##TITLE=1H_DE-80H_F
 200.13MHz, D2O,
 8 sc
 
 10.2.2025
##JCAMPDX= 6.0         $$ Bruker NMR JCAMP-DX V2.0
##DATA TYPE= NMR FID
##DATA CLASS= NTUPLES
##ORIGIN= UXNMR, Bruker Analytische Messtechnik GmbH
##OWNER= pz
$$ XWIN-NMR		Version 3.5
$$ Mon Feb 10 16:33:27 2025 Russian Standard Time (UT+4h)  she@DPX200
##.OBSERVE FREQUENCY= 200.1313
##.OBSERVE NUCLEUS= ^1H
##.DELAY= (6, 6)
##.ACQUISITION MODE= SIMULTANEOUS
##.ACQUISITION SCHEME= undefined
##.AVERAGES= 8
##.DIGITISER RES= 18
##SPECTROMETER/DATA SYSTEM= spect
##.PULSE SEQUENCE= zg30
##.SOLVENT NAME= D2O
##.SHIFT REFERENCE= (INTERNAL, D2O, 0, 14.3821)
##AUDIT TRAIL= $$ (NUMBER, WHEN, WHO, WHERE, WHAT)
$$ ##TITLE= Audit trail, XWIN-NMR		Version 3.5
$$ ##JCAMPDX= 5.01
$$ ##ORIGIN= Bruker BioSpin GmbH
$$ ##OWNER= she
$$ F:/spectra/data/she/nmr/H-C/1/audita.txt
$$ ##AUDIT TRAIL=  $$ (NUMBER, WHEN, WHO, WHERE, WHAT)
(   1,<2025-02-10 16:32:19.64 +0400>,<she>,<DPX200>,
      <created by zg, POWCHK disabled, PULCHK disabled
       configuration hash MD5:
       00 E9 B6 7A A2 85 ED C7 34 08 36 98 17 FE 4E 26
       data hash MD5: 16K
       EE E3 34 C2 4E 46 4A 5E A6 20 56 DF 76 03 9E A0>)
$$ ##END=
$$ 
$$ hash MD5
$$ A4 AE 63 8D DF C7 BD 4B 71 64 83 AE 6A 55 64 4A
##$RELAX= 
##$RELAX= 
##$RELAX= 
##$RELAX= 
##$RELAX= 
##$RELAX= 
$$ Bruker specific parameters
$$ --------------------------
##$DU= <F:/spectra>
##$EXPNO= 1
##$NAME= <H-C>
##$PROCNO= 1
##$TYPE= <nmr>
##$USER= <she>
##$AMP= (0..31)
100 100 100 100 100 100 100 100 100 100 100 100 100 100 100 100 100 100 
100 100 100 100 100 100 100 100 100 100 100 100 100 100 
##$AQSEQ= 0
##$AQ_mod= 1
##$AUNM= <au_zg>
##$AUTOPOS= <>
##$BF1= 200.13
##$BF2= 200.13
##$BF3= 200.13
##$BF4= 200.13
##$BF5= 200.13
##$BF6= 200.13
##$BF7= 200.13
##$BF8= 200.13
##$BYTORDA= 1
##$CFDGTYP= 0
##$CFRGTYP= 5
##$CHEMSTR= <none>
##$CNST= (0..31)
1 1 145 1 1 1 1 1 1 1 1 1 1 1 1 1 1 1 1 1 1 1 1 1 1 1 1 1 1 1 1 1 
##$CPDPRG= <>
##$CPDPRG1= <>
##$CPDPRG2= <>
##$CPDPRG3= <>
##$CPDPRG4= <mlev>
##$CPDPRG5= <mlev>
##$CPDPRG6= <mlev>
##$CPDPRG7= <mlev>
##$CPDPRG8= <mlev>
##$CPDPRGB= <>
##$CPDPRGT= <>
##$D= (0..31)
0 0.7 0 0 0 0 0 0 0 0 0 0.03 0 0 0 0 0 0 0 0 0 0 0 0 0 0 0 0 0 0 0 0 
##$DATE= 1739190739
##$DBL= (0..7)
120 120 120 120 120 120 120 120 
##$DBP= (0..7)
150 150 150 150 150 150 150 150 
##$DBP07= 0
##$DBPNAM0= <>
##$DBPNAM1= <>
##$DBPNAM2= <>
##$DBPNAM3= <>
##$DBPNAM4= <>
##$DBPNAM5= <>
##$DBPNAM6= <>
##$DBPNAM7= <>
##$DBPOAL= (0..7)
0.5 0.5 0.5 0.5 0.5 0.5 0.5 0.5 
##$DBPOFFS= (0..7)
0 0 0 0 0 0 0 0 
##$DE= 6
##$DECBNUC= <off>
##$DECIM= 32
##$DECNUC= <off>
##$DECSTAT= 4
##$DIGMOD= 1
##$DIGTYP= 9
##$DL= (0..7)
0 120 120 120 120 120 120 120 
##$DP= (0..7)
150 150 150 150 150 150 150 150 
##$DP07= 0
##$DPNAME0= <>
##$DPNAME1= <>
##$DPNAME2= <>
##$DPNAME3= <>
##$DPNAME4= <>
##$DPNAME5= <>
##$DPNAME6= <>
##$DPNAME7= <>
##$DPOAL= (0..7)
0.5 0.5 0.5 0.5 0.5 0.5 0.5 0.5 
##$DPOFFS= (0..7)
0 0 0 0 0 0 0 0 
##$DQDMODE= 0
##$DR= 18
##$DS= 0
##$DSLIST= <SSSSSSSSSSSSSSS>
##$DSPFIRM= 0
$$ [...]
##$SUBNAM0= <"">
##$SUBNAM1= <"">
##$SUBNAM2= <"">
##$SUBNAM3= <"">
##$SUBNAM4= <"">
##$SUBNAM5= <"">
##$SUBNAM6= <"">
##$SUBNAM7= <"">
##$SUBNAM8= <"">
##$SUBNAM9= <"">
##$SW= 18.0517328524113
##$SWIBOX= (0..15)
0 0 2 0 0 0 0 0 0 0 0 0 0 0 0 0 
##$SW_h= 3612.71676300578
##$TD= 16384
##$TD0= 1
##$TE= 0
##$TE2= 300
##$TE3= 300
##$TEG= 300
##$TL= (0..7)
0 120 120 120 120 120 120 120 
##$TP= (0..7)
150 150 150 150 150 150 150 150 
##$TP07= 0
##$TPNAME0= <>
##$TPNAME1= <>
##$TPNAME2= <>
##$TPNAME3= <>
##$TPNAME4= <>
##$TPNAME5= <>
##$TPNAME6= <>
##$TPNAME7= <>
##$TPOAL= (0..7)
0.5 0.5 0.5 0.5 0.5 0.5 0.5 0.5 
##$TPOFFS= (0..7)
0 0 0 0 0 0 0 0 
##$TUNHIN= 0
##$TUNHOUT= 0
##$TUNXOUT= 0
##$USERA1= <user>
##$USERA2= <user>
##$USERA3= <user>
##$USERA4= <user>
##$USERA5= <user>
##$V9= 5
##$VALIST= <valist>
##$VCLIST= <CCCCCCCCCCCCCCC>
##$VD= 0
##$VDLIST= <DDDDDDDDDDDDDDD>
##$VPLIST= <PPPPPPPPPPPPPPP>
##$VTLIST= <TTTTTTTTTTTTTTT>
##$WBST= 1024
##$WBSW= 4
##$XGAIN= (0..3)
0 0 0 0 
##$XL= 0
##$YL= 0
##$YMAX_a= 651262
##$YMIN_a= -665821
##$ZGOPTNS= <>
##$ZL1= 120
##$ZL2= 120
##$ZL3= 120
##$ZL4= 120
##$ABSF1= 10
##$ABSF2= 0
##$ABSG= 5
##$ABSL= 3
##$ALPHA= 0
##$AQORDER= 0
##$ASSFAC= 0
##$ASSFACI= 0
##$ASSFACX= 0
##$ASSWID= 0
##$AUNMP= <proc_1d>
##$AZFE= 0.1
##$AZFW= 0.1
##$BCFW= 1
##$BC_mod= 2
##$BYTORDP= 1
##$COROFFS= 0
##$CY= -3
##$DATMOD= 1
##$DC= 2
##$DFILT= <>
##$DTYPP= 0
##$F1P= 0
##$F2P= 0
##$FCOR= 0.5
##$FTSIZE= 0
##$FT_mod= 4
##$GAMMA= 1
##$GB= 0.15
##$INTBC= 1
##$INTSCL= 1
##$ISEN= 128
##$LB= 0.25
##$LEV0= 0
##$LPBIN= 0
##$MAXI= 10000
##$MC2= 0
##$MEAN= 0
##$ME_mod= 0
##$MI= 1.114404
##$NCOEF= 0
##$NC_proc= 0
##$NLEV= 6
##$NOISF1= 3.799351
##$NOISF2= 2.8
##$NSP= 1
##$NTH_PI= 0
##$NZP= 0
##$OFFSET= 14.38212
##$PC= 1
##$PHC0= -474.6209
##$PHC1= 18.59221
##$PH_mod= 1
##$PKNL= yes
##$PPARMOD= 0
##$PSCAL= 0
##$PSIGN= 0
##$REVERSE= no
##$SF= 200.129724274929
##$SI= 16384
##$SIGF1= 3
##$SIGF2= 2
##$SINO= 400
##$SIOLD= 16384
##$SREGLST= <1H.CDCl3>
##$SSB= 0
##$STSI= 0
##$STSR= 0
##$SW_p= 3205.1282051282
##$SYMM= 0
##$S_DEV= 0
##$TDeff= 0
##$TDoff= 0
##$TI= <>
##$TILT= no
##$TM1= 0
##$TM2= 0
##$TOPLEV= 0
##$USERP1= <user>
##$USERP2= <user>
##$USERP3= <user>
##$USERP4= <user>
##$USERP5= <user>
##$WDW= 1
##$XDIM= 8192
##$YMAX_p= 0
##$YMIN_p= 0
$$ End of Bruker specific parameters
$$ ---------------------------------
##NTUPLES= NMR FID
##VAR_NAME=  TIME,          FID/REAL,        FID/IMAG
##SYMBOL=    X,             R,               I
##VAR_TYPE=  INDEPENDENT,   DEPENDENT,       DEPENDENT
##VAR_FORM=  AFFN,          ASDF,            ASDF
##VAR_DIM=   8192,          8192,            8192
##UNITS=     SECONDS,       ARBITRARY UNITS, ARBITRARY UNITS
##FACTOR=    0.0002768,     1,               1
##FIRST=     0,             0,               0
##LAST=      2.2672688,     0,               0
##MIN=       0,             -665821,         0
##MAX=       2.2672688,     651262,          0
$$ Real data points
##PAGE= N=1
##DATA TABLE= (X++(R..R)), XYDATA
$$ [...]
2645a86J483J174J90p41j397j497j054p57O70J417J954J058M05n58j243j748j254
$$ -186 1297 2471 2661 1920 523 -974 -2028 -2785 -2115 -698 1256 2314 2719 2161 918 -830 -2084
2662b084l94N00R99J886J188N51l56j407j530j158p87K93J266J496J792J97q4
$$ -2084 -2478 -1978 -979 907 2095 2646 2290 883 -647 -1805 -2592 -2299 -1033 463 2255 2452 2368
2679B368j294j328j386o60k02J315J565J177P95o8j041j513j371o33J58P16J287
$$ 2368 1074 -254 -1640 -2300 -2502 -1187 378 1555 2350 2282 1241 -272 -1643 -2276 -2118 -1402 -115
2696a15J679O75j13n28j476j513r72L73M33J237J645R93J51r64j167j420r30l67
$$ -115 1564 2239 2126 1598 122 -1391 -2363 -1990 -1557 -320 1325 2318 2469 1505 338 -1082 -2012 -2379
2714b379P58Q95J593J025M22n34j010j560r63n86M05J481J444Q20N35n97j115
$$ -2379 -1621 -726 867 1892 2314 1780 770 -790 -1753 -2339 -1934 -453 991 1811 2346 1749 634
2731F34j165j266m69K75J251R48J705K17j65j194j303q42p84J21J047J666R58
$$ 634 -531 -1797 -2266 -1991 -740 208 1913 2130 1965 771 -532 -1374 -2158 -2037 -990 676 1634
2748A634M58l05o01j772q95o93p6J085J104J576N09p6j071r31r61r04J28L76J283
$$ 1634 2092 1787 1186 -586 -1481 -2174 -2250 -1165 -61 1515 2024 1948 877 -54 -1015 -1919 -1791 -1415 -132
2767a32J385L57M10q76q40j362j023J73L9J457J043Q37L65m03r71j515q87r6O70
$$ -132 1253 1610 2020 1144 304 -1058 -2081 -1908 -1869 -412 631 1468 1833 1430 459 -1056 -1943 -2039 -1369
2786a369R82J238Q83L88n73r85j138p77n26L08R59J025J016N44r5j133j291q11
$$ -1369 -387 851 1734 2122 1549 564 -574 -1351 -1877 -1569 -610 415 1431 1975 1880 747 -544 -1355
2804a355m49J71J064Q69J136K72m2p83j258r50m70K09N73J018J114P39k64o36
$$ -1355 -1804 -1633 -569 300 1436 1708 1666 883 -375 -1325 -1795 -1586 -1013 5 1119 1858 1594 958
2822I58j191r88m13r6L10J453J046Q18k56n27r56j028r63M4P70Q86R99R04J23
$$ 958 -233 -1221 -1634 -1730 -1420 33 1079 1897 1641 1114 158 -870 -1833 -1789 -1019 -133 866 1770 1893
2841A893p87q27q53j099o3L02R08J042J083K41m02q01j335p35j40J76N17J483
$$ 1893 1106 279 -574 -1673 -1736 -1434 -526 516 1599 1840 1438 637 -698 -1433 -1573 -1397 -880 603
2859F03Q40Q5J43j363o42j101j74J76O03J523N54M07l7r61r95j087j88j77R57
$$ 603 1443 1528 1671 308 -334 -1435 -1609 -1433 -830 693 1247 1654 1617 656 -339 -1426 -1614 -1791 -834
2878h34J194P07L72L07q64j430m68p10K31N03Q03J125N32k5k38j048q81p37R2
$$ -834 360 1067 1439 1746 882 -548 -1016 -1726 -1495 -992 -189 936 1468 1443 1205 157 -724 -1461 -1369
2897a369N09P84O44R73J48o99j028q47m27m63P41P86O96O43L50l00o39r24q49
$$ -1369 -860 -76 568 1541 1689 990 -38 -885 -1312 -1775 -1034 -248 448 1091 1441 1141 502 -422 -1271
2916a271l09K80Q98N29J199M7k0p84q18o83m96J12M64R32Q03O67k27m62j221m42
$$ -1271 -1580 -1300 -402 127 1326 1373 1353 569 -249 -932 -1428 -1316 -852 80 883 1550 1323 861 -360 -802
2936h02p10K99L91J293M87L63J39n91p80j145q7j81M97R86P54N02r3l77r59q46
$$ -802 -1512 -1213 -822 471 958 1321 1460 869 89 -1056 -1143 -1324 -827 159 913 1415 1322 945 -14 -860
2956h60m91p6P86M84N21J090j53L5j032p11q83l22N71O11J083M55L23k94q45r31
$$ -860 -1351 -1427 -641 -157 364 1454 1301 1336 304 -407 -1290 -1612 -1041 -430 653 1108 1431 1137 292 -639
2976f39p15j63K68L93J255P65L14o01k02j118o96m95M31M02J002R35K60k78m19
$$ -639 -1354 -1517 -1249 -856 399 1164 1478 877 675 -443 -1139 -1634 -1203 -801 201 1136 1396 1118 699
2995F99r77p37m09J10M09O56J409J04k2k91j034q00k69l46L26Q43J117O52k0m45
$$ 699 -278 -1015 -1424 -1314 -905 -249 1160 1264 1242 951 -83 -883 -1152 -1498 -1172 -329 788 1440 1420 975
3015I75r23q99m10j84M53J007O70O94o5m38n51p26p50j15L21L42J038O61M20n77
$$ 975 52 -847 -1257 -1441 -988 19 689 1383 1318 880 329 -397 -1147 -1262 -941 -599 439 1100 1520 943
3035I43m92r48m73m52j09Q38J087O03M35m17o16l89q75m95J26N35R02O39O38R3
$$ 943 451 -497 -970 -1422 -1531 -693 394 997 1432 1015 399 10 -865 -1360 -1234 -699 203 842 1480 1573
3055A573j095o47o51o02q7N39R44R27N78k48m91p80m92o21n33O48J192P65M05
$$ 1573 478 -169 -820 -1422 -1509 -970 -26 901 1479 1231 740 -40 -532 -1153 -1686 -1038 154 919 1324
3074A324o8l18o91r81k82m40M18P85N42Q35N85p17n46r43q12J4L16L08Q31Q07
$$ 1324 1256 938 247 -734 -1016 -1456 -1038 -253 289 1124 1709 992 446 -497 -1309 -1295 -979 -671 160 967
3094I67L40Q5o07j267p68op1R04Q72P57K18l01q06n77p78l08J78M02Q21P97O46
$$ 967 1307 1392 785 -482 -1250 -1256 -1327 -423 449 1206 1424 1123 317 -260 -1038 -1346 -1168 -766 55 852 1498
3115A498j56p09n72j184l30K55L01J145N39P80l27m48q69p70m46o9J63J072R50
$$ 1498 1342 633 61 -1123 -1453 -1198 -897 248 787 1567 1240 792 -77 -847 -1293 -1362 -1199 -127 823
3134H23M31K18n37p59q32p54k7L15P18J092P06K9l71p20j034p65k44P63L89R41
$$ 823 1254 1472 935 176 -656 -1410 -1437 -1122 -404 688 1394 1423 1052 332 -702 -1467 -1711 -948 -559 382
3154C82O19M11k33o49q98p88n26M59O14R91Q23K39j6p44r89q70n45M87N04R54
$$ 382 1001 1412 1179 530 -368 -1156 -1682 -1223 -609 382 1205 1444 1428 684 -305 -1175 -1720 -1233 -729 225
3174B25P53N16p1p36p55j136k71K25L83Q50J133L54K04r31q07p05o95p2M17J121
$$ 225 978 1494 1423 687 -68 -1204 -1475 -1250 -867 -17 1116 1470 1674 743 -64 -769 -1464 -1536 -1119 2
3194BR43N30m2m80j028q45o95o0M86J054J032N35K56l57j212p81m72o37O76J029
$$ 2 945 1475 1433 953 -75 -920 -1615 -1675 -1189 -135 897 1432 1688 1331 119 -662 -1134 -1771 -1095 -66
3214f6R76M55J48l41r22q06p81l08K32R44R33O85M17j54r53j230n68p3j52J079
$$ -66 910 1365 1513 1172 250 -556 -1337 -1645 -1413 -469 464 1149 1566 1412 459 -771 -1339 -1412 -1564 -485
3234d85Q37J011K86m82m12j162q17l79Q5P47Q44J062O30k98j047q27q00n07K39
$$ -485 352 1363 1649 1167 755 -407 -1224 -1603 -1518 -771 73 1135 1765 1467 420 -407 -1207 -1714 -1475
3253a475N55J217Q83L10J47p88p48j288m68L44N04O77Q95Q21Q6o09p88r96q81
$$ -1475 -920 297 1180 1490 1637 849 101 -1187 -1655 -1311 -807 -130 765 1586 1672 1063 275 -721 -1602
3272a602K16M13P81Q37Q11J86m78q14j010q90R9Q2Q88J301P44K57m71r18j173
$$ -1602 -1386 -973 -192 645 1456 1642 1164 350 -660 -1550 -1451 -1369 -481 820 1564 1821 1350 432 -741
3291g41p37j01K87R46R79N13N73l69p54r74j036l45L22N28J399P69L39l58m86
$$ -741 -1478 -1579 -1292 -346 633 1146 1719 1350 596 -378 -1414 -1759 -1437 -909 490 1259 1598 1240 754
3310G54j303p95k63k96R75R58J061N75N6r39j055q24n18j54P87J206P90P36j45
$$ 754 -549 -1344 -1607 -1903 -928 30 1091 1666 1722 783 -272 -1096 -1614 -1768 -981 225 1015 1751 1606
3329A606n49j317o63q94j3O61J197J024M78K18n21r96j205n97k24M13Q64J414
$$ 1606 1057 -260 -923 -1817 -1830 -1169 28 1052 1530 1748 1227 231 -974 -1571 -1795 -1382 -518 896
3347H96Q91J15o32j132r48j089L06K66J064J001Q19N72q83j063r53l90o40J77
$$ 896 1787 1902 1270 138 -810 -1899 -1593 -1327 -263 738 1557 2129 1246 183 -770 -1160 -1800 -1623
3365a623J237Q13R83P20q45o76j052j285q8J59Q59J327P10N62Pr75r71j193n12
$$ -1623 -386 427 1410 2130 1285 609 -443 -1728 -1816 -1657 -798 529 1239 1801 1808 833 -138 -1331 -1843
3384a843K60O14J034R64Q24m97o01j116q14n38O3N57J058J301O51K1o25j520q68
$$ -1843 -1583 -969 65 1029 1853 1356 755 -361 -1175 -1713 -1650 -1093 -35 1266 1917 1938 1313 -207 -1075
3403a075n75J82M12Q00J276Q52J96p03j187j163q50j23J011P63J216M56M01l51
$$ -1075 -1650 -1468 -1056 -256 1020 1872 2068 1365 178 -985 -1835 -1958 -947 -184 1032 1488 1889 1538
3421A538j325r55q81o3L13Q84J402J075n1m16j193q35j287l64O51R70J095O25
$$ 1538 213 -742 -1623 -1686 -1373 -489 913 1988 1937 1521 328 -507 -1794 -2158 -1507 -537 558 1183
3439A183N60k03r56j038j228j45J27Q83J274J068M55m03r53q18j206n50K10P57
$$ 1183 1743 1540 584 -454 -1682 -1827 -1700 -817 457 1525 1980 1577 624 -194 -1400 -1950 -1740 -983
3457i83J436Q79N71j60q29j229j293m81L01P34J354P77O14J17p35j335r51o18
$$ -983 453 1332 1903 1743 914 -315 -1608 -2089 -1788 -1054 300 1077 1691 1808 1073 -262 -1213 -1831
3475a831j87J091R44J148M85J99k91j431j071q72j52P11J144J106R34p9m20j120
$$ -1831 -2018 -927 17 1165 1650 1849 1558 127 -944 -1816 -1968 -1257 -113 993 1927 1848 1428 308
3493C08j276q00n5L78J240R87J017L01m65j038j387o95p03R54Q20J185R87J43
$$ 308 -968 -1768 -1823 -1445 -205 782 1799 2100 1635 597 -790 -1485 -2188 -1234 -414 771 1758 1901
3511A901l88r33j227j046k47L37P50J579Q14K47j18j065j295j063j36K40P05J462
$$ 1901 1513 580 -647 -1693 -1940 -1603 -853 726 1540 1787 1669 604 -691 -1754 -1890 -1650 -945 517
3529E17J057O19n71p72j219q04q13L34M67J617R63L74K36q83j468r34r95L99Q13
$$ 517 1574 2193 1622 850 -369 -1173 -1986 -1652 -1185 432 1395 1769 2005 1122 -346 -1280 -2275 -1876 -1063
3548a063J118J454J60K61j024q45j312l02l60O12R20J380Q39J7n62r37j280p88
$$ -1063 55 1509 1669 1930 906 61 -1251 -1553 -1913 -1301 -381 999 1838 1855 1293 356 -924 -1712
3566a712l02N29J473J013J043j37m65j259j025j005k54P01Q78J354Q99M64j97
$$ -1712 -2014 -1485 -12 1001 2044 1907 1442 183 -842 -1847 -2101 -1400 -522 832 1731 2195 1998
3583A998j318j537j067K21J92P49J640P57N13o13r08j357r28m24K46J175J204
$$ 1998 680 -857 -1924 -1703 -1511 -762 878 1635 2148 1535 627 -730 -1658 -2082 -1836 -661 543
3600E43Q95O08o32p27r58j397kk72J292J060J021N65k07p12j447j178n93L46R80
$$ 543 1438 2046 1414 687 -271 -1668 -1670 -1942 -650 410 1431 1996 1789 1077 -370 -1548 -2141 -1795 -815
3619h15J331N02J210j38j042j003j189n64J6N01J193J476Q45l08q15j074j392
$$ -815 516 1018 2228 2090 1048 45 -1144 -1708 -1692 -1191 2 1478 2323 2015 1200 126 -1266
3636a266p45m3M43J428J164R47J21o38j382r80p91k01P53Q05J329J062J71o03
$$ -1266 -2011 -2054 -1611 -183 981 1928 2049 1411 29 -951 -1742 -1943 -1190 -385 944 2006 2177 1574
3654A574j255j112o93m68K98J111J258J063J54l34j135j206j077K2r9J328J060
$$ 1574 319 -793 -1486 -1954 -1656 -545 713 1776 1930 1596 461 -745 -1822 -1800 -1899 -571 489
3671D89J179M04l09q56j462r60m88N06O48J172J266M01K8j236r33j460p71L93
$$ 489 1668 2072 1763 907 -555 -1515 -2003 -1497 -849 323 1589 1990 2018 782 -151 -1611 -2382 -1989
3689a989J099J487P03O55K52j177j145j322o67J92P39J304J212P59Jq00j066j558
$$ -1989 -890 597 1300 1955 2207 1030 -115 -1437 -2104 -1912 -1173 131 1343 2102 2103 1303 237 -1321
3707a321o19J71O40J225P96J163J47p87j135j541n89n2K84J504J414K89O95q99
$$ -1321 -1940 -1769 -1129 96 892 2055 2202 1415 280 -1261 -1850 -1902 -1618 -114 1300 1589 2284 1385
3725A385j201r48j064k17P03J107J097J057K88l59j302j172j171l34N27Q20J475
$$ 1385 184 -764 -1828 -2045 -1342 -235 862 1919 2207 1848 546 -626 -1797 -2131 -1604 -784 691
3742F91J104L64n47r48j382p59o30L45P01J646J145M39l95j089j214r44l62J27
$$ 691 1795 2159 1612 664 -718 -1477 -2107 -1762 -1061 585 1730 2169 1774 685 -529 -1473 -1835 -1708
3760a708R84J143R53O13k90j042j111r31p10J27Q20J570J113K51L06j019j496
$$ -1708 -724 419 1372 1985 1695 653 -458 -1389 -2099 -1972 -1152 418 1531 1782 2088 1069 -427
3777d27j161m45lQ69J368R32R05j71n64j301j194p89O4O79J172J399P72k09n89
$$ -427 -1588 -2033 -2036 -1167 201 1133 2038 1867 1303 2 -1192 -1981 -1917 -1238 -66 1333 2105 1896 1307
3796A307j016j313q54k60P36J269J122P71J73n09j091j043j293K24J45J205J386
$$ 1307 291 -1022 -1876 -2136 -1400 -131 991 1762 1935 1426 335 -708 -2001 -1777 -1632 -427 959
3813I59Q84J87m38j269j097r61k04J91J019J554P36L55n27o98j499r20l75O69
$$ 959 1843 2030 1592 323 -774 -1735 -1939 -1748 -729 825 1561 1916 1389 691 -808 -1728 -2103 -1434
3831a434J025J180P12O21l59r39j298j186k52K09R65J230J006O11k97o19j585
$$ -1434 -409 771 1483 2104 1745 806 -492 -1678 -1930 -1721 -756 474 1480 2091 1794 1175 -410
3848d10q22n93m08J596Q96J043O66k66p57j175q25j086K58P64J107J308O02L52
$$ -410 -1232 -1825 -2233 -637 259 1302 1968 1702 945 -230 -1055 -2141 -1883 -1119 -12 1296 1898 2250
3866B250j166j026r19j013q8Q82J223J002N76L27r53j021j160r41J45P52R35J312
$$ 2250 1084 58 -861 -1874 -1962 -1080 143 1145 1721 2048 1095 74 -1086 -2027 -1882 -1130 -195 1117
3884A117P20K9n42r71j304q44k09Q12R62J273N90L48m94j174j178r36j68M05J101
$$ 1117 1837 1866 1324 353 -951 -1795 -2004 -1192 -230 1043 1633 1981 1487 313 -865 -1801 -1969 -1564 -463
3903d63J361J025Q2k49j447r46r11n63O11R08J144J038M56m04j297q76j007l39
$$ -463 898 1923 2005 1756 309 -637 -1548 -2111 -1500 -592 552 1590 2046 1642 345 -531 -1538 -1877
3921a877N3J119R54J163N70m47q37j176q44n97J26R27J214J037O59k40j185q84
$$ -1877 -1824 -705 249 1412 1982 1535 698 -478 -1322 -1919 -1793 -866 348 1385 2044 1804 619 -265
3939b65j020q22J43P88J486R35P64l61o74j377p30q55N0P44J259P59J072j16o40
$$ -265 -1285 -2107 -1964 -1176 310 1245 2009 1648 974 -403 -1133 -1988 -1938 -1194 65 824 1896 1780 1140
3958A140j217r54q66o5O03J488R33O05K63p47j072j162q27K78M44R23J115R11
$$ 1140 -77 -1031 -1897 -1962 -1359 129 1062 1667 1930 1183 111 -1051 -1878 -1600 -1156 -233 882 1793
3976A793K83q32q33j402q64J43N9J382J021R96J46m78q82j312o01o33M57J076
$$ 1793 2076 1244 411 -991 -1855 -1712 -1653 -271 750 1746 1892 1414 532 -780 -1381 -2014 -1557 -481
3994d81J089J153J24k46j148j115j086k55M04R25J002J323M80n44j086j304o24
$$ -481 608 1761 1885 1639 491 -624 -1710 -1965 -1561 -636 366 1689 2169 1625 539 -765 -1389
4011a389n94L09R95J156R95N12l00p28j364q79o49J17R41J174J088M83k59n57
$$ -1389 -1983 -1674 -679 477 1472 1984 1684 956 -408 -1287 -1936 -1819 -878 296 1384 1867 1608 1051
4029A051j307j263n81L19Q59Q96J245Q92m17r96m84j227j041K41P11R71J346N82
$$ 1051 -256 -1519 -2100 -1781 -922 -26 1219 2111 1694 698 214 -1013 -2054 -1813 -1102 -131 1215 1797
4047A797q3m48r82j553l67k67N71J398J036Q50k5o11j132j172n96m52P30J076
$$ 1797 1714 1266 284 -1269 -1636 -1903 -1332 66 1102 1952 1927 1316 184 -988 -1584 -2036 -1306 -230
4065b30J136O81L65m29j273j089r36k41L77J528Q46P36P72p90j070p68j436l12
$$ -230 906 1587 1952 1523 250 -839 -1775 -2016 -1639 -111 735 1471 2243 1453 383 -385 -1821 -2133
4083b133Q26Q41J218Q82K38l77o68j151j276l09K66P29J573Q07K06l13o00r33
$$ -2133 -1307 -466 752 1634 1872 1495 827 -324 -1600 -1909 -1643 -914 659 1466 1672 1359 759 -174
4101a74j337m19M40R16J066P58P85m11p05j117r11q65K24P96J146J055O08qp89
$$ -174 -1511 -1930 -1490 -574 492 1250 2035 1624 919 -198 -1109 -1974 -1750 -954 192 1247 1855 1847 1058
4120A058j118j117p22L15N81J249Q80N85K31j186r06q36q63M0O76Q66J239Q52
$$ 1058 -60 -1177 -1899 -1584 -1003 246 1126 1711 1942 756 -150 -986 -1849 -1809 -1133 -267 972 1824
4138A824J69o42j213j263n92k96J008J260P39P51r0n75o02j309p93j47M56R25
$$ 1824 1993 1351 138 -1125 -1717 -2013 -1005 255 994 1745 1655 1080 478 -831 -1624 -1771 -1315 -390
4156c90J308P93q5l14r37j461m64l13M29J082J146M98N88l00j196j140p54m86
$$ -390 918 1711 1626 1312 375 -1086 -1550 -1863 -1434 -352 794 1292 1880 1580 384 -756 -1510 -1996
4174a996O58O90J110J061Q2k9j116q04j146n52M04Q78J325P05N69k96j323o89
$$ -1996 -1338 -648 462 1523 1605 1576 460 -344 -1490 -2042 -1638 -760 565 1270 1839 1543 220 -469
4192d69q92l53J51J098J001Q86M16k99q20j039q21p79k4J097J104J044N14j41
$$ -469 -1361 -1714 -1563 -465 536 1422 1838 1539 719 -320 -1141 -1920 -1944 -847 257 1301 1815 1674
4210A674o25j073j222l88k04R19R68J036O18J29p58j044j160n21J29L20J198R75
$$ 1674 1049 -24 -1246 -1634 -1838 -919 49 1085 1703 1832 1074 30 -1130 -1651 -1522 -1202 -4 971
4228I71Q19J89q03j035j309j43q81J093P71J375P63l40k36j224q94n32n15P91
$$ 971 1790 1979 1176 141 -1168 -1311 -2192 -1099 -328 1047 1810 1470 1234 10 -884 -1416 -1931 -1140
4246a140R74R53R21No08q74j007p31n25M79J023J302N13L74k10j010j297r12Q4
$$ -1140 -166 787 1708 1713 1105 231 -776 -1507 -2032 -1553 -530 772 1285 1659 1449 439 -858 -1770 -1686
4265a686J55P79J385R90K53n73o73r43j230j84J87R32J130J067K81n46o00j468
$$ -1686 -1531 -752 633 1623 1876 1303 630 -313 -1543 -1727 -1540 -608 522 1589 1870 1324 724 -744
4283g44n35l77j19J012R22J058N13o4o85j322p68p70K64N05J303P36R77l81m29
$$ -744 -1279 -1656 -1775 -763 159 1217 1730 1666 981 -341 -1109 -1879 -1615 -1110 193 929 1906 1525 1096
4302A096q51j305n62J59L36J392R54N71j29r06p54j181l60k92O34J193R28P09
$$ 1096 245 -1060 -1622 -1463 -1127 265 1219 1790 1661 755 1 -1180 -1540 -1832 -1198 -5 923 1632
4320A632l3m67j050q49p94k61P04N76J358P44M2l15j311q01p35o3M27J021R97
$$ 1632 1599 1132 82 -767 -1561 -1822 -1118 -542 816 1560 1602 1287 -24 -825 -1560 -1623 -1196 -175 822
4339H22O08K16k97r53j012q52l99M21J190Q54Q15L72j98j182j114q05l11L40R26
$$ 822 1430 1646 1349 396 -616 -1468 -1867 -1446 -256 598 1413 1785 1587 405 -709 -1514 -1825 -1485 -559
4358e59J314Q34L37n28r32q93p15n09K59P83J208P93N07m37o94j110j006l78j02
$$ -559 755 1589 1926 1398 466 -427 -1142 -1651 -1392 -609 599 1392 1899 1462 768 -342 -1348 -1726 -1828
4377a828J137R75J067M63l00m30j332p84m78j9O71J207J008K23j4p54j214p14
$$ -1828 -691 284 1351 1814 1514 1084 -248 -1032 -1510 -1529 -858 349 1357 1580 1566 812 -402 -1116
4395a116m86J79O23J010P74P43o2n14j231q34q39p4P94J095P65O30L88o16j276
$$ -1116 -1602 -1423 -800 210 984 1727 1665 1151 -80 -914 -1753 -1827 -1033 62 827 1457 1845 1229 -47
4414d7q40o59m28Q66Q33J210O56n5l88o12j505q56J52N30Q80Q08J040K3m63p10
$$ -47 -887 -1546 -1974 -1108 -275 935 1591 1536 1148 536 -969 -1825 -1673 -1143 -263 545 1585 1608 1145 435
4434D35j117q06n39N99J156P52J044K54n10p37r71j025k44L75N53J365Q11L75
$$ 435 -682 -1488 -2027 -1428 -272 480 1524 1778 1268 531 -440 -1465 -1709 -1334 -781 584 1395 1770
4452A770k22j123n74j261l34L71P49Q93J207L73m96n12j235o46r21K66Q64J119
$$ 1770 1548 425 -149 -1410 -1744 -1373 -624 269 1476 1849 1353 841 -394 -1040 -1961 -1695 -831 288
4470B88J000N36m37p30n97j266l60K05O55J130P64L80k27n39j097j016p2j41M29
$$ 288 1288 1824 1387 657 60 -1206 -1566 -1361 -706 424 1188 1568 1341 802 -295 -1311 -1383 -1524 -1095
4489a095J071J292M26j36p19o85j039q30P0M98J045J127P61k5o16j039q72p06
$$ -1095 -24 1268 1694 1558 839 154 -885 -1715 -1645 -1147 -102 1025 1786 1761 1145 106 -766 -1472
4507a472k83O50Q67J060Q44l70k64n31j080r57k63Q34J018O11R91m8j51r08j235
$$ -1472 -1755 -1105 -238 822 1666 1296 1032 501 -579 -1536 -1799 -965 53 664 1655 1607 1456 548 -687
4526f87p58J2J07J078O25Q13N36o66o73q35j160J05M31K88J415J100M6m10p93
$$ -687 -1445 -1433 -1326 -248 377 1190 1726 1060 387 -448 -1608 -1503 -1072 -784 631 1731 1777 1367 574
4545E74j249o54m73N63N65J177O54K51P5r73r25q46l63L34M91J071J041O5M7o54
$$ 574 -675 -1329 -1802 -1239 -674 503 1157 1408 1483 510 -415 -1261 -1624 -1290 -799 272 1313 1378 1425 771
4565G71j003j030j22M0P00Q18J164L53j29n21r99r78n96j58P19R18J014O58K18
$$ 771 -232 -1262 -1384 -1344 -644 174 1338 1691 1562 1041 42 -936 -1532 -1690 -971 -53 961 1619 1837
4584A837r89p25q89q62M7P17Q96J010N37m9m55j002n52j053K5L69P76J327P30
$$ 1837 848 123 -766 -1628 -1581 -864 32 1042 1579 1530 1075 73 -479 -1532 -1507 -1138 -362 965 1695
4603A695k13l26r36j098m85j73N03Q30Q68Q75p7o08m31j175o30m23M45R60R51
$$ 1695 1482 1156 220 -878 -1363 -1536 -1033 -203 665 1540 1463 855 424 -751 -1381 -1804 -1359 -399 552
4622E52Q01Qk18p50r27o71k98K82Q40R45Q02LL9q24j081r52j43m8J044R98Q17
$$ 552 1353 1361 1143 393 -534 -1205 -1503 -1221 -381 564 1366 1369 1408 584 -497 -1449 -1592 -1640 -596 402 1219
4643A219N89o06m30j114m58n73r1R41O90J148N2k16n84p83q27n38J57P61Q22Q17
$$ 1219 1808 1202 772 -342 -800 -1373 -1464 -523 167 1315 1367 1151 567 -216 -1043 -1581 -1424 -663 159 976
4663I76O40k55k87j175q24o67J16P62Q22Q32Q77l17p48q20q81j98n20O95R10J087
$$ 976 1616 1361 1074 -101 -925 -1592 -1476 -714 108 940 1817 1500 752 -68 -949 -1147 -1667 -972 -62 1025
4683A025O66k68n78r43o04o77l43O01Q04P15J130j57k51p91j063p38J05L10P77
$$ 1025 1691 1423 845 -98 -702 -1379 -1722 -1121 -317 398 1528 1371 1120 329 -734 -1472 -1367 -1057 -280
4702b80Q81P57L84p51n22j270n12l13L30J054P72R73j62k79n20j178m60m05K74
$$ -280 601 1358 1742 991 469 -801 -1313 -1626 -1296 -242 530 1503 1341 1062 542 -636 -1096 -1501 -1227
4721a227P82Q00N87O50j98o86r70j053k25M23N74R27P87M38m51n46r11j120j60
$$ -1227 -445 355 942 1592 1394 708 -262 -1315 -1540 -1117 -543 384 1171 1609 1158 612 -299 -1419 -1579
4740a579k5Q81R97Q45K65J03q44o99p75m72K0O33O54R15M46P4q35q81n81n73L76
$$ -1579 -1604 -723 274 1119 1384 1487 643 -56 -831 -1303 -1283 -650 4 919 1365 1439 604 -277 -858 -1431 -1055
4761a055J76R02R77L73J4n18j143m94n06m59O53J042J106K57J63m30q77j036n12
$$ -1055 -879 23 1000 1373 1387 869 -274 -768 -1274 -1733 -1080 -38 1068 1325 1488 1058 181 -855 -1367
4780a367j90O63Q09Q88M99K59p47n30j029n94k15M93Q71P58O52L96m24r13r81
$$ -1367 -1557 -894 -85 803 1302 1561 814 284 -745 -1339 -1554 -1061 -190 568 1220 1616 1192 279 -702
4799g02q56J46M84N25P13J002K37m18q59p55p27l50K41J144O02Q59J01m8q54j019
$$ -702 -1558 -1412 -928 -403 310 1312 1549 1131 272 -483 -1210 -1560 -1319 -175 427 1286 1387 1339 485 -534
4819e34q99oK65M84J221N46M21j87n44j208n61l06r4O40Q84R78O47m44p38r98
$$ -534 -1433 -1439 -1174 -690 531 1077 1498 1311 767 -441 -1002 -1308 -1402 -762 122 1100 1747 1303 565 -433
4839d33p37j91J39O36Q92O78M23k93l95j020o89k84p9N90R39O00M59M73o42j121
$$ -433 -1170 -1361 -1222 -586 306 984 1407 1114 719 -301 -990 -1274 -1353 -763 176 776 1235 1708 1066 -55
4859e5p12m67j42M99R98M68J057l29j54j178q22m52l93O97P47Q06Q86J68o60n39
$$ -55 -767 -1234 -1376 -877 121 589 1646 1317 1163 -15 -837 -1289 -1682 -985 -238 568 1454 1622 962 423
4879D23j297m47r5M28Q17R33O01K99m79j046p23o57L8n0Q14Q52P74N46m55j004
$$ 423 -874 -1321 -1416 -988 -171 762 1363 1662 1183 137 -586 -1243 -1205 -1255 -441 411 1185 1731 1276 272
4899B72q45q34N1J38J075M90Q62O3j8r68o60p34j82n7P85J024P05K32l02m21q48
$$ 272 -573 -1407 -1356 -1218 -143 347 1209 1272 1254 286 -374 -1108 -1290 -1347 -562 462 1167 1399 1097 676 -172
4920a72q20n11K06P08Q72P32L95k83o56q44o19m92M28L07R78O82M79K4j079m21
$$ -172 -992 -1503 -1297 -589 283 1015 1410 1127 471 -373 -992 -1484 -1056 -749 229 911 1390 1414 335 -86
4940h6j167rj26O53Q59Q06O77m48l23p94r38l76j71O33J016Q59J81M34p31j145
$$ -86 -1253 -1262 -1388 -735 124 930 1607 1159 836 42 -896 -1272 -1443 -810 206 1065 1246 1680 949 -196
4960a96n78p58J04L77J103R87K10M1p5j201o84l22p39Q50O67Q41Q25o5l33j053
$$ -196 -774 -1532 -1428 -1051 52 1039 1249 1290 1215 14 -670 -992 -1731 -881 -214 627 1452 1387 1054 1
4980An56q13K96L86Q28L11Q01L41q66k09j209q97M08o2J040R95O20j81j75r40
$$ 1 -555 -1368 -1072 -686 142 453 1254 1595 729 520 -689 -1586 -1178 -1240 -200 795 1415 1234 1059 119
5000A19n63o23k72Q6O05J125M33O94p25k05j114m48m70J88P05O73Q41L41j29p91
$$ 119 -444 -1067 -1339 -1253 -648 477 910 1604 879 674 -440 -888 -1358 -1170 -465 208 1049 1390 1261 470
5020D70r48n26o19L77O64Q81O75M58j26m30r80j050k54L99Q1J072O84O72l12k58
$$ 470 -478 -1004 -1623 -1246 -582 299 974 1432 1306 876 -104 -1154 -1408 -1009 -928 144 828 1500 1188 930
5040I30r95p72k57k62N28P50P90O69k29Nj062o66q89j00P13Q51Q36N62P0n38q12
$$ 930 -65 -837 -1094 -1356 -828 -78 712 1381 1152 1157 95 -571 -1460 -1560 -847 4 840 1402 1472 934 122
5061A22q93m87J9M5J119O03R24m5m84q12q14m20k73L05N55J399K8P01m03q76r37
$$ 122 -771 -1258 -1239 -1194 -75 528 1452 1407 923 111 -703 -1123 -1396 -1091 -536 863 891 1592 1189 313 -624
5082f24k24n01L29P65O90P18L09m83o69p63o79n31O53N98P58P96L72K05j459p93
$$ -624 -848 -1349 -1020 -255 435 1153 1462 979 310 -453 -1132 -1663 -1010 -412 346 1142 1514 1719 260 -533
5102e33m67k62j3R31P18N72M14p6r39q15n79j69l7M59J109R08o4M1n20r14o04
$$ -533 -1000 -1262 -1275 -344 374 946 1360 1284 345 -470 -1049 -1218 -1255 -796 313 1221 1157 1198 678 -236 -840
5123h40l62J27M66Q82N43O30j46m81j052m56p11o7O70R23L95R38k4p43p97q99
$$ -840 -1202 -1075 -609 273 816 1446 1300 819 -233 -689 -1400 -1467 -797 126 521 1459 1435 692 -105 -1004
5143a004l06l3N70J065O38L70P9p83o96l89r06j55M97R23R33M77j02m66m46j065
$$ -1004 -1310 -1343 -773 292 930 1300 1379 596 -100 -489 -1395 -1550 -1053 -130 803 1280 1178 712 266 -799
5163g99l36k28M01J085K75N88L29m43q27p38n86j52J98J041P22M43M84m37m02
$$ -799 -1135 -1363 -962 123 398 986 1315 872 45 -693 -1279 -1431 -1233 -192 530 973 1457 1020 618
5182F18j270m02k80R7R02O93P00M22m05n19j217l33m28J92Q92O56Q29R4j71m79
$$ 618 -652 -1054 -1334 -1237 -335 358 1058 1480 1075 556 -661 -994 -1422 -1230 -338 318 1147 1241 1070 591
5202E91q70q89j68M7Q48Q31Q60J5J30p85p62r87p0k4O65P24J029K11P2r33p59
$$ 591 -279 -1168 -1336 -1289 -441 390 1250 1265 1395 610 -152 -1139 -1209 -1233 -568 156 1185 1396 1468 535 -224
5223b24o43n79p3P79P90P62M98P6q57m03p30q48K14J7J182J008O21j94n29p66
$$ -224 -867 -1446 -1519 -740 50 812 1310 1386 529 126 -604 -1452 -1238 -1221 -39 969 1590 1396 867 101
5243A01q36k56l36N23O26J202M47J4n58n50j159m84L2J97O52J115O69j25k30o24
$$ 101 -735 -991 -1327 -804 -178 1024 1471 1485 927 377 -782 -1266 -1234 -1037 -385 730 1399 1274 1044 420
5263D20j029m30n05N26N92R07P42J27k72q25r25n35k23L87P45R06M13L62l28p90
$$ 420 -609 -1039 -1544 -1018 -426 481 1223 1350 1078 253 -672 -1207 -1430 -1043 -298 608 1021 1383 1055 265
5283B65o82l78o54K73O44Q05Q56J37q0o65r41m28n93K16O91O44J217J9l4q26n85
$$ 265 -417 -795 -1449 -1176 -532 273 1129 1266 1186 521 -420 -848 -1441 -1225 -534 110 1327 1346 1312 486 -99
5304i9o97o42K96M30P41N91P09l14l24q04p87j96N7M59N91O98M62K46o31o84r64
$$ -99 -796 -1438 -1142 -712 29 620 1329 1015 691 -113 -900 -1096 -1039 -580 11 709 1171 1417 786 102 -862
5325h62k48j20M75O83Q77L42K9j42j111p60k62j37M63P48N96P94l17l33n53q47
$$ -862 -1110 -1230 -755 -72 805 1147 1176 1034 -77 -837 -1099 -1236 -773 -25 571 1365 1048 715 162 -685
5345f85l73k48J49J003P49N21R9l74o06p92m41l5P1O37R97M46j07l61l34m57r45
$$ -685 -1058 -1306 -1157 -154 595 1116 1215 841 235 -557 -998 -1033 -962 -325 672 1118 1011 650 316 -141 -1086
5366a086n1N6Q28O30O75L37l37p64n92q17j28J39O22N77P44L41k2o83o64o21l53
$$ -1086 -1137 -1081 -253 377 1052 1389 1052 288 -304 -1121 -1249 -1110 -488 89 833 1174 1152 469 -195 -816 -1169
5387a169%P02P69M29M23k96l36o37p91k91J38L61Q79M36N21p8k76j017m44n77
$$ -1169 -1169 -467 302 731 1154 858 522 -115 -906 -1197 -1059 -698 181 617 1138 1060 784 -233 -677 -1254
5407a254Q0O20P73O12L44K41p46n59r07l38J69J69J074K65O58Q5m86r86m23n67
$$ -1254 -1174 -554 219 831 1175 1416 670 111 -796 -1134 -965 -796 278 543 1201 1286 800 -186 -609 -1176
5427a176O0L31M35J176L09K6l99p56p82n67P1M08N40Q02L34K62m04l63o86n89
$$ -1176 -1116 -785 -350 826 1135 1161 762 6 -776 -1343 -1272 -864 -324 478 812 1074 670 307 -379 -968
5447i68l10L04J035L67N98J69l68l08r45n35k56J70M53Q95O31K98J1r74o94m64
$$ -968 -1278 -974 61 428 1026 1195 827 519 -426 -961 -1217 -1047 -594 301 932 1230 1241 267 -427 -891
5467h91l29L15P09P77M80M07r21J3j049p58j0L45L50P84P02P1K0o35r14k13m95
$$ -891 -1220 -905 -196 581 1061 1468 547 560 -489 -1247 -1257 -912 -562 222 924 995 1015 380 -534 -747 -1242
5488a242O3O89O92N21M56k36n38m13q32k39J45M42N77R08P0M8n15o44o70p65L15
$$ -1242 -1179 -490 202 723 1179 943 405 -8 -840 -1079 -934 -492 85 993 1063 1111 596 -48 -718 -1483 -1168
5509a168K16J106N50K12M0l61o27k49p08l44N65K63Q95N04l0l66n62m42p45P6
$$ -1168 -952 154 704 916 956 595 -32 -281 -989 -1333 -768 -505 390 894 864 498 -64 -506 -1251 -1175
5529a175M47O89P83L23o4l03n58p49l63j98L02Q65L93O59P0p8q91o11m52m57P96
$$ -1175 -728 -39 744 1067 1003 700 142 -607 -970 -1168 -866 -1 392 1051 1121 1043 152 -459 -911 -1368 -572
5550e72L00Q46L82K16l04n91p13l20k98R0P85L73N50K69o4o42p83l48o3N5N39
$$ -572 -272 574 956 1172 868 277 -436 -756 -1054 -964 -179 194 744 1013 949 307 -476 -824 -887 -832 -293
5571b93N67O03L99l00m83p84q43J02P3N87P94M67J08l31l12m63p63j57j0M99P01
$$ -293 274 877 1276 976 493 -291 -1134 -1032 -959 -372 422 889 997 666 354 -109 -872 -1029 -1039 -540 161
5592A61L98N88j72m19o57o33m33M41J01O97O99L21k07o28k12q55j30j57N04N52
$$ 161 559 1147 975 556 -101 -734 -1167 -726 -625 72 771 1092 885 257 45 -810 -940 -1097 -593 -41
5612d1R02J78k52j58p06l74m65j8M02N65L61M75j4j30n86p79l60k1L37O23M55
$$ -41 861 1039 787 629 -77 -451 -916 -934 -532 33 394 869 855 725 139 -640 -1000 -1021 -684 -61 394
5633C94M27J71l65m87p86l9p48M71N86R57K28M54o89k28o93m21o4p9L66J079L44
$$ 394 821 992 627 140 -646 -685 -1433 -962 -376 581 809 1263 574 346 -347 -768 -832 -911 -545 534 878
5654H78J38R5r30m64o65o3J82N25O18L35J69J8n19p68k24l05J54M91N87K76M84
$$ 878 1016 1111 181 -283 -948 -1011 -829 -304 314 649 818 836 317 -451 -675 -980 -826 -335 252 528 1012
5675A012k91n36n11l03m64J00M18O69M93M07o0m89o05m85k68q0N54Q29L60p1K45
$$ 1012 721 185 -326 -629 -1093 -993 -575 94 587 994 934 445 -160 -645 -913 -993 -439 390 750 679 924
5696I24l43n59o39k59Q4L7Q18L93O17k02k33n98n27l39k20M07N15Q24M71k50l45
$$ 924 581 22 -617 -876 -792 -755 63 456 1073 871 638 40 -487 -826 -1046 -639 -124 700 1171 921 576
5717E76m84m07m70j82L38O07O23O9K19Q6r36m28k19l99M70L34N79O53K70m28o75
$$ 576 92 -315 -785 -967 -629 -22 601 670 889 975 39 -389 -608 -1007 -537 -203 376 1029 1299 871 196
5738A96o32l68k64K94N20M88M57K37l22j90o00j54o27K51K82Q58K44J12jm77o25
$$ 196 -436 -804 -1068 -774 -254 234 691 928 606 416 -184 -338 -965 -714 -432 426 670 782 781 304 -321
5759c21l80m92L21Q07Q8Q83K9k77k77o53l38n22N62L62N29K02K78M9n44l10m94
$$ -321 -701 -1193 -872 -65 23 906 935 658 381 -272 -610 -1132 -570 -208 321 523 801 850 306 -4 -498
5780d98n43K22L21L46R78N0j05m91l82o73Jk10M10N58Q12J13L24p40m19m74k85
$$ -498 -1041 -819 -498 -152 826 876 771 280 -102 -775 -774 -984 -574 -16 796 909 1233 493 74 -400 -685
5801f85k00L74M82N65L75j48M2r95q1n41rJ45M22O69M56K20l96n35n19l82k7K49
$$ -685 -885 -511 -29 536 911 763 805 -190 -271 -812 -821 -676 -254 415 871 1091 695 160 -359 -741 -768 -519
5823e19K50N56N10J95k58m09m57m69l22N09M3O16M98K46j89n40k73n76O4%K72
$$ -519 -269 287 797 992 734 325 -132 -601 -923 -414 -371 245 743 989 800 260 -13 -589 -525 -525 -253
5844b53N47L99L46k97n76l07l19l75P4L20M08Q84M9j67n39k06o14j72R7L73M25
$$ -253 294 693 1039 742 166 -141 -460 -835 -761 -441 -33 851 900 733 194 -12 -626 -798 -701 -328 97
5865I7O03L08k12k96q46j26k74K78K14M04N78n3m8l6p05o91J20N8L57N3O81K71
$$ 97 700 1008 796 500 -346 -472 -746 -468 -254 150 728 675 627 591 -114 -805 -685 -627 -270 -217 464 735
5887G35k2j04o01n75j35nJ29M98O95J54J76m95j85p96j89j07N02K80L72M14Q5
$$ 735 713 609 8 -567 -702 -707 -578 -80 615 769 945 450 265 -531 -720 -827 -325 -45 327 741 826
5908H26j82p06k07k89m17J97N41M32L90K50k03n16n31k40j57K11M44K45L26K71
$$ 826 644 -62 -269 -558 -975 -778 -237 195 585 835 632 116 -415 -655 -812 -601 -157 88 414 685
5928F85k1j88p05m44j83L01J58M50P80J2n23k40r3n69m14Q4O47L61L08M11r0k28
$$ 685 664 476 -229 -673 -856 -555 -397 53 833 845 322 82 -11 -580 -994 -910 -263 98 406 817 727 499
5950D99n34o26k9L0K49L56O91j6J8n6p34n15Q4j6J46L34M30L22J20k54n40m94
$$ 499 -35 -661 -690 -660 -411 -55 636 620 638 582 -152 -667 -583 -599 -453 -119 311 633 753 499 -41 -535
5972e35k33O5L12K71O61J07p5j01n99l49m19L75N1M98Q78l24J9j06o06k99l40
$$ -535 -768 -703 -391 -120 541 648 573 472 -127 -476 -895 -520 -469 29 907 583 602 496 -110 -409 -749
5993g49k8O2N87M87N26j88k76k98n79l76O3K63L63L38L84J88m74J0o51l38J32
$$ -749 -777 -715 -128 359 885 697 421 123 -456 -832 -769 -506 -143 195 579 767 293 303 -348 -686 -554
6014e54j96M34M12O10L20l63k83m73n72j1p4N83N88L68k88%l19k64m23j82J54
$$ -554 -750 -316 96 706 1026 663 380 -93 -665 -676 -750 -167 421 789 501 501 182 -82 -505 -687 -533
6035e33L31O17Q3m5K72m92l16k97l62r6K44P36L91K79k47k11n59l28j04N5R3N29
$$ -533 -202 415 498 453 725 233 -83 -380 -742 -838 -594 142 533 812 565 354 -205 -533 -637 -582 -489 40
6057D0N51K00k6m13n51k46Nl85O63j46J137o1Q4n12j32n11l94J53K8M77L89O39
$$ 40 591 791 765 352 -199 -445 -440 -825 -162 -308 829 768 852 340 208 -303 -697 -544 -516 -39 350 989
6079I89k60m88j32l04m46r2K22Q3M25L94M72m26j3q93j38k2j5K42P78K01n4O8
$$ 989 729 241 109 -195 -641 -733 -511 -428 -3 391 863 437 424 -469 -607 -629 -644 -402 376 577 523 591
6101E91n76m1p03J02J31K56L74N41j78J00o44L1n69L5Q4K60K44N41j69L33o31
$$ 591 15 -26 -729 -627 -496 -240 134 675 497 597 -47 -16 -585 -550 -466 -206 38 579 410 743 112
6122A12k15k31l24J74K1Q37q6O85l39m54j42l94l18J74M0L76O00K24J75m54n60
$$ 112 -103 -334 -658 -484 -463 374 288 973 634 180 38 -356 -674 -500 -460 -84 516 740 915 461 -99
6143i9m63p6J85J43K78L55J53J37l16j3n53l71OL55k8N27K04l4j59j71l55k53
$$ -99 -562 -638 -453 -310 -32 323 476 613 297 284 -269 -640 -634 -279 -307 220 424 390 231 60 -295 -548
6165e48L8Q6L04L40L67k5N7m54l27k96k13L90L01J65M23q3J03o85j63k08Op0L70
$$ -548 -510 -424 -120 220 587 562 619 165 -162 -458 -671 -281 20 185 608 525 628 -57 -220 -428 -422 -492 -122
6188a22M07J66K66k58k49k57m67j56J72K16L20O50k59K46m86j49p10Q9m8M17K49
$$ -122 285 451 717 459 210 -47 -514 -670 -498 -282 38 688 429 675 189 40 -670 -581 -629 -212 37
6209C7P34J6j93k28m59k80j92M06j65N35m7M23j61j52l27j55k25J35k22N30L79
$$ 37 771 787 594 366 -93 -373 -565 -159 -324 211 164 587 426 274 -53 -208 -433 -298 -520 10 389
6230C89R5J41m59k69k7n18K22j89O36N18j34J64q1m88l12j47N0N0L74J33L88j32
$$ 389 484 625 166 -103 -130 -648 -426 -615 21 539 405 569 488 0 -312 -459 -409 -359 15 148 536 404
6252D04O7j71n14n7k45K37J26M49K29p5J0j18p48R8j7l29Q16O5K55M1l00j37l02
$$ 404 471 300 -214 -271 -516 -279 -153 296 525 450 460 342 -406 -308 -325 -654 162 227 482 523 223 86 -216
6275b16J91k20k58N29K22K44L6jp11k2m04n8O2L65M10J94M68m84k50k24j27N6
$$ -216 -25 -245 -503 26 248 492 528 527 -184 -206 -610 -668 -606 -241 169 363 831 347 97 -127 -254 -198
6297a98m66L79L68L93j33j7j12k80k45J1j93K5M42N27J75k38k80p2l48J50m79
$$ -198 -664 -285 83 476 343 326 214 -66 -311 -300 -493 -468 -26 501 676 438 158 86 -262 -112 -591
6318e91M38P7M06J67k30J40m21k39r7m2nM15J15K27J24r1n34j31q8j27J09N04
$$ -591 -153 -76 330 497 267 407 -14 -253 -350 -392 -397 18 133 360 484 393 -141 -272 -360 -487 -378 126
6340A26j3L63m8L9l79N4o20k31L01J56M67q0K97K01l53m43l42J08K3K18L37J61
$$ 126 113 476 428 467 88 142 -478 -709 -408 -252 215 135 432 633 280 -163 -505 -397 -374 -156 181 342
6362C42M02m60J40m57m10R7j4J63N02J1K07J92m90k89m41O6K18o9N2O28J74o5
$$ 342 744 284 424 -33 -443 -346 -360 -197 305 316 523 715 225 -64 -505 -439 -221 -290 -238 390 564 499
6384D99k96o82R8J50j73K60J44K44K67q0l97q9k13k16J05K03N11J25j02no1k31
$$ 499 203 -479 -381 -231 -404 -144 0 244 511 431 34 -55 -268 -484 -379 -176 335 460 358 353 292 61
6406F1m06k20L16q1K47L69M12m47k25n1k58j40j70N64j62L32N51n99J55l34k21
$$ 61 -345 -565 -249 -330 -83 286 698 251 26 -25 -283 -423 -593 -29 -191 141 692 93 248 -86 -307
6427c07l4k34L20J31L12L26j75j1k81j85q3j56q9O93k21K10K89l91J9j28j76j70
$$ -307 -341 -575 -255 -124 188 514 339 328 47 -138 -221 -377 -466 227 6 216 505 114 133 5 -171 -341
6449c41j10L29K00L1O94n93j43j84l12r2J25N10J95L1K21N6k40m80n7k99K01K65
$$ -341 -451 -122 78 109 803 210 67 -117 -429 -521 -396 114 309 340 561 617 377 -103 -160 -459 -258 7
6471Gn7N80m26L66n5l88l37m06J08L34K36J21K97Ol11k37j22K48m55O2K52L19
$$ 7 -50 530 104 470 415 27 -310 -716 -608 -274 -38 83 380 386 75 -162 -284 -36 -491 -429 -177 142
6493A42M17M4n23l80M16k34k99j02L63J75M21R1k20l33m9n84L44j6L08K41L64
$$ 142 559 603 80 -300 116 -118 -417 -519 -156 19 440 531 311 -22 -71 -655 -311 -327 -19 222 586
6514E86j93j10m0n19j06o7J20M8O74j34K6Q6k76m84K19l05K49L42N4K09K90m86
$$ 586 393 283 243 -276 -382 -449 -329 -281 393 259 285 371 95 -389 -170 -475 -226 116 170 379 669 183
6536A83K0l92l40L19k17J04M84J31Q2J03n47m2j80q4M0J40J85L70pO7j66l36m90
$$ 183 203 -189 -529 -210 -427 -323 161 292 374 477 -70 -112 -292 -376 -336 -196 -11 359 352 419 253 -83 -573
6559e73J80K23K06J3L49k2k35K61l94n25J28J16J83L6L18R0K09m24k3j97r1k42
$$ -573 -393 -170 36 49 398 376 141 402 8 -517 -389 -273 -90 -54 264 354 563 139 116 -81 -172 -414
6581d14J26K26L6K62K75o8k74j80j15l30P6K65N70o7J63l66m6m34j80J49J6L13
$$ -414 -288 -62 -26 236 511 443 169 -11 -126 -456 -380 -115 455 388 551 185 139 -295 -475 -326 -310 3
6603CK83JJ73p1k24j68l57n5J04K81OM35O5j99p4l04k12Q8N5j31L24N09k57Q8
$$ 3 286 287 460 389 165 -3 -360 -415 -311 -30 -24 411 476 277 203 -101 -313 -225 -170 -301 23 532 275 363
6627C63m69q3n2p0MK23l2L46P6j60j27k14L3k73K05Q4K28J8L04k80J53l94r3k78
$$ 363 -106 -189 -241 -311 -307 -84 -116 230 306 146 19 -195 -162 -435 -230 -146 82 100 404 124 277 -117 -210 -488
6651d88L39P4O35l4k30k0o6k72L1l35J95j20L41J67k9K39k64j51j31p3J45j06
$$ -488 -149 -75 560 526 296 276 210 -62 -31 -366 -171 -291 50 217 188 427 163 12 -119 -192 -47 -153
6673a53K08J71M7%K2j58l01m2j76p1L25K46L7K23q7j07j58j19l67K14o2M51L2
$$ -153 55 226 273 273 295 137 -164 -206 -382 -453 -128 118 155 378 291 184 26 -93 -460 -246 -308 143 175
6696A75M5J03k52r0l40J09k6J23K47Q4J26M0l16m9l85O5O6J08R0O03l76r9J6q4
$$ 175 220 323 71 -19 -359 -250 -276 -153 94 178 304 344 28 -21 -406 -341 -275 -167 -77 526 150 51 67 -17
6720a7p9l72K1K35K38N6J50p5P0l31j68J13k84J56J31L47o5R0p4m05j09j3J50
$$ -17 -96 -468 -447 -212 26 82 232 157 227 -104 -272 -159 -443 -287 -156 191 126 216 142 -263 -372 -385 -235
6743b35L33k19L90k5j0J77m30k30r5n0K69Q5K65k32M90k74j01l06pPP4kJ24J6
$$ -235 98 -121 269 244 234 411 -19 -249 -344 -394 -125 -40 225 -7 483 209 108 -198 -205 -198 -124 -126 -2 14
6767A4N08j23k38k31j43L3k6K51n1L22k6r2p8N9m49k10O0P6N02J69K79m29j94
$$ 14 522 399 161 -70 -213 -180 -206 45 -6 316 290 198 120 179 -270 -480 -420 -344 158 327 606 177 -17
6790a7p8k26K0o6R4M67J56j22O1P3k67m77L49N7j87K07J89lq8q5l12K74j25j99
$$ -17 -95 -321 -301 -367 -273 194 350 228 289 362 95 -382 -33 24 -163 44 233 230 142 57 -255 19 -106 -305
6814c05M34o7L0Q5K18k77k21j46k45K32L11k78L65L46M6m33R3l75J15l65K22J15
$$ -305 129 62 92 177 395 118 -103 -249 -494 -262 49 -229 136 482 528 95 188 -187 -72 -437 -215 -100
6836a00L45K6p2J53k32l03J0j32R8K76O9L02k91j91J40j29j83j23j31L31L62O3
$$ -100 245 271 199 352 120 -183 -173 -305 -207 69 138 440 149 -42 98 -31 -214 -337 -468 -137 225 288
6858B88M7j63n7j97k26J58M7k67L22K24q4J8k05O4l76J76L5J07K92k3K38l08j23
$$ 288 335 172 115 -82 -308 -150 -103 -370 -48 176 92 110 -95 -31 -407 -231 -196 -89 203 180 418 110 -13
6881a3Rr2j47M2Q7K13k26K21o6O0k14Nl53K58J62m3K14K69l01l7q4m39J88K23
$$ -13 -4 -96 -243 -201 -114 99 -127 94 28 88 -126 -121 -474 -216 -54 -97 117 386 85 48 -36 -475 -287 -64
6905f4k6j48O00k83O44n88j35j89j13J32J50J07J12J24j49j6k72J0K7j30j05N35
$$ -64 -90 -238 362 79 723 135 0 -189 -302 -170 -20 87 199 323 174 158 -114 -104 -77 -207 -312 223
6927B23L5j21J98k10n4K21l15N9l69o3L96L07jk12j01n7j55r3P0R1K63J96K22
$$ 223 258 137 335 125 71 292 -23 36 -333 -396 0 307 306 94 -7 -64 -219 -312 -242 -151 112 308 530
6950E30k94k16j70J16j28j56J13N32J30j84j11rk33j21j54j3L91K42K57j75j73
$$ 530 236 20 -150 -34 -162 -318 -205 327 457 273 162 153 -80 -201 -355 -368 23 265 522 347 174
6971A74m1q9n13L58k27K50K4L83J1j25o1k29LR3j67oM17q9k14K47j48k70K4n5
$$ 174 133 44 -469 -111 -338 -88 -64 319 330 205 144 -85 -82 11 -156 -162 255 166 -48 199 51 -219 -195 -250
6995b50o0p3L71L3Q7Q8j76j40J80m17Q8N4Q6J91L45j83k14k87o6m3K84O8k35M44
$$ -250 -310 -383 -12 21 108 196 20 -120 60 -357 -269 -215 -129 62 407 224 10 -277 -343 -386 -102 -34 -269 175
7019A75j79P2j20J38j70o8k12J10J3L44J25j29q2J1k53l23L30j89j31O35M50j34
$$ 175 -4 68 -52 86 -84 -152 -364 -254 -241 103 228 99 17 28 -225 -548 -218 -407 -538 97 547 413
7041D13k35r6j76K14j23j07K6J09R4M45k44j82m54J43m5J12J52j31J49O8K14k50
$$ 413 178 82 -94 120 -3 -110 -84 25 119 564 320 138 -316 -173 -218 -106 46 -85 64 132 346 96
7063I6k88J87k85J63j11M43k14J03k7K0q5Ll49o2O96k49RJ85m1P0k26k44m2J97
$$ 96 -192 -5 -290 -127 -238 205 -9 94 67 87 2 5 -344 -406 290 41 50 235 194 264 38 -206 -248 -51
7087e1o8Q0m6L34p9j59j90J40n40L47Q1M50l00L02n1j90N0p8k13J93k83L58N4
$$ -51 -119 -39 -85 249 170 11 -179 -39 -579 -232 -151 299 -1 301 250 60 110 32 -181 12 -271 87 141
7110A41m7R8j40K75m06n1r5J39k03N28m91L65J50k59k13Q1J79l07K49j17J57J47
$$ 141 94 192 52 327 -79 -130 -225 -86 -289 239 -252 113 263 4 -209 -128 51 -256 -7 -124 33 180
7132A80R6k13k29qo4j03L89J8L9J35n0j33k01k31K35o0l1P2K13J13R1J94l75m29
$$ 180 276 63 -166 -174 -238 -341 48 66 105 240 190 57 -144 -375 -140 -200 -231 -159 54 167 258 452 77 -352
7156c52J17J03j41J73mM57k91J10k5k32j97L63J9o3J01J3R2k38k61K3K9k09K06
$$ -352 -235 -132 -273 -100 -104 353 62 172 147 -85 -282 81 100 37 138 151 243 5 -256 -233 -204 -413 -207
7179b07K55L61k31J0n7l11M3k72K53l5J54L39k74j31K41j37O7j32p8L26k24J88
$$ -207 48 409 178 188 131 -180 -137 -409 -156 -191 -37 302 28 -103 138 1 68 -64 -142 184 -40 148
7201A48N0oR6j15m34J96K09k84K07j0K07j26L58p12M9k51l2L06R6K52o4J58j03
$$ 148 198 192 288 173 -261 -65 144 -140 67 57 264 138 496 -216 -167 -418 -450 -144 -48 204 140 298 195
7224A95k34l2O0k46j43L02l3N38qk65J4j35j7j86MQ5J40j16Q3K77l69N8l51J39
$$ 195 -39 -71 -11 -257 -400 -98 -131 407 399 134 148 13 -4 -190 -186 -101 39 -77 6 283 -86 -28 -379 -240
7248b40m6J00M40pr7k67L6J96l08o6J29j85L62L61q8q2Lr5j14K1k58K79m5J75
$$ -240 -286 -186 254 247 150 -117 -81 115 -193 -259 -130 -315 47 408 320 238 241 146 32 53 -205 74 29 204
7272B04jM0j87l88L07k57J12oL36J52n0L6j04J6l18j37J78j06J42Q6K62j4L9k90
$$ 204 203 243 56 -332 -25 -282 -170 -176 160 312 262 298 194 210 -108 -245 -67 -173 -31 55 317 303 342 52
7296E2j14l40l3J54L96O1n9K04j54m1m15k28J09J23J71K91P1Q6j01j68m7j96M0
$$ 52 -62 -402 -435 -281 115 176 117 321 167 126 -289 -517 -408 -285 -114 177 248 334 233 65 18 -178 -138
7319a38j80K51kJ50K10J7r7k20l27O0k3J22L92p1J76j16j22l32j66J87k5M50j12
$$ -138 -318 -67 -69 81 291 308 211 -9 -336 -276 -299 -177 215 144 320 204 82 -250 -416 -229 -254 196 84
7342H4n5K34J11k62o4r8j06qj14J28K97J79J63n86K28j81k52m7N46k62K85K20
$$ 84 29 263 374 112 48 -50 -156 -164 -278 -150 147 326 489 -97 131 -50 -302 -349 197 -65 220 440
7364D40k39p4j33j26k43J82NJ69L26k29L92l78p8q0l37O1P4K61K68J04k84j06
$$ 440 201 127 -6 -132 -375 -193 -188 -19 307 78 470 92 14 -66 -403 -342 -268 -7 261 365 81 -25
7386b5p1j62N6j40L36j78M55O2n9k67P8k27J44l73K44K97o2rQ4J23m76j92N5J22
$$ -25 -96 -258 -202 -342 -6 -184 271 333 274 7 85 -142 2 -371 -127 170 108 99 183 306 -170 -362 -307 -185
7410a85K4J26P2J29P9nL7m5m19j74n1M13K95k72K51m9l03lk29J91j2J19R2j09
$$ -185 -161 -35 37 166 245 240 277 232 -187 -361 -412 1 296 24 275 226 -77 -80 -309 -118 -130 -11 81 -28
7434b8M90j24p6k60M0k32K41Q6j49J98K61j02k31L9j27o40M28Q9K09J94k35r5
$$ -28 462 338 262 2 42 -190 51 137 -12 186 447 345 114 153 26 -614 -186 -97 112 306 71 -24
7456b4l5R9p9k2j54K61j4K05RJ84j28k62m87M56j77J6K2L59L0lk25k20k0r8r0
$$ -24 -59 40 -39 -61 -215 46 32 237 246 430 302 40 -447 9 -168 -152 -130 229 259 256 31 -189 -209 -307 -397
7481c97K82K08N5j10M80j28l83j69p6R6K22k81M54J48k6j16k61k90N0L56m52M14
$$ -397 -115 93 148 38 518 390 7 -162 -238 -142 80 -201 253 401 375 259 -2 -292 -242 114 -338 76
7503G6j92O49j36j69k12k11l25L60p8J95K38o5K2R2r6l63K23j63K60r7M18k31
$$ 76 -116 533 397 228 16 -195 -520 -160 -238 -43 195 130 152 244 148 -215 8 -155 105 8 426 195
7525A95m6J24q4k72j9J62r0j7P8N8q5N6J57k48j79p1K08K7N3L06l7n6n6l83K57
$$ 195 149 273 189 -83 -102 60 -30 -47 31 89 4 60 217 -31 -210 -281 -73 -46 7 313 276 220 164 -219 38
7550C8m85M02L6N0K51n9o8j41Rk97l9P0J35O6J68p2J90k8k04k75K01m1j22J56
$$ 38 -447 -45 -9 41 292 233 165 24 33 -264 -303 -233 -98 -32 136 64 254 226 22 -253 -52 -93 -215 -59
7574e9L92j96L4Pr7k69j41q0j6O21k49L75N7q3j78k31k00j49M43j91M1M01j26
$$ -59 333 137 171 178 81 -188 -329 -409 -425 196 -53 322 379 296 118 -113 -313 -462 -19 -210 -169 232 106
7597A06Q3N8k15l83J83O4k11P40j80mJ50k17l50Pk21K49K51P3j17L53o1j60k39
$$ 106 189 247 32 -351 -168 -104 -315 425 245 241 391 174 -176 -169 -390 -141 110 183 66 419 358 198 -41
7620d1l12L64k15K54k66N21L92l51k47m1l44r0N3rM54J95k21l2O2j26qk69j24
$$ -41 -353 11 -204 50 -216 305 697 346 99 58 -286 -376 -323 -332 122 317 96 64 126 0 -8 -277 -401
7643d01L24J2L45J86l2l69J6m0k44k3J99J23K13M3k77j67J5N3k5l3k37L12P6M36
$$ -401 -77 -65 280 466 434 65 81 41 -203 -226 -27 96 309 352 75 -92 -77 -24 -49 -82 -319 -7 69 505
7667E05k18l5j41n27J0K03R3J23K24K46k22m0m5n0k23l44Q9J65L84j30J10Rk04
$$ 505 287 252 111 -416 -406 -203 -110 13 237 483 261 221 176 126 -97 -441 -352 -187 197 67 177 186 -18
7690a8o1k29rP2j8M41o7J11J8j62l16j56J26J4K29M08j32L20m08l27N2n5l05K34
$$ -18 -79 -308 -317 -245 -263 178 111 222 240 78 -238 -394 -268 -254 -25 383 251 571 163 -164 -112 -167 -472 -238
7714b38K24q8M35j09M5k02m08J13m7J18J73J55K3M03k23j82k65l24J83j35J23
$$ -238 -14 -102 333 224 269 67 -341 -228 -275 -157 16 171 194 597 374 192 -73 -397 -214 -349 -226
7735b26L65k9q1J07o4j31l26J3K17j37M46J07N2k51K26m22qo3q0L53q5K05J58
$$ -226 139 110 29 136 72 -59 -385 -372 -155 -292 154 261 313 62 288 -134 -142 -205 -285 68 -17 188 346
7758C46k76J79K31o08k15j20L51Q1J12K06j59N7j90l59L06q6o9L66N5K52l50J15
$$ 346 70 249 480 -128 -343 -463 -112 -31 81 287 128 185 -5 -364 -58 -144 -213 153 208 460 110 225
7780B25j24o11J38P3K48l2J45L7J02j17l61l1J37j5mR9N2J98K12r1l35pj53O8
$$ 225 101 -510 -372 -299 -51 -83 62 99 201 84 -277 -308 -171 -186 -190 -91 -39 159 371 280 -55 -62 -215 -147
7804a47n7J03K12Q6k0j44J06k70k65O4O7j96O31r5K26J28m05j27l3j99L27oMK89
$$ -147 -204 -101 111 197 177 33 139 -131 -396 -332 -265 -461 170 75 301 429 24 -103 -136 -335 -8 -14 -10 279
7828B79mJ21n21O9j90K03l83K05K20j34O45k60j10k21k67O2j89L89K92k80O48
$$ 279 275 396 -125 -56 -246 -43 -426 -221 -1 -135 510 250 140 -81 -348 -286 -475 -86 206 -74 574
7849E74l74k23L5k36j43P4m5J65L73J4K6k23K9m3l19J65r0N4M26q3P7j76j57O2
$$ 574 200 -23 12 -224 -367 -293 -338 -173 200 214 240 17 46 3 -316 -151 -241 -187 239 156 233 57 -100 -38
7873c8q2k09j85L80j8N91j95p8j04m50L31p2M9k76N12Q5r8J68r7l56r8J26l24
$$ -38 -120 -329 -514 -134 -152 439 244 166 62 -388 -57 -129 -80 -356 156 241 143 311 214 -142 -240 -114 -438
7896d38N87l0M58k95q0r2j04l13m2J42J30J95J79qr9R8n46j13L33L7l95O25j03
$$ -438 149 119 577 282 202 110 6 -307 -349 -207 -77 118 297 289 190 288 -258 -371 -38 -1 -396 229 126
7919A26K70j84k48Nn8m86L00Q3K12L80j81J83o22K37j77k87K40J9J53L51Q7j84
$$ 126 396 212 -36 -31 -89 -575 -275 -192 20 400 219 402 -220 17 -160 -447 -207 -188 -35 316 403 219
7941B19o7j01m58NK8L49J98R9j50K65l26l01j74K49m5K33O9K00K5k0l85J9J05
$$ 219 152 51 -407 -402 -374 -25 173 272 122 387 61 -240 -414 -165 -210 23 92 292 317 297 -88 -69 36
7964C6k17k0L8r6O27l6R7k77j1r0l11j04m6J95M81j19m6j9n4k11L7oJ96j28J55
$$ 36 -181 -201 -163 -259 368 332 429 152 141 51 -260 -364 -410 -215 266 147 101 82 28 -183 -146 -152 44 -84 71
7989G1L86k66J00j84l74N0r4K22k9J50J22J19l60J12J44m30J60r6M9R8N89j88
$$ 71 457 191 291 107 -267 -217 -311 -89 -118 32 154 273 -87 25 169 -261 -101 -197 -148 -50 539 351
8011C51k68P2j82j16k15M58j28L30q0M1n5j04j18j94R6j41J74J67J32j73J48R8
$$ 351 83 155 -27 -143 -358 100 -28 302 222 263 208 104 -14 -208 -112 -253 -79 88 220 47 195 293
8033B93k22m81K49k66M88J1J92J07j73J49l48l91j27jM05K00N7M0J75k05K5l63
$$ 293 71 -410 -161 -427 61 72 264 371 198 347 -1 -392 -519 -520 -115 85 142 182 357 152 177 -186
8055a86k08P0j03J03M45M78k64j38Q0m20n6j13j25Q2M99R0l5Q1n4m81p6j32K07
$$ -186 -394 -324 -427 -324 121 599 335 197 277 -143 -199 -312 -437 -355 144 234 199 280 226 -255 -331 -463 -256
8078b56M42N3J99K7l13l8k04p3l8J06J87n9J3O00k94m41k3lr7J11K6L10J39Q5
$$ -256 186 239 438 465 152 114 -90 -163 -201 -95 92 33 46 646 352 -89 -112 -115 -212 -101 -75 235 374 459
8102D59l81m5j10q8l57M84k82L92L46l16k7Q6j78k49j08J27N1K93Q1Ol8K17l45
$$ 459 78 33 -77 -165 -522 -38 -320 72 418 102 75 161 -17 -266 -374 -247 -196 97 178 184 146 363 18
8125A8r2k02m3M5K90L01j36M37p66J91j20n2r9M5J63K85j8M63n90R1n03j52R2
$$ 18 -74 -276 -319 -274 16 317 181 618 -148 43 -77 -129 -228 -183 -20 265 247 710 120 211 -292 -444 -352
8148c52J41Q8K70K18j72m8J23m91p5p0J24L42K33j08K32k01Q6n83Q2j7k4J50J35
$$ -352 -211 -123 147 365 193 145 268 -223 -298 -368 -244 98 331 223 455 254 340 -243 -161 -178 -202 -52 83
8171H3J95M5J12l73j52j54KJ85m9L15k2J86Nk55j04m87Q4L72m9R6
$$ 83 278 323 435 62 -90 -244 -242 -57 -106 209 187 373 378 123 19 -468 -384 -12 -61 35
8191C5
$$ Imaginary data points
##PAGE= N=2
##DATA TABLE= (X++(I..I)), XYDATA
0@%%%%%%%%%qJ6j6J6k4L3m1N6o4P3r7J18j37J63j92K25k63L11l61M14m77N43o20
$$ 0 0 0 0 0 0 0 0 0 0 -8 8 -8 8 -16 17 -24 32 -32 41 -56 62 -75 88 -104 121 -142 169 -192 222 -255 288 -332
32c32P08q00R04j019J148j289J440j608J790j993K215k452K715k999L313l656
$$ -332 376 -424 480 -539 609 -680 760 -848 942 -1051 1164 -1288 1427 -1572 1741 -1915
48a915M027m439M889n387N938o548P233q001Q872r869J1021j2374J3983j5944
$$ -1915 2112 -2327 2562 -2825 3113 -3435 3798 -4203 4669 -5200 5821 -6553 7430 -8514
62h514J8389k1540K5786l1834M1233n7998R7162l66633k38101M84791L36380L31304
$$ -8514 9875 -11665 14121 -17713 23520 -34478 62684 -303949 -542050 -57259 279121 610425
74F10425M0837j58997l80002l73677l14390p3817J53958L54514L79843L13954
$$ 610425 651262 492265 112263 -261414 -575804 -649621 -495663 -141149 238694 552648
84E52648R0408j45078l36169l76053l11095j05181J28510L18905L75275L13300
$$ 552648 643056 497978 161809 -214244 -525339 -630520 -502010 -183105 192170 505470
94E05470J15643j17601l06094l69267l10433j25594J03267K90257L62996L11205
$$ 505470 621113 503512 197418 -171849 -482282 -607876 -504609 -214352 148644 459849
104D59849J35990q8602k75546l55970l12452j46343P4707K61697L48415L13555
$$ 459849 595839 507237 231691 -124279 -436731 -583074 -508367 -246670 101745 415300
114D15300J56233o1307k48432l42127l13935j64705M9181K36099L33702L12953
$$ 415300 571533 510226 261794 -80333 -394268 -558973 -509792 -273693 60009 372962
124C72962J71834l5529k22442l25529l12358j78424K2082K08074L18071L11848
$$ 372962 544796 509267 286825 -38704 -351062 -529486 -507404 -299330 18741 330589
134C30589J84886j0215j95708l09024l10812j92404k866J83866L02206L08564
$$ 330589 515475 505260 309552 528 -310284 -502688 -505554 -321688 -19482 289082
144B89082J97652J4726j70734k93060l06198k03343k5923J58341K83976L03077
$$ 289082 486734 501460 330726 37666 -268532 -471875 -497798 -339457 -55481 247596
154B47596K08664L8881j45943k74899l00837k14134m9081J32968K65305K97725
$$ 247596 456260 495141 349198 74299 -226538 -440672 -489753 -356785 -91480 206245
164B06245K19798N9345j22368k56580k93604k22788o8712J10242K46135K90461
$$ 206245 426043 485388 363020 106440 -187164 -409952 -478664 -368422 -122287 168174
174A68174K26104P7766r8177k35568k86522k30231q6665Q7034K26220K81207K31934
$$ 168174 394278 472044 373867 138299 -148223 -378454 -465119 -378085 -151865 129342 361276
185C61276R5908p4708k15923k77039k34564j04081O3893K06380K71771K35739
$$ 361276 457184 382476 166553 -110486 -345050 -449131 -385238 -178858 92913 328652
195C28652J11820n2881j96645k65884k36864j19248M2199J85387K60375K38257
$$ 328652 440472 387591 190946 -74938 -311802 -431050 -388851 -203464 56911 295168
205B95168J25337l1866j75968k53637k37945j32767K1500J66026K48514K38081
$$ 295168 420505 388639 212671 -40966 -278911 -411678 -390178 -224152 24362 262443
215B62443J38235j1589j55932k42042k37314j43417K185J46242K34724K36609
$$ 262443 400678 389089 233157 -8885 -246199 -389616 -387431 -241189 -6465 230144
225B30144J48842P385j36432k29003k35605j52960j5788J26167K21671K33995
$$ 230144 378986 386371 249939 20936 -214669 -367629 -383417 -257250 -35579 198416
235A98416J57886K4675j17018k14940k31724j61422l3454J07309K08275K29660
$$ 198416 356302 380977 263959 49019 -182705 -344127 -377581 -270272 -61997 167663
245A67663J65235M0762r8013k00785k26712j68856m8911Q8696J93989K24298J71203
$$ 167663 332898 373660 275647 74862 -151850 -320706 -369617 -280921 -86932 137366 308569
256C08569N6035p9919j85992k21502j73937o2862P1379J78329K18071J76350O9986
$$ 308569 364604 284685 98693 -122809 -296746 -359608 -288229 -109900 108171 284521 354507
267C54507o2700j71445k14617j78350p5950N3897J63892K10886J79858Q1699m5870
$$ 354507 291807 120362 -94255 -272605 -348555 -294658 -130766 80120 259978 341677 295807
278B95807j56009k06785j81204q7977L8208J49221K03200J81646R2709l0072j41019
$$ 295807 139798 -66987 -248191 -336168 -297960 -148739 54461 236107 328816 298744 157725
289A57725j98768j82467r8572K2971J33821J94091J82686J03193j5305j26429
$$ 157725 -41043 -223510 -322082 -299111 -165290 28801 211487 314680 299375 172946
299A72946j89910j82808j06914P786J18826J85232J82628J11496j009j12141j79868
$$ 172946 -16964 -199772 -306686 -298900 -180074 5158 187786 299282 298273 186132 6264
310F264j81874j15414o216J05124J75328J81288J18508J2112r7176j70425j79664
$$ 6264 -175610 -291024 -297240 -192116 -16788 164500 283008 295120 197944 27519 -152145
321a52145j22143j9309R0460J65417J78446J25051K5181q2853j59992j77399j28016
$$ -152145 -274288 -293597 -203137 -37720 140726 265777 290958 208105 48113 -129286 -257302
332b57302l1301P6356J54625J75472J30801L7248o9841j49882j73330j32570m2654
$$ -257302 -288603 -212247 -57622 117850 248651 285899 216058 66176 -107154 -239724 -282378
343b82378O2412J43959J71463J35111M7960n5510j38775j69070j36374n3731M9278
$$ -282378 -219966 -76007 95456 230567 278527 223017 84242 -84828 -221202 -274933 -225655
354b25655J32948J66574J38672N8160m2648j26799j64103j40069o3163L6290J21433
$$ -225655 -92707 73867 212539 270699 228051 101252 -62851 -202920 -266083 -229793 -108360
365a08360J61026J40537O8072k9734j15925j58049j41509p2208K3395J10159J55182
$$ -108360 52666 193203 261275 231541 115616 -42433 -183942 -256150 -232755 -122596 32586
376C2586J42425P6069j7906j04464j51514j42900p9818J1955R8546J48730J43061
$$ 32586 175011 251080 233174 128710 -22804 -165704 -245522 -233567 -135021 13709 156770
387A56770Q2994o222r3015j45183j42547q6887R23Q7412J41575J42624Q9570M443
$$ 156770 239764 233542 140527 -4656 -147203 -234090 -233167 -145755 -4180 138444 228014 232457
399B32457q2323j37536j42131r2594r024P6757J33670J41052R5567J4501p2004
$$ 232457 150134 12598 -129533 -222127 -231151 -154394 -20724 120328 215895 230396 158392
410A58392j30624j39931r7511j8812O5923J26615J39327R9632K3394o0714j22503
$$ 158392 27768 -112163 -209674 -228486 -162563 -35948 103379 203011 226405 165691 43188
421D3188j38040j01523k8020N5631J18612J36745J03236L2523n1079j13977j34947
$$ 43188 -94852 -196375 -224395 -168764 -50152 86593 189829 222352 171273 57296 -77651
432g7651j05585l6274M5579J10373J33063J06692M0435m0317j06117j31559j07947
$$ -77651 -183236 -219510 -173931 -63558 69505 176197 216632 176315 70198 -61361 -169308
443a69308m3948L5322J01724J29607J09185M7716l0603r7599j27810j10006n1142
$$ -169308 -213256 -177934 -76210 53397 162582 210298 179695 82096 -45714 -155720 -206862
454b06862K5816R3215J25599J11261N4291k1250q9093j22870j11688n7946J6727
$$ -206862 -181046 -87831 37768 149029 203320 182070 92977 -29893 -141581 -199527 -182800
465a82800Q4628J20766J11803O0900j2258q0105j18456j12043o3551P801P6321
$$ -182800 -98172 22594 134397 195297 183039 102934 -15522 -127565 -191116 -183315 -106994
476a06994J15394J11764O6596l609p1637j12969j12163o8600p03O7303J10515
$$ -106994 8400 120164 186760 183151 111514 -1455 -113618 -182218 -182921 -115618 -5103
487e103J12045P0778M500o3037j07960j10982p3325q400N9216J04612J11143P4712
$$ -5103 106942 177720 182220 119183 11223 -99759 -173084 -181484 -122268 -17656 93487 168199
499A68199J1952n4352j02037j10039p6969j5882N0590R9127J09196P8574J9468
$$ 168199 180151 125799 23762 -86277 -163246 -179128 -128538 -29411 79785 158359 177827
510A77827m6542r6111j08512q0255k2551M2902R2558J07289Q1587K6154l8585
$$ 177827 131285 35174 -73338 -153593 -176144 -133242 -40684 66605 148192 174346 135761
521A35761q9892j05985q2496k9631L4673Q6342J05023Q3613L2945l1003q3393
$$ 135761 45869 -60116 -142612 -172243 -137570 -51228 53795 137408 170353 139350 55957
532E5957j03419q4758l5996K7419Q0346J01496Q5893L8573k3766p6524j00137
$$ 55957 -47462 -132220 -168216 -140797 -60451 41045 126938 165511 141745 65221 -34916
543c4916q6882m0848J9578P3262R8517Q7154M4026j6058p0159r6475q7794m6625
$$ -34916 -121798 -162646 -143068 -69806 28711 115865 159891 143833 73674 -22801 -110595 -157220
555a57220J3011O6321R4941Q8327M8708r031o4022r2550q8115n1169N655O0172
$$ -157220 -144209 -77888 17053 105380 154088 145057 81035 -11515 -99630 -150799 -145144 -84972
567h4972R1023Q8476N3285k705n6742q9017q8422n5213m91N3665Q6512Q8272N6730
$$ -84972 6051 94527 147812 145107 88365 -652 -89074 -144287 -144778 -91113 -4601 83671 140401
580A40401L847m9929q4484q8439n8294o931M6744Q2341Q8063O0000R789m3337
$$ 140401 144248 94319 9835 -78604 -136898 -143829 -97085 -14744 73319 133319 143108 99771
592I9771q0459q7175o1560j2470L9999P8225Q6407O2692J5574l7050p5541q5767
$$ 99771 19312 -67863 -129423 -141893 -101894 -23669 62738 125430 141004 103954 28413 -57354
604e7354o4345j8199L3756P3664Q5121O5066K0827l0695p0777q4365o6161k3557
$$ -57354 -121699 -139898 -106142 -32478 52643 117709 138536 107841 37064 -47301 -113462 -137019
616a37019K7983O8128Q3251O7028K6001k4753o5704q2258o7864k8582K1741O3123
$$ -137019 -109036 -40908 42343 109371 135372 110619 44915 -37343 -105207 -133789 -112048 -48925
628d8925Q1093O9014L0377j8042o0836p9892o9542l3141J5805N8194P8822O9470
$$ -48925 32168 101182 131559 113517 52681 -27211 -96753 -129894 -114089 -55895 22927 92397
640I2397L5069j2841n5324p7133p0511l7174J0009N3073P6061P0333L8921o976
$$ 92397 127466 114625 59301 -17832 -88343 -125517 -115508 -62435 13626 83959 122880 115904
652A15904n0594p3966p0881m1074M655M7808P2556P0708M2911j763m5309p0825
$$ 115904 65310 -8656 -79537 -120611 -115956 -68148 4408 75116 118027 116264 70955 130
664A30p1065m4414m05M2141O9271P1013M6026L318m0119o7858p0430m7557n482
$$ 130 -70935 -115349 -115754 -73613 -4342 66671 112697 116015 75896 8038 -62392 -109949 -115431
677a15431L7151O5901P0472M8644P956l4108o4137p0461m9442j0705L1548O2364
$$ -115431 -78280 -12379 58093 106737 114693 80585 16448 -54013 -103455 -114160 -82612 -20248
689b0248O9852N0844J2865k9049o0471o8877n2402j5178K6607N8469O8833N2946
$$ -20248 49604 100448 113313 84264 23793 -45084 -97486 -112664 -86057 -27588 41245 94191
701I4191J7300k4112n6554o7744n3948j9467K1654N4433O7062N4777K1579j9029
$$ 94191 111491 87379 30825 -36919 -90867 -110334 -88680 -34247 32815 87592 109171 90142
713I0142n2349o6607n5255k3365J6531N0347O5507N5490K5458j3874m8092o4626
$$ 90142 37793 -28814 -84069 -107434 -90903 -40556 24951 80441 105899 92025 43933 -20693
725b0693n6437k7295J1732M5729O3589N6988K8868q822m4360o2144n7184l0981
$$ -20693 -77130 -104425 -92693 -46964 16625 73613 102481 93659 49299 -12845 -70029 -101010
737a01010P034M2191O0851N7341L2562m912l9466n9888n7205l4010K141L7323
$$ -101010 -93976 -51785 9066 66407 98969 94057 54591 -5297 -62502 -96512 -94371 -57048
749e7048N8711N7632L5005K99l5449n7319n7580l6483k242L3146N6028N7089L8167
$$ -57048 1663 59295 94300 94599 59150 1831 -55749 -92232 -94474 -61328 -5300 51789 89956
762H9956M127l0984n4187n7291l9395o201K8880N2599N7395M0196Q337k6579n1299
$$ 89956 94083 63099 8912 -48379 -87774 -93975 -65095 -12496 44899 85095 93432 66853 15554
775A5554n6842m1804r692K4270M9784N6424M2159J2080k2036m8121n5758m3418
$$ 15554 -41288 -83092 -92784 -68514 -18730 37694 79853 91933 69897 21776 -33982 -77400
787g7400j3937J9822M6684N5649M3756J5509j7859m4557n4962m4514j7426J5771
$$ -77400 -91337 -71515 -24831 30818 74574 90083 72224 27667 -27295 -71809 -89235 -73464
799g3464M3049N4291M5003J9035j3717m1044n3451m5768k0499J1527L9288N2832
$$ -73464 -30415 23876 68879 87914 74197 33153 -20298 -66066 -86565 -75038 -35750 17082
811A7082M5922K2276r476l7653n2104m6112k4033P783L6065N0534M7111K4771
$$ 17082 63004 85280 75804 38151 -13953 -60065 -84098 -76315 -40250 10284 57395 82166
823H2166n483l4309m9591m7055k6271L779L2204M8752M7066K7384j518l0857m7518
$$ 82166 76683 42374 -7217 -54272 -80543 -76764 -44560 4192 51258 78642 77124 46267 -1251
836a251m6946k8944lK8833M6510M7008L0095J529k6593m5443m7152l0993l685
$$ -1251 -48197 -77141 -77144 -48311 -1801 45207 75302 76831 50238 4795 -42357 -73350 -77035
849g7035K5517M3986M6642L2244N279k3518m2743m6653l2915p062K1640M1659
$$ -77035 -51518 -7532 39110 71354 76633 53115 10372 -36281 -69196 -76258 -54618 -12959
861a2959M6303L3723Q641j9857m0147m6218l4341r933J7786L9078M5410L4931
$$ -12959 33344 67067 75708 55851 15704 -30514 -64855 -74788 -57002 -17924 27486 62417
873F2417J1988j6304l7702m5249l5245j3437J4972L6178M4250L6289J4158j2544
$$ 62417 74405 58101 20399 -24850 -60095 -73532 -58560 -22382 21868 58157 72315 59771
885E9771l4899m4011l6532j5477J0669L3528M3361L7061J6806r371l1717m2561
$$ 59771 24872 -19139 -55671 -71148 -60479 -26951 16410 53471 70277 60906 29189 -13372
897a3372l7439j8227P647L0503M1860L7681J9107o214k8930m0933l7904k0562
$$ -13372 -50811 -69038 -61391 -30888 10972 48653 67760 61546 32616 -8317 -46221 -66783
909f6783M818K7576M0381L7928K1487k916k6538l9304l7971k2575J628K4837L8444
$$ -66783 -61965 -34389 5992 43920 65407 62491 35953 -3351 -41322 -63897 -62269 -37432 1012
922A012L7738K3629m16k2927l7799l7723k4076j499K1792L6681L7634K4938K814
$$ 1012 38750 62379 61963 39036 1237 -36486 -60562 -62061 -40269 -3588 34046 58984 61798
935F1798k0122l5552l8100k5358m170J8775L4716L7103K6522N200j7014l3667
$$ 61798 41676 6124 -31976 -57334 -61504 -42729 -8013 29090 55612 60812 43798 10131
947A0131l6942k6951o825J5943L2568L6744K7413Q388j4377l1905l6281k8155
$$ 10131 -26811 -53762 -60587 -44644 -12076 24668 52081 60469 46092 14187 -22094 -50249
959e0249r214J2834L0194L6407K8246J0494j1731k8926l5528k9376j1340J0418
$$ -50249 -59463 -46629 -16435 19972 48218 58712 46981 18055 -17473 -46849 -58189 -47771
971d7771K8021L5030K9754J2183r001k6759l4912k9430j3539P771K5655L4025
$$ -47771 -19750 15280 45034 57217 48216 21457 -13455 -42885 -56424 -48653 -22998 11027
983A1027K9873J4356o341k4249l4086k9664j5259M964K3624L2763L0142J6060
$$ 11027 40900 55256 48915 24666 -9420 -39084 -54343 -49379 -25755 7008 37150 53210
995E3210l776k2450l2219l0164j6692K601K0936L1805K9939J7743j492j9977l0647
$$ 53210 49434 26984 -5235 -35399 -52091 -49490 -28554 3251 33190 50933 49441 29464 -1183
1008a183l0126j8393K32J9058K9807K9863J9378N15j7375k9409l0120j9469k182
$$ -1183 -31309 -49702 -49470 -30412 -605 29258 48636 49151 31776 2367 -27753 -47222 -49404
1021d9404J6521K8883K9875K0102K839j4927k8132k9745k0745l959J3959K7365
$$ -49404 -32883 -4000 25875 45977 48816 33889 5757 -23988 -44733 -48692 -34733 -7368
1033g368K9376K1198N221j2710k6470k9253k1815o038J1707K5345K8860K2315
$$ -7368 22008 43206 48427 35717 9247 -20006 -41821 -47859 -36152 -10807 18053 40368
1045D0368O879j0530k4314k8913k2457p713R700K2804K9068K2378Q972q438k2800
$$ 40368 47247 36717 12403 -16510 -38967 -46680 -36980 -14176 14892 37270 46242 37804 15004
1058A5004k7539k3063r968P440K1773K7350K3477J0253o389k0575k6966k3831
$$ 15004 -12535 -35598 -45566 -38126 -16353 10997 34474 44727 38338 17763 -9203 -33034
1070c3034j0939N240J9413K6839K3801J1764m034j8866k6327k3839j2162K934
$$ -33034 -43973 -38733 -19320 7519 31320 43084 39050 20184 -6143 -29982 -42144 -39210
1082c9210J8381K5389K3721J3250k532j6786k5061k4219j3681J523J5920K4439
$$ -39210 -20829 4560 28281 41531 38999 22213 -2848 -27067 -40748 -39225 -23305 1134
1094A134K3955J4735q01j5098k4293k3595j4633l42J4142K3390K3678J5195J676
$$ 1134 25089 39824 39023 23925 -368 -23963 -38596 -38938 -24796 -1406 22272 37467 39143
1107C9143j3414k3156k3378j5968j850J2202K2254K3501J6155K992j1469k1707
$$ 39143 25729 2573 -20805 -36773 -38623 -26421 -4167 19334 35489 38481 27012 5305
1119E305k3434j6240m037J0759K0811K3291J6791M364r259k0594k2778j7322n030
$$ 5305 -18129 -34369 -38406 -27647 -6836 16455 33246 37610 28351 7757 -15021 -32343 -37373
1132c7373Q881J9413K2462J7741N822p726j9042k2564j7931o118P111J7620K2504
$$ -37373 -28492 -9079 13383 31124 36946 29220 10178 -12386 -30317 -36435 -29324 -11704 10800
1145A0800J7973P281o074j7751k1961j8219p352N201J6670K1663J8384Q647n017
$$ 10800 28773 36054 29980 12229 -9732 -27951 -35303 -30102 -13432 8231 26615 35262 30245
1158C0245j5628k1131j9123q697L850J5307K0697J8549R846l287j4423k0541j9247
$$ 30245 14617 -6514 -25637 -34334 -30484 -15177 5520 24069 33915 30628 16205 -4336 -23583
1171b3583r398K261J3875K0253J8578J0569j880j2996j9594j8939j0955P51J2675
$$ -23583 -32981 -30720 -16845 3408 21986 32555 30675 17679 -1915 -20854 -31809 -31058 -18383
1184a8383J9366J8491J1304L0j1982j8690j8598j1639l57J0780J8573J8440J2474
$$ -18383 983 19474 30778 30808 18826 136 -18462 -30101 -30458 -19678 -1105 17335 29809
1197B9809N55j0176j7791j8592j2444j672R669J7152J8980J2536K406r183j6861
$$ 29809 30364 20188 2397 -16195 -28639 -30311 -20642 -3490 15490 28026 30432 21249 4388
1210D388j8640j2794k937Q454J6150J8357J3229L596p604j5936j7897j3674m005
$$ 4388 -14252 -27046 -29983 -21529 -5379 12978 26207 29803 22199 6263 -11634 -25308 -29313
1223b9313P107J5202J7866J3883M399o674j4804j7220j4348m799N858J4302J7249
$$ -29313 -22206 -7004 10862 24745 29144 22470 7666 -9554 -23902 -28701 -22843 -8541 8708
1236H708J3867N886n039j4150j6904j4214o123M701J2882J7384J4223O420l965
$$ 8708 22575 28461 23422 9272 -7632 -21846 -27969 -23268 -10386 6998 21221 27641 23676
1249B3676j2717j6799j4490o818L244J2508J6118J4897P117k820j1831j6208j4377
$$ 23676 10959 -5840 -20330 -27148 -23904 -11396 4722 19619 26736 23916 12085 -4123 -18500
1262a8500p546K132J1198J5783J4241Q484j887j0627j5333j4737q131R20J0183
$$ -18500 -26046 -23914 -12716 3067 17308 25792 23905 13278 -2055 -16792 -24923 -24003 -13820
1275a3820J5161J4499Q626m97r563j5084j4042r497P1R016J4349J4806R468O74
$$ -13820 1341 15840 24466 23969 14406 -678 -14720 -24217 -24146 -15130 -781 14025 23493 24167
1289B4167q737j4170j4363r940q22P776J3976J4629R962J282p417j3824j3966
$$ 24167 15430 1260 -13103 -23043 -23865 -16089 -2113 12516 22478 23760 16343 2519 -11447
1302a1447j0049k178P113J3083J4051J0465K301o484j2613j3967j0535l048N945
$$ -11447 -21496 -23674 -16561 -3478 10573 21038 23339 16855 4242 -9725 -20260 -23308 -17363
1315a7363J2179J4249J0532L669n521j2046j4168j0607l677N062J1279J3897J1214
$$ -17363 -5184 9065 19597 23266 17745 5699 -8469 -19076 -22753 -17691 -6412 7485 18699
1328A8699L887m447j1064j3884j1085m207L926J0687J3368J1523M632l490j0360
$$ 18699 22586 18139 7075 -6809 -17894 -22101 -18175 -7488 5880 17403 22035 18545 8185
1341H185j3258j1498n183L084J0175J2806J1596N338k319r568j2967j1640n916
$$ 8185 -5073 -16571 -21754 -18670 -8495 4311 15907 21245 18926 9358 -3609 -15249 -21165
1354b1165K306R329J2531J1613O241j741q954j2521j1619o346J503Q174J2168
$$ -21165 -18859 -9530 3001 14614 20855 19114 10160 -2361 -13980 -20326 -18823 -10649 1519
1367A519J1491O938q29p791j2264j1658o685PP654J1614J1832P339K65p225j1763
$$ 1519 13010 19948 19119 11328 -936 -12594 -19279 -19272 -11618 -4 11828 19167 19432 12207 444
1382D44j1387p692l32O504J1358J1590P613J023o238j1047j1807p556j419N818
$$ 444 -10943 -18635 -18967 -12463 -1105 10485 18098 19121 12883 1836 -9971 -17527 -18946 -13128
1396a3128J0872J1107Q293J732n381j0404j1468q512j764N032R921J1404Q477
$$ -13128 -2256 8851 17144 18876 13495 3091 -8377 -16889 -18653 -13621 -3700 7704 16181
1409A6181K281m674r720j0973r041k579M464R444J1467Q360L107l693r154j1574
$$ 16181 18462 13788 4068 -6905 -15946 -18525 -14061 -4617 6850 15210 18317 14624 5470 -6104
1423f104q874l109L203R100J1030Q992L761l054q376j1217r204l756K316Q420
$$ -6104 -14978 -18087 -14884 -5784 5246 14238 17999 14945 6569 -4648 -13852 -17608 -15292 -6872
1437f872J0699R251M700k656p946j0622r585m141K043P466J0281R627N083j823
$$ -6872 3827 13078 17778 15122 7176 -3446 -13031 -17172 -15129 -7663 2618 12245 17328 15505
1451A5505p395j0432r275n076J067O978J0209R699N177o84o707r910r587n810
$$ 15505 8110 -2322 -11597 -16673 -15606 -8628 1581 11280 16457 15773 9066 -844 -10431 -16241
1465a6241P85O062R847R596O173m01o116r532r389n804p28N634R307R554O462
$$ -16241 -15456 -9394 453 10049 16222 15821 9705 173 -9216 -15020 -15748 -10114 -807 8747 15209
1480A5209N90n337r099r707o176p41M660Q594R669O367J442m645q574r414o973
$$ 15209 15799 10462 1363 -8344 -14520 -15261 -10601 -2007 7662 14029 15471 10826 2252 -7162 -14135
1495a4135j322M272Q137R557O703K196l820q029r473p163k228L288Q260R033P419
$$ -14135 -15457 -11185 -3048 6509 13212 15408 11588 3559 -5914 -13077 -15305 -12017 -3757 5276 12695
1510A2695K455l214p306r679p318k653K843P271R451P270L101k583p252q712q010
$$ 12695 15150 11936 4630 -5049 -12367 -15020 -12177 -4906 4545 11815 14916 12333 5081 -3631 -11641
1525a1641l038K041P022Q889P700L765k077o508q760p807l963J301O479Q621Q159
$$ -11641 -14679 -12638 -5616 3273 10973 14738 12661 6153 -2607 -10414 -14377 -13076 -6597 2024 10183
1540A0183M143j534n841q537q121m439J174N727Q055Q111M732o83m968q873p753
$$ 10183 14326 12792 6951 -1586 -9707 -14146 -12972 -7245 810 8921 13653 12970 8002 -871 -8624
1555h624m864M98M877Q279Q131M835M83m881q202q294n045o77M916P675Q126N406
$$ -8624 -13488 -12990 -8113 166 8297 13132 13615 8734 532 -7762 -12807 -13484 -8568 -893 7233 12639
1571A2639R73m394p862p760o065n14L820P375P983N733J328l914o964q346n595
$$ 12639 13612 9218 1356 -6404 -12469 -12983 -9163 -1788 6195 11928 13256 9342 2378 -5968 -11563
1586a1563j651L690O582Q157N951J850k941o875p915o303k329L193O683P767O416
$$ -11563 -13214 -9524 -2942 5215 11166 13016 10075 3200 -4715 -11018 -13347 -10154 -3471 4296 10712
1601A0712K083k497o127q275n912k730K174O324P455O836K567j873o003p640o985
$$ 10712 12795 10298 4171 -4104 -10016 -12746 -10572 -4248 3207 10043 12610 10737 4734 -2906 -9891
1616i891k448J401N755P660O691L253j769n030p562o710l463J319N324P060O774
$$ -9891 -12339 -10938 -5183 2477 9168 12421 10652 5622 -1940 -8650 -12113 -10794 -5470 1590 8364
1631H364L746r52m871p551o506l912M85M784P155O668M061m8m917o502o896m376
$$ 8364 12110 11158 6287 -1264 -7770 -11682 -11197 -6413 742 7410 11471 11423 6506 4 -6892 -11268
1647a1268l36M410O945P072M353l59l292o636p087m715j95L404O513P214M442
$$ -11268 -11604 -7194 -249 6823 11176 10817 7525 889 -6198 -10913 -11108 -7704 -1191 6023 10465
1662A0465Q76l222o582o729n182q21L073O214O931M964J274l006o080o946n032
$$ 10465 11341 8119 1537 -5192 -10374 -11195 -8122 -1908 5023 9987 11261 8255 2175 -4771 -9803
1677i803j291K468O078O866M998J950k663n682o447n779j669K055N356O648N709
$$ -9803 -11094 -8626 -2548 4318 9316 11266 8603 2921 -3526 -9305 -10974 -8919 -3563 3085 8794
1692H794K070j916n329o430n437k591J773N123O491N619K680j465m936o444n854
$$ 8794 10864 8948 3619 -2811 -8248 -10839 -9066 -3943 2548 8167 10847 9382 4446 -1998 -7852
1707g852k592J209M465O338N874K987q83m421o468n876k961P00M206N965N961
$$ -7852 -10444 -9235 -4770 1568 7442 10429 9546 5125 -1343 -7219 -10180 -9480 -5274 691 6652
1722F652L465m54l944o335n660l592M47L609N962O007L532J04l698n936n783l827
$$ 6652 10117 9663 5719 -616 -6276 -9868 -9421 -5812 150 6157 9689 9793 6095 159 -5624 -9451
1738i451l41L369N307O458L606R90l217n636o417l788m67K829N249O106M429M65
$$ -9451 -9792 -6423 -1116 5342 8948 9938 6721 1085 -5332 -9120 -9587 -6758 -1509 4597 9026 9491
1754I491k394n290n925m367r98K286M904O276M003J490k150m699o134m465j533
$$ 9491 7097 1807 -4118 -8485 -9483 -7197 -2293 3983 7986 9476 7326 2627 -3507 -7972 -9505
1769i505J921M893O153M349J659j610m518n825n016j566J140M646N654M637K221
$$ -9505 -7584 -2691 3462 7811 9470 7860 3342 -2483 -7499 -9065 -7925 -3279 2375 7012 9233
1784I233j312m325n366n058k356J223M144N116N297K477p64m116n313n281k569
$$ 9233 7921 3596 -1770 -6828 -9184 -7961 -3817 1299 6596 9073 8309 4193 -1120 -6401 -8970
1799h970J122L607N152N085K639m24l509n125n125k771J28L229N282M625L542
$$ -8970 -7848 -4241 911 5996 8635 8211 4702 -423 -5548 -8319 -8191 -4962 320 4945 8487
1814H487o9l158n310n007l262k65K895N190M996L354P28k951m795m979l528r14
$$ 8487 8418 5260 -50 -5057 -8319 -8584 -5689 -499 4497 7851 8579 5628 833 -4146 -7674 -8588
1830h588K604M867N132L713Q33k508m628n117l845p42K148M339N019L956R93j881
$$ -8588 -5984 -1117 4015 7728 8561 6053 1425 -3692 -7537 -8279 -6131 -1792 3227 7183 8176 6295
1846F295m303m889l934j626K118L875N144M004J271j124m214m897l985j772J431
$$ 6295 1992 -2897 -6831 -8457 -6339 -2464 2680 6684 7955 6831 2617 -2280 -6265 -8037 -6606
1861f606L562M986M328J700j013l928m991l981k033J095L549M759M405J831q64
$$ -6606 -3044 1942 6270 7970 6957 3029 -1962 -5943 -7976 -6881 -3332 1427 5832 7663 6799
1876F799k908m909m228k372M02L442M442M337K471K33l479m764m356k428r7L122
$$ 6799 3891 -1018 -5246 -7618 -7216 -3774 668 5005 7476 7709 4230 -534 -4890 -7318 -7415 -4293
1892d293M526M561K426K20k929m246m630k830k43K939L978M401K993N10k491l943
$$ -4293 233 4794 7220 7440 4511 265 -4365 -7195 -7438 -4499 -521 3880 6873 7383 4892 949
1908I49m475l092o08K280L990M540L155M02j777m267m156l385p31J567M151M644
$$ 949 -3526 -6618 -7226 -4946 -956 3584 6739 7141 5364 1097 -3059 -6444 -7175 -5608 -1457 3187
1924C187L087R48j813l634m421l408j208J481L892M285L460J319j202l585m472
$$ 3187 6274 7222 5409 1775 -2646 -6054 -7262 -5781 -1889 2396 5856 7175 5973 2388 -2084
1939b084l669j473J429L229M342L687J655j109l488m025l742j805J202K621M263
$$ -2084 -5753 -7226 -5797 -2568 1774 5461 7116 6007 2519 -1506 -5248 -7053 -5851 -3230 1033
1954A033L973J811p40l050m003l597k534Q57K710M066M121K205l64k920m186l607
$$ 1033 5006 6817 6077 3027 -976 -4573 -7107 -6250 -3540 526 4647 6852 6488 3568 -618 -4225
1970d225k234K9K533M104L660K416J97k506l714m261k152k56K193L712M170K720
$$ -4225 -6459 -6430 -3897 207 3867 6283 6480 3974 260 -4001 -6153 -6409 -4216 -504 3666 6386
1986F386M4k032l524m316k739j15J738L776L536L246N14j786l536m309l039k26
$$ 6386 6430 4398 874 -3442 -6181 -6296 -4558 -782 2754 6000 6514 4728 1192 -3117 -6156 -6382
2002f382J580L251M054L440N21j392l683l611k976j192J362L304L917L213R91
$$ -6382 -4802 -1551 2503 5943 6464 5072 1389 -2222 -5198 -6390 -5028 -1724 2193 5406 6397
2017F397j120l204m038l146j201J147K892L965L192J262p43k775m107l441j248
$$ 6397 5277 2073 -1965 -5111 -6312 -5165 -2273 1692 4884 6146 5403 2628 -1479 -4920 -6168
2032f168P09K585L773L728J698o00l069l715l217j805L23K575L763L779J802m02
$$ -6168 -5459 -2874 899 4627 6325 5725 2656 -1059 -4276 -6081 -5758 -3183 580 4359 6161 5759
2048E759k328l735l460k062K09K282L479L582K099j16k132l523l501k341o5J913
$$ 5759 3431 -304 -3764 -5826 -5617 -3335 144 3726 5825 5709 3577 54 -3447 -5788 -5853 -3940
2064c940L695L511K259K54j984k881l969k101q50J822L576L180K765O22j838l060
$$ -3940 -245 3266 5525 5779 3795 914 -3055 -5156 -6006 -4184 -608 2572 5337 5959 4121 1061
2080A061l608k630p46J766K839L615K625P25j112l267l508k670q99J160L076L319
$$ 1061 -2547 -5177 -5923 -4157 -1318 2297 4922 5647 4535 1268 -2240 -4910 -5809 -4649 -1573 1746
2096A746K890R16o62k891l769k773j103J054K875L284K621J807j102k617l461
$$ 1746 4636 5552 4890 1999 -1770 -4543 -5646 -4592 -1717 1567 4188 5995 4893 2276 -1185
2111a185l051j391M46K722L556L088J756r19k455l402l433j364L14K588L240L146
$$ -1185 -4236 -5627 -5181 -2459 1097 4185 5941 5022 2567 -835 -4268 -5632 -5318 -2730 510 3656
2127C656J757l50j889l353l312j614j20J976L355L164J848J77j941l145l098k479
$$ 3656 5413 5063 3174 -179 -3491 -5105 -5225 -3249 106 3270 5118 5295 3354 209 -2889 -5368
2143e368N7J664L135L492K151K76j542l299l240k218m60J528K975L617K251J43
$$ -5368 -5311 -3647 -512 2980 5131 5407 3865 566 -2674 -4892 -5352 -3824 -849 2768 5019 5162
2159E162j148l089l211k408o69J289K735L408K609P39j328k811l015k771q51R24
$$ 5162 4014 925 -2286 -4694 -5363 -4074 -1339 2069 4678 5417 4089 1278 -1737 -4508 -5359 -4435
2175d435K687L086L169Q05j068k273l474k672j239J412J990L441K667Q33l38k443
$$ -4435 -1748 1338 4507 5312 4244 1971 -1503 -4175 -5414 -4002 -2012 1429 4096 4929 4591 2148
2191B148l176k698j711N93K130L636K674J809l93k497k767l167j820N17K006L212
$$ 2148 -1028 -3726 -5437 -4844 -2714 922 3596 5405 5012 2515 -252 -3419 -5239 -4722 -2716 496
2207D96K888J643m72j847k841k920j840nJ847K803L378J739J85k067k629l344
$$ 496 3384 5027 4555 2708 -133 -3053 -4893 -4898 -3051 -248 3130 4869 5054 2987 358 -2986
2223b986j884N6J734K420L194K176K78j602k751k861k143n59J251K744K971K149
$$ -2986 -4870 -4814 -3080 -660 2534 4710 4988 3386 635 -2226 -4369 -4928 -3677 -933 2038 4187
2239D187O80j238k684k859k183q51J354K414L023J966J079r36k519l151k310p09
$$ 4187 4867 3629 945 -1914 -4097 -4948 -3594 -1180 1843 3809 4888 3952 1433 -1718 -4028 -4737
2255d737P75K617K804K430J009j029k021l019k609j068O96K313K718K894J162
$$ -4737 -3962 -1345 1459 3889 4898 3869 1848 -1171 -3780 -4848 -4152 -1839 879 3773 4935
2270D935m57k475k795k520j525N17J892L069K863R91k69j916k909k359j769N11
$$ 4935 4478 2003 -792 -3312 -4837 -4320 -2428 641 3504 4495 4226 2310 -599 -2958 -4727 -4216
2286d216J719L021K402J723n20j582k368k963j725J07J522K891K581J598K16j535
$$ -4216 -2497 524 2926 4649 4129 2547 179 -2784 -4509 -4402 -2880 11 2592 4190 4406 2871
2302B871k664k704j833k86J304K705K807J890M80j418k432k869k085m33J468K304
$$ 2871 207 -2497 -4330 -4616 -3312 -607 2200 4090 4570 3152 720 -2149 -4234 -4667 -3199 -895
2318h95L103J742M98r57k733k591k044m32P67K475K841J780Q20r08k019k694k260
$$ -895 2208 3950 4448 3491 758 -1833 -3877 -4309 -3542 -1067 1774 3554 4374 3466 1447 -1247 -3507
2335c507j138P01K206K897K462Q70n08k365k738k057j339P07J969K659K316J440
$$ -3507 -4645 -3944 -1738 1159 3621 4491 3983 1618 -1120 -3177 -4516 -3809 -1840 819 3135 4575
2351D575n30k028k741j872j625L35J966K514K204J252k33j584k656k325j512K83
$$ 4575 4045 2017 -724 -2596 -4221 -3886 -1920 594 2798 4050 3817 2233 -423 -2748 -4260 -3977
2367c977J753K367K473J310lj355k413k691j596l7J402K646K440J521K74j358
$$ -3977 -2224 143 2616 3926 3923 2568 155 -2536 -4132 -4169 -2767 -121 2319 3840 4114 2756
2383B756k812k221j676k15J334K303K454J676N73j270j798k971j773p82J417K357
$$ 2756 -56 -2277 -3953 -4168 -2834 -531 1923 3599 4172 2902 1104 -1867 -3640 -4422 -3005 -648
2399f48K234K017N97j138k244k238j926o63O43K007K669J994P04m68k272k691
$$ -648 1586 3603 4200 3062 818 -1420 -3346 -4009 -3366 -1359 1310 3304 4008 3540 1268 -1423
2415a423j982n71N51J885K475K157R31n26j692k725j881j056K29J728K622K089
$$ -1423 -3405 -3976 -3425 -1540 935 3092 4023 3497 1805 -920 -2801 -3857 -3628 -1900 722 2811
2431B811J176m43j695k142k356j177K18J788K338J990J118N2j295k449k289j376
$$ 2811 3987 3544 1849 -293 -2649 -3826 -3608 -1820 518 2508 3626 3678 2383 -66 -2355 -3731
2447c731j26J633K090K604J028K50j417k037k198j530k16J201K065K044J736L55
$$ -3731 -3857 -2224 -134 2470 3498 3748 2331 294 -1904 -3434 -3650 -2449 -384 1660 3396 3751
2463C751j174j800k474j462m85Q07K373K126J554M61r51j982k153j894m89J104
$$ 3751 2577 777 -1697 -3159 -3644 -2837 -464 1662 3216 3677 2726 744 -1409 -3303 -3792 -2688
2479b688J845J940J893P14n08k264j923k128p05P98J752K335J915N39m75j832
$$ -2688 -843 1097 2990 3704 3196 932 -991 -3119 -3824 -3026 -1274 1061 2976 3515 3040 1208
2495A208k117j722m96m7J747K309J836O96j99j838k001j809r97M04J619J858J728
$$ 1208 -909 -2631 -3127 -3174 -1427 882 2718 3414 3215 1377 -624 -2433 -3430 -3026 -1407 451 2179
2512B179J401j66j528k247j925j358L67J117K375J384J526J27j383j658k048j515
$$ 2179 3580 3414 1886 -361 -2286 -3644 -3277 -2160 215 1599 3125 3252 1869 211 -1837 -3352
2528c352n1J448J939J956J539k30j062j579k094j325n94R95J817K242J460K60
$$ -3352 -3403 -1955 -16 1940 3479 3249 2187 608 -1486 -2811 -3405 -2410 -593 1649 3109 3369
2544C369j084j500k158j655j26N73J720K256J235O64p44j512j932j650p74P91
$$ 3369 2285 785 -1373 -3028 -3154 -2581 -861 1395 2630 3294 2550 1038 -894 -2544 -3318 -2527
2560b527J326K114J942J71k23j520k147j508r44N98J421K314J235O26k24j220
$$ -2527 -1201 913 2855 3026 2803 1283 -864 -2372 -3316 -2718 -1297 1017 2252 2878 2654 1434
2576A434j899j914n97J7J625J801J655R13k38j373j578j867r32j86J647J478J834
$$ 1434 -465 -2379 -2976 -2959 -1334 467 2122 3035 2797 1424 -154 -2021 -2953 -3139 -1492 -14 1820
2593A820R26K96j105j869j827j020n2J013J659J679J260K20r12j930j488j309
$$ 1820 2746 3042 1937 68 -1759 -2779 -2831 -1818 -159 1520 2780 3000 2088 158 -1330 -2639
2609b639j23O27J818J555J189L65n96j634j723j289k91N19J728J729J472N5n30
$$ -2639 -2762 -2135 -317 1238 2427 2792 2196 562 -1161 -2450 -2741 -2222 -494 1235 2707 2762 2232
2626B232j513j629j354p42Q71J254J600J556N17l98j326j754j447q28N74J241
$$ 2232 719 -910 -2264 -3006 -2135 -881 719 2275 2792 2394 1068 -686 -2133 -2961 -2387 -1146
2642a146J771J420P86n21j280j249j814n38L30Q28J807J250J073k76j084j533
$$ -1146 625 2045 2831 2310 1030 -219 -2033 -2571 -2241 -1413 394 1644 2717 2441 1357 -176
2658a76j438p58J20O08J850R40J514l16p15j507j700o13l05O86J597J548J096
$$ -176 -1614 -2372 -2252 -1644 206 1146 2660 2344 1629 122 -1578 -2191 -2496 -1810 -213 1335 2431
2675B431p7p71j319j602q56l28N32J598J424J050L01n83j405j146j289n00N82
$$ 2431 2354 1583 264 -1338 -2194 -2522 -1990 -392 1032 2082 2383 1800 395 -751 -2040 -2540 -1958
2692a958J287J553J431J07n53q55j524j317o09L55J235J379J244N94k18j397j207
$$ -1958 -671 882 2313 2420 1867 1012 -512 -1829 -2438 -2083 -848 531 1775 2369 2151 754 -453
2709d53j113p28K81Q13J629J122N58j03p98j288j242j076N69M54J496J239J049
$$ -453 -1566 -2294 -2013 -1200 429 1551 2109 2006 1208 -80 -1322 -2398 -1829 -1375 121 1360 2409
2726B409j28q60j143j892n41R6P63J332J159Q96K90p80j346j175r31k36N89J372
$$ 2409 2281 1421 278 -1614 -2155 -2059 -1296 36 1195 2091 2381 1601 255 -920 -1851 -2087 -1498 -126
2744a26J013Q24K82n24j088j498r05q6M04J113J221J289J64l32j272r15j420l61
$$ -126 887 1711 1993 1469 381 -1117 -2022 -2108 -1704 -591 630 1919 2083 1751 479 -436 -1856 -2217
2762b217N12J150J268J019P45o50j229q71j233l42R9R73J085J476J99k11j019
$$ -2217 -1705 -555 713 1732 2477 1827 598 -273 -1506 -1848 -1749 -776 309 1785 1984 1773 754
2779G54j082j112m43J13R03J129J174P88p21p17j049j025m13l10Q42R23J591N83
$$ 754 -328 -1440 -1883 -1770 -867 262 1436 2224 1503 786 -263 -1288 -1701 -2011 -1169 -246 1345 1928
2797A928L7m45j499j150m65m89O42J144J129R62J05o83j067q30o03o27M17J195
$$ 1928 1965 1520 21 -1129 -1594 -2083 -1441 -297 832 1794 1899 1216 149 -681 -1284 -1911 -1494 -299
2815b99J101Q72K83o88r61j129n99n14N04Q25J185J060P7j62r84j156n36n79J96
$$ -299 802 1674 1957 1269 308 -821 -1420 -1934 -1430 -605 580 1640 1717 1555 571 -585 -1121 -1700 -1504
2834a504Q66J090J000N37r1j115j107o83p66J00Q05Q62J138N56j24p30p63j081
$$ -1504 -638 452 1452 1989 1898 783 -324 -1007 -1773 -1673 -868 -6 1132 1688 1564 834 71 -1010
2852a010p41N9P51J047P24J112k09p42p47j034q44J48L40Q19J144N21J99l85j092
$$ -1010 -1751 -1692 -941 106 830 1942 1733 991 244 -790 -1634 -1486 -1146 -327 817 1338 1537 1152 60
2871F0o69q70k6L25J238O00N30K06n49p22q22l24p31L93Q64Q25R27K69m36l11
$$ 60 -609 -1479 -1505 -1180 58 658 1188 1394 845 123 -699 -1023 -1754 -1361 -497 328 1255 1524 1088 777
2891G77j068q22l35J42N08J037P71O17j89r64o21j113m48L81N18Q17J156K32K78
$$ 777 -291 -1113 -1448 -1306 -798 239 1010 1627 1438 474 -147 -1260 -1708 -1327 -809 8 1164 1396 1674
2910A674q43p72j260k99k73Q28R44Q28N16jk69j252m26n22p76O96J178P44P44
$$ 1674 831 59 -1201 -1500 -1773 -945 -1 827 1343 1342 1073 -179 -605 -1127 -1903 -1207 -29 715 1459
2929A459O1l90j029p31q59jM19R25O42Q12J75k76q27o71r52k82L67N78J038O14
$$ 1459 1520 1130 101 -630 -1489 -1490 -1071 -146 496 1308 1483 1207 380 -291 -1243 -1525 -1158 -580 458 1072
2949A072L62j76p86p36j091Rk7Q22O94Q73M56l23o02o86p50o57L98L78P71R01
$$ 1072 1434 1258 472 -264 -1355 -1346 -1373 -551 143 1016 1472 1149 547 -139 -889 -1546 -1148 -770 1 902
2969I02N97l84k06q93p88r53N20M41N82R27N65J70J5j498o63n07n33N49Q99J137
$$ 902 1499 1115 909 16 -772 -1725 -1205 -764 -182 745 1310 1480 1495 -3 -666 -1173 -1706 -1157 -258 879
2989H79N82j87k1j067n79q15l05K32R48J003M08J01j11q35o91p11m62N43N60P86
$$ 879 1461 1274 1253 186 -393 -1208 -1513 -1281 -333 670 1078 1179 1068 233 -458 -1169 -1631 -1088 -528 258
3009B58Q92K24j28p70r52n65o07O93K38P81P52O83j97l58r62r07k76j82O93Q94
$$ 258 1150 1374 1246 476 -476 -1041 -1648 -955 -717 64 816 1499 1302 944 -18 -925 -1201 -1383 -690 204
3029B04P01O28L6o31r67p37m13j56N11N50J225J89J02k05q69r69o59P1K59R39
$$ 204 905 1533 1569 938 -29 -766 -1179 -1335 -824 -274 951 1140 1242 1037 168 -801 -1460 -1389 -1130 -191
3049a91R16P06j03k39r85n62o49l32L45P82J134M23k6O8r16p75q59m4J64O68P40
$$ -191 725 1431 1328 1089 104 -458 -1107 -1439 -1094 -312 822 1245 1219 1287 371 -404 -1263 -1307 -1143 -475 265
3070B65O84N25l08p44p80n46m78j25P07Q24R35M86j12o40q64o43r80L19J078L74
$$ 265 949 1474 1166 422 -358 -904 -1382 -1507 -800 24 959 1445 1333 693 -171 -814 -1794 -1475 -397 -23
3090b3J389m5m3l39q42q68q94K32M72Q27R70O44j45l29r27q05p26K66J65Q98P08
$$ -23 1366 1321 1278 939 97 -771 -1665 -1433 -961 -134 836 1480 1335 1006 79 -726 -1452 -1186 -1021 -123 585
3111E85P09m5l30p18r48p32J29L25M01J067P06N42p46m57r82p67l31N70L68Q31
$$ 585 1294 1249 919 201 -747 -1479 -1350 -1025 -624 443 1149 1691 945 488 -494 -1261 -1592 -1022 -654 177
3131A77Q33N83n26n78o78r40j73J67O51R21O05M21j52n30q88r10m61J03O96R44
$$ 177 1010 1593 1067 489 -189 -1129 -1302 -1135 -484 437 1042 1463 1311 781 -107 -1017 -1478 -1375 -679 265
3151B65P87K92L7o86j81j551l15l42R61M88J118N29Rn62m98j161q24P6P20O62
$$ 265 1052 1344 1381 695 514 -1037 -1352 -1694 -733 -245 873 1402 1411 849 351 -810 -1634 -1558 -838 -176
3171a76R47N03K60j68r51j192n38m3J69P46J095Q04j62j51o86j136p46l36N53
$$ -176 771 1274 1534 1366 415 -777 -1315 -1358 -1189 -443 652 1456 1294 1143 457 -679 -1425 -1761 -1208
3190a208P24J121O35K12q2r14r55p20j23o4J043R83O34M35j83o71j238o89l03
$$ -1208 -484 637 1272 1484 1402 488 -467 -1187 -1310 -1374 -331 652 1286 1721 1538 867 -371 -1060 -1363
3209a363k05R47N86J392P2R6q79p61p12m85j3O37P87J011M63o6n87r09r16m39
$$ -1363 -1568 -621 -35 1357 1429 1525 646 -115 -827 -1312 -1325 -688 99 1110 1573 1507 920 11 -905 -1344
3229a344k15N56Q97J162P86m7q67p39q77q27qP28O19Q28J197l45l41j068p77r36
$$ -1344 -1559 -1003 -106 1056 1842 1795 928 189 -688 -1515 -1523 -795 -176 652 1849 1504 1163 95 -682 -1618
3249a618J5L55O63J126R04L1k54r71p73p58k34J79P10J046P82K87j57o80j318
$$ -1618 -1603 -1248 -585 541 1445 1476 1222 251 -522 -1280 -1514 -1335 -625 421 1203 1490 1333 653 -665
3268f65o89m65M51O59J324L46N29R8q00j147q60m02Q3Q18R89P54Q67m57m34r19
$$ -665 -1354 -1819 -1368 -709 615 961 1490 1588 788 -359 -1219 -1621 -1538 -720 269 1023 1890 1433 999 80
3288H0j318k37k32Q24O48J295N22r9k01j130j233n87q6P46R83R44O86l4l91q41
$$ 80 -1238 -1475 -1707 -883 -235 1060 1582 1483 1282 152 -1081 -1668 -1754 -1008 -25 919 1605 1571 1180 339
3308C39j236o59j5K92J130P68P75K31o53m38j341p57k79M76R95J099O60N83o30
$$ 339 -897 -1556 -1571 -1279 -149 619 1394 1625 972 534 -807 -1564 -1843 -1367 -372 727 1387 1970 1340
3327A340p50j095j174j99K92J155J103P15N14m20r61p43j197l20M16N88R64R50
$$ 1340 590 -505 -1679 -1878 -1586 -431 672 1387 1901 1481 520 -223 -1420 -1740 -1324 -736 228 1178
3345A178L86k4o91j142p80p10L9P33J227R78N67pr96q54j051o28K69O31J086J001
$$ 1178 1564 1540 849 -293 -1073 -1783 -1744 -1011 216 1194 1761 1754 758 -96 -1147 -1775 -1506 -875 211 1212
3365A212L26P4m97j220j184n10O9O23R39J289P07r2k30j258j054j059J03N78J007
$$ 1212 1538 1612 1115 -105 -1289 -1799 -1730 -1107 -168 1121 1828 1736 1506 248 -806 -1865 -1762 -1184 -177
3384a77J155Q35m4j54j240j294m73n34L44J330Q04J175K87p31p70r73j172j63
$$ -177 978 1813 1769 1615 375 -919 -1392 -1926 -1582 -252 552 1727 2014 1283 513 -460 -1632 -1795
3402a795L95J004J154N23O98j26j225j225j049k59J12J116J149R15N44k48j142
$$ -1795 -1400 -396 758 1281 1979 1853 628 -597 -1646 -1905 -1793 -677 472 1387 1931 1683 541
3419E41m25j737l70L30J058N96J348K98k4m44j208j029j061M55O12J253P84J022
$$ 541 116 -1621 -1991 -1661 -603 -7 1341 1639 1615 1171 -37 -1066 -2127 -1672 -1060 193 977 1999
3437A999l86o68q02j163p25j42P37J119J241O47kn75j124j022j002j5M42J344
$$ 1999 1613 945 143 -1020 -1745 -1887 -1150 -31 1210 1857 1855 1280 156 -866 -1868 -1883 -1441 -97
3455i7R79N46M72n88r72r68j152j65N96J070J077Q08K64l67j228p60j336k13L50
$$ -97 882 1428 1900 1312 340 -628 -1780 -1945 -1349 -279 798 1606 1870 1503 275 -485 -1821 -2034 -1684
3474a684J293J050R47M06j69j284j248q61p4k8P04J523Q43P28n84q39j087q85
$$ -1684 -391 659 1606 2012 1843 559 -689 -1550 -1624 -1652 -948 575 1418 2146 1562 723 -364 -1249
3492a249r51M28P40J474J050N47j76o77j383j349m39P7J129Q70J133P65O1q53
$$ -1249 -2200 -1772 -1032 442 1492 2039 1863 1186 -197 -1546 -1985 -1908 -779 91 1224 1989 2050 1197
3510A197j365j132m59k79R14J026J023R19%n28j222j246m87m50R75Q73J000J121
$$ 1197 -168 -1300 -1759 -2038 -1124 -98 925 1844 1844 1316 94 -1152 -1639 -2089 -1114 -241 759 1880
3528A880k5m06j019j235j267J00Q65O62J396O08J84j49j232j128p16o34O51P97
$$ 1880 1855 1449 430 -805 -2072 -1972 -1107 -445 951 1559 1743 1594 362 -766 -1482 -2116 -1465 -668
3546f68J457P02O98m83j153j335q98l16K21J057J436Q06M92k69j008j212r18n92
$$ -668 789 1491 2189 1706 553 -782 -1680 -1996 -1775 -718 718 1524 2016 1747 739 -473 -1391 -1983
3564a983K99R31R51J184N88k17q75j383q53q72L90P87J320J244O81j85r93j017
$$ -1983 -1684 -753 198 1382 1970 1753 878 -505 -1358 -2230 -1840 -1053 267 1511 2192 2007 1014 -3
3582cj348p79J2J060J284J215N66J74j100j521j127k87m5O60J107R63R67N4o33
$$ -3 -1351 -2130 -2118 -1058 226 1441 2007 2181 1081 -440 -1567 -1854 -1899 -1239 -132 831 1798 1852 1219
3601A219j172r33j000M2L91J475J021J079M8o31j435q76r58l78J77J262J598P66
$$ 1219 47 -886 -1886 -1844 -1453 22 1043 2122 2170 1539 104 -772 -1730 -2108 -1931 -669 929 1695
3619A695L00j63j242j532q05l46Q85L15J700R97L35k71j300j275r90n66N46Q02
$$ 1695 1995 1832 590 -942 -1747 -2093 -1208 -893 807 1804 2139 1868 568 -707 -1697 -2263 -1717 -915
3637i15J363J371K32k07j086j043j290o64M10P79J146J288N82l60m20j314j564
$$ -915 448 1819 2051 1844 758 -285 -1575 -2239 -1829 -1050 96 1384 1966 1606 1186 -128 -1692
3654a692l02P5N58J636J240P20k05p44j554j025p31j84R65Q70J787N65J75n58
$$ -1692 -1994 -1919 -1361 275 1515 2235 2030 1286 -268 -1293 -2024 -2208 -1243 -373 1414 1979 2154 1596
3672A596j614j215q52O5O05J184J415P92J15p73j264j311n55j1J68J418R86J081
$$ 1596 -18 -1233 -2085 -2020 -1415 -231 1184 1976 2091 1318 54 -1257 -1812 -1823 -1655 -237 749 1830
3690A830P8m09j272p24j341l53P50R78J240J111L08o72q69j097j718o6N31Q88
$$ 1830 1908 1499 227 -497 -1838 -2191 -1441 -463 777 1888 2196 1524 655 -442 -2160 -2226 -1695 -807
3708h07J350J124J59k00j048r37j325l47J67J047J253J022N06k42q64j298j122
$$ -807 543 1667 1826 1626 578 -359 -1684 -2031 -1864 -817 436 1458 1964 1722 858 -440 -1562
3725a562o44K34R86J225J414K37k75o96j195r76n58KQ30J482O84Q20j59p89j097
$$ -1562 -2206 -1972 -986 239 1653 1890 1615 919 -276 -1252 -1810 -1808 -978 504 1188 2008 1849 1060 -37
3744c7j433o74J65O55J769P41R20j94o14j156j365p72j35P75J030J377Q59%o07
$$ -37 -1470 -2144 -1979 -1324 445 1186 2106 1912 1298 142 -1223 -1995 -2130 -1355 -325 1052 1911 1911 1304
3763A304j031j586m88j07L49J226J203J139K08q30j088j276r51R6J94J218J334
$$ 1304 273 -1313 -1801 -1908 -1559 -333 870 2009 2217 1387 299 -977 -1928 -1832 -1638 -420 914
3780I14Q39M21o52j030j330q27n59M21J031J351J290K29j04j387j248p63o30K91
$$ 914 1753 2174 1522 492 -838 -1665 -2224 -1803 -772 579 1869 2098 1994 607 -641 -1404 -2034 -1743
3798a743Q83J448Q44N59k92r38j181j251o97M09R77J344Q54P33k15o84j033j450
$$ -1743 -860 588 1432 1991 1699 761 -420 -1671 -2368 -1959 -982 362 1216 1949 1734 1050 17 -1433
3816a433o03J73P89J137J190O61K32q52j233j534k62k36P18J223J098R22k27n39
$$ -1433 -2036 -1863 -1074 63 1253 1914 2146 1294 61 -1473 -1735 -1971 -1253 -30 1068 1990 1763 1224
3834A224j315r35j007N3Q69P90J631Q20j88n81r06j242r67k63N79J111J073Q45
$$ 1224 -91 -1026 -2033 -1980 -1111 -321 1310 2130 1942 1361 455 -787 -1754 -2017 -1438 -327 746 1591
3852A591J45k36q92j360j139JP28O82J292N83M51l25j228q79r46p11N31J126J271
$$ 1591 1736 1500 608 -752 -1891 -1890 -1162 -480 812 1395 1846 1521 293 -586 -1532 -2243 -1712 -586 685
3871F85Q02O08l48r82j604n11p38L20J185J188Q97N31k53p94j392j135o62N10
$$ 685 1487 2095 1747 765 -839 -1350 -2088 -1768 -583 605 1502 2033 1780 986 -406 -1541 -2203 -1693
3889a693Q05J182J092O12Q9j187j167j230o61M64N71J380J046P29p5q83j001j294
$$ -1693 -888 294 1386 1998 2087 900 -267 -1497 -2158 -1694 -1123 257 1303 2032 1957 1074 73 -1221
3907a221n37k46R03J151R65R49L3p97j458p08p73r5P82R51J265O20J94o76j066
$$ -1221 -1758 -2004 -1101 50 1015 1964 1997 1200 -258 -966 -1739 -1834 -1052 -101 1164 1784 1978 1302 236
3926B36j143j027J24M38J272Q21J142k3l53j389r82r57l3O15P25J532M94O19p29
$$ 236 -907 -1934 -1810 -1372 -100 721 1863 1840 1487 98 -884 -1841 -1874 -1259 -534 998 1492 2111 1382
3945A382q43j187r44k77kJ540J100P33N42p45o68j279j163L3K58Q17J215J110
$$ 1382 539 -648 -1592 -1869 -1871 -331 769 1502 2044 1299 631 -648 -1811 -1778 -1520 -703 512 1622
3963A622M08m11p54j310r91n97L26J215J070R95L18l3r62j217j062p10L67P63
$$ 1622 2030 1619 865 -445 -1436 -2033 -1707 -492 578 1573 1891 1858 896 -321 -1383 -2093 -1726 -963
3981i63J387J361L19k27q55j421j321j25K78M21J445R83N05j5o05j440p24j001
$$ -963 424 1785 2104 1877 1022 -399 -1720 -1845 -1567 -1146 299 1282 1787 1772 1167 -273 -997 -1998
3999a998K47Q47Q28J099O11M50j075r34j367o12j37J006J021Q44J101n2m24j361
$$ -1998 -1751 -904 -76 1023 1634 2084 1009 75 -1292 -1904 -2041 -1035 -14 830 1931 1879 1455 94
4017I4j159o90l77P24J257J134N06K98n32p40j427p01j46K70J070J292O68L03
$$ 94 -1065 -1755 -2132 -1408 -151 983 1489 1787 1255 515 -912 -1613 -1759 -1489 -419 873 1541 1844
4035A844m34r55j154r86j34M52Q28J268P60O93m54j230j338p11n31M24J076J080
$$ 1844 1410 455 -699 -1685 -1819 -1367 -539 729 1489 2182 1728 498 -840 -1551 -2082 -1658 -582 498
4053D98R36N07o0r30j423r49n18K90P57J272R93K84J46j121j001j035o16K49P32
$$ 498 1434 1941 1881 951 -472 -1421 -1939 -1649 -892 380 1373 1657 1803 682 -319 -1354 -1970 -1721 -989
4072i89J181J059N78k6o48j535n92q08N2Q14J160R06O12k7p56j154o90j156K99
$$ -989 192 1251 1829 1803 1155 -380 -972 -1780 -1728 -914 246 1152 1764 1737 981 -173 -863 -2019 -1720
4091a720K95J418Q72J039J92p78j165j222j147K09R98N86J503P71p4m53j150j092
$$ -1720 -1425 -7 865 1904 2096 1318 153 -1069 -2216 -2007 -1009 -423 1080 1851 1777 1324 174 -918
4109i18p41l47P24R45J097R24q9l39q84r50j067k99N29Q73J227J093j13m98p30
$$ -918 -1659 -2006 -1282 -337 760 1684 1595 1256 372 -578 -1645 -1944 -1415 -542 685 1778 1665 1167 437
4128D37j334p24k63L65J003J085P01M22K2j218j237o48m29L01O41J288J118L85
$$ 437 -897 -1621 -1884 -1519 -516 569 1270 1692 1714 496 -741 -1389 -1818 -1517 -876 412 1530 1915
4146A915k31j047r32j024l18k16O94J412J221L68p4o66j401p72q22K14R33R42
$$ 1915 1684 637 -295 -1319 -1637 -1853 -1159 253 1474 1842 1768 1102 -299 -1071 -1893 -1679 -746 196
4164A96J576n4K9p90r68j327l52J76N47R94J281L48L31r46j242p79p08j22P83
$$ 196 1772 1718 1747 957 -11 -1338 -1690 -1514 -967 27 1308 1656 1987 1041 -201 -980 -1688 -1810 -1027
4183a027P80J263Q81Q8p17j281j213m39k0N03J332P04Q46K48p44r12j203o23m0
$$ -1027 -247 1016 1897 1985 1268 -13 -1226 -1665 -1685 -1182 150 854 1700 1948 1204 292 -911 -1534 -1574
4202a574M02J024J125N20O7n61o04j165q39n9L36P94J253R50M20o46j116j035
$$ -1574 -1172 -148 977 1497 1564 1003 399 -766 -1605 -1664 -1328 -534 719 1669 2089 1443 327 -708
4220g08n79n01L16J029Q37J017O70p28p79j260m50n76J21P75J253Q79Q13n14q09
$$ -708 -1287 -1788 -1472 -443 394 1411 2081 1353 574 -686 -1136 -1712 -1591 -816 437 1316 2129 1615 806
4239H06j076j001o08j1J058J241Q74N99l4r70j193q39o56J33Q84J118P40M45L85
$$ 806 -270 -1271 -1879 -1890 -832 409 1283 1882 1848 878 -315 -1154 -1810 -1677 -793 325 1065 1510 1895
4258A895p09j476q02p56L65N01J004R01O56J40o67j068q17p97Q1O70P48J213O75
$$ 1895 1186 -290 -1092 -1848 -1483 -982 22 923 1579 1719 1052 -16 -833 -1630 -1549 -879 -131 1082 1757
4277A757J08o99j169q75p46M4M39R89J038J081r6o79q67j207q08rN09J091R66
$$ 1757 1865 1166 -3 -878 -1624 -1580 -1141 -152 886 1967 1871 1192 325 -882 -1690 -1699 -1190 -99 867
$$ [...]
8191D11
##END NTUPLES=NMR FID
##END=
