##TITLE=1H_DE-80HK
 200.13MHz, D2O,
 8 sc
 
 10.2.2025
##JCAMPDX= 6.0         $$ Bruker NMR JCAMP-DX V2.0
##DATA TYPE= NMR FID
##DATA CLASS= NTUPLES
##ORIGIN= UXNMR, Bruker Analytische Messtechnik GmbH
##OWNER= pz
$$ XWIN-NMR		Version 3.5
$$ Mon Feb 10 14:04:51 2025 Russian Standard Time (UT+4h)  she@DPX200
##.OBSERVE FREQUENCY= 200.1313
##.OBSERVE NUCLEUS= ^1H
##.DELAY= (6, 6)
##.ACQUISITION MODE= SIMULTANEOUS
##.ACQUISITION SCHEME= undefined
##.AVERAGES= 8
##.DIGITISER RES= 18
##SPECTROMETER/DATA SYSTEM= spect
##.PULSE SEQUENCE= zg30
##.SOLVENT NAME= CDCl3
##.SHIFT REFERENCE= (INTERNAL, CDCl3, 0, 14.3821)
##AUDIT TRAIL= $$ (NUMBER, WHEN, WHO, WHERE, WHAT)
$$ ##TITLE= Audit trail, XWIN-NMR		Version 3.5
$$ ##JCAMPDX= 5.01
$$ ##ORIGIN= Bruker BioSpin GmbH
$$ ##OWNER= she
$$ F:/spectra/data/she/nmr/H-C/1/audita.txt
$$ ##AUDIT TRAIL=  $$ (NUMBER, WHEN, WHO, WHERE, WHAT)
(   1,<2025-02-10 14:03:46.18 +0400>,<she>,<DPX200>,
      <created by zg, POWCHK disabled, PULCHK disabled
       configuration hash MD5:
       00 E9 B6 7A A2 85 ED C7 34 08 36 98 17 FE 4E 26
       data hash MD5: 16K
       2F 50 63 4E 75 8D B5 61 99 64 2B FB B3 CC 3A 06>)
$$ ##END=
$$ 
$$ hash MD5
$$ 22 58 10 EC 78 0F 97 52 57 7A 5F A2 C2 51 99 A4
##$RELAX= 
##$RELAX= 
##$RELAX= 
##$RELAX= 
##$RELAX= 
##$RELAX= 
$$ Bruker specific parameters
$$ --------------------------
##$DU= <F:/spectra>
##$EXPNO= 1
##$NAME= <H-C>
##$PROCNO= 1
##$TYPE= <nmr>
##$USER= <she>
##$AMP= (0..31)
100 100 100 100 100 100 100 100 100 100 100 100 100 100 100 100 100 100 
100 100 100 100 100 100 100 100 100 100 100 100 100 100 
##$AQSEQ= 0
##$AQ_mod= 1
##$AUNM= <au_zg>
##$AUTOPOS= <>
##$BF1= 200.13
##$BF2= 200.13
##$BF3= 200.13
##$BF4= 200.13
##$BF5= 200.13
##$BF6= 200.13
##$BF7= 200.13
##$BF8= 200.13
##$BYTORDA= 1
##$CFDGTYP= 0
##$CFRGTYP= 5
##$CHEMSTR= <none>
##$CNST= (0..31)
1 1 145 1 1 1 1 1 1 1 1 1 1 1 1 1 1 1 1 1 1 1 1 1 1 1 1 1 1 1 1 1 
##$CPDPRG= <>
##$CPDPRG1= <>
##$CPDPRG2= <>
##$CPDPRG3= <>
##$CPDPRG4= <mlev>
##$CPDPRG5= <mlev>
##$CPDPRG6= <mlev>
##$CPDPRG7= <mlev>
##$CPDPRG8= <mlev>
##$CPDPRGB= <>
##$CPDPRGT= <>
##$D= (0..31)
0 0.7 0 0 0 0 0 0 0 0 0 0.03 0 0 0 0 0 0 0 0 0 0 0 0 0 0 0 0 0 0 0 0 
##$DATE= 1739181825
##$DBL= (0..7)
120 120 120 120 120 120 120 120 
##$DBP= (0..7)
150 150 150 150 150 150 150 150 
##$DBP07= 0
##$DBPNAM0= <>
##$DBPNAM1= <>
##$DBPNAM2= <>
##$DBPNAM3= <>
##$DBPNAM4= <>
##$DBPNAM5= <>
##$DBPNAM6= <>
##$DBPNAM7= <>
##$DBPOAL= (0..7)
0.5 0.5 0.5 0.5 0.5 0.5 0.5 0.5 
##$DBPOFFS= (0..7)
0 0 0 0 0 0 0 0 
##$DE= 6
##$DECBNUC= <off>
##$DECIM= 32
##$DECNUC= <off>
##$DECSTAT= 4
##$DIGMOD= 1
##$DIGTYP= 9
##$DL= (0..7)
0 120 120 120 120 120 120 120 
##$DP= (0..7)
150 150 150 150 150 150 150 150 
##$DP07= 0
##$DPNAME0= <>
##$DPNAME1= <>
##$DPNAME2= <>
##$DPNAME3= <>
##$DPNAME4= <>
##$DPNAME5= <>
##$DPNAME6= <>
##$DPNAME7= <>
##$DPOAL= (0..7)
0.5 0.5 0.5 0.5 0.5 0.5 0.5 0.5 
##$DPOFFS= (0..7)
0 0 0 0 0 0 0 0 
##$DQDMODE= 0
##$DR= 18
##$DS= 0
##$DSLIST= <SSSSSSSSSSSSSSS>
$$ [...]
##$SUBNAM0= <"">
##$SUBNAM1= <"">
##$SUBNAM2= <"">
##$SUBNAM3= <"">
##$SUBNAM4= <"">
##$SUBNAM5= <"">
##$SUBNAM6= <"">
##$SUBNAM7= <"">
##$SUBNAM8= <"">
##$SUBNAM9= <"">
##$SW= 18.0517328524113
##$SWIBOX= (0..15)
0 0 2 0 0 0 0 0 0 0 0 0 0 0 0 0 
##$SW_h= 3612.71676300578
##$TD= 16384
##$TD0= 1
##$TE= 0
##$TE2= 300
##$TE3= 300
##$TEG= 300
##$TL= (0..7)
0 120 120 120 120 120 120 120 
##$TP= (0..7)
150 150 150 150 150 150 150 150 
##$TP07= 0
##$TPNAME0= <>
##$TPNAME1= <>
##$TPNAME2= <>
##$TPNAME3= <>
##$TPNAME4= <>
##$TPNAME5= <>
##$TPNAME6= <>
##$TPNAME7= <>
##$TPOAL= (0..7)
0.5 0.5 0.5 0.5 0.5 0.5 0.5 0.5 
##$TPOFFS= (0..7)
0 0 0 0 0 0 0 0 
##$TUNHIN= 0
##$TUNHOUT= 0
##$TUNXOUT= 0
##$USERA1= <user>
##$USERA2= <user>
##$USERA3= <user>
##$USERA4= <user>
##$USERA5= <user>
##$V9= 5
##$VALIST= <valist>
##$VCLIST= <CCCCCCCCCCCCCCC>
##$VD= 0
##$VDLIST= <DDDDDDDDDDDDDDD>
##$VPLIST= <PPPPPPPPPPPPPPP>
##$VTLIST= <TTTTTTTTTTTTTTT>
##$WBST= 1024
##$WBSW= 4
##$XGAIN= (0..3)
0 0 0 0 
##$XL= 0
##$YL= 0
##$YMAX_a= 617689
##$YMIN_a= -696360
##$ZGOPTNS= <>
##$ZL1= 120
##$ZL2= 120
##$ZL3= 120
##$ZL4= 120
##$ABSF1= 10
##$ABSF2= 0
##$ABSG= 5
##$ABSL= 3
##$ALPHA= 0
##$AQORDER= 0
##$ASSFAC= 0
##$ASSFACI= 0
##$ASSFACX= 0
##$ASSWID= 0
##$AUNMP= <proc_1d>
##$AZFE= 0.1
##$AZFW= 0.1
##$BCFW= 1
##$BC_mod= 2
##$BYTORDP= 1
##$COROFFS= 0
##$CY= -3
##$DATMOD= 1
##$DC= 2
##$DFILT= <>
##$DTYPP= 0
##$F1P= 0
##$F2P= 0
##$FCOR= 0.5
##$FTSIZE= 0
##$FT_mod= 4
##$GAMMA= 1
##$GB= 0.15
##$INTBC= 1
##$INTSCL= 1
##$ISEN= 128
##$LB= 0.25
##$LEV0= 0
##$LPBIN= 0
##$MAXI= 10000
##$MC2= 0
##$MEAN= 0
##$ME_mod= 0
##$MI= 1.114404
##$NCOEF= 0
##$NC_proc= 0
##$NLEV= 6
##$NOISF1= 3.799351
##$NOISF2= 2.8
##$NSP= 1
##$NTH_PI= 0
##$NZP= 0
##$OFFSET= 14.38212
##$PC= 1
##$PHC0= -469.7299
##$PHC1= 9.592205
##$PH_mod= 1
##$PKNL= yes
##$PPARMOD= 0
##$PSCAL= 0
##$PSIGN= 0
##$REVERSE= no
##$SF= 200.129724274929
##$SI= 16384
##$SIGF1= 3
##$SIGF2= 2
##$SINO= 400
##$SIOLD= 16384
##$SREGLST= <1H.CDCl3>
##$SSB= 0
##$STSI= 0
##$STSR= 0
##$SW_p= 3205.1282051282
##$SYMM= 0
##$S_DEV= 0
##$TDeff= 0
##$TDoff= 0
##$TI= <>
##$TILT= no
##$TM1= 0
##$TM2= 0
##$TOPLEV= 0
##$USERP1= <user>
##$USERP2= <user>
##$USERP3= <user>
##$USERP4= <user>
##$USERP5= <user>
##$WDW= 1
##$XDIM= 8192
##$YMAX_p= 0
##$YMIN_p= 0
$$ End of Bruker specific parameters
$$ ---------------------------------
##NTUPLES= NMR FID
##VAR_NAME=  TIME,          FID/REAL,        FID/IMAG
##SYMBOL=    X,             R,               I
##VAR_TYPE=  INDEPENDENT,   DEPENDENT,       DEPENDENT
##VAR_FORM=  AFFN,          ASDF,            ASDF
##VAR_DIM=   8192,          8192,            8192
##UNITS=     SECONDS,       ARBITRARY UNITS, ARBITRARY UNITS
##FACTOR=    0.0002768,     1,               1
##FIRST=     0,             0,               0
##LAST=      2.2672688,     0,               0
##MIN=       0,             -696360,         0
##MAX=       2.2672688,     617689,          0
$$ Real data points
##PAGE= N=1
##DATA TABLE= (X++(R..R)), XYDATA
0@%%%%%%%%%%%%%qJ2j2J6j6K4l2L2l7M5n3O1p0Q1r1J06j23J39j59J79k04K31k58
36a37K91l25L63m05M52n02N53o12O77p49Q28r10J004j107J219j345J480j634J807
55I48k002K226k480K778l130L556m085M752n632O849q651J1598j7242L1969j46886
70a25432m61462j09466J24156K93762L72265L53160J65552n7338k62891l62442
80g0136l27989j63224L9370K43589L42437K89795J42509j2476j90405l24518l08071
91c39119j47968M0244J99310K81060K54783J39371j0532j67420k66151k49525
101b65947j36311J4466J60787K38936K17360J28665O683j32380k25400k19975
111b13116j33140k526J36649K15043J93702J09955N118j07686j87335j89075j19892
$$ y = [0, 0, 0, 0, 0, 0, 0, 0, 0, 0, 0, 0, 0, 0, -8, 4, -8, 8, -8, 16, -16, 16, -21, 24, -29, 32, -38, 43, -48, 58, -65, 74, -85, 94, -110, 121, -137, 154, -171, 192, -213, 239, -263, 290, -322, 355, -394, 434, -476, 528, -579, 640, -705, 775, -859, 948, -1054, 1172, -1308, 1470, -1660, 1896, -2189, 2563, -3069, 3780, -4871, 6727, -10515, 21454, -125432, -586894, -696360, -572204, -278442, 93823, 446983, 612535, 555197, 292306, -70136, -398125, -561349, -521979, -278390, 64047, 353842, 496351, 483875, 293470, -31048, -339119, -487087, -446843, -247533, 33527, 288310, 427681, 417149, 249729, -16422, -265947, -402258, -387792, -227005, 11931, 229291, 357956, 364639, 232259, 6859, -213116, -346256, -348782, -212133, 2910, 196612, 306567, 311685, 203999, 16664, -172411, -292303]
122b92303o012J10048J74375J65635J09244J6992r1623j61992j62325j08859j7343
133b64163Q7448J53888J50144R6487J4843p2891j32147j41890j01606j9941P2047
144a57781J27747J29528R0114K0644n9706j13260j23049r0403k3286N4954J07585
155c6913J17200Q3299J9674m8884r5387j06760q1685k4370M3774R0711J01751
166F2410P5536K2208l8273q1171r3502p3874k4617L4006P6380Q9484O8858K2316
178A39761l0448o8691q1648o5820k4416K6056O3877P8331O2256K2819k3437n8362
190D0278p1947n8632k3596J9298N4391O7880N5941K2754j7572m9685o2610n2383
202g5883k3244J4296M5647N9466N0302K1771j2822m1878n4495m6720k2492J0523
$$ y = [-292303, -298315, -188267, -13892, 151743, 260987, 277979, 186356, 24364, -137961, -246820, -264163, -176715, -22827, 127317, 223804, 238647, 165756, 33609, -108281, -209887, -229828, -157781, -30034, 99494, 189608, 210252, 150546, 37286, -85763, -176166, -199452, -144498, -36913, 80287, 163586, 183260, 134376, 38989, -67771, -149456, -173826, -130052, -39341, 62410, 137946, 160154, 121881, 40710, -52792, -126666, -151283, -117277, -40897, 48587, 117445, 139761, 109313, 40622, -41026, -106846, -131262, -105206, -41329, 37002, 99258, 122077, 98640, 40278, -31669, -90301, -113897, -94599, -40208, 27672, 83613, 106367, 88795, 39110, -23500, -75883, -99127, -84831, -39184, 20282, 70584, 92355, 79533, 37655, -16840, -63560, -86052, -75529]
214g5529L8055N1555M4793K1687r461l4964m7535m1721k1055O594L1631M4575
226H625M0383K0524n837k9333m1240l7314j9968M316K6379L8361L5403J9503l021
239E6781k4905l5223l3188j8922K057K1912L3632L1166J8464j496k0034l0631
251c87l0042j7665J186J7819K8338K7759J7131K96j6470k6248k6058j6256j293
264d1890J4647K4391K5041J5687J271j3005k2402k3334j5440k346J2247K0750
276d383K2215J4096K448j0539j8974k0117j4483k589R200J7879J8952J3463K913
289C0081q304j5821j8033j2925l571P422J5096J7144J1809L251o435j3411j5374
302i071j2250l481N491J2573J5014J1060L738m871j1703j3531j0554l993M063
$$ y = [-75529, -37474, 14081, 58874, 80561, 71100, 36136, -11399, -53120, -74175, -67581, -35950, 8625, 49008, 69532, 63695, 34362, -6878, -44192, -64160, -59844, -33465, 4896, 40299, 59802, 56781, 31876, -3347, -36535, -55457, -53400, -31488, 2144, 33310, 51774, 50278, 30244, -387, -30429, -48094, -46908, -29089, -751, 27008, 44139, 44435, 27965, 1717, -24341, -40597, -41890, -27243, -2852, 22189, 37876, 39147, 26142, 3740, -19594, -35034, -37380, -25133, -4383, 17832, 31928, 34376, 23837, 4863, -15254, -29737, -32326, -23126, -5247, 13705, 27168, 30081, 21777, 5956, -12077, -25002, -28573, -21151, -6055, 11089, 22898, 26149, 19714, 6303, -9071, -21321, -24802, -19311, -6738, 8276, 19336, 23074, 18203, 6500, -7031, -17585, -21578, -17515]
315a7515J0768J2948J0319L619l845r791j1319r731m263K949R176J1197Q807M326
329A7645k984p994j0451q563l522J790P384R718Q121L968j898p050q687p433l967
344a3923J363O165Q286P340L907j473n775p552o846l742J336M847P205O730L499
359A1367r52m820o659n571l635N36M107O202O096L423p95m018n765n440l086K71
375h739L569M969N507L129q1l364m880m772l039k3K822M597M673K883r1k865m193
392A02m039k536l76K252L961M220K750K03k074m125l845k086l01J793L591L225
408B715K581M53j729l351l275k199n43J607K712L393J980O78j537k408l144k087
424d154n32J365K205L031J768N02o91k780k579j577n08J028J940J885K155N76
$$ y = [-17515, -6747, 6201, 16520, 20139, 16294, 6503, -4816, -14547, -18810, -15861, -6685, 4512, 13319, 17645, 14661, 6667, -3784, -12347, -15869, -14079, -6695, 3023, 11144, 15112, 13214, 6164, -2523, -9956, -13923, -12560, -6395, 1891, 9231, 13138, 11665, 5890, -1662, -8508, -12250, -10914, -6067, 1138, 7868, 11367, 10415, 5595, -1064, -6635, -10270, -9734, -5627, 575, 6671, 10094, 9299, 5281, -484, -5924, -9010, -8739, -5170, -201, 5306, 8435, 8354, 4990, 110, -4662, -7701, -7724, -4902, -305, 4368, 7251, 7160, 4295, 102, -3937, -6473, -6849, -4597, -636, 3584, 6334, 6537, 4463, 338, -3507, -5593, -5894, -4101, -510, 2715, 5296, 5749, 4020, 669, -2606, -4805, -5348, -3741, -1029, 2364, 4344, 5022, 3485, 1077, -2067, -4154, -4686, -3321, -1116, 1915, 3683, 4185, 3494, 714, -1865, -3442, -3950, -2922, -982, 903, 3058, 3634]
440C634j288j239k562j162o47N22J656K459J173P20r31j435j713j702m27O37J651
457f54J399J332N37l27j245j768j126r04O62J175J307J504L59l48j243j488q80
474a708l64K70Q56J404J099K92o5j157r85r03q33L93Q94J280N96L20p5n93q87
493a66r35l28J33M66R00P74N40m45k88m94j302j41RN66Q30N66P39k91j74r77q82
514i00k70N6N34N84M16N02R1k78o56m16o92k2L95O46O25J40P4k64o05p06K35l03
536h14J49O62N94K62j56J1o07m62m88L83k62O13L77M39N2m73k53j50o23m7L48
557d45K15J94N30k07Q5l7n36m45qL55L26J85J56J76k82k3j97m54l9K02L27j8K77
580C37L6L2l99k27p1j6J24J90JL00Q0k39j65J87l21R3j73J39J90j86N6K85j27
$$ y = [3634, 2346, 1107, -1455, -2617, -3264, -2742, -1086, 1373, 2546, 3266, 2335, 900, -813, -2515, -2942, -2305, -654, 745, 2077, 2614, 2287, 1042, -726, -1852, -2756, -2094, -919, 388, 1892, 2251, 1903, 660, -828, -1708, -2072, -1802, -946, 458, 1557, 1849, 1784, 627, -358, -1261, -2094, -1701, -807, 473, 1069, 1389, 1314, 721, -166, -1101, -1429, -1296, -830, 70, 844, 1384, 939, 651, 157, -1145, -1286, -1277, -711, 119, 685, 1424, 1133, 959, -18, -900, -1170, -1114, -580, 4, 420, 922, 1013, 735, 79, -337, -1029, -1051, -656, -10, 615, 755, 829, 565, -40, -746, -511, -814, -665, -3, 591, 853, 697, 708, 101, -361, -849, -466, -728, -115, 262, 701, 753, 280, 27, -123, -746, -793, -445, -230, -36, 494, 287, 372, 335, -201, -646, -654, -299, 27, 212, 368, 544, 262, 239, 42, -412, -451, -249, 78, 60, 337, 373, 405, 6, -221, -292, -308, -184, 6, 7, 307, 387, 148, -17, 170, -151, -58, -231, -92, 98, -88, -32, 253, 126]
603A26l03j95J50lK84j48N0O8K94k70K46m65j52K04r1J72J61N9nl0j46N0m25M10
627D1j73J31K61J52j05k88L2k53j38J26J04K53j42K38J1n3n9k10J01m48R9J93
649a27J86J59m02J11j17P1M9J2K6M3l1j6J66j6p9j9k66J55j9Q9k1K15R6n5J66
674C76p2m62P5mJJ38J41j40J4k62R4l1K33o4j02mK68j97j2M02n69J64k09K41k97
699b78L86Lj01J78l2j6q6J90l45N8J76j70k1M36k97j27L26l70j7m8K89l08J08
722f6K06lk78J43k5k7j90L07m69M54o5J48J47l66K44k32l7R8J01r4K9Q0k3R5k59
747h2r7PJ06j12KK4K35J89j37p9M3q3o4k31M12jP9pj11J16k22oJ53k06j01J45
773b8k1N4J92Ok66O7j50j03qJ99j4J09J97m56K37j9p8m6K58k14O7k9L88l62r4
$$ y = [126, -177, -372, -222, -225, 59, -89, -39, 29, 323, 53, 299, -166, -318, -114, -205, -33, 128, 187, 182, 152, 6, 56, -369, 41, -132, -1, 260, 412, 307, 19, 51, -202, -340, -214, -110, 143, 1, 239, 250, 197, 138, -72, 29, -419, -320, -127, 59, 218, -184, -73, -190, -119, -70, -58, -32, 11, -20, -36, 130, 114, 35, 16, -250, -95, -114, -25, -46, 169, 265, 210, 376, 304, -158, -83, -87, -86, 52, 193, 53, 67, -195, -101, -132, 101, 37, -65, -69, 199, 2, -10, 392, -177, -13, -222, 19, -278, 108, 111, 10, 188, 156, 140, 54, 244, -101, -43, 133, -37, -58, 378, 81, -46, 280, -90, -107, -155, 134, -174, -66, 140, 137, -141, 2, -23, -50, -240, 67, -402, 52, -13, 135, 282, -84, 160, -72, -109, -11, 90, -4, 25, 105, 82, 177, -82, -179, -172, -66, -178, -176, -152, 83, 272, 135, 56, 99, 16, -48, -279, 133, 132, 211, 204, 93, 209, -13, -19, 134, -72, -173, -28, -49, 5, 197, 203, -63, 4, -146, -249, -257, -58, -72, 37, 234, -222, 15, -4, -82, -128, 130, -84, -17, -46, 342, -20, -114]
798a14L7J27o3l8k29L10L0n2K84m09K2J38k27N4J72j45J99k07l5L13j67j9j30
821a49J18J5J48l03R1L58j73k61K81j67k1q6J36j56J46K12q8q7j12Q6l12P1L04
844E1L5j20j73J35J09j97K19P3l99J22J06M4K74l51J06j86L6J36k65Q2R2J36k5
867D0J74Q9k67j36j7j12K19R1O4m1O2n2j82J71n2Rl34N5O32k18p9l24J60j4l34
892c96M50j10J94k66PK42j61k29K35Q5j79J16J36m7J53k34O4J19j32PJ29k75N0
915d2j0K75m9mj8k56j4J00J10p3l7j9k1J27J68m00L27j91Q5J19m56K46j92K93
939F8j30K48j86j06j2k5J70k67K67J1j53N3K3q7k17J73L79l0j06j07O7n5k6N2
963Dj42L71j33j98M3J69K2q4r5J34k65O7K3M0L4J07P6l2j54L1n0O8l52N36k22
$$ y = [-114, -77, 50, -13, -51, -280, 30, 60, 8, 292, -117, -95, 43, -184, -130, 42, -103, 96, -111, -146, 167, 0, -19, -149, -31, -16, 132, -171, -80, 278, 105, -156, 125, -42, -63, -149, -13, -169, -23, 189, 101, 14, -98, -12, -324, -253, 51, 86, -34, -207, -72, 37, -160, 59, 132, -267, -145, -39, 5, 279, -72, 34, -152, -116, 20, -245, -163, -71, 65, 40, 214, 303, 36, -100, -117, -229, -10, 81, 145, 104, 166, 114, -68, 103, 51, 60, -274, -219, 413, 195, 116, -208, -48, -62, -396, 54, -56, 138, -128, -121, 121, -40, -269, -34, 51, -128, -12, 124, 77, 230, -4, 60, 179, 47, 54, 183, -92, -42, -52, 223, 174, 170, 152, -104, -118, -18, 92, 19, -18, -37, -58, 69, 237, -163, 164, -27, 58, 177, -279, -33, -225, 68, -62, 186, 0, -106, -118, -143, 27, -240, 27, 38, -115, -62, -39, -126, -343, -170, 209, 179, 73, -34, 33, -22, -48, 4, -138, 233, 100, -98, -55, 114, 136, 52, -43, 91, -174, -107, -84, -44, -10, 97, 173, 141, -13, 18, -32, 36, -316, 220, -2]
988bk3QJ09j38j07J52l0K05l51M06k48r2j13L46l9k02M4m1K54k93K77l65J49j44
1012b38M41k5j70J02k42L63j96J21j53K27m58K41J79l12K8M7R5k10p6L9K69j9
1034E3k5j98L56j33M9j82J03j74J53N7oJ28m58J19L10k36M07m38O7N1k3j65K32
1057D7J32m13L67L2k28J80j42K26m38L24K6R8R1j68N7j21j34J82k78J92j27L26
1079B31j29r8J24R2m62K42J20j01Q4p6K07l48L6l2K39j18K0k11J39L55m17J29
1101B6k63K29J13l77K37k12L07o1J64m37M46o4J5l4j28N9J51k90P6L84l73Q5k12
1124a59K01L7j0l13J13L90k94J99o3j9N1j38k3J23m60L73q5n2R0J93l1n8J1Q7
1148A63p2k12j44J99lO2J42j50k51L01J24K4M4k48J17J58l63P9RL82m78j07N06
$$ y = [-2, -25, -17, 92, -46, -153, -1, -31, 174, -177, 229, -19, -111, -224, 122, 83, -119, -75, -116, 138, -155, 122, -243, -94, -238, 203, 178, 8, 110, -132, 231, 35, 156, 3, 230, -228, 13, 192, -120, -92, -45, 50, -160, -236, -197, 72, 53, 28, -170, 186, 53, 102, -80, 23, -151, 2, 59, 53, 181, -277, -158, 152, -84, 323, -115, -48, 3, -20, -185, 47, 179, -234, 133, 165, -63, 117, -25, 201, -237, 87, 113, 211, 302, 134, 191, 70, -64, 118, -160, 32, -95, 231, 102, 4, 128, 220, -242, 0, 120, 19, 103, 27, 234, -114, -78, -110, 129, 11, 31, -180, -41, 314, -103, 26, -237, -8, 105, -272, -35, -247, 60, -1, 163, -274, 172, 108, 123, 89, -39, 20, 171, -119, -43, 341, -32, 53, -159, 42, 79, 69, -244, -131, 259, -35, 164, 101, 82, 133, -5, -28, 95, -365, 8, -77, -129, -39, 154, 123, 65, 76, 163, 91, -121, -265, -66, -69, -7, 135, -15, -266, 35, 159, 183, 227, -21, 96, 254, -109, -30, -21, 361, -117, -224, 282]
1171B82m24L2r9L8J1nR5Q6N1lNj23l8O3P7k2k13K59m12L55J89j83k01O7p7K76
1197H6J97j7j15k44L0j96L38K8Q5j01j08P9j7j6J87k94J88j9J52l09J33l72L35
1220C0K21o18M36j5j86P3q8J87J00k5n2m6j44j21L77%J60l20J99k40L3m6J62o8
1244IR0k50J23K34l75M76m39L52k90M6M0j06Nk5K0L03k10Q0L0m06J67J55J71k23
1268b3R9q4Q2r6k87Q6L21LJ01j36m6L18n40K80Jj22K25Mj48j6K82r6j61J14j92
1293c1M2J17o1N6j93k30M25j5j29k31J73p8l7K68j26o2J08O8k89L68q8j46K93
1316B02j85J02k69k9K57k77L25j64J13N0j10J06l2j41J09J55m27qJ96j45M20j72
1338G6n5o8n2J60r5j34M50j17r5L1j42J65j99p2L07k33rK70k37Q7j08lJ12L0j8
$$ y = [282, -142, -110, -209, -171, -160, -165, -70, 16, 67, 64, 69, -54, -92, -29, 48, 26, -187, 72, -340, 15, 204, 21, -180, -113, -190, 86, 283, 266, 151, -93, -63, -259, 79, 107, 192, 91, -17, 62, 45, 29, 216, -78, 110, 91, 243, -66, 67, -305, 30, 251, -367, 69, 54, -132, -59, -147, 40, 140, 115, 63, 17, -127, -248, 129, 129, 289, -31, 168, -72, -39, -85, 77, 9, 99, -151, -28, 206, -169, 307, -132, 220, -70, -24, 16, -90, -85, -110, -90, 213, 3, 83, 113, -293, -126, 29, 200, -23, 76, -8, 74, -22, -309, -223, 98, 101, 202, 66, 20, 338, -202, 78, 79, -43, 182, 186, 38, 22, 304, 208, 47, 161, -31, 11, 128, 67, 123, -70, -300, 125, 110, -19, -250, -77, -155, -192, 76, -50, -112, -4, 64, -225, 143, 55, -91, 202, 17, 119, -150, -179, 78, -199, 126, -38, 75, 125, 15, 121, 89, -52, 57, 212, -215, -223, -27, -172, 248, 76, 21, -47, -99, 61, -34, -168, 282, 165, 70, 101, -41, 124, -75, -147, 160, -73, -82, 188, -49, 38, -70, -73, 39, 69, 51]
1363E1J63k44L27j99j62o4n3K89j4j96J1K8P4Q2J1k99P6J3K35m07M17J81q2k31
1387Gk60j25N48j6j53j47R0J10k02q3R9M27m69K95jj91R0j2J00j21Q0k19K2J17
1411a4%J44m0j16Q0J82k57J98j88Q4l60K82Oj70K01O5o9k28J44J01K47k02j38
1434d8J60m1K68n20J19P1K4M8l7J0j41o4J45K88j67q0l26K71K12l8o6k11j13J99
1458c7K5K4J69o6q6J37j52l6l1j49qJ24n8K75J9j23j30J88J58l66J46m2j13J99
1482F7l51L52K0m5L1N2J0k20O5M7J04l24K21L3j79L10j46l3J7J08p0k2o6j89K42
1507C4r4R9j47R5k2J11O2k14l1K18k51j19k2K41N9K72o5m0k54K5j68L48k22J71
1531H6m1J0k0rp6J30j29r5K01k0k33K1K77J95j57k53K94j05K19j08m64L95pj84
$$ y = [51, 214, -30, 297, 98, -64, -128, -181, 108, 94, -102, -91, -63, 11, 93, 104, -195, -119, -106, 129, -278, 139, 320, 238, 7, -253, -378, 170, 154, 1, -146, -56, 54, -148, -231, -132, 295, -174, 121, 120, -71, 19, 7, 107, -14, 66, -153, -131, -14, -14, 130, 90, -26, 54, 236, -21, 177, -11, 73, -287, -5, 1, -169, 32, 97, 28, -200, -56, 45, 292, 90, -48, 112, 71, 339, -181, -62, 9, 33, 81, 44, 54, -87, -151, -6, 282, 115, 35, -291, -20, 192, 154, 88, -123, -236, -37, -12, 12, 181, 115, 29, 166, 14, -22, -53, -202, -210, -86, -144, 131, 150, 27, -103, 85, 243, -123, 23, -19, -132, 67, -284, 68, 88, 43, 74, 126, 136, -84, -19, 28, 132, -192, 29, 62, -117, 193, 47, 14, 31, 139, 69, 47, -19, -208, 34, -60, 39, -108, -13, -35, 76, 138, -76, -107, 111, -140, -259, -281, -40, 19, 291, 226, 186, -68, -43, -211, 137, -85, 86, 45, 55, 35, 26, -50, 80, -49, -144, 57, 37, -196, -175, 102, 297, 140, -113, 181, 76, 295, 187, -277, 118, 111, -73]
1555g3M9m1j72J92K00L1j33k6k08P0L4L01j13j50j0J05j16K62j13J18L1j97j53
1578a12K16j79J93K19m1k19k2J6K1j37L4j07l0L77m13L01m7R9q7j62L46m9k50
1601c3j40n2M06j59j44J17J89j27j73L03l08L49K7j66j71k08M95k2o8j44MK12
1623A87j26m56L69j86Q8L33k28o3j03J58%K6j00o0M18k12M3o9k92L66J14q5j78
1646e6Q4m3k44M81k41k4Q2Kj82J44j3L8K56j72r3N2m6j68O6K31k06M6r8J75K9
1671A00M0k95M9p7K43k28q6L26k0o1R6k57l0J12K17k39K49m65M17k74q3P9N8k00
1695c29M35l31L88j82k80M18k69J08J78O0K6N2o7l35l0K38k29M33l47K55m23j35
1717c66j01L95O4J36K16k76j01K50j63o0Lj4nj26J52j49j88M07k32M14j04j55
$$ y = [-73, -24, -65, -237, -45, 155, 186, 53, 27, -181, -111, -77, 224, 111, -39, -49, 56, -60, 202, 89, 207, 238, 41, -112, 104, -75, 118, 337, 296, 77, 55, 71, 92, -45, -11, -118, -148, 229, -184, 117, 70, 169, 82, -80, 266, 217, -33, -173, -225, 181, 22, -122, -5, 184, 57, -116, 187, -121, 228, 255, 89, -82, -290, 205, 183, 115, -29, -25, 187, 61, -395, -26, -212, -124, 209, -19, -82, -185, -27, -27, -1, -101, -161, 257, 45, 88, 19, -273, 93, 207, 122, -56, 28, -15, -259, 222, -19, -43, 39, 41, -141, 3, -10, 28, 284, 112, 19, 71, 25, -143, -77, 154, -52, -6, -104, 71, 100, 140, -155, -106, -183, 60, -168, -254, 72, 52, -9, 87, -170, -200, -88, 129, -110, 139, -326, 91, -183, -266, -187, -129, -329, 106, -225, 163, -19, -299, 119, -150, -42, 136, 196, 222, 274, 207, -128, -158, 80, -149, 284, -63, 192, -231, -366, -467, -72, -8, 128, 344, 68, -33, 217, 54, -6, -3, -17, -22, -148, 4, -145, -333, 74, -158, 256, 152, -3]
1739cn6k38L41N1O0J6k67l6K89q2J36%j84j32KK81l39mR0M4l1K46rk80N0J24j56
1766h7J50j14j55J64J84l5j53J30k34L49j99J99k19l34L42r9J68j7q7M7oQ4O9
1789A47k96m3J20K08l43K56j24RJ53o8K40k98M4K84l82J33K40k41J53j86l5R8
1811F9L8j75k17R5OM12l5k45L42q2k46p7k8K18q0J77l77q2M73l06K11K4j20K12
1835B07k14q7J9K18J14k63K3p0K58k54M48l02o0j45K33k51K6J10k59M10l54K49
1857E6l52K10K74j14j61q0M53k56J33k98K4K75n1j92p1J96Ok5k00J97r4J03O8
1880A01j7n8J34l98K58r9Q6M7Rp3j22J33j68n4J76o4J35P7K6m5j22K16j36K06
1904B48l83JK31L0J3k10M31k47l41K18K11L0l12K14k98n5J26l9J39o0K05N6j15
$$ y = [-3, -59, -297, 44, 95, 155, 171, -96, -132, 157, 75, 211, 211, 27, -105, -103, 178, -161, -165, -75, -31, -62, 184, 175, -105, -55, 69, -87, 63, -51, -206, -42, 142, 107, -46, 84, -150, 199, 0, 199, -20, -354, -12, -111, 57, 40, -47, 0, -6, 78, 147, -149, -192, -72, 136, -207, 49, -75, -66, 87, 19, 259, -39, 5, 289, -93, 40, 280, 39, 192, 6, -29, 69, 107, -68, -285, -190, -184, 228, 193, -52, 290, 208, -38, -115, -143, 75, -5, 172, -205, -287, 186, -120, 91, 115, -5, 207, -7, -94, -75, 143, 257, -6, 17, -53, 205, -49, 399, 97, 37, -108, 125, -126, -100, 10, -249, 161, -193, 56, -296, -86, 188, 74, -87, -167, 286, 30, 163, -135, -111, 164, 113, -79, -150, 46, 52, 27, -173, 24, -70, 33, 101, 84, 26, 160, -238, 20, -79, 7, 54, 63, -10, -132, 1, -167, -221, -45, -109, 26, 103, 129, 84, -38, 178, 42, 248, -135, -134, 97, 127, 140, -70, 361, 114, -227, -9, 202, 232, -80, 134, -164, -219, -93, -132, 7, -53, 152, 208, 93]
1927I3N8k1j20k4o8K17J01o28K95O2r2L6j01M41k91J09J4p0p6K0O3L23k91p5J0
1952a5K5J2Lj85K75j91J20r5L00l68J20K51l43J60j26k1M44n15L11k10k00J16
1974a32L3K35j39l04L28q0PO8J56k20j20K37N5k51K2J13j07M5j60L42n3j59J26
1997D2J61K1k26J36p5k07L9K05j49J5J28k54K53l2Q1j27J4j75L78l73J42K7l68
2020c44N37k41pK1P1J16n1l27o8K32q6j7L93m51K37o0J26O5q4J5J00K2k16k2j64
2045b03K06k8p6J52Nk54K62l7k2J80l08r8P5J46P6k01K83l25M3L43m25K97m5j88
2069a42j08K20L27m34O6N49m57l0J13j37N1K38j78L2j62P8J33j44j4K03j06%q9
2092Ij18j01J06K52R3j89m4R7k8n3R4J8n2r4j26K74l21J24j97K34p5j27K15Mo2
$$ y = [93, 151, 130, 10, -14, -82, 135, 236, -392, -97, -35, -127, -91, -192, 249, -42, 67, 81, 11, -65, -45, 18, 341, 50, -25, -15, 10, 22, 25, -160, 115, -76, 44, -51, 249, -119, 1, 252, -91, 69, -57, -78, 366, -149, 162, -48, -248, -132, -99, 136, -3, -307, 21, -59, -52, 16, 172, -48, -168, 69, 124, -127, -105, 8, -99, -54, -214, 128, 75, -84, 42, 203, 224, -2, 134, 59, -148, -109, 96, -53, -38, 90, -164, 89, 57, 138, 11, 25, -150, 228, -145, -3, 24, -344, 193, -48, -55, -34, 37, 153, 102, -225, -293, -61, -147, -164, 229, -222, 15, -45, 81, 146, 62, 77, 177, 199, -17, -39, -203, 3, -25, -101, 51, 56, -198, 64, 27, 5, 185, -123, -221, -146, 0, 76, -125, 158, -167, -124, 219, -206, 91, 46, -142, -250, -30, 297, -137, -71, 478, 21, -9, 104, -33, 18, 256, 78, 110, -52, 26, 159, 15, 1, 204, 98, 98, 9, -109, -210, -104, 148, 241, 52, 8, 105, 77, 24, 118, 136, 84, -10, -136, 138, -183, -59, -256, -22, -97, -224, -9, -5, -67]
2117f7J15m59L69K4L03l29l6J42K4j57J80oK0J18n21K06K81k43l6j26J9Q8q9L26
2141A46l3k07J78p9J79n1k6Q7j88j92Q7J86j99Q5k8q3J11J14k00J36j82O3L28
2164B32k59l3on5J93l1j46Q6r2J52j14K39k33K25j7r5J47k11l08K00J05k20M25
2187A84o0M1K6R2l21P6K47l56p8LJ76j62K8J42J1k9J06q5JL4LJ89k73n7PK41j44
2214D2n5r8M9OK1k13N67R2m41M8j18L4n7r5K4J13p1R2j21m5L18j11M9j51N2J91
2240A22L4K80m09j42J06N0M4k36K4j35L24J45n33M83o0k37P2K21k46L16j23j14
2262a4N9n0k6K0J2L9j24l1J06J46Rm22M22J34m16L38k74J30k6pk17K39o7J74M0
2287A94q0k37Ok8K32m41L66J02n1R6n0l58J53J94j15R3n8j85L22l4K3k91M21o60
$$ y = [-67, 48, -411, -42, -18, 285, -44, -80, 62, 86, -71, 109, 103, 123, 241, -280, -74, 207, -36, -72, -198, -179, -91, -180, 146, 113, -94, 84, 5, 184, 133, 107, 194, 6, -186, -99, 87, -112, -27, -55, -138, -27, 87, -113, 23, -159, -96, 232, -27, -60, -66, -121, 72, 41, -105, -19, -111, 41, -73, 166, -67, 158, 141, 46, 193, -18, -326, -126, -21, -241, 184, 124, 165, 191, 283, -38, 38, 285, -71, -149, -146, 30, -132, -104, 38, 49, 20, 126, 41, 42, 76, 79, 268, -5, -62, -55, 186, 42, -13, -111, -62, -56, -35, -248, 319, 411, -30, 18, -100, -66, -123, -218, -194, -81, -152, -60, -181, -226, 92, -19, 30, -121, -69, 122, 156, 436, 27, -115, -9, 41, 85, -151, -127, -262, 62, 207, -326, 157, 97, -140, -68, 153, -93, 223, 100, -14, 45, -5, -31, -11, 1, 40, -84, -115, -9, 137, 146, -276, 146, 280, -136, 202, -72, 58, 32, 25, -192, 47, -20, 154, 194, 114, -123, -117, -145, 87, -354, 12, 114, 63, 159, 109, -249, -96, 98, -17, 76, 18, -167, 155, 121, 144, -147, 274, -386]
2311c86K79j08L50j91K4N2l77K30lL92k84j48J88n6j26j65M87n1M7k49J20k8K02
2334A99lj27J54k82J0K2j33K68q0j3j45J01j1K48k4k33J29j31l6kO7J10l4J47
2358B01J8k42l6R2j84L09k34R4P0L08m6k81p5o7PK27l42K38N5p9M5j70J18J5m
2383C7k8P2k59K06O6m2j47J89K5k63J1J18j51J71Q9l23N20k27J18K7j83o1k07
2406b42J10L8J82R4r3l6o1p2p1J45P0k62M8J17K15k05K7J02k22K89l50L45O3l77
2430a46J02O8%P7r7j32J27m4J76J63l55q7p1J82j34N07l0j77l19k0K25j67L49
2453A97L1k97J64%k97M16l69K37j43k24K50Q2k20K84k93O77m17K51l98k35J93
2474a11l2L30j58L9j45J02P7m14K76jm7O6J11lj75N4j53L86mk35J77q1m5l2J73
$$ y = [-386, -107, -215, 135, -56, -32, 20, -357, -127, -130, 262, -22, -170, 18, -38, -164, -329, 158, 107, 154, -95, 25, -3, 199, 196, 69, 223, -59, -49, -27, -160, 108, 28, 15, -130, -29, -40, 208, 184, -49, 80, -51, -87, -89, -22, 88, 54, 201, 219, -23, -59, 33, -151, 158, -76, 18, 88, 396, 350, 69, -6, -73, -66, 161, -181, 57, 112, 33, 78, -92, 26, 41, 37, 9, 81, -178, 28, 94, 52, -95, 94, 119, -144, -133, -15, -166, 5, 94, -229, 291, 64, 182, 209, 26, -35, -242, -132, -94, 88, 182, 89, 53, -8, -80, -151, -6, 64, -198, -150, -33, 182, -23, 4, 106, -116, 173, -177, 168, 231, -146, -44, 24, 24, 101, 4, -128, -1, -45, 131, 294, -61, -148, -219, -37, -171, 336, 306, 129, -190, -210, 15, -152, 197, 228, -69, 95, 95, -202, 214, -155, 82, -61, -285, -35, 47, -173, 111, -182, 495, 78, 329, -69, -304, -111, -143, 187, 29, 68, -77, 25, 102, -312, -36, -37, -84, -18, 93, 90, -85, -31, -184, 202, 198, -37, 140, 59, 14, -18, 155]
2499A55l7k95K00P0P2k89kK69j26j31J4K04m84M90j37Rl4K68j69q3K15o3k20L16
2523B12r2k59K68k85N05l67j11J45j09m9p2L82k6m60l0L42J53l20L92J02k13j47
2545c9N7j37J17j3J8J01k5m8p1P5k01R3J61j86J20j62J72K66m77Q9K47j01k58
2568b02M31m94L61j95L4j96K94j27R5l9L4p1M4J43j26J48j96jJ98j46J39k56J09
2591a9k0k08K78L1j06j4M67m78L12k64Q5M03l80k9J08k5j71j82K92j38J57j36
2613c7KQ8j92L93k80J81k10R1lk5l2L45l6q7l96J19J17k12O9M40l36nJ02j7k02
2638a23J79O9k11L17k54p1K2O6j6K9n6Q0Qo5j08K02j84J28j88Q6k5J46Q1L9ll66
2664b18J33q3K54j13J00j69O9J11m6J36j81Jp0j29K20q7J29l0k9P7k07K70l92
$$ y = [155, 118, -177, 23, 93, 165, -124, -126, 143, 17, -114, -100, 104, -380, 110, -27, -18, -52, 216, 47, -36, 179, 116, -104, 212, 120, -139, 129, -156, 349, -18, -129, 16, -93, -142, -214, 168, 142, -318, -348, -6, 147, -173, 219, 321, 108, -39, 18, -119, -2, -15, 3, 104, 79, 31, -40, 35, -166, -73, 88, -98, 22, -140, 32, 298, -179, -90, 157, 56, -202, 229, -265, 96, -99, -65, -261, 33, -94, 1, -38, -4, -75, -31, 112, -14, 134, -62, -63, 135, -11, 128, -128, -19, -39, -247, 31, 62, -44, -58, 409, -69, 243, -21, 64, 467, 87, 58, 166, 141, -30, -212, 80, -58, 99, -37, -35, 53, -139, 254, -26, 155, -55, 36, 33, 8, -24, 321, 285, 198, -198, -79, 38, -174, -105, 335, -1, -6, 96, 79, -123, 56, 125, -86, 231, -23, -94, -72, -6, -22, 7, -49, 31, 39, -26, -134, 68, -116, 12, -176, -90, -115, 31, 112, 151, 148, -218, -85, -168, 86, -27, 73, -96, -27, 84, 38, 174, -7, -6, -76, -205, 15, -72, 57, 27, -2, 75, -132, 138, -254]
2687b54N7J45K34j73L4k44L06J17k56O1j7J42m08K98m1N4Q1k25O1j7p4L0J37J5
2711F3j47O6M5n6j94M41k13k21L55j01K15m44J75j10K95R4k21J51l54J18J36l87
2733b94J33L15k31K30j71n6j21L38l17J3m6L53j52l07J31J6%K78M3o1j42Q5j24
2756h7J71r8J8q1K15l03L06n8j64K56r5J91k10m4k05N7mj4L3M01j82N9j23On0
2781ek8k07K21j76M15l87O5J96j47M75m05j1n5j79L2K39L5r1jP3k45K48j22p4
2805a34J89J21M4m09R8R1J23p1j3k1j91Q0N9j3N6j81N21l91p1J36K94k35j50N9
2829iM0j05KJ79m9j62K92r0j10J02qm7j58M2K0o0J75n1J78j43j19K1J80P7m7k95
2855a45K56j65P7j95k9m0M8J97J40l04J40Q8k5j01lJ3m7k14R3J65k4N7j83L28
$$ y = [-254, -197, -52, 182, 9, 43, -201, 105, 222, -34, 27, 10, 152, -256, 42, 1, 55, 136, -89, -28, -45, -119, -89, 48, 63, -84, -18, 27, -29, -223, 218, 5, -216, 139, 38, 253, -191, -16, -126, 169, 263, 42, 193, -161, -43, 93, -294, -161, 154, -77, 153, -18, -74, -195, 143, -174, -161, -207, 146, -6, -313, -182, -166, -166, 112, 155, 94, -48, 37, -87, 84, -14, 4, -77, 138, -165, 141, 83, -81, 175, 80, 271, 61, 17, -188, -131, -135, -149, -116, 285, 103, 162, 39, 45, -5, -33, -240, -19, -195, 220, -167, -102, 94, -53, 422, 17, 6, -49, -228, -196, 43, 78, -13, -14, 59, -186, 62, -60, -134, 55, 176, 220, -189, -91, 0, 123, 52, 39, 18, -173, -93, -34, -47, 9, -172, 349, -42, -113, 23, 317, 82, -68, -9, 31, -74, -72, 107, 58, -104, 188, 98, -12, 90, 82, 35, -123, -81, -61, -121, 54, 3, 181, 38, -81, -60, 120, 197, 150, -145, 111, -54, 23, -172, -201, -241, -193, 4, 144, -160, -20, 68, 43, -58, -61, -48, -95, -309, -216, -51, -75, -18, -201, 127]
2879A27J5R0k79N8N1m4Q8r2j1J28n54J75J77J49j08K4J17k57O1P1O6Q9l87L14
2903F8J15J2j80k84K58j45J43j10P8J5K81j08k99J12m7j14M02k49J7j07l4J97
2925B1J46k66J63j24o0J79J10pk45n1M7L5P9J95p4o8l49M96k75J29j62R9k07K7
2949a62J63R6m0k36K66L6m50J47L41L0k96j36M32l8k3j88n1r9M98j37K28j82m97
2972b98N16j81L5k67J65k8J05j1j47Q5n2p6J78k51J10L85j42j01j76L2K88q8J89
2995B70m35J79P8j49j4j9o6J51M8J3R5r1o0J91k32K23j5m78L67Nj14K2J17Q3J1
3020A80k25J84j52P2p6p1R3k01R2R6O6j42J60Jj19j5p5q7L72k47P1J42k40m03
3044e24L36p5K72R2l61L06R5j03J49p1j80J71j98n5RO4j85O09l23j16K56j32l70
$$ y = [127, 142, 232, -47, 11, 62, 18, 106, 14, 3, 131, -423, -248, -71, 78, -30, -6, 111, -146, -85, -14, 52, 141, -246, 68, 183, 195, 15, -269, -11, -156, -13, -123, -45, -30, 251, 143, -156, -44, -91, -205, 197, -52, -35, -142, -176, 21, 167, -99, 64, -60, -120, 59, 169, 162, -83, -134, -87, -52, 27, 222, 148, 80, -269, 227, -48, 81, -81, 18, -189, -162, 1, 97, 57, -179, 87, 123, -327, -180, 161, 191, -105, -241, 191, 153, 130, -58, -109, -208, 290, 153, 381, 199, -298, 218, 37, 72, -195, -30, -58, 47, 36, -111, -26, -78, -154, 24, -227, -117, 268, 126, 25, -151, -119, 169, 81, 270, -165, 14, 92, -57, -71, -90, -156, -5, 43, 56, 151, 60, 0, 191, -41, 182, 167, -311, 56, 61, -53, -31, 86, 169, 180, -45, 139, -13, 59, -17, -88, 5, -196, -104, -8, 58, -84, 76, 77, -42, -57, -132, -219, 153, -94, -23, 119, -121, -524, -188, -263, 9, 101, -260, 46, 141, 38, 187, 116, -64, 107, -91, -146, -137, -73, -258, 351, 28, -88, 168, 36, -334]
3067c34L92p9j56K58Q2j43o3P1p8M2j34K67j32r2jJ97J43l17P2q3p1M8K1K09l3
3092H6O7j76k17L30j33L5r4QJ18l8k46M79j39K7j42n1K60ql40J0J19J24r7o9J2
3117g5J06m1j42J99J85l19K16j30L05l21K99k79L9J42j93n4L08j68p2J24k02l3
3139a06K5J67j79P4qJ5j89J82R9j10J00k72J72N6J0J27L8j85p3J90o1q4j09J68
3163D7j98J30p4P2l7R6r6J50J46n1k92Q1j53M6J65j96QJ34K27k1k18j55J42K09
3187A62M7k07j25J71Q8Q1l72oK34j13j02K73j68N4M3r4nK07j43J69m45p2K29M67
3211C73l28O8j67k04K55j62J46j64J00j1N1K8M7Nk3J91k08q5j24J4L21r3J82J2
3235B24l62O4J67l34L22n7j66J10k5m8L46k33K5j19J82J29k92P6K9r1M2l70K07
$$ y = [-334, 58, -21, -177, 81, 163, 20, -43, 28, -50, -8, -142, 125, -7, -99, -100, 97, 240, -77, -5, -88, -159, -111, -90, 119, 86, 153, -23, -240, 90, -43, -8, -102, -94, 24, -14, -260, 219, 80, 107, -35, -86, 174, 166, -174, -164, -45, 79, -18, -87, -75, 31, -10, -152, 47, 232, -87, 129, -1, 304, -17, 282, 3, 42, 184, -9, -63, 245, 77, 5, 129, -73, -106, -81, 86, -93, -19, -27, -12, -201, -19, 80, -30, 70, -202, -30, 26, 36, 163, 201, 16, -57, 133, 72, -12, -121, 47, -151, -21, -95, -23, -60, 36, -60, 90, 236, 185, -107, -26, -179, -133, 32, -164, -156, -22, 205, 184, -34, -189, -47, 162, 209, 2, -123, 48, 136, 217, -155, -161, 73, -40, -142, 131, -37, 17, 60, -34, -39, 168, 25, 194, -251, -323, -94, 373, 45, 113, -54, -258, -3, -165, -19, -183, -83, -94, -43, -15, 32, 37, 14, 205, -3, -88, -212, -198, 123, 30, 212, 224, -138, -74, 93, -241, 81, 24, -142, -32, -57, -105, 241, 8, 33, -86, 96, 225, -67, 9, 38, -53, -11, -381, -174]
3258a74J70L03j87K0N7l39J51j7q0J96j93O6l2K0j5J23j23k42K28P2n7J17M4N5
3282A63k04n6J65n8lj21O0M6J72j43k09J18J01J01l7j05j26J34q2J12K02k25j0
3305eJ56k53J5M67k21l43L58l28O3J02J18jj19j68K40P8j31Q7j91r1P5J42M3k03
3329a10J55K0k8j93J2M4N9J16K60n03J61j47N21k85l9J68j00j05r7N8L82q6m48
3352a85K15l4j26M69m93Q0j44K32K8J13J05m26K54j21R4K94l16k01J48j85L66
3373A67j28j90O7r4J76Q2j23J03R5j22k16J53m8K8J27k07K17k64J5K82n5k09J87
3396D3Q2j56K9r2M7L52J18m81o4j9M25l83J53j53R5n9K56k72j08l1K5J00J57n14
3420d50L50J61J35j27j4j86K49k84O2n1j32N29j89j30K59j10Qj19RJ7k22K32j36
$$ y = [-174, -4, 299, 112, 132, 189, -150, 1, -16, -96, 100, -93, -27, -59, -39, -54, 69, -54, -296, -68, 4, -53, 64, 108, 163, -41, -97, 68, 10, 7, -114, -54, -8, 164, 21, -188, -70, 31, 132, 95, -10, -136, -2, -84, 28, 230, 5, -5, 151, -102, -87, 380, 159, -184, 174, -154, -91, 11, 129, 128, 9, -159, 81, 159, 28, 115, -76, -167, -92, 50, 93, -110, 45, 65, 37, -156, -144, -100, -41, 75, 335, -168, -7, -154, 367, 82, 43, 211, 111, 6, -91, -33, 349, 263, -185, 30, -4, -130, 339, -154, -74, -218, 14, 42, 155, 260, -166, 88, -33, 61, 355, 39, -162, -14, -199, 167, 39, -151, -84, -178, -2, 80, -43, 60, 155, 33, -183, -30, -78, -50, 77, -130, 87, -177, -162, 120, 65, -144, 43, 125, -31, -2, -94, -47, 305, 423, -58, -122, -141, 284, -99, 54, -99, -4, -63, 193, -79, -187, -218, -193, -93, 64, -450, -100, 61, 196, 69, 55, -131, 118, -166, -104, -155, -287, 242, 53, -77, 182, 72, 80, -39, -30, -13, -235, -3, -139]
3443a39K35j66j31K48J18k60K35p5j72J3K2M3N2K88k40K33m92J02p9J09L91m72
3465a37k55K75r4J47J01P2j8l6j57nR4j52J90j4j1j59K56J30k26K0j26P6o5M2
3489e2r7K96j80j19P6j0j9M3K8k1r2K52K30j10q0m1j11j40K41k50J32J03m1j14
3513g6J17pP2m25K26p4M5q6L14j98K75k07J26J4m1Knj06J46k62P0J21k39K63j75
3538a10k86K51L7J33K06n51K98j36Q1P9kj87k3N02m26p4M78p1m19K25R9j14K04
3561A94l13N4l1K53k73J21k1j79j51K28J48O4O2k81K60r1m9K31j35q1J82j65L13
3584C40r3j02o2k03L5K23j92j7m0r0J30J74l2k03O5q0K64k0j2K31k73k7j07K06
3608A15j56J06J68j58j86K41q2m1N6M1L1j04M0l2j67K24j78l5k14O12l52P4p7
$$ y = [-139, 96, -70, -201, 47, 165, -95, 140, 65, -107, -94, -72, -29, 23, 311, 71, 304, -188, -86, -165, -56, 335, -137, -392, -117, -211, -64, 37, 109, 91, 55, -102, -107, -13, -165, 25, 11, 0, -159, 97, 227, 1, 21, -105, -29, -94, -52, -149, 147, -33, -152, -76, -86, -105, -62, -34, -55, -147, 105, 335, 225, 145, 104, -7, -147, 94, -156, -24, 79, 38, -76, 41, 34, 106, -319, -93, -167, -122, -208, 106, -92, 183, -24, 102, 116, 75, 77, 72, -34, 112, -150, -80, 41, -198, 65, -110, -396, -145, -108, 25, 231, -320, -22, -158, -77, 2, 0, -187, -210, 292, -134, -208, 270, 199, -220, 5, 104, -10, 194, -119, -65, -96, 157, -116, 5, -16, -195, -346, -118, 30, 94, 156, -125, 135, 44, -5, 226, 91, 10, 192, 27, 340, 247, 145, 83, -120, -85, 138, -54, -71, -111, -201, -71, 103, 71, -132, -67, -147, 117, 97, 85, 316, 43, 16, -91, 115, -41, 65, 233, 75, -111, 130, 48, 7, 63, 104, 135, 31, 71, 39, -128, 96, -82, -117, -331, 281, -71, 3, -74]
3631g4J33k19K09L3Ln2J35j80k25J08J15n7K95n6j49j85K25O1oJ8k0j47p3J14
3655Fk84M42k13qM30l66n0l8L6k4J04P0j15j18Kj46J79J49J04P8l99K80k02Q8
3679Ek50J44P0r7k18K72Q2pj59M14m65R4J56k04L04k74K39j79J92j64m7m6L38
3702B00m34J64J26k15J14K45J44n88L46j72N4R5Rj4n0J01l40K88J07j16p3l36
3724c45K84k38N03j01l17M96k61o6p6J89k65J92p2J57j56P1J52j20P9j65k1K05
3746A25J69m69q1J33j4P8J8M4K23r5m46L27r3J34j56J53r8N1Q8n19L77J82n4k42
3770a65j2R6J8P6J18j0l89J49K59j57J30j30J37j35K78k50j05K83k32K12p9n9
3792C3j72J27j30K51k0j58k3J07J9m2q6m5P4k8l8L74l02P7J13l20J96J89k8p5
$$ y = [-74, 59, -160, 49, 82, 85, 33, 168, -12, -237, -129, -14, -71, 224, 168, 19, -166, 59, 120, 114, 132, 112, -35, -108, 6, -278, 164, -49, -57, 373, 7, -43, -81, -45, -69, 35, 105, -10, -128, -126, -272, -93, 56, 160, 238, -161, 119, -83, 5, -245, -101, -31, -128, -346, -74, 8, 1, -158, 256, -209, -115, 41, -163, 141, -133, 106, -73, 119, -45, -92, -138, 200, -234, -70, 56, -159, -45, 200, 344, -244, 102, -70, -16, 79, 88, 74, 24, 125, -215, 73, 180, 64, -9, -345, -61, -299, 204, 103, -214, 282, 21, -45, -121, 68, -197, -5, -77, 80, -76, -5, 147, 27, 106, -59, -80, 125, 294, -175, -256, -123, -137, -59, -41, 3, 226, 131, -315, 12, -81, 53, -103, 50, -48, 3, 91, -428, -51, 131, 77, -165, -177, -81, -63, 13, 131, 121, -268, -119, 140, -17, 113, -17, 120, -15, 263, 13, -92, 191, -41, 171, 92, 33, -139, -12, -142, 109, 89, -69, -92, 15, 34, -8, -94, -139, -65, -93, -131, 243, -59, 18, 131, -189, 7, 196, 168, 93]
3816I3l25J53R6n9j34L49m65L30j98J90J72k37J76l15L03j97R0N1l1j95L28l19
3838a44J74PJ8m14N86m30J90K25k34J62o1K0J22J1p1m69Q8K4O7J52k11M76n61
3861b73L66l86L83K7k4nJ1k89r1K33J70j80k35L73R0l17N5O0L0j62m1J59j39j10
3885b95J07J03O7Q8j69k7L2J90j38J16p5J20j30Jk3n5K8M82l08k21J06j16m1J23
3909c5J95j39m5J5K76m7n98J89O7K43lm10J61K66pj63q1K37k44K86l77K48O3k85
3933a88L93r1o7q6m4R4O0j40J26m71N65j62j79J50M0k02L80j35j91o2L80k43p5
3956a48l4J51m5N9J10k81J26L9JL13m54RJ60q1P8P8L9q0K7p0N9k68J11K02L6p4
3982F3k39M05j71j3k9J72k34J12l89M20Ol11J47K10j62o7J55k66J56l3mJ16r1
$$ y = [93, -232, -79, 17, -42, -176, 173, -292, 38, -160, 30, 202, -35, 141, -174, 129, -68, 22, 73, 42, -153, 175, -144, 30, 37, 55, -359, 227, -203, -13, 212, -22, 140, 79, 99, 221, 232, 161, -308, -220, -196, -129, 23, -188, 288, -273, 93, -293, 90, 117, 93, 88, 99, -190, -281, -48, 122, -58, -293, 80, 170, -147, -92, -32, -2, -164, -205, -46, -185, -295, -188, -85, -18, 70, -99, -126, -94, 96, -42, 74, -1, 119, -11, -10, -33, -88, -60, 422, 114, -107, -1, -117, -158, -35, 160, 21, -24, -9, 267, 220, -378, -189, -122, 121, 118, -292, -131, 135, 128, -35, -116, 121, -123, 163, -214, 34, 97, -188, 205, 114, 47, -39, -83, 11, 71, -69, 57, -414, 151, -11, -190, -40, 0, -202, 178, 43, -148, -210, 170, -73, -148, -182, -31, -76, -17, 93, -188, -62, -23, -22, 291, -163, -154, 6, -75, 3, 81, 120, 40, 67, -3, 56, -212, -101, 101, 137, 63, -176, 229, 58, 45, 16, 188, -46, 66, -323, 97, 103, -208, -61, 149, -13, -80, 75, -191, -35, -68, -72, 44, -47]
4005d7J89r1N5p7k00J44k56J81J75k53j28J93K33j72j51J61M3o4l5N8J0j8P9q8
4029e9J8K71j40j81L21k24j95J80l9j26M67m20L32m06K45k44J86N2J6j84k37M71
4051A04J44m08K39P2k3p8k01l5N0J14P1LJ58j66J30j68K48k49k94P41l32L0o7
4074H3o8j36K96k60m3J35j30J08j13J34R0n2N1j00J63l85J79p9M39n7k71L47n20
4097a89M80j51k92J72K12k02P1l3j62J04R8m09K74k47L74Q1l49K95k20P4M7j32
4119a04kK8k38J50K32mm2K6J09k16J39j4j57J98j00O7j18J7J81k47K08l29J98
4142a8L1R5o6J08k14L40o2j05j05j15J97pJ29k44P9k06K37o6j11n5L92k24J45
4165A55j14j32p6M00m33J39n0L0j21Q1K64j24k35J1L34K3j35K07j14j03l8j71
$$ y = [-47, 142, 51, 106, 29, -171, -27, -283, -102, 73, -180, -308, -115, 118, -54, -205, -44, -1, -65, -100, -42, -32, -50, 29, -59, -41, 230, 90, -91, 230, 6, -189, -9, -48, -174, 293, -127, 205, -201, 44, -200, -14, 38, 54, -130, -367, 104, 248, -160, 79, 151, 128, 50, -151, -186, -136, -22, 49, 52, 210, 44, 174, 6, 254, 5, -289, 452, 120, 150, 83, 15, -121, 175, -85, -128, 7, -123, -15, -128, 6, 96, 44, 95, -5, 158, -227, -48, -127, 312, 255, -16, 331, -189, 291, 140, -152, 20, 232, 30, 101, 68, -94, 10, 108, -301, -27, -274, 100, 181, -168, 127, -93, -19, 28, -104, -106, -78, -316, -166, 66, 62, 20, 46, 155, -61, 78, 64, -93, 105, 5, 72, -46, -29, 152, -95, 113, -216, -18, 13, 108, 42, 150, -64, 276, 214, 109, 4, -111, 86, 79, 208, -36, 43, -163, 74, 8, -103, -158, 234, 10, 155, 41, -91, -167, 233, -200, -61, -111, -81, -202, -121, 143, 19, -216, -205, 129, 152, 17, 224, 110, 7, -31, -202]
4187b02L34j99r8L9j59M34j29j09K32J84l71ML4l0N9j59R8L4l9j82K52Q3r4J63
4211A79k42L66k73q1o0O5J83j7m6j84l4N65m94L1n5k8K51k69N2QN8k00N5J06J46
4236H2k88J32L3r1K25J19k42J8j75M77m70o5J91j13K95j55nK13j02j94L26q9j7
4259A05j40J05r5r9J05J47k39q6K77j99L99l79K00j46L1K49k31n7N7p5l2J22r4
4282g5K03o3P8m39L01q3oL73j85j47o5p2J55j36L34j76R4k55K02N6l81N54n05
4305b38L49P9j01q2J35k37j76J63R2P3R5j19l57J41J64K33j13m6m4q7L60m04L86
4328B66m33L45j24j41K50L6j46P0l62L46k9q0n6J51k0k05K54J21j45J54q4j03
4350F5M1n5k07Q9O5M5J76k23n9NM7O7j40L16l93J04l6K1k06K34r0J94L72m58n0
$$ y = [-202, 132, -67, -165, -126, -285, 149, 20, -89, 143, 327, -44, -40, -6, -36, 23, -136, -38, -4, -43, -225, 27, 110, 16, 179, -63, 303, 30, -51, -111, -46, 137, 120, 74, -110, -144, 421, -73, -42, -97, -125, 126, -143, -91, -83, -25, -225, -170, -64, 82, -206, -74, -41, -132, 93, 212, -30, -12, -187, 290, -180, -245, -54, -167, 128, -27, -32, 181, 79, -115, 211, 122, 105, -35, 70, -25, -124, -19, 128, -111, -197, 80, -119, 280, -99, 101, -45, -14, 235, 4, -53, 4, -71, -103, 19, -75, 128, 65, 143, -296, 5, -78, -84, 289, 104, -43, -108, -180, -25, -161, 173, -3, 91, -164, 38, 94, -287, 267, -238, 111, 190, 89, 7, 142, -95, -271, -108, -16, 57, 152, 33, -324, -183, -19, 214, 101, 55, 11, -76, 284, -120, 266, -167, 178, 54, -87, 163, 199, 53, 123, -239, 107, 78, -2, -58, 93, 73, -132, 122, 243, 98, 252, 168, 65, 106, 51, -156, -67, -2, 43, 219, -4, -63, -58, -11, 56, -84, 232, -161, -57, -93, -72, -278, -44, -134, 60, 432, -26, -76]
4375g6Q1J7L17m22L29l62k85L80P9m20K58J24j86J22j67K80o8k7n0K72k20j14
4397a38J51Nk13J48K40k34J96j7m4j12mj68J37K11jR5j76k4j50J26L0mp2J17n21
4422d22L30J85k94K91RL3K1k94M32k25j62K7J46r1J49l24K29p6J27k76J43m7P8
4445a1K3k10K84k15J16Qk27K35j63K57j3k99mM13k49K97k12J40j49J23N7j53J56
4468B04k42N2p9J81j81J65k15J80M8p1j38J87j17J18Q9l06J9K39Q4o18K13J70
4490a8N0N1j31l03M52J2o2m36M34J0L1k15K55k14k03L70O2j30k29Q6q0L80j51
4513B1J79J23m79N58l53p4J02l64N08n09K46j75R3K28J1J11n78K09K01R5j31j5
4535Gk09kJ71N2L2j46K16o3r2M5J83k37J38k66J97J54M9l31j77L62j46j40Q4J2
$$ y = [-76, 5, 22, 339, -83, 246, -116, -401, -21, 58, -362, -104, 20, -166, -44, -211, 69, 1, -26, -76, 196, -24, -138, 13, 18, -195, -47, 193, -41, 155, 138, 94, -18, -22, -190, -53, 158, 157, 252, 76, 52, -98, 28, 58, 54, -18, 99, -422, -92, 93, -201, 90, 99, 132, 153, -141, 291, 66, -96, -69, 77, -14, 135, -189, 40, -36, 91, -185, -42, -89, -11, 12, -198, 86, -129, -13, -5, -232, 3, -160, 97, 84, -215, -219, 194, -55, 242, 30, 170, 21, 144, 201, 48, 204, -38, 14, -65, 116, -65, 100, -115, 65, 113, 42, -96, 91, -26, 92, 181, -125, -106, 133, 217, -401, -188, -18, 32, 83, -48, -351, 101, 113, 51, -385, 49, 59, 90, -125, 130, -84, -287, 83, 145, 15, -214, -128, -208, 172, 21, 200, 323, -156, 402, 49, -25, 77, -287, 221, -288, -42, -217, -124, 104, 115, 226, -352, -143, 58, 153, 22, 7, -202, -204, -33, 19, 51, -95, 121, 58, -34, 11, 194, -43, 95, -171, 26, 180, 229, -102, -279, 83, -63, -203, -119, -107]
4559a07J66P2J60k18o5J36k15j62N9O9K6J7J25m3j2M11l94O4k0J12m5K1q1k53
4583a77R2K9o9J42k5k99L55P2J4j01Q3l86J92m4J42l08K33J4j0j24J40m1j9L0
4607f5J80k20Q5R8m3R1n05M84j14Q1J0r7Q9k23O5j91L06j92K15p0P8j30J68k44
4631a44j92L82M4p6k67l9L03J40j62M6m0j91K08l30M4J29J86k11j6J04N4J86l93
4654b35L6K58k4k7J70j77k8K74l01J37l3j33K38m92K46n4J82l49K98j39j7K1Q8
4677f1P4j08J77j21J07l02K11OM88m91L34m05K00k10j03J50j08j39J43J27J59
4698A28k33K26k11L20l59M8J26j50K43k73N30l34j56O1o9N5k23K59N0j2j42Q0
4720c6K60j08j84J54Q8k70QJ70r8J38j48J90J06j31j95K23l11K07q2O7JJ37k8
$$ y = [-107, 59, 131, 291, 73, 8, 144, -71, -233, -174, -105, -79, -62, 63, 20, 8, 419, 25, 89, 69, 181, 136, 157, 76, -177, -85, -56, -125, 17, -8, -307, 48, 120, 134, 33, 116, -270, -78, -122, 20, -288, -55, -41, -51, -175, -35, -76, -95, -65, 115, -105, -20, 78, 35, 126, -379, 105, -9, 72, 82, -15, 74, -149, -84, -275, 31, -161, 54, -16, 62, -68, 100, -144, -336, 46, 90, 14, -253, -292, 11, 151, -11, 35, -5, -196, 12, -318, -274, -145, 41, -170, -186, -82, -28, 158, -235, -199, 59, 35, 8, 178, 1, -27, 247, -54, 83, 50, -83, 155, -337, -91, -145, 37, -312, -14, -153, -170, -149, -61, 13, -95, 82, -39, 68, -234, -23, -17, 471, -20, 314, -91, 109, -101, -204, -54, -162, -301, -158, -31, 128, -105, 121, -90, 230, -129, -81, 45, -105, 138, -135, 395, 61, -95, -34, -103, -48, -271, -12, 38, 26, -116, -36, 224, 116, -68, 86, 174, -96, -88, 82, -16, 122, -26, 164, 270, 139, -56, 167, -144, 63, -19, 48, 49, 186, 158]
4743A58j62P2q2J8K49k65Pj12N4M5j04K25Or1j94L87k50n6%K53Kj38m6m8k87K56
4769a03q1K10j21Q9j11k8OJ4J26m56N85l21M10j44j89m5J98R7o9J8j05M72k75
4792A77pJ16l81J10J31N0qj64Q4J47k78j01P8R1j70K14l21J95R5Jr3l3J39j72
4816a00J29j84Q2J21j25K62j56K19l61J05J62Oj23j86J58j19M04L2l24P1r4J11
4838I0j52J48N1l9k51J30p1K46k51L4L00k11k30J66J38Nn9j36j71N75k66k63J18
4861i9Q2j56J53J73n3j59k6J93m3L3k48M3J14j34r0J86l9K06n16M35j44P7l3J57
4885A12M5k01J63j25Q6l36L72J19n49J9J48P7j06kJ31P3k08R0J74rj58%q9J55
4909a9K39j68QM3j48q3l2O2NK48k23J6J13J6j75j66O1K5J04J11J80l14J50P4k6
$$ y = [158, -4, 68, -14, 4, 253, -12, -5, -117, -63, -18, -122, 103, 109, 18, -176, 211, -39, -95, -95, 158, 160, 22, -24, -72, -359, -103, -184, 26, -95, -6, -117, -145, -139, -125, 1, -455, 130, -191, 219, 75, -114, -159, 39, 136, 67, 85, -20, 452, 177, 170, 286, -95, 15, 146, 196, 188, 24, 108, 255, -23, -124, -46, 45, -125, 89, -232, -37, 58, 59, -34, -67, 72, -100, 29, -155, -73, 48, -77, 185, 29, 248, -113, -8, 154, 160, 37, -149, 9, -110, 294, 326, 2, 73, -21, 90, -62, 86, 137, 98, -153, -23, -94, 152, -99, -65, 235, 24, -206, -40, 98, 103, 44, -92, -263, 312, 46, -217, -99, -17, -173, -20, 153, 100, -59, -85, 108, 65, 98, -150, -107, 7, -127, -217, -31, -70, 136, -380, 55, -89, -12, -45, 112, 157, -44, 119, -6, 80, -256, 116, 235, -314, -295, -147, -70, -176, -178, -47, 26, -182, -92, 82, 73, -85, -85, -174, -19, 220, 52, 60, 103, -45, -128, -160, -98, -93, 155, -68, -52, 61, 77, -98, -264, -203, -178, -74, 37, 217, -97, 53, 127, 101]
4934A01l99K89j53J76j72J0P9K18q7R5l77Q6m1J23J27j21rO1J26m36L64n3J10
4957A17M6j77k10K82J38j37Q0j89J61j69Q0N2M9k9k4j49J50J05j50J2J49k73K0
4980f6J25r1Q5O3j36m8K19%k67J60J31k37O4K75l79q7J07J37k47P4J84j2j9j71
5004a36J04l11K94J49K53l16K64l74r9K27k0k2KoK68k51m6KJ7j9Q7J59l12J90
5028A04k54J41J57k96J53l76L65KK80k14j68O2j05M16p8m50L59l9j15J82j61l8
5050g3k07O07j60j71J87k41k38O3M65nn40K98l35M66o0l11L83m2j53r7K31j59
5072i2r9m7J89J32J1k07P1K9m3r1O7LNn1K34j57j20j3KK86k2Jj06K07k05R2J00
5099A76k28M53l72m0J45o4j75L32j14J96n00L34j38Oj92L70k77q2J55R0k14j09
$$ y = [101, -298, -9, -162, 14, -158, -148, -69, 149, 62, 157, -220, -134, -175, -52, 75, -46, -55, 6, 132, -304, 60, 7, 117, 163, -14, -224, 58, 196, 59, 139, -50, 111, -58, 22, 74, 123, 94, 70, -79, 71, 176, 26, 38, 187, -86, -66, 59, -32, 53, 116, -20, -68, 151, 151, -116, 44, 175, -62, 2, 277, -102, -189, -82, 55, -192, -118, 66, 54, 35, -136, -32, -343, -49, 100, 353, 37, 301, -73, -172, 55, 35, 13, 15, 9, 277, 26, -20, -18, -1, -20, 67, 226, -86, 104, -150, -9, 148, -148, 5, -371, -6, -4, 276, 62, -106, -44, -149, 267, 189, -261, 98, 59, -56, 126, -35, -73, -280, 327, 167, -4, 183, -58, -296, -233, 232, 227, -313, -15, -350, 116, 56, -255, 128, 86, -67, -164, 67, -92, -191, -238, -49, 83, 94, -113, -42, -13, -56, -147, -80, -77, -72, -123, 111, -46, -166, -179, -177, 109, 87, 88, -18, 189, -16, 76, 176, -52, 401, 29, -11, 134, 70, -105, 227, 113, 309, -191, 143, 5, 11, -181, 189, -88, -170, -15, 75, -139, -248]
5121b48K06m4p7qK00j18K9m29J33M70j9K95k38l47J85N3l9o7j63J01J2o1J79J8
5145B3r4L6o8O0p6R7J01J3m74M67PL01k71j54j11M6K5k5K22ln56J99L00Ln1J19
5171A36p3K4j70O2P1q6K64m30K09j79K70J2Pk81K63j20K3m3P1k93O0K98n0o9j72
5196a96J81j72L68o0q5j61K04q0r7j11M21m13J21J30j31N4r0O4K87l91M47l59
5218f9m4J30j68M6Qj08L19J03k54J13J0M1Rk29r3J06Q3n5J19j16P0K9L8Ml50L37
5244G9q9j62JL56M9k46K90k77R0q5k16K04K82k44J05k28J67N6m76K55J52n5no4
5268f1n4J88K0J16k74K08p5K9k39K79k34K24k98K12j5J83k44M0j4R6J10j04m2
5291E1O7k53L06r2l83L97j85K63k12J01jJ23N9m66N3J31J20k56J47K2mK7o2l80
$$ y = [-248, -42, -86, -163, -171, 29, -89, -60, -489, -356, 114, 95, 390, 152, -195, -10, 43, 4, -63, -226, -125, -113, -174, 5, 23, -71, -35, -103, -43, -119, -22, 79, 92, -382, 85, 92, 393, 122, -32, -143, -97, -72, -97, 125, 122, -434, -235, 65, 68, 17, 136, 63, 87, -83, -21, 50, -36, 228, -202, 7, -172, 98, 110, 117, -164, 99, -21, 2, -41, 30, -263, -203, 95, 45, -24, -196, -15, -187, 181, 121, 36, -125, 79, -1, -98, -209, 212, -201, -80, 50, -81, -27, -117, -53, 234, -157, 290, -69, -113, 17, -151, -105, -97, -205, 114, 217, -37, 76, 86, 127, 136, -93, -186, -80, 3, -52, 67, -49, 21, 50, 88, 92, -258, 79, -10, -172, -171, 185, 234, -12, 278, 1, 91, 6, -210, -6, 276, 32, 137, -91, 76, 132, -344, -89, 63, 8, 3, -61, -115, 73, 93, 209, -65, 143, 68, 97, -142, 137, -97, 127, -171, 41, 26, 209, -35, 5, -9, 87, 197, 93, 51, 118, -135, 171, 79, -304, 93, -92, 171, -41, 60, 59, 182, 241, -225, -172, -41, 79, -177, -30, -8, -12, 15, -47, -427]
5315d27P29j35m00O13l13k76Q4J0L11j90j15P8p0j56P4J11J50j65J8l2%J43J62
5338B04j43j81j92J25L6J10p6J68J3m3M9L2o3J35l7j52J22m0j21J91k26J63k8
5361D6k28j16J65K39L0l3k56jK25J6k89K33j4j34J23k4m3j04qL93l3k60K52j01
5385G8j99J5J66r2J41k07Q0j02K74m9k99J41j57M49m93J50Q3N9j79J57j88R0N7
5408b5J21j43J85k89k8L60J1l68J61R3k21M04m79J42p6K62j45j22O7M7j45mL10
5431A18p4o1Q2Mj75K87O2n37L20k71J84k58M76k84P1R2K17l69L5K51k30J03K78
5454C21q8l99PJ50j40Q3k9j18L1J02L06l07j1k0L2J10nj42K35j69J26j08M1o2
5478e4k14M18k77J26R1m6J21k4l59J14N5J84l62K21J1j45J36j19J31l26J76j5
$$ y = [-427, 302, 167, -233, 380, 67, -209, -125, -115, 196, 6, -109, -31, -101, -257, -183, -72, 78, -87, -69, -101, -101, 42, 204, 61, -120, -312, -187, -151, -41, -117, 51, 64, 21, 70, 102, 39, 174, 137, -15, 107, 67, -54, 137, -89, 74, 46, -182, -298, -133, 106, 136, 103, -153, -154, 71, 87, -202, 31, 17, -117, 6, -18, -61, -165, -173, 220, 187, -73, 179, 78, -121, -106, 60, -32, 109, -98, -18, -120, 154, 105, -194, -53, -210, 239, -254, -104, -21, 38, -141, 16, -172, -82, -25, 96, -47, 138, -151, -179, 181, 192, -176, -15, 78, -143, 261, -218, -76, -152, 110, -35, -157, -90, -43, -188, -192, 118, 44, -17, 65, 69, -106, 181, 243, -294, 26, -245, -61, -319, 157, -127, -56, 36, 253, -116, -81, 170, -60, 43, 321, 233, -166, -159, -9, -149, -66, -95, -213, -182, -80, 226, -81, -92, -112, -80, 30, 25, -117, 118, -51, 75, -33, 8, -54, -268, 150, -127, -1, 90, 44, 165, 141, -218, -104, -49, 135, -227, -6, 5, -140, -4, -123, 8, -318, -142, -157]
5500a57L32p0j33J45q6j79J90K4j08j81O7L50j60p6J83Q0k45Q5j41l1J96n1L6
5523G0l80O10k46r3K2K5Q6o4R5j74j52k02M10M9j38J57n2k85K15K16j60K7M8M4
5547A28p4n0M4j19pL48m38R0K71o4o7j21J47p5N2j27l01L13K42k67K96j35o4j3
5571Ik3j3Q4L4q2j15J51o0j2N4J21k18j95J50Q3j77L10k82L12k41J73k36K42q0
5595a1k74L02J1M8j92j34Q1J36j16K31K7q2J87j59J96k24j2J39j9k72K60k94J31
5618d0l2J39k62m9K09J09nj98M02l60N2o9L88l55JJ40j04n6J3K08p6J63k58o9
5642a09J73Kj83O5m4J40l3R7j6j87K87j32n6j28J67q1Q3R5j84J82J04k2J75o36
5666b41K88j02J32K8J33j49n83O92j84N9P4k30M4lR3n2J60j19JO4k33O9R6J2K99
$$ y = [-157, 175, 105, -28, 117, 31, -148, 42, 66, -42, -223, -156, 194, 34, -42, 141, 221, -24, 61, -80, -111, 85, 34, 70, -310, 300, 54, -39, -17, 8, 94, 30, 125, -49, -201, -403, 7, 56, -82, 75, 23, -262, -47, 169, 9, 36, 84, 128, 54, 4, 48, -71, -78, 270, -168, -78, 193, 129, 62, -59, 88, 13, 65, -62, -363, -50, 192, -75, 221, 86, 22, 9, -14, -27, 57, 91, 9, -106, 45, -15, -27, 27, 148, -70, -265, -115, -32, -209, 101, -181, 131, -110, 63, -173, 69, -11, -285, 17, 28, 76, -116, -250, -169, -33, -149, 82, 109, 27, 214, 55, 251, 27, 15, 154, 135, -137, 123, -171, -40, -72, 67, -195, -244, -35, 74, 69, -129, 273, -87, -35, -104, 284, -71, -70, 70, -34, -90, -77, 131, 55, 218, -40, -109, 64, 66, -117, -52, -96, 44, 11, 108, 92, -95, 192, 60, 4, -124, 43, -38, 45, 140, -44, 138, 242, 220, 395, -241, 47, -55, 77, 105, 238, 89, -494, 198, 14, 73, 147, -83, -39, -42, 51, -1, 159, 40, 41, 105, -128, -59, 37, 49, 348]
5691C48N2m90J60j01N1O0l8r8N8j4oL18k79Q3k12j30K94qj82K05r9O4k28K18k94
5716b68K78L58j82m75K83J23k71P9J02J41k24p6K16l69L47L5k8P8j40j6K30j86
5738C5J27o5l92L2N15j76j51kJ23j76J73k50J59j27L62j37k98J34K88l27K68J
5760A16K67k92j32p1M1l6M10l60r8kL18K68k98J58j96r6j22K03k38J62O1J9j10
5783b8q3L7L83k15j68M7j06o5J18J78o4k7k4O5Q9q8l21M66k03l7J41j38j8j27
5807a88J52k9l8R5J25q2l3R2j95L5ML7j7m1J25l8J55j25Q8j37J19j03j11J04J54
5832A48k33o1l6K37J40j45o8p8J47k4Q7j88p0J55J59m2l38M59m67J61nK10k37
5855h9M66k59j28K78j42R8j41k26j12J90J92qk43J76j81J11J0j98j44M22K51l77
$$ y = [348, 400, -90, 70, -31, 20, 80, 42, -56, 2, -12, -18, 300, 21, 104, -108, -238, 56, 48, -134, 71, -28, 36, -192, 26, -268, 10, 368, 186, -289, -6, 117, -154, -75, 27, 168, -56, -132, 84, -285, 62, 97, 69, 147, 7, -9, 221, 35, 162, 97, -295, -263, 252, 76, -75, -77, 46, -130, 43, -207, -48, -175, 187, 50, -248, -114, 174, -153, 115, 116, 383, 91, -41, -112, -71, -107, 303, -57, -155, -157, 161, 429, 131, 289, 93, -3, -125, 78, -160, 2, 63, 82, -28, -111, -74, 309, 94, -74, -27, -133, -198, -80, 98, 34, 7, -17, 48, 137, 49, -272, 194, -9, -46, 95, -43, -61, -188, -36, -65, -103, -8, 117, 35, 2, 94, -101, -66, -62, -25, -42, -83, 42, 4, 159, 34, 122, -15, 104, 1, -110, -6, 148, -85, -146, -182, 55, 195, 50, -18, -96, 51, 27, 114, -74, -144, 11, 170, 128, -210, 249, -218, -57, -62, 148, -89, 377, 118, -10, 268, 126, 224, 83, -143, -255, -65, 127, 119, -124, 52, -129, -18, -8, -206, -350, 72, 323, -54]
5877e4J1j08P2J64P3j24l8k29K96r0k97L46J20j9p1q3q3P6N8J9j0k33l1N11k2
5902B54k39J6J72k01P8R2j32o4o7n4K49m30K80K02j90q1J45m8m0nJ27r1M5k9o5
5927g6K97n16K05Q6r6J08ll10J64J11J71k9N3j75n1nL74m91J98J81j1k71L2J73
5951A19j11l72M39r1J74L07m46N3j13R5J41j53k31m9K29n3j27J75q6J89N4j22
5973B1j8J29k41J78J4m18M97j60Q9J5l19J82J39r4j21J33J72k57J20k27q6K99
5995D7j48J88j76j76M80l40L58m86N31p8n4l26J14K51p6j92K00oj15K07k24m1
6017f2o4L05Q3j14l70L30j56J3r7K97o6k35J01nK67j76J23j87K1P7j78P2r6J01
6041a6j47J74K35m11J11pK72j10j23n7j12Q2j13O2mM26j36l38K21m0j60p6K33
$$ y = [-54, -43, -151, -79, 85, 158, 34, -4, -233, 63, -27, -324, 22, 142, 123, 52, -31, -114, -38, 20, 39, 29, -204, -235, 276, 254, 15, 31, 203, 2, 80, 172, 40, -24, -91, -145, 104, -326, -46, 156, -34, -115, 30, -18, -58, -63, 64, -27, 18, -11, -76, 221, -295, -90, -4, -100, 8, 5, -305, -141, -30, 141, 112, 165, -10, -61, -66, 308, -183, 15, 196, 185, -86, -54, 119, 8, -364, 75, -16, 158, 465, 19, 72, -41, 54, 195, 42, -189, -238, -9, -62, -189, -14, -100, 89, 143, 21, 3, 132, -109, 69, 83, -335, 162, 2, 91, 106, -213, -31, 108, 14, -107, 26, 198, -59, 61, -166, -252, 47, -101, 87, -89, -265, 215, -125, 233, -253, 278, 200, 146, -180, -66, 185, 109, -83, 117, 111, -4, 203, -21, -62, -126, 179, 262, 148, -222, 108, -48, -35, -132, 165, 99, -136, -35, -40, 227, 51, 174, -13, 8, 85, -93, -21, -117, -16, -163, 11, 246, -165, -54, -61, 211, 101, -22, -79, -191, -109, -222, -160, -164, 262, 126, -212, 9, -31, -191, -267, -34]
6064c4J18Rj97P8nK07j89l2j28M22k18k20O3NJ38L1j12L21k53M3q9J75j61K3J25
6089A20j33R4k50K97r7j59k7J07K84J5k92l41K22J61R0j35j64K08j93K30j66k03
6111c32L02J53j58K45j30J5j58M86o93K39L4j40L21k44P4j79L38K23n33K72K6
6132A61j75q7K6L33k79q1L5J64n0Q3k46N2K57k35P6R3k21K45m6k02qJ59O9j04
6156A9p3l4N0n3N5j3K87l31K64j03r8q9o8L08l5J57l16K5j73K91R9l06P2K96n06
6181b75J60n1Q6r9R4K77l47L4L99m21L19k58l6K3J02n9M1K82k79J52k73K64o47
6204e12M27m6L46k82K2J56j38k2KJ40k96M44K4k85K85m46N8R1J37J41m42K55j14
6227e5M3l2j10J60M05m56j24O8K26j62p1K4M7j55R3n3J32Rr7O9k08Q24o08J56
$$ y = [-34, 84, 93, -104, -26, -31, 176, -13, -45, -173, 249, 31, -189, -126, -121, 17, 48, -64, 257, 4, 47, -42, 133, -28, -5, 120, -13, 81, -169, 128, 31, -128, -155, -48, 236, 251, -41, -382, -160, 1, 91, -44, -208, 0, -193, 37, -129, -332, -30, 123, -35, 210, 80, 95, -63, 423, -270, -31, 3, -137, 184, -60, 14, -165, 173, 396, -137, 135, 161, -14, -101, -75, 258, -21, -102, -67, 97, 47, 130, -116, -64, 193, -42, 34, 127, -94, 151, 105, -97, -105, 54, 123, 19, -54, -88, -38, -91, -36, -49, 238, -93, 171, 68, -30, -119, -187, 121, 86, 243, -73, -48, -221, 70, 169, -137, -65, 231, -275, -115, -166, -80, -179, -85, 192, -155, -121, 278, -143, 176, -82, -118, -95, 7, -52, -11, 271, -8, 144, -129, 135, -512, -85, -131, 215, -67, -45, 111, -27, -49, -47, 93, -203, 241, 265, -20, 265, -181, -123, -32, 105, 246, -196, 59, -55, -12, -44, -154, 6, 411, -45, -169, -101, 125, -37, -108, -84, -37, -192, -99, -152, -20, -11, -108, -39, -247, 577, -31, 125]
6251A25j40Rj12L26k31R4j15J06j52J15k55L2N0K25l2p2J6j9O6J97j56J81l72
6274a14j04R9N6k21J36M5L61j90K9j05m3J44k55K75j63n4r8J09K46j85J60JM7
6297A76j81r3j05N7RK13j27K04o8n9qm3m3L6o1K26o1M3j29N6q3M5j57R4m1j03
6323b03J72J14J8Q0q1j92k23K72j85K49k49K75j42L63j99r2r6K49n6l23K95j25
6345g9j31M56J1r5l52J56j9J83J3j97K20K8k51n2o0K44j28LJ88p4J18m36L50j4
6369H2R9J5n4j3K5k2k52M36l88j07K54J22j50J0j47J68N1n0J12j38k9q2O4K8O4
6394I8k69J33k0k9O0K03R9n66lK31J23k58J55J03M5k19J24q8j25K31p9M5K68j44
6418A18J1j88J0J18K1r3m1J03P8j73q7M3O1L05l60K57k51l5q8J03K4Ll5K53j74
$$ y = [125, -15, -6, -118, 208, -23, 71, -44, 62, -90, 25, -230, -198, -148, 77, 45, -27, -11, -30, 36, 233, 77, 258, -114, -218, -119, -63, -284, -148, -103, 258, 68, 97, -8, -51, 93, -162, 113, -50, -104, -202, -93, 153, -32, 128, 129, 176, -5, -98, -203, -146, -137, 76, -51, 153, 85, 26, 18, -25, -68, -32, -93, 133, 72, 115, -14, 42, -41, 4, -153, -59, -100, -203, -31, 83, 101, 181, 100, -92, -315, -43, -228, 21, -228, 47, -95, 268, 69, -23, -119, 130, 74, -249, 46, -79, -210, 246, 257, 162, -190, -34, -53, 130, 143, -54, 166, 194, -57, -109, -169, 75, -53, -50, 138, 64, 182, -254, 96, 82, 181, 196, 142, 129, 154, 132, -120, 316, -72, -179, 75, 197, 47, 57, -90, 78, 129, 79, 191, 53, 24, -58, 6, 34, 98, -171, -38, -58, -87, -27, 176, 275, -291, -294, -63, 60, -198, -43, 60, 105, -114, 10, -78, -203, 28, -51, -6, 262, 118, 129, -59, -49, 69, 90, -3, -44, 59, 137, -36, -123, -80, -19, 286, -74, 183, -68, -103, -191, -88, -64, -61, -96, 157, -17]
6443a7K52k82k1L00J73m49k22J7K47K5K18m30K47K1k67L10j52J17K18m65J14J60
6465A14K4m1R4m9j12r4j95J98J39Q8j70J89j38j50J03j5p1p2j3K06k0j38K31j89
6489h1K10j92J72j96J02J3j33J68o6J82Qmj4l39J81J80j19J33l34J7K56r8K51
6512B97k87j03P5J1K1l22M46j36K09k65k6Q3o9J40j17J52o9k58L43k55K42k00
6534h8R0k48M56k33J44j13p3R4J22Kj30K77l47L03k93j79L79k23l7K30j48J76
6556A61l44M7J99j2j54J35J6J22J53n22K48k75J24K26l50M80m66J76J22L3j71
6577e2NL1l32N49j55j24L18j56Q6l59K12L8j6N7M7l93L03r4j37K1L05j84J74J9
6601A63m82O2K95o6j58L25k69J24J7j21J41M4j43j2K6K91j27M9j83J09R0k26N3
$$ y = [-17, 235, -47, -68, 232, 405, -44, -266, -249, -2, 23, 241, -189, 58, 79, -188, 122, -30, 87, 305, -160, -46, 114, 138, 97, 191, 142, 30, -64, -259, -61, 78, 166, -4, 185, 47, -103, 0, -15, -86, -158, -171, 35, 15, -123, 108, -81, 129, -63, 109, -87, 15, 28, -105, 63, -3, 179, 187, 183, 169, -170, 11, 191, 72, 205, -129, -112, 144, 46, 297, 10, -93, -18, -7, 14, -308, 138, 2, 211, -54, -80, 3, -66, 74, -43, 109, 40, -218, 125, -130, 112, -88, 2, -246, 210, -23, 121, 8, -65, 29, 151, 153, 23, 300, -47, 256, -37, -216, 163, -60, -97, 133, -15, 161, -183, -136, 63, 51, -103, 32, 48, 170, 323, -199, 49, -226, -102, 124, -226, 254, -212, -36, 86, 119, -52, -47, -16, -348, 201, 46, -78, 240, 84, 170, -189, 23, 61, 45, 102, 149, -244, 59, -35, -172, -151, 154, -30, 144, 163, -319, -257, 38, -28, -186, 139, -130, -6, 11, -110, 31, 75, -68, -80, -54, 237, 110, 159, -24, 85, 175, -51, 2]
6624Bn8k4J03k40J50m7J88l3K8K4j76j31K60J3J02k46l7J99k02R6J98K7k38M2
6648@J5j06J93j69L3n2q2K45q8j74K7J91k32J55J14n1K53k75j80j5J07m5P6N8
6672bn2l5J0J61J34k01Q9k09J57j03M1Q9j09L37l61K73j23j85j60Q6M9K53Q4k33
6696a0l3j06o3K45Q9k54K08J89l95J78j20J28q6j4K57j65j24K69l28O4K57l92
6718b06L04k18K35p0j41K94k16r3M7N57o55K6J86k4J39p4j28N1R3m4j33K04o6
6741F8k22M83l71l8K12J65l11K2L5j46J59j24j02N07r4j59k07O9Ol4MQR8Q3k28
6766a17j5K94L6k57k75M64l33P9R4j15P9J1k00L16l95L58L8n6L5J59o1k70L67
6789B36k45n42M18K39J89l86J43k70q6j6M12N1k72J79j47J68Q3n5j24j54K86k36
$$ y = [2, -56, -80, 23, -217, -67, -114, 74, 41, 69, 93, -83, -214, 46, 59, 161, -85, -122, 77, -125, -29, 169, 196, -42, 0, 15, -91, 102, -67, -34, -86, -168, 77, -11, -185, -158, 33, -199, -44, 70, 19, 272, -3, -183, -198, -91, -136, -60, -2, -54, -89, -79, 82, 216, 15, 104, -105, 52, -51, -10, 79, -30, 307, -54, 219, 96, -89, -249, -163, -114, 139, 223, -10, -43, -149, -212, 33, 122, -132, 76, 265, -130, 48, -72, 56, -30, -44, 213, 48, -76, 193, -135, -71, 186, -206, 98, -120, 115, 45, -96, 198, -18, -111, -64, 493, -162, -136, 50, 26, 165, 91, -37, 14, 107, 63, -70, 134, 68, -154, 329, -42, -80, 132, 297, -14, 8, 43, -103, 56, -68, -170, 337, 243, 84, -123, -54, -48, -82, -78, -70, 28, 111, -117, -132, 162, 198, -59, -334, 130, -203, -124, -30, -145, -66, -55, -255, 61, -334, 24, 62, 6, 41, 200, 139, -131, 236, -9, -551, -133, 106, 295, -91, 52, -218, -304, -320, 92, 143, -129, 50, -97, 71, 154, 99, -25, -179, 107, -129]
6811a29k7K23n6j9j02J49j79J20K61n0k46k28K84K79k33J17k08L91m18m9M78k31
6833A27o8J76m2k41K24k04pJ09j04m5J07N6j92L25k21J93j86P1j98J42j31J08
6855aQj56r2P0PJ51J04j35R9k56K30L0J1j56M1K1K43k31m1R4Q9k26j2O1q5p9P7
6882a34j9R3J60k39J79k38K73l10J68K18n0J68l35j74K18L9j05K90l03L10k24
6903a5J94j96M7J11j89J71k63m1K87m8J48pk69K16J12j51l63K98M1p0p6P7O7p4
6927GJ4n7K66j96j04P9qP3J06j08j38O6r4J18R7k01N3QJ08j56Q9k38K00j62J7
6952a61J88M4L73o23J58k71L68k2R0j12j25J6K00j19n6J61k5n5M4j29l1l7J24
6975@J83j21l66L22J02j08k66K90j97k5K10J34j81M2R3j67J2j22K52k26J65l6
$$ y = [-129, -156, 67, 11, -8, -110, 39, -140, -20, 241, 191, -55, -283, 1, 280, 47, 164, -44, 347, -71, -120, 358, 127, 59, 235, 193, -48, 176, -28, -35, 74, -30, -75, 32, 88, -104, 221, 0, 193, 7, 78, -120, 22, -109, -1, 7, -149, -241, -171, -164, -13, 91, -44, 55, -201, 29, 59, 70, -86, -45, -24, 219, -12, -53, 41, 130, -96, -108, -47, -132, -211, -134, -153, -60, 100, -139, 40, -198, 75, -235, -67, 151, 101, 269, -66, -240, -22, 17, -88, 202, -101, 209, -15, 179, -17, 30, 141, -48, 123, -140, -181, 106, 58, 206, 199, -70, 146, 258, 107, -256, 42, 83, 13, -63, 14, 81, 7, 21, -36, 230, 34, -70, 9, 1, 74, 180, 72, -66, 0, -94, 24, 121, -80, -27, -19, 89, -67, 22, -216, -16, -178, -161, 27, 71, 444, -179, -21, -292, 76, 54, 144, 32, -93, -77, 123, 4, -52, 109, 84, 29, 73, -56, -87, -124, 0, 183, 62, -304, 18, 120, 12, -254, 36, -161, -186, 24, 158, -23, 19, 112, -55, -43, -165, 87, -139, 26, -10]
6997a0o0j47P4J81j39q4J04k56K14L61k03k20qN0P3L25l40J91K7n0j74J05J89
7020B03M4l23L8O3j98J31J50J00k50L8j98J63M8qJ05j82p0N3k9JP2pO6j34J99
7045G5q4r6L22k39j50J09o6K29j47j57K75j73L47l86J95J43p7K0P1j26j07J96
7067A74j46j07K45l86N90l31j9j75k58O81k59K10l17l4J60j4m6N9N8k4l4k28J37
7090f4J85k24o0L47m35L24j65j12N19l29pkj20J57l0R3r8j8K74j31j7j57Q0J48
7114A58j54j4J54j57J95j14j46K35l03J60L62l17mj23j5k2mR1k79K13J96o4m0
7137HK84k33J46j90J83m42J88j40J78J68l26L30n3q4l0K29k49K56j7l01r2K14
7159B7J74m15K29k9J01k26k0J84K7K0J31l86QJ50j0J47P5l59K91j32p8K7kJ10
$$ y = [-10, -70, -217, -143, 38, -101, -185, -81, -337, -123, 238, 35, -185, -193, -143, -70, 255, -85, 106, 133, 83, -91, 14, 203, 247, -76, -38, 25, -173, -42, 108, 208, -42, -4, -202, -39, 9, 1, 106, -76, -146, -93, -122, -121, -49, -56, 10, -124, 75, -9, -105, 217, -22, -172, -63, -129, 100, -47, -204, 71, -102, 245, -141, 54, 197, 120, 140, 211, 85, -22, 174, 28, -79, 166, -220, 370, 39, 20, -155, -413, 268, 9, 219, -98, -132, 28, 14, -32, 27, 85, 61, 27, -201, -64, 121, -103, -163, 184, -251, 73, -92, -204, 315, -14, -21, -23, -143, 14, -16, 77, -21, -39, 235, 104, 87, -70, 10, 158, 4, -10, 144, -13, 182, 68, -78, 157, -146, 14, 376, 59, 55, -68, -83, -105, -109, -18, -297, -84, 112, 48, 8, 292, 59, 205, 15, 198, -244, -56, -196, -18, 150, -176, 154, 101, 17, -13, 216, -33, 223, 206, -95, -187, 27, 201, -214, 15, -14, 87, -139, -159, 25, 52, 72, 203, -183, -175, -25, -35, 112, 187, -172, 119, -13, -91, -64, -66, 44]
7183D4j69o6J07L22l53j8K98J93j60j37N5l54L3L36k59M6J02Jl9K57j40l0K16
7206B85k93l1K5j49K28q4Q4j53K44m13J78J69L7l82M29p8k24p5j80N44j53j2p5
7229g9J95J18n65j35N28KL0m4R8P2m01K5J35K6K2J56m0k48M6k2J08m2Rm7RP8R1
7256A25j42q7K29O4j56k31K95k60J9L98m3k61L44j33k75r2J92l2o7K27j87R2J7
7279C6l5J41p7k5j95J87K36k92J07j8J77l21J23J21m84L61q5nJ93p1j58J54N6
7302A26n8Q4j61L7m2J37n3N8k09j01K28K16j90j9q0K3j99K17j59O6j39L19n3j04
7326e6Q3k40J86J46r3J24J49r6o8J08n3k56j64L82l27K46p9j07N4J0j9J77j18
7349a1j44M20l25j17O7k8qK48om5J16k97J12j43J21P9P6L8j93o7R5K3j3M08k25
$$ y = [44, -125, -191, -84, 238, -115, -133, 165, 358, 198, 61, 116, -238, -205, 131, -128, -82, 20, 21, -18, 239, 99, 69, 285, -8, -39, -14, -163, 65, -19, 65, -88, 156, -257, -79, 90, 127, -255, 174, 96, -128, -203, -383, 161, 8, -4, -79, 116, 234, -331, -466, 62, 64, 94, 50, 148, 220, -181, -156, -21, 5, 27, 183, 143, -105, -59, -81, 27, -15, -6, -53, -44, 34, 125, -17, -104, 125, 189, 33, -198, 97, -163, -144, 254, 211, -50, 294, 161, -114, -206, -14, -46, -113, 114, -73, 19, 36, 1, 142, 65, 40, -155, 32, 268, -24, 83, 65, 242, -79, 44, 165, -319, 42, -43, -48, 145, 74, -84, 70, 126, 68, 152, -9, 28, -14, 123, 70, 128, -81, -182, 46, 262, 72, 53, -27, -4, -203, 14, -145, -79, -218, 101, 48, -56, 27, -213, -27, 119, 26, 150, 299, 203, 135, 243, 190, -66, -230, 152, -175, 71, -8, -115, -61, -51, -70, 107, -11, -155, 265, -60, -177, -110, -138, -146, 102, 96, 51, 167, -130, -18, -161, -40, 39, 115, 153, -40, -107, -12, 11, -2, 406, 181]
7374A81j77K4J14q8J98j46j13J10J00J20m47K7J83N5m25L33M9k15m3J60j70j66
7396c36M10K25k8m94K67j60R6p1J63j02j62N5k21O23j37j45n1R1qo0M5j09L5N6
7420a8P2K8jp4o5K6J69l9k76L57J83n36J51P4j85L42j65L6M1k81L01k47J75m3
7444B5J68l79N69m98J64j65j6J55m0l3M1q8O1O1J96l77pK66KP0j87J34p7J4M7
7469A06j44j14L24o4j09p6J95j63J7K06j22l00K70K0j8n3K81l26Q3k6j77O6J35
7492A1Q2n7O5j87j07O01k20k81K03k14J28r9kk6K96l41K02J38k36J68J3j33K29
7515B33j39k19J07k32K74M3n1J5j41R3j46J88n0p7K52J0k27K03l30J12j23K55
7537E0l60M78p6k70K83j99R2j03J58k29J60k5j74K3j13J17m3L80p9k5K42l60J8
$$ y = [181, 4, 28, 142, 54, 252, 106, -7, 103, 203, 323, -124, -97, 86, 141, -284, 49, 98, -117, -160, 0, -170, -336, 74, 299, 271, -223, 44, -116, -20, -91, 72, -30, -192, -137, -358, 265, 128, -17, -68, 23, 15, -45, 0, -109, -74, -18, 54, 82, 81, 7, -58, -32, 137, 98, -178, 179, 362, -174, -23, 51, -134, 208, 43, 79, 120, -161, 140, -107, 68, 25, 193, -186, 383, -115, 49, -116, -132, 23, -17, -50, -9, -97, -36, 25, 221, -156, -163, 103, 105, 175, -12, 122, 45, 59, 106, -38, -152, 172, 108, -1, -77, 118, -45, -28, 178, 56, -244, 26, 46, 28, -25, 256, -70, 13, -13, -190, -124, 11, 93, 36, 101, -86, -193, 408, 188, -93, 110, -104, 24, -75, -77, -103, 193, -148, 54, 192, -44, 124, 137, 4, 233, 94, -125, -18, -250, 24, 67, 16, 31, -110, -17, -163, 25, -25, -102, 150, 160, -67, 136, -194, -82, -205, 50, -310, 168, 92, -178, 105, -94, -2, -105, 53, -176, -16, -41, -215, -192, -305, -188, -231, 149, 70, 45, 287, -73, -55]
7560e5k8j85K94l9j15j10K85j86M38l72L54k31j23K59k40j47K29K35l87K5L1j8
7582h6j51K30n4J11j99L73n2l98K88j24J87K57l39nj3K06j55j7k00m3K82j98K30
7605A30k0J20l54J14k58M15j71K6k31L42L0R0J5k35N0j82K00j13M0O6j02O0k12
7628a80Pl4J69l4K18k77J14J79k71K5J65Q0j27j53n6K15j7j61K42j31j8l1K23
7651A47l12J34K36m30L03j99K85m33O5K83L1k99J70K34j52k3J70l47k1M3Q3j12
7673a44M22j62k42K24k59K04k30J61J0L9n0jq0L00k73J29O9KO9k37J71o6n9O6
7697F3qJ54l36n0J15R2m1J35j72J06J25j87J63O5o7L0k90M4M0l4K32n54L06P4
7721EO1N8m8j69J83k4r9J58j56L7k63L36k15l0K13J0k17K28j26O4p7N1J5k87L76
$$ y = [-55, -83, -268, 26, -13, -128, -238, 47, -139, 299, -73, 281, 50, -73, 186, -54, -201, 28, 263, -124, -99, -68, -86, -237, -7, -61, 50, -149, 224, 172, -226, 62, -62, 125, 382, 43, 38, 25, 231, 76, 59, -141, -184, 98, -100, 130, 110, 230, -124, -10, -268, 147, -24, 2, -229, 113, 143, 233, 248, 13, 63, -119, 81, -32, 8, 74, -28, 32, -180, -173, -207, -38, -72, 146, -131, -17, 162, -109, -84, 81, 161, 34, -119, -175, 40, 23, -138, 104, -27, -45, -76, 147, -165, -31, 205, -225, 78, -121, 164, -269, -204, 79, 110, -189, -19, 215, 63, 40, 210, -137, -158, -115, -32, -144, 278, 116, -126, 98, -161, 43, -187, -26, -16, 23, -27, -28, -108, 192, -81, 48, 117, 119, 188, -49, 122, 56, -3, 63, 55, 209, -127, -177, -62, 30, -11, 124, -48, 58, 183, -4, 159, 224, 157, 187, -103, -59, -19, -53, 179, -375, -69, 5, 66, 124, 76, -93, 90, 66, -33, 125, -31, 6, -257, 79, -136, -166, 47, 57, -160, 68, -58, 6, -71, -20, -5, -292, 84]
7746H4K34k41O8j70LK13j96j11J04P1J68l37O4L06l57P6j06O1M8k29K24l33N81
7769B25n8k03j28K48j15J33L0l34K65k29p3M9K39k81j17M16j7J68l76mK60j60
7791f2j8J93nq2K75n08M31m20L68k49J70M4j51J43k24J4J20l12J26K63l52K94
7813E8l89M84k86n6J28l3j02o1J79K77l20L8K00k31R9QJ62M2M7l57NK73m20K27
7837b8k6j58K50ko2r0J16N4q7J67j71K13k18J69m9k99L68R5k32J43j27r6J59J55
7861B44l61m1P9k34M77j38Q4J21n3J40j39m55K50k82Q6J67K68l13M2PM4p4J0J31
7885F0j34j73J45j5j02L35l14L2K63k07j45K90k23L16k99n8M4K49q5J42j30j93
7907b02R7q7J45O2J7n9L0K86m1n02L56N3P3l14J71j27m5n1L21k55N3j46K73j59
$$ y = [84, 318, 77, 145, -25, -22, 191, -5, -116, -12, 59, 227, -110, -46, 260, -97, -21, -127, -66, -18, -247, -23, -356, 225, 167, -36, -164, 84, -31, 102, 132, -202, 63, -166, -239, -190, 49, -232, -349, 67, 50, 218, -158, -162, 98, -62, -80, 113, 108, 26, 301, -207, 224, -196, 172, -77, 93, 137, -14, 129, -95, -81, 39, -273, -147, 116, -236, 58, -331, 153, -133, -189, -61, -94, -196, -257, -78, 199, -121, -83, 117, -114, -15, -7, 155, 197, 244, -113, -108, 165, -255, -28, -54, -212, 38, 36, -26, -116, 0, 54, -33, 134, -37, 176, -42, 127, 78, -221, 147, 242, 10, 153, 26, -70, 89, 244, -117, -158, -79, -313, 164, 26, 110, 231, 178, 318, 179, -276, -26, -308, -222, -55, 213, -100, -58, -51, -7, -81, -71, 60, -74, -247, -102, -117, -219, 116, -198, -166, 97, -110, -255, 35, -188, 128, -171, -229, -185, 64, -21, 121, -9, -202, -105, -192, -47, 15, 32, -27, 3, 289, 248, -254, 102, 155, 228, -86, 85, -42, -87, -138, 183, -72, -19, -165, 108, -51]
7931e1j20M7M22m39N05n0k86j17N4J7N2K2r3j33L66l63K91Ml5j2o3J6k62k9K54
7956cR6l00K27j27Q8j01J48r1k48R1L62k26Q8J6Rj29L76l30J18J60k28M3P4r8
7980A5k2n0J85ol53J55O9K34j48j90j7j6J03K59ml57k7o4J11J16jK57j74Jl54
8005b78L8M04k42j06OQ3J47R8j99J28l32R2J25J71J15k17k68M60j42J70m97J54
8027i0L03k1j24j38j8L95j68k48J13M8P2j26ML2J82k32j53J6M95q6l73J71m8N0
8051E6L5m7K0o8q5K7j32K64k8J16l16K31k33J29J22p1j21K1k4p4L50K8k11l14
8075c25K32K70j68M1j06O7L4k60NJ89p6J65q2Q7J75k90J80o6r2K11j79k43L0J36
8099f5J86j64J49j47N2j3l32K14J01J17j3k83l3K07O6l29J75J44k25j2J64j22
$$ y = [-51, -171, -124, 298, -141, 364, 314, 28, -89, -35, -18, 34, 56, -37, -170, 196, -167, 124, 128, 93, 81, 18, 34, -228, -257, -3, 93, -207, 20, -107, -19, -120, 28, -63, -311, -220, 142, -84, 4, 20, 29, -100, 276, -54, 64, 224, -4, 39, 113, 15, -7, -57, 128, 122, -231, -76, -7, 227, 79, -111, -128, -144, -41, 218, 214, -143, -170, -234, -123, -7, -8, 249, 75, 76, -278, -240, 164, -78, -184, -178, -95, 52, 150, -49, 79, -253, -161, -36, 135, 250, 33, -235, 225, 83, 253, -244, -90, 213, 192, 68, -70, -88, 307, 139, -109, 4, 52, 124, -2, 2, 34, 216, -16, -169, -153, 342, 256, -117, 54, 6, 56, 91, 44, 64, -4, -89, -62, -194, 70, 42, 158, -158, 73, -160, -31, 91, 20, -101, -80, -104, -178, 172, 200, -11, -325, -93, 177, 9, 50, -56, 11, 45, -215, -210, -21, -97, 68, -14, 73, 248, -42, 138, 72, -20, 191, 12, -231, -201, -65, 121, -43, 106, -41, 11, -2, -334, -120, -19, 98, 85, -198, -231, -24, 42, -287, -112, 32, -193, -205, -41, -163]
8121a63J90k9J20Q2j79r2J11J46l95K60j87L58k71R6jK1q2k6j4J34j04K4J61J5
8145A75j44m20K80J15J6J0K68k00j27L8l08j25N12p6j62J97l1JJ81L4k1j86O2
8168H9j03k0k32N28j38m04L45O4Q2mm61L45p5R8m7k6L1j05K86l50J46K67k22
$$ y = [-163, 27, -2, 118, 200, 21, -71, 40, 186, -209, 51, -136, 222, -49, 47, 46, 67, -15, -41, -55, 79, -25, -1, 160, 175, 31, -389, -109, 6, 22, 32, 300, 100, -27, 11, -297, -422, 90, 14, -148, 49, 18, 19, 200, 234, 213, 27, 89, -14, -34, -266, 262, 124, -280, 65, 129, 211, 207, -254, 91, 16, 114, 67, 41, 72, -33, 253, -97, 49, 316, 94]
8191I4
$$ Imaginary data points
##PAGE= N=2
##DATA TABLE= (X++(I..I)), XYDATA
0@%%%%%%%%%qJ6j6K4l2M0m8N6p2Q8j10J34j60J90k22K62l02L52m08M68n40O16
31C28p05Q05r14J036j164J308j468J641j836K044k273K526k799L097l420L777
47A983m167M591n061N577o144O772p468Q248r125J0116j1252J2566j4108J5944
61H472j8177K0963k4551K9376l6252M6920o5907J10098m12371k30407N62724L13406
73C04294K92213K1182j48352l71426l49745k84994m7741J47659L24845L36429
83B24364K68922M5879j46254k74116k92654k64350q6404J31248K86354K94218
93A87207K18790N4541j11177k32524k64998k18553o9614J00521K22420K53145
103A39758J96545N7474q6319j86007k27779j96701p4237P3202J83580K26591J83900
$$ y = [0, 0, 0, 0, 0, 0, 0, 0, 0, 0, -8, 8, -8, 16, -16, 24, -24, 32, -40, 48, -62, 72, -88, 102, -120, 142, -160, 192, -216, 252, -288, 328, -377, 428, -486, 550, -614, 694, -774, 867, -969, 1075, -1198, 1328, -1471, 1626, -1794, 1983, -2184, 2407, -2654, 2923, -3221, 3551, -3917, 4331, -4794, 5322, -5930, 6636, -7472, 8472, -9705, 11258, -13293, 16083, -20169, 26751, -39156, 70942, -341429, -571836, -9112, 304294, 596507, 617689, 469337, 97911, -251834, -536828, -584569, -436910, -112065, 224364, 493286, 539165, 392911, 118795, -173859, -438209, -524613, -393365, -107011, 187207, 405997, 460538, 349361, 116837, -148161, -366714, -436328, -335807, -113387, 139758, 336303, 393777, 307458, 121451, -106328, -303029, -377266, -304064, -120484, 106107, 290007]
114B90007N7570p7114j62126j93366j65755o9675N4453J53613J93130J56008N6127
125B92872n0350j30131j73152j51796o3735M1616J23808J66399J43664N8758m1708
136B16245j14861j47595j28075o1036K5651J03521J45018J26067N4434k7423r3095
147I8851j28953j15696n6713J8124Q5443J22774J11732N5411j7842q0736j12902
158b0507j00668n2426J0639P0601J05989R7979N1679j0700o5955r6870q9440m9882
170a49561N005N8822R1245Q6246M9111m593n5672q4182p9100m6010J514M8599
182g8576P7654P5889M5656j84m5450p2695p0464m2503j879M0352O6826O6325M2842
195A03793K766l7661o1993o2548l9833l737L3160N6960N8766L9158N259l0819
$$ y = [290007, 347577, 270463, 108337, -85029, -250784, -320459, -266006, -112393, 80737, 236745, 292872, 242522, 112391, -60761, -212557, -276292, -234676, -110868, 55531, 199195, 257953, 216245, 101384, -46211, -174286, -235322, -209671, -106150, 38868, 164935, 219369, 191946, 98851, -30102, -145798, -202511, -184387, -98944, 23830, 135562, 190973, 173131, 92395, -20507, -121175, -173601, -162962, -92361, 13628, 111607, 163286, 152586, 86631, -10239, -99679, -149561, -144556, -85734, 5511, 91757, 140868, 136275, 80603, -3579, -82679, -128689, -127175, -78576, -922, 74967, 120623, 120439, 74989, 2294, -68170, -110673, -112552, -72200, -5374, 60951, 103793, 106559, 68898, 6905, -55643, -95476, -99213, -66053, -9093, 49673, 88831, 94090, 63271]
207F3271n3617n4974l6567n279K7103M8328N1743L5892O531k4803m5249m8761
219c6382l3582o907K2071M1333M5249L2839P974j9630l8760m3100l0815q163J7932
232d9941L5548L9952K9094Q548j5312l3285l7280k7869q404J3547K9914L4883
244A9395K7217Q804j2139k8093l2473k5225r199J0742K5439L0928K3831R092r136
257C9183k3693k8475k3227q988Q176K1277K6904K1858R092o602j9935k4845k0779
270c0054q979N218J8338K3256J9679Q987m943j6502k1282j8482r236M280J4649
283a5071K0067J7616R376l867j3531j8590j6683q119K534J1754J7239J6147Q399
296B7271k163j1450j5897j4477p994J057J0221J4721J4202P874j097r160j3872
$$ y = [63271, 9654, -45320, -81887, -87166, -60063, -11735, 40008, 75900, 82431, 57628, 12379, -36382, -69964, -76871, -54800, -13467, 31782, 64621, 72595, 52965, 14205, -28895, -59710, -67873, -49941, -14393, 25559, 54653, 63201, 47889, 14604, -22676, -50545, -58949, -45402, -15488, 19395, 46612, 55416, 43277, 15184, -17289, -42514, -51713, -40971, -15532, 15396, 39227, 48319, 39183, 15490, -12985, -36212, -45200, -37024, -15747, 11157, 33015, 42107, 35505, 15570, -9275, -30054, -39033, -33815, -15477, 7779, 27458, 36445, 31502, 15000, -6282, -24764, -34000, -29720, -15071, 4996, 22612, 31988, 28121, 14590, -4000, -20683, -28802, -26268, -14514, 2725, 18872, 27271, 25108, 13658, -2239, -16716, -24710, -23653, -13432, 1289, 15491, 23365, 22268, 13108, -764]
309g64j3160p021n3Q177J2585J2397P751j06p646j1592j1502p125k72O127J0951
324a253J1061P375J78o076j0009j0197o636m98M858R514R503O505J224m752q810
339A987r258n686j298M325P605Q615O108J173m061p178p836n767j119L408O326
354b656P719N394J205k729o365p176m991j269K523N658O595M982J188k031n562
369B485n969m625j387K304M330N881M494J388j891m456n375l756j923J497M470
384b533M629M324J455j453l721m887l862j188J211L399M174M048J363j304k710
399B945m372l401j544R80L075L298L585J465r72k390l722k882j311K28K664L222
415H68K664J372m57k048l110k623j524P14K020K803K562J148l12k014k567k346
$$ y = [-764, -13924, -20945, -20998, -12821, -236, 12161, 19912, 19806, 12160, 568, -10934, -18059, -18331, -12204, -1253, 9808, 17183, 17361, 11285, 1276, -8921, -15557, -16055, -11197, -1683, 7820, 14325, 15549, 10797, 1987, -7271, -12957, -14255, -9930, -2325, 6290, 12398, 13571, 9510, 2332, -5504, -11271, -12390, -8982, -2656, 5063, 10457, 11662, 8933, 2568, -4608, -9599, -10868, -8345, -2687, 3908, 8890, 10078, 8047, 2485, -3484, -8109, -9496, -7192, -2862, 3019, 7513, 8901, 7010, 2554, -2821, -6577, -8500, -7003, -2533, 2096, 6420, 7875, 6422, 2701, -2186, -6048, -7236, -6025, -2626, 1548, 5596, 6959, 5655, 2945, -1427, -4828, -6372, -5392, -2317, 981, 4566, 6031, 5059, 2669, -1053, -3935, -5246, -5018, -2354, 868, 3532, 4904, 4447, 2399, -711, -3334, -4858, -4144, -2124, 679, 3241, 4389, 4077, 2063, -504, -2850]
431b850j420O71J595K415K147J136j44j643k065k067j363K67J301K313J827Q20
447B940L34j174k180j860j146M93O49K151J192J324m5r09j556j871j057o1J207
464a569J480J442Q73j35m96j345j416q65j61N90J395J428K56P65r38j274q69r44
482a783n0L42J374R22R13L29j288l64j286p36M5L24J153P55M55J84l03n72j018
501f04p13q5L02N70J071P38k51n7o40q47n64j45k6Q77P33O53l20J64l10n94o53
522g01p9r8M47N48N81J31j09m97l93l26k75r8N89L73M53K56J62o83n33j14n08
543h74K14J68O11O08K17p2l08m41p01j89L03N0L50K72L58r9m5l80k72n7k16J86
565c17K45M65j00L34n35Q1n42j12J24L14K66L1J15P4k95l82K09l42j31J68M23
$$ y = [-2850, -4270, -3599, -2004, 411, 2558, 3694, 3550, 1907, -158, -2225, -3588, -3321, -2020, 293, 2120, 2940, 3274, 2100, -80, -1940, -3086, -2593, -1944, 207, 1399, 2723, 2678, 1769, 213, -1658, -2715, -2776, -1569, -89, 1353, 2226, 2091, 1595, 250, -1166, -2031, -2192, -1602, -207, 1221, 1477, 2242, 1304, 30, -839, -1783, -1833, -1491, -117, 805, 1718, 2047, 759, 395, -891, -1627, -1582, -1258, -105, 650, 1105, 1289, 986, 414, -604, -1317, -1402, -1100, -530, 541, 1279, 1028, 971, 331, -516, -1080, -1225, -1251, -374, 359, 1012, 692, 856, 546, -48, -701, -780, -878, -431, 117, 698, 829, 720, 223, -170, -496, -771, -869, -280, 93, 546, 802, 964, 281, -252, -366, -874, -660, -492, 119, 727, 944, 872, 564, 123, -578, -767, -464, -414, -64, 208, 566, 467, 422, 42, -230, -287, -503, -317, -72, 393, 293, 627, 92, 173, -369, -481, -357, -43, 223, 254, 369, 443, 148, -234, -25, -367, -498, -330, 93]
586I3r3L23j35J01r2l21n55J02K40N70j40K70lj47L04n15l77J91K05k72K90J87
608B26R9j98k13Q7j09J10k22J54J65QLM1j80j62P3q6j96L40l4M78j8m36K63j66
632B7j84P7j24K08k80L45J24j21j52k1j21j56qM89j07J86L0Ml87pK75j63K85m39
656b20K65J95R7k8q0m23L09l90J71L8J24k66M2L33l00L33l48J63K6k9M4j74K26
679A08J79l88j7K28j59K8l0K9J39p2r5P0L75j85l03J0mJ3L23n57L27K59n34M08
703A52j57j81J40k7J8k3J1J54Ro9Qj6p1k03P5K52j63J41K61m60J80L4%k97J87
728d5J10J57j24J14N7j33J18o2j83J60j27J63j47o3j43K68P1l76j14M18k46K54
750A27j50j35K52J48l82j5j35K51k12J26jL8J10L75l47m2K18m70J90r8L75j97
$$ y = [93, 0, 323, 188, 289, 197, -124, -679, -577, -337, 233, 93, 363, 360, 213, 517, 2, -375, -184, 21, -251, 39, 226, 325, 127, -86, 1, -108, 2, -220, -66, 99, 107, 110, 151, -29, -191, -118, -204, -400, -60, -94, 384, 366, -70, 193, 27, -157, -80, -204, 4, -276, 69, 193, 72, -80, -101, -222, -378, -386, 103, -4, 182, 212, 216, -171, -178, 97, -66, 219, -220, 45, 240, 337, 309, 229, -194, 115, -275, -104, -66, 58, -208, -166, 167, -133, 200, -148, 15, 41, 12, 56, -118, 108, 287, -101, -118, 110, -49, -21, -51, -22, 117, 45, -50, 20, 395, 210, -93, -83, -87, -74, 249, -308, 19, 278, -256, 152, -5, -186, -46, -73, -55, -78, -67, 87, 96, 27, 35, 19, -52, -255, -180, 72, -91, 50, 311, -149, 31, 65, 65, -232, -45, 65, 222, 98, 212, 269, 136, 254, 192, 9, 169, 42, 205, 58, -5, -148, 120, 191, -185, -299, 119, -127, 127, -23, -158, 94, 242, -140, -155, -290, -39, -251, -125, -126, -88, 22, 397, 50, 8, 226, -244, -54, -152, 223, 26]
772B6n1M14m85K66j08j05J2Jk44L86n9L68k60om0j16KJ07l07L97l91L19Qj43o0
797f9L3j56J04LJL63k61J73l0k05J50k62R0N1J5K2K01m56N2o3J45L18j25k06K4
822h8R9J65J5r6Q4n25L08n9q7J50J7K45M9o4J7m13mJ15L1j9K4J90k19p7K47L8
848A43j3k59K35j83J33j01j0J93k00j8mJ17k70K80k30M6L39j04J71m11M2K58m2
871A12m4j59J24K5q9K14k26l3J21J03k48J26J18J00n76L98N4k28J58j58Q8j9M6
894Gj5J92l46J69p4J5J9l9P3k48L68J55k91o4M4k0J62k70L9k90N01k88L5J61r5
919a00j42P5K24j77J52K00j21j36N5j48QJ41j33J51J02k72K45j3j68J82j55j73
941b03K81l52M01l47J81J33n9J86k23N2J91k84j30J86O8j63K84k36M8m3Mj05L79
$$ y = [26, -25, 389, -96, 170, 62, -43, -31, -30, -274, 112, 53, 421, 161, 155, 115, -1, 1, 108, -199, 198, -193, 126, 134, -9, -69, -36, -192, -88, -85, -84, 279, 18, 191, 161, -44, 106, -156, -66, -15, 0, 22, 223, -233, -181, -244, -99, 219, 94, -112, -88, 11, 176, 191, 95, 179, -346, -38, -97, -184, -34, -17, 228, 277, 213, 230, -183, -187, -72, -41, -60, -36, 154, -65, -142, 105, 143, 130, -129, 106, -77, 56, -45, -55, 138, -62, -80, -84, 33, -237, 43, -187, -141, 198, 94, 265, -146, -104, 154, 112, 68, -91, 33, 58, -31, 183, -43, -76, 45, 148, -100, 26, 144, 244, -332, 66, 120, -108, 50, -108, -20, -39, 7, -8, 184, -162, 7, -67, -52, -33, -72, 1, -247, 121, 276, -15, -79, -35, -55, 107, -163, -124, -414, 87, -201, -166, -5, -100, -242, -167, 57, -120, 32, 232, 111, -25, 30, -118, -110, 31, -102, 49, 151, -121, 124, 111, -57, 125, -30, -203, 78, -274, 127, -220, -39, 94, 35, 221, -2, 50, 241, -43, -173, 13, 81, -82, 202, -34, 14, -29, -25, -130, 249]
964B49j72j55L11l35J73k02L34m03J25k48N24k93L86k58k15J11K03n1L5k36K05
985H8j55K19k18j42L65k47K5L25k42r4K8J79J49l86L30O3l93J07L5r3KJ24J78
1008B47n0k26P4j39J67j26k6J1J69r5m6p3K80l91K76M2n2p7J76j99o4K80k24j49
1032b15O2J07k7K5o1m4J78K57l07J61J10o09K95j11J44J56K6p7M1j30q6J38J31
1055A64J71m64J86N9j90k56O17l30q3J72k5K70m85L35j0n7j40nJ68o0J6M4k36
1078a39L84l11K1j6K47k77K70r2k37K44j22J05N0k5l8j5j06j6J52m3j62Q2J45
1101A01j82O9o2j36K1L86l7J98k09l56J61Q5q6o3R3m6K43k80k15L24J77k49J05
1124D2q5n3p9K62j78k82M66k27J79J12l13J51q2K2O8j4j14N9p8L23j12Q5J24j53
$$ y = [249, 77, -78, 233, -102, 71, -131, 203, -200, -75, -323, 201, -92, 294, 36, -179, -68, 135, 84, 119, -117, 88, -67, 152, -66, -208, 157, -90, -65, 260, 18, -76, -48, 131, 280, -106, 224, 287, -106, 1, 36, -57, -55, 69, 247, 197, -29, 45, -94, 73, -53, -79, -68, 101, 6, -40, -113, 167, -224, 52, 94, 42, -35, 141, -58, -122, 158, -66, -215, -153, -46, -73, -48, -109, -153, 25, 282, -25, 136, 246, -363, -68, -179, -35, 121, 147, 70, 111, -19, -105, 33, 164, 335, -129, 57, 116, -74, -330, 287, -43, -126, 46, 21, 291, -194, 141, 131, 74, -66, -71, 97, 37, 53, 97, -139, 245, -66, -45, -61, 186, -91, 179, 87, -150, 94, -28, 77, 127, 102, 64, 49, -57, -73, 79, 36, -126, -44, 101, -81, -12, -74, -210, -189, 197, 160, 358, 149, -207, -46, 39, -47, -110, -17, -63, 180, -100, -315, 9, 186, -63, 42, -43, -96, -175, 87, -91, -373, 93, -134, 45, 157, -156, -5, -87, -65, 3, -11, -125, -66, -144, 179, 67, 152, 276, 123]
1148A23q2j24O6j37L35k67J66j04jJ29j39J53j58K48q9j45j28q7M76k45j44M32
1170B78j0k75j4j07K3j01K94K15l02J54l03K08k00qJ3L00O2m53K49p0j22K01m3
1193a1m6L45m76K10k5j1K5p7J28Q0k12K6J03j42R3P2j6k72K74P7j89j77K10mJ88
1218A73j78J45l4r9j13RK15L6k12J1Pk55L91M2j34R3rr9Pj68K32O6k09P9L68l32
1244C2p5r6K65k5R6rm5k06n1K78J20j63k85J70N8p4J34k53L8L1J36J2j40K53k52
1269e1j1K89m17NL88l73K39j29k64L35m76O13k76j8n5J82L0j61K24l0K2r4M7J51
1293A70P9p2O6j22j78K0p1Jj18L68j54k9K12k91k8P3n9L18p2k14P1pJ22k7o8n7
1319f7J13k21L52R4m23K27M20k03n4j47k34J96Q6j37j7K8k6J20m2o1L7qk01K98
$$ y = [123, 41, -83, -17, -154, 181, -86, 80, -24, -25, 104, -35, 118, -40, 208, 119, -26, -154, -241, 235, -10, -154, 278, 268, -7, -21, -128, -105, -206, 88, 303, 1, 155, -148, 60, -140, -148, -135, 165, 227, -226, 23, -47, -169, 32, -11, -57, 288, -188, 22, -3, -14, 11, -66, 62, 142, -70, -44, 59, -83, 10, 82, 66, -206, 68, 145, -44, -221, -11, -15, 173, -5, 140, 106, 7, -106, -97, 118, 154, -58, -47, -40, -295, 96, 138, 4, 97, 88, -11, -4, -172, 60, 126, -83, -4, 364, 32, -43, -139, 126, 101, 197, 188, 143, -63, -114, 164, 284, 121, -164, 6, 64, -10, 124, -129, -91, -60, 76, 88, -52, 201, -51, -62, 227, -190, -185, 203, -170, 69, -60, -324, 11, -465, 148, -128, -146, -201, -19, 11, -150, 74, 44, 66, -28, 19, 170, 249, 177, 243, 121, -57, -37, -108, -107, -225, 143, -11, -40, 172, -119, -147, -74, -133, 185, 113, -101, -30, -37, 85, 58, -10, -67, 46, -175, 177, 271, -152, 75, 495, 292, 238, 91, -143, 53, 139, 2, -15, 13, -13, 107, 65, 4, 41, 33, -168, 130]
1343A30j18K06l1k91j03J42J09j87J86r7K65k4p7k33J65l1o2P8r4J96q8J28O2
1366B31J9n41J93k8M55l32L7L3l87M72r3n4M4n4O6l08O1L35k68J26K63k31j3R9
1390A25j93l2K37m52M77m54J88M2J00Q7n13M62m6k27M0L24j17k34J44J16j97K06
1412H3j07%J4k29L13M20m54j34K32k86J00m7j22K18J53k75n8J35R3J0k07J28j76
1435a96K80j34nK03j14k20J27j02J48O9j83o0L12j59j74N8L44l9k87N8L29l77
1457a22K08J7J62k22j54K66r2l0k3k39L10k38K89l9J59l12QO6j90K20O0J10l18
1480a04L19m69K92j87R9J53m6L5K57m17K03o8K8l55L36J39k74K28k34O6J33R5
1502B29l97M01j72m8r9M38k01j45Q7o0j06K85l04J6q4K43k98L06j60J49n8n1J13
$$ y = [130, 12, 218, 187, -104, -207, -65, 44, -143, 43, -54, 211, 187, 110, -123, 42, 11, -51, 27, -67, 129, 41, 169, 231, 250, -291, -98, -126, 329, -3, 34, 67, -320, 152, 59, 5, 49, -5, 61, -247, -186, 149, -119, 7, 270, 39, 26, 125, -68, -100, 137, -315, 162, -292, -104, -62, 38, 125, -388, 74, 28, -199, -159, 165, 48, -186, -42, 74, -123, 83, -24, -24, -10, -239, 74, 494, 40, -94, 138, -148, -48, -95, -217, 1, 154, -121, -179, -44, 49, 59, -148, -20, -196, 84, -50, -55, 148, 34, -186, -59, -161, -13, 56, -127, -187, 125, -34, -208, -150, 194, 155, -132, -74, 255, -122, 86, 103, 265, 43, -111, 155, 63, 33, 10, -229, 81, -157, 132, 93, 252, -60, -52, 14, -176, 44, 104, 214, -104, 215, -254, 38, -149, -50, 103, 57, 92, 349, -68, 135, 67, 95, -260, 76, 215, -59, 169, -65, 1, 134, 229, -168, 233, 61, 13, -86, 352, 151, 6, 93, 33, -73, 212, -92, -76, -160, 83, -215, 91, -69, 80, 22, -29, 84]
1525H4j64L8L04m15J10J38rj50p9J43Q1m45M33K3N6N8k51j20K3K02l54M51j38
1548A9j9J34j82J29j73J80p3J42o1M1k47R6R4j00L46l04J51k42M43N6m61L63l81
1571d9J95l82M47j61k6J14k86J74K60l50J45j86R7Q4k78L55m04K53J64j60p3J1
1593e6K43R0j30n33L39P3l2J53l9p9qO4k44L05j01J3K2J07j39J14MM4j04np6N2
1619G7l00K38j53J84oN0J81m25L36J4j7j62J1J85l85K66j44J40k36J88L07n03
1641a54L23k32K00k82K49l55P8M20k50M6k81P4J22J34j06J87k84K52r3M9n46K02
1663b47M36j50J17j57K66n50K07K92k81PQ7j34K55j12N89n40M7J1k47o5N28j65
1685A94j93L32k44J84l84l6j5o3J3M08k02j39L23r2J30j79p4L06m30J29JK44j53
$$ y = [84, -80, -42, 262, -153, -43, 95, 86, -64, -143, 0, 81, -364, 69, 92, 148, 206, -45, -165, -142, 60, -294, 157, 19, 0, 134, -48, 81, -92, 88, 15, 157, 96, 137, -110, -14, 80, -20, 326, 22, 173, -69, 374, 430, -31, 332, -49, 146, -236, 211, 50, 24, 138, -148, 26, 286, -64, 81, -105, -8, 76, -202, 153, -251, 2, 166, 6, -67, -56, 187, 277, 147, -386, -47, 26, -6, 147, 108, 29, 21, 85, -159, 146, 45, 58, 80, 187, 48, 162, 166, 210, 106, 101, 25, 77, -223, 15, -138, 46, 40, 90, 271, -154, 182, 196, 179, 17, 28, 213, -172, 94, -50, 90, -146, 42, 349, -154, 169, -63, 137, -145, 104, -251, -173, 247, -3, 43, -238, -164, -42, 92, -14, 173, -111, 141, 48, 97, -449, -247, 189, 39, 156, -1, 265, -285, -78, 214, -67, -60, 27, -107, 148, 36, 625, 85, 132, 143, -104, -169, 359, 194, 1, 333, 89, 273, -111, -147, -162, -225, -212, 196, -6, -145, 178, 86, 216, 37, -37, 269, -161, -32, -31, 213, 60]
1708F0J04K1n20L14R1lj32KlJ52k68J87o5Q1j60L26j81K1R1k39l1L91m08j52M15
1733I4o8o4J50Ko0Pl3O5p4k0j95j78L67q8J97j45J03J50j12J79n02K82K31n29
1757b41K61j20L06k09M6j15j53K81l7j50l7Q3n0PJ10j05L09k21L2O9n0K31k95
1780d8J4j41J79N0M0J25l33j39pM30j26Mo1p2J49k51K03L36l03L5L5k08O4Q2k3
1805C4q8q8n2j1K08n2J02j14J94qJ53k65O7k28R3J97r6j04M2J21j33j7k0K46o7
1830A14p8k03K41J57m58K01j10K35p6j89K23j45M46l18L57l82J7R0k19J24p2l2
1852g7rJ58J97k24j35k34K84L5j06J37J55o7j48P6q4R6K1JLJ03r5k32K55o6J2
1877E6o9M7oJ94J38o63K74j31K15q6k88L75q0P4K32m3p4p6n0j36r6Q4J98K91l59
$$ y = [60, 164, 185, -335, -21, 70, 67, -65, -63, -66, 86, -182, 5, -60, 21, -139, 187, 6, 27, 118, -121, -152, 239, -169, -321, 94, 26, -38, 112, 114, 54, 61, 28, 93, 19, -1, -196, -374, -7, -95, 102, -43, 60, 210, 98, 277, -225, 57, 288, -241, 20, -100, 206, -3, 43, -72, -225, 56, 19, -131, -168, -85, -135, -128, -18, -123, 186, -35, -3, 66, 16, 247, -48, -34, -175, 4, 54, 94, 219, -114, -253, -260, 170, 44, 48, -13, -85, 64, -187, 16, 352, 49, 84, 119, -89, -25, 57, 34, -54, -142, -194, -205, 3, -49, 53, -61, 133, 125, 278, 13, 80, -148, -55, 142, 46, -58, -16, 105, -28, -45, -65, 181, 114, 36, -167, 74, 231, -227, -26, -136, 99, 23, -166, 57, -88, 358, 40, 397, 15, 32, 122, -97, 27, -45, -77, -86, 72, 269, 45, -90, -324, -40, -5, -111, 26, 181, 114, -34, 42, -42, 54, 75, 76, 79, 182, 87, -145, 110, 44, 56, -13, 34, 28, 222, 360, -303, -29, -160, 55, -31, -319, 56, -24, 50, 282, 239, 165, 89, 39, -97, -193, -109, 89, 380, 21]
1902B1j48J09q0K31m98L02J0R3o9N9o0P0k62L38M5n1q7j63J08J25p2RQ3j68O4
1927Iq8K18k37K28j49j55O2r0O1m5L60MJ66m36J96n71O16J23k74J49J04l79Q6
1950d2j77L70j57m1pj84m9J76L4n2r8M58l88R5m3p0K01J27k63p7K17k25J87j21
1974a29M31n23K02j29J81o8J12l8k80K85p6N3k2l1O6J42j60j94K16k07M02l00
1996f7N7M6l2PJ14k82J56j80O9J69j91Q4m4J97Q3j9k0l42R9L89n81K67K20j26
2020G3q5j69K30q7J99k48J68j84m1L53k82J31J83m56L49o7r0j30K30K9r4L8q7
2043c7Ml06J45J91K08k80L5j57L42l35K11J1j42J98l0l0j15J11j57J33R2k38J19
2066b7K04k70K50k10J13J53m44j71P42l27m37M98j56J32k55J62k3K80M2q9j34
$$ y = [21, -127, -18, -98, 133, -365, -63, -53, 40, -29, 30, -30, 40, -222, 116, 161, 110, 23, -140, -32, 93, 21, 30, 113, -55, 9, -79, 139, -98, 130, -19, -174, -112, -202, -141, -186, 174, 178, 344, -92, 104, -467, 149, 272, -2, 147, 251, -128, -42, -219, 151, -6, -47, -54, -238, -287, -111, -77, -129, -227, 231, -157, -62, -105, -175, 26, 153, -110, -187, 30, -195, -8, -129, 302, -221, -19, -148, 33, -35, 77, 39, -241, 44, -32, 21, -1, -32, 34, 176, 16, -178, 38, -169, 233, -67, -10, 36, 4, 11, 125, -157, -1, -181, -112, 57, -134, -50, -94, 103, 186, 167, 147, -195, -96, 293, -288, -21, 199, 73, -12, -181, 49, -38, 161, -87, 81, -103, -144, 209, -73, 58, 241, -215, 134, 67, -23, -153, 77, 106, 12, 50, -37, -33, -339, -194, -3, 205, -75, -40, -197, 145, -190, 21, 32, -110, 88, 58, 28, -87, 24, -133, 0, 92, -146, -27, 177, -93, 157, -53, 60, 213, -231, -402, 340, 13, -424, 74, -82, 50, -205, -43, -66, 214, 256, 167, 33]
2087C3r6M5n4n4K13l7J63k26J46k73%J30R0l6l6J52j09k52L43K69n45OR1nQ7j18
2113g3M62l63J14k15K27l48J58J34q6QP9m9J02Nn9Mo0j26p6Q0J47j15p5L11j09
2138G7o6j05O7k2j0J56k4Rrj66J58l24K25k3K11j63R6J16ol76L3K08K7k57O4L1
2164g3J64J9k47K60o5P7k76K95k74l5R1K8mJ99k89K81j9L3q3K05m09j73M09M9
2188A63k58N4J32j37K75k42k23J75O3P9pN0P1l45l3K00o5nK03j66k20J82Q1J9
2212D6j14K0J25k50L73m1k99l1L1L04k60K23J41j11j91J0o1j77L31q1j88R7P9
2235b4k83J84K27o2m0R9j35k09L23p1K05J08m53m3M15n9Pj3k03O8O8J49j42j74
2259e8m38L23M03k36k56M89k8m14J12Q0j84O0K92j09r6kJ5P4j61K84j96M26p5
$$ y = [33, -63, -18, -72, -126, 87, 50, 213, -13, 133, -140, -140, -10, 80, 44, 8, 160, 51, -201, 142, 411, -134, -128, -37, -42, 45, -73, 389, 26, 140, -75, 152, -196, -38, 96, 10, 18, 97, 48, 150, 155, 96, 100, 40, -86, -162, -82, 65, -50, -125, 186, 77, 11, -94, -27, -49, -59, 97, 73, 82, 73, -93, 65, -259, -34, -57, 154, -9, 87, 203, 197, -179, -146, 62, 89, -168, -104, -73, 91, 110, -137, 123, 58, 135, -141, 154, -120, -155, -64, -36, -40, 159, -130, 151, 132, 165, 82, 287, -122, -295, 114, 163, -95, -41, 91, -46, 229, -13, -236, -61, 2, 81, 74, 124, 195, -150, -183, 17, -48, -53, 150, -16, -236, -54, 27, 46, -68, -48, 77, -173, 200, 159, -140, -171, -140, 164, -96, 127, 268, 157, -34, -24, -85, -262, 69, -12, -200, -103, -24, -307, -123, 104, 42, 2, 101, -34, -243, 80, 9, 214, 322, -131, -174, 241, 182, 189, 176, -27, 41, 109, 258, 116, -58, -496, -173, 230, -6, -262, 227, 199, -215, -103, -23, -207, -147, 145, 36, -60, -62, -47, 27, -134, 150, -46, 380, 305]
2282C05m00j42L38l27K44j3Q7k11l2Q3K20k78l2J59P8oj77j2k8P7j78J85K05P2
2306B17k06k69L53l14K02J71j95k77K97j34K77o7Q3k04j41M05k75OJ84R9k42L20
2328B90l62J67k67K73N3q6k39R3l6J60J2O9k41L67k84J13j47k1K24m45M84j18
2350E9j82J25j53L79l26J55J17l69K31j69j42L59l1K25m25K3N0j80K19P3J00m78
2372c40J31kO6K71k3K4j60j11j26K37%K60k63J12K53o58N08J32j97k40mJ77L0
2395G7k53K76k37K36M9K7j19m0P1Q5K6l04J32K9q1L12k12n0J5q5l8K29j24O0j16
2420c5l90L62J00j45J91Q1p2N3j60K5o3J33L4J0j52J42N9k57L4K80j39j75K20
2443A36K72p13J13Q6P7j72K59n5J95j94k7j27L12M6j9k77J27J90Q2j97l28J60
$$ y = [305, -95, -237, 101, -226, 18, 5, 92, -119, -151, -68, 152, -126, -158, 1, 79, 73, -104, -116, -144, -67, -245, -60, 145, 217, 11, -258, 95, -219, -17, 154, -41, -318, -21, -155, 122, 55, 138, -66, -207, 198, -77, -71, 113, 212, -30, 290, -72, 95, -172, 101, 154, 68, -171, -78, -114, 46, 58, 127, -114, 253, -31, 82, -65, -86, 138, -307, 177, 59, -123, 2, -151, 228, -98, 57, 174, -195, 36, -133, -275, 84, 53, 278, -147, -124, -74, -254, -35, 38, 138, -340, -209, -211, -145, 126, 103, 127, -33, -144, -270, -33, -33, 227, -36, 76, 329, -329, 179, 311, 114, -126, -130, 47, 77, -176, 100, -137, 99, 148, 175, 56, 16, 87, 172, 198, -106, 26, 55, -26, 286, 74, 24, 39, -46, -84, 145, 21, 81, -35, -425, -63, 37, -108, 83, 164, 92, 145, -15, 10, -53, 80, 114, 124, -28, 114, 173, -84, -50, 230, 91, -84, 136, 408, -305, -192, -106, -29, -201, 58, 3, 198, 4, -23, -150, 162, 208, 189, -88, 39, 229, 311, 114, -214, -54]
2465e4J14k94jN39k44M6l02O90j46l49J26j19o8J62K2m37K80k08K33k07K15J54
2487A52k26N1m39K07k1M18m4l27J19L35j79j64rK08q7j11J66L2j18j9R7q0k0J17
2511E8Q3k45j2K41l99J92l6M25j05m03K52L0j21pJ5o8J33K36l43o1M2J08j6j97
2535a98J75K80k92J01Oj33j80M8K86j60J81Q0j24l4J44j59J20l53J57q4J87M16
2557D64l73o5m3L06k90J86l53l9L71k18K73l06J2l8j52L25j92nJ0J91q9mJ35l29
2581b23J43k33M37r1K68j71m15J99J52n1J05l89L37k36P1J26k24L50l23J98m2
2602a2j36k8K4L37n3j42O6j46K35m32M73k16K66k16J15l01N9J3J67o1R8j30rQ0
2626E1K29l62l1K80Q6k93J31j36M6j37Q8K62m25J65l7M53l62Q6j8k05L3J6n8N0
$$ y = [-54, 60, -234, -235, 304, 60, 106, -196, 494, 348, -1, 125, 6, -62, 100, 122, -315, -35, -243, -10, -217, -2, 152, -74, -23, -462, -255, -276, 142, 98, -229, -110, 225, 46, -118, -127, 81, -6, -117, 49, 81, -37, -56, 41, -39, -59, 58, 141, -104, -116, 125, -274, -82, -118, 307, 202, -201, 51, 81, -40, -47, -32, -100, 33, 269, -74, -135, -93, 15, -1, -198, -23, 257, -35, 66, 72, -61, -241, -193, 93, -67, 114, 194, 70, 36, 180, 21, 141, -212, -55, -139, 48, 464, 91, 26, -17, 289, -1, 185, -168, -207, 164, -54, 219, -87, -75, -113, -265, 60, -132, -137, -127, 64, -25, -29, 106, -223, -80, -313, 124, 33, 301, 130, -285, -86, 66, 15, 120, -269, 68, -168, -97, 29, -195, 155, -168, 30, -12, -148, -176, -152, 185, 132, -10, 56, -90, 145, -287, 186, -30, 236, 20, 135, -166, -107, -94, 73, 12, 110, -20, -29, 51, 280, -82, -113, 167, 253, -40, 91, -45, 1, -136, -48, 214, -211, -46, -83, 370, 8, 94, 76, -129, -96, -80, -138, -88]
2650h8k37K54O0L5r1j46J87j58K39j1j23N8l2p8PJ84K68n59K86J22o4j17J83j21
2674E8P2m9k97Q1J10j67L18j01j76K58K1Ml63J98j8J49j17K7k32J04L36l99J96
2697A3J85j68K2j89m6K29j75J74j90Q2J29O2p2N5j26j06nJ76k83l7K39k09L57
2720A17n5Oj5q2k13K44m0O2P9J5L3k50Q4l2j71J24P4r4K0n4R5j89L47J9o1J26
2746A89k16K72j46l6k41K75j22pn9J02k3m2P5r5L24n52M45k9k2j27L24j25j91
2769b7k22L44j46j8j44L80l12o7K02PNK45j08p0j82L29j76j07K54l66N34n06Q6
2792f5K42p8l5k11M48l35l54M09J03j52j15K47k8k1k96J09L2OK63j08P6j52L16
2815C01k49k89M2L10n6q0J5j59L5K09L06k88k54K93k61j9L46l60M5L71l3l41J47
$$ y = [-88, -325, -71, -11, 24, -67, -213, -26, -184, 55, 44, -79, -21, -53, -131, -124, 60, 328, -231, 55, 177, 113, -4, 179, 58, 130, 81, -216, -135, -25, -192, 126, 25, -151, 107, 128, 132, -231, -33, -51, 98, -19, 8, -224, -120, 216, -183, 13, 198, 30, 52, -137, -183, 46, -129, 45, -145, -63, 66, 128, 56, 111, -15, -121, -126, 50, -233, -270, -31, -240, 117, 62, 68, 53, -29, -242, 2, -38, 24, 103, 118, 151, -99, -15, -47, -218, -94, -20, -114, -94, -148, -53, -242, 105, 124, 63, 189, -27, 245, 99, 63, -178, 97, -25, -32, -91, 11, -12, -54, 21, -74, 250, -302, 143, 114, 92, -35, 289, 164, -27, -249, 95, -51, -69, -213, 167, -145, -212, -10, -3, 2, 247, 139, 69, -113, 216, 40, -67, 187, -179, 355, -151, -65, 177, 99, 64, -147, 301, -34, -388, 21, 124, -28, -143, 104, 76, 55, -241, -132, -100, -94, 169, 61, 137, -15, 301, 52, -237, -195, 115, 59, -21, -6, -165, -130, 79, 385, 97, -157, 136, -125, -144, 202, -158, -113, 258, 225, -116, 31]
2838C1j62Q5r2K23k72k15L99rj35J84j26J2J00M3n6j04L44m19Mq8L13nk34K46
2862F7l82L04q4J41l12J95pj59K0L27k16K22j43J3L7L4M8j0J34m1J74m8m19k3
2886a28J52q6J88l02M9J16r7J17pJ23l79L69j40j1J97j6o8K77l02l7l8mj27O1
2910i3p4K11N6j42J37J34k43K20j26K6j96KM7J41k6j43O3K00j52j72J80N0J09
2933B09k69K07j29rj0n8J01l06L22p8P1k79L25j13J52j66P1o2N9j9k32K77P1j13
2957B2L6m09J33K56p0K20q5R8m77K04J16L58m80o9J56K7K4k06N9J56o2J9j44M34
2981C16l57K6M4R7j54J73j37j26p2K77l04n7L39M5k15J3j36M25m27K43J38k64
3003a13j25L69r2k66M80m22L00M1j63kK51m17J36J49j43J17l8k2k1K2j83M4J61
$$ y = [31, -131, -46, -138, 85, -187, -402, -3, -12, -147, 37, -89, -77, 23, 66, 10, -94, 250, -169, -165, -253, 60, 55, -179, 67, -315, -11, -95, 46, -266, -71, -78, -237, -217, 110, -106, 116, -27, -14, 23, 57, 105, 95, 229, 188, 362, 314, -105, -128, 24, -62, 126, -176, -127, -11, -108, 9, 2, 125, -254, 115, -25, -36, 161, 145, 77, 354, 52, 15, -23, -27, -154, -93, -167, 44, 100, -42, 95, 229, -14, 206, 80, 106, -90, -88, -41, 100, 74, -69, -6, 194, 42, -130, 50, 100, 209, -60, 147, 18, 9, -1, -59, 42, -264, 58, -20, 51, -228, 97, -16, 136, -30, 41, -21, 38, 19, -213, 64, 135, 22, 58, -351, -218, 38, -32, 188, 103, 201, -276, -72, 44, 402, -78, -147, 9, 36, 60, -146, -87, 69, 7, 26, -118, 316, -41, -15, 29, 126, -28, 145, 8, -118, -190, 87, -217, -274, 65, 110, -105, -92, -228, 197, -230, 13, 151, -113, -238, 131, 39, -227, 253, -169, 131, 172, 9, 7, 258, -159, -23, 126, -17, 100, 62, 40, 19, 41, -142, -98, 63]
3026F3J64m48K27l58L14K04l82L59j84q0NM9J02lO4J39o9l51M62l82K31p6K6l87
3050c11K93L32m45j3L57r4k36J67P2M9l55K06j67Q3O1Q2k78J19j8J54J78j83j50
3073i7K68j17m08K40L23n61N22k15q9J43J32J1k34K46k31P9J9M9j7M2p0j30n2
3096a47K19J18j61L8k20L11k83J74r7L51k50k18J19k2j7J04J3R9l21K76P8q9j7
3119E8l2l3J92l09l1Q9j56K08j0R6j97K87l12J92LJ29m9p1j36Q2L5k42P3n0J21
3144f3o3J24k55K98O3j42m3Q3j34l5K92k50K42l82M39o6j45L48l07K8m3J09l38
3167b40L34j01r9N9J90m11M43Rj14j02L7N0J57j31J3l0j09J39qM6k65K44J39k98
3191d8J90j91q2K23j23K92k55M8J64j19l27L90l02L16j05Q6m36K74o4J11j36J02
$$ y = [63, 227, -221, 6, -352, -38, 166, -216, 143, -41, -121, -116, -67, 35, 32, 96, 235, 166, -185, 277, -105, 126, 50, 76, -311, -18, 314, -131, -144, 213, 119, -117, 50, 122, 171, -184, 22, -145, -62, -1, 81, -197, -78, -96, 58, 236, 53, -97, 171, 54, -354, -114, 209, -352, 170, -45, -134, 9, 141, 152, -82, 164, -67, 12, 31, 80, 63, 105, 35, -95, -147, 72, 190, 29, 67, -153, 158, -125, 49, -48, 303, 53, -165, -46, -68, -85, 19, 32, 131, -190, 86, 164, 75, 58, 26, -7, 185, -124, -155, -66, -222, -14, -24, 72, -125, 162, -150, 42, 45, 174, 125, 54, -82, 0, 35, -207, -134, -184, -63, -126, -2, -257, 41, 104, -38, -81, 2, -132, -167, 125, -125, 117, -265, 174, 108, -37, 311, 4, 32, -11, 98, -240, 94, -7, -106, -47, 143, -268, 175, 184, 70, -32, 5, 55, 212, 81, 94, 64, -45, 94, 86, 132, -133, 111, 250, -48, 142, -49, -131, 92, -31, 261, 6, 54, 218, 99, -228, 162, -140, 176, 71, 157, -279, -5, -69, 42, -94, 8]
3213HN6k11K26j54K53k03j15K63l27M07l95J97k40L19l0k6P2q0J86k14r6K48l50
3236b06K6K21%m4j08k07M79q9o3l5j9P1N4J0j92J28o9Q6j90K33j06j5j46J65j75
3261a91K03M0n2n4J50J97j90l85L10j2m8K41m03K09M8j23l7Jj74K85l3J69K4p6
3285I9m3J72k31J06l33K24q8J48J39k77j25j34L06j27J14kK33m04K40K2N6k28
3307a33O3K49J39k34M5k79J74J45K2q1j88K72l20N4J4k25J27J00J16J04j74k29
3329b39Q7J94p1Q0J77k87j08K55m11N95n13O1J40k06N84k39j95J14N8l59J40J5
3351a28L51l17r8L13k13K00l9P4j9k49o3L24j8k89R1k19K56j17O8J2j43J83j67
3374b07K79M2R1k97l9o1J80K42k45O4j88K18J30j32j30O2R6l41N35p9l55M8q2
$$ y = [8, 64, -147, 79, -75, 178, -25, -140, 123, -204, 203, -192, 5, -235, 84, 54, 28, 100, 20, 206, -8, -104, 144, -206, -180, 41, 41, -3, -111, -318, 161, 72, 9, -26, -45, 26, 80, 90, -102, 26, -43, 43, -147, 86, -20, -35, -181, -16, -191, 12, 52, 0, -54, 96, 293, 103, -282, 28, 16, -32, 209, -194, 15, 63, -60, -97, -96, -270, 15, -18, 151, 175, 99, 56, 228, -3, 103, -230, -6, -94, 54, 193, -84, -209, -343, -37, -164, -50, -52, 181, -223, 17, 39, 95, -133, -70, 179, 318, 84, 129, -150, 24, 169, 191, 110, -78, 194, -126, -72, -58, -283, -156, -56, 60, 164, -10, -239, -152, 42, -29, 51, 228, -59, -167, 88, -323, 272, -241, -180, -40, -246, 338, 99, -96, 18, 76, -283, -143, -128, 223, -94, -192, 121, -92, 108, 69, 143, 124, -125, -188, 136, 118, -171, -80, -299, -43, -160, -92, -80, -223, -40, -207, 72, 114, 205, -92, -131, -192, -12, 230, -15, 49, -139, 79, 209, 77, -53, 9, 105, -236, 299, 220, -135, -87, -169]
3397a69J2L10j81n7K36k27K1L1P6k30K43J09K2l53J81n5O9J67m25L85MQ4o9m20
3421b36J25J27k17N30j01P9j68j46K80l95J90Q2l47N6L39k01R8j92k4p0K62j08
3443c7J34l86L78Q8k89O4J20J06l1j72K08k71O1j13O0o8J97J21k35l1Q2L13k76
3466B3J28%j21k66K68l06K55j03K78l19J38J06j59o1K0M2J88k57J25J61j12l11
3488b83M15k27J49K25l03L13P3n90P6k8k83N06j3N6j02l43J73L46j84n3M2P8j4
3511B9j16m8m7L88o5j19j54L10j78R5l01j9Q3J81j96K21k66L87o8k89J2M44k87
3534cL07k68o7J26o0j80K39J20k25O8K5m01Q0K08K91l46K0L75m72R0J21K48j26
3557A70p4l17K37K9k2j6l44L52k01J35p2J11l8l4J42J04l46J41J36j35o8P7nP6
$$ y = [-169, -157, 153, -28, -85, 151, -76, -55, -24, 52, -178, 65, 174, 196, -157, 24, -31, 38, 205, -220, 165, 169, 253, 184, -236, -111, 16, -201, 329, 228, 307, 139, -7, 273, -122, 68, 150, -197, -141, 198, -3, 95, -97, -121, -191, 71, -37, 97, -289, 89, 177, -112, -48, 72, 178, 147, -25, 183, -88, -27, -140, -80, -148, 49, 170, -65, -96, -14, 299, 23, 151, 151, 30, -236, 32, -274, -19, -122, 156, -163, -25, 81, -78, -139, -119, -77, 111, -146, -21, 140, 28, -283, 132, -95, 54, 279, -24, 289, 362, -228, -152, -180, -463, 43, 30, 86, -16, -359, -186, 160, -24, -77, -35, 43, 29, -87, -135, -182, 206, 141, 22, -132, 178, 0, 95, -206, -225, -142, 39, -157, 64, -202, 185, 117, -172, -160, 284, -3, 304, 36, -31, 95, 35, -145, 94, 214, -11, 57, 82, -319, -239, -31, 260, -86, -66, 309, -163, -73, 48, 296, 170, 96, -221, 16, 45, 23, 7, -337, 15, -186, -51, -123, -12, -50, -84, 58, 162, -184, -43, 93, -42, -110, -33, -38, 38]
3581C8n8K1J10k02J45k13J92j65J71J67l79K67m4k47L21m00L49j53Q0R7j96K48
3603A49j86K4J6K32q8k2k66mJ71l5P5k9k43J51j24J14K00l93J43R6j63K06j1J28
3627A41m65L03k43M2J56J23k51O2J86j8J47l1N5j87J13k02PO6k11P9K47M9r6k52
3651a80M12j30J09j38l24J43O5Q8j16K17k29q8L30l25m7J25k44M60k88J75Q2j09
3673a2K46m68J40J60j92K30j68O5J4j89J04K6k9J63m42K79K38k20k83N31k64K87
3695B16j62p2J15j56K33k28L1k72M37j60M6K0k96J64K87k94j2j03K00j83q9L40
3717F2l3K25m10K46%J87k71j60J58l2n1K21r4J16L0m85L03j85J28J54mk20r5K14
3741Dn5L24l29K33j98k74K94K04m23K69j48J61M3Kk01J23J48j32K2k8J46k47l0
$$ y = [38, -20, 1, 111, -91, 54, -159, 33, -132, 39, 206, -173, 94, 50, -197, 124, -276, 73, -80, 0, 97, -99, 149, -37, -13, 3, 235, 147, 125, -141, -145, 26, -9, 66, 37, -206, -55, -179, -65, 135, -258, -115, -19, -182, 24, 13, 141, -324, -21, -264, -222, -66, 57, -194, -132, 54, 36, 183, 152, 207, 20, 133, -69, -62, 4, -207, -128, 119, 168, 72, -180, 232, 102, 211, 73, -251, -108, -43, 45, -71, 146, -83, -171, 159, -166, -213, -88, -332, 128, -160, 15, 97, -12, 234, -234, -94, 66, -126, 104, -64, 1, 15, -174, -70, -44, -73, 90, -352, -73, 165, -55, -338, 193, -71, 216, 54, -18, 97, -59, 174, -54, -23, -295, 142, -18, 28, 48, -248, -84, 203, -91, -103, -206, -6, -189, -278, 62, 29, 254, -156, 90, 90, 277, 6, -154, 4, -28, -79, 142, 48, 164, 194, -291, 12, -173, -45, 109, 105, -115, -210, 4, -51, 273, -56, 177, -21, -295, -1, 203, -220, 49, -99, 62, 105, 107, -94, 29, 177, 45, 67, 39, 185, -62, -92]
3764i2N2o9j36M75k82j04M30m59L54j86p1L15k61k2l9J21J60j63k11P3L1K22R
3787A47jN4l17J29R7q0qM8k71J41m0J12j9k43M3J79J07k07J37j60K44j42J65k79
3811a64QL18k21O8j47Q7K46k01r3L5K3J50k39L25k07j53q3J80M1O4l48K46J50
3834H5K25m33N8M7r2J81j45P7J31k36k4K46r9j0o3m4j11K84j53j52J03J53M6K8
3858A02k51K70j16j36j30K95M5q0j27K68J5o4O1k52NL41l90m8Q8K49o6n8p2J43
3882I2l84M65l37p1L11j79K97j68k10L37k63L08j59j72J24Mj31J91j86L11J6k02
3904fn1j42K89q7k5q0K56j57j76K77m37M15K05k71j58K55q9M5M8m13L66j33J90
3927A21p2p8k04J79K83l04k1P1K32j42o6j15J30j09K05p5o7pn7R2j16j05J8L75
$$ y = [-92, -40, -109, -245, 230, -52, -156, 274, -185, 169, -17, -88, 227, -34, -56, -95, 26, 186, 23, -188, -115, -84, 138, 147, 146, 200, -117, 12, 109, 29, 21, 69, -202, -61, -101, 11, -8, -251, -208, -29, 78, -129, 8, -152, 92, -50, 115, -164, -156, 162, -59, 9, -138, -51, 195, -6, -99, -64, -41, 109, -130, 195, -12, -165, -248, -68, -27, 37, -311, -65, 85, 310, -123, -65, -18, -110, 71, -74, 3, 134, -102, -126, 120, 21, 11, -52, -96, -207, 77, -76, -228, -125, 28, 74, 102, -149, 121, 5, -131, -261, 34, 79, -1, -128, 140, 155, 91, 152, -100, -95, 246, -144, -192, -104, 145, 79, 21, -51, 92, -292, 173, -164, -235, 76, -103, 194, 26, -184, 153, -110, 198, 39, -133, -9, -5, -136, 55, -131, 180, 196, -6, -57, -199, 90, 3, -22, -102, 154, -3, -179, 98, -339, 76, 281, 10, -148, 107, 18, 63, 111, -302, 64, -69, 121, 49, -29, -233, -54, 229, -75, -96, -25, 207, 65, -1, -116, 14, -95, 110, 35, -32, -39, -96, -4, -120, -225, -207, 168]
3951A68j16j61j9K57J5j26J10J32k06j52O6K43l08l7N7K52l4L2j15k7J34N8j78
3974D5J91l57K50J33k81m1N02m22J26k05M1L7j57J57j2J76R7l06J57j62N5K6l8
3997A2J69l68j5K25K16o9q3j35j23K13n7J42j36j07q2K23L2l1J47j02j61L66k60
4020A6l3K75k16mp6j46L46m17L49j72J10j2k63o6M74j75j68J86L49n32L7J1j04
4043b31M80k99Q3J45j09M2j43J6O4j09O8p6L09p5j52L19l18o1J48J12j68K9l04
4066b30J23J3rK58j64Q5j7k40N1J91q4M8o4L4KJ71p4j44k3j61J72n8l6K31k32
4091a57K36j57J58j32K6J93l08L48k8pk26k04N82k45J6k97K11J14J04m21K09J90
4113B05j66j03Qk0J87k98K42j08l9K44Q8k19R9L1M4m35K22n1j89M14k19N1k7m9
$$ y = [168, 52, -109, -128, 129, 144, 18, 128, 260, 54, -98, -32, 211, -97, -134, -77, 175, 141, 173, 58, 31, 165, 223, 45, 236, -121, 129, 262, -19, -60, 442, 20, 146, -59, -18, 19, -138, 19, 7, 183, 280, -26, 131, -31, 24, 50, 12, 181, -187, -202, 23, 239, 170, 87, -48, -171, 42, -15, 127, -9, -116, -198, 25, 57, 26, 173, 71, -90, 276, 16, -17, 258, 42, 38, -38, -184, 162, -255, 94, -78, 32, 20, -243, -309, 165, -10, -178, 8, 357, -175, -138, -127, -231, 249, -50, 33, 178, 69, 111, -32, -16, 48, -61, 7, -69, 240, 165, 13, 332, 14, -47, 101, 213, 45, 74, -230, -107, -94, -103, 155, -9, 76, 59, -181, -130, 61, -23, 25, -39, -5, -3, 168, 94, -50, -73, -234, -62, -120, -156, 75, -157, 79, -78, 80, -52, -26, 167, -141, 207, 179, 172, -54, -258, 324, 79, 95, -202, 9, 123, 227, -194, 15, 205, 39, -64, -56, -76, 111, -187, 55, -53, -92, 152, 240, 21, 120, 151, 195, -240, -18, -69, -258, 156, -63, -12, -39, -88]
4137h8R3N4j54K58l41J62J13l67L37m46L02K38k89N9k41N1M57k94rM82o91O32
4159C18k80L0O2M5q3k00o3J30o2J01N8J9m8j09J39j86M1k37O01m51L17j68j0R0
4183E4rq1k1J78K46k20k81O4l7J45j48K69j34j73l4K95l02L03j15n0n5J91M1J24
4207B50k97K27o4j6j5M9j03K42k73Pk31L43o2J03l5o2k63J44Q3k16L52M3M4j61
$$ y = [-88, 5, 59, -95, 163, -178, -16, 97, -270, 67, -379, -77, 161, -128, -69, -310, -259, 198, -96, -105, 377, -314, 318, 38, 68, 130, 175, 92, -108, -171, -41, -103, -2, 56, 75, 27, -82, 57, -129, -88, -325, 276, -175, 142, -26, -36, 54, 45, -36, -57, 121, 367, 147, -134, -70, -107, 38, -110, 159, 25, -148, -182, 113, -189, 114, -1, -51, -106, 85, 126, 250, -47, 180, 116, 100, 85, 134, 31, 273, 0, 7, -224, 119, 57, 160, 125, 63, -200, -56, 27, -189, 163, 206, 250, 89]
$$ [...]
8191c01
##END NTUPLES=NMR FID
##END=
