##TITLE=1H_DE-80HDEK
 200.13MHz, D2O,
 8 sc
 
 13.2.2025
##JCAMPDX= 6.0         $$ Bruker NMR JCAMP-DX V2.0
##DATA TYPE= NMR FID
##DATA CLASS= NTUPLES
##ORIGIN= UXNMR, Bruker Analytische Messtechnik GmbH
##OWNER= pz
$$ XWIN-NMR		Version 3.5
$$ Thu Feb 13 14:57:34 2025 Russian Standard Time (UT+4h)  she@DPX200
##.OBSERVE FREQUENCY= 200.1313
##.OBSERVE NUCLEUS= ^1H
##.DELAY= (6, 6)
##.ACQUISITION MODE= SIMULTANEOUS
##.ACQUISITION SCHEME= undefined
##.AVERAGES= 8
##.DIGITISER RES= 18
##SPECTROMETER/DATA SYSTEM= spect
##.PULSE SEQUENCE= zg30
##.SOLVENT NAME= D2O
##.SHIFT REFERENCE= (INTERNAL, D2O, 0, 14.3821)
##AUDIT TRAIL= $$ (NUMBER, WHEN, WHO, WHERE, WHAT)
$$ ##TITLE= Audit trail, XWIN-NMR		Version 3.5
$$ ##JCAMPDX= 5.01
$$ ##ORIGIN= Bruker BioSpin GmbH
$$ ##OWNER= she
$$ F:/spectra/data/she/nmr/H-C/1/audita.txt
$$ ##AUDIT TRAIL=  $$ (NUMBER, WHEN, WHO, WHERE, WHAT)
(   1,<2025-02-13 14:56:06.29 +0400>,<she>,<DPX200>,
      <created by zg, POWCHK disabled, PULCHK disabled
       configuration hash MD5:
       00 E9 B6 7A A2 85 ED C7 34 08 36 98 17 FE 4E 26
       data hash MD5: 16K
       67 26 AA E1 EC 68 E5 73 7F F9 52 4E DD 9B 6D F6>)
$$ ##END=
$$ 
$$ hash MD5
$$ 01 73 E0 A3 74 A7 6E ED 04 12 55 D9 CA 35 40 7A
##$RELAX= 
##$RELAX= 
##$RELAX= 
##$RELAX= 
##$RELAX= 
##$RELAX= 
$$ Bruker specific parameters
$$ --------------------------
##$DU= <F:/spectra>
##$EXPNO= 1
##$NAME= <H-C>
##$PROCNO= 1
##$TYPE= <nmr>
##$USER= <she>
##$AMP= (0..31)
100 100 100 100 100 100 100 100 100 100 100 100 100 100 100 100 100 100 
100 100 100 100 100 100 100 100 100 100 100 100 100 100 
##$AQSEQ= 0
##$AQ_mod= 1
##$AUNM= <au_zg>
##$AUTOPOS= <>
##$BF1= 200.13
##$BF2= 200.13
##$BF3= 200.13
##$BF4= 200.13
##$BF5= 200.13
##$BF6= 200.13
##$BF7= 200.13
##$BF8= 200.13
##$BYTORDA= 1
##$CFDGTYP= 0
##$CFRGTYP= 5
##$CHEMSTR= <none>
##$CNST= (0..31)
1 1 145 1 1 1 1 1 1 1 1 1 1 1 1 1 1 1 1 1 1 1 1 1 1 1 1 1 1 1 1 1 
##$CPDPRG= <>
##$CPDPRG1= <>
##$CPDPRG2= <>
##$CPDPRG3= <>
##$CPDPRG4= <mlev>
##$CPDPRG5= <mlev>
##$CPDPRG6= <mlev>
##$CPDPRG7= <mlev>
##$CPDPRG8= <mlev>
##$CPDPRGB= <>
##$CPDPRGT= <>
##$D= (0..31)
0 0.7 0 0 0 0 0 0 0 0 0 0.03 0 0 0 0 0 0 0 0 0 0 0 0 0 0 0 0 0 0 0 0 
##$DATE= 1739444165
##$DBL= (0..7)
120 120 120 120 120 120 120 120 
##$DBP= (0..7)
150 150 150 150 150 150 150 150 
##$DBP07= 0
##$DBPNAM0= <>
##$DBPNAM1= <>
##$DBPNAM2= <>
##$DBPNAM3= <>
##$DBPNAM4= <>
##$DBPNAM5= <>
##$DBPNAM6= <>
##$DBPNAM7= <>
##$DBPOAL= (0..7)
0.5 0.5 0.5 0.5 0.5 0.5 0.5 0.5 
##$DBPOFFS= (0..7)
0 0 0 0 0 0 0 0 
##$DE= 6
##$DECBNUC= <off>
##$DECIM= 32
##$DECNUC= <off>
##$DECSTAT= 4
##$DIGMOD= 1
##$DIGTYP= 9
##$DL= (0..7)
0 120 120 120 120 120 120 120 
##$DP= (0..7)
150 150 150 150 150 150 150 150 
##$DP07= 0
##$DPNAME0= <>
##$DPNAME1= <>
##$DPNAME2= <>
##$DPNAME3= <>
##$DPNAME4= <>
##$DPNAME5= <>
##$DPNAME6= <>
##$DPNAME7= <>
##$DPOAL= (0..7)
0.5 0.5 0.5 0.5 0.5 0.5 0.5 0.5 
##$DPOFFS= (0..7)
0 0 0 0 0 0 0 0 
##$DQDMODE= 0
##$DR= 18
##$DS= 0
##$DSLIST= <SSSSSSSSSSSSSSS>
##$DSPFIRM= 0
$$ [...]
##$SUBNAM0= <"">
##$SUBNAM1= <"">
##$SUBNAM2= <"">
##$SUBNAM3= <"">
##$SUBNAM4= <"">
##$SUBNAM5= <"">
##$SUBNAM6= <"">
##$SUBNAM7= <"">
##$SUBNAM8= <"">
##$SUBNAM9= <"">
##$SW= 18.0517328524113
##$SWIBOX= (0..15)
0 0 2 0 0 0 0 0 0 0 0 0 0 0 0 0 
##$SW_h= 3612.71676300578
##$TD= 16384
##$TD0= 1
##$TE= 0
##$TE2= 300
##$TE3= 300
##$TEG= 300
##$TL= (0..7)
0 120 120 120 120 120 120 120 
##$TP= (0..7)
150 150 150 150 150 150 150 150 
##$TP07= 0
##$TPNAME0= <>
##$TPNAME1= <>
##$TPNAME2= <>
##$TPNAME3= <>
##$TPNAME4= <>
##$TPNAME5= <>
##$TPNAME6= <>
##$TPNAME7= <>
##$TPOAL= (0..7)
0.5 0.5 0.5 0.5 0.5 0.5 0.5 0.5 
##$TPOFFS= (0..7)
0 0 0 0 0 0 0 0 
##$TUNHIN= 0
##$TUNHOUT= 0
##$TUNXOUT= 0
##$USERA1= <user>
##$USERA2= <user>
##$USERA3= <user>
##$USERA4= <user>
##$USERA5= <user>
##$V9= 5
##$VALIST= <valist>
##$VCLIST= <CCCCCCCCCCCCCCC>
##$VD= 0
##$VDLIST= <DDDDDDDDDDDDDDD>
##$VPLIST= <PPPPPPPPPPPPPPP>
##$VTLIST= <TTTTTTTTTTTTTTT>
##$WBST= 1024
##$WBSW= 4
##$XGAIN= (0..3)
0 0 0 0 
##$XL= 0
##$YL= 0
##$YMAX_a= 662863
##$YMIN_a= -672286
##$ZGOPTNS= <>
##$ZL1= 120
##$ZL2= 120
##$ZL3= 120
##$ZL4= 120
##$ABSF1= 10
##$ABSF2= 0
##$ABSG= 5
##$ABSL= 3
##$ALPHA= 0
##$AQORDER= 0
##$ASSFAC= 0
##$ASSFACI= 0
##$ASSFACX= 0
##$ASSWID= 0
##$AUNMP= <proc_1d>
##$AZFE= 0.1
##$AZFW= 0.1
##$BCFW= 1
##$BC_mod= 2
##$BYTORDP= 1
##$COROFFS= 0
##$CY= -3
##$DATMOD= 1
##$DC= 2
##$DFILT= <>
##$DTYPP= 0
##$F1P= 0
##$F2P= 0
##$FCOR= 0.5
##$FTSIZE= 0
##$FT_mod= 4
##$GAMMA= 1
##$GB= 0.15
##$INTBC= 1
##$INTSCL= 1
##$ISEN= 128
##$LB= 0.25
##$LEV0= 0
##$LPBIN= 0
##$MAXI= 10000
##$MC2= 0
##$MEAN= 0
##$ME_mod= 0
##$MI= 1.114404
##$NCOEF= 0
##$NC_proc= 0
##$NLEV= 6
##$NOISF1= 3.799351
##$NOISF2= 2.8
##$NSP= 1
##$NTH_PI= 0
##$NZP= 0
##$OFFSET= 14.38212
##$PC= 1
##$PHC0= -472.8331
##$PHC1= 11.99221
##$PH_mod= 1
##$PKNL= yes
##$PPARMOD= 0
##$PSCAL= 0
##$PSIGN= 0
##$REVERSE= no
##$SF= 200.129724274929
##$SI= 16384
##$SIGF1= 3
##$SIGF2= 2
##$SINO= 400
##$SIOLD= 16384
##$SREGLST= <1H.CDCl3>
##$SSB= 0
##$STSI= 0
##$STSR= 0
##$SW_p= 3205.1282051282
##$SYMM= 0
##$S_DEV= 0
##$TDeff= 0
##$TDoff= 0
##$TI= <>
##$TILT= no
##$TM1= 0
##$TM2= 0
##$TOPLEV= 0
##$USERP1= <user>
##$USERP2= <user>
##$USERP3= <user>
##$USERP4= <user>
##$USERP5= <user>
##$WDW= 1
##$XDIM= 8192
##$YMAX_p= 0
##$YMIN_p= 0
$$ End of Bruker specific parameters
$$ ---------------------------------
##NTUPLES= NMR FID
##VAR_NAME=  TIME,          FID/REAL,        FID/IMAG
##SYMBOL=    X,             R,               I
##VAR_TYPE=  INDEPENDENT,   DEPENDENT,       DEPENDENT
##VAR_FORM=  AFFN,          ASDF,            ASDF
##VAR_DIM=   8192,          8192,            8192
##UNITS=     SECONDS,       ARBITRARY UNITS, ARBITRARY UNITS
##FACTOR=    0.0002768,     1,               1
##FIRST=     0,             0,               0
##LAST=      2.2672688,     0,               0
##MIN=       0,             -672286,         0
##MAX=       2.2672688,     662863,          0
$$ Real data points
##PAGE= N=1
##DATA TABLE= (X++(R..R)), XYDATA
$$ [...]
$$ plain form
1442 1564 450 -1154 -2020 -2126 -1671 -575 798 1935 2279 1553 634 -481 -1762 -1964 -1816 -789 637
1459 637 1399 2095 1852 1117 -218 -1285 -1923 -1820 -1147 141 1208 1854 1958 1380 49 -1180 -1917 -1986
1477 -1986 -1310 -258 926 1793 1979 1241 613 -762 -1601 -1930 -1417 -409 643 1510 1818 1467 600 -634
1495 -634 -1407 -1757 -1471 -677 366 1340 1814 1579 804 -228 -1079 -1612 -1509 -1074 176 1103 1575 1730 1066
1514 1066 52 -948 -1561 -1652 -1160 -202 731 1429 1427 1166 517 -643 -1454 -1624 -1201 -268 532 1256 1530 1292
1534 1292 557 -349 -1182 -1567 -1241 -560 252 1093 1407 1408 831 -177 -974 -1561 -1352 -695 56 947 1510 1397
1554 1397 903 40 -879 -1423 -1235 -917 -282 745 1313 1524 1220 203 -350 -1053 -1520 -1132 -630 426 1079
1573 1079 1449 1206 521 -231 -1099 -1292 -1192 -848 367 789 1180 1122 814 161 -675 -1136 -1224 -693 65 764
$$ packed form
1442A564j114j604q66j06M55J096J373J137L44p26r19j115j281k02J48J027J426
1459F37P62O96k43p35j335j067o38J03O73J288J067O46J04n78j331j229p37o9
1477a986O76J052J184Q67J86p38o28j375q39l29N13J008J052Q67L08l51q67j234
1495f34p73l50K86P94J043R74M74k35p75j032q51n33J03M35J250R27M72J55o64
1514A066j014j000o13r1M92R58R33O98kk61o49j160q11j70M23R33Q00P24K74k38
1534A292p35r06q33l85L26O81Q12Q41L14Jn77j008p97n87K09O57P51Q91N63j13
1554A397m94q63r19n44J88L18O35J027N68K11l04j017n53p03m67L88N02J056O53
1573A079L70k43o85p52q68j93J00L44J215M22L91n8l08o53q36m61q8N31P58O99
$$ plain form
1593 764 1245 1281 702 309 -633 -1156 -1224 -836 -315 394 927 1225 987 259 -331 -923 -1119 -1035 -335 306 898
1614 898 1250 1013 566 -200 -808 -1157 -986 -330 84 697 1030 1078 598 18 -656 -794 -1050 -565 -270 503
1634 503 919 1092 655 204 -357 -954 -1152 -827 -270 396 681 873 960 174 -364 -648 -884 -967 -361 291 673
1655 673 906 948 407 -112 -731 -1025 -869 -560 96 444 930 820 659 -34 -500 -823 -908 -659 -97 507 718
1676 718 776 413 334 -308 -844 -895 -653 -236 214 761 812 785 276 -409 -823 -874 -695 -436 70 615 783 784 339
1699 339 -3 -528 -762 -624 -575 166 510 844 649 468 4 -277 -541 -797 -413 -92 352 651 749 558 202
1720 202 -157 -577 -652 -411 -256 200 548 619 628 199 -238 -660 -666 -568 -195 232 464 649 620 291 -134 -491 -694
1743 -694 -616 -520 -184 443 624 687 504 80 -327 -430 -523 -402 -124 318 411 464 322 250 -96 -492 -594 -385
$$ packed form
1593G64M81L6n79l93r42n23o8L88N21P09N33K98k38p28n90n92j96Q4P00O41N92
1614H98L52k37m47p66o08l49J71O56M14O13L33M8m80n80o74j38k56M85K95P73
1634E03M16J73m37m51n61n97j98L25N57O66K85J92Q7p86n38k84k36q3O06O52L82
1655F73K33M2n41n19o19k94J56L09O56L48M86j10j61o93m66l23q5K49N62O04K11
1676G18N8l63p9o42n36n1K42M17M50N47N1k7n09o85m14n1J79K59N06N45J68Jm45
1699C39l42n25k34J38M9P41L44L34j95j81m64k81k64k56L84L21M44K99R8j91l56
1720B02l59m20p5K41J55M56L48P1Rm29m37m22oR8L73M27K32J85k9l29m25l57k03
1743f94P8R6L36O27J81O3j83m24m07j03r3J21K78M42R3N3j42p2l46l96j02K09
$$ plain form
1765 -385 -96 78 638 541 583 282 -182 -616 -555 -492 -201 123 410 552 514 225 48 -522 -504 -397 -240 -43
1787 -43 217 427 489 337 16 -193 -602 -456 -522 -88 188 419 518 518 211 -167 -395 -628 -294 -207 79 409
1809 409 586 508 108 -155 -327 -323 -320 -116 49 342 446 513 198 -110 -391 -486 -310 -198 111 298 245 501 369
1832 369 -87 -374 -470 -278 -199 -52 310 449 456 391 221 -216 -421 -419 -459 66 224 421 349 453 17 34 -238
1855 -238 -440 -134 -231 71 218 441 235 243 -152 -271 -371 -430 -193 -20 183 138 228 100 18 -225 -491 -335
1877 -335 -164 -114 120 444 241 282 46 -145 -341 -473 -118 -141 24 329 255 276 143 -203 -442 -377 -344 10
1899 10 15 252 330 351 115 -111 -146 -379 -414 -214 -67 423 496 263 125 60 -94 -426 -269 -25 155 126 330
1922 330 408 163 14 2 -312 -414 -339 -230 73 194 378 240 138 -30 -97 -372 -288 -246 38 240 380 375 154
$$ packed form
1765c85K89J74N60r7M2l01m64m34O1O3K91L24K87J42l8k89j77n70J8J07J57J97
1787d3K60K10O2j52l21k09m09J46o6M34K76K31R9%l07l78k28k33L34Q7K86L30
1809D09J77p8m00k63j72MLK04J65K93J04O7l15l08k81r5J76J12L09J87n3K56j32
1832C69m56k87r6J92P9J47L62J39Po5j70m37k05Km0N25J58J97p2J04m36J7k72
1855b38k02L06r7L02J47K23k06Ql95j19j00n9K37J73K03m5R0j28q2k43k66J56
1877c35J71N0K34L24k03M1k36j91j96j32L55k3J65L05p4K1j33l46k39O5L3L54
1899A0NK37P8K1k36k26l5k33l5K00J47M90P3k33j38o5j54l32J57K44J80k9K04
1922C30P8k45j49j2l14j02P5J09L03J21J84j38j02j68o7k75Q4M2K84K02J40nk21
$$ plain form
1945 154 -192 -417 -233 -200 -164 0 281 296 390 172 -105 -366 -244 -393 -325 -53 286 319 281 162 124 -105 -287
1968 -287 -406 -285 2 150 392 217 176 280 21 -172 -285 -333 -125 11 247 463 314 170 -5 -336 -331
1989 -331 -570 -54 26 221 202 253 92 139 -119 -234 -305 -122 -147 142 256 280 281 26 -236 -297 -380 -223 9 116
2013 116 253 497 247 52 105 -338 -215 -122 -260 4 263 182 239 121 -101 -153 -306 -252 -265 -44 128 201 165
2036 165 267 -151 -171 -181 -361 -176 83 177 219 229 222 121 -71 -215 -297 -234 -195 35 188 275 321 108 4 -345
2060 -345 -115 -267 -1 -149 -50 273 84 306 -42 -236 -302 -335 -242 -109 91 366 244 236 218 -191 -298 -240 -174
2083 -174 -126 59 120 226 254 89 -172 -223 -221 -360 -138 82 239 186 307 190 -228 -265 -192 -113 -169 -63 181 258
2107 258 259 171 90 -182 -187 -110 -291 -170 -5 311 204 269 16 -302 -174 -177 -108 -132 194 50 62 381 39 -35 -202
$$ packed form
1945A54l46k25J84L3L6J64K81J5R4k18k77k61J22j49O8K72L39L3l8j19l8k29j82
1968b87j19J21K87J48K42j75m1J04k59j93j13m8K08J36K36K16j49j44j75l31N
1989c31k39N16Q0J95j9N1j61M7k58j15p1J83k5K89J14K4Jk55k62o1q3J57K32J07
2013A16J37K44k50j95N3m43J23R3j38K64K59q1N7j18k22n2j53N4j3K21J72P3l6
2036A65J02m18k0j0j80J85K59R4M2J0pj01j92j44q2O3L9K30J53Q7M6k13j04l49
2060c45K30j52K66j48R9L23j89K22l48j94o6l3R3J33K00K75j22qj8m09j07N8O6
2083a74M8J85O1J06K8j65k61n1Kj39K22K20J57n3J21j17m18l7P3P9n6J06K44P7
2107B58Jq8q1k72nP7j81J21J65L16j07O5k53l18J28lO9k4L26j44J2L19l42p4j67
$$ plain form
2132 -202 -194 -113 -131 146 193 182 15 123 -9 -190 -260 -244 55 -84 215 163 148 -134 137 17 -76 -255 -87 -113
2156 -113 -91 275 319 287 -199 -74 -210 -192 -163 19 -78 110 275 55 163 -83 -126 -242 -174 -35 29 -63 179
2179 179 43 85 -18 -114 -139 -249 -200 19 81 -9 215 100 4 -53 -252 -32 -216 -82 59 44 270 23 94
2202 94 -158 -104 -196 -194 -89 299 -69 -66 102 75 -91 -159 -146 -173 -122 58 43 123 78 51 -59 -81 -139 -139 -235 -24 16
2229 16 72 267 159 25 -162 -156 -209 -71 20 87 183 163 39 -37 -238 -28 -165 -185 75 61 83 240 247 -41 -160
2254 -160 -204 -170 -419 -74 109 93 54 102 150 44 -163 -119 -186 -34 23 160 23 233 231 154 120 -221 -138 -135 -155 -73
2280 -73 127 234 59 47 -48 -148 -281 41 20 -13 148 107 124 121 -10 -163 -152 -81 -88 33 227 313 1 -32 -5
2305 -5 -240 -112 -107 -102 54 71 65 145 145 32 -63 -120 -62 31 -166 252 135 126 3 -57 -118 36 -88 -84 12 110 -14 41
$$ packed form
2132b02QQ1j8K77M7j1j67J08j32j81p0J6K99j39K99n2j5k82K71j20r3j79J68k6
2156a13K2L66M4l2m86J25j36J8K9J82r7J88J65k20J08k46m3j16O8J39O4r2K42
2179A79j36M2j03r6k5j10M9K19O2r0K24j15r6n7j99K20j84J34J41j5K26k47P1
2202I4k52N4r2KJ05L88l68LJ68k7j66o8J3k7N1J80j5Q0m5k7j10k2n8%r6K11M0
2229A6N6J95j08j34j87On3J38R1O7R6k0j24p6k01K10j37k0K60j4K2J57Pk88j19
2254a60m4L4k49L45J83j6l9M8M8j06k07M4o7J52N7J37j37K10kp7l4l41Q3Lk0Q2
2280g3K00J07j75j2r5j00j33L22k1l3J61m1J7lj31j53J1P1pJ21J94Q6l12l3K7
2305ek35J28NNJ56J7oQ0%j13r5n7N8R3j97M18j17rj23o0o1J54j24MR6R8j24N5
$$ plain form
2333 41 61 107 115 -158 -207 -149 -99 122 67 8 107 84 -20 21 -213 -172 -29 -17 -80 45 80 88 -6 51 -271 -130 -183
2360 -183 -171 251 75 335 124 -3 -73 -174 -38 -92 -27 92 -60 102 265 227 -133 -114 -125 -81 92 10 98
2383 98 -16 266 3 -15 -220 -109 60 -278 -29 78 161 43 46 256 -98 38 -332 -20 -40 105 150 148 73
2406 73 -3 16 -343 -104 -114 -102 37 31 106 87 61 35 -80 -330 -261 -72 25 162 139 -37 -82 -139 -30 -174 -176 -75
2432 -75 -168 136 170 126 217 22 189 -241 -158 -219 37 46 -17 83 146 -237 -12 7 -198 -209 99 34 63 171 82
2457 82 -5 -118 -27 -80 67 34 -75 66 109 152 152 -47 -30 -151 -107 -23 -31 309 140 146 125 160 -79 -154 0 -269
2483 -269 112 26 10 21 240 86 -54 -71 -137 -110 -17 16 149 321 301 -17 79 -18 -241 -243 -139 57 62 93 -64
2508 -64 20 28 -17 -187 -139 -126 19 37 35 133 -42 59 -117 -261 -292 114 78 141 219 200 156 112 -49 57 -224 -159
$$ packed form
2333D1K0M6Qk73m9N8N0K21n5n9R9k3j04M1k34M1J43J2o3J25L5Qr4N7l22J41n3
2360a83J2M22j76K60k11j27p0j01J36n4O5J19j52J62J63l8l60J9j1M4J73q2Q8
2383I8j14K82k63j8k05J11J69l38K49J07Q3j18LK10l54J36l70L12k0J45M5kp5
2406G3p6J9l59K39j0J2J39oP5j9k6k6j15k50O9J89R7J37k3j76m5n7J09j44kJ01
2432g5r3L04L4m4R1j95J67m30Q3o1K56Ro3J00O3l83K25J9k05j1L08o5K9J08q9
2457H2q7j13R1n3J47l3j09J41M3M3%j99J7j21M4Q4qL40j69Ok1L5k39p5J54k69
2483b69L81q6j6J1K19j54j40j7o6K7R3L3J33J72k0l18R6r7k23kJ04J96NL1j57
2508f4Q4Qm5j70M8J3J45J8kR8j75J01j76j44l1M06l6O3P8j9m4m4j61J06k81O5
$$ plain form
2534 -159 -56 78 342 99 191 94 -40 -5 -268 -39 -340 172 28 189 160 102 -51 -165 -80 -156 -62 -65 70
2557 70 202 362 -80 -24 -160 -42 -155 -61 104 -62 90 194 114 76 -151 -166 -184 -158 -122 128 133 281 80 76
2581 76 -79 -205 -259 -130 -165 -31 -59 240 223 65 43 -91 -239 -168 -124 -90 -1 149 65 190 -104 66 -171 -297
2605 -297 -21 -31 91 79 365 71 -58 15 -213 -43 40 -163 46 74 -20 -20 14 99 -51 -181 11 -148 -112 100
2629 100 147 307 64 -115 -99 -85 -165 6 -62 147 132 121 111 121 -25 -123 -274 -159 60 169 201 181 7 58
2653 58 -114 -147 -177 -153 -146 62 92 26 -16 52 -142 -67 -285 -60 -156 -136 -83 86 166 55 81 -69 -22 -75 -19 -84 140
2680 140 22 92 26 -29 -219 -119 14 -93 -15 69 131 1 178 -1 78 70 -157 -184 -65 134 46 176 46 81
2704 81 9 -2 -135 -195 -94 137 -35 124 191 10 -150 -154 -177 -248 -176 29 117 203 300 17 154 -9 -97 -50 -63
$$ packed form
2534a59J03J34K64k43R2r7j34L5k63K29l01N12j44J61k9n8j53j14Q5p6R4lJ35
2557G0J32J60m42N6j36J18j13R4J65j66J52J04q0l8k27j5j8K6L6K50NJ48k01m
2581G6j55j26n4J29l5J34k8K99j7j58k2j34j48P1M4L4Q9J50q4J25k94J70k37j26
2605b97K76j0J22j2K86k94j29P3k28J70Q3k03K09K8r4%L4Q5j50j30J92j59L6K12
2629A00M7J60k43j79J6J4q0J71o8K09j5j1j0J0j46r8j51J15K19J09L2k0j74N1
2653E8j72l3l0K4PK08L0o6m2O8j94P5k18K25r6K0N3J69Q0j11K6j50M7n3N6o5K24
2680A40j18P0o6n5j90J00J33j07P8Q4O2j30J77j79P9qk27k7J19J99q8J30j30L5
2704H1p2j1j33o0J01K31j72J59O7j81j60mk3p1P2K05Q8Q6R7k83J37j63q8M7j3
$$ plain form
2729 -63 71 49 83 75 7 -13 161 -256 -63 -196 -282 8 130 252 115 -112 -6 -188 -3 -40 111 84 65 26
2753 26 254 24 -102 -19 18 -54 -45 63 -52 25 101 80 15 -55 -135 -159 -187 -51 93 164 147 180 114 70 66 -196 -176
2780 -176 -10 147 77 93 97 -65 106 -76 -93 -8 -17 -85 229 242 189 121 112 -4 -169 46 90 19 -3 13 -110 58
2806 58 -2 -67 -28 38 -102 -108 53 22 70 -47 37 33 -146 -101 -86 -220 57 -17 61 -29 -91 19 -19 -135 -98 49 60
2833 60 -78 -23 62 71 62 -54 -224 -116 -170 -73 54 84 -1 95 221 -89 -215 -162 -9 -134 2 -85 217 36 6
2858 6 -91 -198 52 -108 79 3 100 96 13 161 -94 -192 105 129 -178 130 98 -112 14 78 -60 29 50 31 4
2883 4 -24 -35 -38 175 -98 -19 -152 -166 -80 47 -119 -147 35 34 -36 108 165 7 -52 85 74 61 -52 140 84 84 58
2910 58 -74 -113 47 -194 -41 116 103 -51 102 -26 -79 -46 -98 -170 -92 -64 -41 21 115 -103 39 -148 -141 -99 59
$$ packed form
2729f3J34k2L4qo8k0J74m17J93j33q6K90J22J22j37k27J06j82J85l7J51k7j9l9
2753B6K28k30j26Q3L7p2RJ08j15P7P6k1o5p0q0k4k8J36J44P1j7L3o6m4mk62K0
2780a76J66J57p0J6Mj62J71j82j7Q5ro8L14J3n3o8rj16j65K15M4p1k2J6j23J68
2806E8o0o5L9O6j40oJ61l1M8j17Q4mj79M5J5j34K77p4P8r0o2J10l8j16L7J47J1
2833F0j38N5Q5Rrj16j70J08n4R7J27L0q5R6J26l10j26N3J53j25J36q7L02j81l0
2858Fr7j07K50j60J87p6R7mq3J48k55r8K97K4l07L08l2k10J26O4j38Q9K1j9k7
2883Dk8j1lK13k73P9j33j4Q6J27j66k8J82jp0J44N7j58n9J37j1j3j13J92n6%k6
2910E8j32l9J60k41J53J57j3j54J53j28n3L3n2p2P8K8K3O2R4k18J42j87PM2J58
$$ plain form
2935 59 57 -51 44 158 -68 111 54 -82 86 -35 30 -37 15 118 -22 -174 -85 26 15 79 -30 -3 23 72 164
2960 164 12 -12 -127 -6 2 -99 -59 -26 179 -53 -71 106 -11 59 -31 2 -35 46 197 39 240 -6 -80 174
2984 174 5 -27 -136 56 130 239 8 -136 12 51 100 -77 112 193 140 -3 42 96 177 -41 -35 3 9 -35 9
3009 9 -18 172 -84 29 43 102 45 -12 23 -18 51 -52 -146 161 -116 -170 146 106 -38 -26 173 -4 -38 -40 48 154
3035 154 -38 -50 111 185 0 -73 103 40 7 -52 -9 -11 30 101 -92 68 -48 -67 -75 -185 -100 57 66 94 59 -76
3061 -76 -24 8 -84 174 77 -68 -192 -2 85 32 84 16 -7 -67 -80 101 -133 -2 237 97 200 64 27 129
3085 129 47 28 -206 -37 183 43 71 -2 -85 51 -28 -143 97 -143 68 238 -88 20 99 -71 81 -133
3107 -133 68 167 56 64 -79 67 -36 62 52 140 107 -161 -88 80 247 58 -24 23 -28 174 -63 -10 -56 -35 -29
$$ packed form
2935E9kj08R5J14k26J79n7j36J68j21O5o7N2J03j40j52Q9J11j1O4j09K7K6M9R2
2960A64j52k4j15J21Qj01M0L3K05k32j8J77j17P0r0L3l7Q1J51j58K01k46p4K54
2984A74j69l2j09J92P4J09k31j44J48L9M9j77J89Q1n3j43M5N4Q1k18OL8Om4M4
3009Ik7J90k56J13J4N9n7n7L5m1O9j03r4L07k77n4L16m0j44J2J99j77l4kQ8J06
3035A54j92j2J61P4j85p3J76o3l3n9M3kM1P1j93J60j16j9qj10Q5J57RK8l5j35
3061g6N2L2r2K58r7j45j24J90Q7n3N2o8k3o0j3J81k34J31K39j40J03j36l7J02
3085A29q2j9k34J69K20j40K8p3q3J36p9j15K40k40K11J70l26J08P9j70J52k14
3107a33K01R9j11Qj43J46j03R8j0Q8l3k68P3J68J67j89q2M7n1K02k37N3m6K1O
$$ plain form
3132 -29 -79 204 20 51 24 -53 48 -88 41 72 95 -91 -43 151 26 -91 -22 15 0 -3 -224 -84 -87 -55 58
3157 58 33 60 86 153 133 -23 -38 76 82 -76 -4 -95 -71 19 -142 -46 109 -42 57 6 -33 30 -139 13 -4 -50 -120
3184 -120 -78 71 -181 -43 -115 -52 -131 -33 -59 -3 -3 63 34 -35 -25 22 87 -133 35 16 47 31 -19 71 11 -62 -167
3211 -167 343 84 69 -123 194 -63 -26 95 -209 182 -93 -25 63 -22 115 5 -120 -112 17 80 38 -27 50 46
3235 46 65 144 99 -41 -97 -182 6 -265 -44 27 80 107 22 -49 76 31 24 -81 -30 52 -56 51 19 -83 22 29
3261 29 60 133 -17 64 -92 -22 -8 81 -47 -81 -140 49 -29 232 27 155 154 -81 174 155 -47 77 -37 -39 13
3286 13 25 16 44 76 -71 -109 49 21 12 47 -71 -100 2 117 -60 7 -192 -10 38 -93 -49 89 125 -28 -46 -114
3312 -114 108 -67 -38 -4 -109 30 89 -87 84 -4 -83 -24 -13 -45 15 26 95 -99 174 49 10 100 91 17 71 113
$$ packed form
3132b9n0K83j84L1k7p7J01j36J29L1K3j86M8J94j25j17O9L7j5lk21J40lL2J13
3157E8k5K7K6O7k0j56j5J14Oj58P2r1K4R0j61R6J55j51R9n1l9O3j69J52j7m6p0
3184a20M2J49k52J38p2O3p9R8k6N6%O6k9o9J0M7O5k20J68j9L1j6n0R0o0p3j05
3211a67N10k59j5j92L17k57L7J21l04L91k75O8Q8q5J37j10j25QJ29O3m2o5P7m
3235D6J9P9m5j40n6q5J88k71K21P1N3K7q5p1J25m5pj05N1Q2j08J07l2j02J05P
3261B9L1P3j50Q1j56P0J4Q9j28l4n9J89p8K61k05J28jk35K55j9k02J24j14kN2
3286A3J2rK8L2j47l8J58k8rL5j18k9J02J15j77O7j99J82M8j31M4J38L6j53j8o8
3312a14K22j75K9L4j05J39N9j76J71q8p9N9J1l2O0J1O9j94K73j25l9R0rp4N4M2
$$ plain form
3338 113 87 28 99 78 -184 12 24 -40 -120 108 -82 137 199 -6 27 142 51 83 44 29 92 -75 39 143 49
3363 49 139 44 122 -73 -194 0 -137 36 146 -37 31 -102 -62 101 -12 187 -49 169 -30 0 68 200 70
3386 70 83 104 83 -24 -56 -149 68 -64 -46 -10 -106 12 -112 -45 -53 15 -103 -1 105 -31 -37 55 -103 -134 -59 44
3412 44 23 68 -59 -114 125 -106 135 -156 -18 -54 -13 26 96 -72 33 4 62 -229 -6 -2 -54 -27 -7 186 -27
3437 -27 87 119 -92 37 -27 -15 18 180 5 29 53 -34 -1 37 2 53 -8 -70 -56 -38 216 -72 -21 -42 -29 55 -41
3464 -41 -8 69 -23 109 -70 191 -46 -57 89 -36 -25 -60 -115 98 -111 57 -193 -230 81 -70 32 114 18 -153
3488 -153 125 -107 -76 -91 111 117 -26 107 -94 -3 -25 117 36 -19 -55 1 -39 68 -20 59 -160 -12 88 131 56
3513 56 29 -49 -146 -134 -70 -67 17 -27 118 -86 -84 -43 120 34 -8 61 22 -159 -94 22 68 -6 52 -32 -61 118 -86 38
$$ packed form
3338A13k6n9P1k1k62J96J2o4q0K28j90K19O2k05L3J15r1L2l9j5O3j67J14J04r4
3363D9R0r5P8j95j21J94j37J73J10j83O8j33M0J63j13J99k36K18j99L0O8J32j30
3386G0J3K1k1j07l2r3K17j32J8L6r6J18j24O7qO8j18J02J06j36oR2j58l1P5J03
3412D4k1M5j27n5K39k31K41k91J38l6M1L9P0j68J05k9N8k91K23Mn2K7K0J93k13
3437b7J14L2k11J29o4J2L3J62j75K4K4q7L3L8l5N1o1o2J4J8K54k88N1k1J3Q4r6
3464d1L3P7r2J32j79K61k37j1J46j25J1l5n5K13k09J68k50l7L11j51J02Q2r6j71
3488a53K78k32L1j5K02Oj43J33k01R1k2J42q1n5l6N6m0J07q8P9k19J48J00M3p5
3513E6k7p8r7J2O4LQ4m4J45k04KM1J63q6m2O9l9j81O5J16M6p4N8q4k9J79k04J24
$$ plain form
3541 38 -31 6 142 -38 88 -79 -111 13 24 -8 62 174 -55 -159 -12 30 -51 63 -98 3 5 36 14 -73 13
3566 13 121 23 -203 -92 78 27 115 -70 -277 -111 -86 64 -143 6 107 -11 -17 -2 -140 -157 41 11 -80 -99
3590 -99 96 155 -51 21 156 85 -120 18 -231 -43 -54 -20 -36 -24 -130 -178 64 2 -26 -64 161 11 162 -76
3614 -76 1 160 -88 -49 0 37 -19 57 69 -14 -87 0 13 -3 -35 -158 -89 -20 -197 -103 -17 25 15 7 7 -163 -174 -10
3642 -10 101 -55 125 11 -98 21 81 -161 -223 22 -53 23 -49 227 -29 -40 -54 -5 -17 42 -177 16 -16 147
3666 147 -80 4 10 -169 165 -86 197 44 81 22 145 -29 76 -15 -7 -179 -115 128 31 -47 -3 -16 -155 -60 8
3691 8 81 -45 -81 26 111 -67 -139 85 -29 8 -24 -4 -187 -101 71 -31 -196 -15 -127 49 -47 -8 -19 116
3715 116 117 -66 127 -46 -158 -162 -34 -61 104 -94 -107 -1 -76 -132 33 -175 -52 -116 8 46 -50 24 33 61 -48
$$ packed form
3541C8o9L7J36j80J26j67l2J24J1l2P0J12k29j04J47M2q1J14j61J01KL1k2q7Q6
3566A3J08r8k26J11J70n1Q8j85k07J66K5J50k07J49J01j18oJ5j38j7J98l0r1j9
3590i9J95N9k06P2J35p1k05J38k49J88j1L4j6J2j06m8K42o2k8l8K25j50J51k38
3614g6P7J59k48L9M9L7n6P6J2q3p3Q7J3j6l2j23O9O9j77R4Q6M2j0q%j70j1J64
3642a0J11j56J80j14j09J19O0k42o2K45p5P6p2K76k56j1j4M9j2N9k19J93l2J63
3666A47k27Q4Oj79L34k51K83j53L7n9J23j74J05r1Qj72O4K43r7p8M4j3j39R5O8
3691HP3j26l6J07Q5j78p2K24j14L7l2K0j83Q6J72j02j65J81j12J76r6L9j1J35
3715A16Jj83J93j73j12mJ28k7J65j98j3J06p5n6J65k08J23o4J24L8r6P4RK8j09
$$ plain form
3740 -48 25 33 39 1 147 -36 -59 -104 -102 -48 8 -9 123 13 -47 -88 52 56 -113 -161 -100 55 41 80 -58 122 121 116 -215
3769 -215 -173 30 80 -109 -112 -11 -79 -25 -63 67 -75 28 -69 -33 44 40 -140 -75 -5 -75 -55 137 -39 -238 121
3794 121 37 -61 133 96 -20 -15 92 27 109 111 -15 -86 188 56 73 14 -89 15 -102 -120 -1 70 -94 39 85
3819 85 -133 118 36 -183 -75 16 16 135 41 -153 -35 47 105 21 -40 -205 -126 -38 46 -34 39 109 48 -10 47 -32 -38
3846 -38 196 123 226 -81 -15 -29 1 -1 45 -104 16 104 113 107 25 91 56 -75 66 -87 -33 -25 -59 191 -72 -33 -53
3873 -53 -241 -78 35 1 -34 45 -17 32 82 -4 -87 -50 -51 72 -100 106 37 17 109 82 -91 99 12 -18 89 9
3899 9 -44 147 -136 78 -22 51 -1 -78 101 -47 29 -20 -201 42 -133 -79 -37 -33 96 -143 -129 64 -53 -145 27
3924 27 -105 -16 -68 -17 -37 42 -7 -25 138 -56 9 144 46 -49 113 210 86 4 113 23 -4 -153 -42 63 0
$$ packed form
3740d8P3QOl8J46j83k3m5KN4N6j7J32j10o0m1J40Mj69m8O1J55j4L9j38J80jnl31
3769b15M2K03N0j89lJ01o8N4l8J30j42J03r7L6P7mj80O5P0p0K0J92j76j99L59
3794A21q4r8J94l7j16NJ07o5Q2Kj26p1K74j32J7n9j03J04j17j8J19P1j64J33M6
3819H5k18K51q2k19J08R1%J19r4j94J18Q2N8q4o1j65P9Q8Q4q0P3P0o1n8N7p9o
3846c8K34p3J03l07O6j4L0kM6j49J20Q8Roq2O6l5j31J41j53N4Ql4K50k63L9k0
3873e3j88J63J13l4l5P9o2M9N0q6q3L7jJ23j72K06o9k0R2k7j73J90q7l0J07q0
3899In3J91k83K14j00P3n2p7J79j48P6m9j81K43j75N4M2MJ29k39J4J93j17r2J72
3924B7j32Q9n2N1k0P9m9j8J63j94O5J35r8r5J62R7j24q2J09r0k7j49J11J05o3
$$ plain form
3949 0 -67 44 12 -126 -130 147 54 -65 1 -22 -63 137 178 -11 -52 -45 -35 123 -33 -18 103 149 64 -50 70 -7
3975 -7 182 -113 -160 34 18 -115 66 37 -71 -48 69 -22 -116 -19 -133 133 178 -335 35 -53 -30 -34 -62 161 52
4000 52 -29 47 75 92 -40 -77 -17 9 -13 29 50 81 46 -68 -103 91 148 77 37 53 62 -135 76 55 -76 72 126
4027 126 97 -50 141 -6 25 -130 -68 87 -37 40 49 36 43 -56 157 -84 97 -30 -10 34 -15 90 60 87 2
4052 2 152 23 166 -104 -3 4 -31 85 155 -40 -23 -112 200 -58 -13 15 -70 -14 -23 144 113 -52 19 74 87 -184
4078 -184 147 -93 -195 -17 81 58 -127 136 -1 58 90 166 -162 -18 -4 -15 -55 108 -35 -111 101 68 6 92
4102 92 17 46 86 35 123 -27 61 -63 43 83 -74 76 -63 -39 -47 -25 24 -88 -72 91 -50 126 198 -2 92
4127 92 -145 -43 -36 -81 -33 75 59 61 -113 11 -36 -12 62 -48 -40 -45 -72 -26 11 -104 30 64 -65 3 105 44 68
$$ packed form
3949@o7J11l2j38mK77r3j19O6k3m1K00M1j89m1PJ0J58j56J5J21M6q5j14J20p7
3975gJ89k95m7J94j6j33J81k9j08K3J17r1r4R7j14K66M5n13L70q8K3mk8K23j09
4000E2q1P6K8J7j32l7O0K6k2M2K1L1l5j14l5J94N7p1m0J6Rj97K11k1j31J48N4
4027A26k9j47J91j47L1j55O2J55j24P7Rj3Pr9K13k41J81j27K0M4m9J05l0K7q5
4052BJ50j29J43k70J01Pl5J16P0j95J7q9L12k58M5K8q5N6rJ67l1j65P1N5J3k71
4078a84L31k40j02J78R8k3j85K63j37N9L2P6l28J44J4j1m0J63j43p6K12l3o2Q6
4102I2p5K9M0n1Q8j50Q8j24J06M0j57J50j39K4qK2M9j12J6J63j41J76P2k00R4
4127I2k37J02Pm5M8J08j6Kj74J24m7K4P4j10Qnk7M6L7j15J34L4j29O8J02o1K4
$$ plain form
4154 68 -115 45 10 -142 -34 -68 5 38 70 -67 93 56 71 -191 68 -45 38 -25 43 -44 72 -15 -48 -40 47 56
4180 56 57 38 -119 62 -25 -19 116 64 -35 -17 -83 -113 95 -35 68 46 65 46 59 32 -51 -147 -14 -35 89 -95 -76
4207 -76 -29 -236 47 3 -152 67 -139 11 37 -155 80 -21 2 118 82 55 -122 -34 27 59 -83 21 -36 84
4231 84 -116 18 20 182 -27 179 37 -77 -262 54 -70 -94 -68 63 85 4 60 56 -132 -46 -55 118 -101 53
4255 53 96 -96 52 43 2 -94 83 -146 20 204 -86 138 -119 -7 85 71 113 22 62 58 -18 105 -87 149 -24
4280 -24 69 105 7 -49 129 -26 185 12 77 21 52 87 -58 74 10 -86 90 81 -74 -197 -120 60 -127 -56 -62 6
4306 6 -49 -35 -29 57 86 77 -20 -65 14 -67 -101 -42 -10 -28 -80 27 46 -147 19 -92 -87 38 -30 90 77 127 59 -49 -94
4335 -94 -121 -97 38 42 -106 -99 -126 -20 66 29 81 3 241 14 9 24 11 31 291 -81 -26 -39 64 112 135 142 22 -68
$$ packed form
4154F8j83J60l5j52J08l4P3L3L2j37J60l7J5k62K59j13Q3o3O8q7J16q7l3QQ7R
4180E6Jj9j57J81q7OJ35n2r9J8o6l0K08j30J03k2J9j9J3k7q3r6J33k1J24j84J9
4207g6M7k07K83m4j55K19k06J50K6j92K35j01K3J16l6k7j77Q8O1L2j42J04n7J20
4231H4k00J34KJ62k09K06j42j14j85L16j24k4K6J31K2q1N6mj88Q6rJ73k19J54
4255E3M3j92J48rm1r6J77k29J66J84k90K24k57J12R2j4M2r1M0mp6J23j92K36j73
4280b4R3L6r8n6J78j55K11j73O5n6L1L5j45J32o4r6J76rj55j23P7J80j87P1oO8
4306Fn5J4OQ6K9rr7m5P9q1l4N9L2j8n2J07J9j93J66j11NJ25o8J20j3N0o8j08m5
4335i4k7K4J35Mj48Pk7J06Q6l7N2p8K38k27nJ5j3K0K60l72N5j3J03M8K3Pj20r0
$$ plain form
4363 -68 221 26 64 158 22 98 18 -124 3 -75 102 -3 24 93 -73 76 -41 -6 -127 36 133 64 29 16
4387 16 122 -40 48 -41 30 233 -22 111 67 138 -138 144 5 -97 67 -2 -52 28 51 151 156 16 -70 -11 -131
4412 -131 4 5 0 -69 -33 100 -66 -78 83 -80 -65 -37 52 9 -150 -137 -127 64 -180 46 77 -132 96 199 -130
4437 -130 -76 -87 -147 66 51 -153 26 -53 -27 -38 -66 25 -29 -40 -84 75 -157 45 -8 -166 27 198 251 94 -125
4462 -125 -121 51 41 98 -158 -131 -108 -84 6 120 180 -62 67 -146 91 57 -29 -80 13 -196 -15 -43 135 12 39
4487 39 71 40 198 -39 -87 -31 163 21 -169 -166 -88 -71 224 -183 77 -2 -70 -30 -79 51 -92 -16 -27 151 116
4512 116 54 -3 25 -18 86 17 22 -66 48 45 18 -65 -91 99 -30 -103 69 -57 -175 -25 -3 -66 150 41 11 3
4538 3 83 184 -134 26 -13 -4 -108 -63 38 105 -61 -95 -12 -22 -152 137 21 -31 37 -56 12 -75 112 145 -224 83
$$ packed form
4363f8K89j95L8R4j36P6q0j42J27p8J77j05K7O9j66J49j17L5j21J63R7o9l5j3
4387A6J06j62Q8q9P1K03k55J33m4P1k76K82j39j02J64o9n0Q0K3J00Nj40q6N9j20
4412a31J35Jno9L6J33j66j2J61j63J5K8Q9m3j59J3J0J91k44K26L1k09K28J03l29
4437a30N4j1o0K13j5k04J79p9K6j1k8R1n4j1m4J59k32K02n3j58J93J71N3j57k19
4462a25MJ72j0N7k56K7K3K4R0J14O0k42J29k13K37l4q6n1R3k09J81k8J78j23K7
4487C9L2l1J58k37m8N6J94j42j90LP8J7K95m07K60p9o8M0m9J30j43P6j1J78l5
4512A16o2n7K8m3J04o9Nq8J14lk7q3k6J90j29p3J72j26j18J50K2o3K16j09l0q
4538CQ0J01l18J60l9Rj04M5J01O7j66l4Q3j0j30K89j16n2O8r3O8q7J87L3l69L07
$$ plain form
4564 83 31 -20 99 61 -49 -109 -28 -69 -22 -79 70 21 57 2 -46 -69 -83 180 -5 -78 18 -13 -30 6 -32 -85 -30 -119
4592 -119 -210 -78 175 -73 208 68 207 -111 -37 82 13 -83 78 -28 -52 144 5 -113 15 59 41 60 76
4615 76 162 -78 16 -11 -176 -77 24 65 185 -41 -9 -112 74 -101 110 -6 -80 54 -18 -47 -9 -84 -32 99
4639 99 -219 211 -49 -45 141 120 -49 46 141 -142 60 -79 74 -136 9 32 -166 -9 -68 -114 12 0 129
4662 129 37 89 43 26 63 63 -47 -19 -53 60 45 -117 15 -76 -59 74 86 -46 -25 119 23 4 -46 109 129 82
4688 82 -36 -98 68 -13 -11 137 69 -57 65 36 -61 62 13 -68 -67 -39 85 -42 -158 -109 56 -63 -204 -103 71
4713 71 19 139 -20 -56 44 132 -4 89 27 82 -20 126 37 -159 76 22 84 208 17 15 -7 40 129 60 102 66
4739 66 -15 112 -74 86 96 -33 -3 63 -24 -44 9 -48 115 -5 54 -9 70 27 30 -68 235 166 -88 -77 -59 106
$$ packed form
4564H3n2n1J19l8j10o0Q1m1M7n7J49m9L6n5m8k3j4K63j85p3R6l1j7L6l8n3N5q9
4592a19r1J32K53k48K81j40J39l18P4J19o9r6J61j06k4J96j39j18J28M4j8J9J6
4615G6Q6k40R4k7j65R9J01M1J20k26L2j03J86j75K11j16p4J34p2k9L8p5N2J31
4639I9l18M30k60MJ86k1j69R5R5k83K02j39J53k10J45K3j98J57n9m6J26j2J29
4662A29r2N2m6j7L7%j10K8l4J13j5j62J32r1J7J33J2j32K1J44r6j9n0J55K0m7
4688H2j18o2J66q1KJ48o8j26J22k9r7J23m9q1JK8J24j27j16M9J65j19j41J01J74
4713G1n2J20j59l6J00Q8j36R3o2N5j02J46q9j96K35n4O2J24j91kk2M7Q9o9M2l6
4739F6q1J27j86J60J0j29L0O6q7k0N3n7J63j20N9o3P9m3Lr8L03o9k54J1J8J65
$$ plain form
4765 106 76 -85 -41 139 33 39 60 53 -68 15 49 -51 110 -30 -53 35 -4 -59 7 68 45 39 -76 -25 63 26 -90
4792 -90 145 -171 53 69 -75 109 -9 90 33 124 -62 101 -73 82 108 80 44 -36 67 98 54 49 -33 55 -143
4817 -143 -128 -22 -54 44 115 5 29 -61 -108 -137 -126 -110 35 252 -100 -5 149 -18 -119 -46 -74 -15 -26 68 -26 105
4843 105 -45 44 -53 -102 -76 -154 57 -115 161 19 -107 -41 -61 79 -17 -86 90 135 33 64 -51 -61 16 86 -86
4868 -86 -58 19 -168 -66 26 -37 -66 114 -39 12 2 -68 121 -51 -30 -136 -133 -91 -46 -20 107 -60 129 -26 94
4893 94 72 75 -73 35 114 -42 141 -77 64 111 46 27 32 -27 4 -17 30 59 21 26 -18 -122 28 -90 192 11
4919 11 -96 33 -72 109 -18 83 -128 -89 36 -42 -79 48 24 6 -11 32 -6 -48 96 29 52 -19 0 34 -23
4944 -23 24 38 -69 -52 73 -30 135 82 11 -73 -194 146 19 16 -78 -58 -27 -128 -97 -66 70 72 -154 -43 -221
$$ packed form
4765A06l0j61M4J80j06OK1pj21Q3L4j00J61j40k3Q8l9n5O6O1k3oj15N1Q8l7j16
4792i0K35l16K24J6j44J84j18R9n7R1j86J63j74J55K6k8l6q0J03L1m4nq2Q8j98
4817a43J5J06l2R8P1j10K4r0m7k9J1J6J45K17l52R5J54j67j01P3k8N9j1R4r4J31
4843A05j50Q9r7m9K6p8K11j72K76j42j26O6k0J40r6o9J76M5j02L1j15j0P7P0j72
4868h6K8P7j87J02R2o3k9J80j53N1j0p0J89j72K1j06LM2M5K6J27j67J89j55J20
4893I4k2Lj48J08P9j56J83k18J41M7o5j9Nn9L1k1M7K9l8Nm4j04J50j18K82j81
4919A1j07J29j05J81j27J01k11L9J25p8l7J27k4j8j7M3l8m2J44o7K3p1J9L4n7
4944b3M7J4j07J7J25j03J65n3p1q4j21L40j27lr4K0L1j01L1L1J36Kk26J11j78
$$ plain form
4969 -221 33 94 39 9 36 35 -38 -6 74 6 -148 12 122 -84 -67 -14 -46 56 30 -91 -31 80 -31 -249 -110
4994 -110 -112 9 73 37 9 7 25 -104 29 -6 10 -133 53 116 -217 -84 -78 -27 126 -62 66 71 -33 -54 33 8
5020 8 -38 -17 -6 50 -62 -32 -74 -49 -11 -98 17 27 83 -65 14 146 -41 -92 -44 -29 -90 5 131 30 -73 -97 229
5047 229 18 -161 -21 -79 51 -10 230 69 71 5 140 76 -190 -174 -6 -60 40 37 27 32 -44 -54 -106 -83 -85 -242
5073 -242 128 -58 -67 182 159 47 64 65 48 36 47 -18 -87 83 -80 -82 3 6 28 -114 -118 -42 31 84 -122 58 15 102
5101 102 -27 79 74 57 -5 102 75 211 71 5 -1 -96 73 -72 -98 -75 28 -116 125 89 13 -19 124 -42 22
5126 22 73 -96 -112 23 -140 -12 -64 -86 -227 16 48 -41 -47 70 54 134 -116 154 -16 21 -152 -56 115 -104
5150 -104 68 -46 -2 88 -75 97 5 -12 -105 29 51 107 13 -20 -24 -135 -34 32 -184 6 42 11 58 -114 3
$$ packed form
4969b21K54O1n5l0K7jp3L2Q0o8j54J60J10k06J7N3l2J02k6j21O0J11j11k18J39
4994a10kJ21O4l6k8kJ8j29J33l5J6j43J86O3l33J33ON1J53j88J28Nj04k1Q7k5
5020Hm6K1J1N6j12L0m2K5L8q7J15J0N6j48P9J32j87n1M8J5o1R5J26j01j03k4L26
5047B29k11j79J40n8J30o1K40j61Ko6J35o4k66J6J68n4J00lj0Np6j0n2K3kj57
5073b42L70j86rK49k3j12J7Jj7j2J1o5o9J70j63kQ5LK2j42mP6P3N3k06J80m3Q7
5101A02j29J06nj7o2J07k7J36j40o6or5J69j45k6K3J03j44K41l6p6l2J43j66O4
5126B2N1j69j6J35j63J28n2k2j41K43L2q9oJ17j6Q0k50K70j70L7j73R6J71k19
5150a04J72j14M4R0j63J72r2j7r3J34K2N6r4l3mj11J01O6k16J90L6l1M7j72J17
$$ plain form
5175 3 -153 -156 81 -87 -52 -176 27 -145 -94 70 16 87 34 -65 -71 79 62 -36 -55 -131 1 34 85 -63 167 96
5201 96 140 89 38 -56 60 35 73 124 214 -31 -5 -40 -158 14 116 82 -208 220 29 -60 -213 -99 -47 8 15 -93
5227 -93 10 -109 45 8 -37 150 87 -204 -144 131 -107 -19 -31 -88 64 -29 90 -179 8 56 307 153 -19
5250 -19 77 -107 -129 4 -88 -132 -57 -41 153 20 -164 43 57 147 -72 -95 -19 31 115 -85 217 136 -27 70 37
5275 37 -26 71 135 67 -8 53 25 -46 17 -12 31 -12 109 -113 -13 -1 4 95 -63 -64 -150 32 41 -78 27 -47 -41 3 20
5304 20 22 13 -46 -43 -114 108 -5 -170 127 0 -38 55 87 33 -70 -53 -50 46 25 -57 35 -8 -143 -182 -82 138 -109
5331 -109 -97 -76 -218 22 116 -3 32 20 -14 -55 33 -79 -28 85 70 -55 4 39 -83 -215 7 6 55 -52 33
5356 33 -125 -90 -96 -78 30 275 12 117 121 -23 -70 -147 -22 50 109 41 63 -105 36 -51 19 -77 69 90 -23 50
$$ packed form
5175Cj56lK37j68L5j24K03j72N1J64n4P1n3r9oJ50j7r8j9p6J32L3N1j48K30p1
5201I6M4n1n1r4J16k5L8N1R0k45K6l5j18J72J02l4k90M28j91q9j53J14N2N5Pj08
5227i3J03j19J54l7m5J87o3k91O0K75k38Q8j2n7J52r3J19k69J87M8K51j54j72
5250a9R6j84k2J33r2m4P5J6J94j33j84K07J4R0k19k3P6N0Q4k00L02q1j63R7l3
5275C7o3R7O4o8p5O1k8p1O3k9M3m3J21k22J00J2NR1j58jq6J82Rj19J05p4OM4J7
5304B0Krn9Lp1K22j13j65K97j27l8R3L2n4j03J7LR6k1q2R2m3j35l9J00K20k47
5331a09J2K1j42K40R4j19L5j2l4m1Q8j12N1J13j5j25N9L5j22j32K22jM9j07Q5
5356C3j58L5oJ8J08K45k63J05Mj44m7p7J25P2N9o8K2j68J41q7P0r6J46K1j13P3
$$ plain form
5382 50 -61 -128 50 -12 -99 27 44 -158 119 7 -107 -3 -48 -9 -40 -42 -83 129 39 -86 136 -176 181 -223
5406 -223 -95 -108 -55 -165 59 -12 45 217 -117 -50 -102 22 -63 -169 118 -127 9 26 106 -8 -118 96 8
5429 8 -4 78 -61 88 -108 -9 54 1 -114 -5 107 -68 -29 -7 30 -189 -66 142 -39 53 -103 -7 16 33 -23
5454 -23 8 11 162 88 158 181 -129 -15 -53 98 -81 14 36 133 231 -115 23 -12 -21 -48 -48 73 0 -50 -146 -80 87
5481 87 -7 118 64 216 13 83 -11 47 -36 -98 -69 248 58 83 -36 65 82 64 128 -13 80 -7 26 71 -102 -74
5507 -74 205 -11 128 -25 -82 2 102 15 121 23 179 -136 68 52 62 -21 57 54 85 -24 -87 145 10 84 78
5532 78 -9 -93 47 0 -90 12 112 15 -13 -116 118 -107 -62 -58 -10 -50 14 -141 -9 -47 -80 -40 -22 64 -22 -84 11
5559 11 -81 112 -2 78 -45 10 -53 1 -87 -39 -20 21 37 147 61 -166 -120 -66 -93 -60 -167 34 49 188 -133 24
$$ packed form
5382E0j11o7J78o2q7J26J7k02K77j12j14J04m5L9l1km1K12r0j25K22l12L57m04
5406b23J28j3N3j10K24p1N7J72l34O7n2J24q5j06K87k45J36J7Q0j14j10K14q8
5429Hj2Q2j39J49j96R9O3n3j15J09J12j75L9K2L7k19J23K08j81R2j56R6K3J7n6
5454b3L1LJ51p4P0K3l10J14l8J51j79R5K2R7R8l46J38l5rk7%J21p3n0r6O6J67
5481H7r4J25n4J52k03P0r4N8q3o2K9L17j90K5j19J01J7j8O4j41R3q7L3M5j73K8
5507g4K79k16J39j53n7Q4J00q7J06r8J56l15K04j6J0q3P8lL1j09o3K32j35P4o
5532G8q7q4J40m7r0J02J00r7k8j03K34k25M5MM8m0O4j55J32l8l3M0J8Q6q6o2R5
5559A1r2J93j14Q0j23N5o3N4q8M8J9M1J6J10q6k27M6N4k7L3j07K01J5J39l21J57
$$ plain form
5585 24 -108 -132 43 -42 53 -80 88 61 39 90 37 23 54 70 182 22 86 133 -82 -117 -112 64 -19 -11 22 34 148
5612 148 -30 -51 -109 -133 -87 -87 -122 20 23 17 -165 -12 68 -18 65 160 165 -198 51 -20 95 42 47 52 -125 16 -139 -1
5640 -1 161 -78 -128 -14 86 10 -65 95 153 -62 -123 50 9 54 6 -20 -65 16 -8 111 67 -93 -101 10 -118 -73
5666 -73 -89 105 47 47 120 105 105 -32 -23 127 17 -50 36 8 123 57 -26 -37 31 -67 48 50 3 -142 -137 40 4 74 121
5695 121 -123 -74 -72 -10 35 -78 -88 -55 -25 59 33 125 40 -88 82 -81 -62 -12 -129 -50 202 53 -5 41 -3 49
5721 49 -89 47 -75 13 10 26 21 -43 0 -44 111 -237 -205 44 117 86 -27 -24 -116 199 -286 18 -50 -22 90 -76
5747 -76 135 -74 -37 51 4 -96 -18 34 147 7 17 55 -63 118 -99 72 82 28 17 102 51 188 -57 116
5771 116 -12 115 93 -11 111 155 117 100 19 88 -75 -7 25 -25 5 116 44 -87 -59 -95 29 -14 28 207 -100
$$ packed form
5585B4j32k4J75q5R5j33J68k7k2N1n3j4L1J6J12j60O4M7k15l5NJ76q3QL3J2J14
5612A48j78k1n8k4M6%l5J42Loj82J53Q0q6Q3R5Nl63K49p1J15n3NNj77J41j55J38
5640aJ62k39n0J14J00p6p5J60N8k15o1J73m1M5m8k6m5Q1k4J19m4j60qJ11j28M5
5666g3j6J94n8%P3j5%j37RJ50j10o7Q6k8J15o6q3j1O8r8J15Km7j45NJ77l6P0M7
5695A21k44M9KO2M5j13j0L3L0Q4k6R2q5j28J70j63J9N0j17P9K52j49n8M6m4N2
5721D9j38J36j22Q8lJ6no4M3m4J55l48L2K49P3l1j13Lr2L15m85L04o8K8J12j66
5747g6K11k09L7Q8m7j00P8N2J13j40J0L8j18J81k17J71J0n4j1Q5n1J37k45J73
5771A16j28J27k2j04J22M4l8j7q1O9j63O8L2n0L0J11p2j31K8l6J24m3M2J79l07
$$ plain form
5796 -100 139 -42 -111 -225 -7 -4 62 -45 -13 187 -111 122 -119 1 4 -144 -23 50 -1 -13 -69 79 14 67
5820 67 168 54 -93 -13 -81 -72 -30 -54 -161 51 -70 -19 25 59 130 -24 159 -33 -57 -27 -42 -50 -115 178 33 -23
5846 -23 213 56 90 62 27 -67 134 108 -10 109 34 -61 -211 -117 -45 98 54 14 177 50 85 86 -63 -108 74
5871 74 95 51 2 78 84 -28 -76 -59 -27 5 -120 -24 -106 110 77 -15 36 26 16 -17 39 -40 -29 137 105 -160 1 -52
5899 -52 114 61 -51 -70 -50 148 29 5 56 -51 -155 85 -66 -36 54 97 117 -121 177 20 28 21 231 -31 -61
5924 -61 76 17 123 -239 1 -21 -153 -66 16 3 -37 7 45 118 82 99 -66 93 127 36 123 -62 107 66 -231
5949 -231 -52 -68 -35 -43 146 -32 47 -64 -214 25 -22 -2 26 28 -20 -17 47 -112 170 164 -3 227 -24 -5 4 -189
5975 -189 -4 32 72 5 -291 42 31 -88 -143 16 110 32 178 -115 113 -14 60 6 109 -30 -75 -75 67 -113
$$ packed form
5796a00K39j81o9j14K18LO6j07L2K00k98K33k41J20Lj48J21P3n1j2n6J48o5N3
5820F7J01j14j47Q0o8RM2k4j07K12j21N1M4L4P1j54J83j92k4L0j5qo5K93j45n6
5846b3K36j57L4k8l5r4K01k6j18J19p5r5j50R4P2J43m4m0J63j27L5Jj49m5J82
5871G4K1m4m9P6Oj12m8J7L2L2j25R6q2K16l3r2N1j0j0l3N6p9J1J66l2k65J61n3
5899e2J66n3j12j9K0J98j19k4N1j07j04K40j51L0R0M3K0k38K98j57QpK10k62l0
5924f1J37n9J06l62K40k2j32Q7Q2j3m0M4L8P3l6J7j65J59L4r1Q7j85J69m1k97
5949b31J79j6L3qJ89j78P9j11j50K39m7K0K8Km8LO4j59K82oj67K30k51J9Rj93
5975a89J85L6M0o7k96L33j1j19n5J59R4p8J46k93K28j27P4n4J03j39m5%J42j80
$$ plain form
5999 -113 51 71 -50 133 -232 -49 -146 103 97 -7 -108 -36 -67 2 -30 38 19 -63 83 -82 -8 -143 -91 -16 122
6024 122 -35 163 -88 1 -10 -55 -28 184 95 139 -55 -134 -120 -44 -129 -125 -167 -36 -47 52 -84 -15 -150 7 13 -26
6050 -26 99 -142 2 -36 107 -141 17 17 43 -78 -68 -33 -16 -12 99 -73 -95 49 -39 93 66 -136 19 -62 -45
6075 -45 14 -28 74 197 63 -54 77 184 -19 114 -29 -51 20 64 -99 20 97 -142 98 -3 -52 -61 -2 -49
6099 -49 -153 130 -162 158 116 -3 105 41 -23 -268 -12 29 68 150 161 -62 143 115 46 -88 40 -54 -80 -107
6123 -107 -74 -128 123 16 78 -220 -74 -33 195 70 -86 -60 -37 87 136 -74 58 -5 -72 51 -35 11 109 20
6147 20 105 -127 47 54 -59 12 -9 28 113 12 141 141 -16 -17 -29 144 159 -119 150 -43 -37 -38 -14 -49 -171 109 7
6174 7 22 277 -109 -169 -72 -33 -46 -14 35 108 43 155 -28 90 -49 56 149 -4 -26 80 -97 20 -27 161 65
$$ packed form
5999a13J64K0j21J83l65J83r7K49oj04j01P2l1O9l2O8j9q2J46j65P4j35N2P5J38
6024A22j57J98k51Q9j1m5K7K12q9M4j94p9J4P6q5Mm2J31j1R9j36O9j35J57Ol9
6050b6J25k41J44l8J43k48J58%K6j21J0L5J7MJ11j72k2J44q8J32k7k02J55q1J7
6075d5N9m2J02J23j34j17J31J07k03J33j43k2P1M4j63J19P7k39K40j01m9rN9m7
6099d9j04K83k92L20m2j19J08o4o4k45K56M1L9Q2J1k23K05k8o9j34J28r4k6k7
6123a07L3n4K51j07O2k98J46M1K28j25j56K6K3J24M9k10J32o3o7J23q6M6R8q9
6147B0Q5k32J74Pj13P1k1L7Q5j01J29%j57jj2J73J5k78K69j93OjK4l5j22K80j02
6174GJ5K55l86o0R7L9j3L2M9P3o5J12j83J18j39J05R3j53k2J06j77J17m7J88r6
$$ plain form
6199 65 -170 -25 -51 -61 -139 -75 -43 35 51 -16 -68 32 -47 -266 2 44 162 57 35 -73 -28 -56 -55 156 42 116
6225 116 -89 -37 40 -50 -11 -71 -124 55 -184 -115 -35 -76 0 65 -132 -6 3 -64 -47 -51 -86 54 70 -171 -9 4 49
6252 49 69 -4 -71 -11 48 -16 112 -4 66 88 -62 -232 22 90 -142 11 -123 -39 144 -68 -112 71 -88 109
6276 109 -11 -28 2 69 5 52 -116 2 -38 52 77 53 89 113 15 -9 8 -82 125 -38 -99 17 58 103 1 86
6302 86 47 39 -79 -36 193 -160 14 81 81 74 -22 9 104 -36 68 103 125 84 -99 -34 -48 70 87 -92 -25 28 80
6329 80 48 -181 -38 63 107 122 34 35 -57 -99 -51 116 35 32 195 -42 120 -31 35 -60 -77 -75 -37 33 40 31 121 222
6357 222 -131 -101 64 -4 -104 11 -113 100 -16 57 22 -71 11 3 37 -7 142 57 -122 -79 44 4 -103 -56 -50
6382 -50 166 54 -130 -99 267 17 -8 29 70 78 -153 -87 43 -3 -81 42 -164 98 -26 -10 3 -79 -28 -119 31
$$ packed form
6199F5k35J45k6j0p8O4L2P8J6o7n2J00p9k19K68M2J18j05k2j08M5k8JK11j14P4
6225A16k05N2P7r0L9o0n3J79k39O9Q0m1P6O5j97J26Ro7J7ml5J40J6k41J62J3M5
6252D9K0p3o7O0N9o4J28j16P0K2j50j70K54O8k32J53j34Q4J83k12m4J83j59J97
6276A09j20j7L0O7o4M7j68J18m0R0K5k4L6K4r8k4J7r0K07j63o1J16M1M5j02Q5
6302H6l9qj18M3K29l53J74O7%pr6L1R5j40J04L5K2m1j83O5j4J18J7j79O7N3N2
6329H0l2k29J43J01M4J5q8Jr2m2M8J67q1lJ63k37J62j51O6r5j7KL8P0PrR0J01
6357B22l53L0J65o8j00J15j24K13j16P3l5r3Q2qL4m4J49q5j79M3J23m0j07M7O
6382e0K16j12j84L1L66k50k5L7M1Qk31O6J30m6p8J23k06K62j24J6J3q2N1r1J50
$$ plain form
6407 31 42 -21 -30 102 -11 -17 82 -69 -152 -70 -60 -30 -38 -75 -25 -288 142 66 -64 115 45 -86 14 -50 -60 -12 -83
6434 -83 -41 62 -180 -112 51 50 47 7 65 -93 -92 151 81 -16 -81 -58 -136 43 45 -70 86 68 -127 6 -21 -5 54
6461 54 -256 147 -77 59 -4 -83 139 47 124 23 -29 -47 -13 -29 23 103 -62 -133 102 18 120 -23 71 -73 -94
6486 -94 70 -9 -201 -156 -59 -22 59 -89 66 16 1 -160 14 301 -83 -159 -100 -53 -11 -98 43 -83 55 38 -196
6511 -196 -50 53 -92 -114 218 -125 28 144 73 -113 -161 -59 220 61 -62 32 122 -30 -38 -197 -94 -8 -31
6534 -31 54 -48 6 56 -5 -65 114 -39 -8 -109 -14 37 -111 -21 -186 -124 106 220 18 -75 82 17 -126 78
6558 78 -104 14 -34 38 36 -55 90 -57 -40 63 -12 168 -143 191 16 -25 6 -18 53 -104 -14 57 -60 -14 -100
6583 -100 -68 64 -19 -152 33 52 52 -12 71 86 -82 -58 167 -95 -85 -5 -65 60 -66 56 -196 132 -129 -30
$$ packed form
6407C1J1o3rJ32j13oR9j51q3Q2J0L0ql7N0k63M30p6j30J79p0j31J00o4j0M8p1
6434h3M2J03k42O8J63jlm0N8j58JK43p0r7o5K3p8J79Kj15J56j8j95J33k7J6N9
6461E4l10M03k24J36o3p9K22r2P7j01n2j8L4j6N2Q0j65p1K35q4J02j43R4j44k1
6486i4J64p9j92M5R7L7Q1j48J55n0j5j61J74K87l84p6N9M7M2q7J41j26J38j7k34
6511a96J46J03j45k2L32l43J53J16p1j86m8J02K79j59j23R4R0j52qj59J03Q6k3
6534c1Q5j02N4N0o1o0J79j53L1j01R5N1j48R0j65O2K30J14k02r3J57o5j43K04
6558G8j82J18m8P2kr1J45j47J7J03p5J80l11L34j75m1L1k4P1j57R0P1j17M6q6
6583a00L2J32q3j33J85J9%o4Q3J5j68K4K25k62J0Q0o0J25j26J22k52L28k61R9
$$ plain form
6607 -30 66 46 -43 33 17 -194 -135 -10 177 -71 -28 19 63 -50 216 -36 -193 -35 -218 26 -9 -74 83 -240
6631 -240 -28 60 62 -143 134 -78 -47 15 33 24 -50 -45 -55 -4 -60 215 4 61 -49 118 157 -58 65 126 -59 -34
6657 -34 -50 -19 46 104 224 25 -22 -137 -78 -89 15 4 -53 -149 32 65 31 116 9 45 25 115 174 -134 14 3
6683 3 -110 -28 161 40 -33 -56 61 -75 57 11 -159 -41 -101 11 41 102 -70 -84 9 130 11 51 -97 -161
6707 -161 70 -102 -53 -265 20 -75 26 -253 -38 112 -70 35 61 -60 278 75 -60 -41 -25 154 -35 -16
6729 -16 72 -46 6 90 37 -43 164 -34 82 -176 -127 -68 64 172 48 10 -9 -84 -68 -246 -136 -75 76 74 39
6754 39 -102 -24 20 49 -17 43 -80 77 87 19 -30 -64 -136 -27 44 -89 -102 73 19 101 -126 17 -77 81 29 -7
6780 -7 40 81 -20 -93 -120 -67 -31 -37 82 92 9 -67 -13 62 127 1 -159 3 129 22 -55 58 -96 -86 -56 -72 -1
$$ packed form
6607c0R6k0q9P6j6k11N9J25J87k48M3M7M4j13K66k52j57J58j83K44l5o5J57l23
6631b40K12Q8Kk05K77k12L1O2J8rp4Nj0N1n6K75k11N7j10J67L9k15J23O1j85K5
6657c4j6L1O5N8J20j99m7j15N9j1J04j1n7r6J81L3l4Q5j07L6k0R0N9l08J48j1
6683Cj13Q2J89j21p3k3J17j36J32m6j70J18o0J12L0O1j72j4R3J21j19M0j48o4
6707a61K31j72M9k12K85r5J01k79K15J50j82J05K6j21L38k03j35J9J6J79j89J9
6729a6Q8j18N2Q4n3q0K07j98J16k58M9N9J32J08j24l8j9p5J6j78J10O1J51kl5
6754C9j41P8M4K9o6O0j23J57J0o8m9l4p2J09P1j33j3J75n4Q2k27J43r4J58n2l6
6780gM7M1j01p3k7N3L6oJ19J0q3p6N4P5O5j26j60J62J26j07p7J13j54J0L0j6P1
$$ plain form
6807 -1 32 17 -13 -1 -78 35 79 78 121 98 39 154 99 42 -84 -24 -18 -66 -30 -45 55 -20 -183 93 -34 -109 94 -92
6835 -92 12 13 -33 -174 35 82 -153 -27 -24 -13 -20 20 -47 33 -20 40 116 -39 -21 -99 -72 57 -108 -1 166 -18
6861 -18 -17 -68 153 95 79 4 -77 41 -29 -58 -107 -34 -69 -84 48 0 -81 78 80 159 5 -105 -82 -96 -42 8 58 175
6889 175 -8 10 129 76 121 -101 61 -71 165 -186 176 -140 -35 34 62 -17 70 11 64 66 -6 -8 12 10 -59 -68 -83
6916 -83 106 -42 13 -77 68 -109 109 -19 -21 8 -346 184 -88 -125 13 44 82 0 -18 30 -79 16 97 -136 -21
6941 -21 -68 -9 -81 27 66 -95 -57 138 84 105 46 0 6 74 -64 4 -33 7 95 -32 -16 -107 70 22 -90 -141 -75
6968 -75 67 -167 46 -35 -163 126 43 -100 -21 -12 60 99 74 147 -130 115 124 -10 9 -7 -20 70 121 70 -54 252
6994 252 -59 13 7 -183 -105 109 86 69 -32 -68 -38 -44 80 49 21 70 -151 75 95 -118 60 75 -71 7 72 67
$$ packed form
6807aL3j5l0J2p7J13M4jM3k3n9J15n5n7j26O0Om8L6j5J00p5j63K76j27p5K03j86
6835i2J04Jm6j41K09M7k35J26LJ1pM0o7Q0n3O0P6j55J8p8K7J29j65J07J67j84
6861a8Jn1K21n8j6p5q1J18p0k9m9P3l5j5J32m8q1J59KP9j54j10K3j4N4N0N0J17
6889A75j83J8J19n3M5k22J62j32K36l51L62l16J05O9K8p9Q7n9N3Kp2kK0ko9rj5
6916h3J89j48N5r0J45j77K18j28kK9l54N30k72l7J38L1L8q2j8M8j09R5Q1k33J15
6941b1m7N9p2J08L9j61L8J95n4K1n9m6OO8j38O8l7M0Q8j27J6r1J77m8j12n1O6
6968g5J42k34K13q1j28K89q3j43P9RP2L9k5P3k77K45Rj34J9j6j3R0N1n1j24L06
6994B52l11P2oj90P8K14k3j7j01l6L0oJ24l1k8M9k21K26K0k13J78J5j46P8O5n
$$ plain form
7020 67 -65 -185 -150 18 90 -110 20 -143 82 -77 95 -88 149 -25 33 67 93 68 -93 -4 -104 44 99
7043 99 238 71 -7 -126 -55 65 -3 147 -77 -131 53 27 -23 -20 -74 -113 73 22 -39 -93 13 -37 46 38 -13 -3 78
7070 78 126 105 -73 -65 89 -170 48 -181 66 -57 52 -11 -84 82 -68 42 -4 71 -65 -34 8 54 167 79
7094 79 -52 -63 13 -284 -15 -41 131 -112 -68 -57 87 -69 -75 49 23 -135 -31 -120 17 -6 -54 8 143 -29
7118 -29 -154 177 70 65 -13 8 26 127 24 130 144 38 -75 -82 45 -61 -40 -23 62 23 61 73 90 51 -48 105
7144 105 -20 8 28 -68 114 -58 243 -100 -26 6 -85 175 57 -71 -92 129 -39 177 58 34 -133 -71 153
7167 153 -29 139 -22 -128 -75 -19 32 -29 22 126 -112 -103 8 -59 -10 -85 72 -17 -45 94 -81 33 28 -9 -16 64
7193 64 -104 -24 65 45 59 48 -37 119 -51 1 31 127 -5 35 123 80 111 27 -19 41 176 -116 -119 135 -22 129
$$ packed form
7020F7j32j20L5J68P2k00J30j63K25j59J72j83K37j74N8L4K6k5j61Q9j00J48N5
7043I9J39j67p8j19P1J20o8J50k24n4J84k6n0Ln4l9J86n1o1n4J06n0Q3qn1J0Q1
7070G8M8k1j78QJ54k59K18k29K47j23J09o3p3J66j50J10m6P5j36L1M2M6J13q8
7094G9j31j1P6k97K69k6J72k43M4J1J44j56oJ24k6j58J04q9J37k3m8O2J35j72
7118b9j25L31j07np8K1J8J01j03J06J4j06j13pJ27j06K1J7Q5l9L8J2J7l9r9J53
7144A05j25K8K0r6J82j72L01l43P4L2r1K60j18j28k1K21j68K16j19k4j67O2K24
7167A53j82J68j61j06N3N6N1o1N1J04k38RJ11o7M9p5J57q9k8J39j75J14nl7pQ0
7193F4j68Q0Q9k0J4j1q5J56j70N2L0R6j32M0Q8m3L1q4m6O0J35k92lK54j57J51
$$ plain form
7219 129 -33 -171 131 1 -146 18 34 8 105 -28 84 12 -26 -10 108 126 -26 104 -61 -115 37 -86 -47
7242 -47 -106 39 161 -19 176 62 60 144 97 -64 202 -59 149 52 -53 52 -38 130 -105 71 -74 35 -113
7265 -113 -195 -251 57 151 -58 112 -288 20 148 56 11 -70 13 -52 34 31 -6 11 -70 -33 37 186 53 95 -250 97
7291 97 -17 -114 149 98 -65 -13 50 -24 -76 3 -20 124 -54 -77 19 -92 108 76 -52 56 102 -86 91 68 -12
7316 -12 -71 4 14 -26 37 67 -64 27 156 -71 -119 73 71 -48 -23 90 102 -62 -19 -146 18 -103 -28 -56 -76 247
7342 247 92 -8 145 -112 -63 -35 -12 68 -132 96 55 -63 -79 -38 90 -13 2 -43 61 -104 -105 129 -107 -71
7366 -71 -99 136 -7 -4 -89 67 -14 -85 -33 -11 115 -10 107 222 -63 91 -95 135 2 -109 -89 85 -47
7389 -47 -5 9 -130 -145 7 45 -13 -38 41 5 79 -138 6 -114 -78 -87 272 74 2 -53 -139 22 -105 -18 21 23 65
$$ packed form
7219A29j62j38L02j30j47J64J6k6R7j33J12p2l8J6J18J8j52J30j65n4J52j23L9
7242d7n9J45J22j80J95j14kQ4m7j61K66k61K08r7j05J05r0J68k35J76j45J09j48
7265a13q2n6L08R4k09J70m00L08J28r2m5q1Q3o5Q6ll7J7q1L7P0J49j33M2l45L47
7291I7j14r7K63n1j63N2O3p4n2P9k3J44j78k3R6j11K00l2j28J08M6j88J77k3q0
7316a2n9P5J0m0O3L0j31R1J29k27m8J92kj19K5J13J2j64M3j27J64j21P5k8k0L23
7342B47j55j00J53k57M9K8K3Q0k00K28m1j18j6M1J28j03J5m5J04j65jK34k36L6
7366g1k8K35j43Lq5J56q1p1N2K2J26j25J17J15k85J54j86K30j33j11K0J74j32
7389d7M2J4j39j5J52L8n8k5P9l6P4k17J44j20L6rL59j98p2n5q6J61j27Q7L9KM2
$$ plain form
7416 65 7 153 143 -42 -96 46 177 7 68 -50 113 46 -26 171 -23 153 -23 -116 -55 14 -49 -25 -80 -50 -92
7441 -92 -137 -155 -25 -109 128 -8 116 -19 62 54 -32 53 42 13 17 98 50 58 165 -43 21 140 -211 -59 -168 -18
7467 -18 -154 24 -46 -243 126 -95 2 20 -69 36 -164 -3 -8 -90 7 -70 -30 -167 -31 -98 23 -7 12 100 -30
7492 -30 -3 -64 -60 42 39 38 31 112 193 175 43 -39 29 -181 -80 21 -85 122 1 55 16 53 48 86 -62 3 28 54
7520 54 -17 -49 27 -26 -139 57 88 54 -10 -53 -76 -59 69 -139 53 -39 6 -36 115 -20 -29 34 -42 141 -102 -69
7546 -69 27 29 -36 -186 13 115 -133 -95 -37 65 -68 -17 -31 15 -58 -166 94 2 -6 -23 -37 -41 158 -8 -95 -152 -36
7573 -36 -89 -108 -98 153 32 102 -63 115 122 13 43 132 -106 7 92 56 41 7 42 -104 -169 -10 30 116 64 -102
7599 -102 -46 -90 147 24 87 -3 -32 -66 -91 -21 71 -136 -53 82 -9 -22 -40 49 -7 117 -11 -54 56 38 38 -68
$$ packed form
7416F5n8J46j0j85n4J42J31j70O1j18J63o7p2J97j94J76j76r3O1O9o3K4n5L0m2
7441i2m5j8J30q4K37j36J24j35Q1qq6Q5j1k9MQ1m8QJ07k08O4J19l51J52j09J50
7467a8j36J78p0j97L69k21R7J8q9J05k00J61nq2R7p7M0j37J36o7J21l0J9Q8j30
7492c0K7o1MJ02ljpQ1Q1j8j32q2O8k10J01J01j06K07j21N4l9L7nL8j48O5K5K6
7520E4p1l2P6n3j13J96L1l4o4m3k3J7J28k08J92r2M5m2J51j35rO3p6J83k43L3
7546f9R6Ko5j50J99J02k48L8N8J02j33N1j4M6p3j08K60r2qj7j4mJ99j66q7n7J16
7573c6n3j9J0K51j21P0j65J78Pj09L0Q9k38J13Q5l6j5l4L5j46o5J59M0Q6n2j66
7599a02N6m4K37j23O3r0k9l4k5P0R2k07Q3J35r1j3j8Q9n6J24j28m3J10j8%j06
$$ plain form
7625 -68 38 257 33 64 15 -27 -131 73 -12 -7 -146 -107 -148 -72 -148 -83 58 -176 81 41 106 12 63 65 -191 -35
7651 -35 111 -101 23 16 0 110 67 46 -253 185 88 24 -99 -35 33 -25 -160 -48 -25 49 -38 -2 -59 -42 -22 11
7677 11 55 -170 87 -55 90 -184 -102 60 46 36 53 20 -102 -28 27 6 141 30 -85 30 5 33 144 45
7701 45 -109 68 -125 -97 29 -19 -57 118 18 100 84 102 105 -47 -48 -32 -62 -226 -40 101 -91 12 -63 47 11
7726 11 -71 116 35 39 -39 26 -77 158 122 28 -100 -63 9 127 -10 -149 -53 28 99 -36 144 87 -189 48 124
7751 124 82 -78 76 -96 25 -48 -27 76 -68 70 -140 51 73 99 -37 228 27 42 -5 51 250 126 17
7774 17 -53 -87 -29 177 -53 19 0 225 9 -123 194 42 99 151 22 92 8 -6 7 63 -37 -35 -74 145 134 43
7800 43 -7 -91 76 51 201 -22 -72 -8 166 74 -41 -55 -26 -114 -6 -42 1 27 -68 174 -220 -249 99 -23 -115
$$ packed form
7625f8J06K19k24L1m9m2j04K04q5Nj39L9m1P6p6O5J41k34K57m0O5r4N1Kk56J56
7651c5J46k12J24pj6J10m3k1k99M38r7o4j23O4O8n8j35J12K3P4q7L6n7J7K0L3
7677A1M4k25K57j42J45k74Q2J62j4j0J7l3j22P4N5k1J35j11j15J15k5K8J11r9
7701D5j54J77j93K8J26m8l8J75j00Q2j6J8Lj52jJ6l0j64J86J41j92J03p5J10l6
7726A1q2J87q1Mp8O5j03K35l6r4j28L7P2J18j37j39R6Q1P1j35J80n7k76K37P6
7751A24m2j60J54j72J21p3K1J03j44J38k10J91K2K6j36K65k01J5m7N6J99j24j09
7774A7p0l4N8K06k30P2j9K25k16j32L17j52N7N2j29P0q4j4J3N6j00Kl9K19j1r1
7800D3n0q4J67k5J50k23n0O4J74r2j15j4K9q8J08l6M3K6r5K42l94k9L48j22r2
$$ plain form
7825 -115 -62 113 -33 -101 -38 -172 -103 35 138 -189 120 43 61 -114 -111 -65 -32 64 -45 -86 79 -39 69 -77
7849 -77 -35 53 -148 -4 83 40 -20 6 -123 -11 -67 187 -105 -29 -69 -72 86 29 -11 28 8 46 -37 20 -2 36 127
7876 127 -2 -129 3 40 15 218 175 -1 -89 -29 13 39 -20 -10 -122 -5 69 35 92 -40 110 -5 111 -92
7900 -92 -31 121 -123 -181 69 70 140 17 -30 -115 12 141 34 201 51 135 -154 84 108 59 -17 124 49 55 -51
7925 -51 -3 36 -171 -97 7 -19 77 -107 -74 -21 10 -2 112 -76 -68 -73 -46 -74 89 -8 99 57 -169 46 -29 -24 -44
7952 -44 -40 37 97 64 137 70 61 229 -12 97 -26 111 -121 -135 -1 4 62 -163 -89 147 27 29 156 27 47 65
7978 65 92 -50 10 -152 66 -37 -84 120 98 -120 -48 27 89 83 -105 -58 -79 -132 -33 -51 -53 -25 -68 -101 -59 57 -6
8005 -6 47 -74 -71 86 -105 131 -70 41 -50 77 158 -52 -1 -59 -32 5 -34 6 60 52 -238 -30 24 145 -91 -7
$$ packed form
7825a15N3J75j46o8O3j34O9J38J03l27L09p7J8j75LM6L3R6j09m1J65j18J08j46
7849g7M2Q8k01J44Q7m3o0K6j29J12n6K54k92P6m0lJ58n7m0L9k0L8q3N7k2L8R1
7876A27j29j27J32L7k5K03m3j76q8O0M2K6n9J0j12J17P4l4N7j32J50j15J16k03
7900i2O1J52k44n8K50JP0j23m7q5J27J29j07J67j50Q4k89K38K4m9p6J41p5Oj06
7925e1M8L9k07P4J04k6R6j84L3N3L1j2J14j88QnK7k8J63r7J07m2k26K15p5Nk0
7952d4MP7O0l3P3o7rJ68k41J09j23J37k32j4J34NN8k25P4K36j20KJ27j29K0J8
7978F5K7j42O0j62K18j03m7K04k2k18P2P5O2oj88M7k1n3R9j8kK8m3l3M2J16o3
8005fN3j21LJ57j91K36k01J11r1J27Q1k10N1n8K7L7l9M0N4qk90K08N4J21k36Q4
$$ plain form
8031 -7 -38 -10 288 -50 -133 89 43 118 235 54 -98 -17 150 -38 -67 1 -75 -99 30 -73 17 -107 52 -184
8055 -184 0 189 -163 51 112 9 133 -46 109 -139 24 87 37 102 64 -74 -40 41 15 -72 43 5 52 -188
8079 -188 -83 37 -24 31 -97 -57 -39 141 -131 -43 83 142 -102 -42 41 28 26 -94 -72 -22 -28 -82 116 -146 -214 -2
8105 -2 91 -25 -15 -65 -94 -32 -110 -162 46 88 -22 21 6 119 -12 31 -3 175 2 94 57 150 39 17 -83 51
8131 51 -5 176 115 45 1 65 -43 2 156 72 55 51 -6 -83 -57 -24 12 -45 52 54 155 -108 44 -43 -125 -27 -102 110
8159 110 101 75 -61 47 13 3 154 28 -26 69 4 -168 97 -135 126 64 -10 -87 -33 24 -104 12 -62 -81 208
8184 208 120 135 83 51 -39 1 83
$$ packed form
8031gl1K8K98l38q3K22m6P5J17j81j52Q1J67j88k9O8p6k4J29j03R0j24J59k36
8055a84J84J89l52K14O1j03J24j79J55k48J63O3n0O5l8j38L4Q1k6q7J15l8M7k40
8079a88J05J20o1N5j28M0J8J80k72Q8J26N9k44O0Q3j3kj20K2N0on4J98k62o8K12
8105bR3j16J0n0k9O2p8n2K08M2j10M3j5J13j31M3l4J78j73R2l7R3j11k2j00J34
8131E1n6J81o1p0m4O4j08M5J54q4j7mn7p7K6L3L6n7R7KJ01k63J52q7q2R8p5K12
8159A10rk6j36J08l4j0J51j26n4R5o5j72K65k32K61o2p4p7N4N7j28J16p4j9K89
8184B08q8J5n2l2r0M0Q2
8191H3
$$ Imaginary data points
##PAGE= N=2
##DATA TABLE= (X++(I..I)), XYDATA
$$ plain form
0 0 0 0 0 0 0 0 0 0 0 -8 8 -8 8 -16 17 -24 32 -32 40 -56 64 -77 88 -104 122 -143 168 -192 222 -256 288 -333
32 -333 375 -426 482 -541 610 -680 761 -848 944 -1053 1163 -1291 1428 -1575 1742 -1918
48 -1918 2115 -2330 2566 -2829 3115 -3441 3801 -4207 4674 -5206 5826 -6559 7438 -8522
62 -8522 9887 -11676 14131 -17726 23529 -34474 62599 -301438 -533549 -46069 284567 618023
74 618023 662863 507546 129656 -244757 -562542 -650535 -521165 -185473 190632 516815
84 516815 633251 528670 230864 -135594 -466154 -610518 -537217 -266567 88263 418401
94 418401 586122 537960 296094 -41608 -371172 -556719 -537500 -325868 -3020 321780
104 321780 524524 535736 351663 46528 -276191 -494255 -528322 -374616 -86808 235218
$$ packed form
0@%%%%%%%%%qJ6j6J6k4L3m1N6o4P2r6J20j41J65j92K26k65L11l60M14m78N44o21
32c33P08q01R08j023J151j290J441j609J792j997K216k454K719l003L317l660
48a918M033m445M896n395N944o556P242q008Q881r880J1032j2385J3997j5960
62h522J8409k1563K5807l1857M1255n8003R7073l64037k32111M87480L30636L33456
74F18023M4840j55317l77890l74413l17785q7993J29370L35692L76105L26183
84E16815J16436j04581k97806l66458l30560j44364P3301K70650L54830L30138
94D18401J67721m8162k41866l37702l29564j85547J9219K11632L22848L24800
104C21780K02744J1212j84073l05135l22719k18064l4067J53706K87808L22026
$$ plain form
114 235218 462309 518123 391452 124064 -189274 -428464 -506694 -403546 -158383 145869
124 145869 392285 491006 415163 188458 -105660 -354916 -474556 -423385 -218201 65606
134 65606 321065 455528 426183 243429 -28645 -284268 -433355 -427013 -263452 -6375 247807
145 247807 410611 424003 283284 40499 -213189 -385156 -418642 -300288 -71671 177735
155 177735 360196 411800 311874 100483 -144190 -333854 -401371 -322950 -126542 112132 305606
166 305606 389156 330171 151101 -79361 -279217 -375211 -333865 -173272 48551 251001 360791
177 360791 337323 191023 -19860 -221761 -344123 -338039 -208678 -7328 194599 324265
187 324265 335487 224581 32760 -167498 -305145 -331250 -236511 -58110 140392 285958
$$ packed form
114B35218K27091N5814j26671k67388l13338k39190p8230J03148K45163L04252
124A45869K46416R8721p5843k26705k94118k49256j19640N1171K05184K83807
134F5606K55459J34463k9345j82754k72074k55623j49087O342J63561K57077K54182
145B47807J62804J3392j40719k42785k53688j71967l3486J18354K28617K49406
155A77735J82461N1604r9926k11391k44673j89664o7517P8421J96408K38674J93474
166C05606Q3550n8985j79070k30462j99856r5994M1346J60593K21823K02450J09790
177C60791k3468j46300k10883k01901j22362O084J29361K01350K01927J29666
187C24265J1222j10906j91821k00258j37647k6105R4739J78401J98502J45566
$$ plain form
197 285958 324912 247130 80538 -114423 -264957 -317569 -254927 -100805 88356 244637 308748
208 308748 260422 119907 -63510 -222808 -298567 -265316 -135931 39952 199989 287212 268185
219 268185 151705 -17785 -178810 -272883 -268448 -166555 -3612 157922 259399 266833 177843
230 177843 25027 -136118 -245718 -264007 -187746 -44209 114584 229795 260801 196592 61561
241 61561 -93658 -214036 -255121 -203357 -79000 73491 197273 248304 208983 93856 -53484
252 -53484 -179858 -240962 -213128 -107872 34723 163387 231534 215621 121485 -16768 -146458
263 -146458 -221558 -216430 -132169 -1306 129210 211787 215918 142116 17670 -112301 -200080
274 -200080 -214908 -151101 -32869 95229 188156 211685 158507 48467 -78788 -176208 -207838
$$ packed form
197B85958L8954p7782j66592j94961j50534n2612O2642J54122J89161J56281O4111
208C08748m8326j40515j83417j59298p5759L3251J29385J75883J60037Q7223j9027
219B68185j16480j69490j61025r4073M435J01893J62943J61534J01477P434q8990
230A77843j52816j61145j09600j8289P6261J43537J58793J15211L1006o4209j35031
241F1561j55219j20378m1085N1764J24357J52491J23782N1031l9321j15127j47340
252e3484j26374o1104K7834J05256J42595J28664O8147j5913r4136j38253j29690
263a46458p5100N128Q4261J30863J30516Q2577M131p3802j24446j29971q7779
274b00080j4828O3807J18232J28098R2927K3529n3178j10040j27255r7420l1630
$$ plain form
285 -207838 -164475 -61803 62451 162835 203563 169160 73976 -46080 -149384 -197616 -173321
296 -173321 -86179 31553 136096 190541 176007 96825 -16346 -122343 -183327 -176677 -106636
307 -106636 1808 108740 174924 177518 115515 11975 -94617 -166002 -176481 -123100 -25771
318 -25771 80777 156749 174629 129687 38257 -66416 -146275 -172745 -135447 -49593 52566
329 52566 135526 168729 140205 60596 -39992 -124592 -163638 -143751 -71024 26958 113994 158690
341 158690 145576 79953 -14151 -102816 -152728 -146975 -88355 2124 91019 146107 147671 95361
353 95361 9390 -79430 -139043 -147071 -101998 -20472 67899 131253 146193 107835 30628 -56354
365 -56354 -122740 -144128 -112824 -40595 45160 113672 140796 117054 50299 -34238 -105091 -137264
$$ packed form
285b07838M3363J02672J24254J00384M0728l4403r5184j20056j03304m8232K4295
296a73321Q7142J17732J04543N4445j4534p9182j13171j05997o0984O650P0041
307a06636J08444J06932O6184K594o2003j03540j06592p1385j0479N3381R7329
318b5771J06548P5972J7880m4942r1430j04673p9859k6470L7298Q5854J02159
329E2566Q2960L3203k8524p9609j00588q4600l9046J9887P2727R7982Q7036M4696
341A58690j3114o5623r4104q8665m9912N753N8620R0479Q8895N5088J564n2310
353I5361q5971q8820n9613q028M5073Q1526Q8371O3354J4940l8358p7207q6982
365e6354o6386k1388L1304P2229Q5755O8512K7124k3742o6755q4537p0853l2173
$$ plain form
377 -137264 -119295 -58777 22938 95938 133234 121538 66741 -12204 -86054 -128034 -123314 -73608
389 -73608 2137 76394 122585 123507 80001 7720 -66837 -116592 -123507 -85609 -17139 56984 110020
402 110020 122726 90500 25678 -47594 -102884 -120605 -94843 -34397 38013 95556 118166 97857
414 97857 42348 -28163 -88330 -115409 -100391 -49510 19166 80200 111657 102745 56290 -10268
426 -10268 -72259 -107519 -103471 -62264 1394 64143 102796 104152 67624 6837 -55576 -97772
438 -97772 -104058 -71996 -14644 47203 91975 103198 76442 22078 -39351 -86228 -101586 -79978
450 -79978 -29550 31201 80164 99544 82725 36161 -23397 -73712 -96920 -84718 -42163 15201
462 15201 67022 93713 86457 47562 -7721 -60311 -90319 -87060 -52447 486 53321 86652
$$ packed form
377a37264J7969O0518Q1715P3000L7296j1696n4797p8945p3850m1980M720M9706
389g3608P5745P4257M6191R22m3506p2281p4557m9755o915L7898O8470P4123N3036
402A10020J2706l2226o4822p3272n5290j7721K5762O0446P2410N7543K2610k0309
414I7857n5509p0511o0167k7079J5018N0881O8676O1034L1457q912m6455o6558
426a0268o1991l5260M048M1207O3658O2749L8653J356l6528o0787o2413m2196
438i7772o286L2062N7352O1847M4772J1223k6756n4364o1429m6877j5358K1608
450g9978N0428O0751M8963J9380j6819m6564n9558n0315k3208J2202M2555N7364
462A5201N1821K6691p256l8895n5283n2590l0008L259L4613N2933N2835L3331
$$ plain form
474 86652 87630 56860 6072 -46347 -81883 -87261 -60876 -12544 39736 77078 86161 64320 19254
487 19254 -32867 -72175 -84940 -66960 -25107 25974 67188 83396 69405 30425 -19151 -61588
499 -61588 -81005 -71160 -35696 12936 55881 78332 72446 40107 -6418 -50223 -75384 -73136 -43930
512 -43930 578 44337 71867 73446 47893 5171 -38689 -68105 -72913 -51209 -10619 33091
524 33091 64482 72087 53915 16310 -27060 -60122 -70958 -56057 -21021 21422 55691 69576
536 69576 58071 25560 -15895 -51106 -67741 -59656 -29594 10301 46453 65457 60301 33342
548 33342 -5307 -41426 -63028 -60899 -36751 385 37004 60011 61087 39870 4472 -32284
560 -32284 -56875 -60629 -42445 -8756 27469 53639 60022 44502 13266 -22548 -50274 -59083 -46528
$$ packed form
474H6652R78l0770n0788n2419l5536n378K6385M8332N2280L7342R083k1841m5066
487A9254n2121l9308j2765J7980M1853N1081M1214J6208j3991l8980m9576m2437
499f1588j9417R845L5464M8632M2945K2451n886l2339m6525m3805k5161K248K9206
512d3930M4508M3759K7530J579k5553m2722m3860k9416m808K1704M0590M3710
524C3091L1391P605j8172l7605m3370l3062j0836J4901L5036M2443L4269J3885
536F9576j1505l2511m1455l5211j6635Q085L0062L9895L6152J9004n156k6959
548C3342l8649l6119k1602K129K4148L7136L6619K3007J076k1217l5398l6756
560c2284k4591l754J8184L3689L6225K6170O383j5520l1236l5814k7726q809J2555
$$ plain form
573 -46528 -17343 17941 46419 57901 48043 21230 -13389 -43010 -56293 -49057 -24389 8985
585 8985 38952 54550 50074 27439 -4834 -35091 -52439 -50465 -30409 875 31382 50093 50611
598 50611 33045 3155 -27519 -47749 -50433 -35119 -7065 23355 44885 50193 37114 10584
610 10584 -19425 -42206 -49389 -38621 -13968 15694 39280 48358 39731 16901 -11905 -36125 -47305
623 -47305 -41106 -19622 8245 32974 45634 41726 22316 -4759 -29836 -43902 -42079 -25182 1276
636 1276 26594 42307 42393 27156 2442 -23241 -40180 -42339 -29167 -5367 20004 38103 42179
649 42179 30617 8086 -16734 -35860 -41619 -31992 -11309 13480 33291 40766 33289 13783 -10445
662 -10445 -30815 -40071 -34423 -16283 7276 28289 38786 34945 18832 -4313 -25663 -37533 -35534
$$ packed form
573d6528K9185L5284K8478J1482r858k6813l4619k9621j3283P236K4668L3374
585H985K9967J5598m476k2635l2273l0257j7348J974K0056L1284L0507J8711N18
598E0611j7566k9890l0674k0230k684J5314K8054L0420K1530N308j3079k6530
610A0584l0009k2781p183J0768K4653K9662K3586R078q627k2830k8806k4220j1180
623d7305O199K1484K7867K4729J2660l908j9410k7075k5077j4066J823J6897K6458
636A276K5318J5713Q6j5237k4714k5683j6939k159J3172K3800K5371J8099M076
649D2179j1562k2531k4820j9126n759R627K0683K4789J9811P475p477j9506k4228
662a0445k0370r256N648J8140K3559K1013J0497l841j6113k3145k1350j1870J999
$$ plain form
675 -35534 -20949 1222 22903 36166 35920 22790 1469 -20096 -34270 -35973 -24413 -4126 17368
688 17368 32548 35795 25582 6845 -14712 -30763 -35372 -27243 -9109 11904 28501 34905 28188
701 28188 11211 -9336 -26492 -33800 -29296 -13680 6842 24401 32945 29612 15590 -4120 -22309
714 -22309 -32282 -30229 -17486 1604 19834 30993 30592 19065 857 -17611 -29392 -30569 -20523
727 -20523 -3391 15210 28137 30500 21890 5348 -12940 -26329 -30211 -23042 -7528 10537 24587
740 24587 29733 23956 9494 -8321 -22959 -28966 -24813 -11588 5888 21136 28397 25179 13161
753 13161 -3663 -19122 -27433 -25822 -14738 1620 17038 26445 25861 16230 487 -15186 -25316
766 -25316 -25941 -17356 -2499 13239 23997 26069 18565 4211 -11358 -22562 -25816 -19492 -6142
$$ packed form
675c5534J4585K2171K1681J3263k46j3130k1321k1565j4174j703J1560K0287K1494
688A7368J5180L247j0213j8737k1557j6051m609Q129J8134K1013J6597O404o717
701B8188j6977k0547j7156p308M504J5616K0522J7559Q544l333j4022j9710j8189
714b2309r973K053J2743J9090J8230J1159m01j1527j8208j8468j1781j177J0046
727b0523J7132J8601J2927K363q610j6542j8288j3389l882P169J5514J8065J4050
740B4587N146n777j4462j7815j4638o007M153J3225J7476J5248P261l218j2018
753A3161j6824j5459q311J611J1084J6358J5418R407n84r631j5743j5673j0130
766b5316o25Q585J4857J5738J0758K072p504j4354j5569j1204l254O324J3350
$$ plain form
779 -6142 9441 21119 25185 20238 7708 -7402 -19748 -24788 -20861 -9410 5517 18136 24327
792 24327 21438 10787 -3764 -16530 -23307 -21729 -12112 1774 15031 22615 21969 13485 -108 -13232
806 -13232 -21751 -22173 -14473 -1613 11569 20735 22079 15377 3239 -10012 -19459 -21883 -16398 -4798
820 -4798 8440 18475 21569 17091 6137 -6645 -17297 -21269 -17701 -7579 4842 15747 20756
833 20756 18080 8885 -3340 -14457 -20147 -18502 -10183 1851 13038 19369 18830 11146 -481 -11556
847 -11556 -18565 -18732 -12140 -1128 10224 17758 18799 13010 2358 -8758 -16763 -18629 -13910 -3869
861 -3869 7317 15942 18486 14381 5090 -6055 -14740 -18271 -15036 -6221 4474 13695 17766 15476
875 15476 7321 -3115 -12559 -17344 -15571 -8355 2011 11454 16821 15991 9234 -671 -10338 -15994 -15986
$$ packed form
779f142J5583J1678M066m947j2530j5110j2346n040L927J1451J4927J2619O191
792B4327k889j0651j4551j2766o777J578R617J3886J3257P584o46q484j3593j3124
806a3232q519m22P700J2860J3182R166J344o702j2138j3251r447k424N485J1600
820d798J3238J0035L094m478j0954j2782j0652l972L568J0122J2421J0905N009
833B0756k676r195j2225j1117n690J645Q319J2034J1187O331n39p684j1627j1075
847a1556p009j67O592J1012J1352P534J041n789j0652j1116q005j866M719J0041
861c869J1186Q625K544m105r291j1145q685l531L235Q815J0695R221M071k290
875A5476q155j0436r444m785J773P216J0366R443N367q30o757r905r667n656Q
$$ plain form
890 -15986 -10360 -571 9068 15344 16054 10891 1816 -7987 -14829 -16087 -11689 -2982 6820 13843 15926
905 15926 12198 4051 -5450 -13076 -15820 -12757 -5265 4474 12098 15446 13027 5945 -3057 -11057 -15189
920 -15189 -13627 -6800 2027 10164 14807 13683 7677 -819 -9027 -13948 -13904 -8393 -252 8190 13440
935 13440 13883 9142 1283 -6890 -12841 -13912 -9953 -2301 6044 12058 14000 10432 3207 -4942 -11365
950 -11365 -13691 -10984 -4229 4045 10619 13433 11271 5112 -2843 -9804 -13120 -11681 -6017 1975 9027
965 9027 12721 11870 6668 -697 -8022 -12316 -11970 -7348 80 7076 11856 12015 7943 1082 -6218 -10995
981 -10995 -11954 -8444 -1831 5437 10602 12056 9239 2871 -4391 -10026 -11884 -9347 -3642 3463 9120
996 9120 11777 9687 4406 -2515 -8532 -11344 -10140 -5146 1527 7731 11087 10233 5881 -659 -6978
$$ packed form
890a5986N626R789R639O276P10n163r075r803o842j258M398Q707R802P023K083
905A5926l728q147r501p626k744L063P492R739P624L348k419p082r002q000m132
920a5189J562O827Q827Q137M643j124o006q496q208m921M4N511Q141Q442N250
935A3440M43m741p859q173n951j071L959P652Q345O014J942l568p225q149o423
950a1365k326K707O755Q274O574K814k162o159p955o961l316J439N664P992P052
965I027L694q51n202p365p325m294L46M622P428O996M780J59m072o861p300m777
981a0995r59L510O613P268N165J454k817o368p262n635j858K537N705P105N657
996I120K657k090n281o921o017k812J204M994O673O204L356q54m352o540o319
$$ plain form
1011 -6978 -10437 -10361 -6305 -8 6257 10147 10614 6901 935 -5425 -9732 -10480 -7595 -1839 4613 9116
1027 9116 10566 7889 2488 -3773 -8699 -10422 -8119 -3169 2954 7959 10084 8641 3841 -2127 -7331
1042 -7331 -9707 -8736 -4498 1379 6629 9753 8872 4853 -520 -5970 -9202 -9016 -5636 -52 5309 8739
1058 8739 9044 6223 919 -4671 -8376 -9119 -6312 -1417 3865 7758 9029 6707 2235 -3285 -7276
1073 -7276 -8824 -7221 -2839 2565 6838 8636 7245 3445 -1874 -6216 -8213 -7681 -4083 1062 5568
1088 5568 8105 7696 4354 -397 -4994 -7868 -7558 -4774 -254 4546 7586 7798 5336 887 -4034 -7060
1104 -7060 -7804 -5470 -1555 3235 6676 7681 5859 1929 -2657 -6227 -7431 -5889 -2368 2120 5830
1119 5830 7402 6210 2933 -1405 -5293 -7093 -6541 -3432 941 4813 7050 6458 3837 -343 -4262
$$ packed form
1011f978l459P6M056O297O265L890M67l713n966o360m307p48K885N756O452M503
1027I116J450k677n401o261m926j723K303M950O123N005K125j443m800n968n204
1042g331k376R71M238N877N250L124q81m019n373n450l232J86L380N584N361L430
1058H739L05k821n304n590l705p43K807M895N282L893J271k322m472n520l991
1073g276j548J603M382N404M273J798j391l800n319m342j997N32L598N145M506
1088E568K537m09l342m751m597k874L10K784M520M800L040K12k462m449m921l026
1104g060p44K334L915M790L441J005j822l930m586l570j204J542L521M488L710
1119E830J572j192l277m338l888j800N52L109M373L872K237n92k621m180l919
$$ plain form
1134 -4262 -6585 -6531 -4274 -413 3809 6255 6633 4466 730 -3236 -6174 -6568 -4698 -1177 2541 5693
1150 5693 6406 5071 1637 -2121 -5256 -6352 -5307 -2134 1848 4867 6292 5107 2333 -1376 -4500
1165 -4500 -6073 -5370 -2956 869 4000 5841 5535 3063 -257 -3662 -5601 -5810 -3515 -131 3239 5410
1181 5410 5612 3872 396 -2793 -5023 -5416 -4090 -1040 2422 4784 5583 4185 1321 -1981 -4528 -5415
1197 -5415 -4372 -1911 1487 4277 5374 4276 1779 -1108 -3700 -5124 -4769 -2444 696 3414 4943
1212 4943 4619 2728 -237 -3108 -4877 -4785 -2981 -172 2855 4570 4990 3243 389 -2291 -4237 -4722
1228 -4722 -3508 -875 1985 4039 4854 3715 1245 -1571 -3792 -4649 -3750 -1456 1334 3697 4622 3854
1244 3854 1877 -869 -3323 -4427 -4020 -1827 676 3093 4235 4101 2359 -121 -2740 -4272 -4130 -2563
$$ packed form
1134d262k323N4K257L861M222K446L78k167l736l966k938l94J870L521L718L152
1150E693P13j335l434l758l135j096J045L173L982L019J425j185k774l709l124
1165d500j573P03K414L825L131J841l06k472l320l405j939k09K295L384L370K171
1181E410K02j740l476l189k230l93J326L050L462K362P99j398k864l302k547q87
1197e415J043K461L398K790J097j098k497k887k592j424L55K325L140K718J529
1212D943l24j891k965k871j769R2J804K809L027J715M20j747k854k680j946m85
1228d722J214K633K860K054Q15j139k470k816k221q57Q99K294K790K363R25p68
1244C854j977k746k454j104M07K193K503K417J142j34j742k480k619j532J42J567
$$ plain form
1260 -2563 -79 2354 4088 4294 2829 491 -2173 -3860 -4263 -3055 -898 1809 3661 4106 3212 1034
1276 1034 -1407 -3375 -4186 -3276 -1416 1160 3073 3827 3686 1823 -713 -2882 -3749 -3435 -1901 426
1292 426 2599 3751 3680 2326 -197 -2554 -3708 -3543 -2402 -213 1950 3398 3671 2688 624 -1654
1308 -1654 -3145 -3494 -2701 -762 1441 3096 3507 2929 1036 -1113 -2934 -3570 -2889 -1182 856 2583
1324 2583 3475 3035 1472 -600 -2429 -3133 -3057 -1695 420 2086 3413 3193 1954 185 -1943 -3072
1340 -3072 -3043 -2239 -174 1715 2866 3120 2356 643 -1417 -2837 -3184 -2472 -827 1318 2563 3137 2549
1357 2549 866 -839 -2458 -3093 -2581 -1095 562 1993 2883 2612 1491 -538 -2004 -2864 -2633 -1538
1373 -1538 230 1780 2748 2567 1874 81 -1575 -2744 -2602 -1807 -376 1443 2365 2659 1898 628 -1069
$$ packed form
1260b563K484K433J734K06j465k338k664j687m03J208K157K707J852M45q94k178
1276A034k441j968q11R10J860K576J913P54j41j863k536k169q67L14J534K327
1292D26K173J152p1j354k523k357j154J65J141K189K163J448K73r83k064k278
1308a654j491l49P93J939K203J655M11n78j893k149j821o36O81J707K038J727
1324B583Q92m40j563k072j829p04P6J362K115J666J327k20j239j769k128j129
1340c072K9Q04K065J889J151K54p64j713k060j420l47P12J645K145J245N74n88
1357B549j683j705j619o35N12J486J657J431Q90k71j121k029j466q60K31J095
1373a538J768J550R68j81o93j793j656j169J42P95J431J819R22K94p61j270j697
$$ plain form
1390 -1069 -2207 -2860 -2162 -932 870 2054 2708 2122 885 -776 -2084 -2696 -2359 -1040 603 1802
1406 1802 2632 2213 1349 -278 -1910 -2359 -2550 -1448 253 1391 2269 2423 1440 136 -1342 -2172 -2380
1423 -2380 -1712 -418 1183 2018 2373 1707 617 -884 -1958 -2370 -1834 -596 704 1661 2306 1832 980
1440 980 -372 -1636 -2270 -2073 -810 490 1529 2070 2003 1215 88 -1419 -1945 -2044 -1338 16 1175 1894
1458 1894 1962 1306 312 -1082 -1709 -2169 -1641 -460 739 1804 2017 1629 536 -771 -1502 -1997 -1811 -749
1476 -749 478 1483 1814 1802 764 -409 -1480 -1852 -1732 -1098 133 987 1836 1875 1185 -45 -997 -1719
1494 -1719 -1776 -1159 -126 909 1565 1695 1301 376 -800 -1534 -1675 -1447 -477 421 1342 1744 1271 547 -351
1513 -351 -1439 -1685 -1297 -651 357 1175 1655 1517 761 -316 -1174 -1615 -1675 -1002 179 1123 1558 1472 879
$$ packed form
1390a069j138o53O98J230J802J184O54n86j237j661j308o12L37J319J643J199
1406A802Q30m19q64j627j632m49j91J102J701J138Q78J54r83j304j478q30k08
1423b380O68J294J601Q35L55o66j090j501j074m12N36J238J300R57O45m74q52
1440I80j352j264o34J97J263J300J039N41o7p88j127j507n26r9P06J354J159P19
1458A894O8o56r94j394o27m60N28J181J199J065K13l88j093j307p31m95J86J062
1476g49J227J005L31j2j038j173j071l72J20O34J231Q54Q49L9o90j230r52p22
1494a719n7O17J033J035O56J30l94r25j176p34j41K28R70Q98R21M02m73p24q98
1513c51j088k46L88O46J008Q18M80j38p56j077q58m41o0O73J181R44M35q6n93
$$ plain form
1532 879 -113 -862 -1369 -1461 -1103 -144 728 1451 1585 1027 349 -643 -1312 -1448 -1106 -268 595 1120 1416 1269
1552 1269 602 -519 -952 -1374 -1130 -580 292 1035 1167 1142 545 -125 -946 -1342 -1358 -705 -15 850 1244 1316
1572 1316 858 210 -659 -1240 -1376 -930 -144 620 1155 1420 908 247 -428 -1091 -1129 -1048 -487 567 942 1176
1592 1176 1101 412 -352 -943 -1127 -1185 -692 283 851 939 1071 568 105 -801 -1224 -1085 -705 48 559 1147 1182
1613 1182 826 231 -444 -940 -959 -719 -240 401 940 1073 885 195 -508 -975 -1215 -836 -370 275 918 1228
1633 1228 953 464 -228 -866 -925 -733 -451 80 443 1051 980 500 90 -715 -1034 -884 -662 -102 505 860
1653 860 1005 601 164 -396 -1049 -1243 -815 -154 444 809 946 786 313 -365 -626 -947 -795 -331 149 483
1673 483 888 909 363 -216 -602 -829 -793 -421 178 601 955 850 459 101 -362 -826 -833 -559 -142 292 837
$$ packed form
1532H79r92p49n07r2L58R59Q72P23J34n58o78r92o69j36L42Q38Q63N25K96j47
1552A269o67j121m33m22K44N50Q72P43J32k5n97o70q21l96j6O53O90Q65L94P2
1572A316m58o48q69n81j36M46P86P64N35K65n12o61o75o63l8Q1N61J054L75K34
1592A176p5o89p64n91j84n8M93R75N68Q8J32n03m63r06m23J39L80P53N11N88L5
1613A182l56n95o75m96j9K40M79O41N39J33j88o90p03m67k40L79M66O45O43L10
1633A228k75m89o92o38n9J92K82N31L63O08p1m80m10q05l19J50K22N60O07L55
1653H60J45m04m37n60o53j94M28O61N98L65J37j60m73o78k61l21J52M64M80L34
1673D83M05K1n46n79l86k27L6L72N99M23L54j05l91l58m63m64pK74M17M34N45
$$ plain form
1694 837 842 459 101 -196 -620 -898 -579 -36 137 572 802 642 244 -143 -382 -673 -631 -262 159 612 757
1715 757 573 286 -65 -659 -792 -732 -422 -93 404 730 788 479 94 -400 -695 -626 -564 -133 320 665 645 437
1737 437 128 -195 -532 -770 -625 -388 266 546 535 551 237 -95 -408 -533 -636 -347 -52 446 345 541 312
1758 312 -36 -467 -505 -591 -296 -98 474 435 494 197 122 -162 -502 -653 -494 -7 273 502 571 509 94 -57
1780 -57 -415 -585 -526 -99 238 304 369 490 355 -189 -424 -536 -615 -73 109 557 555 657 116 62 -418 -469 -573
1803 -573 -240 5 358 337 598 407 -89 -249 -465 -540 -142 -111 189 509 304 345 197 -125 -469 -432 -382 -314
1825 -314 191 386 450 523 206 -113 -296 -393 -370 -149 59 352 581 352 110 -68 -356 -361 -384 -316 -87 284 331
1848 331 323 254 23 -235 -276 -389 -241 -63 202 394 438 170 134 -188 -309 -366 -249 -72 97 310 406 324 214
$$ packed form
1694H37Nl83l58k97m24k78L19N43J73M35K30j60l98l87k39k91M2L69M21M53J45
1715G57j84k87l51n94j33O0L10L29M97L26N8l09l85m94k95O9O2M31M53L45k0k08
1737D37l09l23l37k38J45K37O54K80j1J6l14l32l13j25j03K89K95M98j01J96k29
1758C12l48m31l8q6K95J98N72l9N9k97p5k84l40j51J59M87K80K29O9o2m15j51
1780e7l58j70N9M27L37O6O5J21j35n44k35j12p9N42J82M48kJ02n41n4m80n1j04
1803e73L33K45L53k1K61j91m96j60k16p5L98L1L00L20k05M1j48l22l44L7N0O8
1825c14N05J95O4P3l17l19j83r7K3K21K08K93K29k29k42j78k88nk3O8K29L71M7
1848C31qo9k31k58m1j13J48J78K65J92M4k68l6l22j21n7J17J77J69K13R6q2j10
$$ plain form
1871 214 -79 -322 -279 -333 -173 164 259 456 338 290 -59 -392 -405 -335 -136 0 253 292 274 174 -42 -94 -455
1894 -455 -350 -100 -35 335 330 364 290 116 -161 -421 -519 -250 24 263 431 411 348 2 -98 -284 -585 -275 -193
1917 -193 7 341 358 408 205 -100 -149 -241 -521 -41 12 344 413 384 290 -28 -180 -454 -355 -379 -118 138 300
1940 300 337 67 124 -45 -282 -90 -270 -170 120 219 379 338 82 -45 -442 -318 -199 -170 111 187 334 284
1962 284 128 -159 -211 -238 -302 -372 39 386 207 216 1 -159 -167 -187 -350 -195 -3 153 368 399 305 30 -112 -446
1986 -446 -206 -84 12 -9 320 238 307 111 -126 -231 -336 -187 -128 93 198 283 262 48 50 -204 -351 -245 -309
2009 -309 95 122 339 372 217 104 -179 -114 -329 -331 -176 148 535 251 176 42 -101 -211 -240 -196 -74 -7 315
2032 315 336 200 185 59 -158 -335 -289 -2 -66 188 223 366 113 139 -99 -304 -134 -262 -111 222 315 125
$$ packed form
1871B14k93k43M3n4J60L37R5J97j18m8l49l33j3P0J99J36K53L9j8j00k16n2l61
1894d55J05K50O5L70nL4p4j74k77k60r8K69K74K39J68k0o3l46j00j86l01L10Q2
1917a93K00L34J7N0k03l05m9r2k80M80N3L32O9k9r4l18j52k74R9k4K61K56J62
1940C00L7k70N7j69k37J92j80J00K90R9J60m1k56j27l97J24J19K9K81P6J47n0
1962B84j56k87n2k7o4p0M11L47j79Rk15j60qk0j63J55J92J56K15L1r4k75j42l34
1986d46K40J22R6k1L29q2O9j96k37j05j05J49N9K21J05Q5k1k14Kk54j47J06o4
2009c09M04K7K17L3j55j13k83O5k15kJ55L24L87k84p5j34j43j10k9M4J22O7L22
2032C15K1j36j5j26k17j77M6K87o4K54L5J43k53K6k38k05J70j28J51L33R3j90
$$ plain form
2054 125 280 16 -68 -257 -224 -271 -137 186 108 340 199 196 -78 -35 -162 -315 1 140 163 357 339 -61 163
2077 163 -194 -260 -253 -227 22 257 260 50 226 49 -20 -331 -200 -173 -161 235 94 432 221 -65 -68 -222 -228 -114
2101 -114 10 24 122 229 -66 126 29 -299 -207 -288 -3 57 -20 218 225 97 -214 -215 -90 -188 -207 119 105 264 110
2126 110 218 -70 -22 -179 -33 -109 -118 57 179 100 175 37 -160 -161 -18 -258 -101 139 111 252 130 164 -8
2149 -8 -104 -192 -76 -125 41 116 -9 181 207 -16 -217 -93 -103 -157 27 149 239 188 191 -11 -203 -385 -65 -162 -92
2174 -92 124 31 0 139 -280 29 -177 -243 -189 -125 47 152 225 -56 52 -83 -44 -185 50 -119 -124 91 215
2197 215 109 -97 -90 -103 -93 -37 -177 148 145 95 77 125 -33 -249 -137 -135 -67 -64 80 111 64 132 -74 -54 -93 -288 -76
2224 -76 -155 55 191 298 -53 68 -2 -203 -279 -177 -80 52 113 140 137 58 -136 -131 -225 -93 -150 254 38 88 131
$$ packed form
2054A25J55k64q4j89L3m7J34L23p8K32j41lk74M3j27j53L16J39K3J94j8m00K24
2077A63l57o6PK6K49K35Lk10J76j77o9l11J31K7J2L96j41L38k11k86lj54oJ14
2101a14J24J4R8J07k95J92r7l28R2q1K85O0p7K38Pj28l11jJ25r8j9L26j4J59j54
2126A10J08k88M8j57J46p6rJ75J22p9P5j38j97jJ43k40J57K40k8J41j22L4j72
2149hr6q8J16m9J66P5j25J90K6k23k01J24j0n4J84J22R0n1Lk02j92j82L20r7P0
2174i2K16r3l1J39m19L09k06o6N4O4J72J05P3k81J08j35L9j41K35j69nK15J24
2197B15j06k06Pj3J0N6j40L25ln0j8M8j58k16J12KO8LJ44L1m7O8k06K0l9j95K12
2224g6p9K10J36J07l51J21p0k01p6J02R7J32O1K7lp9j94Nr4J32n7M04k16N0M3
$$ plain form
2249 131 35 -4 -97 -113 -113 -37 143 193 194 197 106 -6 -58 -211 73 -140 -35 -80 201 33 33 38 -200 -42 -76 -235 13
2276 13 15 87 -23 39 117 -88 -119 -233 -164 -102 -86 128 46 230 151 76 -282 72 -210 -132 44 18 154 59 255
2301 255 -39 15 -56 -127 -225 -48 72 206 211 168 44 -16 -4 -232 -195 -146 -64 41 62 96 19 -99 -99 -166 -100 5
2327 5 -99 21 82 41 50 -18 -78 -175 -98 -106 -133 -20 115 155 157 -99 31 -74 -100 -53 -44 90 184 3 123 -94 -23
2354 -23 -84 -125 -62 -96 -9 105 84 176 79 79 -118 -34 -12 -118 -67 187 168 -18 15 -63 -48 -210 19 -113 53 162
2380 162 106 135 51 27 17 -214 -71 -158 77 -15 243 107 50 83 24 -132 -156 -172 -234 -7 191 -42 160 82 -87
2405 -87 -126 -399 -28 -102 -152 98 224 381 87 86 28 -269 -128 -158 182 2 103 -75 88 154 15 -99 -174
2428 -174 -210 -128 170 287 257 -208 98 12 -130 -198 -138 -74 -60 -5 71 24 113 -106 -60 -110 -213 -132 59 111 238
$$ packed form
2249A31r6l9r3j6%P6J80N0JLr1j12n2j53K84k13J05m5K81j68%Nk38J58l4j59K48
2276A3KP2j10O2P8k05l1j14O9O2J6K14q2J84p9p5l58L54k82P8J76k6J36r5J96
2301B55k94N4p1p1r8J77J20J34Nm3j24o0J2k28L7M9Q2J05K1L4p7j18%o7O6J05
2327Ej04J20O1m1Ro8o0r7P7qk7J13J35M0Kk56J30j05k6M7RJ34R4j81J20k17P1
2354b3o1m1O3l4Q7J14k1R2r7%j97Q4K2j06N1K54j9j86L3p8J5j62K29j32J66J09
2380A62n6K9q4k4j0k31J43q7K35r2K58j36n7L3n9j56k4j6o2K27J98k33K02p8j69
2405h7l9k73L71p4n0K50J26J57k94jn8k97J41l0L40j80J01j78J63O6j39j14p5
2428a74l6Q2K98J17l0m65L06q6j42o8O0O4J4N5P6m7Q9k19M6n0j03Q1J91N2J27
$$ plain form
2453 238 149 148 154 -121 -144 -196 -67 -46 131 311 190 121 54 -69 -148 -206 -211 33 56 11 108 203 101 -1 -151 -88
2479 -88 -29 -66 147 19 193 163 91 -76 -23 -301 -205 -100 9 97 199 61 343 -34 -64 -108 -113 -82 -81 212 127
2504 127 79 59 1 -90 -97 -114 -326 -80 43 166 43 35 -1 -167 -131 -99 -106 -70 61 146 175 124 -47 105 29 -44 -118
2531 -118 -122 -54 101 27 55 124 103 -123 -92 -132 -70 5 -28 218 229 -6 66 -73 -145 -134 -101 27 -69 96 141 214 17
2558 17 -95 -76 -322 -8 -31 181 95 269 -43 146 -17 -188 61 -62 -28 -68 104 201 191 -55 100 -176 -187
2581 -187 -42 -78 -124 94 204 191 -145 138 -181 -43 -40 -79 -5 7 147 149 132 192 -21 -76 -76 -127 15 122 244
2606 244 164 52 297 13 -153 -115 -129 59 -25 107 347 272 78 93 -95 -93 -9 -41 -105 43 195 96 68 -107
2630 -107 -136 -37 -223 -41 12 5 49 91 155 -102 74 -205 -175 -123 -111 27 266 56 227 71 -92 -121 -78 -123 -36
$$ packed form
2453B38q9jOk75k3n2J29K1J77J80j21o9o7j23p9n8nK44K3m5R7R5j02j02j50O3
2479h8N9l7K13j28J74l0p2j67N3k78R6J05J09Q8J02j38K82l77l0m4nL1JK93q5
2504A27m8k0n8r1pj7k12K46J23J23j23ql6j66L6L2pL6J31Q5K9n1j71J52p6p3p4
2531a18mO8J55p4K8O9k1k26L1m0O2P5l3K46J1k35P2j39p2J1L3J28r6J65M5P3j97
2558A7j12J9k46L14k3K12q6J74l12J89j63j71K49j23L4m0J72R7j0k46J55k76j1
2581a87J45l6m6K18J10j3l36K83l19J38Ll9P4J2J40Kj7O0k13n5%n1J42J07J22
2606B44q0j12K45k84j66L8j4J88q4J32K40p5j94J5j88KQ4l2o4J48J52r9k8j75
2630a07k9R9j86J82N3pM4M2O4k57J76k79L0N2J2J38K39k10J71j56j63k9M3m5Q7
$$ plain form
2655 -36 -58 -1 -75 141 77 34 -164 -68 -119 -158 82 190 2 117 137 -32 -76 -102 -15 -10 -90 35 -43 58 55 107 32
2682 32 6 -78 -182 -171 16 -82 53 -12 103 -91 -112 -49 -135 -108 20 123 30 105 124 43 50 -61 18 -203 24 -26
2708 -26 -128 165 119 -51 -28 -74 -204 -137 18 -54 98 171 225 85 -119 24 -225 -79 -6 61 168 112 67 146
2732 146 23 -120 -147 -33 -15 -138 0 260 199 140 208 -175 -146 -201 -281 111 114 150 -37 147 51 31 -167 -34
2756 -34 -97 -37 21 -116 215 65 64 229 -198 -56 -166 -46 -62 5 155 36 116 50 -92 -127 11 112 10 53
2780 53 70 125 211 -27 -120 -119 -171 -150 -47 72 37 13 57 172 13 16 106 -116 -49 134 50 63 7 -127 136 -17
2806 -17 -17 -12 29 -91 -44 13 161 -73 22 -155 56 -95 -69 9 -16 -81 -142 -32 177 -56 -63 -122 -109 243 -99 52
2832 52 49 25 74 -120 -28 -14 42 38 -42 -46 81 6 -43 44 -180 35 27 -29 148 -87 140 111 139 37 -80 49 -195
$$ packed form
2655c6k2N7p4K16o4m3j98R6n1l9K40J08j88J15K0j69m4k6Q7Nq0J25p8J01lN2p5
2682C2k6q4j04J1J87r8J35o5J15j94k1O3q6K7J28J03r3P5J9q1Pj11P9k21K27n0
2708b6j02K93m6j70K3m6j30O7J55p2J52P3N4j40k04J43k49J46P3O7J07n6m5P9
2732A46j23j43k7J14J8j23J38K60o1n9O8l83K9n5q0L92LL6j87J84r6k0j98J33
2756c4o3O0N8j37L31j50jJ65m27J42j10J20j6O7J50j19Q0o6j42l5J38J01j02M3
2780E3J7N5Q6k38r3Jn2K1J03J19l5k4M4J15j59LR0k22O7J83q4J3n6j34K63j53
2806a7%NM1j20M7N7J48k34R5j77K11j51K6P8k5o5o1J10K09k33pn9J3L52l42J51
2832E2lk4M9j94R2J4N6mq0mJ27p5m9Q7k24K15qn6J77k35K27k9K8j02j17J29k44
$$ plain form
2859 -195 3 -148 25 277 31 101 18 -129 -128 78 -81 41 -75 20 15 -114 -101 -98 -175 -200 29 -141 -173 63
2883 63 126 47 -179 -89 -32 -55 -116 -19 173 106 44 -57 -53 71 17 -18 -54 13 -12 22 14 243 -64 156 -118 11 -86
2910 -86 -59 -139 -20 1 272 -36 123 -38 -151 -164 -115 -51 -53 -42 171 147 -93 64 -45 -67 -185 -29 -56 121
2934 121 115 33 -86 -62 186 -14 -162 -71 -102 24 15 111 -41 75 -69 9 -3 2 25 -33 200 19 -111 -105 10 -78
2960 -78 -68 -105 55 -26 39 -97 71 -128 68 -61 -59 35 -37 43 52 73 40 153 135 -52 -52 -67 -75 99 62 57 9 70
2988 70 15 -23 7 -56 34 91 -2 51 -49 121 -1 -25 62 -119 -135 11 -78 15 -71 46 0 227 -90 -81 91 -247
3014 -247 4 55 7 -38 -41 54 188 -94 -18 107 -62 125 170 -126 118 0 20 -30 -16 67 -165 -12 4 144
3038 144 55 -176 85 -133 -41 -107 -60 -29 58 72 -9 26 23 -64 -216 11 38 -71 47 14 -21 -57 -109 -167 -235 39
$$ packed form
2859a95J98j51J73K52k46P0q3j47JK06j59J22j16R5nj29J3Lp7k5K29j70l2K36
2883F3O3p9k26R0N7k3o1R7J92o7o2j01MJ24n4l5l6O7k5L4qK29l07K20k74J29r7
2910h6K7q0J19K1K71l08J59j61j13j3M9O4kJ1K13k4k40J57j09k2j18J56k7J77
2934A21oq2j19K4K48k00j48R1l1J26rR6j52J16j44P8j2NK3n8K33j81j30OJ15q8
2960g8J0l7J60q1O5j36J68j99J96j29KR4p2Q0RK1l3J13j8j87%j5qJ74l7nm8O1
2988G0n5l8L0o3R0N7r3N3j00J70j22k4Q7j81j6J46q9R3q6J17m6K27l17RJ72l38
3014b47K51N1m8m5lR5J34k82P6J25j69J87M5k96K44j18K0n0J4Q3k32J53J6J40
3038A44q9k31K61k18R2o6M7L1Q7J4q1L5lq7j52K27K7j09J18l3l5l6n2n8o8K74
$$ plain form
3064 39 -8 27 -13 92 -17 87 88 53 -50 25 25 15 25 -153 33 -4 29 27 -49 -17 3 -104 -10 33 84 -113 117
3091 117 -11 -93 -2 -164 25 -27 101 71 148 -43 222 -145 -27 -140 -14 115 30 58 -83 189 -77 44
3113 44 -73 25 57 23 -28 -101 42 34 151 56 204 -88 -118 75 -17 131 -40 94 -44 177 -58 -51 -60 213 92
3138 92 -34 10 -177 -70 34 -38 -170 15 41 -58 -1 -44 113 116 -60 -5 -44 88 113 -64 38 -26 -58 -89 -119
3163 -119 161 -29 -36 -51 -7 -63 -83 -103 -85 54 -76 -72 62 -120 -135 -151 -53 -53 79 109 19 -101 127 -93 42 113
3189 113 110 -98 115 -109 -26 -81 44 -5 -55 -38 32 18 104 35 -73 8 -122 118 -11 183 23 -64 82 124 -51
3214 -51 -125 50 -104 -69 16 -78 38 -71 -40 -4 -67 109 113 -253 -14 124 -92 9 -9 111 -60 76 51 45 109
3239 109 74 78 1 111 -29 21 49 -161 114 -72 -55 -78 58 -132 25 -83 -264 61 82 91 -46 -76 -94 120
$$ packed form
3064C9m7L5m0J05j09J04Jl5j03P5%j0J0j78J86l7L3kp6L2K0j07R4M3N1j97K30
3091A17j28q2R1j62J89n2J28l0P7j91K65l67J18j13J26J29q5K8j41K72k66J21
3113D4j17R8L2l4n1p3J43qJ17r5J48k92l0J93r2J48j71J34j38K21k35PrK73j21
3138I2j26M4j87J07J04p2j32J85K6r9N7m3J57Lj76N5l9J32K5j77J02o4l2l1l0
3163a19K80j90pj5M4n6k0k0J8J39j30MJ34j82j5j6R8%J32L0r0j20K28k20J35P1
3189A13lk08K13k24Q3n5J25m9n0J7P0j4Q6o9j08Q1j30K40j29J94j60q7J46M2j75
3214e1p4J75j54L5Q5r4J16j09L1L6o3J76Ml66K39J38k16J01j8J20j71J36k5oO4
3239A09l5Mp7J10j40N0K8k10K75j86J7k3J36j90J57j08j81L25K1Rj37l0j8K14
$$ plain form
3263 120 -128 -41 -137 -42 30 -58 -73 -192 -79 -117 -3 69 -151 84 -42 44 228 87 89 19 -94 -74 99 -72
3287 -72 89 -121 15 -100 182 162 74 22 47 -70 -152 -100 -100 -125 -46 118 -113 -11 18 -119 54 -89 -61 -117 -59
3312 -59 134 147 255 -174 -9 114 -100 -27 -103 -119 119 108 -10 73 27 -157 -28 57 124 78 -14 -36 23 -156 2
3337 2 -105 -59 -4 19 -94 29 214 -41 98 -163 -82 29 73 12 76 18 -54 139 -138 18 23 -54 -13 -79 95
3362 95 -10 29 166 -1 86 -113 -119 -67 -154 91 -65 75 128 115 100 54 -134 -140 51 -92 20 -94 -71 -43 167
3387 167 -13 -178 -113 -30 12 80 -6 -42 -77 17 -42 -84 33 -43 87 78 -60 37 10 -138 16 -4 151 -34 17 -57
3413 -57 -110 126 29 -175 -81 114 15 77 -75 91 31 -12 -179 -41 -117 224 119 1 -42 10 -132 -105 115 -63
3437 -63 -73 -55 12 -129 -18 -23 59 24 -6 -17 18 -88 13 244 -12 -77 93 -90 222 -93 15 82 -65 11 -179
$$ packed form
3263A20k48Q7r6R5P2q8j5j19J13l8J14P2k20K35j26Q6J84j41Kp0j13K0J73j71
3287g2J61k10J36j15K82k0q8n2K5j17q2N2%k5P9J64k31J02K9j37J73j43K8n6N8
3312e9J93J3J08m29J65J23k14P3p6j6K38j1j18Q3m6j84J29Q5O7m6r2k2N9j79J58
3337Bj07M6N5K3j13J23J85k55J39k61Q1J11M4o1O4n8p2J93k77J56Np7M1o6J74
3362I5j05L9J37j67Q7j99oN2q7K45j56J40N3j3j5m6j88oJ91j43J12j14K3K8K10
3387A67j80j65O5Q3M2O8q6l6l5R4n9m2J17p6J30rj38R7k7j48J54k0J55j85N1p4
3413e7n3K36r7k04R4J95r9O2j52J66o0m3j67J38p6L41j05j18m3N2j42K7K20j78
3437f3j0J8O7j41J11nQ2l5l0j1L5j06J01K31k56o5J70j83L12l15J08O7j47P6j90
$$ plain form
3462 -179 -23 -15 -129 168 -38 20 -46 82 -99 136 24 65 -42 -13 48 58 154 -105 143 115 14 -55 92 33
3486 33 -108 127 5 -107 -99 7 -59 -15 -20 10 248 -69 49 139 -115 2 4 -137 71 -134 45 13 -105 -72
3510 -72 -58 8 96 341 -63 30 137 -17 -50 27 -79 96 47 -27 -96 52 56 139 147 -51 90 60 129 82 -94 81
3536 81 18 96 86 174 80 39 51 -32 -12 69 114 103 -70 77 69 -10 -21 -130 -15 -185 133 -24 99 115 -171 95
3562 95 -20 296 92 -43 114 -113 54 -56 72 139 -12 -153 128 243 74 35 16 17 -13 -35 -85 -258 -18
3585 -18 57 39 82 22 -50 32 62 -105 115 -130 39 -57 -98 168 75 -81 101 59 33 -37 59 67 27 40 -17 -27 -173
3612 -173 2 -34 16 130 94 -98 -88 58 59 -141 -189 -2 11 -222 16 -9 3 61 -151 -60 -33 -36 148 -48 -4
3637 -4 38 -26 45 22 47 -26 -159 228 88 -24 -37 14 -41 -53 -91 -107 48 9 52 37 -88 51 186 198 47 -11
$$ packed form
3462a79J56Qj14K97k06N8o6J28j81K35j12M1j07K9O1J0R6k59K48k8j01o9J47n9
3486C3j41K35j22j12QJ06o6M4nL0K38l17J18R0k54J17Kj41K08k05J79l2j18L3
3510g2J4O6Q8K45m04R3J07j54l3P7j06J75m9p4o9J48MQ3Qj98J41l0O9m7j76J75
3536H1o3P8j0Q8r4m1J2q3K0Q1M5j1j73J47qp9j1j09J15j70L18j57J23J6k86K66
3562I5j15L16k04j35J57k27J67j10J28O7j51j41K81J15j69l9j9Jl0k2n0j73K40
3585a8P5j8M3o0p2Q2L0j67K20k45J69r6m1K66r3j56J82m2k6p0R6Qm0J3n7j0j46
3612a73J75l6N0J14l6j92J0J46Jk00m8J87J3k33K38k5J2N8k12R1K7lJ84j96M4
3637dM2o4P1k3K5p3j33L87j40j12j3N1n5j2l8j6J55l9M3j5j25J39J35J2j51n8
$$ plain form
3663 -11 23 -135 46 29 -59 -251 -86 -87 -137 -90 -32 -20 16 9 -12 -155 165 -34 -66 194 91 -36 6 -56 -133 -44
3689 -44 1 -131 82 -65 -138 -38 -58 -189 -161 15 -62 68 -108 84 92 -243 -85 94 20 91 -211 117 -35
3712 -35 207 94 90 -219 2 -68 26 9 55 -66 134 27 118 -21 92 51 14 -56 9 -37 -41 17 5 34 -58 61
3738 61 183 29 5 -35 -33 82 -102 75 49 10 -16 -100 -57 95 31 26 -84 81 68 -52 141 -27 -83 -69 -118 -4
3764 -4 -156 134 -125 2 66 -78 38 -12 -75 37 129 -124 95 6 73 -40 -46 -32 128 122 -122 -130 -44 -10 -132 36
3790 36 -160 90 158 94 -18 45 -131 103 -257 37 -6 -108 -11 52 100 8 111 49 81 -33 -141 -32 -72 -49
3814 -49 -109 68 -43 67 46 -42 -3 -150 43 -184 66 23 -22 91 26 -173 71 -37 -72 64 -19 40 -152 18
3838 18 -71 -137 190 -96 33 67 -44 28 2 -15 -31 71 -13 -15 167 -16 91 112 125 -167 -17 105 -115 -13
$$ packed form
3663a1L4j58J81j7q8j92J65jn0M7N8J2L6pk1j43L20j99l2K60j03j27M2o2p7Q9
3689d4M5j32K13j47p3J00k0j31K8J76p7J30j76J92Ql35J58J79p4P1l02L28j52
3712c5K42j13ml09K21p0R4j7M6j21K00j07R1j39J13m1l7p0O5m6mN8j2K9r2J19
3738F1J22j54k4m0KJ15j84J77k6l9k6q4M3J52o4nj10J65j3j20J93j68n6J4m9J14
3764dj52K90k59J27O4j44J16n0o3J12R2k53K19q9O7j13oJ4J60ok44qQ6L4j22J68
3790C6j96K50O8o4j12O3j76K34l60K94m3j02R7O3M8r2J03o2L2j14j08J09m0K3
3814d9o0J77j11J10k1q8L9j47J93k27K50m3m5J13o5j99K44j08l5J36q3N9j92J70
3838A8q9o6L27k86J29L4j11P2k6j7j6J02q4kJ82j83J07K1J3k92J50J22k20J02
$$ plain form
3862 -13 25 -6 57 70 33 -80 21 27 -89 -46 -20 -158 114 -54 123 -31 1 92 -54 86 -20 47 35 -150 -48
3887 -48 230 45 -60 -1 10 -56 69 -25 -59 -10 -22 163 91 93 71 40 17 -22 -75 58 103 122 106 95 -45 -114 -73
3914 -73 -59 90 -1 42 139 36 6 35 -189 79 -94 -190 -69 45 -194 116 -16 -17 23 68 13 30 -146 191 -2
3939 -2 146 29 34 101 109 13 30 66 -55 41 -13 46 67 94 -5 -19 -7 0 144 17 54 42 40 -39 9 -74 12 79 74 -21 -5
3970 -5 -45 108 -13 28 4 -21 6 13 -33 14 34 103 -31 -40 43 50 -33 -28 108 194 -75 -91 -74 -56 29 -31 -60 48 134 144
4000 144 -34 29 -63 80 -81 34 102 60 129 71 141 -60 -46 69 -157 -31 135 -41 120 24 115 100 26 98
4024 98 33 -121 -1 -44 40 32 187 90 -55 -70 -174 -182 35 8 105 41 -80 -57 68 -30 -91 85 -64 -107 -151 -40
4050 -40 66 75 -65 -79 -64 61 86 8 49 -69 -154 -89 -24 18 8 30 -188 21 60 27 194 104 119 -31 -40 -100 -71
$$ packed form
3862a3L8l1O3J3l7j13J01Oj16M3K6j38K72j68J77j54L2R1j46J40j06O7j2j85J02
3887d8K78j85j05N9J1o6J25r4l4M9j2J85p2Kk2l1k3l9n3J33M5J9j6j1j40o9M1
3914g3J4J49r1M3R7j03l0K9k24K68j73r6J21J14k39L10j32jM0M5n5J7j76L37j93
3939bJ48j17NO7Qr6J7L6j21R6n4N9K1K7r9j4J2PJ44j27L7j2kp9M8q3Q6O7nr5J6
3970em0J53j21M1k4k5K7Pm6M7K0O9j34rQ3Pq3NJ36Q6k69j6J7J8Q5o0k9J08Q6J0
4000A44j78O3r2J43j61J15O8m2O9n8P0k01J4J15k26J26J66j76J61r6R1j5p4P2
4024I8o5j54J20m3Q4qJ55r7j45j5j04qK17k7R7o4j21K3J25r8o1J76j49m3m4J11
4050d0J06Rj40j4J5J25K5p8M1j18q5O5O5M2j0K2k18K09L9l3J67r0J5j50ro0K9
$$ plain form
4077 -71 -42 55 132 -102 -50 8 -20 -19 -96 -39 -202 -15 -115 94 67 -102 -17 -27 -176 -50 22 -63 229 70 94 -22
4103 -22 -234 -132 26 -59 -28 -72 -39 -17 146 43 186 16 -150 31 113 53 43 109 33 -48 35 190 0 7 -63
4128 -63 -190 4 -101 -10 16 58 -19 -5 -11 -168 -40 -64 -50 -56 59 -18 5 -19 -20 -191 104 -9 -121 -84 36 145
4154 145 -44 0 -58 29 88 54 26 75 -66 13 15 132 38 -5 11 10 -33 85 92 -57 64 74 -71 -119 38 -63 22
4181 22 -41 -152 74 -93 -105 -122 27 -143 -15 -63 -109 -11 53 56 -19 -61 60 20 -56 34 -19 -113 -52 -80 40 -128
4207 -128 91 -184 67 90 -29 -1 12 121 -45 104 -33 41 -141 -33 -85 26 -64 112 162 35 -34 154 -23
4230 -23 91 -130 26 -10 -113 -75 -99 -176 -2 1 180 88 23 -192 -2 6 165 159 60 -16 39 51 -37 193 91 59
4256 59 74 183 34 -68 145 -16 135 52 100 126 -11 87 -87 -144 -125 44 60 -107 -40 14 160 71 -142 331
$$ packed form
4077g1K9R7P7k34N2N8k8Jp7N7j63J87j00K09k7j69Q5j0j49J26P2q5K92j59K4j16
4103b2k12J02J58q5L1m4L3K2J63j03J43j70j66J81Q2o0j0O6p6q1Q3J55j90Pp0
4128f3j27J94j05R1K6M2p7J4oj57J28k4J4oJ15p7K3k4jj71K95j13j12L7J20J09
4154A45j89M4n8Q7N9l4k8M9j41P9KJ17r4m3J6jm3J18Pj49J21J0j45m8J57j01Q5
4181B2o3j11K26j67j2j7J49j70J28m8m6R8O4Lp5m2J21m0p6R0n3r4O1k8J20j68
4207a28K19k75K51K3j19K8J3J09j66J49j37P4j82J08n2J11r0J76N0j27o9J88j77
4230b3J14k21J56l6j03L8k4p7J74LJ79r2o5k15J90QJ59or9p6N5J2q8K30j02l2
4256E9J5J09j49j02K13j61J51q3M8K6j37R8j74n7J9J69J6j67O7N4J46q9k13M73
$$ plain form
4280 331 -3 44 29 -59 78 -1 -61 -24 122 21 -10 -3 106 70 27 122 -1 132 136 111 -64 -27 18 102 -36 -111
4306 -111 -44 -85 32 -97 34 -118 15 64 43 -28 -165 -21 262 -96 -122 104 53 -148 -36 -29 -112 -87 -75 18
4330 18 -35 22 -58 67 -40 37 -77 265 -3 -60 7 91 -207 -118 -69 15 -1 -42 194 195 221 -175 -32 8 96 -56
4356 -56 104 -41 99 -279 165 95 -11 43 -65 145 5 -79 -222 -15 52 63 -119 -112 -90 87 -26 -84 13 160
4380 160 36 93 30 112 42 -162 -45 77 84 -98 194 99 -50 -123 92 -29 -16 -39 31 204 151 -10 -144 -206
4404 -206 -13 169 166 -193 5 8 61 41 -101 103 -77 -155 45 72 33 -6 34 14 102 -90 -17 106 -105 39 -88
4429 -88 -225 6 8 -93 109 138 133 -78 30 -45 136 -5 -87 1 -60 14 -74 34 98 -68 -134 38 -58 -142 59
4454 59 94 54 -112 -85 40 21 86 -23 -2 -67 15 -53 101 -95 50 -98 27 18 -82 95 70 -20 -54 104 -66
$$ packed form
4280C31l34M7j5q8J37p9o0L7J46j01l1PJ09l6m3R5j23J33Mk5j75L7M5Q4j38p5
4306a11O7m1J17j29J31j52J33M9k1p1j37J44K83l58k6K26n1k01J12Pq3K5J2R3
4330A8n3N7q0J25j07P7j14L42k68n7O7Q4k98Q9M9Q4j6m1K36JK6l96J43M0Q8j52
4356e6J60j45J40l78M44p0j06N4j08K10j40q4j43K07O7J1j82PK2J77j13n8R7J47
4380A60j24N7o3Q2p0k04J17J22Pj82K92r5j49p3K15j21J3k3P0J73n3j61j34o2
4404b06J93J82ll59J98LN3k0j42K04j80p8K00K7l9l9M0k0Q8j92P3J23k11J44j27
4429h8j37K31Kj01K02K9nk11J08p5J81j41q2Q8o1P4q8J08O4j66o6J72r6q4K01
4454E9L5m0j66K7J25j9O5j09K1o5Q2o8J54j96J45j48J25rj00J77k5r0l4J58j70
$$ plain form
4479 -66 17 -1 -44 11 127 -1 17 115 151 -134 -56 2 75 -126 21 -65 -71 -41 -3 23 28 50 -27 89 -137 -13 57
4506 57 -115 -2 -154 -169 12 -95 -64 -178 -58 5 -95 7 26 199 2 -27 -23 91 19 -72 126 62 14 -142
4530 -142 99 -41 -87 -144 94 -58 3 -115 -139 40 -11 95 186 135 163 15 155 75 50 125 -155 104 -99 9
4554 9 204 -100 -124 73 -1 135 93 -38 -153 15 -48 -69 26 32 89 -18 41 -58 65 -58 33 65 38 -72 -31 83
4580 83 -60 109 -56 87 -117 -99 102 24 -163 -10 43 -108 -25 78 -128 38 86 21 -60 -153 87 -34 -53
4603 -53 13 17 28 -2 -2 146 133 4 -177 -140 -49 -33 -14 15 72 145 109 -20 -11 79 76 -43 1 -111 47 42 101 -154 20
4632 20 -15 133 -60 27 99 -24 37 -124 61 -116 -3 104 -41 24 -153 47 -6 -61 -64 -16 23 13 44 -18 -37
4657 -37 -15 -50 -130 -219 88 -123 -32 -102 -212 89 -172 97 -62 60 85 17 -15 104 108 -17 -83 109 186 23 59
$$ packed form
4479f6Q3j8m3N5J16j28J8R8L6k85P8N8P3k01J47q6oL0L8K6NK2p7J16k26J24P0
4506E7j72J13j52j5J81j07L1j14J20O3j00J02J9J73j97k9MJ14p2r1J98o4m8j56
4530a42K41j40m6n7K38j52O1j18k4J79n1J06R1n1K8j48J40q0k5P5k80K59k03J08
4554IJ95l04k4J97p4J36m2j31j15J68o3k1R5ON7j07N9r9J23j23R1L2k7j10M1J14
4580H3j43J69j65J43k04J8K01p8j87J53N3j51Q3J03k06J66M8o5q1r3K40j21j9
4603e3O6MJ1l0%J48j3j29j81L7R1J6J9K9N7P3l6j29RR0lj19M4j12J58nN9k55J74
4632B0l5J48j93Q7P2j23O1j61J85j77J13J07j45O5j77K00n3n5lM8L9j0L1o2j9
4657c7K2l5q0q9L07k11R1p0j10L01k61K69j59J22K5o8l2J19Mj25o6J92P7j63L6
$$ plain form
4682 59 -26 114 48 70 -74 -30 165 1 114 -161 -23 128 35 -65 -107 228 -93 -36 -117 -49 36 88 -109 58
4706 58 -11 76 22 -38 2 -131 229 131 -25 -89 -44 159 -16 14 13 -5 227 -32 -114 -38 62 79 99 -103 96 -66
4732 -66 52 31 -89 66 -102 76 113 108 -59 166 77 -42 -59 -119 36 -116 -6 -132 8 28 0 -19 -113 -22
4756 -22 -56 39 -11 12 -11 -131 -141 -20 -25 -12 -47 136 -48 -44 -8 -111 71 146 -57 74 88 -82 155 37 -102
4781 -102 128 -79 -185 0 130 27 9 -41 7 165 -70 -94 11 69 -49 48 8 110 189 -78 55 -52 -84
4804 -84 -133 -104 -82 9 -87 70 34 -92 124 -110 -140 -35 -129 -108 52 17 -145 -15 29 -39 -54 266 -62 -17 -146
4829 -146 -32 199 56 95 157 73 -79 39 -160 16 159 -25 204 -33 -73 46 163 115 87 92 -77 37 66
4852 66 96 -98 77 -24 43 13 73 61 -36 81 12 -42 0 -59 50 78 -22 -62 179 -26 13 -76 -132 -138 39 88
$$ packed form
4682E9q5J40o6K2j44M4J95j64J13k75J38J51r3j00m2L35l21N7q1O8Q5N2j97J67
4706E8o9Q7n4o0M0j33L60r8j56o4M5K03j75L0jj8K32k59q2P6J00J7K0k02J99j62
4732f6J18k1j20J55j68J78L7nj67K25q9j19j7o0J55j52J10j26J40K0k8j9r4R1
4756b2l4R5n0K3k3j20j0J21nJ3l5J83j84ML6j03J82P5k03J31J4j70K37j18j39
4781a02K30k07j06J85J30j03j8n0M8J58k35k4J05N8j18R7m0J02P9k67J33j07l2
4804h4m9K9K2R1r6J57l6j26K16k34l0J05r4K1J60l5j62J30M4o8j5L20l28M5j29
4829a46J14K31j43L9O2q4j52J18j99J76J43j84K29k37m0J19J17m8k8Nj69J14K9
4852F6L0j94J75j01O7l0O0j2r7J17o9n4M2n9J09K8j00m0K41k05L9q9n6oJ77M9
$$ plain form
4878 88 -54 -95 -105 234 2 -40 -90 156 -52 139 188 60 -121 32 116 140 -16 34 106 30 -31 78 31 -94
4902 -94 141 64 -43 -49 -10 -91 -95 32 -55 87 -180 -62 -62 24 166 64 -182 58 122 110 -49 131 -40 129 34
4927 34 106 -104 -2 4 -30 66 -109 133 43 167 -98 119 -21 111 127 4 -70 196 105 -68 59 63 -80 98
4951 98 2 -119 -131 170 -128 37 -63 19 -17 40 12 -23 -204 73 -191 -55 -32 83 19 -19 -22 -32 -44 104 -36
4976 -36 7 9 94 48 48 52 -113 9 -119 78 -73 113 -93 16 -88 -76 6 -59 -94 164 22 -9 56 -54 62
5001 62 20 47 40 -115 -128 25 -137 12 -5 165 -61 -68 -68 -29 -7 -26 10 132 -52 62 -17 91 -127 -65 -67 -100 -26
5028 -26 1 6 74 46 137 41 -23 46 178 -81 180 123 113 -171 -15 228 -83 127 -48 9 -56 -84 -151 105 -83
5053 -83 -97 -6 -99 -85 139 133 -74 23 -1 -37 101 15 -16 -23 254 -67 51 -17 -26 -134 -56 21 174 -148 -13 208
$$ packed form
4878H8j42m1j0L39k32m2n0K46k08J91M9j28j81J53Q4K4j56N0P2p6o1J09m7j25
4902i4K35p7j07oL9q1mJ27q7J42k67J18%Q6J42j02k46K40O4j2j59J80j71J69r5
4927C4P2k10J02Ol4R6j75K42r0J24k65K17j40J32J6j23p4K66r1j73J27Mj43J78
4951I8r6j21j2L01k98J65j00Q2l6N7k8l5j81K77k64J36K3J15o4l8lj0j2J48j40
4976c6M3KQ5m6%Mj65J22j28J97j51J86k06J09j04J2Q2o5l5K58j42l1O5j10J16
5001F2m2K7pj55j3J53j62J49j7J70k26p%L9K2j9L6J22j84J14p9J08k18O2kl3P4
5028b6K7NO8k8R1r6o4O9J32k59K61n7j0k84J56K43l11K10j75N7o5k8o7K56j88
5053h3j4R1r3J4K24ok07R7k4l6J38q6l1pK77l21J18o8rj08P8P7J53l22J35K21
$$ plain form
5079 208 2 122 -71 49 -96 -253 111 -71 -97 91 111 6 -32 40 -96 229 -99 -108 -2 24 24 -9 -1 75
5103 75 -45 -6 -18 -16 -91 28 -241 -78 164 -81 -17 91 93 104 0 12 -84 -104 128 162 71 42 68 103 74 14 0
5130 0 -191 74 200 21 237 -92 56 44 63 48 22 62 165 -146 -12 90 69 -49 -42 -40 95 119 85 78 -88
5155 -88 -25 96 71 -114 -6 83 30 -21 92 88 -11 85 75 35 115 -95 -14 -165 -103 110 -32 40 83 90 -88 -20 112
5182 112 51 83 -40 -105 130 -145 164 -93 -73 109 46 -69 -21 -141 18 24 30 149 24 151 -66 65 -86
5205 -86 -208 -172 -144 203 -32 27 -101 -167 77 -20 -21 40 75 -81 76 -71 -17 -213 -100 51 -24 66 -80 148
5229 148 -34 -167 7 -68 -121 61 190 -97 79 120 -77 -112 108 41 88 192 -113 12 -106 140 -99 94
5251 94 84 1 -27 -62 10 -99 -7 -29 -53 40 -93 106 17 -241 -77 120 143 71 -6 5 111 124 55 54 115 48 7
$$ packed form
5079B08k06J20j93J20j45j57L64j82k6J88K0j05l8P2j36L25l28rJ06K6%l3QP6
5103G5j20L9j2Kp5J19k69J63K42k45O4J08KJ1j04J2r6k0K32L4r1k9K6L5k9o0j4
5130@j91K65J26j79K16l29J48j2J9j5k6M0J03l11J34J02k1j18PKJ35K4l4pj66
5155h8O3J21k5j85J08Q9n3n1J13mr9R6j0m0Q0k10Q1j51O2K13j42P2M3Pj78O8J32
5182A12o1L2j23o5K35k75L09k57K0J82o3j15M8j20J59OOJ19j25J27k17J31j51
5205h6j22L6K8L47k35N9j28o6K44r7jO1L5j56J57j47N4j96J13J51p5R0j46K28
5229A48j82j33J74p5n3J82J29k87J76M1j97l5K20o7M7J04l05J25j18K46k39J93
5251I4j0q3k8l5P2j09R2k2k4R3j33J99q9k58J64J97K3p2p7J1J06J3o9jO1o7m1
$$ plain form
5278 7 100 -26 -203 49 60 28 239 -43 -17 -11 117 50 -63 35 -23 -30 -145 -101 -76 -45 -26 -51 -23 -7 -42 -32 -44 95
5306 95 -128 -3 -77 -131 -15 3 -30 108 43 -84 -362 -137 -46 -46 131 26 34 40 126 -27 -116 -20 36 -22 134 11
5332 11 -78 -132 183 17 -162 106 42 93 29 8 -39 -1 146 107 -14 60 120 30 -99 169 33 -48 -83 5 94 -112
5358 -112 59 12 102 -91 -121 -14 -183 45 -79 10 -10 -113 159 37 -201 -70 -101 -37 74 -7 54 -125 31
5381 31 62 -79 15 -86 -47 82 -19 -18 -115 82 -18 173 -73 149 -31 51 -98 -119 61 85 -22 -79 -85 -59 11
5406 11 -36 39 46 -127 143 13 -68 118 -192 -7 -3 49 -38 -68 131 1 30 -47 -47 -25 -161 -37 -111 -29 30 108 135
5433 135 96 -90 -25 -75 45 48 5 -147 -110 -24 -33 -12 41 -56 152 -109 32 75 -37 9 -27 -11 -35 60 63 -82 38
5460 38 -74 30 -89 -52 -98 -93 42 -20 -17 -118 -67 -118 -102 106 -145 -14 128 89 78 10 74 -119 -29 -37 -102 82
$$ packed form
5278GR3j26j77K52J1l2K11k82K6OJ28o7j13R8n8pj15M4K5L1J9k5K8J6l5J0j2J39
5306I5k23J25p4n4J16J8l3J38o5j27k78K25R1%J77j05QOQ6j53q9R6N6n8J56j23
5332A1q9n4L15j66j79K68o4N1o4k1m7L8J47l9j21P4O0r0j29K68j36q1l5Q8Q9k06
5358a12J71m7R0j93l0J07j69K28j24Q9k0j03K72j22k38J31l1O4J11q1O1j79J56
5381C1L1j41R4j01L9J29j01Jr7J97j00J91k46K22j80Q2j49k1J80K4j07n7oK6P0
5406A1m7P5Pj73K70j30q1J86l10J85MN2q7l0J99j30K9p7%K2j36J24p4Q2N9P8K7
5433A35l9j86O5n0J20Lm3j52L7Q6rK1N3r7K08k61J41M3j12M6l6J6k4R5Lj45J20
5460C8j12J04j19L7m6NJ35o2Lj01N1n1J6K08k51J31J42l9j1o8O4j93R0qo5J84
$$ plain form
5486 82 -116 40 -151 51 -81 -62 -98 -109 121 -115 181 85 -69 -101 98 -73 -23 -68 54 67 99 89 -80 267
5510 267 51 20 -12 -16 23 -90 -48 51 -57 -26 -38 -38 -86 38 -56 9 -14 -287 -15 63 -34 93 11 -33 -8 -170 -79
5537 -79 194 100 32 -102 -22 -83 -48 57 14 -118 61 -140 155 -85 -96 -34 43 -40 105 124 132 -42 59 30 114
5562 114 -108 76 -47 -107 -4 -37 66 -50 15 -17 -26 94 -35 -76 -233 -98 -43 -60 -31 -22 111 -7 -36 49 50
5587 50 -208 -43 64 -53 174 -225 -63 -36 -27 194 116 5 -1 87 46 -25 -202 -121 61 199 -82 209 -110 -22
5611 -22 150 -70 111 62 -27 -160 -108 38 -110 135 -18 67 100 -23 -141 8 93 -79 86 -110 6 -29 -67
5634 -67 -89 28 -96 -96 -30 15 28 -47 52 145 -79 -2 64 -90 -23 -96 -27 84 -99 -107 33 -52 3 120 -19 -46 70
5661 70 -76 63 22 47 13 -133 65 3 -48 88 86 -10 -182 19 -86 42 23 -53 31 -31 -185 -130 -67 -30 78
$$ packed form
5486H2j98J56j91K02j32J9l6j1K30k36K96r6j54l2J99j71N0m5J22J3L2j0j69L47
5510B67k16l1l2mL9j13M2R9j08L1j2%m8J24r4O5k3k73K72P8r7J27q2m4K5j62R1
5537g9K73r4o8j34Q0o1L5J05m3j32J79k01K95k40j1O2P7q3J45J9Qj74J01k9Q4
5562A14k22J84j23o0J03l3J03j16O5l2rJ20j29m1j57J35N5j7K9RJ33j18k9Q5J
5587E0k58J65J07j17K27l99J62K7RK21p8j11oQ8m1p1j77Q1J82J38k81K91l19Q8
5611b2J72k20J81m9q9j33N2J46j48K45j53Q5L3j23j18J49Q5j72J65j96J16l5l8
5634f7k2J17j24%O6M5J3p5R9R3k24P7O6j54O7p3O9J11j83qJ40q5N5J17j39k7J16
5661G0j46J39m1K5l4j46J98o2n1J36kr6j72K01j05J28j9p6Q4o2j54N5O3L7J08
$$ plain form
5686 78 -28 -57 65 -37 -72 -186 6 33 101 38 -4 13 85 63 169 189 -20 -110 1 -93 39 -201 19 182
5710 182 -3 -55 -92 129 -68 -83 199 43 138 36 -114 47 -13 -8 21 -39 -163 3 -52 -12 48 40 166 -8 -47
5735 -47 -46 -54 53 -24 28 -57 -48 -34 141 -13 37 134 7 -190 -217 -78 138 47 58 63 -83 -29 84 109 -117 14 -45
5762 -45 -151 8 -24 44 119 53 -7 -25 -35 -79 228 57 -74 27 -123 5 -110 -70 69 -35 -26 -15 -27 -90 -156
$$ packed form
5686G8j06k9J22j02l5j14J92K7O8o3m2J7P2k2J06K0k09r0J11r4J32k40K20J63
5710A82j85n2l7K21j97j5K82j56R5j02j50J61o0NK9o0j24J66n5M0O0qJ26j74l9
5735d7JqJ07p7N2q5RJ4J75j54N0R7j27j97k7J39K16r1J1Nj46N4J13K5k26J31n9
5762d5j06J59l2O8P5o6o0j8j0m4L07j71j31J01j50J28j15M0J39j04RJ1j2o3o6
$$ [...]
8191a9
##END NTUPLES=NMR FID
##END=
