##TITLE=1H_DE-80H3_b
 200.13MHz, D2O,
 8 sc
 
 17.2.2025
##JCAMPDX= 6.0         $$ Bruker NMR JCAMP-DX V2.0
##DATA TYPE= NMR FID
##DATA CLASS= NTUPLES
##ORIGIN= UXNMR, Bruker Analytische Messtechnik GmbH
##OWNER= pz
$$ XWIN-NMR		Version 3.5
$$ Mon Feb 17 16:25:20 2025 Russian Standard Time (UT+4h)  she@DPX200
##.OBSERVE FREQUENCY= 200.1313
##.OBSERVE NUCLEUS= ^1H
##.DELAY= (6, 6)
##.ACQUISITION MODE= SIMULTANEOUS
##.ACQUISITION SCHEME= undefined
##.AVERAGES= 8
##.DIGITISER RES= 18
##SPECTROMETER/DATA SYSTEM= spect
##.PULSE SEQUENCE= zg30
##.SOLVENT NAME= D2O
##.SHIFT REFERENCE= (INTERNAL, D2O, 0, 14.3821)
##AUDIT TRAIL= $$ (NUMBER, WHEN, WHO, WHERE, WHAT)
$$ ##TITLE= Audit trail, XWIN-NMR		Version 3.5
$$ ##JCAMPDX= 5.01
$$ ##ORIGIN= Bruker BioSpin GmbH
$$ ##OWNER= she
$$ F:/spectra/data/she/nmr/H-C/1/audita.txt
$$ ##AUDIT TRAIL=  $$ (NUMBER, WHEN, WHO, WHERE, WHAT)
(   1,<2025-02-17 16:24:22.37 +0400>,<she>,<DPX200>,
      <created by zg, POWCHK disabled, PULCHK disabled
       configuration hash MD5:
       00 E9 B6 7A A2 85 ED C7 34 08 36 98 17 FE 4E 26
       data hash MD5: 16K
       35 11 70 04 6A 73 FE FD B4 D9 BA 82 FD 5E 2E 3C>)
$$ ##END=
$$ 
$$ hash MD5
$$ CF F4 57 43 F4 AD 64 59 4F BB 7C 43 51 7A E0 9E
##$RELAX= 
##$RELAX= 
##$RELAX= 
##$RELAX= 
##$RELAX= 
##$RELAX= 
$$ Bruker specific parameters
$$ --------------------------
##$DU= <F:/spectra>
##$EXPNO= 1
##$NAME= <H-C>
##$PROCNO= 1
##$TYPE= <nmr>
##$USER= <she>
##$AMP= (0..31)
100 100 100 100 100 100 100 100 100 100 100 100 100 100 100 100 100 100 
100 100 100 100 100 100 100 100 100 100 100 100 100 100 
##$AQSEQ= 0
##$AQ_mod= 1
##$AUNM= <au_zg>
##$AUTOPOS= <>
##$BF1= 200.13
##$BF2= 200.13
##$BF3= 200.13
##$BF4= 200.13
##$BF5= 200.13
##$BF6= 200.13
##$BF7= 200.13
##$BF8= 200.13
##$BYTORDA= 1
##$CFDGTYP= 0
##$CFRGTYP= 5
##$CHEMSTR= <none>
##$CNST= (0..31)
1 1 145 1 1 1 1 1 1 1 1 1 1 1 1 1 1 1 1 1 1 1 1 1 1 1 1 1 1 1 1 1 
##$CPDPRG= <>
##$CPDPRG1= <>
##$CPDPRG2= <>
##$CPDPRG3= <>
##$CPDPRG4= <mlev>
##$CPDPRG5= <mlev>
##$CPDPRG6= <mlev>
##$CPDPRG7= <mlev>
##$CPDPRG8= <mlev>
##$CPDPRGB= <>
##$CPDPRGT= <>
##$D= (0..31)
0 0.7 0 0 0 0 0 0 0 0 0 0.03 0 0 0 0 0 0 0 0 0 0 0 0 0 0 0 0 0 0 0 0 
##$DATE= 1739795061
##$DBL= (0..7)
120 120 120 120 120 120 120 120 
##$DBP= (0..7)
150 150 150 150 150 150 150 150 
##$DBP07= 0
##$DBPNAM0= <>
##$DBPNAM1= <>
##$DBPNAM2= <>
##$DBPNAM3= <>
##$DBPNAM4= <>
##$DBPNAM5= <>
##$DBPNAM6= <>
##$DBPNAM7= <>
##$DBPOAL= (0..7)
0.5 0.5 0.5 0.5 0.5 0.5 0.5 0.5 
##$DBPOFFS= (0..7)
0 0 0 0 0 0 0 0 
##$DE= 6
##$DECBNUC= <off>
##$DECIM= 32
##$DECNUC= <off>
##$DECSTAT= 4
##$DIGMOD= 1
##$DIGTYP= 9
##$DL= (0..7)
0 120 120 120 120 120 120 120 
##$DP= (0..7)
150 150 150 150 150 150 150 150 
##$DP07= 0
##$DPNAME0= <>
##$DPNAME1= <>
##$DPNAME2= <>
##$DPNAME3= <>
##$DPNAME4= <>
##$DPNAME5= <>
##$DPNAME6= <>
##$DPNAME7= <>
##$DPOAL= (0..7)
0.5 0.5 0.5 0.5 0.5 0.5 0.5 0.5 
##$DPOFFS= (0..7)
0 0 0 0 0 0 0 0 
##$DQDMODE= 0
##$DR= 18
##$DS= 0
##$DSLIST= <SSSSSSSSSSSSSSS>
##$DSPFIRM= 0
$$ [...]
##$SUBNAM0= <"">
##$SUBNAM1= <"">
##$SUBNAM2= <"">
##$SUBNAM3= <"">
##$SUBNAM4= <"">
##$SUBNAM5= <"">
##$SUBNAM6= <"">
##$SUBNAM7= <"">
##$SUBNAM8= <"">
##$SUBNAM9= <"">
##$SW= 18.0517328524113
##$SWIBOX= (0..15)
0 0 2 0 0 0 0 0 0 0 0 0 0 0 0 0 
##$SW_h= 3612.71676300578
##$TD= 16384
##$TD0= 1
##$TE= 0
##$TE2= 300
##$TE3= 300
##$TEG= 300
##$TL= (0..7)
0 120 120 120 120 120 120 120 
##$TP= (0..7)
150 150 150 150 150 150 150 150 
##$TP07= 0
##$TPNAME0= <>
##$TPNAME1= <>
##$TPNAME2= <>
##$TPNAME3= <>
##$TPNAME4= <>
##$TPNAME5= <>
##$TPNAME6= <>
##$TPNAME7= <>
##$TPOAL= (0..7)
0.5 0.5 0.5 0.5 0.5 0.5 0.5 0.5 
##$TPOFFS= (0..7)
0 0 0 0 0 0 0 0 
##$TUNHIN= 0
##$TUNHOUT= 0
##$TUNXOUT= 0
##$USERA1= <user>
##$USERA2= <user>
##$USERA3= <user>
##$USERA4= <user>
##$USERA5= <user>
##$V9= 5
##$VALIST= <valist>
##$VCLIST= <CCCCCCCCCCCCCCC>
##$VD= 0
##$VDLIST= <DDDDDDDDDDDDDDD>
##$VPLIST= <PPPPPPPPPPPPPPP>
##$VTLIST= <TTTTTTTTTTTTTTT>
##$WBST= 1024
##$WBSW= 4
##$XGAIN= (0..3)
0 0 0 0 
##$XL= 0
##$YL= 0
##$YMAX_a= 679936
##$YMIN_a= -719276
##$ZGOPTNS= <>
##$ZL1= 120
##$ZL2= 120
##$ZL3= 120
##$ZL4= 120
##$ABSF1= 10
##$ABSF2= 0
##$ABSG= 5
##$ABSL= 3
##$ALPHA= 0
##$AQORDER= 0
##$ASSFAC= 0
##$ASSFACI= 0
##$ASSFACX= 0
##$ASSWID= 0
##$AUNMP= <proc_1d>
##$AZFE= 0.1
##$AZFW= 0.1
##$BCFW= 1
##$BC_mod= 2
##$BYTORDP= 1
##$COROFFS= 0
##$CY= -3
##$DATMOD= 1
##$DC= 2
##$DFILT= <>
##$DTYPP= 0
##$F1P= 0
##$F2P= 0
##$FCOR= 0.5
##$FTSIZE= 0
##$FT_mod= 4
##$GAMMA= 1
##$GB= 0.15
##$INTBC= 1
##$INTSCL= 1
##$ISEN= 128
##$LB= 0.25
##$LEV0= 0
##$LPBIN= 0
##$MAXI= 10000
##$MC2= 0
##$MEAN= 0
##$ME_mod= 0
##$MI= 1.114404
##$NCOEF= 0
##$NC_proc= 0
##$NLEV= 6
##$NOISF1= 3.799351
##$NOISF2= 2.8
##$NSP= 1
##$NTH_PI= 0
##$NZP= 0
##$OFFSET= 14.38212
##$PC= 1
##$PHC0= -470.6078
##$PHC1= 10.79222
##$PH_mod= 1
##$PKNL= yes
##$PPARMOD= 0
##$PSCAL= 0
##$PSIGN= 0
##$REVERSE= no
##$SF= 200.129724274929
##$SI= 16384
##$SIGF1= 3
##$SIGF2= 2
##$SINO= 400
##$SIOLD= 16384
##$SREGLST= <1H.CDCl3>
##$SSB= 0
##$STSI= 0
##$STSR= 0
##$SW_p= 3205.1282051282
##$SYMM= 0
##$S_DEV= 0
##$TDeff= 0
##$TDoff= 0
##$TI= <>
##$TILT= no
##$TM1= 0
##$TM2= 0
##$TOPLEV= 0
##$USERP1= <user>
##$USERP2= <user>
##$USERP3= <user>
##$USERP4= <user>
##$USERP5= <user>
##$WDW= 1
##$XDIM= 8192
##$YMAX_p= 0
##$YMIN_p= 0
$$ End of Bruker specific parameters
$$ ---------------------------------
##NTUPLES= NMR FID
##VAR_NAME=  TIME,          FID/REAL,        FID/IMAG
##SYMBOL=    X,             R,               I
##VAR_TYPE=  INDEPENDENT,   DEPENDENT,       DEPENDENT
##VAR_FORM=  AFFN,          ASDF,            ASDF
##VAR_DIM=   8192,          8192,            8192
##UNITS=     SECONDS,       ARBITRARY UNITS, ARBITRARY UNITS
##FACTOR=    0.0002768,     1,               1
##FIRST=     0,             0,               0
##LAST=      2.2672688,     0,               0
##MIN=       0,             -719276,         0
##MAX=       2.2672688,     679936,          0
$$ Real data points
##PAGE= N=1
##DATA TABLE= (X++(R..R)), XYDATA
0@%%%%%%%%%%%%%qJ6j6J6j6K4l2L2m0M8n6O4p2Q8j01J17j33J53j77J96k24K54
35A33k84L20l56L98m45M95n49O08o76P45q22R09j001J105j216J337j476J627j795
54i43J984k197K443k724L054l444L913m497N235o211P565r571J2861j9180L5698
69B3986j63196n10929o9137J70838K63051L36846M05771K22706r1621l16094l42936
80g0715l05788k01651J3026K79893L68847K59803J18774K3839j43797l35155l49263
91c42187j51043N5737J70882K44702K79639J87287p560j76188k41844k42022j78995
102d01592k1455J73900K59552K03909J12199L1999r1410k26463k44425j26445
112c30231J0305R9229J66702K04304J48392J0943j07602j50587j60615j49762
$$ plain form
0 0 0 0 0 0 0 0 0 0 0 0 0 0 0 -8 8 -8 8 -8 16 -16 16 -24 24 -32 32 -40 48 -53 64 -69 84 -93 103 -121 133
35 133 -151 169 -187 211 -234 261 -288 320 -356 389 -433 476 -525 580 -636 701 -775 852 -943
54 -943 1041 -1156 1287 -1437 1617 -1827 2086 -2411 2824 -3387 4178 -5393 7468 -11712 23986
69 23986 -139210 -650139 -719276 -548438 -285387 51459 457230 679936 588315 272221 -70715
80 -70715 -376503 -578154 -565128 -285235 83612 343415 462189 486028 342231 7076 -342187
91 -342187 -493230 -437493 -266611 -21909 257730 445017 437457 261269 19425 -222597 -401592
102 -401592 -423047 -249147 10405 214314 326513 358512 267102 40639 -203786 -330231
112 -330231 -319926 -220697 -53995 150309 298701 309644 202042 51455 -109160 -258922
122b58922n7944R8854J88377J53198Q7942M5223l3649j47819j89054j13995j0075
133b37864N6097J08380J51682J29792K6859p3932j07246j09202j09209o2714M7456
144a79901J30031J21397P1874L6124j2818q8746j29848r4764k4756K7905O8497
155g5005J04953J03481L9402l9739p4931p8405q1264n8406J4419Q5344R4574O1123
167I5546L3001L23n4820r4255p6367k4975J3131L9230P0400Q2796M1408k1862
179A03556n1535n1233n7744n2459l819N5470O8521M6637L0122J1213l0543o8345
191a59o0450k2983K992J8751M6472O4676L9295r532l2987l4539m2476m3340j0737
204h5017L3301M8019L5770K6140J4576j5885m7513m5837k0672j715Q862K8980
$$ plain form
122 -258922 -316866 -218012 -29635 123563 211505 256728 223079 75260 -113794 -227789 -237864
133 -237864 -181767 -73387 78295 208087 234946 161014 53768 -55434 -164643 -227357 -179901
144 -179901 -49870 71527 143401 179525 166707 77961 -51887 -146651 -171407 -143502 -75005
155 -75005 29948 133429 172831 133092 58161 -20244 -101508 -159914 -145495 -60151 34423 95546
167 95546 128547 128870 74050 -20205 -96572 -121547 -108416 -69186 1214 84010 125418 103556
179 103556 52021 788 -56956 -109415 -113234 -57764 10757 57394 87516 98729 68186 -159
191 -159 -60609 -83592 -80600 -61849 -15377 49299 88594 79062 46075 11536 -30940 -74280 -85017
204 -85017 -51716 -3697 32073 58213 72789 56904 9391 -36446 -57118 -58833 -49971 -20991
216b0991M6530L4320J97k1309k3977k8778l3077j4498J8261L3495K7070J9688
228C6931J4637m761l0865l5643j8809l037L082J6088L2369K9242N135j2945j5679
241A5745j9237k5739j5543R254K3718J9673J4192J3161J909j9405k7551j5152
253b4975l523n7P927K1923K3723O904p699j0100j1697j8607j4670L094J5654J4387
267B284J0558J0265M611j0247j9639j3615l762j066L117J3902J7811Q360m190
280A8389o736p335j2498j2348j350J0410J0739P600P297N222m461j3727j0656
293i454l738j014K89Q181J3987P555k737m018l697q180j0701k949P154P713M488
308B879N503N649j704r680q218k727j242j538M782J0332O700j292k696j910m990
$$ plain form
216 -20991 25539 59859 60056 38747 14770 -14008 -47085 -61583 -43322 -9827 17243 36931
228 36931 51568 46807 15942 -19701 -38510 -41547 -38465 -22377 9992 39234 44369 31424 15745
241 15745 -3492 -29231 -44774 -35520 -11802 7871 22063 35224 37133 17728 -9823 -24975
253 -24975 -28498 -28555 -20628 1295 25018 31922 24223 14123 2426 -16181 -30851 -27757 -12103 2284
267 2284 12842 23107 27718 17471 -2168 -15783 -19545 -20611 -17494 -3592 14219 22579 18389
280 18389 11653 4318 -8180 -20528 -21878 -11468 -729 6871 14168 19390 14929 1202 -9454
293 -9454 -13192 -14206 -13917 -5736 8251 15806 13069 9051 5354 -2826 -13527 -16476 -9322 -1609 2879
308 2879 8382 14031 12327 2647 -5571 -8298 -9540 -11078 -6296 4036 10736 9444 6748 4838 -152
323a52q259l511M083N561L369L940M352J2o107o209k120j249j732K141P194N737
339G050l0j989q81l133n509l470J852L752K483K515L572J499m339m610j843j057
355d138j585N63M606N132L30j149n36j535m055l440J085K458J536J645K877J466
371E260k107l573j476k16j834k19K989L757Q84q98j77n50k820k761J91K030J075
388d45M77K211J761j078k952j193j65j066p06J639K797J090n47k2m66j383j977
405b025n48J241Q88K27J444J146R8k019j233K32p35r08M74K301Q29J76m05J46
423A329p33j909m94Q92N95k54P58J399J65j378o70k69M3j121L11J577P78k77l0
442G12K37l21j212q94O61L16J33K13J237J90q23o17j72O0j000K89R83O15q5j87
$$ plain form
323 -152 -8411 -11922 -7839 -2278 1091 5031 9383 9395 3288 -2921 -5041 -6290 -8022 -5881 1313 7050
339 7050 7020 5031 4150 1017 -4492 -7962 -6110 -2358 125 2640 6212 7711 3372 -1238 -3081 -4138
355 -4138 -5723 -5160 -554 4578 4908 3759 3223 1688 -2367 -5807 -4722 -2264 -728 917 3794 5260
371 5260 3153 -420 -1896 -2112 -3946 -4165 -1176 2581 3465 2567 2390 1840 -980 -3741 -3550 -1520 -445
388 -445 32 2243 4004 2926 -26 -1219 -1384 -2450 -3156 -1517 1280 2370 1823 1801 1335 -48 -2025
405 -2025 -2573 -1332 -444 -217 1227 2373 2471 452 -781 -549 -1284 -2192 -1718 583 1412 1588 1183 1329
423 1329 596 -1313 -1807 -915 -320 -574 184 1583 1748 370 -300 -569 -526 -1647 -1336 241 1019 742 712
442 712 949 628 -584 -1478 -817 -501 -368 -155 1082 1272 449 -168 -340 -280 -1280 -991 -8 607 522 335
462C35K34J09j015n10N91J46J6K2O89K06j61o53p3J06o43l20N30O80J54l40J24
483B27K68o49m27K62J68K06l73L35N53n9m99n4J25m77J1L27M86k55l75P44m56
504H8j60l54L60K23l10j69M98Q8k5j02r3Qj80k93N8M71Q7r4PjJ89o44K19J92j26
529f3r4P9M39Q9j73l42K51j49n28K81L46O9j69J11M6J88n65r5J26Q3l42Q0N81
552B49J28n42L2L53l33k46J43J41L33l05j71L96m4k61Q8O5K28j73k69K03l18N99
574B96j50k87N9k4L9j00L9L02j07O4k98L14j92j68J78k5OJ23K8k84j96L65K6l65
598c57R8J78j41j38M64l3J4l5k12L31j86m0J58N2p9K9j15K22n00L58p7k94K48
621e5j12J95L4K0j86J85J02j38p4N8J29k28n9K02j79O8n0L61k84M18l00l05K82
$$ plain form
462 335 569 678 -337 -847 -256 -110 -94 -72 617 823 662 9 -64 42 -601 -921 -391 289 443 103 227
483 227 495 -154 -581 -319 -151 55 -318 17 570 511 12 -42 83 -394 -383 -56 430 175 -200 544 88
504 88 -72 -426 -66 157 -153 -322 176 264 239 137 44 52 -128 -421 -363 108 195 101 108 107 296 -348 -129 63 -63
529 -63 -157 -78 361 450 277 -65 186 37 -491 -210 136 205 36 147 193 381 -184 -279 -153 -70 -412 -332 249
552 249 377 -165 -133 220 -113 -359 -216 -75 258 -47 -218 178 134 -127 -39 26 254 81 -188 15 -303 296
574 296 146 -141 -82 -106 -67 -167 -128 174 67 131 -167 147 -45 -213 -35 -60 -54 69 97 -187 -383 -18 8 -357
598 -357 -259 -81 -222 -360 104 71 85 50 -162 169 -17 -57 101 153 74 103 -12 210 -290 68 -9 -303 -55
621 -55 -167 28 62 82 -104 81 183 45 -29 29 158 -70 -129 73 -106 -38 -88 273 -11 407 107 -198 84
644H4J26k27J30j6p9m2n0j65M01l11K21j8k95M16l27O7J1j62M7L93k83K41p5Q9
668A76p3J07j04l74J51P2K08k53J75Mj61J56j13L28m25L41k45J38j65J69k52q
690a48J41l3J28oj94J43j68J62k6j57K24k0k70K27M5q8J46nk39j00J61O6O8k87
714b30M95l81j66K99M86o50K01j81J69J38r0J36j23K0j72K07j73R0m34K20J30
735iJ52j08j50J96r5j9J26J50k69M15m90L44j42j57J30O5j13p4K14K19o14K7L39
758A37J66m77K78P0J68m53J52j61K46r4K37l12P4o6N4L0Q6j41k16K54P0M7J7q8
782G8J00q1j7j87J85r3j96N3J33N6m5m9O2J27j14k54K26K51k98J01r0r1J56j4
806ar1L83l45J45J25l0k66m2j60J49J80j22P7K1k8M4k7O5j4k2j93JJ18n4K61j97
$$ plain form
644 84 210 -17 113 97 18 -24 -74 -239 162 -149 72 54 -241 175 -152 -85 -74 -236 -189 204 -79 162 87 176
668 176 103 210 106 -268 -117 -45 163 -90 85 89 -72 84 -29 299 -126 215 -30 108 -57 112 -140 -148
690 -148 -7 -40 88 82 -112 31 -137 25 -1 -158 66 46 -224 3 48 -40 106 101 -138 -238 -77 -11 57 -230
714 -230 265 -116 -282 17 503 -147 54 -127 42 180 90 226 103 123 -49 158 -15 75 -359 -139 -9
735 -9 143 35 -115 81 -14 -33 93 243 -26 389 -101 243 101 -56 74 139 26 -48 166 385 -229 -202 137
758 137 303 -174 104 174 342 -111 41 -120 126 32 269 -43 31 -35 19 49 135 -6 -222 32 102 149 166 78
782 78 178 97 80 -107 78 -15 -211 -158 -25 31 -14 -63 -1 126 12 -242 -16 235 -63 38 -52 -143 13 -1
806 -1 -92 291 -54 91 216 186 -80 -122 -282 -133 47 -75 2 23 -5 39 12 77 63 41 -152 -151 -33 -87 174 -23
832b3N8p3m5J89j82l3J70J89o2j6j93J61k27R5qN2j93K20q7k51J78l5K31m8J8
857H5m5J13j51J80l52m4L71j21n8J36j13N5j1J40qj39N6P1K8l13m6K2J75K35m03
882a37k1K07M4k10J74J24j62j38J19K17k80m9M4J70j20J18j24m9N6M3j3Kn6J3
906b8%J81j04k87L31MJ73m12J86j15J89P1L3k73R8J85K0r4j35L9k26N9P5l2J15
931E3J21m54K14n8J57J42j85J65m81L59j03j00J96k9PJ01j64p4K30J15j63J4k01
954a38K99j24p8J69l48K38k6P3Qk43J31J73J9j92K6L6o5k2j08J91l92M65Q5j38
978C9j27m4J59K75p8k26k2Q1R6Nn9P5l43M7R7k00N48m27K1N3j4R9P1k78J79J07
1004A34j99L4J65k71K83j44o7J29k39L02k64k0J96J41n2l95K79j85J28m25K92
$$ plain form
832 -23 35 -38 -83 106 -76 -109 61 250 188 172 -21 140 -87 8 0 52 -141 79 -8 -259 -81 -116 115 67 85
857 85 40 153 2 182 -170 -214 157 36 -22 114 1 56 45 185 177 38 94 165 193 -120 -166 -144 31 266 -137
882 -137 -158 49 93 -117 57 181 19 -119 0 217 -63 -112 -68 102 -18 100 -24 -73 -17 26 13 15 -41 -28
906 -28 -28 153 49 -238 93 97 270 -142 44 -71 118 189 222 -51 47 232 252 158 23 62 -164 -105 -30 -62 53
931 53 174 -280 -66 -124 33 175 -10 155 -326 33 -70 -170 26 -3 4 105 -59 -133 97 212 49 63 -138
954 -138 161 37 -41 128 -220 18 -8 65 73 -170 -39 134 153 -39 -13 23 -42 -64 -172 19 -373 92 177 39
978 39 -88 -132 27 302 224 -2 -24 57 153 158 99 174 -169 -122 -25 -225 323 -104 -83 -30 -44 55 126 -152 27 134
1004 134 -65 -31 134 -137 146 2 -65 64 -175 127 -137 -157 39 180 128 -267 12 -173 -45 -470 -178
1025a78K06k34J96p3J47M8j71J44J91l08N4J40p1L2k98J56J46j84j09l0L12j03
1047A3p1J5N5j24O5%J31J35l28J82k51L27l97Q4J80o2m4L04j09k5q9P1j61n6K68
1072A13k00N3l9jq5P0P6J48j86J45L7r8K9j71K05q0K4k2J50k02l2m7J13J12k74
1097a62K71k33K85p5k63J18K06o6J11M4k35J61j42j5JK16K0k61R8r4K28O1j69
1120A05N0k53K10j07m0J03j38L34l84J93k77j13L40l0N9R9P4j13j58J24r7j18
1142a37L4J98j42R0j41K13k0k37O6n4M0j77l8K17Q5K1k81K4J01J78q8Q4r5K36
1166A77k24K59k96k3K21j00k25J68Mm3K5Nm4R0r2j08L0K16J45k69j87L70l46K56
1190Ip1k1r9j46L31K02j77j44L01M2l94L13k71P3J58m4k20J21J19l72M28j19P7
$$ plain form
1025 -178 28 -206 -10 -83 64 112 -59 85 276 -32 22 162 91 123 -175 -19 127 -57 -166 -196 116 13
1047 13 -58 -43 12 -112 -47 -47 84 219 -109 73 -178 149 -248 -164 16 -46 -90 214 105 80 -9 62 -99 -155 113
1072 113 -87 -34 -73 -74 -159 -89 -13 135 -51 94 131 33 62 -109 96 16 40 18 168 -34 -66 -113 0 112 -162
1097 -162 109 -124 161 86 -177 -59 147 81 192 236 1 162 20 5 6 222 242 -19 79 -15 213 274 105
1120 105 155 -98 112 5 -35 68 -70 264 -120 73 -204 -317 23 -7 52 151 225 112 -46 78 -19 -137
1142 -137 -103 95 -47 43 -98 115 95 -142 -76 -130 -90 -267 -305 -88 -3 18 -263 -239 -138 40 -48 36 -59 177
1166 177 -47 212 -84 -107 114 14 -211 -43 -39 -82 -57 -52 -96 -6 -98 -206 -176 40 185 -84 -271 99 -247 9
1190 9 -62 -83 -182 -328 3 205 28 -116 185 227 -167 146 -125 -52 106 62 -158 -37 82 -290 138 19 96
1213I6Oj53J85j57r7k11L40j71J44L7j13J5o7Q6M4Lj53J99j40K97M7J44k75ok47
1238a47J04L1K72k11j5oN2J15k14M5j57J03K27m00K21j07L52J28o78M49l17j2
1260a65L00k09r5K88q8k73L70K55k91j2n84O43k3O6k21n7j7J76K19k13k9P2mm89
1284c81L92l65L92n3J8r9J56J17j20n05M57K02j33O5o6j99J04L22m25K77j44j48
1306a36R4K7J66j94J12J11k69K4J7L25n01J28K29m81M82j11NK12L1o70K91J10
1328Bk49J04K49k54k4K80j22q0N1J94q3N7P5k33M8j03MM9p1j2L32m36K98j78J03
1353AR4K9j20j14J58J73j2J20o31K59J47N7l36p8M16l05K25j25J91j20L52m09
1375b8P0J45j10l29O14l06m2j06L13l89L57k51J96J34l37J27o6J39l60L12q7J87
$$ plain form
1213 96 102 -51 134 -23 -120 -331 9 -162 -18 19 -94 -79 -146 -60 -16 -13 -166 33 -107 190 237 381 106 100 -147
1238 -147 -43 -12 260 49 34 28 80 195 -19 26 -131 -28 199 -201 20 -87 265 393 -285 164 -153 -165
1260 -165 135 -74 -169 119 31 -242 128 383 92 80 -504 139 116 182 -39 -96 -113 63 282 69 40 112 108 -381
1284 -381 11 -354 38 -15 3 -96 60 177 57 -448 9 211 78 143 77 -122 -18 304 -121 156 12 -136
1306 -136 -42 -15 151 -43 69 180 -89 -65 -48 277 -224 -96 133 -348 134 23 28 240 271 -399 -108 2
1328 2 -247 -143 106 -148 -172 108 -14 -94 -43 151 68 125 200 -33 15 -88 -84 -35 -106 -118 214 -222 76 -102 1
1353 1 95 124 4 -110 48 221 209 329 -302 -43 104 161 -175 -253 163 -142 83 -42 149 29 381 -28
1375 -28 42 187 77 -252 362 56 14 -92 221 -168 189 -62 134 268 -69 58 -8 131 -229 83 -4 183
1397A83j61j17P0J02J5k16J68p7J21k19K30j06J6K7N6K33m05N0O0J86m25j00K52
1420e7k3O8O5Jl65K34j17l6J40O0j08L43j49k84M64l13J9j94K47j51L35j88L71
1443C62k65j58l7N0kp6L86m73l7N31j32p8m03M96j56k15J94J5M2r9J97m3j18j83
1467b02K42l08K11M9l16L66k16K49L0j11L86n14p3J48J34k32jk9J02P8M7K60m77
1490a77R1K62k66K54k94q6K63K09l77K87j04Rp4J38O7j08N8j76K30k92l9J60K
1513C7n0J07k6k44K14l23K14j02J17J51n1l18k44N65n8k3M01k64O8q8L7j51k98
1536c29L19l8M0j46J81K55l39J00n6N9k84J77m0j41K38L6J39j06K3L2q5l0k56
1559b51J75P3P2Kn4J38l1k76j33L96k13J36K91r0k56K53ql8p3j9J76k43J6q0m7
$$ plain form
1397 183 22 -95 -25 77 92 -124 44 -33 88 -131 99 -7 9 36 92 325 -80 -30 30 216 -209 -309 -57
1420 -57 -80 -12 53 54 -311 -77 -194 -230 -90 -30 -138 205 56 -228 236 -77 -58 -252 -5 -156 179 -9 362
1443 362 97 -61 -98 -48 -50 -126 260 -213 -250 281 149 71 -332 164 8 -207 -13 2 44 -55 142 99 -19 -202
1467 -202 40 -268 -57 -8 -324 42 -174 75 105 -6 380 -134 -207 -59 75 -157 -158 -187 -85 -7 40 300 -177
1490 -177 -86 176 -90 164 -130 -216 47 256 -121 166 62 71 -3 135 202 94 152 -24 206 -86 -125 35 37
1513 37 -13 94 68 -176 38 -285 -71 -173 -56 95 44 -274 -518 47 -11 -34 367 103 171 83 120 -31 -329
1536 -329 -10 -48 -8 -154 27 282 -57 43 -13 46 -238 -61 -101 -242 -4 32 171 65 88 120 35 5 -251
1559 -251 -76 -3 69 71 17 155 124 -152 -285 111 -102 34 325 235 -21 232 224 186 113 94 270 27 43 -37 -84
1584h4k06N09K3j85j37J51J83l09Q0j27J90Q2o4K5l12L68n9p5j73q7L09k9j91
1607a18L3r6K62m8k5J7k12L94l37mj53J23L8K58j17M34m77L63l48M5j23oK69k58
1631h6K23Q8j13k36J80O5j06k06N2j71L79j56L77l42M01m60K01l16K58J51m4o7
1653G2k7k21J29L55m69K05N7j80K58J40k18j58j1j31J1K15k58J93O8j2K3p4J96
1676A63l07l3M2R3P9N0k4j11Q0J38k45J56L4j01J00q2K85o1n03J68J42M4k10K37
1700A34n8Q8l36J47l8k85M43k12J30J01j45o8O3o5J93l6j10J01k05K02k14K25
1722E5J47J94k66l34j50M41K19Jj96J39l47K93o6k51j0K95m01K65j82K21q6O2
1744D3Pj27k0J39J26l00M1K57k21M8l52J23J67O4m3o2O2NR4j14K23l32K54j10
$$ plain form
1584 -84 -290 219 242 57 -80 71 254 -55 25 -102 88 170 106 131 -181 187 128 53 -120 -207 102 73 -118
1607 -118 -85 -181 81 33 8 25 -187 207 -130 -134 -287 -164 -126 132 15 449 -28 335 -13 32 -91 -97 172 -86
1631 -86 137 225 112 -124 56 121 15 -191 -139 -310 69 -87 290 -52 349 -111 90 -226 32 183 139 72
1653 72 45 -176 -47 308 -161 44 101 -79 179 319 101 -57 -68 -199 -188 27 -231 -38 30 18 41 -33 163
1676 163 -144 -177 -135 -42 37 87 63 -48 32 170 -75 81 115 14 114 32 317 256 -247 -79 63 107 -103 134
1700 134 76 164 -172 -25 -63 -348 95 -117 13 114 -31 -99 -36 -101 92 56 -54 47 -158 44 -170 55
1722 55 202 396 130 -204 -354 87 306 307 111 250 -97 196 130 -121 -131 164 -237 28 -154 67 -19 43
1744 43 50 -77 -97 42 168 -132 -91 166 -55 -7 -359 -236 -69 -5 -48 -110 -48 -43 51 -63 160 -172 82 -28
1768b8p1J39J55m36L78k83Qq6J49N8j3O4N8Q2j45J17j75L5n6J21j52N8ML2K9j02
1794f0Q5J42m51K61J16J4J8j15J68l30l2L56k86N1k1L46k76j30J38J36k34K28
1816A24J08j01j30ON9k62K33L9j6O2l8q5j1k76K65K64k21j17q2L60l01Q0Pn1j13
1841a97k4l7L41j25k3m1J26j65J77OM6j17J77k30N6N4m07L34M3k13J35K39k74
1864a19O7j8K42l20K77j15r4K26k08M09n53J60L38K6j66n1n4k20J46JJ38j65N2
1887ak31J37K23l1l6q2J01L5k42J95j96n2J52m9K08O3k03K02k30jmJ42k26J67
1911D1J3j01k9lK84j84j3j08J50L2R2L0r3K43p20L00J68k47k29L49l5k0J16o2
1935b6j65M02j78K54k80M5O5k79L9M5j51J78k7m7K09j35J15j1O0j7j00J1r2L50
$$ plain form
1768 -28 -99 40 195 -241 137 -146 -138 -224 -75 -17 -30 34 92 174 29 146 -29 6 -50 71 -81 -23 -19 13 42 -60
1794 -60 25 167 -284 -23 93 107 125 10 178 -152 -184 172 -114 -63 -84 262 -14 -144 -6 130 -104 124
1816 124 232 131 1 7 66 -196 37 76 60 122 84 -1 -12 -288 -23 241 20 -97 -179 181 -120 -40 -33 -84 -197
1841 -197 -221 -258 83 -42 -65 -106 20 -145 32 38 84 -33 144 -86 -30 24 -383 -49 -6 -219 -84 155 -119
1864 -119 -52 -70 172 -148 129 14 -80 146 -62 347 -206 -46 292 318 152 101 47 -173 -27 -26 112 -53 -1
1887 -1 -232 -95 128 97 61 -21 80 115 -127 68 -128 -180 -28 -77 131 194 -9 193 -37 -38 -42 100 -126 41
1911 41 54 -47 -76 -79 205 21 8 -100 50 82 174 204 111 354 -366 -66 102 -145 -374 -25 -60 -80 36 -26
1935 -26 -191 211 33 287 7 52 117 -162 -123 -78 -229 -51 -78 -125 84 -51 64 53 113 96 -4 7 -85 265
1959B65m08o2K05K67m96K06r5r6O2J69N0p4L0J72l08L3r9K58k90K33M8j97M2P6
1983in1j41M27k90L59o12M53P6k95L4J34j83K57j26N5n05K40K90j51m8J80J86
2005B80j84l49J18J26j67J34K48k16J91M5j10j58m4N5k08l3K28k9j55K55k80K82
2027B9j33J51k01O4M22j80j80J87m42M83j65j32J33j43L72l03J89j26J2K17j41
2048A13k16J65%J5J1k11K66l9j48k33K07K28j18Pk12J22k37K12K27Rj01j30R3
2071C0q5J98l7n5k5J47J00j35n9j71R9l5J17M6q2j23J68npj54O9j35M49m68l3
2096a86J09J34K22l89L9j4J42r3K09l04j6O3N8q2L48k71J36j41l73N08l9j0j87
2119a37J80k72K27O0j10L49k20m5Pm6k48K16k2K06k3j27J25l23K69L2J47m46L96
$$ plain form
1959 265 -143 -205 0 267 -229 -23 -118 -214 -152 17 67 -7 23 195 -113 -80 -179 79 -211 22 70 -127 -85 -9
1983 -9 -60 -201 226 -64 295 -317 136 212 -83 -49 85 -98 159 33 88 -417 -177 113 -38 -86 94 280
2005 280 96 -253 -135 -9 -176 -42 206 -10 181 226 116 -42 -86 -31 -239 -272 -44 -73 -228 27 -253 29
2027 29 -104 47 -154 -90 332 152 -28 159 -283 200 35 -97 36 -107 265 -38 151 25 37 254 113
2048 113 -103 62 62 77 88 -123 143 104 -44 -277 -70 158 40 47 -165 -43 -280 -68 159 168 67 -63 30
2071 30 -55 143 106 51 26 173 273 138 79 -92 7 -28 89 135 53 -70 98 93 86 -68 1 -134 315 -153 -186
2096 -186 -77 57 279 -110 -71 -85 57 -36 173 -131 -147 -84 -26 -108 240 -31 105 -36 -409 99 60 50 -137
2119 -137 43 -229 -2 58 -52 297 77 32 39 -7 -255 -39 -61 145 122 -5 120 -203 66 98 245 -201 195
2142A95k04p1J19q1K1j01R4j19K2K86k67J60j50J94k76oL4q9O2L01O5k07J15k31
2166a34J58r4L4K07j11Q8r8j2j9j01L26l64K81P6l19J53k15j48L50k2k12mJ0L83
2190B13k31M0M9N9k01Q3m6o5j36k6J88j26M3N0L8J24j42N3J42k40P9J8N4l5j10
2215a25m5L90l93j17J54j72J62K87k18M5n2q6J41K3QK99l28k49L08r6L39k70%
2238Ek0L43q0m53L39j3k08m7K81q5L5l1j17K74m45p6N26N6j17l32MJ36k8J74k09
2263h8j60R5K49k30J07j55J92N6J17k01n7o5J21q8P2J75l28N3j34K09J42j1J93
2286B64k21o1oJ40Rl45J91j46K83k07p1J08L7j63K68Pk97L79k05L5k6M4k82J50
2310a15K30l92J66P2K92j32k47J85K0k7j84R8K47k99p5j1K27o7O3L16k57K6k46
$$ plain form
2142 195 -9 -80 39 -42 -21 -122 -28 -147 -125 161 -106 54 -96 98 -178 -184 -150 -239 -177 124 189 -18 97 -134
2166 -134 24 -70 -36 171 60 148 50 38 19 -82 244 -120 161 237 -82 71 -144 -292 58 36 -176 -180 -170 213
2190 213 -18 22 71 130 -71 12 -34 -99 -235 -261 -73 -199 -156 -106 -68 56 -86 -33 109 -131 -52 -34 20 -15 -125
2215 -125 -170 220 -173 -290 -136 -308 -146 141 -77 -32 -84 -170 -29 -6 2 301 -27 -276 32 -64 275 5 5
2238 5 -15 328 248 -205 134 121 -87 -134 147 62 97 66 -51 223 -222 -298 228 284 167 -165 -161 -25 -53 121 -88
2263 -88 -248 -153 96 -134 -27 -182 10 66 183 -18 -75 -140 -19 -107 -35 140 -188 -135 -269 -60 82 71 264
2286 264 43 -18 -24 116 125 -220 -29 -175 108 -99 -170 -62 -25 -188 80 87 -210 169 -36 -1 -27 17 -265 -115
2310 -115 115 -277 -111 -39 253 121 -126 59 79 52 -132 -34 213 -86 -161 -172 55 -12 51 367 110 136 -110
2333a10K50q7K7l01R1Q3j93K28J84j30J63j17k32M43l21m0Q3K28j81j67J28R7
2355A26P8K8R1k96J1J91l61K35k02M4L12k89K3J41k06j10L14k10N4M7M5J44l48
2378a38P6m0J32k8k20K67l9M5o0Lj20J61L4j12M2L3j17K95N6k93j08L87m90O0
2402a74L95m08K81k50L17l01L61o0l14K76l06J46J80l22L78k72r8K29n7k9j71
2423a99M93q9l19K80p5j61k5L62l47K7n6p6L67l58RK53Q6j98r3L16j41J06j96
2446c4n3L0J63j94j62L27j80NL4o5K5q5k5N16j99j93K05n4k62K57j00o6j2J20
2470bn1Rj4O8j04N5J85k85pJ36r8M2o3J55J14k4l35K23P4k34M87j86j85J17j25
2495d8j57M44l11L08m49J99J57l63L37j49L10j27R4j92j35j68L86k27k67O26k15
$$ plain form
2333 -110 140 53 80 -221 -130 -47 -240 -12 172 42 205 88 -144 299 -22 -62 21 249 68 -99 29 126
2355 126 204 232 323 27 38 229 -132 103 -99 -55 257 -32 -9 132 -74 -184 130 -80 -26 21 66 210 -138
2378 -138 -62 -102 30 2 -218 49 10 55 -5 -2 -122 39 73 -39 3 36 -81 214 270 -23 -131 256 -234 -174
2402 -174 221 -187 94 -156 161 -140 221 161 -153 123 -183 -37 143 -179 199 -73 -171 58 1 -28 -199
2423 -199 294 205 -114 166 91 -70 -95 267 -80 -53 -109 -185 182 -176 -167 86 172 -26 -119 197 56 162 -34
2446 -34 -87 -57 106 -88 -250 77 -103 -98 -64 -129 -104 -189 -214 302 103 -90 115 61 -201 56 -44 -110 -122 -2
2470 -2 -53 -44 -58 10 -94 -39 146 -139 -146 -10 -108 -66 -129 26 140 116 -219 4 78 -156 331 145 -40 77 -48
2495 -48 -205 239 -72 236 -213 -14 143 -220 117 -32 278 151 245 53 -82 -250 136 -91 -358 268 53
2516E3j04PK69K11m91J11kKR8k41J39j7j9J78k63O0M1m4r8O3Q2j32R7j80J31J42
2542I3L1j01J34N8l32L09j37j96j62K28m8M03l62O5k6J9J66P1k9k21Nk09M21j46
2566C4k01L45kj75L9j92K03O7K07k55j41L43k63j8k32M14l12M34k34r2J12k9j57
2589a05j27K58l61K34J16l9L2J28n6j78o2L25J88j94j70J85j68m21K48J19j67
2610b15K44n0r9L85r3k47k0K18j59J35j41j62P1J58k3O8l23J81J00o4j26K02Q
2633D8j04J38Q2m77L25P6j57O0j12RR5q1R9j2j60J23J05K04j58k08N9j9J87k42
2657a20L10k98J56k5M8l8K3R6j16Q1j32j64J21L60n93M66k25Q3j35K59j05J4j91
2680a25J02J23j03J71j56n5J95k85K53l77L76j03O2k29r5K94j90P3J13j70J74
$$ plain form
2516 53 -51 -44 225 436 -55 56 54 56 154 -87 52 35 16 194 -69 -9 32 -12 -110 -47 35 -97 0 -180 -49 93
2542 93 124 23 157 215 -117 192 55 -141 -303 -75 -123 280 -82 -17 -43 -24 142 213 184 -37 -32 -241 180 34
2566 34 -167 178 176 1 40 -152 51 118 325 70 -71 272 9 -9 -241 173 -139 295 61 -31 81 52 -105
2589 -105 -232 26 -335 -101 15 -24 8 136 80 -98 -160 165 353 159 -11 174 6 -415 -167 -48 -215
2610 -215 29 -21 -120 265 172 -75 -95 123 -36 99 -42 -204 -133 25 2 70 -253 -72 28 -36 -162 40 48
2633 48 -56 82 164 -313 12 88 -69 -9 -121 -112 -17 -98 1 -11 -171 -48 57 261 103 -105 -46 -65 122 -120
2657 -120 190 -108 48 23 71 33 56 152 36 117 -15 -179 -58 302 -291 175 -50 33 -102 157 52 66 -125
2680 -125 -23 100 -3 168 12 -43 152 -133 120 -257 119 16 78 -151 -246 48 -142 -69 44 -126 48
2701D8k31K04NJ5q6kL00m29J16J76j54L1L7l06K01j80L08j16j2k4K34j16j61J73
2725C1J55k96Q4o6m0J26Ql0N8j28N3k3K47k19j03K30j40O5J58m7o3j46J61oj82
2750a13J47o7j02N5j73L91j44j8L29k52J05l33L62k10K07k56l5J69k32P8L43j01
2772A50j37M0k32J03mk63K96l7j47L47j63l2J70m5L3J12k18q2P0K1K6J6jj96M5
2797a28K67j20J3L7j03Pj9j53L77j44K3K1j29J06J68j99P6r3J92M3m13O9J51r
2821D0j38K27j41K4J36k76J41K71j70m44N52j96J72j50l86L60L06m41M61k56k91
2842a99K13n1K4k8K24l75N1O9J25J31l29l8M55o23L86o9K5nl77N08p3j80K30J10
2866B04k09P0j78K0kJ56k35L14k69L07n4n3k37K97j37P3k56j17N97l00J9j10J87
$$ plain form
2701 48 -183 21 26 41 -45 -47 253 -176 -60 116 -38 -7 30 -276 -75 -255 53 -63 -75 -99 135 19 -142 31
2725 31 186 -110 -26 -92 -132 -6 2 -28 30 -98 -45 -68 179 -40 -143 87 -53 12 170 123 60 -86 75 69 -113
2750 -113 34 -33 -135 -80 -253 138 -6 -24 305 53 158 -175 187 -23 184 -72 -107 62 -170 -92 251 150
2772 150 13 53 -179 -76 -80 -343 -47 -84 -231 116 -47 -79 91 46 79 191 -27 -109 -39 -18 8 24 23 -173 -128
2797 -128 139 19 32 69 -34 -27 -46 -199 178 34 57 78 -51 55 223 24 100 7 199 242 -171 -102 49 40
2821 40 -98 129 -12 12 148 -128 13 284 114 -330 222 26 198 48 -338 22 328 -113 348 92 -199
2842 -199 14 -37 -13 -41 183 -192 -141 -72 53 184 -145 -183 272 -351 35 -34 -9 -14 -391 117 44 -136 94 204
2866 204 -5 65 -113 -93 -95 61 -174 140 -129 178 124 71 -166 131 -6 67 -189 -306 291 -9 10 -100 87
2889H7k7j05q0Q5J05j43L6p8Q8J01k20j43N59m61R4L57k74m7J5K00k15K18l6j61
2913d5L9J88k15J33p6l31N25m9r5J82k33q2K5m7Q4j37K24j96K13j79j40K83j09
2936c8Q6j68N9p0L71k36K03j47m58N59k08J00M9j62M2j01K3K24L3j34J5J3J2j98
2960a31M19m08j2O2J13jR3l66L32K13j45nj07O6j31n8J47P1j71L24n8j22j92Q7
2984B0j63K37k11J94m6l5k5q2j4M16l13k44J73Kl4J35J2o0J78k29K41o7j50J65
3008A00j48r1L23j93j50K54l10L85k50k9o0n4K29j15k56L48m3R5L24m79J7N4j89
3031b38J43L58n40K45J41r5M4j8n6k04M00p6J3j94j38K77q9J16k46LK43l1k10
3054a52J55j13k5L06l00n7K57o7OJ95j48p7J0k49J3N37l10P0O3KLj91J05j46J01
$$ plain form
2889 87 60 -45 -125 -40 65 -78 -42 -120 -32 69 -151 -294 265 -196 -102 255 -19 -66 -51 149 -66 152 116 -45
2913 -45 -6 182 -33 100 24 -307 218 169 74 256 23 -59 -34 -81 3 -134 90 -106 107 -72 -212 71 -38
2936 -38 48 -120 -61 -131 240 4 207 60 -398 161 -47 53 102 -60 -18 -119 -96 128 161 27 42 55 67 -131
2960 -131 288 -120 -132 -70 43 42 135 -231 101 314 169 164 57 123 -8 -66 81 152 -19 305 247 125 -67 20
2984 20 -143 94 -117 77 31 -4 -29 -111 -125 291 -22 -266 -93 -91 -125 10 22 -38 140 -89 152 85 -65 100
3008 100 -48 -139 184 -9 -159 95 -215 170 -80 -109 -169 -223 6 -109 -365 -17 -60 35 359 -120 -103 -49 -238
3031 -238 -95 263 -277 -32 109 14 58 40 -16 -220 180 104 117 -77 -215 62 -27 89 -157 -154 89 58 -152
3054 -152 3 -110 -135 171 -129 -186 71 4 10 205 57 -20 -10 -259 -246 291 -19 51 114 116 119 -72 33 -113 -12
3079a2k00K27j93P7R7k30K44k17K36m3j23j26K90K3J64j22k06j23K18K66l27J15
3101C5j8r5L21m30J93l1q2M68k55k09j12K82j9K01k33J35l03O4p1J99k30n4N0
3124a94J25o6O8L12k99K8Q5J49k25j63M53m41j5K97j82K67j62J93k73j98M52l88
3146a77J67L49l92J12j88L03k79j17L10J6j36J6Q0L1j53K16l45M1K83j50K60l2
3168B15l03j51L25j54M4r2R7J30nj24M4J04l07K47J0J61j42j75J93j85k78L76
3190C0J40m39N6N7j37K87r6J01p6K44l20J90J09j26l1m4K3O4j40O3q4L7L08k30
3214a4OJ84j87r0M5j49L15k83K77k03J63j17J14l44L18j98K41n6m4j50M32k91
3236c1j19J80l1N0k59J89j90J03J66j96O2J54j72k25M57j94k1J08nJ12j80K75
$$ plain form
3079 -12 -212 15 -178 -101 -4 -234 10 -207 29 -14 -137 -263 27 50 214 92 -114 -237 -19 247 -80 35
3101 35 17 -78 243 -187 6 -25 -107 361 106 -103 -215 67 48 249 16 151 -152 -88 -159 40 -190 -244 -194
3124 -194 -69 -135 -67 245 -54 -26 59 208 -17 -180 273 -168 -183 114 -68 199 37 230 -43 -241 211 -177
3146 -177 -10 339 -53 59 -129 174 -105 -222 88 104 -32 -16 64 95 -58 158 -187 -146 137 -13 247 215
3168 215 -88 -239 86 -68 -24 -116 -19 111 106 -18 26 130 -177 70 80 241 99 -76 117 -68 -346 30
3190 30 170 -269 -213 -156 -293 -6 -102 -1 -77 167 -153 37 146 20 -11 -55 -32 32 -108 -45 -129 -92 216 -14
3214 -14 -8 176 -11 -101 -56 -205 110 -173 104 -99 64 -53 61 -283 35 -163 78 22 -22 -172 260 -31
3236 -31 -150 30 -1 49 -210 -21 -211 -108 58 -138 -76 78 -94 -319 138 -56 -77 31 26 138 -42 233
3258B33n19L16J18j0o4j35P0p8r1J96l22J66K78q5k2j68P0N5k39K22J60j01j58
3281a08J36j61J7L08k34J57K20l50k2J55j51J02k01j27K16J76r1k35P4J18%P7
3303G6p0j76P7o2J06J15K04l36J98n5k68n4K00K28m58L57p9J0J98m02K34J43j79
3326Gp7J0L1L35j95j21J93q1j59r8K35q2J85J0L8l60O5J17Q1r2J3k09N51l77J2
3351C2m7j79k2J99j06R6Jo0M6J93j3o1n6N7k60O1q4L85k10J75k67k5M21m1k02
3376C3k43J59j13K4K77j55K10l63J05J60J16l83L54l31R8J89j38j78L76j54J69
3397B12j34l87K94K1N1l98M57k46J42l1K72j36ko9J7kO2j5n6P6l13J08J58L9j24
3422dJ60j53l5l0J67k04q3M01j84k02J49n7J94m3j70j16J28O4Jj60O5M0pJ18j27
$$ plain form
3258 233 -286 30 148 138 74 -61 9 -69 -160 36 -286 -120 158 73 51 -117 -47 8 -231 -9 151 50 -108
3281 -108 28 -133 -116 192 -42 115 335 -15 -37 118 -33 69 -132 -259 -43 133 42 -193 -119 -1 -1 76
3303 76 6 -170 -93 -155 -49 66 270 -66 132 77 -191 -245 -45 183 -275 82 3 13 211 -191 43 186 7
3326 7 -70 -60 -29 306 111 -10 183 102 -57 -155 80 -2 183 193 231 -129 -64 53 134 42 55 -154 397 20 32
3351 32 -15 -194 -216 -17 -123 -27 -26 -86 -40 153 140 79 23 80 -180 -119 -203 182 -28 147 -120 -145 276 235 33
3376 33 -210 -51 -164 -140 137 -18 192 -171 -66 94 210 -173 181 -150 -52 137 -1 -179 197 43 212
3397 212 78 -309 -15 6 57 -341 116 -130 12 -19 253 117 115 46 63 61 123 108 52 128 -185 -77 81 120 -4
3422 -4 156 3 -32 -62 105 -99 -182 219 35 -167 -18 -75 119 76 -94 -210 -82 -18 -17 -177 -112 -72 -79 39 -88
3447h8J67l21N8L79R7l62q1j40M80j49j9j2Pj88J89K35n73N23l50M1O4J91j59
3470a1p3oL36l45N8M7J05k63P9J86O3l01j00K53N4m01M70j19P1K13n66K10L7J88
3494A85j10J5j98L06l08m2M56k82K83j27L2k31j38J24q8J15r4J93j32K35j31p8
3516a5p5P6N0J20l11J05k16L29j09J12q3J45k09l8K91J51l84K38o8j26J50k37
3538a04Q1P2k0j41QN5o3J10J16j81K51k76K08m4p1J25j49j38J63O3J7k97L48j69
3562c6qj19K25k53L3O0L2m8J2K60o9j09o9J15j12Nj09L09k98M1R6J11L2m3K1N6
3588A35l50L61j05j61Q6k2M5k3J81m39L13k03L8K46J14l31qJ12J77l49K20J19
3610A56k15J79k06M8L3J64q9l1q6P0j96M09k90m0J47k22K77o3O6j13j51J62J25
$$ plain form
3447 -88 79 -242 -184 195 292 -70 -151 -291 189 40 21 9 16 -172 17 252 -321 202 -148 -107 -43 148 -11
3470 -11 -84 -90 246 -99 -41 6 111 -152 -73 113 176 -125 -225 28 82 -319 151 32 103 316 -250 -40 -3 185
3494 185 75 90 -108 198 -110 -152 304 22 305 178 210 -21 -159 -35 -123 -8 -102 91 -41 194 63 -15
3516 -15 -90 -14 36 156 -155 -50 -266 63 -46 66 -17 128 -81 -119 172 323 -61 177 109 -17 133 -104
3538 -104 -23 49 29 -112 -104 -49 -112 -2 114 -67 184 -92 116 72 1 126 -23 -161 2 65 82 -215 133 -36
3562 -36 -44 -163 62 -191 -158 -98 -66 -114 -102 158 89 -20 -89 26 -86 -81 -190 119 -179 -138 -42 69 101 58 79 135
3588 135 -215 146 41 -120 -34 -56 -11 -34 147 -292 21 -182 -144 102 216 -115 -123 -11 166 -183 37 156
3610 156 -59 120 -86 -38 -5 159 70 39 -47 23 -173 236 -54 -94 53 -169 108 45 111 -2 -153 9 134
3633A34j91k50K63j99L37p6J47j51M56l71l17J95kk04K62M7R1m28J13K3L15j50
3655D4J44j13L3q3k5Q1k10m0j74J71J72R2j83L13l50K73l90K88o2q0j41K09o6
3678i7LN10m92R7k00L6m0M73j72j05j26J08Q6j09K39l8l55M11j03j7k24J96j54
3701g3L27Jm10Q7K61l11J81K54k26l7k62N61o38N96l30J21k01j11k9J40L32l12
3723g9j31K04K59r7oj65O9m3q9L52l81n5K59j33j09J07k74K79j79L40p8k81J33
3746i8M9J86l11n0K36R0n7m5J66j99J99j52j80QJ07Q2j20K11n8l80L93N5k46r3
3770b07O4M01l64L06k21q5l2L87m68K37L9p7Q7l4r1NJ54k10Q1NJ29k49J8R7J7
3795a1m0K36k44Q6j9J15l44P0J24l32K63J81k77J08j63P8K72k12K4j25J91J50
$$ plain form
3633 134 -57 -307 -44 -243 94 18 165 14 470 99 -218 -23 -25 -229 33 80 171 -257 -144 -121 194 44
3655 44 188 75 108 25 0 81 -129 -169 -343 -172 0 92 -91 222 -128 145 -245 43 -19 -99 -240 -31 -97
3678 -97 -94 416 -76 21 -179 -143 -183 290 118 13 -113 -5 81 -28 211 173 -182 229 126 109 -115 81 -73
3701 -73 254 255 -155 -68 193 -118 63 317 91 54 -208 353 -285 311 -19 102 -99 -210 -239 -99 233 -79
3723 -79 -210 -6 253 156 150 -15 54 11 -78 274 -107 -162 97 -36 -145 -38 -312 -33 -212 128 50 -231 -98
3746 -98 -49 137 -174 -224 12 102 45 0 166 -33 166 14 -166 -158 -51 31 -89 122 64 -316 77 132 -114 -207
3770 -207 -143 258 -106 200 -21 -106 -138 249 -219 18 57 -20 67 33 -58 -53 101 -109 -28 -23 106 -143 -125 -28 -11
3795 -11 -51 185 -59 27 8 123 -221 -151 -27 -359 -96 85 -192 -84 -247 -169 103 -109 -85 -210 -19 131
3817A31j30o8K23j63j64K48m9K74l12l5j42J44M9J17j89l5k5J95L5M5k49R6J43
3840A39k58L37J47n57L91l77J28j06N03m71R6O3K1K18k36j64L52j0j8k64j60J67
3862e9j20N0L29k98K62l3k94K72N1l16P4J81J39k70j47Q3J41p6P5J98k68K65l19
3885h0J37k10M71l83nQ2M4M9J0R4p0r8q6L25l44J75O6k63J27r1R6J79j78K5r4
3910b2P1l5j29k3J24R6j70n4J0L91k71J03m23J80J68m4k00L29K3j0j16r8J45j9
3934B6lm4j57K83l32L51k38J99k36k17L66J39p2r2J0k96L88Mj04J91q9J11o0N9
3958A87k26O4k33k67N16j34j51K53K45k64J42Q8j92K9m2J23M0k03j71J24J64n0
3980D2l73M24qp2j96J60j0j63J6o7Q3K48j13k5JJ13k4J79j06j65N0Jl5J47k54
$$ plain form
3817 131 1 -67 156 -7 -171 77 28 302 -10 -45 -187 -43 6 123 -66 -101 -126 69 104 149 -100 -4 139
3840 139 -119 218 365 -192 199 -178 -50 -156 347 -124 -28 35 56 274 38 -126 226 216 198 -66 -226 -59
3862 -59 -179 -129 200 -98 164 131 -163 109 160 -156 -82 99 238 -32 -179 -96 45 -31 44 242 -26 239 -80
3885 -80 57 -153 318 -65 -70 12 56 105 115 209 139 41 -45 280 -64 111 177 -86 41 -50 46 225 47 72 -22
3910 -22 49 14 -115 -138 -14 82 -88 -142 -132 259 -12 91 -332 -152 16 -28 -228 101 124 114 -2 -100 45 26
3934 26 23 -21 -178 105 -227 124 -114 85 -151 -368 -2 137 65 -27 -17 -313 75 79 -25 166 77 188 128 187
3958 187 -39 25 -208 -475 41 -93 -244 9 254 -10 132 220 28 57 15 138 178 -25 -196 -72 92 42
3980 42 -331 93 85 13 -183 -23 -33 -196 -180 -247 -164 84 -29 -54 -53 60 36 215 109 -56 -6 -5 -40 107 -147
4005a47L8J37l2K16k64J00j3k9j05j54L23k6J01J52K57p65J60n3p5J1J68J79J1
4028A90k83Q2q3J55M9N4m03L50k63M06l47Q4L30k96P1k03N6j31K2K01P8l65N7
4051a89L43M3k43J23j59J67L5o0P8n9j11N4r6J79j69K6J0R2j66J13j31K04k47
4074a63K21J35K2j48j55J37J26m07K69J26m24J39j08O8J64q6R6j38J91R8k49k30
4096c16M27j96O0j09%J61k04N6L24j35j15R1j65Q3j00K63r2j94L96j63j5R2N5
4119B04l99K73K2K3Q3K0l79rM0J26J84q5P9l13J56J07p9J88L6p9jr3n6Q7k72K43
4145A06K16n09L20o3K41k76j24K20p7j45P5r3J72M9k44P5J87j03j05J17J19j0
4167A48l28K53l72K46k2l12K69J42j98K61o1k94K17k3J02j22n9K67L9k84J90j79
$$ plain form
4005 -147 -109 28 -4 212 -52 48 35 6 -99 -253 70 44 145 297 554 -211 -51 -104 -179 -168 0 179 190
4028 190 -93 -11 -94 61 110 164 -239 111 -152 254 -93 -9 321 25 96 -107 -51 -182 -160 41 119 -246 -189
4051 -189 154 197 -46 77 -82 85 120 60 138 79 -32 22 -74 105 -64 -38 -28 64 -102 11 -120 84 -163
4074 -163 58 193 215 67 -88 49 175 -232 37 163 -261 -122 -230 -162 2 -84 12 -126 65 163 -86 -316
4096 -316 111 -85 -25 -134 -134 27 -177 -121 203 68 -47 44 -121 -38 -138 125 33 -161 235 72 57 149 204
4119 204 -195 78 100 123 206 226 -153 -162 -122 4 188 103 182 -131 25 132 53 241 277 198 197 104 48 135 -137 106
4145 106 322 -187 133 70 311 35 -89 131 54 -91 -16 -109 63 112 -132 -57 130 27 -78 39 158 148
4167 148 -180 73 -299 -53 -75 -387 -118 24 -174 87 26 -268 -51 -74 28 -94 -153 114 153 -131 59 -120
4189a20m6M57k14Q5k83J67j18J24jJ04k75J66l0J90l83K81p3j64n3L17kk4j21
4212a6lJ02J49K0l13m9K16N6k20J73j18m8N8K46l12N3j59K30l24K86K60k51K57
4235B93k71j72J93M2l0j22r4K97j30J70j81m5R8J07k66R5lj19L06P5l99R8P7J03
4259A22n5k01K3P5K88j47N2l46L09p0j18J15n4j9j21k6L93j33K83k73j91K65l78
4282b07L18k65K9K14j68O0Q9k78K49j6o5k49J91J00o7P2O5n3m2PJ25q5J36j68
4306hk68O77j29r0p6J11l35l1J28O2PJ06k22K31j91m9M5K1O4j51K5P2J18r6J13
4331A34j12k62M91k83Q2p1k01Q9J50J33l9j37j56K22q7L3q3J29j84J1J82J03j91
4354d7M6j94M75k56K38k16L5j65K0L5j70L67J38j65j60M9q9k6kJ73q6n6K02n6
$$ plain form
4189 -120 -166 291 77 162 -121 46 -72 52 51 155 -120 46 16 206 -177 104 31 -133 -186 131 129 105 -16
4212 -16 -19 83 232 252 -61 -110 106 162 -58 115 -3 -51 7 253 -59 -6 -165 65 -259 27 287 36 293
4235 293 22 -150 43 85 55 -67 -161 136 6 176 -5 -50 48 155 -111 -16 -19 -138 168 243 -156 -58 19 122
4259 122 67 -134 -111 -36 252 105 157 -189 120 50 -68 47 -7 -26 -147 -173 220 87 370 97 -94 171 -207
4282 -207 111 -154 -125 89 -79 -19 70 -208 41 25 -40 -289 -98 2 -65 7 72 19 -23 -16 109 24 160 -8
4306 -8 -276 401 272 182 106 217 -118 -149 -21 41 48 154 -68 163 -28 -77 -32 -11 53 -98 -73 -1 117 21 134
4331 134 22 -240 251 -32 50 -21 -222 -133 17 150 111 -26 -182 40 -47 -14 -97 32 -152 -141 41 144 -47
4354 -47 -1 -195 280 24 262 46 81 -84 -64 -29 -199 168 306 141 -19 30 -59 -85 -87 86 0 -56 146 90
4378I0k02R3k2N2O2m6M0J97m26m0K22j41N4N7j29J71j11pR2j32K85j48j78Q4o4
4403a47J31j41K45j61n0j00K66P6j23q9R5lJ5R3k85j66J98j4N5K48m8Rj57N1Q2
4428H0m5J99k40L9p2Q1j80N0j46M48l09n5J05r0O4L21j98J4L75m94J61o3k07J70
4452Ho6J15l05K71RR4o9l43J21K72k94J77j50K11m4J88l35K35J63j68N7R5k54
4475a2r2k3J18nl7J4M9k66K07J11o6M0J56j75j19J96r4%J18k66J30j18P6J23m7
4500A8q7K90j89O2J34j98O7j99K92K54j78k84j37k31O9L33J20j45j34l3J23J95
4522A42O5l73rJ10J43l8k4p1J82j74K99l74L69k65j84L0n6J42q1J97R4k23J94
4545I5mk88J07j03M4J52j50J82k81M8J76J30J12l93N1J88j75p2k4L54j74l3K24
$$ plain form
4378 90 -112 -19 -41 11 73 27 67 264 -162 -202 20 -121 -67 -10 -139 32 -79 -86 6 -126 159 11 -167 -83 -147
4403 -147 -16 -157 88 -73 -123 -223 43 119 -4 -93 2 -1 14 107 -178 -344 -146 -160 -105 143 95 104 -53 -2 80
4428 80 35 234 -6 33 -39 42 -138 -88 -234 214 -95 -150 -45 -135 -71 250 52 66 441 -53 108 45 -162 8
4452 8 -58 57 -248 23 32 126 57 -286 -165 107 -187 -10 -160 51 7 195 -140 95 258 90 147 242 -12
4475 -12 -104 -127 -9 -14 -51 -37 12 -254 -47 64 -2 38 194 19 -100 96 2 2 120 -146 -16 -134 -58 65 18
4500 18 -69 221 32 94 228 30 97 -102 190 444 266 -18 -155 -386 -317 16 136 -9 -143 -176 -53 142
4522 142 207 -166 -175 -65 78 40 16 -55 127 -47 252 -122 247 -18 -202 -172 -228 -86 -167 30 124 -99 95
4545 95 91 -197 -90 -193 -149 3 -147 35 -246 -198 -22 108 220 -173 -122 66 -109 -181 -205 149 -25 -58 166
4568A66m35N45k92Q9j71n2J86k5J4Q0m04K07Q6M7k19K26j24J59k15r4K10n1N1
4591a6R4k27j80N17j88q1K98k23k65L31j85J67k0j8k47L91Q9o2j81j59J98Lm4
4614hp0K78l57J46mJ15kOj09k42M59m29J75j5J55j59N8j79L06j83k6J75j20L0
4638@K19j49L9k04jj7l7K46K3q1J38m41J87L39p6k1k76J50J45m45P9K99k71J41
4662a4k9M5L6N7Q4K2J12l3l24L95j62l36K20p5K53N1l79n8L48j53l92L63L8j74
4686a05L1P8k28K67J71j37l8k21K7Q7J30P2m22K27q0K29J20k51r9M15k95m9J31
4709F0p0M15m25j60N1J17L8L44m08m8l0N1J54j01J70o0J5k12K25j05j24L5J14
4732D6Qp2M5N2q6j5n4K75j46J6o0j6j33J41p5J33KK49l50J95j69nJ23m71M87O5
$$ plain form
4568 166 -269 276 -16 73 -98 -150 36 11 25 105 -299 -92 -6 41 -178 48 -76 83 -132 -226 -16 -67 -16
4591 -16 78 -149 -329 188 0 -81 217 -6 -271 60 -125 42 22 4 -243 148 237 175 -6 -165 33 36 -8
4614 -8 -78 200 -157 -11 -15 100 98 104 -5 -247 212 -217 -42 -57 98 -61 -3 -182 124 -59 -85 90 -30 0
4638 0 219 70 109 -95 -96 -113 -150 96 119 38 176 -265 -78 261 185 164 -112 38 183 -262 -183 116 -155 -14
4662 -14 -43 2 38 95 179 201 313 280 -44 351 189 -147 73 -2 251 302 -77 -135 213 60 -332 31 69 -105
4686 -105 -74 4 -224 43 214 77 39 -182 -155 -68 62 134 -288 -61 -141 88 208 -43 -142 273 -22 -71 60
4709 60 -10 405 -20 -180 -129 -12 26 370 -38 -86 -116 -65 89 -12 158 98 113 -99 126 21 -103 -68 46
4732 46 54 -18 27 79 -7 -22 -76 199 53 69 9 -7 -140 1 -74 59 61 310 -40 155 -14 -19 104 -367 120 185
4758A85p0j82J09q8J92j04N6j43L85J00m32J76j00k7P4l5k6j16o9R9k44L90j29
4781AK1O4Qq7o6K72k22l4J53l54J85J6J83k3j23j67K45M4o8M5l13K88k5k63K81
4806F1j03O9J21o0qk40L85l07J59r9NQ7Ol63O63m45R6J57n7n2J47j43j37J46k9
4831E9J44K2k27j33rK79J58k28p4j01J93L22m25kK27k30n6l8K66j21k74K28n2
4854g2J70j85j3P9O3J07n48L21L3j81J56l8L92k35o4J61j41j83K18k26L5J01l2
4877h2K36p9m52L41K15j69k88M43k61N1K41n8j53M00o56L77k14J02K9j12J70M0
4899A21j61j17j16K05K09l41K78o2J54r0K2m2Rk40J68k16L36j23j77K41k04M18
4921B72k21k5nk83M47k05j53j36J32K16P4j50p7j36J62K28l13K90j77K39k18r7
$$ plain form
4758 185 115 -67 42 -46 146 42 98 -45 340 440 8 184 84 57 131 96 70 -46 -115 -16 -260 130 1
4781 1 22 86 94 7 -59 213 -9 -43 110 -244 -59 -43 140 117 -6 -173 72 116 48 93 -220 68 43 -220 61
4806 61 -42 27 148 88 80 -160 225 -82 77 -22 -17 70 76 -287 376 -69 27 184 127 75 222 79 -58 88 59
4831 59 203 225 -2 -135 -144 135 293 65 -9 -110 83 405 -20 -22 205 -25 -81 -119 147 26 -248 -20 -72
4854 -72 98 -87 -100 -21 42 149 -399 -78 -45 -226 -70 -108 284 49 -15 146 5 -178 40 -186 -151 -50 -82
4877 -82 154 75 -377 -36 179 10 -278 165 -96 -45 196 138 -15 385 -271 106 -108 -6 23 -89 81 121
4899 121 -40 -157 -273 -68 141 -200 78 16 170 80 102 60 69 -171 -3 -219 117 -6 -183 58 -146 272
4921 272 51 26 21 -262 185 -20 -173 -309 -177 39 113 -37 -114 -250 -88 140 -173 117 -60 179 -39 -136
4943a36J0J15j12K25j77O3rqm3o4J19m0K71l11l3J8QK61j19j8j32J35l07L12K5
4968E3P6J17k15m6N1J74q6r6k10K73r9k9j11O5K85k24o7n7K37j26L26l08p2q1
4992a70L09l24K85k39K46j87j4J58k02o4O02m06O5j15K4k43M29l26N3L43j94J12
5014A42j10p3K6J28nr6j47l7K55Q0l9K6k15L5l2j34J12J90k03J49N8K7n3J02l48
5039a62Q9mk81L73J65m03K19j86J73O0J69k88N4l07L30r4R5J18j77K19j00J01
5061A63l52j24RL75j6j12m4J61M7j7m18K60Q0J5j18J15J15n2P0l96K50N1j77N3
5085f2J96j48q5L02k5j14k9J7j1K9N7n7j88j02J64m5%j60J83o6M23j40O6k84J40
5110F1j83R2k58K45K62m27P0K15K50j24r8o9J5O5l65R0R0L2O3l0n2K60N5j88R5
$$ plain form
4943 -136 -126 -11 -123 102 -75 -12 -21 -29 -72 -136 -17 -57 214 -97 -130 -112 -104 157 38 20 -112 23 -284 28 53
4968 53 129 246 31 -15 36 210 124 28 -182 91 -8 -37 -148 -83 202 -22 -89 -146 91 -35 291 -17 -89 -170
4992 -170 139 -185 100 -139 107 -80 -94 64 -138 -202 400 -6 59 -56 -32 -275 154 -172 -119 224 30 142
5014 142 32 -41 -15 113 108 12 -135 -172 83 163 124 150 -65 -30 -62 -196 -84 106 -97 52 110 137 84 186 -162
5039 -162 -73 -77 -358 15 180 -223 -4 -190 -17 43 212 -76 -22 -329 1 -93 2 120 -57 162 62 163
5061 163 -189 -313 -304 71 55 -57 -101 60 107 90 -328 -68 12 27 -91 24 139 87 157 -239 11 62 -115 -62
5085 -62 134 -14 -99 203 178 64 35 52 41 70 127 70 -118 -220 -56 -101 -101 -261 -78 -144 279 139 205 -79 61
5110 61 -122 -30 -288 -43 219 -208 -138 77 327 203 105 36 51 116 -249 -159 -69 -37 26 -4 -56 204 259 71 166
5135A66k20%Lo7J80l19M74m45L49mj86J58p2k5p9J05o2l7P3k7q0J94j90j4K63
5160A38k19K61j21k43K90r8lk41J51K8k2l4j8k3L51j86j15M7n6K27J3k73m2K44
5184E6j2j09mN3J61n8j52l4J81j28j41J88L66m49J43l31O53j92k52q1K46j52J00
5207E2Q2k41jO0j17J31K61l7k24N4k48K94k91M76m79J83K03jJ9n03K19P8K78m28
5231a80K96J11k2k86mJ10o8J63k54P0l6j0P9L5O0j54K30P0k36J1J09o3j65N1J7
5256f6Q6K28j54k17J78J85k05K1r7o1L37j31N3j24M06k41k05j31k91M18j12K59
5278A36j00J23j50N0n6O6J07k63J81k5J54k59K18l76K08oJ17k44K99j71l14K57
5300d8q1P5K63j38q7K04o2l34L22l1k22J01k13L87j11k04J85m2o5q6L19k59J24
$$ plain form
5135 166 -54 -54 -51 -118 62 -257 217 -228 121 117 -69 89 17 -8 -87 18 -44 -81 -8 -35 -115 79 -111 -125 138
5160 138 -81 180 59 -184 106 8 5 -236 -85 -57 -79 -113 -131 -154 197 11 -104 -57 -113 114 127 -146 -188 56
5184 56 44 -65 -69 -16 145 87 -65 -99 82 -46 -187 1 367 -82 61 -270 383 191 -61 -142 104 -48 52
5207 52 134 -107 -108 -48 -165 -34 227 190 -34 20 -228 66 -225 251 -228 -45 158 157 176 -327 -108 -30 248 -180
5231 -180 116 227 205 -81 -85 25 -43 120 -134 -64 -100 -110 -31 4 64 -90 140 210 -26 -15 94 31 -134 -83 -66
5256 -66 20 248 94 -123 55 240 35 56 -41 -102 235 104 157 33 439 198 -7 -138 -429 -11 -123 136
5278 136 36 159 9 59 3 69 176 -87 94 69 223 -36 182 -194 14 8 125 -119 180 9 -305 -48
5300 -48 -129 -54 209 71 -16 188 126 -208 114 83 -139 -38 -251 136 25 -179 6 -36 -101 -187 132 -127 -3
5323ck64J68J45j11K17%k29m8q0L89j36l97N13j65Q7J16k36L8j3J36L3k22J38
5346G6n7n7J57N5j97k53M51k90L33j53j60j20J78K25j93%nN0j3N4L5N2k32K13
5370A49k37o5P1J08R4k23L17j81l5j12J01J0j97L61j24l3j09l1P8K0J87k04K62
5393B07j45j37J81j60M0j08K14l00K11J62P0l53K05J00j28j29J2J48m0n9k3K01
5415A69pj11j77Q1n2l9L33k24J22k50l67L36L07r7j68L17j72J04k39P7L0j74K17
5438A6R5j14k08J99N6k23P5K70Jj63j51K04j67R1J32m2j13q6n4K88k01R9R9k50
5462a47K41J54l30J37%N6op6j65M6l7J86K07m05K51N5j22j31J81j56J01k10P1
5485i9M01j80J39l51p6J36l8N2j01m2L39k18j75L26k05J4K05r6J81m20K30Q7j05
$$ plain form
5323 -3 -267 -99 46 -65 152 152 -77 -125 -205 184 48 -349 164 -1 86 202 -34 4 -9 127 160 -62 76
5346 76 19 -38 119 174 -23 -276 175 -115 218 65 -95 -215 -37 188 -5 -5 -10 40 27 81 116 168 -64 149
5370 149 -88 -153 -82 26 120 -103 214 33 -2 -114 -13 -3 -200 161 37 4 -105 -136 -58 -38 149 -55 207
5393 207 62 -75 106 -54 -14 -122 92 -208 3 165 235 -118 87 187 59 -70 -58 90 50 -9 -32 169
5415 169 162 51 -126 -45 -97 -136 197 -27 95 -155 -522 -186 121 24 -144 173 1 105 -134 -57 -27 -201 16
5438 16 111 -3 -211 -12 44 -179 -104 166 167 4 -147 57 -110 -19 113 71 -42 -128 -182 106 -95 4 103 -147
5462 -147 94 248 -82 55 55 111 105 29 -136 -90 -127 59 266 -139 112 167 45 -86 95 -61 40 -170 -99
5485 -99 302 122 261 -90 -166 -30 -68 -16 -117 -159 180 -38 -213 113 -92 -78 127 31 212 -208 22 109 4
5508Dp7j8K63L9l76QK87q4k9j06K97k57M1k80K08L71l69J73k97O4K13o4k00p1
5532b60M6J23q3M1K3j62J69K71L5l75L84l12k03N44k05l14K98j40k4J19J26l6
5554F5Lp1M2J49L8l43j04p2L71m3N3J32k34j76L60l60J55qL1K7j08K18k2N4N0
5579B07l06KJ29j14n7l3L99k87j72jL85p9K89m13L10l26o4K1L5J97L2k54K73r9
5603G4M7j61K78m19JO2O3J92rp8K63p14N73k35J54O0l77M32k12k10K09nQ9Q9j33
5628C3K8L9j91k41K34J49k3j47L05k35K4o3J69j56Nj1J84l1K0j40qQ5K7j26R7
5653B7o6R5j00j53K90O8l31Q8J62p4k84K23J30r0K24l67J12K49k19M2j49J48J50
5676A75L9j11j80j82N20j54l9J55r2j57r8L92k60J1K0j69jJ10O6O1J9%k42J63
$$ plain form
5508 4 -73 -91 172 211 -165 -157 130 46 17 -89 208 -49 -8 -288 -80 291 -78 95 -202 -138 75 11 -189 -260
5532 -260 -214 -91 -174 -133 -110 -272 -103 168 203 -172 212 -100 -303 241 36 -278 20 -120 -144 -25 101 65
5554 65 68 -3 39 188 226 -117 -221 -293 78 35 88 220 -14 -190 170 -190 -35 -43 -12 15 -93 125 103 157 207
5579 207 -99 -97 32 -82 -139 -172 227 -60 -232 -233 152 73 362 -51 259 -67 -131 -110 -75 122 154 -100 173 74
5603 74 121 -40 238 -181 -180 -118 -55 137 128 50 313 -401 172 -63 91 151 -226 206 -6 -216 -7 -12 77 166 33
5628 33 61 100 -91 -332 -98 51 28 -119 186 -49 -25 -88 81 -75 -70 -81 103 72 92 -48 -56 29 56 -70 27
5653 27 -39 56 -44 -197 93 161 -170 -82 80 6 -278 -55 75 -15 209 -158 -46 203 -16 26 -123 25 175
5676 175 214 103 -77 -259 261 107 68 223 131 -26 -124 268 8 19 39 -130 -131 -21 45 106 125 125 -117 46
5700D6n0r5K93l76M6J96j45J23q3J25l3r3LK14k3k29L2L17l87p3j46L94qJ40k04
5725a6p0Q1q3j21J38J31j01J48l0O6m4l72N35j15Pm8J68l36R3j94L23l34K45j8
5749E3n2k4j32m5K44J4k05K84n1j37J6N1N26o06k07M50k91L57k40J69j53k25R
5772a95L41j96K91l78K87o3j39Q9k1j0Qk16R3j13J52mP5q1l1K18j47L9k17K68
5796E0l5N0r2J07L7j22J75op2Mj42k25L15o5J41j19j93L8N5L01k07L3K31m05M4
5821a02j19L07o4J71j03K2j58K38m01K94j96Q2N0j00Q8J62J21j52k05R5k5O3J56
5844B24j08k85L9J79J40k22J34k3k8K4k17L31k76K06J28m82lJ80r5J08J80j40
5866fj31N2q8K43j6N6j54j8L03k53m6J40q1k18K02m6M9N6P6j04K2P8p9j21Q3O9
$$ plain form
5700 46 -4 -99 194 -182 -136 60 -85 38 -45 80 47 -46 -43 171 148 -81 -49 268 -119 -192 -338 56 48 188 -16
5725 -16 -86 -5 -88 -209 -71 60 -41 107 77 143 99 -273 262 147 154 106 274 -62 31 -163 160 -174 71 53
5749 53 1 -23 -155 -200 44 58 -147 137 86 -51 -35 16 542 -64 -271 179 -112 245 5 174 21 -204 -195
5772 -195 146 -50 241 -137 150 87 -52 37 16 6 14 -202 -109 -222 -70 -74 1 -80 -111 107 -40 -1 -218 50
5796 50 15 65 -27 80 117 -5 170 164 92 96 -46 -271 44 -21 120 1 -192 -154 -99 202 -5 28 259 -146 -102
5821 -102 -221 86 22 193 90 112 -46 192 -209 85 -111 -29 21 -79 9 171 292 140 -65 30 5 68 224
5844 224 116 -169 -130 49 189 -33 101 78 50 74 -143 188 -88 118 246 -236 -239 -59 -154 -46 134 -6
5866 -6 -137 -85 -173 70 54 110 -44 -62 241 -12 -58 82 1 -217 -15 -61 -12 44 120 16 38 116 37 -84 -1 68
5892F8j99L7p1K10oJ69j67j00R4P5K8m4k02r5J13R6j91P0k26L30jJ14k51L04k57
5917a02K48l67M86k31j12K42j8m33L3L18j59J85p5j23J03Q4R4j75K6K0lJ12k81
5940a28L62l48K28J68k80l4M8K1p8l71M38J02j44R2r8m0K07q6j76J9p4K61k35
5963a46K91k40O1p3K46j44l0L85l78L54k47l27N81j50j37M8J22o0m14K90n1k6
5985d5k2M7J47j31J94j65K7n63N21m1m6j13L09K8l53J06M63j28j48j46j4j25L10
6008A12k77O4Q1m9j40L96J51k66j60o2J95l9L0j08j15L69R7lo2k68K24j96P4L2
6032H0o6m9K86l06L18l39K90j62n0J86l56J08M5l5k3K35qm6O3j33J5P1r8q9K17
6057A54L7k73M5o2qP2K78k84J09k59J01J61k89K45L47l29j39L7l2m3m1M01k98
$$ plain form
5892 68 -131 -94 -165 45 39 208 41 -59 35 110 138 94 -108 -203 -90 6 -185 -115 -341 -11 -12 102 -149 155 -102
5917 -102 146 -221 265 34 -78 164 146 -287 -254 64 -95 90 15 -108 -5 79 173 -2 24 44 41 153 -128
5940 -128 234 -114 114 282 2 -32 16 37 -41 -412 26 128 -16 76 -22 -62 145 59 -117 -98 -172 89 -146
5963 -146 145 -95 -34 -107 139 -5 -35 350 -28 326 79 -248 333 183 46 94 216 156 -258 32 -19 -45
5985 -45 -67 -20 127 -4 190 25 52 -511 10 -31 -77 -190 119 147 -206 -100 363 235 87 -59 -73 -198 112
6008 112 -165 -101 -20 -69 -209 187 338 72 -88 -150 45 6 36 -72 -187 182 279 276 214 -54 170 -26 48 80
6032 80 14 -35 251 -55 263 -76 214 52 2 188 -168 -60 -15 -50 -73 162 154 108 171 38 53 124 26 -63 154
6057 154 191 -82 -37 -99 -107 -35 243 -41 68 -191 -90 71 -218 27 374 45 -94 -57 -89 -132 -173 228 -70
6080g0q8R0J16j64j55L25j16J8J9K42j93mJ66j55K25l10J6J56j23m8k13L45q3
6103do4J55J76j67J77j12P8l21k2p8n3K27J71k81K37l77J47J07j08P7r8q9K93
6126G1k91J2N7J79j64M4L92j85l3O4j22q7K60p9k30J26j55K84l50L16P3j63J24
6149A43j27j05k2L54l37k20L13j5J07k28J52j00k0J28J07l45qJ63nJ34m7j10K88
6172B00k08k8K0Q5l12j21M55k79PM3P3K07k51K48J09l73J47R6k91rJ13J27k98
6195b40K62ko0j10J25ml14M95k5k70L99k13q1N3j89K31o2N6K17l62P2o5K32j31
6219A4L3p6J14p5J14k99J36k2J96j33m4L13l49R2k33L20p5l9Q4j37K44n4L2Q2
6243B38k39O9k78K25j66J67r5K56J6k00J48l25J27R9j37P7j13J11m3Q3M8q1r3
$$ plain form
6080 -70 -158 -68 48 -116 -271 54 -62 -44 -25 217 24 20 186 31 256 -54 -38 118 -5 -53 -266 79 -4
6103 -4 -68 87 263 96 273 161 239 -82 -104 -182 -235 -8 163 -118 119 -258 -111 -4 -112 -35 -133 -222 71
6126 71 -220 -208 -151 28 -136 -92 300 115 82 146 24 -63 197 118 -112 14 -141 143 -207 109 182 19 143
6149 143 16 -89 -111 243 -94 -314 -1 -16 91 -137 15 -85 -105 23 130 -215 -223 -60 -65 69 22 -88 200
6172 200 -8 -36 -16 69 -243 -364 91 -188 -181 -138 -65 142 -109 139 248 -125 22 118 -173 -182 -69 58 -240
6195 -240 22 20 -40 -150 -25 -29 -343 152 127 -143 256 43 -38 15 -174 57 -5 51 268 -94 -22 -87 145 14
6219 14 47 -29 85 10 124 -175 -39 -61 135 2 -42 271 -78 14 -219 101 26 -13 71 -66 178 124 156 238
6243 238 -1 68 -210 15 -151 16 -79 177 193 -7 141 -184 -57 42 -95 -18 -131 -20 -63 20 68 -13 -106
6266a06M8j27M47j74j8p7M9J42r1J47k49J80m06J88J1O3K41j07j66k00N8J82N7
6289I2k03O1L08j36j80k00J8J81j16J77jJ34j35j62o5M63j43Qj70J48j42J55L54
6312D46p28L80k89J71J82k74L47pj07k02k3o9K91j23J82l18L52l39J66k8N1l32
6334b71K62K09m61L47k11K3J57J28k67Q2J5j92K11m7j99J42k47L12J02j20n5L44
6356B64k04k31J69Qq4qJ90j85Q8j71L60l49n8M00m52M34k61K35o0k08J8j2J5K99
6380A97m5k08q8PK66J62l92j6K43M6J31m29N4J08L25l77J65l14K19J10p7k12m7
6403a72K80j83J89rj93l1K25j80j23J80Q6k8R3k09k7r9P1l1K33N7l68K49J97j90
6427A7l0j1j55N55m66J21o9l8K4j00N0K61j44j83L21j49k2K84l57kn5J61J25K21
$$ plain form
6266 -106 -58 -185 262 88 70 -7 42 184 93 240 -9 171 -235 -47 -36 27 268 161 -5 -205 -147 35 92
6289 92 -111 -50 258 122 -58 -258 -240 -59 -175 2 1 135 0 -162 -227 236 93 101 -69 79 -63 92 446
6312 446 -282 98 -191 -20 162 -112 235 228 121 -81 -104 -173 118 -5 177 -141 211 -128 38 10 61 -271
6334 -271 -9 200 -261 86 -125 -102 55 183 -84 -2 13 -179 32 -15 -214 -72 -319 -7 95 -25 -80 264
6356 264 60 -171 -2 6 -78 -86 104 -81 7 -164 196 -153 -211 189 -263 171 -90 145 85 -123 -105 -117 -102 197
6380 197 152 -56 -144 -137 129 291 -101 -117 126 172 303 -126 -72 36 361 -16 149 -165 54 164 87 -125 -172
6403 -172 108 -75 114 105 -88 -119 106 -74 -197 -17 69 41 134 -75 -102 -201 -130 -161 72 129 -239 10 207 17
6427 17 -13 -24 -179 376 -90 31 -38 -76 -52 -152 -102 159 15 -168 153 4 -18 266 -91 -93 -148 13 138 359
6451C59k22kj62j78J23J81j46J10k55j1K37k37O3K5K98l75K40L29n09R4J36r8
6473@j40J66K26n32M01j1k4J1p7J8j17J20J06J24l83k8J38K58k63n6J25j25o1
6496a24J15j44K76N0j65j01M7QJ42k79j4L21r6Q6q3K08j43k55J70mj32J95j20
6519d2J08k97L82j32O3J3J25k18J84k07k95M11Oj97m1J38K93j78k64j18K98j94
6541a62J60P7K1J37m89K24Q6N5O2j78K93l09J78l31o2N9M1J94p7R3p4l78L84J14
6565A18j76J37j37J41Q6r0p7j05LR3j31j14Q0P4J42j62r9K48L4n8l9j11K42Rn7
6590E1n2j34j12L71nj44R4J61l54J83L1j80o5L2P4k2K52l95N05m35J35R3lj19
6614c8J61K36k79j42j03K29k03p2J09K04K38j95l92m9L39N7J08k80q9p0L01j96
$$ plain form
6451 359 137 135 -27 -205 -82 99 -47 63 -192 -203 34 -203 -140 -115 183 -192 48 377 -132 -38 98 0
6473 0 -140 26 252 -280 121 110 86 97 20 38 -79 41 147 271 -112 -140 -2 256 -7 -63 62 -63 -124
6496 -124 -9 -153 123 173 8 -93 -46 -38 104 -175 -189 132 36 122 39 247 104 -151 19 15 -117 78 -42
6519 -42 66 -231 151 19 82 95 220 2 186 -21 -316 95 101 -96 -137 1 294 116 -148 -266 32 -162
6541 -162 -2 75 96 233 -256 -32 54 109 171 -7 286 -23 155 -176 -238 -179 -138 56 -21 72 -2 -380 4 118
6565 118 -58 79 -58 83 169 79 2 -103 -100 -7 -138 -252 -172 -98 44 -118 -217 31 65 7 -32 -143 99 108 51
6590 51 -1 -135 -247 124 119 -25 69 230 -124 59 90 -90 -155 -123 -49 -71 181 -214 291 -144 -9 84 81 -38
6614 -38 123 359 80 -62 -165 64 -139 -211 -102 102 340 145 -247 -296 43 100 208 -72 -161 -231 70 -126
6636a26J97j39J87J0j02O0k9j48l4J67j97J71n2kJ64r7m0O4O4k01L65j93j48q1
6660a40J18J46j79L3j21M19n01O9L35k33K24l5k35P3k6J04J65k94o9K11K7J5j17
6683a1R8k07Q7k99K32m7J81j30M83k93j42j00M64k69J65n9k59J84jk1n0K53n44
6706b85L16K7j15n2n7P6P4Q3P1j26J7O7J1qr2k5L1J42p0j93L07p4j54J74Q3j98
6732C0J7j62L78k08j97K90k97P1J27K5J50r%j52l3j35o2r4J65j2j17L24j53O3
6756IJ62k48Q9J02r3k3J13k78J93NJ46Pn19M71l43K81j50P2r1m8L11k36p4J1J03
6781b8K12p3j18k79K02J1n7J05j71L74q8J21k64L7J82j93j02M99l03J31l51K01
6803D8L9R7k23J60M4l64J44R0P7j16J89l12R0Oj01J28l11L43J56k7j94J7O3K32
$$ plain form
6636 -126 71 -68 119 129 27 87 58 -90 -124 43 -154 17 -35 -37 127 30 -10 54 118 -83 282 89 -59 -140
6660 -140 -22 124 -55 -22 -143 276 -225 -156 179 -54 170 135 -100 -27 -53 51 216 -78 -147 64 91 106 -11
6683 -11 87 -120 -33 -332 -100 -147 34 -96 387 94 -48 -148 316 47 212 153 -106 78 77 56 6 259 -285
6706 -285 31 58 -57 -109 -166 -90 -16 67 138 12 29 96 107 99 7 -18 13 155 85 -108 199 125 -29 145 228 30
6732 30 47 -115 263 55 -142 148 -149 -78 49 74 224 215 215 63 30 -105 -167 -261 -96 -108 -225 99 -54 9
6756 9 171 -77 12 114 21 -2 111 -167 26 31 177 184 -335 136 -207 74 -76 -4 -95 -143 168 -68 -142 -131 -28
6781 -28 184 111 -7 -286 -84 -73 -130 -25 -196 178 90 211 -53 -16 166 -27 -129 370 67 198 -153 48
6803 48 87 184 -39 121 165 -199 -55 35 112 -4 185 -127 -37 -31 -132 -4 -315 28 184 157 -37 -20 43 275
6827B75k52Q5j27J30pM6J8k84M23l05j95J68j5J35J60j30l1j96J95j78J54q3q9
6850a03R2j84K40K4p4k6j07J26J0r8K67j0r4j24R1R5j05J31r3pr3j15Q6p5K24
6875G8k95oK97j02JM20m93P8J62r8k74J95Q1j00K20n5J44o2l59J40J74k88j76
6898c18L80l33M98l14j60L95k85K29k19J58K7j17J31j39K7k6l4J18J40j78nR3
6920F8l48J97J81j15K97j28m4k8L4j04J12j29J62j52NJ45k54J72J02m25J95J34
6942G7p9K36j88J86j61L33n08n3J59q4j83L36j41K75k12j66p6M4J75%j09p4K15
6965Bn9k77K85J98j10o1q7J41J15l71L65j7k58K73j48l2j87M67m08M38j82J3o4
6988C6M0Lj95j10K7K76k03m7N9lJ23R3R2K10l76j35K43j23k2R7q2K4O0j65K07
$$ plain form
6827 275 23 108 -19 111 104 150 168 -116 307 2 -193 -25 -40 95 255 125 94 -102 93 -85 69 -14 -103
6850 -103 -11 -195 45 69 -5 -31 -138 -12 -2 -100 167 157 63 -61 30 125 20 151 58 51 -42 -157 -71 -146 78
6875 78 -217 -223 74 -28 -27 393 -100 -22 140 42 -232 -37 44 -56 164 109 253 191 -168 -28 146 -142 -318
6898 -318 62 -271 227 -87 -247 148 -137 92 -127 31 58 -59 72 -67 -40 -66 -100 18 158 -20 -25 68
6920 68 -280 -83 98 -17 280 152 108 80 114 10 122 -7 155 3 8 153 -101 71 173 -252 -57 77
6942 77 -2 234 46 232 71 404 -104 -157 2 -82 -265 71 -70 205 -7 -173 -249 -205 -30 -30 -139 -213 2
6965 2 -57 -334 -49 149 39 -22 -109 32 147 -224 141 124 -134 139 -9 -41 -228 239 -169 269 87 100 36
6988 36 76 79 -116 -226 -199 77 -126 -173 -114 -117 6 99 191 401 25 -110 133 10 -12 85 3 27 87 -78 129
7013A29m06R5Q2L53j33j56N1N3k49K57k65K52j45k2N1j79L60j99L3o6M2P0J29
7036A37K3J22k85J39p0J14j7o3j81M8mj0Q6n4k49J55J89q5k18J36J52j53K60k50
7060g8q1K42j41J52K46l06k4j82J46J28k50L78l10J42J15j44n3J08L4K9k56J42
7082C7l07L4M08k23o4K25%k15J54j84k1K64L8p9k46j7k1o9L10k83K18J64k9l64
7106b70K87L03j16j95M4J25kl84Q0Q0K11k03K25n79N80k29m4j90J99K09O6k30
7128c3p6K03l53K89k27J41L8l5J48M1k91O1kj35N54l95Q3K05l11M3J15l7j26J65
7152F5j99J71j11J57k44M64m35L36k96J96J64n6k3k48L8M9N2j47Q7n5n5J53k21
7175a58J74J34l02K03k11M46k39J5j62l6RL02l74K55J21L9k78J54k55J27K0q1
$$ plain form
7013 129 -277 -182 -100 253 120 -36 15 68 -181 76 -189 63 -82 -104 -53 -232 128 -71 -38 -104 -62 8 137
7036 137 160 282 -3 136 66 180 163 100 -81 -33 -37 -47 39 -15 -264 -109 80 -5 -223 -87 65 -88 172 -78
7060 -78 -159 83 -58 94 340 34 10 -172 -26 102 -148 230 -80 62 177 33 -20 88 122 151 -105 37
7082 37 -270 -236 172 -51 -115 110 110 -105 49 -135 -156 108 146 67 -179 -196 -217 -286 24 -259 -41 123 94 -270
7106 -270 17 320 204 9 53 178 176 -208 -128 -48 163 -40 185 -394 186 -43 -87 -277 -78 131 197 -33
7128 -33 -109 94 -259 30 -197 -56 -18 -53 95 136 -155 -94 -96 -231 323 -72 11 216 -95 -52 63 26 -100 65
7152 65 -134 37 -74 83 -161 303 -132 204 -92 104 268 212 189 -59 -21 28 80 -67 20 -35 -90 63 -158
7175 -158 16 150 -152 51 -160 286 47 62 -100 -136 -127 175 -199 56 177 216 -62 92 -163 -36 -16 -97
7197i7J2K8q5J94J24m21K80J87P6L8l82Q7J00M8l31J74M8Q9j46q4L21k52Q6p5
7221A9O8k77J90L07l80k6L25j28M2k87J51K18k6k51P9j09k78M07J85p5j92k8J14
7244D8J29p5L3p3q3N0J37m04L25j34Rj52r4K96J06k14R9J13j13r1R6J60j58j90
7268a80N0Q4O9J79k76J98K8j60OJ86m61R2J58m1J59K56k84pJ43J23j33l39J97
7291D7j82j56L38P4J68j53M0k23K1K1j0L95j90J1l57J79l61J72M29l14j67k5J44
7314i9K40j13j80K60J44m23R5k70K82j04n2M11m4j35j44J31j01J38j06K6J25M7
7336A28q5m0J74R6l95k4j93L60j08L28r2n09K96K53j02q1l5L46l97j90K22K42
7358A94l03J32p5M7M1j61Q9J9p9K2j66L91k44L49p9j70J67m38K85j78L53k39J24
$$ plain form
7197 -97 -85 -57 -142 52 176 -245 35 222 298 336 -46 41 141 189 -142 32 80 169 23 -61 260 8 94 19
7221 19 87 -190 0 307 -73 -99 226 98 140 -147 4 222 196 -55 24 -85 -363 44 229 154 -38 -66 48
7244 48 177 102 135 62 -21 29 166 -238 87 -47 -38 -190 -284 12 118 -96 3 116 3 -88 8 168 10 -180
7268 -180 -130 -46 23 202 -74 124 152 -8 -2 184 -277 -185 -27 -68 91 347 63 56 199 322 189 -150 47
7291 47 -135 -291 47 121 289 136 176 -47 -26 -5 -15 380 190 201 -156 23 -338 -166 263 -51 -218 -243 -99
7314 -99 141 28 -152 108 252 -171 -76 -346 -64 -168 -220 191 147 12 -132 -1 -102 36 -70 -44 81 128
7336 128 43 3 177 273 -122 -146 -339 21 -87 241 149 -360 -64 189 87 6 -29 317 -80 -270 -48 194
7358 194 -109 23 -52 -5 36 -125 -36 -17 -96 -74 -240 151 -93 256 177 7 174 -264 21 -157 196 -43 81
7381H1l57L36J39k53j50J50k43J43J54q9J15K44j56j17q1j17K42j70L80k72K38
7402B17l97KL06j94K01J02l9l14K43O8j55M7k6j60r2J02k9J54O5j88m6k5J76R4
7426A12n3k28L29K7k87J37j78O7J25J32l73R3P4j7l8o6J08k4J2k39R1J1P7M73
7450C65l44k54J46L8L7p4J4N5N2k06K20J68k28j57J60qR6j24J35j22O1K5l34M79
7474B00j90j65J71N0l13O6K62k30K75k50J56O4j83K92l49L04l1k14J69k61J48
7495b9r0O3j30M0j06P47n41J5M7r8L2Pj34K03K5o9n8J47r8M1l9q6J68l15L53J1
7521A06l12N7K44m2p5j91K74n9j85M21m2p2n2j09K4J38k75L93l69J23Q6J23j75
7544C1nj81J12o2P8L2N2O7l65MK39M1k51L40r5q1L1K9P5P0l92K77k34K66m4Mj31
$$ plain form
7381 81 -276 60 199 -54 -204 -54 -297 -154 0 -89 26 270 114 -3 -84 -201 41 -129 251 -21 217
7402 217 -180 -178 128 -66 135 237 198 -116 127 195 40 87 61 -99 -191 -89 -118 36 101 -87 -133 -158 18 112
7426 112 59 -169 160 187 -100 37 -141 -74 51 183 -190 -97 -23 -40 -78 -144 -36 -60 -48 -287 -196 -185 -108 365
7450 365 21 -233 -87 -49 -12 -86 -72 -17 35 -171 49 217 -11 -168 -8 -16 80 -44 91 -31 30 55 -279 200
7474 200 10 -155 16 66 -247 -181 81 -149 126 -124 32 96 -87 205 -144 160 129 -85 84 -177 -29
7495 -29 -119 -56 -186 -146 -252 495 -46 -31 16 -82 -50 -43 -177 26 51 -18 -76 71 -27 14 -25 -111 57 -258 95 106
7521 106 -206 -149 95 53 -22 -213 61 2 -183 238 196 124 72 -37 -13 125 -150 243 -126 -3 83 206 31
7544 31 26 -155 -43 -105 -27 5 57 124 -241 -237 2 43 -208 132 37 -44 -13 16 91 161 -231 46 -188 78 34 38 -93
7571i3J79k14K62j69J29m3J30N2m80K24O5JJ7J97k31Q5l96M46l96J75J22m47J40
7594b45L01k02J8L58k84L2k8J65j22N1k01O5j52L38l7K3j19J86k36L7k3M1q5K47
7618A28k40k8O45n55N9q4J36r9j01L19j90J8m8j61J01n8L17r9Q6j61Q7k25M42
7641B89l86j19L85l99J67Q6j96L17j90M3j00J98k62K0m4K82j24r8J79O1q5j14
7663i0k3J18J83j40k79J58k8R6N8L3o3n6j65M12j34q0J79o1Q0j91j14j10L66j9
7687A30k5Nn7j36L49q2k0k79J51o0j01J49l0M0q8O4p5n0J45n1l39M87k20R3n4
7712e4K6Pj44J86j74L01n3l4p4M6k55K14J03r8J41l26j6K50J1m4l14N11j96L0
7736D4l92N55k59j20L40l59K55j46lp1K70J8m1j14K09M7p4n3j20Nn1p0K17K51
$$ plain form
7571 -93 86 -128 134 -35 94 51 181 233 -247 -23 42 43 60 257 26 111 -285 161 -235 -60 62 -385 -245
7594 -245 56 -146 -128 230 -54 -22 -50 115 -7 44 -157 -92 -244 94 57 80 -39 147 -89 -52 -75 -34 -119 128
7618 128 -112 -140 505 -50 9 -75 61 -38 -139 180 -10 8 -40 -201 -100 -158 159 60 146 -15 72 -153 289
7641 289 -97 -216 169 -230 -63 23 -173 144 -46 -3 -103 95 -167 -147 -191 91 -33 -131 48 109 24 -90
7663 -90 -113 5 188 48 -231 -73 -101 -5 53 86 23 -33 -198 214 80 0 179 118 198 7 -107 -217 149 130
7687 130 105 110 53 -83 266 184 164 -115 36 -24 -125 24 -6 34 -54 10 -65 -115 30 -21 -360 127 -93 0 -54
7712 -54 -28 -21 -165 21 -153 148 95 61 -13 33 -222 -8 95 -3 138 -188 -204 46 57 13 -301 210 14 44
7736 44 -348 207 -52 -172 168 -191 64 -82 -85 -156 114 132 91 -23 186 233 159 106 -14 -9 -60 -130 87 338
7760C38n96M41k71j63M32J63l10q1l4J40m0j49M4J12oJ52P7j70j63J42n0j42O5
7783f9p9K62J47j44j63J05j75J53nJ79j72L8j37P4J31m78K31Q4Or3J45k6l7P7
7807E4j78Q4K2L8J12k08Po8J41k11K43Q4P4J62l16j07J84l03m5J94J10Q3j4k23
7831h1L9K7r4lJ11j69K29K0o9k8k60L48p7qK8J04l30K95k87L00k21J58k5j38J70
7856C9n8K34o3m58L76j63J8L58k64j72L85k50J47j46k11K37p4K32l07k2J74k6
7878a4l29K11j62L29m7J94l82k32O73m41K43lJ15k10J25j05k78N09rk17oj9J58
7901A03j12J62k24P5J59k83J41J17j42K5j21L3M9j42J13L06k21q7j3MO5N8k2j97
7925a54J71j10k06M63Q1l16K57l01lM7L03n13M02j17q5k05K51j86J60NJ93j22
$$ plain form
7760 338 -258 183 -88 -251 181 344 34 -47 -81 59 19 -130 -86 26 20 172 249 79 -84 58 8 -134 -69
7783 -69 -148 114 261 117 -46 59 -116 37 32 211 39 77 -60 14 145 -333 -102 -18 -12 -105 40 14 -23 54
7807 54 -124 -40 -18 20 132 -76 -69 -137 4 -207 36 120 194 356 40 -67 117 -186 -231 -37 73 156 142 -81
7831 -81 -42 -15 -109 -112 -1 -170 59 79 10 -18 -278 70 -7 -15 13 117 -213 82 -205 95 -126 32 7 -131 39
7856 39 -19 215 152 -306 70 -93 -75 283 19 -153 232 -18 129 -17 -228 9 -65 167 -140 -162 12 -14
7878 -14 -343 -132 -294 35 -12 182 -200 -432 241 -200 43 40 155 -55 70 -35 -313 196 187 -30 -36 -55 103
7901 103 -9 153 -71 4 163 -120 21 138 -4 21 -100 -67 -18 -160 -47 259 38 -49 -62 -58 7 65 43 -154
7925 -154 17 -93 -299 164 245 -71 186 -115 -118 -71 232 -281 121 4 -81 -286 -35 -221 -61 -56 137 15
7947A5j23L25k34n1j05M81k12k48M00j20n25N11J00k89Or9J54K7M7k54K84k03
7969a13R4Q0j88J67L6n4rR7k45J9o1J38N01l96m2q5kL4J29M0l55M35k66J22j44
7994f8J33rk42J27K50l7k17p6K17K67m66j64K88J0p5k5J03j58JL32k00J44k04
8017f9j46M19k36j5O4j63L2K6J33O4k53J95j35K42q1j69j57K66J88k63j65K36
8039A3mL52j94k0O4j77o6q4N5m7MJ58j10Jp5L08n9K1j1Lj10j23K98Lj86J67l60
8066a79K16r6p6J7M7K04k62J30n0p4L02j96O0J5j16P5k90L58j25j09Q1r1J82J83
8090B06K11n66J55J56k39k6j69K94M1J27k75K70j04l9j56O6M37n55N91n78J27
8111b6M0J58k80J13qj20K86k48L52rj40P2m33M40j17n3L15k30l37K00L7L1Ql86
$$ plain form
7947 15 -108 217 -17 -68 -173 308 96 -152 248 128 -397 114 214 -75 -69 -168 -14 13 60 -194 90 -113
7969 -113 -19 61 -127 40 76 22 13 110 -135 -116 -177 -39 462 66 24 -61 -63 -29 100 140 -215 220 -46 76 -68
7994 -68 65 56 -186 -59 191 154 -63 -139 78 345 -121 -285 3 13 -62 -87 16 -142 -141 191 -9 135 -69
8017 -69 -215 204 -32 -47 17 -146 -114 -88 45 109 -144 51 -84 158 77 -92 -249 17 205 -58 -223 13
8039 13 9 361 167 147 211 34 -32 -116 -61 -108 -104 54 -56 -55 -130 178 119 140 129 132 22 -101 197 200 14 181 -179
8066 -179 37 -59 -135 -118 -71 133 -129 1 -49 -123 179 -17 43 58 -58 17 -273 85 -40 -149 -68 -159 23 206
8090 206 417 -149 6 162 -77 -103 -272 22 63 190 -85 185 81 42 -114 -48 389 -166 425 -153 -26
8111 -26 14 172 -108 5 -3 -123 163 -85 267 258 118 190 -243 197 80 27 342 112 -225 -25 12 43 51 -335
8135c35L66pJ7M2j63K72k18Q3K02k23p0J36j89P7KK3P1m49K81K75l00K22j87j5
8159h7J87k75J66j00K03k4J48j61j40P2k5J91k84J28K78l24r6j0K56k12j36J42
8181a03L96m58K13M1l38P6K40p5j74K61
$$ plain form
8135 -335 31 24 41 83 -80 192 -26 57 259 36 -34 102 -87 -10 -8 15 86 -363 -82 193 -107 115 -72 -87
8159 -87 100 -175 -9 -109 94 70 218 57 -83 -11 -36 155 -129 -1 277 -47 -143 -153 103 -109 -245 -103
8181 -103 293 -165 48 89 -249 -173 67 -8 -182 79
8191G9
$$ Imaginary data points
##PAGE= N=2
##DATA TABLE= (X++(I..I)), XYDATA
0@%%%%%%%%%qJ6k4L2l2M0m8O4q0R6j20J43j75K08k40K80l28L84m48N18n97O81
31C62p77Q85j004J137j281J440j615J806k017K247k500K775l073L403l761M151
47B178m580N049n565O130o753P442q206R065j0028J1119j2369J3813j5506J7522
61I311j9975K3034k6974L2271l9814N1511p2298J20528m47727k24158O28142K79148
73C12999K61784O0642j00432m22777m09568k65180j0740J19098L05513L77708
83B29047K99641J4902j67007k40738k59154k92971j36374J27481L11765K82415
93A69007J98498Q9148o0781k40175k94479k14520o9942N9317J97809K82532K30038
104C46452N0360r7997j62377j97081k11594j13435O9214J95547K00628J54876
$$ plain form
0 0 0 0 0 0 0 0 0 0 0 -8 8 -16 16 -16 24 -24 40 -40 56 -64 79 -96 112 -128 152 -176 208 -240 278 -319 362
31 362 -415 470 -534 603 -678 762 -853 953 -1064 1183 -1317 1458 -1615 1788 -1973 2178
47 2178 -2402 2647 -2918 3212 -3541 3901 -4305 4760 -5268 5851 -6518 7295 -8211 9311
61 9311 -10664 12370 -14604 17667 -22147 29364 -42934 77594 -370133 -594291 33851 312999
73 312999 574783 635425 534993 112216 -297352 -562532 -573272 -454174 -148661 229047
83 229047 528688 543590 376583 135845 -123309 -416280 -552654 -425173 -113408 169007
93 169007 367505 456653 395872 155697 -138782 -353302 -423244 -363927 -166118 116414 346452
104 346452 396812 298815 136438 -60643 -272237 -385672 -316458 -120911 79717 234593
114B34593Q8091k4005j56125k07632j51930o3861J0444J03889J98060J90822O4003
125B86349n8136j00876j27631j59451j13152K1250J31456J47729J18846Q1492
135B27876P395j00452j58742j21279n0572j019N5711J30164J46755O8132k8107
146A75862p1016q9325j09061q8394o039P6949J03733R1349O8362K1636n4194j10176
158I686r8255m7766q628K8763Q3047J10408O7132o198m6802o2727p9212p2752
170a23304j7360M8575P3652O4000N3300K9422k6345p8237p6678l7906j1404R138
182i3147N0497Q1731N8135M369k7468l8732n6155o0508k3184K9005N0280M4422
194A9245M1962L1589q975n4214n7695l0771j2923o75L0982N8010M7048R747j4179
$$ plain form
114 234593 322684 298679 142554 -65078 -217008 -280869 -270425 -166536 31524 222346 286349
125 286349 228213 127337 -294 -159745 -272897 -251647 -120191 27538 146384 227876
135 227876 235271 134819 -23923 -145202 -195774 -196793 -141082 -10918 135837 203969 175862
146 175862 104846 15521 -93540 -181934 -187973 -111024 -7291 84058 152420 174056 119862 9686
158 9686 -88569 -136335 -144963 -116200 -33153 77255 144387 138189 91387 28660 -50552 -123304
170 -123304 -140664 -92089 -18437 45563 98863 128285 101940 23703 -52975 -90881 -102285 -93147
182 -93147 -42650 39081 97216 101585 74117 35385 -20770 -81278 -104462 -75457 -25177 19245
194 19245 61207 92796 83821 29607 -28088 -58859 -71782 -72457 -41475 16535 63583 73330 59151
207E9151k3710l9349m7027k4007J5655L3568L1329L0940K6921J297l3804m3159
219a2195k5985j2439l766J6870L9511L7053J2772p014j4354k4782l4980k3513
231e2822N801K3534K1818K0934K2473P674k0021l1552k1139j0301n584O449K6864
244e872K9825J2206l457p344j4932k5527k1179J86J6051J5348J3860J7345R618
257C6128j0677k2585j6066q037o531J462J6869K2529J1196o79m245q060j6955
270e651j7649l392R340J0976R935J2376R763m649j5421j2639o352n137j309R156
284a0653J6678J0493P51k961m144j0818j3282n616N729P719N804R144Q876p00
298A7020j1061r653m066l931l415M820J2478Q495O80r92j382o632j1277n146L740
$$ plain form
207 59151 35441 -3908 -50935 -74942 -59287 -25719 5610 36550 63471 64768 30964 -12195
219 -12195 -38180 -50619 -54385 -37515 1996 39049 51821 44807 30453 5671 -29309 -52822
231 -52822 -47021 -23487 -1669 19265 41738 49412 29391 -2161 -23300 -33601 -39185 -32736 -5872
244 -5872 23953 36159 32702 25358 10426 -15101 -36280 -36094 -20043 -4695 9165 26510 36128
257 36128 25451 2866 -13200 -21237 -27768 -26306 -9437 13092 24288 23609 19364 11304 -5651
270 -5651 -23300 -26692 -17352 -6376 3559 15935 25698 21049 5628 -7011 -13363 -18500 -19809 -10653
284 -10653 6025 16518 17269 14308 10164 -654 -13936 -19552 -13823 -6104 -300 8844 17720 17020
298 17020 5959 -3694 -7760 -11691 -15106 -10286 2192 10687 11367 10375 8993 2361 -8916 -14062 -10322
313a0322M712L674O203P946O86p267p499k481k790l765J983Q635O840J430o33
328G352l58l933p991m526J820L178K128L719O383J888m584n076k312k033l063
343g408M30N294N604J704n05L33k402n018m424K72K597J219K378M472K461k109
359D898m124k201r44k717n33L266M385J794n44O21o92l561l924K5J839N14P99
376a099L398K766j192k844j578n15j892j184K027L033J447k76O91K25k861k678
392b532l55J193L66M73J949K061l30j867j278l87r16j222Q96K282J113K06q5O91
410B258j551k310o36P19N26R5J284J628M34j491q34m0p01j394L00J494J311k34
428H58K11O07m02j755r62L81M81l38P07J352O61j147n28Q9o90q66Q0J062P05K63
$$ plain form
313 -10322 -5610 -1936 4267 12213 12899 5632 -1867 -4348 -7138 -10903 -8920 -285 6555 7985 7352
328 7352 6994 3061 -4930 -9456 -7636 -4458 -2330 1389 7772 9660 5076 0 -2312 -4345 -7408
343 -7408 -6978 -1684 3920 5624 5119 5452 3050 -1968 -6392 -6120 -3523 -2304 74 4546 7007 4898
359 4898 774 -1427 -2371 -5088 -5621 -2355 2030 3824 3280 3901 3209 -352 -4276 -4251 -2412 -1898 -1099
376 -1099 2299 5065 3873 1029 -549 -1064 -2956 -4140 -2113 920 2367 2091 2782 3007 146 -2532
392 -2532 -2887 -1694 -1328 -855 1094 3155 2825 958 -320 -707 -1623 -2845 -1949 333 1446 1652 1567 2258
410 2258 707 -1603 -2239 -1520 -994 -899 385 2013 2447 956 122 82 -619 -2013 -1713 -219 1092 858
428 858 1069 1676 1274 -481 -1443 -1062 -581 -919 -212 1140 1801 654 126 215 -475 -1341 -1261 -199 506 769
448G69k03N14j06r05r99K48N48n08N79P54L64o00k93k79jn49k75M45Q77q7j31
469A62M93K11r33n49J10O7R9M6O53M99l13o16Q8k33j49l35M52M62n3q2j9L81r5
492C46n01j52K55l8j98O44L27m95J3m5J64o69Q4r9N66j05J27J08r9J00o25n4M08
515F2l43K3M22K01k72k16J14R7j38k31Q4K3M77k38l09L61R5k70l26K59L43l21
537a03J26M36k8l99r9N1J8j29o4M67k40j31L40k52N3j10r5M7Q5m7OK2L27j66j23
562hO2o9j7k33M97l69R1J98l9j88J52k74o5M51j48j30PJ48J54j58J58l09j18J70
586c7j49O04l6n81P6J03M8j18J19K09j05j92q5K76N6k26j29L78k09k6o3j20L8
609a69r5O45m27j18L36j88J25k51O3%J25j30j72L66N0o9Q6j94j9j19q8J80J38
$$ plain form
448 769 566 1080 974 69 -930 -682 -134 -642 -63 691 1055 455 162 -117 -118 -667 -942 -497 380 293 162
469 162 655 866 -67 -616 -506 -439 -340 -294 359 858 545 -71 17 -216 -365 -700 -248 214 161 79 60 441 346
492 346 -155 -307 -52 -90 -288 356 683 188 201 156 320 -349 -265 -364 202 97 224 332 233 333 -292 -346 62
515 62 -281 -258 164 365 93 -123 -9 88 -50 -281 -197 -174 303 65 -244 117 212 -58 -384 -125 218 -103
537 -103 23 459 431 32 -67 -16 2 -127 -191 276 36 -95 245 -7 46 -64 -159 -112 -27 -74 -68 -46 281 115 -8
562 -8 54 -15 -32 -265 232 -137 -46 152 113 -75 77 -197 -262 189 41 -89 -82 66 220 62 220 -89 -207 -37
586 -37 -186 418 382 -199 -123 -20 28 -90 29 238 133 -59 -144 132 188 -38 -167 211 2 -24 -87 -207 -169
609 -169 -264 381 -46 -164 172 -16 109 -142 -79 -79 46 -84 -256 110 160 91 177 -17 -36 -155 -243 -63 75
632G5j07j02K5J77l9r4K13k12K37k41J0K14k18N0K77j93J36j90O4K8k27J75o2
655dj04K01p9j95J18j72L12l5M7j8j20P0M1k2N1o6m26M61j3k38L02m10M52k1M2
680A74n3k49j76K48Q3L9k08M0K30R0j77O7Ol47K74J35j79k29L52nj80j19M32l76
704a28K98j78j25Q5m1K85k61q5J87k0j98K75l64J30N5p2K08l19J33j63J89L6P9
727FJ33K3j51j02j97J22Q4L01j68j74M12l14k73K28J16o9n4l7K76k18J24j05P3
750C6j34J81j28j0M7k8K76K78l77m4k45J68q5j37J7J87J18m36L64J20j78r3J75
773G2l03N38n0k21J65j68o8P1j5k70M8N37k83P1q7k39J93K25j97kR6Q6k02j52
797a55K37m4j9k01K72J03l65J33P1j42K11l21J26K32k46K07l07J09K76l83J57
$$ plain form
632 75 -32 -134 -109 68 29 -65 148 -64 173 -68 -58 156 -62 -12 265 72 208 18 82 110 -117 58 -4
655 -4 -108 93 14 -181 -63 -235 77 42 89 71 -49 21 62 40 91 25 -401 60 47 -191 111 -299 153 132 174
680 174 121 -128 -304 -56 27 66 -142 -102 128 218 41 108 114 -233 41 176 -3 -232 120 115 -65 -184 248 -128
704 -128 170 -8 -133 -48 -89 196 -65 -150 37 17 -181 94 -270 -140 -85 -157 51 -268 -135 -298 -109 -73 6
727 6 139 162 11 -91 -288 -166 -82 219 51 -123 289 -25 -298 -70 46 -23 -77 -114 162 -56 68 -37 36
750 36 -98 83 -45 -55 -8 -36 240 518 141 97 -148 20 -65 -202 -185 2 120 -316 48 168 -10 -103 72
773 72 -231 307 257 36 201 33 -35 36 21 -249 -201 336 53 124 37 -202 -9 216 19 17 113 199 -3 -155
797 -155 82 38 19 -182 90 193 -172 -39 32 -110 101 -220 -94 138 -108 99 -208 -99 177 -206 -49
818d9O9k97J15L60l43OJ84K2J37l5k68L22j65j14k2J98l27J80J3J27j07l8J26
841I4K11n07Q6J18k18K55J36k11o6J34O8j01J35m05L63m14L24o0O0M2k22K40j55
864i3J04l3k91N38R2n85N81k83j5R7K49k78q6L31k47j06L0k91L27j41P0j89L4
887a85L13j8k13q9K72k50n3K55l62K78O2j49J41M2M0L4r5%Q9o1O6K0k15L2M07
912C61k66n3j3J13K34o16K25j0K25k17k92J65M35l06p0J52k56K74j46k05R7m2
934b11j6K54J8K4k80L45k42J96R2j06j49l4K75k33j5j5O9k1J20k67J15K86k41
957c6j19L01j96Q5k80Q7R2o4P0L28j01j91r1m9K98l25N0M1J87j18p2j3L80j17
981A47m35L34N7k75O4K56j04K59o36Q7L12j88J26O1l0l00J42p3J89L60m98J12
$$ plain form
818 -49 20 -277 -162 198 -145 -139 45 67 204 169 -99 223 58 -56 -78 120 -207 -27 -14 113 6 -32 94
841 94 305 -202 -116 2 -216 39 175 -36 -102 32 100 -1 134 -271 92 -322 2 -58 2 44 -178 62 -93
864 -93 11 -22 -313 225 317 -268 313 30 15 112 361 83 -3 328 81 -25 5 -286 41 -100 -30 -219 -185
887 -185 128 110 -103 -192 80 -170 -223 32 -330 -52 10 -139 2 44 84 118 23 23 112 51 117 137 -78 -46 361
912 361 95 42 29 142 376 -240 -15 -25 200 -17 -309 -144 291 -15 -85 67 -189 85 -61 -266 -169 -211
934 -211 -227 27 45 69 -211 134 -108 88 180 74 -75 -109 166 -67 -82 -97 -28 -49 71 -196 -81 205 -36
957 -36 -155 146 -50 35 -245 -158 -66 -130 -60 268 167 -24 -115 -164 134 -191 -141 -100 87 -31 -103 -116 264 147
981 147 -288 46 103 -172 -108 148 44 303 -333 -246 66 -122 4 65 35 -265 -123 -196 -7 353 -145 -33
1003c3K13J26l08j2K18j65M3l8P0rp9J7Q1j76R2n8N0r3j33L0RJ68m2l9mm3J75
1030F0k29J87j2O5r2l0k8mQ8K38l53j53J21n5L0K08QM5l33m7L02K22k07l9K65
1055B57k73j11J23j47J16kJ06KP9j41N4J52m22J23M7L4k07K9K58j47O7L9k04Q3
1079h5J78l6k05K84k57J65j7PJ40m40L79r3p3J36m4j20M1L15l94K84p6p9J95l28
1103a23N04k72Kj82J47n33O08k8k86K97l7K24m31K21l97K06L7J42j00L51l94k3
1125f7J13k27K01l8J9l7J04K7Pj62J19m08L76n2M5MK46l85N3q2O9K38j49J95j12
1150I7n2j25L21m46L00j00Oj40J06J14m54N03n6K59l23j35K06O1k38O9k50K03
1172g4J07J66l02K74k59j63L66j03k05K29Q9n4j23l6P3r2N71m19lk01J54K6J30
$$ plain form
1003 -33 180 306 -2 -14 204 39 82 44 114 105 26 43 124 -52 40 -18 32 -61 -194 -164 -155 13 -29 -68 -72 -115 60
1030 60 -169 18 6 71 -21 -51 -79 -83 5 243 -110 -263 -142 -197 -167 41 49 94 -239 -286 16 238 31 -8 257
1055 257 -16 -127 -4 -151 -35 -37 69 71 150 9 63 215 -207 -84 -37 -3 -210 -181 77 -70 -3 36 -168 -85
1079 -85 93 57 -148 136 -121 44 27 34 174 -266 113 20 -53 83 39 -81 -40 275 -119 165 89 10 205 -123
1103 -123 381 109 111 -71 76 -457 151 123 -163 134 97 321 -110 111 -286 -80 -43 99 -1 350 -44 -67
1125 -67 46 -181 20 -18 1 -36 68 95 102 -60 59 -349 27 -25 20 24 270 -115 -62 -144 -75 163 14 209 97
1150 97 45 -80 241 -205 95 -5 1 -139 -33 81 -373 130 74 333 10 -125 81 142 -96 -27 -277 -74
1172 -74 33 199 -103 171 -88 -251 115 12 -193 36 125 71 -52 -88 -15 -107 464 45 42 -159 -5 21 151
1195A51j15o7J44j21j03K62j88J55r9r2j78K33j15N4Q3k31M4J84J42l08K50L7
1217A22j98K11l44J91O5r9n6J9J43J45l72N2n4P9K50j07j25r0K93k82M03l46K91
1240A91j41j40J24J51j05l2K5k36k78N98q6J48k43J30j7k31K29k44K26L0j1K0
1262A08j28J43l8Q4j61j93R6L62l26J46J8k14O8J45k80J2K58l53M67j39j2k37
1284a74K11O1q3j70J59J68J28k57J85j33k03L96m92K70j85K06o4j85K37j90K35
1305A20j38o2j13K63L1l47Q7L55l87L03j06r4LQ3j15k3K87j30j88L85l47J1R3
1328b9J61n8k32K54q5j13J62r8k39J54J85j34l01J48K84m1p6L27k47nk47M32k03
1351aJ3J7p9K14j0k34J46q1m1J01j61K54l41L97l09K54P6Jp5j45K53j68J11l93
$$ plain form
1195 151 36 -31 113 -8 -111 151 -37 118 19 -73 -251 -18 -133 -79 4 -227 -183 1 143 -165 85 122
1217 122 -76 135 -209 -18 47 -52 -108 -89 54 199 -173 -121 -175 -96 154 47 -78 -168 125 -157 246 -100 191
1240 191 50 -90 34 185 80 48 73 -163 -441 157 71 219 -24 106 89 -142 87 -157 69 99 88 108
1262 108 -20 123 85 169 8 -185 -89 273 -53 93 111 -103 -35 110 -170 -158 100 -253 214 75 63 -174
1284 -174 37 98 15 -155 4 172 300 43 228 95 -108 288 -204 66 -119 87 23 -162 75 -115 120
1305 120 -18 -80 -193 70 101 -246 -159 196 -191 112 6 -88 -85 -2 -117 -140 147 17 -171 214 -133 -122 -29
1328 -29 132 74 -158 96 11 -102 60 -38 -277 -123 62 -72 -373 -225 59 18 -58 269 22 17 -230 202 -1
1351 -1 12 29 -50 164 154 -80 66 -15 -56 45 -116 138 -203 194 -115 139 215 216 141 -4 249 81 192 -201
1375b01l7M87m19J63J40m36K08j14J40j3J58J07k65J9Q4n0J0J29R2jk74m0R3j91
1399b11l1J71J12l0J22j46o1L96k45M3N7l43k93M05L11k1j91J02k90q9K31o1J82
1422A20j59j84J53j40J3J97l12M79K5j20Q7k53p6J46j34J90J62j00R1L9j73n6
1444epQ9l91L64mq5k20J62J59K17n46K70K7n5q5o0L96k99Q4K1L2j79n6L23j25
1469B7j3j51J1J59J4k75M06k35J13k10K80M8L0k29K77p1j28J42k84J89l71J59
1491a12M3J84j30L9l10L34l3n5k73K13J33j64K12j39j31L35k29K4N75o60n5J28
1513g1J11j06k46N69l16O4L8J7k15J10j64L28J22k55J26j13j00J52m8l9N4j95
1535a77J40N3J32O2j43k06k6K68k36qJ67p1J98k74k17J73K20J77l32J93k43J1
$$ plain form
1375 -201 -238 249 -170 -7 133 -303 -95 -209 -69 -82 76 183 -82 -63 21 -29 -19 110 202 201 -73 -113 -20 -211
1399 -211 -242 -71 41 11 133 -13 -74 322 77 120 177 -166 -459 -54 257 236 45 147 -143 -232 -1 -62 120
1422 120 -39 -223 -70 -210 -197 0 -312 167 192 72 159 -94 -170 -24 -158 32 194 94 185 224 51 -5
1444 -5 -12 77 -314 50 46 -39 -259 -97 62 279 -267 3 30 -25 -110 -170 226 -73 11 32 64 -115 -171 152 27
1469 27 14 -137 -126 33 47 -228 178 -57 56 -154 126 174 204 -25 252 181 53 195 -89 100 -271 -112
1491 -112 -69 115 -15 24 -286 48 15 -40 -313 -100 33 -131 81 -58 -189 146 -83 -59 516 -144 -199 -71
1513 -71 40 -66 -312 257 -59 5 43 60 -155 -45 -209 119 241 -14 112 -1 -101 51 3 -36 18 -177
1535 -177 -37 16 148 210 67 -139 -165 103 -133 -141 26 -45 153 -121 -338 -165 55 232 -100 93 -150 -139
1557a39PJ60k43J36j87O15l24j99K68l80N34l80L08l70J35K15p0j09L5j69ON44
1579C93l57K4k8l12qL24p8j02O6J92J2K2j98L70l19m2K12Mj27l0J1K4r8p0P3p
1605d9p1L50k37O7m8R8p0N5j14oJ17j33J2M4n5O9Mk91K94J77j81M5K35l29k18
1630b35K97p9J12o1j9J21j88J17l95M23o6Rl0J42p7K1R0l10J90J6k35J28J03j4
1654F0L8n7j61q3J59P3o3J1J16j34j24R8J21R1j52m9J68mK02m08K40k05M6K08
1678A91l3q1j62L4j03K52P7j26n2l7m4L7O7l4j55K39k47J42j08J74j64J0N2P9
1702HQ8j41nQ3J14j24k27J88N1R4l69N16k37j82J57Rj31K9K09l94M57k42M2j27
1726a34J02K55rj24O8Lk34l0k13N03j15k80K01N7j57k27L49O7j4r1j98P5J71O8
$$ plain form
1557 -139 -132 28 -215 -79 -266 349 25 -174 94 -286 248 -132 176 -194 -59 156 86 -23 12 -157 -151 393
1579 393 36 60 32 -280 -288 36 -42 -144 -78 114 126 148 -50 320 1 -41 171 175 48 18 29 53 -45 -115 -42 -49
1605 -49 -120 230 -7 60 12 110 40 95 -19 -25 92 -41 -29 15 -40 29 33 -258 36 213 32 77 312 -17 -235
1630 -235 62 -17 95 34 15 136 -52 65 -330 93 27 36 6 148 71 92 182 -128 62 78 -157 -29 74 60
1654 60 98 41 -120 -203 -44 29 -34 -23 93 -41 -165 -67 54 145 -7 -56 112 108 310 -98 142 -63 -17 191
1678 191 158 77 -85 -51 -154 98 175 49 -3 -40 -84 -47 20 -14 -169 70 -177 -35 -143 31 -133 -123 -71 8
1702 8 96 -45 -50 33 147 23 -204 -16 35 129 -240 276 39 -143 14 23 -108 -79 130 -264 193 -49 -7 -134
1726 -134 -32 223 214 90 158 161 -73 -103 -316 187 72 -208 -7 50 -107 -334 15 82 68 -23 -221 -146 25 93
1750I3k24M01k66J8J52k01m1nJ16Rk50K90j76P6k00Q0J11m7K16J06k26j42J0J48
1774D8Kk13J77M2n6J74j00K38m30k9K61n4j41J70k8L9j24k00P9R0j58J55J26l6
1798C2j29p2P1O1L18l35j10K42L7P6j84j12J07K03m74M65l9J05m88J55Q0k05K83
1821H7j19K6J30k7L5k18J29J91p8r4K22l44J2N2k94N2j20L45J91o0l92J89K40
1844A55k07n1O7L7j39L64k58k11K82p5L4j19J08J19l8k04O4J90k66J18l1R9R1
1867A29j10o0l4J67j03J12k76K69Q1j70K12q2k44J93l90M43n5j32k0L4p7J67K0
1890G4J63n42M18p4p5NO9l84L58n9J29N0l57K26k61J23K89l84K90n5l6M8m4J98
1914A69q8k71K00j33K78k05J36j35m5K18j69n4m4L76p3m9j3R3N2k19J43j74q7
$$ plain form
1750 93 -131 270 4 22 174 -27 -68 -73 43 52 -198 92 -84 -8 -208 -128 -17 -64 152 258 32 -110 -100 48
1774 48 50 -163 14 56 0 174 74 312 -118 -147 114 60 -81 89 61 100 -24 -224 -145 -55 -213 -58 68 32
1798 32 -97 -169 -98 -37 281 -54 -164 78 115 191 7 -105 2 205 -269 196 157 262 -226 -71 9 -196 87
1821 87 -32 -6 124 97 132 -86 43 234 156 62 284 -60 -48 4 -290 -238 -358 -13 178 118 -274 -85 155
1844 155 -52 -103 -36 1 -138 226 -32 -243 39 -36 -2 -121 -13 106 68 -136 -72 118 -148 -30 -61 38 129
1867 129 19 -41 -75 92 -11 101 -175 94 175 5 217 135 -109 84 -306 137 82 -50 -70 -36 -113 54 74
1890 74 237 -305 113 39 -36 -31 38 -346 12 -47 82 132 -225 1 -260 -137 152 -232 58 3 -33 15 -29 169
1914 169 81 -190 10 -123 155 -50 86 -49 -94 124 -45 -99 -143 233 160 111 98 191 243 24 167 -7 -94
1937i4J92k22J18j18o9J61N1rj44K24R2j14jk93J57L14j57j42L13k60N4q5J25
1960I3o5k40L15j14j98K19P8J1L0k48K72L27k32k38qj20p7J4K75J5k0o0q0k3J84
1985A10L6O3k56J74k3p4j10J6K44l40K29l1j19K6K37o5l26K28J45k80Q0K14r5
2008H3j89M51r3p9l22J5J46j93K34P5k67J42K8o6pk32J38J52j70K30J41l94j5
2031a92L57j84J32j61j66K71k01L33n7J4j44K44j27k50K32J64k02n7J33j52J31
2052A18m7k19J09n6R4L17k87k97M52j12j54k7J52O0j80M7j28K61j3Q9j68K8Nl43
2076b99K13j16K88m2p9P9j42J13P3j25K04j61k83K41J92k71r8L11J46m81L41j01
2098Cj04J84P7j15j20o1r0L20J37j8j56j30Q0k26L73j39N5L8k35J99n5k82L76
$$ plain form
1937 -94 98 -124 -6 -124 -193 -32 19 10 -134 90 182 68 67 -226 -69 245 88 -54 259 -1 53 -32 93
1960 93 28 -212 103 -11 -209 10 88 99 129 -119 153 480 248 10 2 -118 -195 -181 94 109 89 29 -51 -74 110
1985 110 146 209 -47 127 104 30 -80 -64 180 -160 69 38 -81 -55 182 117 -209 19 164 -116 -36 178 83
2008 83 -106 345 252 173 -149 -134 12 -181 53 128 -139 3 31 -35 -42 -274 -136 16 -154 76 217 -177 -192
2031 -192 165 -19 113 -48 -214 57 -144 189 132 146 2 246 119 -131 101 265 63 6 139 -13 118
2052 118 71 -148 -39 -95 -1 316 29 -268 184 72 -82 -109 43 103 -77 -30 -158 103 90 179 11 39 44 -299
2076 -299 -86 -202 86 44 -35 44 -98 15 88 -37 167 6 -277 -36 156 -115 -213 98 244 -237 104 3
2098 3 -101 83 160 45 -75 -136 -226 94 231 213 57 -73 7 -219 154 15 70 108 -127 72 17 -265 111
2121A11k0j07K34j62J26j67l59N33l43O3J91j85J98q7k5J18j48J68l24J43J56
2142A14k54L77l33j92L01N2l0o1J1r2n8Q3J27J28j66K6K8j78R9K11k79j27K50
2165C7j2R8O4l70P8K3k82L89J34j73m51M28J75l42M21m74L91J2j64L0Ql50M09
2188G9P9l31P1O0K55j81j57J56l10K07N0k7j48J02J16L5R3k87J23p3J46n1j22
2211a15J95N9n4K31n80L04K5k61J14M28m48m6L28j68K66l00j89J92N0K23l97M2
2233a01Q2J69p5j56m9M11m66J6R7R4j94k38K86K22l72L3K04K94o28O39l88J82
2255F2M1Rk75n9M41j26J3L9k38Q5P6l13J25J02K32l37J38O0j37K4K91j17j4k11
2279h9J38j45K38NM9k7j81J36O2l34P2Nj8j27L59j22K2q7k46M34l73L93r8k91
$$ plain form
2121 111 91 -16 218 56 182 15 -344 189 -154 -91 100 -85 113 26 1 119 -29 139 -185 -42 114
2142 114 -140 237 -96 -288 13 65 35 -26 -15 -107 -165 -82 45 173 7 33 61 -117 -18 193 -86 -213 37
2165 37 25 123 187 -183 -105 -82 -364 25 159 -14 -465 -37 138 -204 217 -257 134 146 -18 12 20 -330 79
2188 79 158 -173 -102 -42 213 32 -125 31 -279 -72 -22 -49 -197 -95 21 56 149 -138 -15 -88 58 7 -115
2211 -115 80 139 85 316 -264 40 65 -196 -82 346 -102 -148 180 12 278 -22 -211 -19 31 254 -143 -101
2233 -101 -19 150 75 -81 -130 281 -185 -169 -72 22 -172 -410 -124 98 -274 -241 -37 257 -371 268 -120 62
2255 62 103 112 -163 -222 219 93 106 145 -93 -8 68 -245 -120 -18 214 -123 15 75 -62 -38 253 136 122 -89
2279 -89 49 -96 142 147 196 169 -12 124 186 -148 -76 -71 -89 -216 143 21 43 -44 -290 144 -229 164 66 -225
2303b25J48m3J58k18q5L10k40M25N8m20O8J24o1j80j01L03k9Lp2P2J16k09J48
2326E0j81J41r6K55m3k12p0j6J02J60L24m21L19o1l09j34P6K76J6r2q4K6j97J23
2350d8J29No5o8M4K52k73L21l05M3M1pk59q5M76j82j68J33P7j47O3K24j95j42
2374a36K8O1j00K9J78J22k80RoP9j22L28m36K93j4p6K23k51J15k55L19j20K4m9
2398c7j02L13k11M2k13M21m20J16J65l26J48L87j87j00j17l3oj8j52N35j77j85
2420a57P8k25L19j55J30j88L63j76j46k2K40l2q9R0n9J42N5J34m83K37L5N1J15
2443B57j16l6j97Q9R7k65M10m69K26m1J7k7j3L8J55j07K3Qj3O3k94K49r2j64L79
2468A77J35l92q7M37k72J04j41k23K70M3J12n24K78Q5M54l68k87K03j48J63l5
$$ plain form
2303 -225 -77 -120 38 -180 -265 45 -195 230 288 -132 -64 60 -1 -181 -282 21 -8 -5 -77 -5 111 -98 50
2326 50 -131 10 -86 169 126 -86 -156 -172 -70 90 414 -7 312 251 -58 -192 -116 160 176 84 0 26 -171 -48
2350 -48 81 86 21 -47 -3 249 -24 297 -8 35 76 69 -190 -275 201 19 -149 -16 61 -86 -23 201 6 -136
2374 -136 -108 -47 -147 -118 60 182 -98 -89 -95 -16 -138 190 -246 47 33 -43 180 -71 44 -211 108 -12 12 -37
2398 -37 -139 174 -37 5 -208 213 -207 -91 74 -252 -104 283 96 -4 -121 -154 -160 -178 -330 205 28 -157
2420 -157 -79 -304 15 -140 -10 -198 165 -11 -157 -179 61 29 -60 30 -29 113 168 302 -181 56 91 142 257
2443 257 141 105 -92 -3 94 -171 239 -230 -4 -45 -28 -55 -68 -30 125 18 41 49 36 99 -195 54 -38 -202 177
2468 177 312 -80 -167 270 -2 102 -39 -262 8 51 163 -361 -83 2 456 88 -199 4 -144 19 -16
2489a6M0r1nN4K16l43J54l9q4J47l32K79j28Q7j4K9L9Q3J5j36o8K99l87K58J02
2514A59q1Q0r4J6P8k49RQJ26K5j49Q6J95k17Q0j17j74M43j7j99j16J93j47P4J89
2539B01q5j90L05m08mP6L45l9k86J64P4j20K7l24K56Or6ooL9M1j84J2J74l1L40
2565B81m34K19J6qkm1l6J1j86M04k74r4J15l8lj57M22q2j34m3J18j30j40J75J15
2590G4k2k57Q2J15O1K19k85R7k9J1J09l62L48j03j79J23J92k25J99k06J26l56
2612b68N11m68K53P1j58kK4oK73j53n7L84m08j16K1O9O9J06j4J70k58K90l6o13
2636c16K93J5j4N48j076M80K19k8N5J4j00J05l55K58J67k58j99P5K05k8J33j15
2658G8K1j37J37j13J61j06q5J54l76L39k24l6L02k08L9R6L1j10O1j67R5K46k17
$$ plain form
2489 -16 24 -67 -72 -18 198 -145 9 -30 -114 33 -299 -20 -148 -61 -75 -46 -7 76 91 -45 -113 186 -201 57 159
2514 159 78 158 64 80 158 -91 -82 -74 52 77 -72 14 209 -8 72 -45 -219 224 207 8 -108 85 -62 12 201
2539 201 116 -74 231 -177 -181 -105 240 201 -85 79 153 33 60 -264 -8 -2 -98 -104 -110 -71 -30 -214 -202 -28 -59 281
2565 281 -153 66 82 74 72 31 -5 6 -180 224 -50 -144 -29 -67 -70 -227 195 113 -21 -64 54 -76 -216 -41 74
2590 74 52 -205 -123 -8 53 272 -13 84 55 66 175 -187 161 58 -121 2 194 -31 168 -38 88 -268
2612 -268 243 -225 28 99 -59 -61 -37 -43 230 77 20 404 -4 -120 -99 -30 39 145 131 301 43 333 297 -316
2636 -316 -23 -8 -22 526 -550 -70 149 121 176 190 90 195 -160 98 265 7 -192 -117 88 60 193 78
2658 78 99 -38 99 -14 147 41 -44 110 -266 73 -151 -187 115 -93 -54 42 73 -37 24 -143 -48 198 -19
2681a9L3l32jK84P3j05j91L96k19J86j30m16L58p4K71k84K27K00l28K27J17k63
2703A0L8l8n3J68l20JQ4L01k53j71N6J32K45o0k70J98k79M5L66o3J63l34P9L2
2727G7j08j80L14j83K22n4j87k1nL3j06k5J54J36J92L6q93O31J97j46k25J84M1
2750H4l2L27j85j03j47M02m89J14M5m6l93L64j5N8m2J93j56N6J02j64J29q2k5
2773eJ11J47l18J30j67j22L43j44j09L48J13n79Q9J16M0j14J05K47Lk24j20J71
2795F1j46q6J50R1m4P5q4K50m00L56k03m7j18J9J79m24M12r6j38K25LJO4l50M58
2820B08k21N3j44j2j55M90j55l8q2Q5Nm8ML43m68J15M9j58lL6R1P8j6MJ34k68
2846g3Q9Q4K1l2l21q8J25o6J08N2K4J59K08l23j33L52N6j89j76k7n9J41J65k28
$$ plain form
2681 -19 14 -318 -319 -35 38 -67 -258 138 -81 105 -25 -441 -83 -157 114 -170 57 257 -71 156 273 10
2703 10 48 10 -43 125 -195 -194 -110 191 -62 -233 -177 -45 200 140 -130 68 -211 -166 200 137 300 -34 45 77
2727 77 -31 -211 103 -80 142 88 -99 -120 -125 -92 -198 -223 -69 67 259 295 -598 33 230 84 -141 43 84
2750 84 52 379 194 91 -56 346 -143 -29 16 -30 -423 -59 -74 -16 -58 135 -21 35 137 -27 102 20 -5
2773 -5 106 253 -65 65 -102 -224 119 -25 -134 214 327 -252 -163 -47 -7 -121 -16 231 234 10 -110 61
2795 61 -85 -171 -21 70 26 101 17 267 -133 223 20 -27 -145 -126 53 -371 41 -55 -193 32 35 36 100 -250 208
2820 208 -13 40 -104 -116 -271 219 64 26 -56 29 34 -14 -10 333 -135 -20 29 -129 -132 -96 -5 73 57 61 195 -73
2846 -73 16 100 121 89 -232 -320 -195 -261 -153 -101 -77 82 290 -33 -166 186 242 53 -123 -150 -209 -68 97 -131
2870a31K22q1kqj10O3p0J81l9n0q2J57L7q9j7n7O5M8j59K1J62l30J71K93j09k3
2896F3p4J43j45p7k8M34l00J06k0l28J01K92k86J20M10m75K16j80m2k2J17m6J19
2919I8k69K8L94l69P8O2j05m4K07Q6k13K49j23m1R0j40J23k83J68m5K54k37j35
2942a67K07p5Q0O3j70J07k58K42p6J9ok72K85J18k53J45%j33J46J61p1k92O9J64
2966C3Q0k8k64J91J76k01n6J75j31P7k17J84K64k19q0J15j23J4M2j02k58K01M9
2989g8L89j85o3J50m84K23K18m09K84jk78M20l34J10J06J62j93J55k2k94K18k80
3011a86K57m8Q6j38k41M12j5k75K82k67k1p4K99J36j4j81k30L2M55rl50J23j00
3034f7J10N3m03L48j55N4j63P4K52K75n31J65J1mj66L52k00N0L6J07K72o08kL5
$$ plain form
2870 -131 91 10 8 0 -110 -47 -117 64 25 -25 -107 50 87 -2 -19 -76 -11 37 -122 -101 61 -269 -98 195 86 63
2896 63 -11 132 -13 -90 -118 316 16 122 102 -226 -125 167 -119 1 411 -64 152 -28 -70 -92 25 -21 98
2919 98 -171 -143 251 -118 -40 22 -83 -127 80 166 -47 202 79 38 128 -12 111 -172 -4 -49 205 -32 -167
2942 -167 40 -35 45 108 -62 45 -213 29 -47 -28 -34 -306 -21 97 -156 -11 -11 -144 2 163 92 -200 -131 33
2966 33 113 85 -179 12 188 -13 -69 106 -25 52 -165 19 283 64 -16 99 -24 -10 32 -70 -328 -127 -78
2989 -78 311 126 63 213 -271 -48 170 -239 45 44 -234 186 -148 -38 68 230 37 192 170 -124 94 -186
3011 -186 71 23 109 -29 -270 142 127 -148 134 -133 -154 -228 71 207 193 12 -218 -186 269 260 -90 33 -67
3034 -67 43 96 -307 41 -114 -60 -223 -149 103 378 -153 12 23 19 -147 205 5 55 91 198 470 -138 -140 -105
3058a05J84l15M24m1j17j14NJ16qn8j53R8J62L6r2M9J5P2J0N0o6L5l05PJ68k28
3084a71J9N10m40L33j02k54K31j84K73j86O8n2j79K28o5k55L02O9r3Q4Ok95K63
3107A10k69J08j67P3J37K6r0J61k04K71k16J39L7n5M1k4j10q2J65j13M61m31K3
3130iJ8m9j16J23O9QJ70k34k7M6j5J80J18j27ll05K27J31j20o0j9k5M4J39J04
3155B68k53L9R8l97J58L37k12Jk95J08M29j29k47K56m43K92k82M06j57q3m7K67
3177A14k69L07r4j66l1J54P3k74L09l49L04j69n3ML61m39K76k47L7R3j6j70K65
3200B0Mk30K21K9K0k74R2K8K15j26K91l73J07k82K96K88n53K26K8K40k75j37k4
3223a69P1J25n9J70lm6k0j04k3K83k2n0k67m2J28J27k45J72p8L3m4K98o2l8k25
$$ plain form
3058 -105 79 -236 188 147 30 -84 -79 37 29 -29 -182 -84 78 114 22 71 86 158 168 218 152 187 -118 -111 57 -171
3084 -171 -152 358 -82 251 149 -105 126 -58 215 29 97 45 -134 94 29 -226 76 145 52 136 142 -153 110
3107 110 -159 -51 -218 -145 -8 18 -72 89 -115 156 -60 79 116 61 102 78 -32 -114 51 -62 399 -32 -9
3130 -9 9 -40 -156 -33 36 44 214 -20 -47 -1 -16 164 282 155 152 -153 74 205 85 25 6 -19 25 164 268
3155 268 15 54 152 -245 -87 250 38 39 -256 -148 281 152 -95 161 -282 10 -272 134 -23 -106 -153 114
3177 114 -155 152 58 -108 -139 15 88 -186 123 -226 78 -91 -144 -140 221 -218 58 -189 -152 -59 -75 -245 20
3200 20 24 -206 15 44 64 -210 -118 -90 125 -1 290 -83 24 -258 38 326 -227 -1 27 267 -8 -145 -169
3223 -169 -98 27 -32 138 135 89 69 -35 -58 225 203 153 -114 -156 -28 99 -146 26 -52 -19 -63 235 173 135 -90
3248i0K22n2k3j37N5K39l35K59m9P2j80m0lJ19O7o0q0J03r7k6r2L29j08n6R5k83
3274a51J30O2O9l51K05K86k66k2n3P2J04j43L8J21j72k3m6K90k8j58P8L11k05
3297A48j32K16J78l59p2J20L0k79K36p0L11j69j34q1P8o7j26rK73k74N66o06L21
3320I9l15K70j27l2L35j75R7m2r0n9J39k26N02k58Ko5P8J26m79L25L5k76K20o8
3344A6l45K09K94J44m81J67J59j07J17l2J20r6n8p2j61K08j50j41K26K12l21K64
3366A72m05K33j23Q7j05J18Q6k24J46J49L9j94L4p2j5oJ64p7K2J10k83K38j52
3389e8L3L14j16k80K67k98J81M4k37L04l52J67N3r0jJ31j60K52o1O1j93K74l34
3412i9j25K62j53K6Qq8N88n83J61J90j1J91k66lRmj57m2J55p2L3j00K74n2q5n06
$$ plain form
3248 -90 132 80 57 -80 -25 214 -121 138 89 161 -19 -59 -62 57 124 64 -16 87 -10 -36 -128 201 93 37 132 -151
3274 -151 -21 41 110 -241 -36 250 -16 -38 -91 -19 85 -58 -20 101 -71 -94 -140 150 122 -36 42 353 148
3297 148 16 232 410 51 -21 99 129 -150 86 16 327 158 24 -57 21 -46 -172 -181 92 -182 384 -222 99
3320 99 -216 54 -73 -105 230 55 152 110 20 -39 100 -126 376 118 120 55 133 259 -220 105 140 -136 84 16
3344 16 -329 -120 174 318 -163 4 163 56 173 141 261 165 107 35 -126 82 -68 -209 17 229 -92 172
3366 172 -233 0 -123 -36 -141 -23 63 -161 -15 134 173 -21 13 -59 -74 -80 84 7 29 139 -144 94 -58
3389 -58 -25 289 173 -107 160 -138 43 87 -150 154 -198 -31 22 -68 -69 62 -98 154 93 154 -39 235 -99
3412 -99 -224 38 -115 -89 -81 -169 419 -164 -3 187 176 367 101 98 107 103 -54 -96 59 -13 20 -80 194 142 57 -449
3438d49L83O8J45l03O5J17p8r3N9K77k5n2j24r0P4m5J23n2J47k66J07K10N8j68
3462H8J61k14O0j24j57m9K46J32j10J8K7n0j03l8L0J14R2j66k60M52R4j8l04M4
3486c5J17L25m10J72J51m46J55K5j17n5R0J73j28L59n32P2L7J96j80o1K0j16J46
3509d2J12m1l36P8j55K89O2K24q0O9n08L82j10o0L07j68O5l57K16N6k53R2P1K54
3533A67j61J8K00k45j03J76L4k07K56k53K21j01j99K20m4K36p9o5k07K45k45o
3555a42L7K60j67q6K03r4k6q2J31l36N12j70M4l2q1J01j28M7J57j02r3J61l10
3578a96Q3j8r4L28j24L3L29n9m37M98k39k82K26L28n20l7L4K48l16J82j70K08
3600Ek26J4K38j78K37l70N34k38k33p5K17K67L6o2k94Qn8p7L00n5o1j89N67m36
$$ plain form
3438 -449 -66 2 147 -156 -91 26 -52 -145 -86 191 166 114 -10 -100 -26 -71 52 0 147 -119 -12 198 256 88
3462 88 249 35 95 -29 -186 -235 11 143 33 51 78 28 -75 -113 -83 31 123 -43 -303 149 243 225 -79 -35
3486 -35 82 407 -3 169 320 -126 29 54 -63 -118 -28 145 17 376 -156 -84 -47 149 -31 -92 -72 -188 -42
3509 -42 70 29 -307 -229 -384 -95 -33 191 111 180 -328 54 -56 -116 191 23 88 -269 -53 3 -250 -158 -87 167
3533 167 6 24 224 -21 -124 52 86 -121 135 -118 103 2 -197 23 -21 215 136 71 -136 109 -136 -142
3555 -142 -105 155 -12 -98 105 11 -15 -97 34 -302 210 40 84 52 -29 72 -56 -9 148 46 -47 114 -196
3578 -196 -113 -131 -225 103 -21 12 341 282 -155 343 104 -178 48 376 -144 -181 -147 101 -215 -33 -203 5
3600 5 -221 -207 31 -147 90 -280 254 16 -217 -292 -75 192 228 166 -128 -120 -178 -255 45 -10 -71 -260 307 -129
3624a29J93J08k16K49j70p0J80k33K52j34L4j18k76M05K53l51o3K08j38k3J0j9
3646d8j52K47J8l5oP9k06j52K17J70k20J78k66M1K29j52k7J87o7j04K0j18P7J81
3670I1O0j79kNN8L8j2n8R2j58J06j02p0K84j50Rk08K98j60J76j23M5J31j71K59
3695B59m30lK02M9j48K65j09k16J07J30O0J16m7p1k39q5K5K49j88N4J53k37K84
3718A80L1k28j21L36l57J80K62n2k66qR8o8K00k96K02m2oj21M9J36J6Mj77R1p3
3743c0K2k1L84l44J72j66l75R4L85q1J31N3l51K59k41lL25l00j53J1L99m07M01
3766A64J8p6J2J1o2M8o1j31J89j57k17J09N26l78J33j37RJ02l65L90j53p0k18
3789c14K43K88j95o3K71m42L99j30j30M8J21k83J22K37n74L87J55j29K5K14l27
$$ plain form
3624 -129 64 172 -44 205 35 -35 145 -88 164 30 64 -54 -330 75 328 -23 -86 122 -16 -39 -29 -48
3646 -48 -200 47 65 30 24 103 -103 -255 -38 132 -88 90 -176 -135 94 -58 -85 102 35 -69 -49 -167 -90 91
3670 91 151 -28 -30 -25 33 71 59 1 93 -65 41 -61 -131 153 3 12 -196 102 -58 118 -5 40 171 0 259
3695 259 -171 -174 28 77 -71 194 85 -131 -24 106 166 282 235 164 -75 -160 -135 114 -74 -20 133 -104 180
3718 180 211 -17 -138 198 -159 21 283 231 -35 -43 55 -13 187 -109 93 51 45 -76 -27 109 125 129 -48 43 -30
3743 -30 -8 -29 355 11 183 17 -358 -264 121 40 171 224 -127 132 -109 -112 213 -87 -240 -229 170 -237 164
3766 164 182 106 118 129 67 115 54 -77 112 -45 -262 -153 373 -5 128 -9 0 102 -263 127 -26 -96 -314
3789 -314 -71 217 22 -41 230 -212 187 57 -73 -25 96 -187 -65 172 -402 -15 140 11 36 250 -77
3810g7K7k07L05m9M4j12K40l38K73Q4j75Q7j08j74K40J73j14j03J88m09K19j45
3832a31J95J95j60q0J37j85j28K81k03K10l2j18J94k52M5mJ16Q2j99J15r1l4J48
3855A01n1k39K06K07P4k43k9k25K37J2K30n00K85k82O2L45j55K5r1M0j81K18l29
3878b83K90n1L2q7j20K3K21j38J09r4k14K05J30n9N6Mn4m7K07r1Q7k77K56j09
3902dQ5m8l1P8j7o8o4R6J02k21M97n32J69o8j72N02j95Q8k41P8j28J69J80k05
3926E0q2O7p8M3J96j09J09o1k00j13L43k76J46l1M33p28J33M8oJ68L7j87J84k46
3950a60l4L79m88J95J07j41o0P9K77j76J18J15l16J70j20J60m3m0J46j93k14K79
3972D0j1J44j05j1L58m76K3RK88m32K6J02M8p4k36L12J5J35l6k15J2J78l80L24
$$ plain form
3810 -77 -50 -257 48 -1 43 -69 171 -167 106 190 15 102 -6 -180 60 233 119 16 204 -205 14 -131
3832 -131 64 259 99 19 156 -29 -157 124 -79 131 99 -19 175 -77 -32 -36 80 162 -37 78 -13 -47 101
3855 101 50 -189 17 224 298 55 26 -199 38 50 280 -220 65 -217 -155 190 35 60 -31 9 -172 46 -283
3878 -283 7 -44 -12 -99 -219 -196 25 -113 -4 -98 -312 -107 23 -36 20 24 -30 -77 130 39 126 -151 105 -4
3902 -4 81 33 2 80 63 -5 -69 27 129 -92 405 -127 42 -26 -198 304 109 197 -44 34 -94 75 255 50
3926 50 -32 35 -43 0 196 87 196 135 -65 -178 165 -111 35 4 437 -291 -158 -110 -116 52 89 -98 86 -160
3950 -160 -194 185 -303 -108 -1 -142 -202 -123 154 -22 96 211 -105 65 -55 105 62 22 168 -25 -239 40
3972 40 29 173 68 57 415 -61 -38 -29 259 -173 -147 -45 3 -71 -307 5 20 155 119 -96 -84 94 -286 38
3996C8J52j18j08J95k87j58L27J30m45K56k8J00Rj56K33l1j80j9j9N58l38j27
4018a6Q5m9J54k36j6R5j45M01j31l66L20j6j14m28M52j45R3L35k13j09J88k56
4040a17j8K69ql6o6J78l83M64j56q0q1k26J15K76L40n94J02N9l9R7j9O5j85Rj55
4065a89J20K50j91j59K36J14q1o6k2k34J39L12j29o3j41M27k54j33K35j67J7l6
4087a5j70J07J09J27J40l21M3m46M36M2J07m04K37K1Q9K0k49J29J50m5k9J88j57
4110A09j32m4j66K46j5K20k65m0k0k29N25j73P7k79K69k37J01j4J9J46j15j02
4132a19J54k55M59k58R9j01k9N2k29L78k12J33k9j35N3K86j15k82J76M3j18O0
4154A1k69L05J13nl42J85j4J2K3j61Q5J87n0L5k26J35N2k56K76J66k12k46K88
$$ plain form
3996 38 190 72 -36 159 -128 -286 41 171 -274 -18 -46 54 63 -93 140 109 -71 -90 -109 449 111 -16
4018 -16 69 20 174 -62 -78 17 -128 273 142 -224 96 80 -34 -462 -10 -155 -62 273 60 -49 139 -117
4040 -117 -135 134 126 90 24 202 -181 283 127 47 -34 -260 -145 131 471 -123 -21 38 -1 96 77 142 -43 -34 -189
4065 -189 -69 181 -10 -169 67 181 100 34 12 -222 -83 229 100 37 -104 323 69 -64 171 4 21 -15
4087 -15 -185 -78 31 158 298 -23 20 -426 10 52 159 -245 -8 13 102 122 -127 2 152 107 78 266 109
4110 109 -23 -67 -233 13 -2 218 -47 -87 -107 -336 189 16 93 -186 83 -154 -53 -67 -48 98 -17 -119
4132 -119 35 -220 239 -19 80 -21 -50 2 -227 151 -61 72 43 -92 -39 247 132 -150 26 69 -49 11
4154 11 -258 47 160 155 -187 -2 -16 -4 19 -142 -57 130 80 115 -111 24 76 -180 96 262 50 -196 92
4177I2j76n9M7L5J44k17J36P8r5q6q0K85l5K29m28K62j77j3n7J29L3K2m8p4K12
4202A59N5m02K14j85J60j5K0j59K76K7j18k6j3K06l26L17j57J13n6K66j24l23
4224i1K70k04J06j62j98N26j42j08j1R5j85K14Lj09o0K2nO4j52K05j4o9j42q9
4248b36O57m61j94K03p1MJ41o3n3k2l5J0m1J81L0o8l67K97ln4%J17j72J53J10
4273F3n1K64j55j82R4Jk30M05q3k81L4m2L6J50k24L86k26K27k4k35l8J58k78l4
$$ plain form
4177 92 -84 -143 -96 -61 83 -134 2 80 -15 -101 -181 104 69 298 -130 132 -45 -58 -115 14 47 69 21 -53 159
4202 159 214 -188 26 -159 1 -14 6 -153 123 150 32 6 -7 199 -127 190 33 146 90 356 232 -91
4224 -91 179 -25 81 -81 -279 247 105 -3 -14 81 -104 110 113 4 -56 -34 -39 25 -127 78 64 -5 -147 -236
4248 -236 421 -40 -234 -31 -102 -98 43 -20 -73 -95 -130 -120 -161 20 50 -18 -385 -88 -91 -145 -145 -28 -200 -47 63
4273 63 12 276 121 -61 33 34 -196 209 126 -155 -121 -163 -127 23 -201 185 -41 186 162 -73 -111 47 -231 -265
$$ [...]
8191a05
##END NTUPLES=NMR FID
##END=
