##TITLE=1H_DE-80H3
 200.13MHz, D2O,
 8 sc
 
 13.2.2025
##JCAMPDX= 6.0         $$ Bruker NMR JCAMP-DX V2.0
##DATA TYPE= NMR FID
##DATA CLASS= NTUPLES
##ORIGIN= UXNMR, Bruker Analytische Messtechnik GmbH
##OWNER= pz
$$ XWIN-NMR		Version 3.5
$$ Thu Feb 13 14:44:44 2025 Russian Standard Time (UT+4h)  she@DPX200
##.OBSERVE FREQUENCY= 200.1313
##.OBSERVE NUCLEUS= ^1H
##.DELAY= (6, 6)
##.ACQUISITION MODE= SIMULTANEOUS
##.ACQUISITION SCHEME= undefined
##.AVERAGES= 8
##.DIGITISER RES= 18
##SPECTROMETER/DATA SYSTEM= spect
##.PULSE SEQUENCE= zg30
##.SOLVENT NAME= D2O
##.SHIFT REFERENCE= (INTERNAL, D2O, 0, 14.3821)
##AUDIT TRAIL= $$ (NUMBER, WHEN, WHO, WHERE, WHAT)
$$ ##TITLE= Audit trail, XWIN-NMR		Version 3.5
$$ ##JCAMPDX= 5.01
$$ ##ORIGIN= Bruker BioSpin GmbH
$$ ##OWNER= she
$$ F:/spectra/data/she/nmr/H-C/1/audita.txt
$$ ##AUDIT TRAIL=  $$ (NUMBER, WHEN, WHO, WHERE, WHAT)
(   1,<2025-02-13 14:43:32.57 +0400>,<she>,<DPX200>,
      <created by zg, POWCHK disabled, PULCHK disabled
       configuration hash MD5:
       00 E9 B6 7A A2 85 ED C7 34 08 36 98 17 FE 4E 26
       data hash MD5: 16K
       3A A2 88 5C 9F E5 CB E8 2D BC CD 3D 19 DC 6A 9A>)
$$ ##END=
$$ 
$$ hash MD5
$$ 4E D6 FD 95 C1 C6 5A AA 1A A5 AF 0C 8F 6C B8 B3
##$RELAX= 
##$RELAX= 
##$RELAX= 
##$RELAX= 
##$RELAX= 
##$RELAX= 
$$ Bruker specific parameters
$$ --------------------------
##$DU= <F:/spectra>
##$EXPNO= 1
##$NAME= <H-C>
##$PROCNO= 1
##$TYPE= <nmr>
##$USER= <she>
##$AMP= (0..31)
100 100 100 100 100 100 100 100 100 100 100 100 100 100 100 100 100 100 
100 100 100 100 100 100 100 100 100 100 100 100 100 100 
##$AQSEQ= 0
##$AQ_mod= 1
##$AUNM= <au_zg>
##$AUTOPOS= <>
##$BF1= 200.13
##$BF2= 200.13
##$BF3= 200.13
##$BF4= 200.13
##$BF5= 200.13
##$BF6= 200.13
##$BF7= 200.13
##$BF8= 200.13
##$BYTORDA= 1
##$CFDGTYP= 0
##$CFRGTYP= 5
##$CHEMSTR= <none>
##$CNST= (0..31)
1 1 145 1 1 1 1 1 1 1 1 1 1 1 1 1 1 1 1 1 1 1 1 1 1 1 1 1 1 1 1 1 
##$CPDPRG= <>
##$CPDPRG1= <>
##$CPDPRG2= <>
##$CPDPRG3= <>
##$CPDPRG4= <mlev>
##$CPDPRG5= <mlev>
##$CPDPRG6= <mlev>
##$CPDPRG7= <mlev>
##$CPDPRG8= <mlev>
##$CPDPRGB= <>
##$CPDPRGT= <>
##$D= (0..31)
0 0.7 0 0 0 0 0 0 0 0 0 0.03 0 0 0 0 0 0 0 0 0 0 0 0 0 0 0 0 0 0 0 0 
##$DATE= 1739443411
##$DBL= (0..7)
120 120 120 120 120 120 120 120 
##$DBP= (0..7)
150 150 150 150 150 150 150 150 
##$DBP07= 0
##$DBPNAM0= <>
##$DBPNAM1= <>
##$DBPNAM2= <>
##$DBPNAM3= <>
##$DBPNAM4= <>
##$DBPNAM5= <>
##$DBPNAM6= <>
##$DBPNAM7= <>
##$DBPOAL= (0..7)
0.5 0.5 0.5 0.5 0.5 0.5 0.5 0.5 
##$DBPOFFS= (0..7)
0 0 0 0 0 0 0 0 
##$DE= 6
##$DECBNUC= <off>
##$DECIM= 32
##$DECNUC= <off>
##$DECSTAT= 4
##$DIGMOD= 1
##$DIGTYP= 9
##$DL= (0..7)
0 120 120 120 120 120 120 120 
##$DP= (0..7)
150 150 150 150 150 150 150 150 
##$DP07= 0
##$DPNAME0= <>
##$DPNAME1= <>
##$DPNAME2= <>
##$DPNAME3= <>
##$DPNAME4= <>
##$DPNAME5= <>
##$DPNAME6= <>
##$DPNAME7= <>
##$DPOAL= (0..7)
0.5 0.5 0.5 0.5 0.5 0.5 0.5 0.5 
##$DPOFFS= (0..7)
0 0 0 0 0 0 0 0 
##$DQDMODE= 0
##$DR= 18
##$DS= 0
##$DSLIST= <SSSSSSSSSSSSSSS>
##$DSPFIRM= 0
$$ [...]
##$SUBNAM0= <"">
##$SUBNAM1= <"">
##$SUBNAM2= <"">
##$SUBNAM3= <"">
##$SUBNAM4= <"">
##$SUBNAM5= <"">
##$SUBNAM6= <"">
##$SUBNAM7= <"">
##$SUBNAM8= <"">
##$SUBNAM9= <"">
##$SW= 18.0517328524113
##$SWIBOX= (0..15)
0 0 2 0 0 0 0 0 0 0 0 0 0 0 0 0 
##$SW_h= 3612.71676300578
##$TD= 16384
##$TD0= 1
##$TE= 0
##$TE2= 300
##$TE3= 300
##$TEG= 300
##$TL= (0..7)
0 120 120 120 120 120 120 120 
##$TP= (0..7)
150 150 150 150 150 150 150 150 
##$TP07= 0
##$TPNAME0= <>
##$TPNAME1= <>
##$TPNAME2= <>
##$TPNAME3= <>
##$TPNAME4= <>
##$TPNAME5= <>
##$TPNAME6= <>
##$TPNAME7= <>
##$TPOAL= (0..7)
0.5 0.5 0.5 0.5 0.5 0.5 0.5 0.5 
##$TPOFFS= (0..7)
0 0 0 0 0 0 0 0 
##$TUNHIN= 0
##$TUNHOUT= 0
##$TUNXOUT= 0
##$USERA1= <user>
##$USERA2= <user>
##$USERA3= <user>
##$USERA4= <user>
##$USERA5= <user>
##$V9= 5
##$VALIST= <valist>
##$VCLIST= <CCCCCCCCCCCCCCC>
##$VD= 0
##$VDLIST= <DDDDDDDDDDDDDDD>
##$VPLIST= <PPPPPPPPPPPPPPP>
##$VTLIST= <TTTTTTTTTTTTTTT>
##$WBST= 1024
##$WBSW= 4
##$XGAIN= (0..3)
0 0 0 0 
##$XL= 0
##$YL= 0
##$YMAX_a= 706889
##$YMIN_a= -763891
##$ZGOPTNS= <>
##$ZL1= 120
##$ZL2= 120
##$ZL3= 120
##$ZL4= 120
##$ABSF1= 10
##$ABSF2= 0
##$ABSG= 5
##$ABSL= 3
##$ALPHA= 0
##$AQORDER= 0
##$ASSFAC= 0
##$ASSFACI= 0
##$ASSFACX= 0
##$ASSWID= 0
##$AUNMP= <proc_1d>
##$AZFE= 0.1
##$AZFW= 0.1
##$BCFW= 1
##$BC_mod= 2
##$BYTORDP= 1
##$COROFFS= 0
##$CY= -3
##$DATMOD= 1
##$DC= 2
##$DFILT= <>
##$DTYPP= 0
##$F1P= 0
##$F2P= 0
##$FCOR= 0.5
##$FTSIZE= 0
##$FT_mod= 4
##$GAMMA= 1
##$GB= 0.15
##$INTBC= 1
##$INTSCL= 1
##$ISEN= 128
##$LB= 0.25
##$LEV0= 0
##$LPBIN= 0
##$MAXI= 10000
##$MC2= 0
##$MEAN= 0
##$ME_mod= 0
##$MI= 1.114404
##$NCOEF= 0
##$NC_proc= 0
##$NLEV= 6
##$NOISF1= 3.799351
##$NOISF2= 2.8
##$NSP= 1
##$NTH_PI= 0
##$NZP= 0
##$OFFSET= 14.38212
##$PC= 1
##$PHC0= -469.5894
##$PHC1= 9.392208
##$PH_mod= 1
##$PKNL= yes
##$PPARMOD= 0
##$PSCAL= 0
##$PSIGN= 0
##$REVERSE= no
##$SF= 200.129724274929
##$SI= 16384
##$SIGF1= 3
##$SIGF2= 2
##$SINO= 400
##$SIOLD= 16384
##$SREGLST= <1H.CDCl3>
##$SSB= 0
##$STSI= 0
##$STSR= 0
##$SW_p= 3205.1282051282
##$SYMM= 0
##$S_DEV= 0
##$TDeff= 0
##$TDoff= 0
##$TI= <>
##$TILT= no
##$TM1= 0
##$TM2= 0
##$TOPLEV= 0
##$USERP1= <user>
##$USERP2= <user>
##$USERP3= <user>
##$USERP4= <user>
##$USERP5= <user>
##$WDW= 1
##$XDIM= 8192
##$YMAX_p= 0
##$YMIN_p= 0
$$ End of Bruker specific parameters
$$ ---------------------------------
##NTUPLES= NMR FID
##VAR_NAME=  TIME,          FID/REAL,        FID/IMAG
##SYMBOL=    X,             R,               I
##VAR_TYPE=  INDEPENDENT,   DEPENDENT,       DEPENDENT
##VAR_FORM=  AFFN,          ASDF,            ASDF
##VAR_DIM=   8192,          8192,            8192
##UNITS=     SECONDS,       ARBITRARY UNITS, ARBITRARY UNITS
##FACTOR=    0.0002768,     1,               1
##FIRST=     0,             0,               0
##LAST=      2.2672688,     0,               0
##MIN=       0,             -763891,         0
##MAX=       2.2672688,     706889,          0
$$ Real data points
##PAGE= N=1
##DATA TABLE= (X++(R..R)), XYDATA
$$ [...]
1876h1Q6O7j46J61oj12o6J37k93L47j21K9j95J63J5J7J35l7q2L6j4J12m9ll58
1901b58K85R8K4O5k99j04P3JL44l45J75k58m3j1L09J24l32J87o3k6J55p0k53L86
1925A64j45N9o7K42j91N1k96k7J78p6K09k08K58j60p1j17M02j96j39jR4J02m7
1948A8k29m2K27r3K4L1M6N9m4K7L7k3r2N2J83qmj80K72k38k4J6l35M20p3O1j52
1975f4J21J62k27K4rj14L1P5P1N1j43J04L6P5k85K20j15j52K24j35J35j14J78
1998A49n3k58j4L00p4l06J93J97k26J37r4J06K6m81L09J72j79J95j71K78j05p3
2020B8m1j70J27J68j36O2k32L68j26j04K09m8j93j00P8J81P5%p3N1j76J85j05
2043B8j96K66j28o6J00Jj83j8J06k3Q4j34rK16K8n3oK02l96K43j67K08j83k00
$$ y = [-81, 5, 72, -74, 87, 81, -31, -97, 40, -253, 94, -27, 2, -193, -30, -15, 2, 137, 100, 18, 54, 40, 152, 103, 100, -258, 27, 125, 149, 214, -85, -189, -116, -115, 229, -116, 59, -199, -242, -253, 56, 180, -152, 35, -28, -54, 101, 31, -222, 164, 19, 78, 11, 253, 62, 113, -183, -210, -32, -108, 101, -107, 151, -9, -80, -197, 205, 9, -130, -131, -37, 65, 18, -211, -253, -26, -119, -95, -64, -18, 41, -3, 24, 61, 38, -54, -2, 181, 173, 169, -11, 261, 23, -1, 15, -320, 100, 27, 88, -64, 57, 219, -8, 16, 7, -107, -76, -1, 70, 121, -22, 82, 118, 193, -92, 128, 13, -139, 85, -50, 85, -29, 149, 96, -162, -176, 124, 50, -256, -63, 134, -92, 45, -49, 57, 83, -398, -89, 83, -96, 99, -72, 206, 101, 28, -13, -183, -56, 112, -24, 38, -194, 174, 48, -56, 153, 105, -88, -188, -110, 71, 146, 146, 73, 124, -52, 133, 28, -168, 98, -30, -96, 4, 5, -178, -196, -90, -113, -29, -163, -172, 44, 72, 19, 13, 215, -181, 62, -105, 103, -80, -280]
2067b80K10J0N2J11l5j46O4j4K05n10K44j1M9L1j69J96r0k7L17k77L43l02L8j97
2091a88l9J14m1K4R4p1J18nO3M3j37J09qp5K7k3J7p8L3k7l6J30o6q0K03l28J97
2118c0j11j35J98J86j87j84L07k05J78r7J97k07r8J91J07j8N6j60J20Q6p3r5J55
2141A81J04P0l05l3K2j14k11J40J72j40J1L2K09k10K64ok7K6j65Q9r5n6p8J80
2165F0j9L35n18L34l15QJ86k24J02N6p4L25m06J99k90J86J9R6k25J08M6k83N36
2188B42k22J28l76K77r5J59k12K65j09k5l08M80l40J13o9K51n2k22J24K02j45
2209F6k49k4K00j49L55p4j98k5K51Q6R2k46j4ql42M28k60K53k80J61J8J76k1j75
2233B1L39n59O7O1J48m15L30l9j6J88j83N5l01N45k65J19m07K15K76j76j13n6
$$ y = [-280, -70, -60, -8, 103, 68, -78, -14, -28, 177, -333, -89, -100, -51, -20, -189, 7, -83, -110, 207, -70, 273, -29, 9, -188, -227, -113, -154, -130, -36, -107, 11, 6, 69, 112, -25, 84, 76, 1, 28, 5, 22, -56, -23, -50, -86, 44, -22, -102, 101, -227, -30, -141, -276, -78, 108, -79, -263, 44, -161, 17, -80, 117, -90, -188, 3, 110, 92, 148, -12, 108, 194, 121, 26, 181, 285, 355, 50, 17, 39, -75, -286, -146, 26, -114, -103, -71, 138, -72, 192, 186, 159, 185, 20, 109, 14, -42, -120, 60, 41, 376, -142, 192, -123, -115, 71, -153, -51, 5, -69, 256, -150, 49, -241, -55, -36, 60, -165, -57, -11, -294, 242, 20, 148, -228, 49, -46, 113, -99, 166, 57, 32, -276, 204, -136, -23, -92, 159, 107, -115, 9, 211, 66, -183, -207, -7, -156, 199, 125, -73, -98, 153, 239, 331, 85, 71, 63, -279, 149, -111, 142, -138, 23, 41, 217, 196, 21, 360, -199, -132, -71, 77, -338, -8, -47, -63, 125, -58, -3, -304, 241, -24, 95, -312, -97, 179, 3, -110, -166]
2255a66J40Q5n4j87K57j25P7k62J51j5N2K0N2l01M31j15m25L19q2M2l7M9J39J51
2279A96j90j13n8J02p8J64j68L39O4l37O4J95k11m0M8n9P3J18o4p5J57M0k46J54
2303G5k7q7O9J45J73k60n4K05k73Q7p0j5j0K57j44k19M54l65j41K34j71K04l9
2326B8J07l38K85k98J24J44p3N7O1P1j20N1k06J22j11K1J07M6l01K63J5J5l70
2349c00K58n9J54k64M01k94k05L33o6k37N16k27R4J70j01Pl64K19k66N18k36K52
2371C03m34L36j9j47j78r5J08Nn4jQ2J35j13J39o6m6K21qj69q3L8K74l00J60j06
2396a8K50j27k28K79k63N6J82k12P5K4n8j46K31n0o4K87j77k94J49J69Q8J2NM5
2420B15m25K74J43j00Jq9r8RP3L1k07J26j19J51q0J97j22J95J23k46K0r1J81k05
$$ y = [-166, -26, 59, 5, -182, 75, -50, 27, -235, -84, -99, -47, -27, 25, -276, 155, 40, -385, -66, -148, -106, -143, -94, 45, 196, 6, -107, -165, -63, -141, 23, -145, 194, 258, -79, -15, 180, -31, -71, -23, -82, -9, 109, 45, -30, 127, 167, -79, 75, 48, -39, 30, 175, 348, 88, 34, 239, -34, 53, -17, -32, -42, 215, 71, -148, 306, -59, -200, 34, -137, 67, 28, 135, -203, 82, -216, -92, 52, -21, 36, 97, 168, 48, 99, -107, 15, -96, -75, 32, 78, -223, 40, 55, 70, -300, -42, -101, 53, -211, 190, -104, -309, 24, -42, -279, 237, 10, 104, 274, 173, 180, -184, 35, -231, 287, 51, 303, -131, 205, 186, 39, -139, -234, -126, -121, -175, -176, -94, 41, -72, 67, 1, -45, 176, 168, -1, -84, -46, 228, -72, 88, -18, 232, 105, -123, 156, -107, -51, 131, -81, -6, 18, -40, -186, 45, -5, -69, 218, 41, -253, -104, 65, 153, 165, 170, 215, -210, 64, 207, 107, 108, 19, -79, -70, 3, 34, -173, -47, -166, -15, -95, 102, -20, 175, 298, 52, 72, -19, 162, -43]
2444d3o5L57m32J17k3L58K2n40M86l42j06J41J48k08K46j23M6j43j72M16j01k42
2466b03M25j21j40j7K7kO4r5J57k6k57K11q4K07r7m0k34L66j68q6K87k64K09o9
2490E0p1m3j6l%J57j5k17J82j53K1N6L1K07k59J94j8l39K88p3j8k60J61K28j04
2515a4L16m31L26j72L5k0P7k3k9o0k61M04j60K31k19p9J7J46j18N8J86q0k99K44
2539G5J43l45J62q3k39M30n7n6J92j05k09J98n1k94L96k56N0r2J67j66J80j5K40
2562B65j25m5o5K43j50q2P9q9r8J86k26O9J40j26j59K98j73L0J33r4o9j76K65
2585C1n3M6J63j48O4m16P8K17j14K65q4j26J01m6QP4M1j85L9L11l18J05O8l02
2609a81K55Jp1n4J74mr7j76Q6j3K4L76k38k50J9R3K9P0j65K80k27J88Q2m19p7
$$ y = [-43, -108, 249, -183, -66, -89, 269, 291, -249, 237, -105, -211, -70, 78, -130, 116, -7, 39, -104, -276, 140, 39, -203, 222, 101, -39, -56, -29, -31, 33, -62, 95, 69, -188, 23, -61, 146, 49, 9, -225, 141, -27, -113, 174, -90, 119, 50, -21, -64, -80, -83, -83, 74, 59, -158, 24, -129, -108, -52, -21, 186, -73, 121, 103, -236, 52, -21, -39, -299, -138, 90, -14, 302, -129, 197, 25, 60, 40, 117, 94, 65, 5, -256, 148, -12, 219, 0, -79, -62, 84, -34, 24, 210, 130, -169, 75, 218, -127, 35, -48, -287, 143, 86, 30, 222, 117, -92, 106, 55, -239, 157, -99, -49, -141, 26, -140, 40, 25, 265, 140, 95, 30, 273, 123, 41, 120, 31, -67, 119, -107, -38, 102, -24, -183, 115, -58, -28, 105, 11, -58, -234, 31, -22, 24, 187, 39, 103, -313, -235, -18, -132, 133, 49, -77, 24, -22, -14, 60, 101, -84, -45, 266, -52, 53, 121, -181, 74, 75, 4, -50, 124, 120, 23, -153, -67, -80, -56, 320, 82, -168, -149, -56, -27, 43, -122, 158, -69, 119, 201, -218, -295]
2634b95K53%J46k16O1Q3mj28R4l0M4J38j01J75q9o6j12j83L02k12K46k58O1o4
2658a55l7J81m2J81k72J8J10K6N4O7l4n3J15j71l25O18m0k20j51m1L46j34N1j15
2682b3K9k03J45J9J37J5q9MJ38j11J40l66L25k31kj59J85L14j17j66j89L57k98
2705a46L3J07j42J96M14l68j17o3r5M25k87J57j68J7j0M5K14k26k0k6j60J60J57
2728I7j43P3J56j6j27k95M23O2l19J09J2R9L21m11J19j03m1Q7k24L16k90L57l92
2751a30j47J22M36l67J59o6k4L7r6m1M41k31j55k9K2K13J3m79K51k12L38j21N1
2774a5Q5l74L44q0L9r9K51n20L57K43j78P3O9k19L9J43j81k03J94K09j05p2O6
2797F6J66n58M83j58R9P8k77K26k29J05m5K66k41m5J36j54J96k68j9K29j38K56
$$ y = [-295, -42, -42, 104, -112, -51, 32, 28, -100, -6, -36, 8, 146, 45, 220, 131, 65, -47, -230, 72, -140, 106, -152, -91, -155, -192, -11, -53, 128, -144, -126, -16, 10, 64, 131, 97, 44, 159, -12, -337, 281, 241, 21, -130, -171, 175, 41, 92, -23, 6, -197, -52, -33, 104, 119, 30, 34, 172, 61, 201, -165, 160, -71, -73, -232, -47, 267, 150, -16, -205, 152, -146, -113, -6, -148, 48, 462, 94, -23, -86, -181, 244, -43, 114, -54, -37, -47, -2, 212, -14, -34, -60, -220, -60, 97, -46, 27, 183, 167, 40, -255, 168, 230, -89, 20, 32, 131, 452, 41, 160, 57, 16, 103, -121, 195, -95, 262, -130, -277, -155, 281, -86, 73, 7, -17, 20, -76, -117, 324, 93, -62, -91, -69, 144, 157, -322, -71, -283, 55, -66, -15, 70, -304, 40, -40, -1, -100, 151, -369, -12, 231, 53, 126, 195, -24, 15, 158, -23, -226, -32, 177, 72, 0, 66, 232, -326, 157, -1, 98, 176, -101, 125, -104, 1, -44, 222, -19, -64, 72, -82, 114, -154, -173, 56, -82, 174]
2819A74n7o3%R2j62J66l85K84J58k5k6J22j09j62l30J39L48j06M4J5m82R7L19
2842E1J02l17J07N8k35Q5K95r1K94m13J90j72j58L03r0k1J22k02J31J29j64P2
2864G6l21L72r3o1m2L66j15j32j79n1K22p6j06L52l20P8O4O2Q7n4j16K78l58p7
2888a44J00%n0N1J12j2k26M80k09r1n5J4k61K33J67k79J34P9K8J24p1k01R7k73
2912b53K72K20l3l78L71l87O1K71q4KK4p2j38L51k46K46o7j29J7k58J52j60K28
2935A0P8J37j26k49K9k18L88j46q4J33q3J1j09M1K69R7k54n3J57K46l46J33n9
2958Bk26L86L6m04J66K09p4j54J92k82J62R2l2j36j20J85N5k71L15l12J95j81
2980a97J52J31J2P8l88K14j38J78M4kj65Q0o8J72k62Q8J16J60j00oq1j47L57m78
$$ y = [174, 117, 54, 54, 146, -16, 150, -235, 49, 207, 182, 156, 278, 169, 7, -323, -184, 164, 58, 102, 117, -365, -268, 51, 153, -164, -57, 1, -234, -149, 146, 55, 349, -64, 126, -46, -204, 99, 9, -12, 110, -92, 39, 168, 4, 76, -245, 127, 34, -27, -69, 297, 182, 50, -129, -180, 42, -34, -140, 212, -108, -30, 34, 96, 183, 129, 13, 291, -67, -144, -44, -44, -94, -43, 69, 57, -169, 311, 102, 11, -44, -30, -291, -58, 109, -170, -36, 43, 71, 195, 124, -77, 20, -253, 19, 239, 206, -172, 199, -188, -127, 144, 60, 62, 86, 14, -124, 227, -19, 227, 160, 31, 48, -210, -58, -218, 10, 88, 225, 99, -150, -121, -339, 49, -97, -181, -48, -131, -120, -229, -188, 81, 178, -76, -129, 28, 274, -72, 61, 2, -224, 162, 198, -206, -40, 169, 95, -59, 133, -149, 13, 105, 73, -63, -183, 2, 57, -214, 101, -211, -16, -197, -45, 86, 98, 176, -212, 2, -136, 42, 86, 84, -81, -1, -69, 103, -159, -71, 45, 205, 105, 99, 18, -129, 228, -250]
3004b50L08j23K38k85R7J38k31J61r3M33k11j50k35K56q2K14k21j02P3Mm5K21
3026A15k1J0m20L03J19q5P1k04J25k8M4l8O9P5M5J16l08p6J89K28j41k21L96j01
3050B62l77J59l5L29m31L7J37p7k10J76M8k48N89n61K37N9r5P0n4j00K62l38q5
3073b46K16Q3lk05O3K74l33L05R0k78J4j08j41L08K36k1j26j53J36j79P8J13j96
3096g3P1L59l97q4K67j37K6r9K38q5P5k6r0K67k40k3J86l46k40K88J05J35m53
3119b76lJ21J06J60p8q3p8L28j43j64J7R2J76J90l65r5K68k56L0K38m00K5J26
3142f4r2K97o2J95k70j06k26K49n0L5N7k86K47J33k8J75m65K35O0l71K31j49L75
3165A20r8m2Kj37J38R4j82m7L03J16m16K45J8j11n7o0j8K44n4k19O6m5OK17k6
$$ y = [-250, 58, -65, 173, -112, -15, 123, -108, 53, -40, 393, 182, 32, -203, 53, -29, 185, -36, -138, -65, -61, -106, 115, 94, 104, -316, -13, 106, 21, 92, -112, 13, -15, 29, -9, 60, 135, 180, 296, -12, -88, 101, 329, 188, -33, 363, 262, -115, 44, 9, 338, -93, -56, 81, 4, -206, -30, 18, -230, 359, -202, 35, 94, -1, 69, 15, -85, 177, -161, -246, -30, 53, 50, -155, -92, 182, -151, 154, 244, -34, -20, -128, -269, 39, 275, 254, 128, -25, 111, -68, 10, 123, -73, -2, 357, -40, -124, 143, 6, 32, -67, 171, 86, 161, 135, 45, 312, 72, 49, 235, -111, -351, -63, 42, 177, -276, -279, -158, -52, 108, 30, -53, -131, 197, 54, -110, -93, -1, 175, 365, 0, -95, 173, -83, -53, 185, -215, -190, -64, -156, 141, 79, 274, 4, -102, -328, -79, -129, -94, -37, -323, -76, 57, 29, 204, -261, -26, 34, -337, -106, -255, 120, 22, -20, -18, -155, -17, 77, -105, -152, 151, 267, -149, 96, 114, 3, -54, -114, -132, 112, 58, -161, -95, -140, -134, 83, 57]
3190E7j44j5j58J99r3N0L04j65j76J8J71qN1k40O2K03j93J04J77J10l78q3J30
3213a7J72j88j47L03p7j66J47M6l1k16J28M8J12O0l57O9M40j83j21j8J3j70K34
3236H1j50j50j3K54l60J96O4L09j73L0j08P6k07K24j44K09M5j65R0k73L66k75
3258g4p8L11n7nl64J38O4n2J8J69J36l96K81l4o0l1J0LQ5n6J5q6J85q8o7J69Q2
3285B18n6Q3l49K12JP8k41P0rq8k9J67K7o5J9l2J70k1j18K5j85J94j1j03K44p0
3311A31J72k00j6k20m8J41J2L41k94k33J83q2J9r3K11k61M42m18N32m58K07L3
3333A01j70K07j31k76j3K62P2J75l62J41j4l5m2R9N1L20l48j27K31j11n0l41L29
3356c2J55n0J7j81K19l51L97j03n25L23L86j88m0j20J75N4J50k45J2j8k40K82
$$ y = [57, -87, -102, -260, -61, -154, -104, 200, 35, -141, -123, 48, 40, 91, -149, -87, 116, -77, 27, 204, 314, -64, -147, -17, 155, -33, -180, 123, 46, -120, 27, 73, 42, -174, -46, 2, 114, 174, -183, -114, 326, 143, 22, 4, 17, -153, 81, -69, -219, -232, 22, -338, -142, -78, 231, 58, 88, -20, 56, -151, 73, -71, 138, 183, 18, 108, -165, 201, -74, -152, 159, 102, 97, -267, -129, -65, -117, -99, 70, 206, -190, 91, 57, -3, -34, -24, -21, 64, 8, 23, -63, 122, 34, -33, 136, 218, 162, 245, -104, 108, 109, 187, -54, 16, 7, -81, -110, 57, 84, 19, 38, 6, 176, 155, 37, 62, -123, 71, 60, -43, 201, 131, 303, 103, 87, -133, -181, -40, -28, 313, 19, -214, -31, -113, -94, -187, 24, -237, 205, -213, 319, -139, 68, 101, -69, 138, 7, -269, -282, -20, 52, 227, -135, 6, -8, -43, -85, 14, 65, 385, 37, -90, 141, 30, -20, -361, -32, 123, 73, 90, -91, 128, -223, 174, 71, -454, -131, 255, 67, 27, -93, 82, 136, 286, 41, 53, 35, -205, 77]
3378G7j3J00L3j58l9K1N4m9q3P3J12J13k28L40l62R9l5j88K76j26J11o7l7lJ2
3403C3J30r1k27J59k7J1Q8J68k95J32j73J55K3k64J96kpK8R5k46J54J73j4n03
3427c04K96J15m8j31M28k27j70J38r3r8K47p6o4O9j46J32K0k76K41l0l3l6m5K8
3451f3J10k09N15n24m2J51J58Q6k75J82Q0j07r2j08J52J53j27K38k62K5K1k9J16
3474A49j34q4J30J33l05K88k74o8K66j13j9j2p8j75K73J29j52j28J14J10j29O9
3496a0J2r4Q3j60r1K65K57k77j45R2L3J26j65K46k47J07j69J59J52j54K1p2m7
3519g8J35j63K34J02j64J7r4j43J32K81k4k56R8j94J78O3k64O7K15q3j7J37j64
3542A5l1M66l36j88K93n2k41J43q9j45L88m88N03Ok79K5j72N0K77m4m02K23PL44
$$ y = [77, 64, 164, 197, 39, 0, 21, 75, 26, -57, 16, 128, 241, 13, 353, -9, 90, 55, -133, 143, 17, 128, 61, 24, 21, 33, 163, 72, -155, 4, -23, -12, 76, 244, -51, 81, -92, 63, 86, -178, 18, 16, 9, 37, 132, -114, 40, 213, 199, -304, -8, 107, 59, -72, 356, 129, -41, 97, 4, -94, 153, 77, 13, 82, -64, 68, 88, -188, 53, 23, -10, -46, -91, -63, 47, -162, 353, -171, -213, -62, 96, 182, -93, 89, 169, 62, -30, -138, 14, 167, 40, 278, 16, 41, 62, 33, 149, 15, -69, 61, 194, -111, 177, -97, -165, 101, -12, -31, -43, -121, -296, -23, 106, -46, -174, -60, 50, -79, -10, 2, -92, -9, -169, -260, 5, 262, -15, -160, -68, -35, 91, -74, 172, -75, 32, -137, 22, 174, 20, 41, -31, -78, 57, -106, 128, 230, 66, 83, -11, -154, -22, 259, 235, -21, 77, -117, 61, 124, -140, -73, 142, 59, 42, 179, 15, -16, 450, 114, -74, 219, 167, -74, 69, -20, -165, 223, -265, 238, 244, -35, -10, -182, -132, 145, 101, -301, -78, -71, 273]
3566B73l45l69N26j52L4K10j34k72L1J26loj03L02q7N5l27L72m02J88j23J85Q0
3589E9J9l21J02M78k69K06m15p5J51L6k7j55L22o2j84M3j19K30J0L0L9k4r1P6
3613E9Q9j41m0j00J87J39k45P7j23j07L58l01n5m5m6J93L01l92K5J18J49J3o2
3636E1k60j48K48J80Q5k75j2j15L48j08o0r6L38k24l5n9J80kj34J42r4j10lM37
3660B74l84J27L8l48N26l94L11l29K67k29K8M5M1%j82J90m0K10k45J08j1J7J19
3683A39j70MJ1l1N0O5Q2j30o3J01l7L12j98k44K72r9j42J76j13N3l35L40O1j83
3707g9J19J40j4j38N3j37k42K26M3J08j80K38j91L8j63K77j42p0o2J88L3K08j35
3730A18J64j33m06J78R3J57k38rR4M4j88K76j85N8O4k87L93j97J97q0q9L3j56
$$ y = [273, -72, -441, 85, -67, -33, 177, 43, -229, -198, -72, -75, -81, -184, 118, 31, 86, -241, 131, -271, -83, -206, -21, 59, 78, -243, -141, 337, 68, 274, -141, -216, -65, -29, -56, -211, 111, 49, -135, -92, -211, 19, 29, 59, 98, 74, -17, 59, 148, 7, -33, -133, 54, 193, -52, 25, -98, -205, 153, -148, -203, -248, -294, -101, 200, -192, -167, -49, 100, 113, 51, -209, -357, -109, 71, 156, -119, -131, -246, 102, -6, -66, -162, 176, -48, -83, -142, 38, 36, -98, 44, -50, -160, -163, 274, -110, 17, 55, -293, 233, -161, 150, -179, 88, -141, -113, -68, -27, -27, -209, -19, -59, 151, -94, 14, 3, 20, 139, -31, -27, -16, -47, 3, 68, 150, 20, -43, 58, 21, 333, 135, -109, 163, 64, -78, 98, -15, 38, -297, 43, 104, -79, 40, 180, 166, 28, 81, -56, -298, -72, -29, 79, -101, 137, -54, -16, -179, 98, -44, -114, -176, 12, 45, 253, 118, 282, 149, -257, -79, 14, 171, -67, -76, 18, 62, -126, 150, -35, 23, 87, -200, 193, -4, 193, 113, 24, 57, -99]
3753i9M14o99K49J10J06j18J92J16k97J1o1k3l8K81J52j18P8j9l52n7M8o7M7K54
3777A10Q1m38K74J24k07pK37K46n05K2l5J3K24k12J2j06j33L63m7J27m21k1K26
3800g3j85J54J42Q9k14J96k8Rk40K3K62j92p0K56n2L8lR5j26L1p4Q9L0l4k48L0
3826i5m9LM87j23j86j86L58k38r0Q7n1o6L31l46R4o9J66q9M30l26o3J36J65k30
3850E0J21p0l38K97lK4k76J93j03K28mN9p2j66K65j39j43q4J24O1j72K48j97k24
3874c21L90N2k58R1LqK71Q7l22j15L17n38M96lk84L39l79J67q7o0J03K71Rk20
3898ApJ79N7k09m9L56p8o72L07q1J61M44n09R5j07R7J39N5m7l71O0Q2L34k60L9
3923A6J78J07k49j09k53M93J09l38K04j6j70J7Q8J85m60J37J32j08lJ02P4k42
$$ y = [-99, 315, -384, -135, -25, 81, -37, 155, 271, -26, -15, -76, -99, -137, 144, 296, 178, 256, 237, -115, -172, -124, -191, -144, 110, 191, -247, 27, 151, -56, -63, 174, 420, -85, -63, -98, -85, 139, -73, -61, -167, -300, 63, 16, 143, -278, -299, -73, -258, -104, 38, 127, -87, 109, 81, 90, -150, -127, 135, -57, -127, 129, 77, 115, 112, 207, 81, 112, 38, 127, 157, 123, -125, -95, -144, -141, 346, 223, 37, -149, 209, -29, -119, -32, -83, -149, 182, -164, -70, -139, 27, -62, 368, 42, -21, 115, 280, 50, 171, 101, -237, 60, 57, 81, -195, -2, -105, 123, 119, 178, 106, -60, 205, 66, -77, -161, -37, 24, -148, 100, -97, -321, 69, 121, -137, -46, -43, -51, 220, 307, -15, -130, 187, -351, 145, 142, -142, 197, -182, -15, -102, -162, -59, 212, 221, 1, -6, 173, 230, 21, -28, 328, 250, -422, -115, -196, -35, 409, -100, -5, -112, -15, 124, 179, 132, -239, -179, -97, 237, -23, 16, 194, 301, 52, -57, -310, 183, 292, -46, 158, 142, -28, -11, 77, 262, -198, -61, 71, -37, -40, 62, 136, -106]
3945a06P2l1N4l2k7J63R5k79L13l77P3P6J41j18j26O2K23q7K09p4j60p2J81k65
3969i2o5J80j15J06R6L0k03R3j58K04j01J00l25L65j65k07L72Q5k40J8J4o5M7
3992b6j2J44j33r9L45rk92R7Q3J21l56J73j58J71j45M2Q1J43k37J69k42K34k4
4015G0j82j05J53Q4j46J46N0L6n7R0j79K86k96j46K00RJ56l44K7J79l3J48k98
4038a52J44L90l40p4j19K86m9L8j64K08k31J96k15K05k84Q0O7K17j19RN7J33k83
4061@K93l09k05L42j02L2J96k39Q4J10l15K54l35K76J31j87p7j0r5L0L18l40J89
4084D1M7l59Q0K34k9j38J9k68M61nJ42j03l38J35M20m35P4J98Q9l33L14j21J1
4107A36m6J2R3j30j63M7j34L82l04J57J8lk76K20Qr0J02j80L46l91J23J98j27
$$ y = [-106, -34, -65, -11, -43, -70, 93, 188, -91, 222, -155, -82, -6, 135, 17, -109, -47, 176, 89, 298, 224, 64, -8, 173, -92, -157, 23, -92, 14, 110, 140, -63, 30, -128, 76, -25, 75, -250, 115, -50, -257, 115, 200, -40, -22, -8, -73, -26, -38, 106, -27, -126, 219, 210, -82, 15, 98, 219, -137, 36, -122, 49, -96, -54, 27, 170, -67, 102, -140, 94, 70, -112, -217, -64, 20, -126, 20, 70, 106, 49, 139, -40, 246, -50, -196, 4, 13, 169, -175, -148, 31, -2, 146, -152, -8, 382, 42, -32, -151, 135, 86, 124, -40, 168, -63, 133, -82, 123, -161, -81, -14, 203, 84, 93, 150, 283, 0, 293, -16, -221, 121, 19, 51, 247, 8, 92, 202, -113, 141, -194, 82, 213, 26, -51, -61, -156, -126, 192, -148, 41, 88, -271, -191, 43, 14, -124, -105, -373, 88, 83, 225, 122, -216, -81, 339, -96, -22, 176, 265, -68, 246, 125, 136, 90, 102, 195, 65, -98, -51, -185, 197, -107, 50, 68, 65, -211, 9, 17, -73, 29, -151, 195, -196, -73, 125, -2]
4130bj23J73j32J78j03qK23k21N2L7j03O6K62K3l77r0J35K10k29o8j70Q1J19m6
4154a13K01j75M7OJ10j84L11q3j84J59j35J03k54J43J47l3L8j11J30j20j8N9k8
4177A6mj83K23j0K99k58O4KJ10q8n4j42J7K51j21k24J18J7K01m48K23L5J46k22
4201c2K26j16k11KJ26l3K2L0k5K0j21K9J90Q9k21K06k24J70n4k80J19J19K9O6
4225A26o2J16k33R1J54m23J72J76j81K06K23n17L80l31K14k19n0K35m67N39p6
4246G3k80K24q2M4O7l02l9L53OM5j00J88j77J96l29K93l43K1K47k33K14K90r9
4269B77j47j94nM8L2J27l27L49Q5k35j91L5Q9J93n0J67l20K20KJ5n49M28R8j25
4293B2j23J96M8m36K36m2J29K30l74M08l28P1j18j33Q6M17k98j0N3L0k52K72j25
$$ y = [-2, -125, 48, -84, 94, -9, -17, 206, -15, 37, 74, -29, 37, 299, 322, -55, -145, -10, 200, -29, -97, -267, -186, -67, -113, 88, -87, -40, -34, 76, -108, 203, 120, -64, 95, -40, 63, -191, -48, 99, 66, 104, -7, 123, 3, -15, 44, 16, 12, -171, 52, 42, 341, 83, 147, 149, 259, 171, 117, -25, -8, 243, 122, -102, 16, 33, 234, -214, 9, 44, 190, -32, 194, 78, -133, -131, -5, -38, -16, 14, -11, 9, -112, -83, 107, 196, -25, 181, -43, 127, 73, -207, -88, 31, 60, 126, 64, 180, -53, 38, 192, -231, -59, 117, -64, 142, 365, -152, 228, -103, 111, -108, -158, 77, -390, 149, 73, -207, 17, -65, -21, 46, -256, -295, 58, 64, 109, 9, 197, 20, 216, -113, 180, -163, -142, 105, -128, 86, 376, 277, 130, -64, -69, -21, 11, 138, -189, 160, 245, 10, -181, -146, -57, 136, 86, 253, -67, 153, 155, 170, -379, 49, 147, 22, -101, 95, 143, -293, -57, -99, 30, 260, -114, 294, -34, 37, -81, -214, -128, 289, -9, -19, 34, 64, -188, 84, -41]
4316d1Q4j57l6J76q1m8j11J41m6J97j82J88j26J93k28J56j22J32k81K02L2j15
4338g3J21k9J27l0M3k94j93P3L40K09k59j7J61k05k12M41l63J76J90J0k91M0O8
4361C3m2O4j37J03j68K99q7M9n1J59k95K11j56R8j90j9Q3r9l3J50j51o3O2Q7J34
4386D1m28L46J38j94J90k66J90j2J00j16K41n7k93J12j58R7J78n5O4N3M0l07L0
4409f6p5J36K00k19R7K03m36K57L5k15j15n9J16O8L36l49q1K76n3M6Qr2L4n4p6
4434g8K51l03J53p0J04l1qK12l13o8R6J43J06r3j00n2m4J78J77l7j60J86k32n9
4458d2Q5J37k51J13l84K27n2J06p2k27M77k4k28l1K13k62L02j04j19N7J04l11
4480b86K09k31L22q8M00j60j72P2k67M7J24J18M0j36K04j60j17J76j64J09j51
$$ y = [-41, 43, -114, -150, 26, -55, -103, -214, -73, -119, 78, -104, 84, -42, 151, -77, 79, -43, 89, -192, 10, 42, -73, 48, 19, 146, 116, 159, -135, -328, -255, 85, 294, 35, 18, 179, -26, -238, 203, -160, 16, 206, 216, -75, -35, 33, -9, 55, -82, 21, -147, 152, 65, 114, 63, 222, -73, 138, -18, 80, -110, -129, -46, -145, -178, -28, -179, -242, -180, -93, 41, -387, -41, 97, -97, 93, -173, 17, 5, 105, -11, 230, 173, -120, -8, -166, -69, 109, 54, 118, 171, 211, -96, -66, -141, -5, 195, -24, 73, 276, -160, 97, 132, -83, -198, -257, -141, -73, 263, -86, -167, 109, 56, 102, 110, 18, 52, -2, -78, 173, -130, 23, -47, 57, 26, 18, 230, -83, -151, -55, 88, 194, 101, 1, -51, -95, 83, 260, 223, 63, 249, 17, -42, 43, 180, -71, 42, -342, -115, -167, -61, -133, -360, 117, 93, -135, -166, 47, -215, 87, -17, -136, -79, 25, -286, -77, -308, 14, -74, 326, 166, -6, 66, -201, -154, -30, 88, 128, -8, 196, 36, -81, 95, -69, 40, -111]
4501a11J10j53QK32J79m10j85J89J37R0k76L2j7L46r7L80o04J97O2l02L65l21
4523a49J63J3pl35K77K0M6k70K83n1j64J89J95k9m18J65K2M1Q8K2j01J21k93Q8
4547h4qJ68lk6O8q8L4j50l2n1j3J84j38J24K32j74QJ72k81J85k32J60J13P0l07
4572f9j5Q7n7n4J61l59L37J7k40N33k03k86J18j23J83K16k80J74k64K04j49R2
4594B3M2R8q5l0K1j02O0j36K2m8J79K46l38N4K0m4j58K13O8o2j7j22J70r3J37
4619A18o8M6p7o9j26L43k44K72l37K04K02l98Q8k15N43l58L33k92j03L91m41J90
4641Bj1K41k73J99k90K06j22J64j97J23K1k78J05J71m2J36np1j02L12l36k9L4
4664d2L7k99M82j34J02j55K89l43O7l8P0l7p8K17j24J84m10O1K42O8O3m64J75
$$ y = [-111, -1, -154, -146, 86, 265, -145, -330, -141, -4, 86, -190, -158, -175, 171, 74, 454, -150, 47, 109, -193, 172, -149, 14, 27, 20, -315, -38, -18, 28, -242, 41, -10, -174, 15, 210, 181, -237, -72, -50, -9, 79, 101, 0, 121, -172, -84, -92, 76, 73, 47, 115, 27, 61, -89, -121, -172, -185, -1, -139, -15, 217, 43, 51, 223, -58, 127, -105, 55, 168, 238, -69, -84, 3, -54, -108, 53, -306, 31, 48, -192, 341, 138, -148, -30, -153, 30, 246, -34, 140, -124, 80, -69, 23, 65, 163, 78, 48, 69, -33, 27, -109, -87, -135, 44, 290, -48, 6, 26, -18, -176, 37, 105, 43, 26, -96, 74, -19, 118, 50, 96, 19, -50, -176, 167, -77, 195, -142, 62, 264, -134, -46, -261, 282, -76, 257, -35, -138, 253, -188, 2, -9, 232, -41, 158, -132, 74, -48, 116, -81, 42, 63, -215, -110, 61, 19, 155, 150, 79, -23, 289, -47, -76, -42, -5, -304, 178, 44, 146, -9, 280, -63, 4, -34, 36, -1, -79, 138, 14, 198, -212, -151, 91, 159, 222, -242, -67]
4687f7L5K17k81j47L96k03L4J39k71L84j33n7o0J96k86K60k36j30Q2K40O5j9l9
4710A19q6Lm0K33o03J99J79j83L79k77k36K96J58p6qj32K73m5m29K21J61Q4k78
4733h8J12m1R1O9j26p9j2K48r5j68L71l77N1K76q1k49O3J14l1k25K53K1l12o7
4757b82L47rl03L04om1j81k25J32N35k77p8J51k88L49m7k99K79m6J58k08jP2m9
4781a3J28j45q0M0N9j9L29l59OP7j52O8R5J1j00k43L78l08K02M5j49O1Q8j82j83
4806c46M70j36k62J78J29k00P0J57l0K46k04M0l14P9k7M1M03k42j28n3K21k41
4828a49O5R3j8k39K10p5P6j86J43j09J25L67j86k00J02j52J33J1q5J38O3j76K79
4851B30l44M13j45m49J31K48m0J6j21K00k33m4R6k2k52M80j4j78M8k21M29k87
$$ y = [-67, -32, 185, -96, -243, 153, -50, -16, 123, -148, 236, 103, 46, -14, 182, -104, 156, -80, -210, -128, 112, 177, 158, 119, 33, 36, -4, 229, -374, -175, 4, -179, 200, -77, -313, -17, 141, 65, 57, -75, 198, 153, -276, -55, 106, 190, -88, 24, -17, 74, 143, 17, -62, -74, 174, 79, -89, 282, -95, -44, 232, 151, -98, -35, 79, 48, -177, 76, 97, -215, -282, 65, 56, -247, 57, 51, 10, -171, -396, -264, 271, -6, -84, 67, -221, 128, 81, -218, 61, 15, 173, -35, -36, 36, -13, 115, -30, -110, -70, -11, -30, 299, -60, -54, 23, -129, -61, 34, 45, -55, -298, 80, -228, -26, 19, -130, -69, 19, -163, -346, 124, -12, -274, -96, 33, -167, -97, 60, 30, 276, 72, 112, -202, -123, -150, -109, 294, 52, -76, -129, 92, -149, -84, 9, -9, -248, -38, -113, -37, -223, -80, -189, -64, 303, 117, -83, 19, -133, 0, 11, -74, 64, 127, -49, 230, -114, 299, 154, -295, -164, 84, 44, 60, -61, 139, -94, -138, -42, -64, -316, 164, 150, -28, 20, -201, 228, -59]
4873e9J35j96J39j32O4p1K50m0O7l3l86M22j43k99K28J01l4rrl85N79k57L15m30
4897a83K76o2J34j67j34J44j84J25N1K14l35J03J62L0J6j57l58K35M7J68p6Pj62
4920a06L06j89M6%j24J01j10J76J09o0o0l13L06Q6k17M3Lj35L20j22J16k78K0
4943h2p9M00Km46J00J14p6k9J6o1M0Q9l4k58K55K4R9o1J68l88J86N9K6k7Q1k30
4969a12K31K8k64K44m31L33K4j16M02j42k40j16K38r1o6j25J59p8J32m6J63%j87
4992f0P8J17m50N07m6l09M17k54n5Q3K2Qk2J27j52k35K14J2m6m2J15Jl10L33R
5017F2k30M88m26K10J06k61Kj9N2J01j22R8j81K29k76PM06n01M61n5j32p2j62
5040b15K36m12M06j45P3J97k0J11m07j5J87k7K2L73j89j82M6K21j77k85J36J26
$$ y = [-59, 76, -120, 19, -113, -49, -120, 130, 90, 157, 124, -262, 160, 17, -282, -54, 47, 13, 4, -5, -390, 189, -68, 247, -183, 93, 31, 165, -2, -136, 8, -176, -51, 0, 214, -121, -18, 144, 174, 190, 33, -325, -90, -43, 125, 49, 56, -106, 200, 11, 57, 57, -67, 34, -76, 100, 209, 149, 89, -224, 82, 168, -49, -6, -3, -138, 182, 60, 176, -102, -82, -161, 239, 241, -205, -105, 9, -67, -96, -80, -141, -101, -12, -46, -304, -49, -25, 74, 13, 181, -207, -21, 38, 64, 37, 118, -112, 119, 147, -117, 127, -304, 29, 53, -63, 339, 197, -43, -159, 79, -12, -78, -203, -44, -122, 10, -36, 127, 127, -60, 18, 135, -315, 192, 146, -163, 254, 0, -55, 28, 50, 58, 36, 163, 11, -224, -10, 2, -44, -86, 29, 30, -280, 53, 62, -168, 320, -106, 104, 210, -51, -49, -68, -16, 85, -37, 61, -120, 109, -167, -160, 246, -255, 206, 151, 19, -53, -215, 21, -391, 15, -130, -57, 140, 120, 231, -176, -191, -4, -31, -9, 364, 175, -7, 39, 260, 83, -202, -66, 60]
5062F0n4j85J92k4n1j80p8M32ro0n7K44l05K28l64J73k4J59j28j30L09p4J56o13
5086c83L85k11Q2K11j30J12k42K39K12k40k6l35K54m9L60l44Q4K20j29j06q4O7
5108e3n0J36J0Q4Oj28Q5k23N1J95k5j12m4j35J67j73K46k78K74n5j54J64r0J87
5132H5J05k11J73k47j30M68j00l56L19k57J38L08j33k96L26o95L25K64j66L7Q7
5153D4p3j7J27l37J18L79j41j58J01K19j55r2L07m67Q2L2o5J22j40L37m26J89
5175a4P2k12J51k83K32Q9k48J26J17P3j06j03J53o6R3k71K54j26j98L25m5Q9k82
5198a80K02p7K66l35K67J27l06P5k44N2K21J74j07l07P0M8NK88k04R2k93J52M1
5221B7J5K1rm09K79k8J00J11J02o9j76P6k97J21K11q6J00k25J48k34P1K54j97
$$ y = [60, 6, -179, 13, -11, -62, -242, -320, 112, 103, 43, -14, 230, -75, 153, -211, -38, -62, 97, -31, -161, 148, 74, 230, -383, 2, -209, -127, 84, -46, 66, -176, 63, 275, 35, 9, -326, -72, -121, 239, -105, -21, 199, 70, -36, -120, -53, -103, 33, 43, 127, 133, 5, 90, -133, -82, 113, 88, -24, -68, -203, -36, -209, 37, -241, 33, -22, -176, -12, -102, 85, 190, -21, 152, -95, -225, 243, 143, -213, 106, -151, -13, 295, 162, -134, 192, -503, -178, 86, -80, -43, 44, -29, -46, 81, -256, -138, 241, 100, -58, 43, 262, 107, 15, 322, -145, -63, -31, -96, 26, -114, 223, -203, -14, 58, -154, -3, -286, -54, 35, -213, -87, 30, 103, -3, -106, 47, -19, 74, -197, 57, -69, -267, 58, 13, 102, -180, 22, -55, 211, -124, 143, 270, -36, 39, -205, -153, 68, 242, 135, -172, -102, -54, -49, 239, 35, 127, -166, -14, 27, 42, 63, 54, -355, -76, -104, -4, 107, 209, 140, -36, 40, -257, -136, 75, -11, 89, -136, 12, -222, -151, 103, -94]
5244i4OP1o0Q9J43k45K04J81j22j02m9q0L4K4R9k66O8j41K46lj60J61j05J49J08
5269A56k67J3K05k77J53j71P7L35qo28P7R7m3L31j0j44J85k60o6J66nKm9J68O9
5294A06J37l25J35q1j58o9Q9k1L95l63K03QL8J76m22K27r8J2k94O00j45q1j06
5317c7LJ2j81l6L94j60L17l08O4j81m7J99p5J78m4j83n0J04J74J5p1L10n86J55
5341c4R6N7p0j28J03R0j65n3J88j31J2j2k3RK40k87J14m6L6J36j1K2k22P1J21
5366A13l63M27N7n25N3K68k40O0k8P7j0K32k3J80r5l43K12j8j24L27j66pk8J03
5390A39O9k88MM6l3J40l31J65J22l1lR6K1l34M6p1M58l19K48k5q7L0p2J15j45
5415d0K38k96Q8j16J46j5L73n81K18K4J12j46j56L33k36j3j44Q5j4J61j36J47
$$ y = [-94, -88, -17, -77, 12, 155, -90, 114, 295, 173, 71, 22, -58, -24, 0, 99, -167, -99, -240, 6, 3, -157, 4, -101, 48, 156, -111, -98, 107, -170, -17, -188, -111, 224, 216, -412, -335, -238, -281, 50, 40, -104, 81, -179, -245, -79, -84, -82, -131, 37, 106, 243, -82, 53, -28, -186, -255, -166, -187, 208, -155, 48, 56, 94, 270, -152, 75, -23, -11, -305, 295, 150, 69, -37, -34, -22, -203, -239, 155, -5, 312, 4, 68, -113, -160, 39, -36, 142, 98, -85, -135, -31, 143, 158, 87, 397, -189, -34, 62, 119, 49, -79, 24, 114, -51, -104, 84, -47, -35, -47, -70, -61, 179, -108, 6, -40, -4, 132, 121, 143, -79, -8, 113, -250, 177, 234, -291, -238, 30, -210, -150, -178, -101, -111, 121, 98, 278, 183, -160, 52, 34, -90, 237, 71, 64, 36, 139, 208, -80, -76, -30, -63, 77, -254, -89, 33, 2, -1, 95, 116, -218, -172, -243, 215, -104, 144, 119, 32, 62, -10, 105, -40, 198, -98, -10, -126, 20, 5, 378, -203, 15, 39, 151, 5, -151, 182, -54, -67, -211, -126, -140, 21, -115, 32]
5437C2q6M2k1m7J89l2l1l3k37K70j99%J64P8p8QO4m7j06L66m65J20J30r1j65J91
5463A6K1J31l62K40J10k2k96J37j45J16Mm2j16J38j8J14k1j31K70l54K65l46N26
5486B35k91J12J8m2k55L08N5l25J54q8k6K31r8L64m19j00K07j91J05j5Q6J06j7
5509A14l57N1J10J1K10k09J44j80J01K53k43L16j41j14j03J42k29k6J85J22l11
5530a54J10j0q6k5P7J06m4q8L3P7%m5K17J48k79L8r3Q1k2O0k53M71l34J0j16l1
5556a52K23j09K10J7m33L78nrk73NL87k22k42M22k2j80j25L8R2J56l97J88k38
5579b91Q2K70j5O6j79P0K94k93J00J60j99k29j40J78L46l59M86m22K35Rk39J84
5601A14j67L7K06j08k7q3L04m36mJ89j50Rj22N65m50j68K30j25k3J02J72j15q
$$ y = [32, -54, -12, -33, -80, 109, 77, 46, 13, -224, 46, -153, -153, 11, 89, 11, 19, 83, 36, -70, 296, -169, -49, 81, -10, -175, 16, 37, 168, -194, 46, 156, 134, -162, -25, -170, -54, -50, -92, -208, -70, -88, 26, 5, -126, 144, -210, 55, -291, 235, -56, 56, 74, 32, -223, 85, 140, -185, -31, -119, -145, 86, -12, 352, -67, -167, 40, -151, -46, -61, 25, 131, 114, -243, -192, -82, -71, 139, -70, 74, -106, -5, 248, 5, 321, 180, 66, -37, 105, -124, -150, 35, 157, -154, -44, -54, -140, -165, -88, 18, -26, -114, -81, -4, -4, -49, 168, 316, 37, 75, -18, 63, 41, 101, -152, 319, -15, -5, -121, -152, 71, -38, 172, 189, -244, 134, 129, 120, -153, -148, 239, 17, -225, 197, 175, -5, -130, -92, 0, 156, -241, -53, -291, -209, 61, 46, 112, -67, 3, 297, 4, 104, 264, 65, -164, -304, -126, 220, -139, 347, -75, 160, 169, -70, 114, -53, -16, 190, 82, 55, -28, 276, -160, -164, 25, -125, -116, -238, 327, -123, -291, -61, -186, -209, -107, 65, -50, -58]
5624e8L02j85k4j42j16J60o7j4J39L37l04J1K7k00J55K51o6k13j41jL36k85O7
5647c1JK0Kn5PK42j81j00j3Nl4K74k82%J53J35J04l19o8r5J87J31J84k11j38M1
5673d1J5J54k55Mj5J11K19j50J99k78L10l75K24k85KkK72j02O6J8j68J65j06r2
5697a10M10k82k82L03J30k20o6k9KM46m82K05j80M15k41J82n5k00J02J84k75O6
5719B3k39K05K83m83K92j07j72P6K74j92M3J36k04K19J86j84ok07l2L02k90P4
5741cl6J14r9K30j82R3l29p9J37M25J13l47j06J64j85R0m9n6J75K52j80j70M38
5764D10k29l23M35m44j65M65R4j52J38m74K75N5J82l87J78M9j15j78J73j97J37
5785g3K69j32Or7Q5o7k35N6N03k05r8j79J09j45L07j38q6K60k43Q8K5L6j94L20
$$ y = [-58, 244, 59, 35, -107, -223, -63, -130, -144, -5, 332, 28, 39, 66, -134, 21, 272, 206, -7, -148, -149, 187, -98, -31, -30, -10, -8, -63, -56, 186, 5, -95, -108, -103, -137, 137, -145, -145, 8, 143, 247, -72, -140, -235, -48, 83, 267, 56, -82, -41, -26, 128, -127, -123, -138, -27, 192, 42, 241, -37, 273, -102, 122, -163, -161, -163, 109, 7, 73, 91, -77, 88, -18, -110, 300, 18, -264, 39, 169, -51, -117, -146, -144, 302, -180, 25, -155, 260, 19, 201, 146, -54, 48, 232, -43, 23, -216, -11, 272, -211, 81, -26, -198, -122, 152, -40, 3, 139, -65, 154, 340, 156, 150, -57, -89, 213, -77, -3, -39, 75, -24, 206, 24, 117, -212, -291, -154, 271, 384, 37, -69, 95, -90, 0, -49, -105, 70, 322, 142, -28, 410, 181, -142, 293, -151, -316, 149, 243, 91, 229, -245, 30, 85, 267, -120, 58, 107, -8, -186, -13, -210, -73, 196, 64, 70, -27, 58, -9, -244, -188, 315, 110, 12, -167, -58, -203, 104, -34, -120, 140, -103, -15, 10, 46, -148, 172]
5809A72k9j4k11j59L98j74oJ79k54J15j71m0K45j18P7j51L50k16j47r9K53M5r4
5832d9K0j74K33n0P4j2l49N15k20J53o6P4Q5k92k66K51k33M82K5k31J5R0J04j38
5856D1j04J16J91n17J42J1J85k30K03J35j02q0j66K87K5m74L50k44J19j12J40
5877h4K5jm9l0J76m8j6K38k15K5R6j60L2K1j46R3p6Q7N7l6l2K7O1j26M7o5O5r2
5905a26K51J9j56L2M2k26J41J20n9l40K30K01j97P3j83oK92j13n0J01J64j85m8
5928b3K16j98N7L4Q1j49n3j0K01j51r5J40R1qj18j80J02p5M83k88k35M07qK2k22
5953B1J80l87L28k97J16j3J65k42k1K96PJ9l45K83K1j86K7k1K97j99J05l55K70
5976F9k6L2j57L4P5Q4J87k45l3l23L50L1l08K47J96j62l32K42p8L74j73j09nl4
$$ y = [172, 143, 129, -82, -241, 157, -17, -23, 156, -98, 17, -154, -194, 51, -67, 10, -141, 209, -7, -154, -253, 0, 45, -49, -29, -203, 30, -20, 54, 42, -307, 208, -12, 141, 75, 149, 234, -58, -324, -73, -306, 176, 201, -30, -15, 75, 179, 41, -63, 53, 244, -273, -131, -120, 65, -165, 38, 173, 71, -9, -175, 112, 137, -337, 13, -231, -112, -224, -84, -59, -60, -109, -139, 37, -11, -27, 211, -4, 21, 117, -43, -11, 10, -136, -43, -119, -32, 25, -11, -43, -16, 45, -81, -34, -99, -34, -126, 125, 144, -12, 20, 62, -164, -23, 97, 38, -302, -72, 129, -68, 5, -178, -184, 108, -5, -55, 46, 210, 25, -23, 193, -5, 52, 86, 167, 18, -35, -45, 156, 5, -90, 50, 141, 133, 15, -165, -63, -138, 345, 57, -178, 229, 221, 243, 21, 201, -186, 142, -155, -39, -52, 113, -129, -150, 146, 153, 172, -173, 110, 131, -55, -28, -49, 248, 49, 154, -201, 69, 43, 75, -82, -48, 27, 111, 298, 53, 20, -303, 47, 78, -230, 17, 213, 51, -281, -39, -117, 257, 84, -25, -30, -64]
6000f4N3K9l6M7N4p0j46j98l5J64Q6J52J47l91O2K58k38k0K60M3k76m6J91j46
6024a20J51J0RJ19j99r5L68l88J07j8m5J52Q1n59L59J28j52RO3P6J12q9N3M5j97
6049b0K6k37L71l59L36j79j12K83l21K48o2k95M12j6k86K16j12o4P1K39k18k90
6071c69M82r4k7j14l2R0O6J21k76Q9K96K8m82K84J10k24j35J67Oj77J35q7L41
6094A98l72J02K22q6o5K0r3M1J12j53K74j05k01K39k85m3J47n5PP3J46j52r7o7
6118a93L12K92l37r6j0O1m8j14J22p1j41L5K28J45l50K82l08L06j28j94K45k05
6140a67Q5k2k8j13L36O3j43k53R1L66k01J51l26J3J53j73K63L7m8J50k49j7J04
6163G2n2k19L06l04J10P7k7O4J29k66n3K15l1l13L12L58m36N6p3Np1J97o0J60
$$ y = [-64, -11, 18, -18, 29, 83, 13, -133, -331, -366, -202, -116, 36, 183, -208, -146, 112, -126, -146, 114, 157, -119, -165, 26, -120, 31, 41, 50, 169, -30, -125, 243, -145, -38, -56, -101, 51, 132, -427, -68, 60, -92, -83, -20, 56, 168, 79, 132, 177, -20, 6, -231, 140, -219, 117, -62, -174, 109, -212, 36, -26, -321, 91, 75, -211, 5, -107, -171, -100, 139, -79, -369, 113, 19, -8, -122, -154, -64, 2, 123, -153, -64, 232, 260, -222, 62, 172, -52, -187, -20, -14, -191, -56, -143, 198, -174, -72, 150, 64, -1, 19, -74, -33, 79, -74, 200, 95, -106, 133, -152, -195, -48, -103, -96, -23, 123, -29, -126, -193, 119, 411, 74, -22, -32, 29, -19, -133, -11, -82, -223, -188, 40, 185, -165, 117, -191, 115, -13, -207, 38, -167, -82, -104, -132, -245, 91, 154, 11, -242, -151, 215, 14, 165, -161, -148, 5, -168, 95, 132, 84, 234, -15, -32, 72, 20, -199, 107, -197, -87, -10, -37, 27, 156, -110, -163, 52, 21, -292, 20, 378, -58, -2, -75, -70, -141, 56, -4, 156]
6187A56j47J2lK83j01j80J56j05J3l8qR5j82Nk31O46m31j0p9Pk9L45J7k25Qo5
6213i1L18j28L17n40R6J21M6j82K75l66J50l5M8K7P8j21Rl17J64J61j20K7J91
6236A28R7l49J75j48J48q2K2J53k09L01j49N5r6J22oj69m7l1n7o6M98l7j00k35
6260h2J50N6j58J82j08l54K34K04j06J1j53L61k57p8J95l84K77k22K80k30J39
6281d3R8k39K73J2l32L49m34M25j74M7j32K36l29J97j63N2L46n2j61j34N2n8J21
6304d3k8K56j13k04P6J62K21m60K71k11L7Q5J6n2j49J38K31r1M0k75k0K91r8j93
6328a13p9M64o42N11p7J04j68k58K34j25L57k62j6RP6k6O1k40J04J30j93K95l37
6351a91M84j48Q3l42L88j76M7Po4n4k7m5j70J56K36Q3l54K35q9J91j21l24J69
$$ y = [156, 9, 21, 18, 301, 200, 20, 176, 71, 84, 46, 38, 133, -49, -44, -275, 371, -60, -70, -149, -142, -171, 174, 191, -34, -26, -91, 227, 99, 416, -124, -28, 93, 139, -43, 232, -134, 16, -19, 29, 56, 134, 13, 22, -295, -131, 30, -90, -63, 128, 225, -124, 51, -97, 51, -31, -9, 144, -65, 236, 87, 142, 46, 168, 162, -7, -54, -85, -142, -208, 290, 253, 153, -82, 68, 124, -34, 148, 40, -314, -80, 124, 18, 29, -124, 237, -20, -98, 97, -287, -10, -232, 48, -182, -43, 55, -184, 89, 101, -231, 118, -316, 109, -65, -18, -150, 86, -243, -46, -209, -157, 189, 137, -24, -158, -106, -164, -43, -71, 185, 72, -132, -56, 106, 327, -133, 138, -73, -36, 49, 65, 13, -136, 2, 233, 142, 182, -93, -113, 178, 80, -113, -192, 272, -370, 141, 64, 168, 0, -258, -24, -149, 208, -54, -70, -61, 15, -11, 50, -190, -86, 44, -149, 146, -191, 293, 145, 228, -114, 274, 98, 145, 152, 88, 34, 7, -38, -208, -52, 184, 267, -87, 148, 59, 250, 129, -195, -26]
6374b6N2R5n8k44N0K32n8J07k2j94J24k04L0J12Q7J44k39j09K07k18J55k10N6
6397a31K2l31M82q4L11j25j71K5j4Q3o1N4p7k29R2J98k40K12N4l08L38k70j68
6420c38N38k66J15l13K01L9q3L13k20J5K61j52Q7k09J84r5j99j3L12J62l43j54
6442a58p3K52k17K21K13k52J39j86j17j00J44j39K85l01N93l29L48k54q7J56k40
6463a02K21k93Q3J47l19M21j04K38m09J8m6N5o4K85R7j59J46k38K70k44J17J87
6485C07l77K10j5j36J51l24Q3M2p5J62J45k89K19J77j28r8J13j71J36J23k9k72
6507d6R4j70J91j45o6L7K39j12j75o0L45j42P8j31K44l07L41N9m63K95j32J9L6
6530B9M3j85L5M03k84o7J02K1l46L6K95Q5l7n4Q7J33l79L20k62lj40M7J72Q6j72
$$ y = [-26, 26, 121, 63, -181, -131, 101, 43, 150, 128, -66, 58, -146, -116, -4, 83, 227, -12, -121, 86, -132, 23, -187, -131, -109, -440, 42, -42, 269, 144, -27, -2, -16, 67, 6, 60, -17, -246, -154, 44, -196, 16, 70, -238, 100, -170, -338, 200, -66, 49, -264, -63, -24, -107, 206, -14, 1, 262, 110, 197, -12, 172, 77, -122, -135, 177, 339, -4, -158, -231, 21, -196, 25, 238, -14, 125, -61, -178, -278, -134, -273, 12, -289, 304, -25, 323, 69, -18, 138, -102, 119, -174, -91, 56, -263, 158, 54, 292, -117, -99, -145, -90, -154, 131, 228, 69, 215, -23, 247, 3, 120, 307, -70, 140, 125, -11, 140, -184, -101, -59, -134, 28, 173, -116, 103, 280, 152, 54, 167, -4, 132, 255, 226, -46, 48, -122, 69, -76, -142, -105, 134, 22, -153, -213, 132, -10, 68, -63, 181, -126, 215, 274, -189, 106, -26, -7, 29, 72, -113, -78, 325, 41, -26, 76, 97, -249, -213, 82, 167, 130, 76, 163, 296, -83, 237, -25, -28, -168, -121, 51, 137, -35]
6555c5L7j71K15rJ07k61j61OK87K4r8p5Q8L27l50J51lp0q8L20l06O4q6O1K71k44
6581An8J24l5o8O5R9N2k13j12j60M81m7j25Q6j53L07j87j6q1M1P0L5Q4k89M0j3
6607g2J99P9k71J96j46L17m62L99j24q5j82pj77O8N43l48j44L59j40J45m7oL4
6630A28j19j54K52l08L50l14L31m09L21Oq9q7n6J87M0j15j87L53j78j09p5N64
6652C32n15K22N5m0N6M1P8jn29R5j93N84l56L93j5l35j53L90q3J0L4J19l18Q7
6676d2J74M2j83j86K48r9P1J98l26Q9j18L3J71k99K26P9o9P6m6pk5O7k52K54k6
6701E0K2m0NJ04k00K5J18N3p4k25j75K12J67r0M1k4R1j42J7O5l71J07L61j09N5
6726D3KJ6J43L1j84Q6J04l47J14j14oq9P3j67J76J70n4j16J85M9l17L15k08J59
$$ y = [-35, 2, -169, 46, 37, 144, -117, -278, -272, 15, 39, -59, -134, -46, 281, -69, 82, 79, 9, -79, 241, -65, -1, -87, -26, 245, 1, -57, 67, 32, -36, 29, 128, 180, -33, -145, -305, 176, 129, 4, 90, -63, 244, 57, 41, -40, 1, 71, 106, 190, -99, -59, -72, 127, 206, -65, 131, -15, 302, -160, 239, 115, 30, -152, -159, -336, -268, 275, -73, -217, 142, 2, 147, 100, 94, 128, 9, -145, 107, -201, 149, -165, 166, -243, 78, 84, -5, -92, -148, 39, 79, -36, -223, 130, -48, -157, -232, 332, -183, 39, 94, 54, 110, 151, 229, 228, -301, -206, -399, 185, -171, 222, 207, -128, -281, 109, 26, 36, 70, 189, -129, -42, 132, 174, -9, -195, 53, -46, 25, 223, -103, -14, -132, -99, 72, -227, -1, 78, 9, 85, 39, 32, 7, 74, -178, 76, 50, 72, 32, 37, 141, -59, -34, 84, 137, 63, -162, -337, -125, 42, -48, -7, -31, 60, -82, -65, 0, -371, -264, 97, -12, 43, 45, 61, 204, 235, 51, 137, 241, -106, 8, -106, -112, -201, -128, -295, -119, 51, -3, -119, 66, 115, -202, 113, -95, 64]
6750F4J79k34k40M11j94Jk30K45P5k82K44j97K30k03L1J45R3j70m2J81M7Q6j38
6773A02l6K04k92L6O1j5j26q4K96j99k9k7K45j71K9R2j36q8L07k17J55l2j30K03
6797A48j88J13J8r8r2L08r3J12k98K18k80K66l08P1O1J22L2k0k67K74J74l2q7
6820A54n24L70j20N2K74k63L95j78J78n90R9K98QL8l2j79j99J95J85r6j03J03
6842F5p7R2k7j01Q8m1J51l08L92q7k35k8M2K33j1l24J91M2l1k58L49l21K31P2
6866I9r2Q1n8J2j88J15K17j43m43M94j83K66j04l8K35n01O2O4j61J29j34L36L50
6889D15n62K6j6N3J11q4k40J76J19J24k12r1K07K07k19K74k44j45K36l41O3K47
6911A04O5l01m8L30m3j22m5J93J43n17J42K6p8L40k9j79R3J14k62L6J13j78J93
$$ y = [64, 243, 9, -231, 180, -14, -13, -243, 2, 77, -205, 39, -158, 72, -131, -100, 45, 138, -32, -74, 107, 154, 240, 102, 66, 270, -22, 14, 75, 60, -66, -150, 146, -53, -82, -109, 136, -35, -6, 86, -50, -138, 169, -48, 107, 75, -55, 148, -40, 73, 91, -7, -99, 209, 116, 228, -70, 148, -132, 134, -174, -103, -42, 80, 112, 92, -175, 99, 273, 241, 154, -370, 0, -120, -68, 206, -57, 338, 160, 338, -252, -153, 145, 153, 191, 159, -20, -219, -24, 161, 65, -38, 65, -12, 80, 53, -48, 40, -1, 150, -158, 234, 147, -88, -116, -74, 159, 148, -176, 15, 57, 26, -232, 117, -204, 27, 99, 7, 88, 30, 42, -146, -31, 186, 43, -400, 94, -89, 177, 73, 35, 270, -231, -169, -105, -266, -137, -271, 65, 415, -147, -121, -137, -84, 27, -57, -297, -121, -2, 122, -90, -181, 26, 233, 14, 288, 44, -101, 135, -206, -143, 104, 169, -132, -180, 150, 107, -15, -60, 133, 276, -241, -99, -73, -151, 189, 160, -19, 74, 188, -74, -38, 75, -103, 90]
6934I0k49K21j33J88ok79j4L08p3j25k8r1N04k55N9j32J01kJ05j84q2J36K13l20
6958d8J6R6l38K41J78j65Jk0k8k49M25m44L02p9R3K03j64o4J00j13J93J11l70
6981a23J49J09r7o3k09L73j96JL6N6j33j46L93J8l8q7j4J00l2j25j3K21k95J29
7005A4K00k23J2j92J18Qk22L43O5J65k11J72j23p6k6J61Jl66J57J80P7j74l94
7028c34J37L00J86j75k81K94j92j64J8K63J54k55J43j81N7lL5n3j89J42l12M72
7050F2J63l47J32k0J85k49J06j3J08k14j27J9K12k57J96j04L47l01Q3Q3K22k94
7072hO1l37K81P9J76R3n09K61P5J5j24l9M2k21J34J06j05no4J97J61l05o5j76
7096b77nJ59R2J7l0K22l33J69J16k73L84p9k93k2K77j16Q9j77J40Jk51L22k58
$$ y = [90, -159, 62, -71, 117, 111, -168, -182, 126, 53, -72, -100, -191, 313, 58, 117, -15, 86, 84, 189, 5, -77, 59, 272, -48, -32, 64, -274, -33, 145, -20, -19, -39, -67, -316, 109, -335, -33, -112, -19, 184, 20, -44, 56, -57, 136, 247, -123, 26, 135, 38, -25, -234, 139, -57, -56, -20, 36, -97, -243, 150, 168, 130, 43, 29, 129, 97, -28, -41, 180, -115, 14, 214, -9, 3, -189, -71, -63, -285, 58, 123, 288, 77, 249, 126, 50, 24, 185, 186, -180, -23, 157, 234, 60, -334, -197, 103, 289, 114, -167, 127, -65, -229, -211, 52, 206, -49, 94, -87, -30, -33, 2, -51, -240, -98, -410, 62, 225, -122, 10, -10, 175, -74, 32, 19, 127, -87, -214, -195, 17, -240, -44, -148, 199, -102, -19, 64, 286, -8, 53, -284, -3, 76, 252, 345, -164, 97, 172, 187, 63, 24, 66, -155, -21, 85, -20, -25, -89, 108, 269, -36, -101, -277, -282, -123, -31, -14, -44, 178, -155, 14, 130, -143, 241, 162, -131, -153, 124, 8, 97, -80, 60, 61, -190, 132, -126]
7119a26L0J8j66R7J18J14j06Q6K9P8J5Rk12J57j73k03L35K84n76J67j12O0O5J08
7143I6j50J8ML3k3Rj09q2L80n1n1j08J26k46J27J9J10J54M5m29J66J24m07K98
7167E3Pj61L22k37j97M37j06l43L78k29K19J77l07k22J13O1j50R2K04k97J29K48
7189A91M0k18M5J8k74K63K9l60J07M29m00K94k41J33j11K12k64J96Q1j0j82ro4
7212i5J13j11K64k76L97l24k2N2M1L6k03p5K47P7m2P5j85r8J8L82j16l66Q1P9
7236e1K46n21K67K13l1j7K9l49j92N04o6q3K71j24o0l27L57M3l10K70m17K96q2
7259a34K94m14L6L04j37O1r9K7J29j07K74m46O3M44k63R7j58L4l2j32J3J28J50
7282A32l3k03R0P9K15m06K74k75J89k18J49J08j02J37k31K8k4J37j65m2L17j57
$$ y = [-126, -96, -78, -244, -147, -29, 85, -21, 65, 94, 172, 187, 196, -16, 141, -32, -235, 100, 384, -192, -25, -137, -77, -12, 96, -54, -36, -32, 1, -22, -13, -122, -204, 176, 125, 74, -34, 92, -154, -27, -8, 102, 256, 301, -128, 38, 162, -245, 53, 60, -101, 221, -16, -213, 224, 118, -225, 153, -76, 143, 320, 13, -209, -96, -35, -185, -93, 111, -186, -57, 191, 231, 13, 58, 76, -198, 65, 94, -266, -159, 270, -130, 164, -77, 56, -55, 157, -107, 89, 170, 160, -22, -31, -95, 18, -93, 171, -105, 292, -32, -54, -2, 39, 75, -128, -203, 44, 121, 79, 154, -31, -129, -111, 271, 155, -211, -130, -51, 195, -326, -59, 154, 123, 106, 135, -214, -406, 98, 32, -51, 220, 96, 36, -291, 66, 109, -201, 69, -348, -52, -134, 160, -254, -218, 86, -51, 10, -89, -62, 67, -40, 234, -212, -149, 295, 32, 129, -29, 5, -27, -159, -146, -18, 132, 99, -104, -14, 65, 280, -126, 148, -127, 62, -156, -7, 101, -1, 136, -95, -67, -91, 46, -119, -161, 156, -1]
7304aJ99j15j15l27K83Q1m6j10L39n6j32K71o30M40q3O4j50q8N1n2J86L0R4q6
7328D7j46M03l61J56mk18J88P8m13j40M30j20M2J21R0r2l5j99N7J74J21J97k40
7351A36n6N3j84J77k09P7p2R2M5k79j43L41k7Kj27J27j8P8K4j32J05J03q0j25
7375i2J9R4o4J18j14k19J65J60J76m82K81j32K8K0m5J29M7Km7J61k65j75K82l3
7399A4J3rj8j11J77m3J79k28k0j2K36m6J70k93k50L33k08P9L8R8l12l8L8L46r6
7424C7O8j29J2k71J75K91p0k10Q7j07K99j18J52l78J69N9k47M3K08rn6k5P0r8
7448d8K27k68J79j11L9J60k88j00K04m40N37j15j71L82l77M45j16kJ15n00K98
7469E0K14l37l6j7L29j24p5K3k11K07l6K26j26l64J02O24n37jr9K29K7Q1j95J34
$$ y = [-1, 198, 83, -32, -359, -76, 5, -41, -151, 188, 132, 0, 271, -359, 81, -2, 62, -88, -176, -125, -177, 9, 39, 133, 47, -99, 304, -57, 99, 95, -123, 65, 143, -270, -410, 20, -100, -58, 63, 153, 61, 26, -173, -116, 58, 179, 376, 136, 80, 133, -51, 126, -83, -6, -78, 14, 59, -220, -363, -22, -49, -47, -174, -47, -65, 13, 37, -95, 10, 113, 33, -92, -73, 21, -43, 75, -39, -258, -93, 67, 243, -239, 42, -90, -62, -42, -87, 42, 89, 91, 44, 205, -60, -235, 47, 14, 27, 18, 0, -111, 66, 23, 202, -26, -46, -58, 178, 132, 302, 9, -241, 92, -116, -37, 1, 99, -213, -251, -213, 133, 37, 105, -24, -12, -283, -108, 183, 113, -97, -10, -117, 182, 64, 216, -162, 7, 66, -181, -138, 70, 61, 5, -20, 50, -48, 179, -89, 90, -21, 18, 178, -110, -210, -6, -446, 91, -24, -195, 187, -190, 255, 139, 137, 252, -248, 50, 264, -73, -109, -126, 203, 79, 4, 27, -184, 23, -13, 213, 87, -277, -175, 449, -88, -89, -188, 41, 68, 149, -46, 88]
7493H8k4k55Q0J69j57J19K28m16J09P3j61L9K74p2Kj45K94p8j61J86j40qk11K44
7517G7m1J88J61l63j4J39j1J9k41L0K94q4m79K72K9P1m9J10j0j90J12j31j09K04
7541a6J07J18l95L41k61L68k87k5M3j4p8P6j62K04m6R5k05O6P8m7K13m96M14j85
7565i4K9R9j40O6J38o4L7l7k07K45O7m62L35O4q9K8o9m9Q6Q2J8J86r4P7K6j78
7591A00k0r5J65j07J65m5j24L20l53J38k97K28n52M97j41L5K48l05K22J4j8l8
7613C7j70K66j91JL24m53K93m18L96n7r8k7J5k9J53N0j46J59k01O7N6%J88l99
7637a84J75M9k71J78K03j23M2N3J65j50k89K16k17K96J3j90j54K50J44Q8l41J19
7659G2k34L66p9j05K12k28l0J46k04R3O5M2k96J47J6P8j12M8R8p6L9K11l04oK68
$$ y = [88, 64, -191, -111, 58, -99, 20, 248, -168, -59, 14, -147, -108, 166, 94, 96, -49, 245, 167, 6, 192, 52, 44, -167, 77, 36, 224, 385, 22, 8, 147, 136, 155, -86, -56, 238, 154, -325, -53, -24, 47, -2, 108, 98, -92, 20, -111, -220, -16, 91, 209, -186, 155, -106, 262, -25, -50, -7, -21, -99, -23, -185, 19, -27, 68, -137, -71, 7, -40, 173, -323, 91, -94, -65, 34, -106, -40, 98, 34, 71, 34, -173, 72, 139, -323, 12, 76, -13, 15, -54, -103, -17, 65, 83, 269, 175, 252, 278, 100, 80, -15, 150, 43, 208, 163, 39, 359, 6, 144, -153, 75, -477, 20, -121, -86, 162, -143, 79, 93, 75, 37, -133, 133, -58, -57, 267, -186, 107, -311, 85, 28, -70, -97, -82, -111, 42, 92, -54, 105, -96, -29, 27, 27, 215, -184, -9, 40, -231, -53, 150, 27, 69, 122, 287, 137, -152, 64, -153, 143, 156, -34, -188, 62, 206, 294, -47, 72, -162, 204, 125, 20, 232, 4, -26, 120, -84, 9, 74, 116, -180, -33, -17, 61, -51, -3, 95, 19, 58, 269, -35, -41, 227]
7684B27m4L0j71N3j67M50l30L3j34K30j53j6J84p3j21N7M8j95j16L65j78Nr2L79
7708B71l61n3M0N1J47n1J14l38K97JP6l34J23J83q9K8r9J38j70J5j79J95K21j79
7732D7j88J74r8J06k77K34P8K9l39J87K3j68K10J1o3o1J82j49K57k65j76M64k43
7755b5q4J38j17J75nk23J95l1j29R8j27K00O6k23J62L4j47Jp1P3L0P0rnj44K88
7781A90l37j59L39j06J59k05J05j8j28K89K91P1m42j50p4Q7J53j36P5j30M4K83
7803B01o2j47Q4l8J28k37J59j14l8K12J20k74Q2j53k32M18k11J41J68j09j50l6
7825h8K36j28r1R0k13jK80J06m8j75K12j90K14j98J79K1p3l98L17j24n5K67j88
7848d8l75K29K31p6j0n2J63j35K35j3k78K21Q8k61K81j17j45K05j11l34M23k09
$$ y = [227, 183, 213, 42, 95, -72, 378, 48, 81, -53, 177, 24, 8, 192, 119, -2, 55, 103, -92, -208, 157, -21, -16, -108, 271, -90, -143, -103, -52, 95, 44, 158, -180, 117, 118, 194, -140, -17, 166, 77, 105, 6, 144, -26, -11, -190, 5, 226, 47, -141, 33, -65, 41, -236, -2, 76, 105, -234, -47, -24, -192, 18, 29, -34, -95, 87, -62, 195, -70, -246, 218, -25, -109, 29, -88, 87, 82, -141, 54, 23, -106, -8, -135, 65, 131, -92, 70, 104, -43, -42, -113, -40, -10, 60, 51, 46, -98, 190, -147, -306, 33, -73, 86, -119, -14, -32, -160, 129, 420, 491, 49, -101, -175, -88, 65, -71, 4, -126, -82, 201, 139, -8, 76, 38, 166, -71, 88, -26, -64, 148, 268, -6, 76, -77, -309, 109, -102, 39, 207, 98, -52, -88, 148, 20, -71, 19, -194, -195, 85, 191, 143, -32, 180, -10, 204, 6, 185, 206, 133, -265, 52, -72, -127, 140, -48, -423, -194, 37, -39, -49, -101, 62, -73, 162, 149, -129, 92, 180, -81, 200, 83, -62, 143, 32, -302, 121, -88]
7870h8J42P3n0J15k06r3P6J90k03o3K62N0m7OK3k20k30M8m5M07j81j23R3R1N2
7895G9n5n1j34K13l88N04r6Kj17K05j65r4j7K98k69K8L43m33K89j33J15n1j50
7918g7k7K43l00J66R0k26p2M1K97o9k0m9k08J0L07l35J33J93J40k46K00k65N5
7941a9L04k48j58P4J69L7k41O8k11L73R9k84moM5K7J47j10l03K61K01k97M8k71
7965b99N22j12j92o2K53k18K14m42M06k10O1pM28l77J19r3j80J75L5J5MJ52j51
7988D1J57k84J85q6j34J63j31j02L45j08J29j91o4K9N2R4k23K03k16j5QL99m40
8011a89R8j3M3J64r0j30J17R5k02j47L74k53N6j35K42j32J06J95k76K44l47K83
8033A03q9j67k5L11j1j28J00j52J07R4M0n3l24M40j3k83J66k58K52j77L41k52
$$ y = [-88, 54, 127, 77, 192, -14, -107, -31, 159, -44, -107, 155, 205, 158, 164, 187, -33, -263, -215, -260, 147, -34, -157, -64, 27, 79, 24, -27, -161, 52, -336, 168, 72, 74, -43, 162, -3, -97, -114, 184, -85, -57, 286, -147, 142, 9, 124, 73, -77, -104, 139, -161, 5, 95, -131, -203, -162, 135, 66, 46, -3, -211, -201, 106, -229, -96, 97, 237, -9, 191, -74, -19, 285, 37, -121, -47, 122, 159, -82, -14, -225, 148, 247, -37, -41, -47, -2, 25, 172, 62, -241, 20, 221, -76, -28, -299, 223, 111, -81, -143, 110, -108, 106, -336, 70, -140, -79, -86, 342, -35, 84, -9, -189, -14, 21, 36, 40, 192, 41, 198, -86, 99, 13, -121, 42, -89, -191, 154, 46, 175, -16, -80, -51, 1, 95, -128, 75, -141, -156, -148, 251, -189, -91, -104, -61, 103, 13, -117, 0, 95, -107, -254, 120, -133, -77, -212, 30, -102, 4, 199, -77, 167, -180, 103, 14, -153, -178, 133, 122, -6, 94, -58, 49, 143, 183, 130, -194, 246, 233, -50, 116, -142, 110, -67, 274, 22]
8055B2L37l66p6N5n19P10k29J76p6k09J26n8n1K83J08pl46P0L3K17j09N8k66Q7
8079c0J38k79Q8J60k30M91m30N1oK0r2J69j20j06K64o3j04J8N3J17j85k7J9Q5
8103Ap0j84J23J39J80k04q5N2L6K99l76k5O1K59k71n9L62J18k19P5l26J11M4j05
8127f4n4N5j33K03o0J40j19K3N3n2J54J62k79Mj98J22K69r5M8O1l69J47Q4k12
8151a10J34m9J12j48k8o0K68k49jJ66K56l03M9n9K19k38K22k45p3K74m8kk85K61
8175F3J22j24l90M62q7r6J87k50Qk6O9k2R3O0o8P1
$$ y = [22, 359, -7, -83, -28, -547, 163, -66, 110, 34, -175, -49, -107, -158, 125, 233, 226, -120, -50, -17, 200, 91, 149, -117, -30, 108, -171, -83, 77, -153, 338, -92, -41, -47, -27, -119, 50, -70, -176, 88, 25, -79, -61, -8, 109, -76, -103, -84, 1, -69, -253, -130, 9, 189, -15, -100, -48, -12, 287, -89, -114, -53, 206, -65, -124, 238, 356, 137, 212, -114, -3, 41, -64, -118, -63, -196, 7, -53, 87, -32, -9, 44, -8, 146, 308, 29, 33, -165, -43, 226, 131, 179, 240, -129, 18, 102, -110, 24, -25, 87, -61, -89, -149, 119, -130, -131, 35, 291, -12, 37, -22, 197, -41, 181, -64, -137, 137, 89, 87, -198, 63, 185, 61, -329, 133, 46, -50, 137, -113, -105, -131, -62, -84, 9, 69, 1, 72]
8191G2
$$ Imaginary data points
##PAGE= N=2
##DATA TABLE= (X++(I..I)), XYDATA
0@%%%%%%%%%qJ6k4L2l2M0m8O4q0R6j20J36j68K06k38K80l28L84m44N08n85O69
31C56p65Q71r86J118j260J417j590J778j988K213k460K731l026L352l702M089
47B148m513M973n481O035o650P330q083Q926r873J0950j2179J3599j5268J7256
61I170j9676K2692k6578L1807l9256N0821p1412J19348m46390k56263O16957L46656
73C37876L12943L0653j41101m11708m18094l35093n2256J70086L71357L90638
83B55301L11656O1556j55266l06967l35688l14168j38176J12148L31528L66663
93A88587K73773R1193r2104k57769l31870k95834j30680Q3839K67983L32572K68683
104C98373J02257p6570k17273k86365k64611j31559N5283K13414K81294K46554
$$ y = [0, 0, 0, 0, 0, 0, 0, 0, 0, 0, -8, 8, -16, 16, -16, 24, -24, 40, -40, 56, -64, 72, -96, 110, -128, 152, -176, 208, -236, 272, -313, 356, -409, 462, -524, 594, -666, 751, -839, 939, -1049, 1164, -1296, 1435, -1591, 1761, -1941, 2148, -2365, 2608, -2873, 3162, -3488, 3842, -4241, 4685, -5188, 5762, -6417, 7182, -8086, 9170, -10506, 12186, -14392, 17415, -21841, 28980, -42432, 76916, -369474, -625737, -8780, 337876, 650819, 681472, 540371, 128663, -289431, -624524, -676780, -506694, -135337, 255301, 566957, 628513, 473247, 166280, -169408, -483576, -621752, -509604, -178076, 188587, 462360, 553553, 461449, 203680, -128190, -424024, -554704, -470865, -202882, 129690, 398373, 500630, 424060, 206787, -79578, -344189, -475748, -420465, -207051, 74243, 320797]
114C20797J18279m7093j83505k46884k28826j34787P321J59105K57297K40817
124B62521J18845k5661j36491k09198k22931j46014m707J35261K18310K15093
134B05028J31795M107j20316j97920j96979j25118j9659R3244J83970K01081J28215
145B87448J1861r3687j60016j72290j26884l6944O9908J55201J77037J27315L4785
156B73734o5728j40518j60671j22007m3032M9446J29011J60470J24237M2528m9287
167A98183j19923j43193j13677m9463L2600J06824J39978J15228N0245l1210r8906
178H6686j25995j07357n3820J8287Q6887J21453J08465N5876j6532q0900j11303
189a8253j00165n6335P509O9273J05325J00380N8336m609o4609r7071r3285n7100
$$ y = [320797, 439076, 391983, 208478, -38406, -267232, -402019, -394698, -235593, 21704, 262521, 381366, 355705, 219214, 10016, -212915, -358929, -363636, -228375, -10065, 205028, 336823, 340930, 220614, 22694, -174285, -299403, -319062, -225818, -41848, 159233, 287448, 299309, 205622, 45606, -126684, -253568, -290512, -220604, -65403, 111634, 238949, 273734, 208006, 67488, -93183, -215190, -258222, -208776, -79765, 80705, 204942, 247470, 198183, 78260, -64933, -178610, -228073, -195473, -88649, 51329, 166557, 216802, 185592, 86686, -39309, -146666, -200486, -182199, -95312, 26141, 134606, 190482, 173950, 93050, -18253, -118418, -174753, -167244, -97971, 7354, 107734, 166070, 161461, 96852, -219, -93504, -150604]
201a50604k268N5187R0172R1114N9466M971n0088q4667q6164n6699q505M2204
213i5881P5725Q2383N9308J2110l9035p1921p7620n5549j4591L1346O4764P4125
225D5164N6957J7399k7559o0796p0185n4430j8201K3071N3424O5452N4623K1415
237A06334j9466n0330o2326n1864k1881J5063M4863N8853N0876K3740j1593m1486
249D0783n5922m8542k2913R067L5720N0593M7666K5231n704l3556m8000m4663
261e0240k5790K647K9533M4650M3610K6208j029k5846m1731m1910k5697j270K3344
274d3521L8559M0222K6525K784k1017l6142l7441k5884m116J7685L3260L5520
286B6434K5823N597j5868l0742l3351k4673q107J2659K8609L3138K4646P360j1564
$$ y = [-150604, -152872, -97685, -7513, 83601, 143067, 148038, 97950, 13283, -72881, -129580, -138085, -95881, -20156, 62227, 121535, 133645, 94610, 22689, -54931, -110480, -125071, -93725, -28961, 45164, 102121, 119520, 91961, 31165, -39020, -93450, -111651, -88580, -35156, 30296, 84919, 106334, 86868, 36538, -25788, -77652, -99533, -84470, -39607, 19246, 70122, 93862, 82269, 40783, -15139, -63681, -86594, -77527, -41807, 8786, 56452, 81683, 75979, 42423, -5577, -50240, -76030, -73383, -43850, 800, 44410, 70618, 69589, 43743, 2012, -39898, -65595, -66865, -43521, -4962, 35260, 61785, 64569, 43552, 7410, -30031, -55915, -60031, -42346, -9086, 26434, 52257, 57854, 41986, 11244, -22107, -46780, -54887, -42228, -13619, 19519, 44165, 51525, 39961]
299C9961k5238l0392k4016r281R438K3972K8842K3478R464p729k2329k6560k2477
312c2867r920N220J8975K6462K2922J0460n689j8613k2797k0509j1214J982J6101
325a9487K3469K0721J1197k645j4588k0879j9425j0994L27J2595J9902J9529J1505
338C1227p02j1788j8531j7600j0657j179R166J6968J8480J1647J018r357j5720
351B972j5831j1060k361O871J4877J6272J1886J852o943j3340j4988j0897k525
364b3215M833J1827J4395J1625L408n073j1807j3204r918l730L425R803J2918
377E287J1166M444m155r830j1394r847m438K435Q536J0935J0393N043k498q564
391G513j0519q927m653J579O292J0112R322N680j806o477r809q276m732P47N427
$$ y = [39961, 14723, -15669, -39685, -48966, -39528, -15556, 13286, 36764, 46228, 38499, 16170, -10390, -32867, -42787, -37567, -18592, 7870, 30792, 41252, 35563, 16950, -5847, -26356, -37570, -35588, -19487, 3982, 24703, 35900, 33255, 18667, -2212, -21637, -32631, -32304, -19709, 193, 19722, 31227, 30525, 18737, 206, -17394, -28051, -29230, -20064, -3096, 15384, 27031, 28049, 18692, 2972, -12859, -23919, -26280, -19409, -4532, 11740, 23626, 25478, 18535, 5195, -9793, -20690, -23215, -18382, -6555, 7840, 19465, 22873, 17800, 5993, -7211, -17129, -20859, -17434, -7631, 5287, 16453, 20897, 16742, 6912, -4482, -14329, -18767, -16332, -7796, 3139, 13532, 18575, 16077, 7513, -3006, -11933, -16586, -15007, -8715, 1397, 10719, 16399, 14593, 8116, -1693, -9969, -14701, -13954, -8527]
406h527Q593Q327N501J8n565q290p927m557l17M131P300P915N532O88m434p165
422A223p575m622q24L317O558O619N377J577l308o076o978m826p61K549N213O204
438C667M799J976k299n213o232m761j637K138M450N669M468K377j864m111n761
453b334m709j437J367M080M623L943K342m79l950m734m533j621Q09L441M071L636
469D515K365j31k699m736l725k229M57K625L941L589K143j58k088l833l486k848
485f298M77K343L061L635J927K44j689l245l583j898l14J596L257K771K530O85
501E499j734k806l086k509j28J339K694K587K143O13j401k018l064j754q00J196
517c229J796K610K265O18p57j804k726j981q88P17K018K118K080Q52m30j569k189
$$ y = [-8527, 66, 8393, 13894, 13912, 8347, 57, -7870, -12427, -12744, -8613, -1313, 6602, 12134, 12822, 8388, 1223, -6352, -10974, -11798, -8481, -1923, 4696, 10073, 11650, 8342, 2266, -4712, -9538, -10299, -7750, -2537, 3667, 8466, 10442, 8143, 2930, -3302, -8063, -9700, -7562, -3112, 2557, 7025, 9402, 7538, 3427, -2334, -7043, -8480, -7113, -3033, 1590, 5533, 7875, 7396, 3446, -1288, -5821, -7442, -6633, -3192, 879, 4515, 6880, 6749, 4050, -686, -4411, -6640, -6183, -3558, 383, 3972, 6115, 5957, 3869, 36, -3450, -6298, -5821, -3478, -417, 3218, 5145, 5389, 3700, 455, -3128, -5026, -5340, -3744, -487, 2284, 4814, 5499, 3765, 959, -2127, -4636, -4764, -3425, -731, 1856, 3999, 4612, 3211, 1193, -1871, -3625, -4425, -3229, -1433, 1177, 3442, 4060, 3303, 1499, -1227, -3208, -4096, -3379, -1361, 757, 2837, 3689, 3259, 1690, -499]
534d99k207n98J58J445K247K229M48m16j251j839j657r04k78J520J903J874N46
551B721N2j150j781j426r40j93J113J722J518J037p8q40j489j620q86k60P58J389
569c53J230J236J74o52j155j465r00n61P28J415J139Q32N79n94r26j350j010o26
587b259R29J255O74P65O49n27p44j251r64n12N27R29J192M72L73j15q12r99n12
606i30o30J40R96Q57O26M47L7r82l61j065m54n3R89K19J132N86l32k14r24q17
626g33m30MK69J003N81L56K76q24n00m37m82k95K59P04O11Q64K0l17j082j65m17
647g35p6J6O99N64K88L15l86n71l30m68l67L10N85M50K80L48l82m24k24n31L7
668f02k39O04N19L26L24l20k47m76k62l57j8K75O77K64K04K64l59o45k45k52j28
$$ y = [-499, -2706, -3304, -3146, -1701, 546, 2775, 3223, 2807, 1556, -283, -1940, -2844, -3122, -1602, 301, 2175, 2721, 2773, 1623, -158, -1584, -2524, -2717, -1604, 118, 1636, 2673, 2595, 1755, 266, -1354, -2240, -2500, -1742, -353, 877, 2113, 2287, 1635, 480, -985, -1885, -2446, -1718, -303, 836, 1668, 2247, 1653, 727, -623, -1633, -2259, -1330, -75, 599, 1364, 2013, 1486, 742, -509, -1473, -1985, -1458, -529, 663, 1135, 1508, 1393, 581, -418, -930, -1560, -1420, -424, 433, 1059, 1506, 1543, 561, 200, -865, -1319, -1372, -383, -164, 968, 1554, 1222, 1008, 84, -733, -1163, -1159, -890, 113, 694, 1050, 1326, 502, 2, -435, -917, -1212, -953, -249, 362, 1226, 1246, 929, -153, -318, -735, -811, -795, -96, 468, 756, 1071, 685, 114, -216, -684, -1051, -741, -156, 294, 574, 922, 540, 116, -108, -639, -602, -841, -237, 282, 608, 932, 612, 365, -111, -373, -730, -748, -473, 204, 468, 672, 936, 577, -68, -313, -565, -693]
689f93K50L87L36L71j59Q4m68l61k83j53N9P55K07J16p4K37k98n94j58j56N25
710g0P0L59J89k19J03j82n31pj92JL97L74n1K54l11k6k42k70k40K82J51J23M70
733D32O8j45j96l69j25Q9k67K97J50N62k48J21j53j52n8k01l6N7K96Q2O1m7K19
756D37n82M8k40L8J94L24q4K21k24J62m27j68K97j61k9M1J99K9K92n1m35K4k03
779b98j76J04J81J22K47J35k34J61k50l30o4K12J8K87K32k08J02l27J59n41N11
800D3k01J47j99N51l18J12r3l53K62j95J88K06m26M30pj88K29J01k83n99L83J30
822h0J45k50L45j60J80k34Nm31L02j40K14M05k32K15j27k1k84J58k22K26j08j16
844b10N89l32k75M14j91J28l34K12L0k0L4k4m7K2k6j63K12j49j34J12J16K84j33
$$ y = [-693, -443, -56, 280, 651, 492, 576, 108, -253, -536, -689, -630, 125, 332, 448, 374, 611, 313, -281, -439, -595, -70, 0, 359, 548, 329, 432, 250, -281, -288, -480, -479, -82, 292, 241, 495, 184, 158, -84, -354, -594, -312, -161, -38, 432, 500, 355, 159, -210, -335, -246, -513, -216, -66, 496, 248, 369, 216, 64, 6, -195, -231, -174, 122, 204, 265, 218, 437, -145, -97, -337, -299, -105, 219, 135, 356, 132, 294, -133, -301, -4, -165, -194, -153, 46, 75, 367, 316, -119, -95, -298, -474, -370, -189, -67, 180, 315, 81, 242, -8, -338, -402, -190, -172, 115, 347, 139, 241, -86, 73, -468, 43, -158, -11, -210, 341, 23, 135, 42, -311, -49, -244, -56, 150, -276, 154, 147, -41, 188, 289, 6, -593, -210, -80, 65, -185, 160, 0, 180, -54, -49, -480, -178, -318, -104, 301, 69, 284, 157, 136, -148, 10, -212, 14, -94, -210, 379, 47, -228, 186, -5, 123, -211, 1, 31, 11, 45, 21, -26, -4, -30, -193, 19, -130, -264, -152, -36, 248, 115]
867A15n0l37J47J56k12J73k61J38M79n93M58j20l57P8J26jJ54J3Q0j52k2J98n95
890c85M07k4j42J81k9J09m31N46k74K15m48J77k0J07J23j58n8K7K30p5k40J9K04
913F1j01N2m1On1n1n5M5L7J76m4J51j16l49M20P4j11k5jj02m0J92j36k90L29k13
939a83K93m0k91L20J36l74J70l37L50Kj13j46K20J15k65l28L36L65N0m19p4k78
961d91J28M69q4l5J57l87P2K45O5l3j18j98J84k65J75J59om4J69j08m00J79o5
984b32K04rQ0l1kr8rN0j31J19R5j85m0N59l28R9K1k21j54R7J81j48j67K73j8k5
1010b0j38Q9j31m1L31K27l10o3J17k33K42j08%K93k07kj28J10r1J01j4q6L77k50
1034F5k17K18J01j04nJ92j22l73J90J11P6k29K47N0k11k72L19P0m7r2q2o2J8K14
$$ y = [115, 65, -272, -125, 31, -181, -8, -269, -131, 348, -245, 213, 93, -264, -186, -60, -61, 93, 106, 186, 34, 12, 210, -385, 22, -2, -144, 37, 8, 117, -314, 232, -42, 173, -275, -98, -118, -11, 112, -46, -104, -77, 153, 78, -162, -143, 61, -40, 12, -29, -23, -74, -125, -180, -135, -98, 78, 34, 185, 69, -280, 140, 214, 103, 78, 77, -25, -65, 127, -9, -299, 30, -183, 110, 70, -221, 99, 235, -139, 31, -306, 44, 46, -67, -213, 7, 122, -143, -471, -135, 230, 280, -139, -213, -491, -363, 106, 22, -13, 144, -243, -171, 74, 139, 106, -12, -210, -26, -291, -116, 43, 37, -7, 162, 54, -346, -167, -232, -28, -37, 43, 12, 10, -88, -97, -47, -178, -59, 36, -149, -189, 370, 42, 141, 162, -59, -213, -116, 65, -83, -250, 23, 5, -20, -158, -69, -200, -241, 90, 317, 7, -56, 61, -172, 70, -38, -38, 255, 48, 46, -82, 28, -63, 38, 24, -62, 315, 65, -152, 66, 167, 63, 58, 250, 128, -245, -55, 56, 132, -97, 150, 200, -11, -283, 36, 106, 59, -33, -115, -177, -159, 55]
1058E5k11P8J78l22M33l00kk14l0L38J06k8l95L76m6p3J39l13K38n9LJ09j77J83
1082F6N8k72J30k10L64j90p1J67r0R6L9m2J98l20J79j53Q8n2j7L56m17K1Q3K23
1106B34j09k74o2L14J38k45q7J01Q1j11J02k23K20k58N0J70p1j05J25r0J14j96
1128a82N0K39k85J37j66L82n3m0N5P0n9m2j48K19j28j97N8J05J16jj36l46K8K99
1152b5J19k44K19j08k1r4J83k58K57K4R2M5m24J86J51j20p1J19j63L4K27j86L02
1175B44j18j52k94L77j06J20L4r4J53R0m05K51K84m53K61m96K86m9P7m6J07L3
1197A04L1j12J13J5j28l35L62M5j62N7r8J79K6m03M03j17N5J26l02K12q8k27k8
1220b72L58j86j5M56l22K73k71Nj99L49n70M73j12n5J94j1j11m1J33q5K49J3j61
$$ y = [55, -156, -78, 100, -222, 211, -89, -91, -305, -335, 3, 109, 81, -314, 62, 16, -57, 82, -231, 7, -52, -49, 60, -117, 66, 124, -148, -18, -228, 136, -54, -125, 42, -48, 48, 87, 45, 243, -77, 102, -51, 37, -15, -32, 324, -93, -72, 11, 234, 125, -149, -211, 103, 241, -4, -91, 10, 91, -20, 82, -141, 79, -179, -129, 41, -30, -135, -10, -100, 14, -182, -132, 107, -178, -41, -207, 175, 122, 82, 137, 207, 148, 106, -42, 177, 49, -148, -90, 15, 131, 130, -6, -352, -324, -25, 94, -150, 69, -39, -60, -154, 29, -229, 28, 52, 144, 189, -235, -49, 102, -18, -89, 30, -133, -99, 128, -58, 244, 126, -26, -320, 57, -49, 71, 105, 11, 164, 254, -151, 100, 384, -69, 192, -304, -18, -67, 10, -36, 71, 104, 135, 23, 136, 151, 23, -312, 50, 95, -67, -10, -108, 71, 97, -306, 97, -20, 35, 161, -141, 71, -17, -244, -272, 86, -100, -115, 341, 19, 292, 21, 26, -173, 176, -394, 79, -33, -88, 106, 95, -16, -57, 76, -9, 240, 253, 92]
1243I2O1j91J27j7O1n8k0j46o5O5l8L40m37J50J05K2m3J36l81O6K48k41L95j7
1267B14R4l04J88k47J57j71j31J71J54J07l2r5k3k30J22J55k76M6K79m2k79n1
1289a94ML12j89j40p1K02j30L15j03j16M06k60J1Q5k30P0J5P4m4J83k82M1N2k8
1313a7J7j23M7K63m57J83J18J52l47J19P6MJ05j49j29L44m16J04K37R3k16P4k14
1336a32n9K31PL4J8L5k22j60J91J8Pk0J64p2m9k8k2k7J8J54o9J16j69ok01J44
1362i9M0K03l0r1K41m24J86J15k12Q5K00r2j28lq7J54j78K89j27k19J05J13j41
1385a00K07k08J14j71N4Q4o5L86k91k68N22l47O1O7J1J6j06r6J72j35j3M15j55
1408A54k96J72j05J12J36l13L4N1o1K0J17Nk83K66j35r3j21M72n2k50kq4K69j23
$$ y = [92, 153, -38, 89, 72, 133, 75, 55, -91, -156, -91, -129, 211, -226, -76, 29, 51, 8, 144, -237, -171, 77, -164, 231, 214, 308, 4, 192, -55, 102, -69, -200, -29, 125, 232, 200, 105, 82, -148, -26, 129, -147, -101, 178, 136, -143, -194, -190, 122, -67, -207, -278, -76, -206, 109, 6, -110, 296, 36, 47, 132, -98, -28, -13, 61, 17, 200, -82, -41, 11, -17, 0, -123, -76, 187, -270, -87, 31, 183, -164, -45, 31, 35, 140, -9, -138, 206, -210, -106, 131, 224, 8, 82, -132, -191, 40, 47, 81, 99, 134, -88, -248, -57, -39, -32, -52, 112, 40, -9, -37, -59, -86, -68, 86, 17, 133, -36, -42, -243, -99, -59, 144, 114, 23, 264, -160, 26, 141, -71, 14, 214, 122, -6, -9, -96, 58, -120, 169, 42, -177, -72, 41, -100, 107, -101, 13, -158, -104, -20, -85, 301, 10, -258, 264, -83, -22, 45, 56, 72, -34, -130, 42, -93, -106, 309, 154, -142, 30, -75, 37, 173, -140, -106, -55, -116, -96, 21, 26, -257, 9, -126, -219, -340, 132, 80, -170, -172, -256, 13, -110]
1432a10J45m2R1O4p9J94k30Q0N8j04m38M35j54J76P3j45k3K02k82N6J44j64lJ8
1456c8N5q8j75K49J8q9O5K78l25j34L16rj68k46L24j01J77M5q4j96Q4J26k41L0
1480a27N2O0J6j18L35k90O6J9j13J38J8J26l00J06J18m50L16J00p7Q4j51j77L61
1503A12K4pj68n6k8J69m5m8l9J06j2q3k4J77N4l08K54J4ok26K93k37K93j51K6
1528H4k8k63K32jj91J60k8K28k07J87l06K39j86K4J5j86K49J08j62J11k04J49
1550B4K07l21K39m14K95J21k34J24J0m7J43l06O8L4l9J08q8j7K29j42p1Q8j5K00
1574A96k88K61K19n52J45J40j00k61K01O0K6j13q7L09q4n6k25L58k35k9K60j32
1596A3J20j79O0j10m7K5M9N3j64J70r8L1ql4L4j4J46L33l02j80J70J71j68j33
$$ y = [-110, 35, -7, 84, 148, 69, 263, 33, 113, 171, 67, -371, 64, -90, 86, 159, 14, -9, 193, -89, -33, 111, -53, -56, -38, 17, -71, -246, 3, 21, -68, -3, 275, -50, -184, 132, 123, -45, -291, 33, -68, 109, 154, 70, -126, -42, 84, -157, -127, -75, -15, 1, -117, 218, -72, -6, 13, -100, 38, 56, 182, -118, -12, 106, -344, -28, 72, -5, 79, -72, -249, 112, 136, 129, -39, -95, -123, 46, 1, -47, -86, 20, 8, -75, -99, 78, 132, -176, 78, 92, 86, -140, 153, -84, 209, 58, 84, 56, -207, 25, 24, -167, -7, -35, 193, -14, 173, -133, 106, -80, -56, -41, -227, 22, 130, -32, 79, -125, 24, 231, -90, 149, -265, 30, 151, -83, 41, 51, 4, 147, -159, -91, -57, -96, 12, -76, -93, 136, -6, -77, 11, -4, 196, -92, 169, 388, -164, -19, 121, 21, -240, -39, 21, 47, -66, -153, 156, 72, 16, -209, 149, -86, -115, 145, 13, 133, -46, 14, -96, -143, -118, -69, -16, -180, -10, -108, -77, -85, -119, -85, -99, 47, 380, 78, -102, 68, 239, 71, -62]
1620f2K05m2J4o3J31k68J79r3K07k66j21J55j80K77k88K81l33J72J28l0J95j28
1642G0K25k96K14j65k1j31O3j79K71j43qN0J21l09P5K05N1k96J88j54L18k30L8
1665d3O1l5O4J14m8k02K9M1L10j16n4j34n5j90J54K05k60K25k20J23J4Mo9k40
1689c22M75k66J22j67J22L75l92K4m4K27n44M18j70J01j05n3M79l71J91j10j71
1710a81L71j39k7K18l91M18j49l62J80J62k48k6K19m1J33j11o7n6K8L32l95J62
1732C0K06k24K03m9j43L1k39J21K12N7k72K9K63l65O5K90k47P5m2q1kO4Q4k12
1756a46j14L32k89J48K26k50M10k51l5M7j27o8J84P9O5j38J8l65L99L6k72R4k72
1779b89M85l00P9K63j29j99j06l6K10j91L42J98m28l0J99q6O7J33j64L3M8j52
$$ y = [-62, 143, 101, 115, 52, 183, -85, 94, 1, 208, -58, -179, -24, -204, 73, -215, 66, -267, -95, 33, 3, 198, 70, 295, -1, 213, 48, 27, -104, -41, -220, 51, -92, -100, -50, 71, -238, -163, 42, 93, -203, -15, -169, 149, -81, -43, 18, -17, 47, 161, 113, -89, -60, -19, 291, 175, 121, -13, -68, -258, -104, 101, -159, 66, -154, -31, -17, -13, -82, -322, 153, -113, 9, -158, -36, 339, -53, -29, -73, 154, -390, 28, -142, -41, -146, -199, 280, -91, 100, -10, -181, 190, 51, 24, 242, -149, 269, 120, -242, -62, 100, -148, -174, 45, 4, 137, 26, -41, -97, -69, 263, -132, 30, 236, 12, 215, 166, 23, 54, -185, -64, 148, 205, -67, -38, 225, -140, -75, 215, -32, 43, 1, -80, -82, -18, 66, -146, -260, 72, -217, -69, 157, -93, 317, 66, 31, 78, -49, -117, 67, 146, 211, 73, 91, -274, 125, 161, -111, -17, -289, 196, -104, -25, 238, 109, -90, -196, -232, -22, -213, 129, 327, -101, -131, 68, -18, 49, 182, 18, 51, 99, -53]
1801e3L2k91L11J12k06jJ5j22j2O5K06j03l4l39M83O0l22p0M96k34q1j76J81o6
1825a49J90j06K07k68O1J1J33j71Q5N2m7p6j46J72Q3R8j79R0m86M70qQ1l4n3j24
1850a14m5R5J11m6J8Q7k72L32j87M9o5k15L29L2K98l08O0q5k88M45k7k90J49j1
1874E2P9O7j81k25Q3J28J2p6l59J56%K44j5O9l1k81P5L36k2j76j18j9J11J06j69
1899a54l2k00L52L7j7m8j21J70L9k55K81J06j3j86J3M12l20m8l09M65l2k52O0
1922e2j44Q8L07j77p6K53l79J11K66l94K42m12L11P2Q1j70K43Lk10L35l63l04
1944c69N7M97k64m2K19k55L48m40PL6L79l49L69j50r7R2R4k11J16K7j43K13l24
1967a90N5L22k9j06J2N2%j13k95K74N6o1j1q7M6O7Q7k94K90k71J92o3M7r5K7J69
$$ y = [-53, -21, -312, -1, 111, -95, -96, -81, -203, -215, -150, 56, -47, -81, -420, 63, 123, -199, -269, 227, -7, -88, -264, -83, -149, 41, -65, 142, -126, -65, -54, 79, -92, -7, 45, -2, -78, -224, -52, 31, 129, -50, 40, -446, 24, 16, 97, 63, 10, -114, -159, -64, 47, 1, 19, 106, -166, 166, -21, 28, -37, -252, 77, 109, 407, 99, 159, 74, -214, 231, 204, -86, 63, 52, 131, 198, 17, -208, -125, 3, 15, -61, -420, -264, -264, -20, -35, 34, 3, -278, -203, 133, 111, -65, -183, -202, -91, 15, -154, -186, -386, -34, 3, -14, -62, -183, -13, 26, -229, 52, 158, 145, -41, -28, 384, 64, 16, -293, 172, 140, -112, -52, -196, -108, 199, 22, -54, 199, -180, -69, 197, -197, 45, -367, -56, 16, 97, -73, 170, 173, -37, 298, -65, -369, -312, 185, -79, -121, 98, -157, 191, -249, -242, -206, 173, -176, 193, 43, -54, 38, 132, -79, 37, 64, -79, 134, -190, -135, 187, 158, 52, 64, 116, 116, 3, -292, -18, 38, -23, -34, -121, -75, -8, 79, -215, 75, -196, -4, -67, -20, -115, -88, 81]
1993H1l30J22q9L81k46L7k8J42j92L64m44K55L7l38N78l05k1j62J50J36o6J02
2015A64l47K1J14J85M7j47J27m32L73Q6k60O8J7J83j24k01J55p6Pk9J68k00J86
2038H5k71J4J37lO5J74m3Qo1Oj83K29Nk67N7L2L30m99P7j72O9K30p1j97M2K60
2064E3j7k72Q7P0J22J04M6k01j55K95j18j20K57j17j40N8L6j17L41k28j34J37
2086a3K26N4j88K23l92o9j14P1r7K34o9l5N6J54j21J19j55nj23L75q8K2j65R7
2110cj20Q2o2J56J52j50j23j53K54k05M05j09J46j86Q2l86K5K1K25J72k29k8J78
2133A44j37K00k71O3j6j48J35nJ29k04J05p2p8M60l81J16k5j56j42K61L91m09
2155d0J99r9k00J9K0j33L07O8j97l7J07J74k61P8J2j7j93L53m9j15J07j02n7K37
$$ y = [81, -249, -127, -216, 165, -81, -44, -72, 70, -122, 242, -202, 53, 90, -248, 330, 25, 4, -158, -8, 128, 62, 164, -183, -162, -48, 137, 184, 37, 164, -268, 105, 191, -69, -1, 16, 199, 75, -126, 29, -47, -40, -69, 99, -101, 85, -186, -172, -35, -38, 27, 201, 158, 166, 105, 111, -72, 157, 162, -105, -48, -16, 314, -185, -108, -280, -211, 19, -52, -249, -207, 53, 36, -236, -149, -79, 43, 147, 193, -8, -163, 132, 14, -106, 151, 34, -106, -48, -12, -129, 212, -16, -150, -13, 213, 267, 79, 302, -90, -159, -273, -202, -299, -65, -134, -169, -113, 41, -80, 39, -116, -121, -244, 131, 43, 65, -100, -3, -123, -41, -103, 53, 205, 55, -68, -221, 33, -172, 233, 124, 270, 84, 166, -220, -195, -174, 51, 223, -6, -34, 144, 7, 207, -64, -1, -17, -165, -30, -35, 94, -110, -5, -77, -155, 305, -76, 40, 15, -141, -283, -22, 369, -40, 159, 60, -140, -121, -101, -234, 73, 141, -56, -93, 14, 188, -73, 5, 17, 0, -193, 160, 111, -4, 103, 1, -56, 181]
2179A81k08j70L45N1k6PJ34m18j05j46K35J91j55L57k98J75k61J59J09m34K25
2200e2K87j21m0J6j28J34k59J72J02J37j50O1l65Q9K10p3j6P9R9l23J85j13J20
2223E1J63k03O4k16N1L40k60k24L43J18k20j5j6j26J49K88m62K00j54r0O66n24
2245g7j93M07L1m3q4q0m7J00K84l97M10m04O9L3j02n0P2J84P2l66nJ91O6n26M32
2270b3J78r4Q4k02Q2r9Q3k28L29j49k1j0M4M36m17q0J6J78j35p3OLK15%p6k02
2296a55J54N3k18J09J19j77K00j12o5M3J16J46n9m7K13m16R5j0o0K7J26M6J06
2319B34m97K69k15K61n9j18K3L6p5K63j5j42k73M31k94J81l0j20K7N4J2q9N21
2342C85l09N3j25Q7k44Q3j6q7L53m50L1J96JR9k17J82j13J6J15J04K5l17J92J3
$$ y = [181, -27, -197, 148, 199, 173, 180, 314, -104, -209, -355, -120, 71, -84, 273, -25, 150, -111, 48, 157, -277, -52, 235, 114, 74, 90, -38, 96, -163, 9, 111, 248, 98, 159, -206, -117, 93, 20, 4, 83, 182, -141, 44, -69, 51, 214, 11, 75, -141, -90, 250, -10, -234, 109, 227, 7, -8, -24, -150, -1, 287, -175, 25, -129, -219, 447, -77, -270, 137, 168, 125, 41, -39, -86, 14, 298, -99, 311, -93, -24, 9, -93, -143, -71, 113, 185, -181, -186, 5, 71, -455, -23, 155, 61, 145, -57, 25, -74, 9, -219, 110, -39, -60, -70, -26, 410, -7, -87, -71, 107, -28, -101, -95, -92, 123, 123, 47, -155, -1, 52, -166, -57, 62, -115, 85, -27, -92, -49, 67, 213, 154, 107, 320, -96, -1, -11, -71, -44, 82, 128, 234, -263, 6, -209, 52, -7, -125, -102, -66, -141, 122, 107, -35, -308, 123, -171, 10, -20, -140, -113, -59, -47, -136, 385, 76, 129, 4, 91, -153, -70, -86, -173, 180, -270, -239, -43, -42, 57, -160, 22, -91, -75, 40, 144, 169, -148, 44, 57]
2366E7J88j77R7k47K3O6j28n6K73j82m1J83j35J68r2j33L0l0J98m5j75O5j54J95
2390e2kj18J25J39r6J1jq9K22k13J86l02j0J86n6m1J81m55O01j93n6l85K03J78
2414c7r5K23j10K54j59k32J19k4R5j58J17j05PL34k01j67M8j25M18k04q9QJ99
2437A16P2m23J06J8R2K99k95J93j33j09JJ35P0k31r0K25l86M07k7Rj44J37L1J9
2461I2k82L20j39J37j63J16J33m93J48k96O53l32K59k4l6j17k01K79P6k65L1L0
2483g4J84p1K48l11K44q5l54M96l56K13k12K38j00j24Kq6J08J0k1j9P9J51n7j84
2507h1j66L77m9j23j07J53K78m50J52J5j0k3R8j80K0k0j2k04M30K22k52RM5p6
2531D6L1J7j14P9J0L14k87l06J05J16J49k65J01M3J52K31o56K27n7L80k41K28
$$ y = [57, 245, 68, 165, -82, -59, 7, -121, -177, 96, -86, -127, 56, -79, 89, -3, -136, -106, -136, 62, 17, -158, -93, -247, -52, -54, -172, -47, 92, -4, 7, 6, -83, 139, -74, 112, -190, -200, -14, -70, -111, 70, -385, 216, 23, -33, -418, -215, -37, -132, 91, -19, 235, 76, -156, -37, -61, 34, -124, -7, -112, -105, 229, 28, -139, -91, -216, 202, -2, -91, -83, 116, 188, -235, -129, -111, -19, 280, -15, 178, 45, -64, -63, 72, 142, -89, -179, 46, -340, 67, 40, 49, -95, 42, 73, 92, -190, 130, -9, 128, -35, 81, 214, -279, -131, -427, 226, -106, 153, 129, 93, -24, -225, 54, 130, -135, -104, -74, 110, 39, 287, -24, 220, 135, -219, 277, -79, 134, -78, 160, 60, -64, -62, -148, -40, -30, -51, -70, 9, 160, 103, -81, -247, 130, 81, -42, -149, 4, 282, -168, -16, -1, -11, -34, 64, -116, -96, -116, -128, -332, 98, 320, 68, 77, 122, 46, 77, 94, -20, 59, 69, 383, 96, -210, -105, 11, 160, -105, -4, 39, 191, 422, -234, -7, -64, 316, 75, 303]
2553C03n75N38k68Oq8j67J60Q4L25m40L74l40k26K80R9j58%J55n1pj28L66l59
2576a17O3l6L34l05ML5p8J07j41L65j35J39l37j0J6r7L38q5N2k1k3j08p0p7M58
2601B71j01j89Q8o2q1L5m5j38J00JQ9J29j86K34k14N9Nj40K36J43k59K4K00k02
2625cp4L11j20m9m3K03m47J77L14k39k56L27k39J16J09J30j23k39O7J56j78p7
2647a77K19l5P2r4J09j1k62K90J3k18K83j33j03K09K12p25K93KM3kK63l23R3j42
2671a24J73p4j19M4k17L37M8J99k56P7p0L86n80J56J15j94K24q4K8j04K54k19
2693@j80N22p4l41M04l60k23K38j58J39J70l1J76l76n7J7Ln7N9k7K08J09j4j87
2717d0n8n6L1J84j16J14L7J01k05m1J6R8J78l41j04K60J10k45J91n6J44m73N51
$$ y = [303, -272, 266, -2, 4, -84, -251, -91, -7, 318, -122, 252, -88, -314, -34, 65, -93, -93, 62, 11, 4, -124, 242, -117, -54, -90, 244, -61, -57, -22, -100, 7, -134, 231, 96, 235, -102, -112, -96, -193, 145, 60, 112, 91, 68, -40, -110, -187, 271, 170, -19, 69, 7, -74, -39, -84, -222, -122, -121, -32, 97, -89, 145, -69, -10, -5, -145, 91, 234, -25, -1, 199, -3, -77, 234, 114, 65, 22, 225, -222, -45, 269, 30, -226, 101, -138, -22, 87, 217, 94, -145, -78, 78, -100, -177, 42, 7, 79, -15, 94, 83, -179, 111, 124, -94, 189, 56, -47, 162, 374, -351, -58, -56, -13, -15, 248, -75, 18, -124, 49, -25, -144, -100, -317, 20, 68, 267, 11, 88, 18, 404, -176, -20, 95, -99, 125, 41, 69, -35, 219, 0, -180, 342, 268, -73, 331, -29, -252, -14, -172, -33, 137, 106, 282, -94, -151, -134, -131, -188, -129, -156, 52, 161, 147, -40, -98, -154, -123, 61, -55, 59, 96, 197, -8, -49, -33, 65, 243, -98, -202, 58, 168, -77, 114, 58, 202, -271, 280]
2740B80k52j93K32j24O4J36j5r3k61L15J18l44q1J80K83k48K79L6j06k50j85J99
2762c0k7nj62K95k69J98J88l02L3j22J04J62M0o7n9j21J25L2r1J02n5m6K44M1
2786B08k79n9J55l3P6O4j37k26P7o3J92j34P5J67M2j55K44j54J44nk72K84j22
2809H9j01j9j84K21N5oJ32j70K32k6M2k11k83L55j87r1K35j76J31o2m2K12l74
2832b28J24M2K76j90K6M2pk33M14l57R6J23j02k60o6K28j54R5K32n9L5j13k48
2855b84J57N8K44q4k01J28j78K36r7R1j16K90j34O3j86P7p9J5J2j9J39J41l83
2878a10rK16nk99M00j97j56J7O5M24o43M05k84r6K54r5J07J36j32J85j57P3K52
2901C51k32o1N4j39K89l28J98J8j42M6o0J2o9J61j47J74M7k80K44j89J5m5R7j39
$$ y = [280, 28, -165, 67, -57, 7, 143, 128, 35, -226, 89, 207, -137, -218, -38, 245, -3, 276, 312, 206, -44, -229, -30, -57, -62, -224, 71, -198, 0, 188, -114, -81, -203, -99, 63, 103, 36, -23, -144, -19, 13, -78, 24, -31, -77, 167, 208, -71, -130, 25, -8, 68, 132, -5, -231, -154, -217, -25, -159, -84, 83, 125, -30, 214, 60, 204, 199, -73, 211, 89, -12, -31, -215, 6, 61, 55, 187, 17, 249, 223, 265, 54, -229, 126, -61, -152, 83, -93, 38, -24, -66, 146, -228, -104, -62, 214, 24, 50, 92, 85, -148, 266, -91, 5, 128, 26, -234, -300, -72, -226, -131, 101, 42, 77, -36, -284, -127, -69, 175, 91, -110, 18, -160, 76, -21, 70, -46, 244, 110, 173, -13, 64, -15, 0, 12, -7, 132, 273, -110, -119, 97, 92, -207, 193, -4, -160, -143, -78, 346, -297, 108, -176, -272, -18, -113, -6, 130, -2, 183, 26, 99, 351, 119, 58, 112, -27, 262, -66, 132, 150, 8, 54, -6, 6, -63, 98, -49, 125, 172, -108, 136, -53, -38, -83, 14, -125]
2925a25l8J21P1L6j21l7J75j22Lr1M3L97k04J13j90J5l04J33J8p6M10n41K98k70
2949b86K36l1P7J84l80M55l28O7j14N08m25j91L04k41R3N10o67L99j23j39J23
2970C1O8j3o7K25m51M12k88N72m61M1k58J27o6l2M25k65M5k9k93Q9M85k89l5k14
2994b41J44j08K20N2k0N5m86M74k0l0J90j49J6M3r0n7q7M6K06p4M0l24K95J08
3018B03J48m46K16j21PJ92k78J25J5r1J46q4L18l28MK9J6o2k7L0j97J17k02K89
3042A9j92K61J19k50L66r1m20J33l9R3M6Pp0j38J57J39o1M1ll36J55J50l0o3O2
3067E5k15K38jJ60k78J92l22J63M8m3j07J3pN7k26L60p8J32P7m5k76L6R9J65k6
3092A71k96J49J36l8k19J65j85J99l13N14l48J74N4nj29KJ94l17j5J2J65q3l02
$$ y = [-125, -163, -42, 29, 65, -56, -93, 82, -40, -37, -128, -85, 312, 108, 221, 31, 46, -258, -125, -107, -183, 227, -314, -16, -286, -50, -81, -4, 180, -200, 255, -73, -6, -120, 388, -37, -228, 76, -165, -72, 438, -229, 170, 47, -92, 31, 99, 86, 19, 244, -207, 205, -83, 489, 28, 69, -189, -62, -128, -160, 265, 0, 45, 16, -277, -188, 297, 8, -27, -241, -97, -205, 15, 67, 47, 102, -384, 90, 70, 40, 230, 81, 97, 140, 50, -7, -94, -48, 158, 84, 124, -200, 95, 203, 351, -95, 121, 0, 7, 199, -79, 46, 61, -30, 116, 32, 350, 22, 26, 55, 71, 9, -18, 12, -185, -68, -270, 19, -173, 88, 207, -43, 323, 232, -188, -55, -94, -1, 45, 52, -18, -156, 1, 140, 79, 120, 117, -219, -64, 86, 56, -7, 55, -160, 78, 77, 237, -41, 151, -171, -8, 40, -3, -110, -97, -104, -47, -273, 87, 9, 141, 218, 173, -103, -67, 32, 197, 171, -125, 24, 160, 122, -97, 68, -117, 82, -231, 283, -65, 109, 163, 158, 29, 31, 225, -92, -107, -95, 70, -13, -315]
3115c15M62k13j4K69J48m42K62l74M39l40K8p2K64j37J78J90l66J3K32m34K85
3136F3J39j71M5k36M46k76k16L51qj65O4R1Ll44M06j2J14k59j79J32L36l19P9
3159H4Mj24P6n1O5kj75O5l9n8L9R0j19J28J15KJ78j98nn6k15j29L23P5k30K9O1
3186f7n0M8j35L2K39r8j12M13l19Q6J4J09j95J71j4R3l16K30m5J10k46p5L71l74
3210a30j15M49j44l5l12J13M87k68P1Q0j59k06l4QK37o3k02J52J97j82LL56j27
3233A76j74P4nj86J18K84j86Q7k29L62j93j71J88l99J18M28k14k04P5j01R1J62
3255A01Om12L44N0o9k49N97l02k41K61k11j26J21J53k97L98j28k56N05l07K16
3276A54n9k05K31k76Q3K26m5n33J90J74N2kj69p6J79K82k40K3K14l48L36l65M58
$$ y = [-315, 147, -66, -80, 189, 337, -105, 157, -217, 222, -118, -90, -162, 102, -35, 143, 333, -33, -20, 212, -222, 63, 202, 31, 76, -160, 286, 10, -206, 145, 137, -28, 36, 127, 130, -214, 192, 180, 294, 35, -144, -12, 324, 5, 84, 88, -36, 40, -11, 54, 52, -123, -58, -97, -155, -116, -26, -145, -17, 98, 100, 278, 80, 75, 19, -196, -325, -2, 73, -157, -128, -67, -117, -69, -204, -172, 67, -31, -143, 270, -49, 37, 51, 160, -35, 136, 122, 215, -101, 129, 84, 194, -52, -127, 244, -130, -245, 204, 60, 25, -287, -174, 313, 45, 116, 196, 37, -169, -203, -195, 42, -21, -223, -71, 126, -56, -53, 303, 176, 2, 76, 71, -115, 3, 287, 101, 188, -41, 321, 128, -43, 145, -254, -136, 292, 78, -126, -51, -152, -61, 101, 107, -305, 39, 89, 20, -229, 368, 66, -175, 86, -125, -251, -130, 23, -274, 124, -4, -260, 245, -62, 154, 95, -110, 121, -155, -72, 154, 109, -424, -234, -60, -8, -10, -179, -255, -76, 206, -34, -11, 203, -145, 191, -174, 284]
3299B84l16j02K24j32jJ01m27N72k62J67k09j61R1K35J33l90J98j67j39K0K74
3320gJ03j23p7j27K99l37M16Q7j13pl72K67M6l38K98M1j68k08K68j39J00k18J58
3343a51J73P3l10K18J37j72o8J00L2r0M05k79Q0k95J69m0l9J82k94J74OJ39j08
3366D2o7j03k88N28J5l94R1J96J32k68M0M65m53j89J42j04P2J50J29p4j35J17
3388D4N8J28j24j87J99l08K91J42l16J69k62J35o4J24o8J24K6k10L90m55K21k7
3410C0o9J54L7l6k11P5l1l5Q9j38L05l4j34l9j14p3P1M01l47nJ85k28J29N4Q1
3435A17q1k27K44q0l7J09r9J75j19m6j20L09k91J85J86j28j96K19k48J57m4j03
3457a18J87k8j53K64k53rk4l0J90J5k25N7J28r8O5j70L43j64j55K06r2J52j60
$$ y = [284, -32, -134, 90, -42, -43, 58, -369, 203, -59, 108, -101, -262, -171, 64, 197, -193, 5, -162, -301, -281, -7, 96, -27, -104, -231, 68, -269, 147, 234, 121, 114, -258, 9, 55, -283, 15, 56, -112, -320, -52, -191, -91, -309, -151, 22, 95, -215, 3, 140, -32, -100, 0, 32, -58, 347, 68, 148, -147, 22, -18, -57, 125, -169, 5, 11, 150, 42, -25, -128, -416, 112, 127, -267, -176, 20, 152, -116, -76, 389, -64, -253, -111, -215, -143, 7, 136, 62, -73, 44, 102, 230, 106, -81, 118, -190, 101, 243, -73, 96, -166, -31, -95, 29, -39, 85, 111, -99, 291, -164, 57, 30, -39, 115, 152, 116, -95, -20, -51, -86, 3, -135, 170, 136, 2, -37, -151, -224, -153, 248, -99, -104, 81, -147, -18, 36, 117, 36, -191, 53, -27, -64, 45, -54, 121, 2, -44, -164, 145, -146, 39, 225, 97, -99, 120, -128, 29, -15, -118, 69, 41, -112, 152, -101, -110, -134, -164, 26, 41, -184, -127, 1, -97, -32, -202, 141, -23, -178, 28, -64, 88, -72]
3480g2R0j34K03k25J9L31J2J5m80P1J62K25j11J82k12k09J17m7j8K73k48P1n1
3503c6J61J59l20QJ17N6l9q3j28K99k07k4j83J20l5r3K01R6j44J29j66q0L11R8
3527B17p1k04P4OK84k96k35L5J75N1j11J74j40n3J68j63K44q1L4J14l98L45k19
3550e0J75j29m9J43o4J34j39M0m6jJ0J1j14k50N99r2j96l6j27J26q8J24m3k32
3574b94K65J41j86Q2N1k80K29j6o9P0r1J28pmL7J55j28j00Q2n4k10K37R4k60J70
3599D2J8J35k50J01j17K46j59j46L53k74p3kJ7J2J02M1k06m3L02j11j67K35J79
3622B35N6k42J67k32l9j9P0r0m5l7M22j75n7p1j81K64j10j28J78j47JK31l13M36
3646A74m8k26K04J3k09j45K89J06j33n1J26L5j7k16K03J76j20j21OJ23j5p6j76
$$ y = [-72, 18, -116, 87, -138, -119, 212, 224, 239, -241, -170, -8, 217, 106, 288, 76, -133, -16, -63, -81, 192, -56, 15, -36, 125, 284, -36, -28, 89, 145, 106, 23, -105, 194, -13, -37, -220, -100, -135, -228, -27, 69, -75, 54, -112, -192, 119, 217, 146, -58, 16, 22, 306, 10, -225, -190, -15, 36, -75, 99, -41, -94, 74, -89, 155, 74, 108, 222, -176, 169, -50, 125, -4, -53, 90, 26, 160, 21, 61, 15, 14, 24, 35, -79, -329, 270, 178, -18, -54, -181, -55, -143, -19, -62, -294, -29, 112, -74, 8, 59, -221, 8, -8, -77, -7, -98, 30, 23, 19, 56, 211, 83, -17, 65, 11, -199, 38, 132, -128, 42, 60, 195, -55, 46, -71, 175, 16, -130, 223, -51, -124, -126, -109, -97, 5, 46, -160, -203, 99, -12, -179, 56, 235, 291, 49, 216, -16, -55, -74, -4, -94, -139, -176, 246, 71, 14, -57, -238, 26, -84, -212, -34, -181, -180, 51, -262, 174, 126, -100, 104, 117, -92, -237, 52, 158, 25, -26, 100, 135, 118, -98, 105, 281, 161, 40, 46, 169, 154, 78, -98]
3669i8pJ4L76j75j20l8O2K9k08K44m05M23k10J52n8j00K7J18j7j45J35pJ01k07
3693a14K3MP2L05k35l02K95j01K53j18l1k50L60l9k70J8K82O5k36k2q7L78l91
3716a41k1qK11j65J39N1k23j82L75j53K12k80k9K20j4Q5M8m01L20p9M00m47P8
3739dJ88k08m4L96n65K32j45J92q0O1P4j5j38J30J01q4J59k77L3O5n6J44j94R9
3763F4j38K76n2k92P5K36l66L2L81k35j45P3Q5P9J57k06j93l5J70n8L8P4J13k10
3787g7j19K24k86K01J42kj8k41K83k52K76l21K07k26J52J32K69j01j33J56l36
3808g0K5J16l88O58p37J27L74j29J74n1J24k65O6m29R2L17K67j72Q5j2j96j06
3830a30L0L69m77M43j95l54K21J64O9j83p5J4J35L5j21j2K08J2l84K44j04kK07
$$ y = [-98, -105, -91, 285, 110, -10, -48, 14, 43, -165, 79, -326, 97, -113, 39, -19, -119, -92, 26, 9, -136, -1, -8, 93, -114, -91, -87, -15, 290, 55, -247, 48, -53, 200, 82, 51, -199, 161, 122, -148, -130, 152, 217, -19, -41, -128, 250, -141, -162, -170, 41, -124, 15, 66, -157, -339, 36, -117, 95, -185, -214, 6, -8, 77, 125, -276, 44, -35, 365, -82, -4, 184, -24, -68, 328, -237, -5, -150, 42, -38, 23, 97, 82, -56, 74, 175, 91, 250, -27, 6, 71, 15, 159, -35, 64, -74, 202, 150, -142, -67, 169, -197, -165, 216, -19, -164, -91, -6, 73, 230, 24, -169, -204, -34, -92, -54, 20, 133, -77, -196, 28, -258, -57, 85, 83, 65, -176, 107, -145, 131, -190, 17, -209, -57, 75, 344, 243, 110, 266, -70, -45, 71, -317, 341, -396, -269, 105, -24, 150, 99, 223, -42, 24, -405, -313, 4, 271, 99, 184, 172, -24, -130, -100, 269, -208, 235, 40, -314, -93, 71, 140, -43, -118, -104, 31, 66, -55, -67, 141, 153, -231, 13, -91, -93, 114]
3853A14Q1j66J35n4Lk25o0j3L44o52L85r3J07J11l0j97J02J24pj97R8K8j05m2
3877b09l4M3L10k72J64K40l95K0Q4J99j72q9J80p0n6r5K89k9j89K84l04K6j5P1
3901a9n3p0Q9J4L07l54j15L13m2N8k17Q6k84K73K07k34o6M04l59l8J49J11k08
3924d8j50j80L25j73P1K03Lj21J76o5J04j66M2J8k7j48P3Q5J10l32J64O8J31j82
3948a9J77j1p2J7P4j73J08Q9j37k6O5L33o00n4n9K97M0p2j38J13p6J35J1j08p0
3973a56M10k57jJ9NQ7q1K57m16M46l44j03K9K7J85l45J11O9J07j7m8J3O8%j98
3998a33R9j7o7J60j17J96k65M57k56K1L0o8O4l98L35j74J32r8OK14k44J21J06
4021A04k96P2K31p8p7o0L1K60n1j2k05q8j1K15rj60L02rl0l41M7L11q5k8q0L49
$$ y = [114, 195, 29, 164, 110, 113, -112, -172, -185, 159, -493, -108, -201, -94, 17, -13, -210, -108, 16, 9, -188, -90, -62, -167, -209, -243, -200, 110, -162, 2, 242, -153, -133, -49, 150, -22, -111, 69, -1, -57, -152, 137, 108, -81, 203, -101, -75, -90, -19, -72, -142, -53, -39, 268, -86, -201, 112, 70, 128, -89, -3, -287, -14, 193, -41, -107, 297, -62, -100, 49, 160, -48, -198, -378, -53, -226, -155, 48, 51, -70, 106, 41, 145, -21, 21, 39, 12, -136, -63, 22, 132, -200, -36, 32, 163, -19, 158, 147, 75, 92, 166, -7, 101, 190, 53, 27, 92, 425, -175, -229, -288, 9, 49, -23, -161, -48, -124, 11, 22, -86, -156, 254, -3, -4, 15, 20, 107, 26, 283, -133, 313, -31, -134, -105, -78, 107, -238, -127, -58, 49, 32, -16, -3, 65, 65, -133, -34, -51, -118, 42, -75, 121, -144, 313, 57, 78, 108, 40, 104, -294, 41, -133, -1, -99, -93, 121, -123, -2, 104, -192, -120, 111, 33, -44, -104, -73, 187, 136, 124, -81, -169, -180, 35, 26, -134, 168, 159, 129, -212, -165, 146, 61, 33, -47, 302]
4047C02m19J85j75j90L11J29n3k35L20k42J58m2l5J98l61q0J81m0R7K65k67r8
4069i1L0l9k21N79L1k01l21L4J14J08kP5k45L11k11K06j52J46k47J47J81l80L19
4092A71k29J26J9N2l76J56R5j59L47k27L15j30j92q9J04o9K2K89j80K1P5j59L0
4115A2J04J74l46o6m2J77k3LO6L8j8j64J63k4P8l49K76j63P5J92n44K35OK42r2
4140A0nJ32j3q9l5P1k26K04j66J26K3j24J65j42Ok21L24Jlqr5L9o0K02k69J64
4166A1j16J44Jj63M68l04lO2j19Q7j46J04N0J02j45j21Q0k93K05J85k46L81J8
4189B42m0l17J25j31J27q1j12K66p3M3k17O1q9J39R9l02J53K00k39J54O8%J77
4212B53J49l12Qj98L81l59K04R3m20L08q0j64K59j14K78l73Q9J38l13K07k38o4
$$ y = [302, -117, 68, -107, -297, 14, 143, 90, -145, 175, -67, 91, 49, 14, 212, -149, -229, -48, -88, 9, 274, 7, -91, -61, -100, -321, 258, 289, 88, -233, -199, -85, 23, 21, 96, -149, 162, -49, 157, 5, 151, -96, 51, 232, -148, 171, -58, 68, 87, 139, -237, -81, 14, -145, 202, -25, 290, 160, -32, -121, -17, -86, -64, 225, 45, 66, 141, -18, 12, 116, 290, -56, -122, -164, 13, -10, -7, 59, 97, 79, -85, 78, 54, 132, -217, 59, -104, -29, 163, -381, -146, -140, 102, 10, 5, 137, 124, 35, 0, 71, -155, 49, -117, 9, 32, -92, 73, -69, -63, -284, 40, 41, 38, 30, -65, -26, -86, 116, -153, 11, -105, 39, 40, -123, 345, 41, 38, 100, -19, 68, -78, 26, 76, 178, 33, -88, -8, -301, -96, 89, -157, 224, 242, 202, -115, 10, -121, 6, -75, -187, 79, 6, 49, -168, -107, -196, -57, 42, -260, -107, 93, -146, 8, 76, 76, 253, 402, 90, 98, -100, 281, -78, 126, 219, -201, 107, 27, -137, 122, 8, 286, -87, 2, 140, -173, 34, -204, -268]
4234b68L11l4Q5J77m54J64Pr1R1j97J61j11L80j37j55K94k25k29J91L12k27R5
4256A40j91m9K29q0j02J26k63J84J52l21J55M3m1J16j00M6p9J0q8r4L15j93K77
4279A92j9k77L13j55l04M11k57JL19j52j48lj90rN02k36J70Nj13J7r9J72J3k54
4303a01n1K7n3K23M2l57J11K54L2j21K78l01L35k09l25J26l8L89k29l48L67j34
4325h3J52Q2j55r2r9K62j27J67k07m5L46j74l9j10NL09k16O5j49O6Q9l8j32M6
4349g7PO4O4K2K08l50K14m9q3j3J13m20L81J95j54O8j69k1p2l1K5R3l18L82k7
4374E2j76J41j51J85j71K65r8nk64K55l54J78K80n8N5j32K3l2j87K03J02m58L30
4397a7N50m19Lj45J75k46K52R9n13L27j65J13j0K02r1k37R3N9j47Q6l4J26l45
$$ y = [-268, 43, 9, 94, 271, -183, -19, -12, -103, -12, -209, -48, -159, 221, 84, -71, 223, -2, -231, -40, 272, 45, 140, -51, -100, 129, 49, -53, 73, -190, -6, 146, -175, -20, 23, -18, 98, -2, 44, -35, -25, -113, -207, 108, -85, 192, 173, -104, 209, 54, -250, 161, -96, -95, 224, 72, -76, -79, -269, -278, 224, -12, 158, 163, 50, 67, -32, 140, 153, -101, -152, -125, -178, 45, 87, -270, -159, 95, 127, 6, 284, -17, 318, 109, -216, -90, -128, 261, 32, -316, 51, -83, 69, 151, -4, -96, -195, 67, -60, 107, -100, -145, 201, 27, -12, -122, -117, 192, -24, 41, -108, -42, 47, 9, -123, -77, -70, -6, 58, 80, 288, -62, 152, 103, 20, 7, 120, -300, 81, 276, 122, 190, 21, 0, -72, -103, -78, 15, -303, 79, 52, -124, 17, -134, 51, -120, 145, 47, 42, -222, 33, -321, -143, 137, 79, 134, 2, 25, -7, -194, 9, 111, -347, -17, 533, 114, 117, -28, 147, -99, 153, 252, -261, 66, -99, 14, 4, 206, 115, -122, -29, 30, -117, -31, -65, 61, -284]
4420b84N43j24j4j24P0J18j51KL7l0O1k4M0L6k63N8J5j83K44N7j35J38j01j96
4444b10J18N2l5J49r6Q3M1N5j45Kj91K10J89l28j19K74r5j11j31L07J37k77P6
4467d5k23L18j69J83k42o9K47J67q1j24J18O4Qj57K49j90j46J24j2m2M6J74p3
4490A25j24j50L91l05Mk13O2K0J69o9N6K64l79K25J1K02l76r1L5R8O0L1L0j52
4514g6J74K91l05L8j03O2k97L33j87J82l1j02l95N31K10k36q6K36l87K09oRl21
4537b57K24K89j09p6j57J91j39R6l09J76K3p9m8L41j53oq3L89m31J8J16J30n1
4560I5j36L29l85J50l3N7j19J90k35q3K18Kk25L03k4l35L60r3L16r0j94j04K57
4583B21j35O8j43l7k1k2J03O6l41j16M24l3j77J16K27m04L31J5m0j28K60j50l26
$$ y = [-284, 259, 135, 121, -3, 67, 185, 34, 36, 73, 43, 104, 80, 120, 156, -107, -49, -34, -217, 27, 84, -51, 87, -14, -210, -92, -40, -75, 74, -22, 61, 102, 157, 12, 14, -177, 33, 222, -106, -225, 49, -46, -157, -288, 19, 156, -121, -45, -268, 50, -119, 64, -178, -247, 0, 167, 86, -38, 80, 144, 152, -5, 244, 54, -92, 32, 20, -22, 24, 198, 125, 1, -149, 242, -63, -59, -272, -210, -190, -21, -90, -34, 230, -149, 76, 87, 289, -87, -178, -143, -45, 15, 46, 76, -76, 98, 389, 84, 122, 19, 81, -216, 117, -70, 112, 81, -21, -416, 115, 325, 89, 3, 239, -148, 61, 55, 64, -257, -33, 256, 147, 71, -86, 105, -34, 62, -247, -71, -48, -127, -175, 166, 13, 7, -76, 313, -118, -100, 16, 146, 95, -41, 288, -97, 53, 20, 77, -42, 148, -87, -170, 48, 50, -175, 128, 104, -231, 129, 36, 352, 262, 68, -36, 221, 86, 154, 11, -26, -47, -69, 34, 100, -241, -357, 67, 34, -143, -27, 200, -204, 127, 142, 102, -26, 234, 84, -242]
4606b42L98j31K11l17j67L27j3M7j67m24M93j16J60k51L96k35j8J25k32L07l0
4627A21j85L70l37m1j1J53j16O3J9M4n1J54k20L5m7jQ0J4j06k4J74j29j19N6p0
4652a74L08j89J21M4j2P3j41q7J90k38l5Q6j77K98L0j69K20j02p9r6P3J25j91
4675a22p1j8M42k71K9j09J48P4j51K74k98o7L15j87n7J19p1l7K6k28K62J41J61
4698C04j85q7O4j12K08k83M3j58J86j18K32m3o6L7R7k22K26k34K11J49n3J9l79
4721a64M06n3K7l39J34N9J33k29o1m0j53J58O5k0k10L47q1k52L84j56O6p5R9N0
4745I5j38J78j21j39Ln6K17J60l91K66M2k79J01n0k78O52k66J76l01K07J1j97
4767a08L76l02j20M35l13J80j66j8K93p4N6k26p1P0j10K41j70J26j49J20l83L62
$$ y = [-242, 156, 25, 236, -81, -248, 79, 66, 113, -54, -478, 15, -101, 59, -192, 204, -31, -49, 76, -156, 151, 121, -64, 306, -31, -72, -83, 70, -46, 17, 36, 80, 29, 183, -37, -2, -49, -50, 30, 44, -62, -86, 88, -41, -160, -104, -174, 134, -55, 66, 110, 98, 171, 30, -57, 133, -105, -140, -54, -231, 67, 97, -72, 148, 46, -33, -129, -56, 69, -122, -193, -211, 231, -40, -11, -120, 28, 102, -49, 225, -73, -140, 175, -12, -69, 50, -21, -58, -32, -260, 2, 143, 304, 119, 32, 96, -16, 192, -91, -48, -206, -20, -138, 94, 51, -15, 22, 119, -103, 123, -111, 100, 249, 196, 215, -164, 242, 189, 216, -123, 11, 70, 203, -26, -87, -127, -280, -122, -57, -77, -287, 60, -21, -273, 111, -45, 21, -54, 45, 95, -43, 135, 14, -125, -122, -178, 39, 199, -192, 74, 116, -163, -62, -112, -390, 262, -4, 172, -129, 78, 89, -108, 268, -34, -154, 281, -32, 148, -18, -36, 257, 183, 239, 13, -58, 12, -98, 143, -27, 99, -50, 70, -313, 49]
4789D9J37l62K16j55L85n61R3J42K65m32M85j08q1l46L15J56k70J6l5J66j99J18
4811fK37j09k23N3R3j93J91j58q5L38j35K8K68n19J42J85J80o16R5J43N7J03o5
4834Do9%Q8L0J52j56o6j11J43O2k12K05J7k11Q2j8M7M8j49pR4R2L06m46l8J15
4860Bl10N81n0l86J10j11J01L14l61J31k65K14j18J30o9J65P8j56l5N5Q9l58L75
4883A26L9j83j39K70J4k99L02k0o6L3p7L5k9j53L75p7j99N7j58K14J32l37M02
4906B62m35P4O1L97l17l7O7J54j62j44j25R6J0Q7l3Q9J15n7O3k36K23k30K17j78
4930c9lM4M9l0j81M14j72j07J35K23k46Q3j70n1K20j74oj74j23N09j48j89J77
4953D1l3l6J27j7k06m5K93j68K31l02J05O2j58L37m47K07j91J73R7k18L46k16
$$ y = [49, 186, -176, 40, -115, 270, -291, -198, -56, 209, -223, 262, 154, 73, -273, 42, 198, -72, -56, -91, 75, -124, -6, 231, 122, -101, -48, 45, -148, 43, -115, -200, 138, 3, 31, 299, -220, -78, 107, 287, -329, -234, -91, -34, 69, 4, -65, -65, 23, 53, 205, 49, -17, -128, 15, 77, -135, 70, 87, -124, -42, -60, -13, 35, -114, -121, -27, 65, 371, -75, -113, 2, -308, 273, 223, -163, -53, -164, -63, 251, -110, 21, -244, -30, -148, -18, -87, 78, 156, 0, -35, 20, 109, -249, 126, 165, -18, -157, 113, 127, -172, 130, 110, 44, 77, 0, 35, 6, -147, 228, 151, -48, 9, -149, 65, 197, -140, 262, -173, -99, -38, 359, 42, 5, 72, 226, 64, -80, -205, -109, -99, -12, -45, 44, 159, 102, 165, -71, 152, -78, 139, -39, -42, 2, 51, 21, -160, 254, 82, -25, 110, 333, 87, 170, 0, -51, 169, -5, -11, -185, -308, 201, 53, -136, 41, 8, -28, 99, 82, -124, -169, 124, -44, 187, -115, -10, 52, -106, 231, -216, -9, -200, -27, 70, -148, 198, -18]
4975a8J92j19m5K5K84l73J80k46RK52k1Q3j98M1k17K19l1J03L1j17k5k1N0M8m68
5000c82M26J47l23j05N54j68J12j32R7k14r4L35j16j71P7j93J64K01j20j09J37
5021A23Q2k57J63J45l35K24J05l95n4j39L96J64l95N7K45k4j8l0j3J10k56L53
5043B51l89K13m2P5k9k5n5j1n9J97n3j80J7J91j00p2L6J72j97J7Rq8M01m46J10
5068e7M8KJ23j87N6n4J83J19n28K02l8J87n8jj03R4j34J58k42M10j78J02k44o5
5092b05K22k21J02r7K31o4R9k89K20n4l50N36jj43oJ44k71n7K09J52j5m81L70
5115C1J70N4j83J9p7j13n5J03K66j55J13k33k3K74j79k71L37j13p1L3K6k16K34
5138b9J0k53q2L82k2j56K36J1R7j62k00K82m78L29J36K24j08l88J91k4K17l27
$$ y = [-18, 174, 55, 10, 35, 319, -54, 126, -120, -111, 141, 120, 203, 5, 46, -171, 48, 17, 120, 151, 34, 9, -12, 38, 86, -382, 44, 191, -132, -237, 317, 149, 261, 129, 226, 12, -82, 253, 137, -34, 43, -150, 14, 215, 95, -14, 123, 205, -52, 111, 256, -79, 145, 250, -145, -199, -338, 58, 222, -173, -116, 129, 105, 87, 57, 44, 154, -102, 251, -138, 75, 33, 108, 79, 54, -1, -12, -71, 126, 73, -107, -90, 101, 1, -71, -35, 137, -60, -43, -34, -122, 279, -167, -57, -9, -7, 116, -71, -15, -69, 114, 233, -295, -93, -131, 56, -2, -3, -106, -12, -146, 12, -230, 180, 2, 104, -140, -205, 17, -204, -102, -199, 32, -32, 67, -222, -2, -56, -406, 130, 129, -14, -20, 124, -147, -204, 5, 157, 142, -339, 31, 201, 255, 72, 91, 14, -99, -154, -51, 215, 60, 173, -60, -83, 191, 12, -259, 78, -35, -106, -73, -47, -263, -29, -19, -272, -354, 28, 6, -150, 86, 97, 194, 32, -168, 114, -364, -35, 101, 325, 217, -171, 20, -4, 213, -114]
5160a14K69k52K21k52K01j96l0K79K5j68j08K15k07K85K7j42k11po4N32k01r0
5182A2M3l53K24J17l4j62M02o46K56M0r8L01j65j25J24L1J82j25j28Q4J42j18
5204DR4j32r5K18j74n5M7K84n9K99o02J58%J55j08j95K08K02k80j33J24J68k65
5227a37j98O00l38j79J33L14k97K51m07L31j91Q6J0j5J73o3p1j68R3K59l56K51
5249H1k10J10pk0P1r4L2k0J64k08K54k00L98j84n8P0l12K08j04j44J62l50N75
5272B14k73L05k32j13j44K28J2N6R4n0j4j18Mj8j24n0J05k2J30r5J97j30m0j7
5296i5J12J18m4L1j84O3o8j75K97l00K32l66N36o4j36L9nj81L9M04n15R9L8K12
5320H7l01J99j96L31n8R0l55M3K16M3L12n62N4p9L68j37N3p1M4R7k24j7j01K46
$$ y = [-114, 155, -97, 124, -128, 73, -123, -153, 126, 151, -17, -125, 90, -117, 168, 195, 53, -158, -165, -229, 303, 102, 12, 55, -298, -74, 43, 9, -153, 249, -397, -141, -101, -199, 102, -63, -188, -64, -33, 149, 24, -104, -20, 122, 4, 98, -34, -129, 89, -85, -140, -93, 191, 132, 431, -171, -13, -13, 142, 34, -161, 47, 249, -31, -164, -40, 128, -137, -335, 265, -73, -252, -119, 195, -102, 149, -258, 73, -118, -32, -22, -37, 136, 73, 2, -166, -73, 186, -170, 81, -129, -19, -26, -46, 25, -69, -37, -57, 107, -101, 153, -47, 351, 167, 109, 179, -133, 75, -29, -173, -11, -361, 214, -59, 246, 14, -99, -243, -15, -3, 53, 147, 97, 83, -35, -31, -49, -173, -223, -118, -140, -10, -105, 92, -38, -78, -95, 17, 135, 91, 122, -62, 1, -67, -242, 55, -245, -13, -379, 157, 93, -43, -4, -9, -190, -151, 253, -262, -163, -125, 87, -214, -15, -211, 120, 62, 152, -203, -160, 56, 99, 411, -151, -97, -176, 192, 55, 108, 37, 81, 178, -46, -63, -164, 82]
5344H2ol2k21K16qm1j12p9J4r7M03n1j31J79q5N4K08k42p7j49J15kL25j49q2M5
5370G7m19L85Q0R7j66k61J82J47J42k27m8K14m8P8j09j5k96L05k30K65kq2j77
5393a08j05n6K08Rp3n6M74m01K35j35q3J08l08L88p1n4j23L05r4m3R8J85l13J29
5417A16j40K5NK16l25j9J70J81m50K73J64p5q6j55O2J42J7p2m0j92K37P8M5j25
5441E2j46l7K23m9j11P1o9k42M23Mk15R0J2o9k20L47k5J49M8l73J67j66K59l20
5465a97L46j73n8L4J56Q4Kj48o4R4k90J91P6J12q4J76l97J54l5J28p4J15j62q3
5489i7M2J68j02P5k00J0J97l0L2l2%j68K77l69K47j37R2k27L09J85k84J90j09
5512F9l42J57L4J5l3k96L79R7k87K18j87J56r4K90k10R5m9j53P2L58j64m36o5
$$ y = [82, 76, 44, -177, 39, 31, -10, -122, -201, -187, -284, 119, 68, -63, 116, 31, 85, 293, 51, -26, -175, -60, -62, 263, 114, 32, 77, -342, 43, 123, 220, 54, -207, -25, 122, 264, 37, -11, 203, 155, 233, 124, 109, -187, 118, -112, 153, 151, 69, -108, -213, -269, -61, -52, -125, -181, 293, -108, 127, -8, -91, 17, -291, 97, 26, -28, -151, 154, 60, 17, 115, 300, -13, 116, -24, 1, 6, 222, -103, -122, 48, 229, -221, 52, 216, 141, 55, -100, -38, 104, 121, 49, 9, -183, 54, 132, 177, 52, -94, -131, 92, 43, -68, 3, -66, -308, 115, 119, -96, -6, 6, -63, -283, 64, 39, 188, 236, -137, 30, -136, 123, -197, 149, -24, -82, -48, 108, 192, 194, 46, -18, 76, -214, -23, 53, 165, 81, 257, -140, 14, -21, 107, 33, 148, -14, -97, -55, 113, 11, 86, -114, -104, 93, 63, 95, 63, 63, -105, 172, -197, 50, -87, 5, -222, 87, 272, -12, 178, 69, -273, -116, -82, -67, -100, -396, -17, 80, -207, 11, -176, -20, -114, 176, -34, 61, 12, -141, -69, 289, 125, -311, -376]
5535c76K92K68j14j92M41k60j9j2j03L02j78p8K30k68J15N9j02r0J94j91K20k55
5557a17J21JP3J09k98J36Mj97N00l58o3j22L71k25l1J73k03k32M41k15J42k20
5579b10K33n0j27K58J29O2m20J70j39K52l06K97j56Q4l6J51k10ko4J13P2k06l2
5602a37K45j94R0l4p6P5k2j66L00k38K9J23JJ24j27q1NK85l6k03Q6j14j6l7J10
5627hJ79m75L80j40L00j4k11K5J7M9k57j0J3JJ30k07M48j44k83J51O9j57K32K30
5651C18n07L19j25J4Kj39O3j47L90j88l5P0j00n7N4L0j30J45J17l21L62O5j83
5674A7j13M01j11k60K96k49J5j81O1Q8j59rJ20M2o8J94j07N8Q3p4N5J49p3k77
5698a02Q9k18K39J47l03J02M8l24N75k54j62L99J30l85m01M42J84p8j15j74p9
$$ y = [-376, -84, 184, 70, -122, 319, 59, 40, 28, -75, 227, 49, -29, 201, -67, 48, 107, 5, -85, 109, -82, 138, -117, 4, 5, 78, 187, -111, 25, 29, -168, 332, -26, -89, -211, 160, -65, -96, 77, -126, -358, 83, -132, 10, -210, 23, -27, -154, 104, 233, 295, -125, 45, -94, 158, -148, 149, -7, 77, 41, 192, -18, -20, -84, 29, 101, -105, -137, 108, -86, 4, -30, -106, -31, -53, -219, 81, -157, -128, -5, -4, 120, -7, -88, -83, 202, 166, -37, 49, -65, -81, -118, -8, 171, -304, 76, -64, 236, 222, 11, 36, 53, 102, -155, -165, -152, -151, -21, -228, 220, 76, -207, -56, 13, -144, 88, 318, -189, 130, 5, 19, 21, -118, -55, -202, 188, 0, -35, 35, -65, -122, -68, -38, -168, -23, 94, -227, 135, 200, 17, -96, 305, 194, -66, 230, -19, -4, -185, -124, -36, -195, -204, -84, -42, -110, 84, -23, 35, 118, 44, 99, 248, 175, -102, -13, -231, 8, 155, -148, -46, 2, -322, 253, -1, -163, 236, 366, -19, -420, 22, 206, 128, 13, -161, -240]
5719b40K7J74O7mp0L38m28J33r5o8K96m3L9Kk06m7R9j45K28j39q3Q7J59K0j16
5744a5J49n8n6o9J10j30L94k06k44J80J06j07P6j10j12OJ30j6Q4Nl46K59k10K47
5768F7k02K65q3l44M83k46p5J24N9J41k18j23L81l07L14k74o5J38j19J9J53J8
5790A06j46j17J22J81P0L4l31K6j28K19Mn1O3J71j28k47O6k5J0L03l52K83J16
5813B49k36OJ8J06k48MN9k3J32j55J09j3K8r8l06M66m0J16m9m58N85j75k46J16
5837e3J68j87J08j12j48L26%K0r8k39J95k88L70j25m3J92k2j26J27j88J91J39
5859B07K0k80n9O7j36K51j75j48K62l68L67O1J44k36J59j93Q5Lj86L14l69K92
5881H2j68l4k1K73k7L1R3k78Q1j98M12J9j54MQm2l09J36J9O8J00j57J01p5l9N8
$$ y = [-240, -213, -39, 28, 24, -46, 292, -136, -3, -98, -166, 130, 87, 126, 128, -78, -125, -26, -171, 57, -82, -165, -78, 81, 101, -15, 134, 76, 20, -49, 61, -69, 325, 119, -125, 55, 161, 54, 130, 20, -92, -86, 44, 28, 112, 117, -229, 30, -180, 67, -135, 130, 47, -297, 186, -60, -135, -11, 48, 189, -29, -152, 229, -78, 236, -38, -103, 35, -84, -65, 88, 106, -40, -157, -35, 146, 216, 250, -81, -55, -183, 36, 40, -11, 52, 223, 95, -152, -86, -111, -101, 202, -150, 133, 249, 13, 19, 37, 143, -105, -101, -42, -65, 67, -88, 21, 8, 36, -62, -368, 98, 58, 174, 125, -333, 252, 77, -169, -53, 115, -72, 36, -76, -224, 102, 102, 122, 24, -215, -20, -308, 62, -63, -106, 86, 64, -62, 65, -123, 68, 207, 227, -53, -112, -45, -181, 70, -105, -253, 9, -359, 8, 69, 213, -23, 136, -57, 28, 31, -155, 159, -210, 82, -86, -120, -141, 132, 105, 136, 229, -49, 32, -166, 246, 265, 111, 115, 123, 81, -228, -92, -73, -5, 95, -62, 39, -36, -75, -17]
5907a7Q9K7j14Pj39J73l5Oj42K9M8j17J65m5R2J09o8j43J27Q9N3m0k01P4R7k73
5933a49K50k4J2L9k34J70k83J30o0R3j30K33J11l10K68j9j50J95l88K91k30j7
5955b02M3J88k04J81J72j38J04j56J01j4j33J37p5J24j56J50k77K39j04j52L8
5976a34M13l48n9K36j17j65R6j38M69k03j3j66K2K75j16k69nR7J26K2q7J78j43
5999b9N3j76R9O7k30RO1m7J57j21K08K01J7k98k97N68k21p8l8J17j00J32J58k70
6023e8K35m49r4N86m31J91M04n01J54J77j65j91L6o9J72O2k97J87J14J4j98K59
6045A38m5j34j46J71L06k30J57k43pr2r0N29l55P2m1M9J08j92k2J44j51J29j1
6068D4J42j43k32L00L25m07N4l8N8l1m02J6O06k91m2K09k06P7j51K49Q9q2k45
$$ y = [-17, 72, 99, -15, -8, -147, 26, -9, -3, -145, -116, -68, -185, -20, -65, 27, 136, 68, -75, 52, 141, 194, 154, -47, 27, 124, -149, 101, 77, 89, 128, -106, 64, -219, -89, -149, -56, -186, 47, 158, -152, 116, 97, -53, 142, -246, 45, -185, -202, -159, 29, -175, 6, 178, 40, 144, -12, 89, 75, -58, 79, 4, 128, -28, 122, -155, 84, -20, -172, -134, 279, -69, -128, 108, -9, -174, -78, -216, 253, 50, 37, -129, -107, 168, 52, -217, -222, -125, 1, 23, -64, 114, -29, 24, -152, -53, 14, -216, -207, -146, -193, -36, -157, 51, 252, 269, -29, -326, 242, 21, -57, -95, 22, -78, 54, 212, -58, 177, -272, -366, 220, -211, -20, 384, -117, 37, 214, 49, -142, -106, -175, -3, 59, -238, -51, 63, 77, -121, 138, 93, -41, -187, -16, 290, 60, 217, -26, -33, -125, -215, 314, -41, 31, -10, 39, 147, -45, -67, 77, -74, 55, 44, 186, 43, -189, 111, 436, 29, 83, 45, 103, 72, -330, -314, 292, 1, -41, 168, -38, 39, -112, 137, 226, 144, -101]
6091a01j2p3N28j07j69L9O1k49J77k75L62j80j27J84j67R8J95l16J61M7j94j9
6113a37Q2M2k03K88L68o53J39j80J12L36j09k99J89L0J91l39q0K94k18m9J20j24
6135b00L20q7o5K19K9j46m0m6j4q0J84j20L28l9k67o0j62J69M3j66O4p2J91M6
6159B9J4r8L2r5K72Kj96Q4r4j52q0L50j53K71n8j78k18P4M14k38l9J7Q6j36K50
6184A60k38l79K74K75j36N7p3L61j96k68J18N4P7o6n2Q0Q3k34j10J49N6k4P7j62
6208a17P3O1j69R9J07OJ41j55M0J48p4K8j6l8j12j02l1J5Q9Q1k4m3j67L55k19
6233b4k08K82j16k81M41Q0n42L51J10k10K8p1L19k23K12j27j10p7J57L6l4j7J01
6256G7k26J17K29m13J16J19m0M7O7M8l0l09L37j10Ko5M6j64j86M45L56o41K82
$$ y = [-101, -113, -186, 342, 235, 66, 105, 166, -83, 94, -181, 181, 1, -126, 58, -109, -11, 184, -132, 29, 76, -118, -137, -55, -13, -216, 72, 440, -213, -74, -254, -142, 194, 85, -214, -25, 5, 196, -143, -223, 71, -147, -196, -76, -200, 120, 33, -32, 187, 216, 70, 30, -16, -30, -110, 74, -46, 282, 243, -24, -84, -246, -77, -34, -200, -136, -208, -17, 29, 43, -55, -23, -118, 154, 156, -40, 44, -50, -202, -282, 68, -85, 186, 128, -50, -268, -194, 220, -18, -57, -40, 46, -90, 160, -78, -457, -183, 92, -44, 13, -60, 301, 105, -163, -45, 9, 86, 20, -32, 48, 131, -103, -213, -64, -8, -32, 45, -117, -44, 17, -152, -53, 54, 60, 201, 46, 86, 234, 160, 188, 172, 134, 22, -80, -111, -96, -7, 74, 50, 7, -160, 195, -24, -232, 50, -66, -347, 94, 174, -368, -17, 93, -117, -89, -160, 159, -64, 148, 21, -89, -166, -9, 27, -7, -24, 77, -149, -32, 197, -216, -100, 19, -21, 26, 93, 141, 111, -198, 139, 29, 31, -34, 12, -152, -338, 107, 463, -178, 104]
6279A04j86K63l10J81n5L39m09P2N0Q6n0m7K05k07j96P7K12l98L79j34l3J33j35
$$ y = [104, -82, 181, -129, 52, -3, 336, -73, -1, 49, 135, 85, 38, 243, 36, -160, -83, 129, -269, 110, -24, -57, 76, -59]
$$ [...]
8191E4
##END NTUPLES=NMR FID
##END=
