##TITLE=1H_DE-80H2
 200.13MHz, D2O,
 8 sc
 
 12.2.2025
##JCAMPDX= 6.0         $$ Bruker NMR JCAMP-DX V2.0
##DATA TYPE= NMR FID
##DATA CLASS= NTUPLES
##ORIGIN= UXNMR, Bruker Analytische Messtechnik GmbH
##OWNER= pz
$$ XWIN-NMR		Version 3.5
$$ Wed Feb 12 14:03:13 2025 Russian Standard Time (UT+4h)  she@DPX200
##.OBSERVE FREQUENCY= 200.1313
##.OBSERVE NUCLEUS= ^1H
##.DELAY= (6, 6)
##.ACQUISITION MODE= SIMULTANEOUS
##.ACQUISITION SCHEME= undefined
##.AVERAGES= 24
##.DIGITISER RES= 18
##SPECTROMETER/DATA SYSTEM= spect
##.PULSE SEQUENCE= zg30
##.SOLVENT NAME= D2O
##.SHIFT REFERENCE= (INTERNAL, D2O, 0, 14.3821)
##AUDIT TRAIL= $$ (NUMBER, WHEN, WHO, WHERE, WHAT)
$$ ##TITLE= Audit trail, XWIN-NMR		Version 3.5
$$ ##JCAMPDX= 5.01
$$ ##ORIGIN= Bruker BioSpin GmbH
$$ ##OWNER= she
$$ F:/spectra/data/she/nmr/H-C/1/audita.txt
$$ ##AUDIT TRAIL=  $$ (NUMBER, WHEN, WHO, WHERE, WHAT)
(   1,<2025-02-12 14:02:11.54 +0400>,<she>,<DPX200>,
      <continue with go, POWCHK disabled, PULCHK disabled
       configuration hash MD5:
       00 E9 B6 7A A2 85 ED C7 34 08 36 98 17 FE 4E 26
       data hash MD5: 16K
       02 42 C0 AF 2A EC 7D 50 F5 1E 0C 72 83 36 9B 62>)
$$ ##END=
$$ 
$$ hash MD5
$$ B5 74 FC 94 5C CE 5F 77 02 C8 32 06 60 9B 84 F4
##$RELAX= 
##$RELAX= 
##$RELAX= 
##$RELAX= 
##$RELAX= 
##$RELAX= 
$$ Bruker specific parameters
$$ --------------------------
##$DU= <F:/spectra>
##$EXPNO= 1
##$NAME= <H-C>
##$PROCNO= 1
##$TYPE= <nmr>
##$USER= <she>
##$AMP= (0..31)
100 100 100 100 100 100 100 100 100 100 100 100 100 100 100 100 100 100 
100 100 100 100 100 100 100 100 100 100 100 100 100 100 
##$AQSEQ= 0
##$AQ_mod= 1
##$AUNM= <au_zg>
##$AUTOPOS= <>
##$BF1= 200.13
##$BF2= 200.13
##$BF3= 200.13
##$BF4= 200.13
##$BF5= 200.13
##$BF6= 200.13
##$BF7= 200.13
##$BF8= 200.13
##$BYTORDA= 1
##$CFDGTYP= 0
##$CFRGTYP= 5
##$CHEMSTR= <none>
##$CNST= (0..31)
1 1 145 1 1 1 1 1 1 1 1 1 1 1 1 1 1 1 1 1 1 1 1 1 1 1 1 1 1 1 1 1 
##$CPDPRG= <>
##$CPDPRG1= <>
##$CPDPRG2= <>
##$CPDPRG3= <>
##$CPDPRG4= <mlev>
##$CPDPRG5= <mlev>
##$CPDPRG6= <mlev>
##$CPDPRG7= <mlev>
##$CPDPRG8= <mlev>
##$CPDPRGB= <>
##$CPDPRGT= <>
##$D= (0..31)
0 0.7 0 0 0 0 0 0 0 0 0 0.03 0 0 0 0 0 0 0 0 0 0 0 0 0 0 0 0 0 0 0 0 
##$DATE= 1739354326
##$DBL= (0..7)
120 120 120 120 120 120 120 120 
##$DBP= (0..7)
150 150 150 150 150 150 150 150 
##$DBP07= 0
##$DBPNAM0= <>
##$DBPNAM1= <>
##$DBPNAM2= <>
##$DBPNAM3= <>
##$DBPNAM4= <>
##$DBPNAM5= <>
##$DBPNAM6= <>
##$DBPNAM7= <>
##$DBPOAL= (0..7)
0.5 0.5 0.5 0.5 0.5 0.5 0.5 0.5 
##$DBPOFFS= (0..7)
0 0 0 0 0 0 0 0 
##$DE= 6
##$DECBNUC= <off>
##$DECIM= 32
##$DECNUC= <off>
##$DECSTAT= 4
##$DIGMOD= 1
##$DIGTYP= 9
##$DL= (0..7)
0 120 120 120 120 120 120 120 
##$DP= (0..7)
150 150 150 150 150 150 150 150 
##$DP07= 0
##$DPNAME0= <>
##$DPNAME1= <>
##$DPNAME2= <>
##$DPNAME3= <>
##$DPNAME4= <>
##$DPNAME5= <>
##$DPNAME6= <>
##$DPNAME7= <>
##$DPOAL= (0..7)
0.5 0.5 0.5 0.5 0.5 0.5 0.5 0.5 
##$DPOFFS= (0..7)
0 0 0 0 0 0 0 0 
##$DQDMODE= 0
##$DR= 18
##$DS= 0
##$DSLIST= <SSSSSSSSSSSSSSS>
$$ [...]
##$SUBNAM0= <"">
##$SUBNAM1= <"">
##$SUBNAM2= <"">
##$SUBNAM3= <"">
##$SUBNAM4= <"">
##$SUBNAM5= <"">
##$SUBNAM6= <"">
##$SUBNAM7= <"">
##$SUBNAM8= <"">
##$SUBNAM9= <"">
##$SW= 18.0517328524113
##$SWIBOX= (0..15)
0 0 2 0 0 0 0 0 0 0 0 0 0 0 0 0 
##$SW_h= 3612.71676300578
##$TD= 16384
##$TD0= 1
##$TE= 0
##$TE2= 300
##$TE3= 300
##$TEG= 300
##$TL= (0..7)
0 120 120 120 120 120 120 120 
##$TP= (0..7)
150 150 150 150 150 150 150 150 
##$TP07= 0
##$TPNAME0= <>
##$TPNAME1= <>
##$TPNAME2= <>
##$TPNAME3= <>
##$TPNAME4= <>
##$TPNAME5= <>
##$TPNAME6= <>
##$TPNAME7= <>
##$TPOAL= (0..7)
0.5 0.5 0.5 0.5 0.5 0.5 0.5 0.5 
##$TPOFFS= (0..7)
0 0 0 0 0 0 0 0 
##$TUNHIN= 0
##$TUNHOUT= 0
##$TUNXOUT= 0
##$USERA1= <user>
##$USERA2= <user>
##$USERA3= <user>
##$USERA4= <user>
##$USERA5= <user>
##$V9= 5
##$VALIST= <valist>
##$VCLIST= <CCCCCCCCCCCCCCC>
##$VD= 0
##$VDLIST= <DDDDDDDDDDDDDDD>
##$VPLIST= <PPPPPPPPPPPPPPP>
##$VTLIST= <TTTTTTTTTTTTTTT>
##$WBST= 1024
##$WBSW= 4
##$XGAIN= (0..3)
0 0 0 0 
##$XL= 0
##$YL= 0
##$YMAX_a= 2099935
##$YMIN_a= -2230742
##$ZGOPTNS= <>
##$ZL1= 120
##$ZL2= 120
##$ZL3= 120
##$ZL4= 120
##$ABSF1= 10
##$ABSF2= 0
##$ABSG= 5
##$ABSL= 3
##$ALPHA= 0
##$AQORDER= 0
##$ASSFAC= 0
##$ASSFACI= 0
##$ASSFACX= 0
##$ASSWID= 0
##$AUNMP= <proc_1d>
##$AZFE= 0.1
##$AZFW= 0.1
##$BCFW= 1
##$BC_mod= 2
##$BYTORDP= 1
##$COROFFS= 0
##$CY= -3
##$DATMOD= 1
##$DC= 2
##$DFILT= <>
##$DTYPP= 0
##$F1P= 0
##$F2P= 0
##$FCOR= 0.5
##$FTSIZE= 0
##$FT_mod= 4
##$GAMMA= 1
##$GB= 0.15
##$INTBC= 1
##$INTSCL= 1
##$ISEN= 128
##$LB= 0.25
##$LEV0= 0
##$LPBIN= 0
##$MAXI= 10000
##$MC2= 0
##$MEAN= 0
##$ME_mod= 0
##$MI= 1.114404
##$NCOEF= 0
##$NC_proc= 0
##$NLEV= 6
##$NOISF1= 3.799351
##$NOISF2= 2.8
##$NSP= 1
##$NTH_PI= 0
##$NZP= 0
##$OFFSET= 14.38212
##$PC= 1
##$PHC0= -471.8589
##$PHC1= 13.39221
##$PH_mod= 1
##$PKNL= yes
##$PPARMOD= 0
##$PSCAL= 0
##$PSIGN= 0
##$REVERSE= no
##$SF= 200.129724274929
##$SI= 16384
##$SIGF1= 3
##$SIGF2= 2
##$SINO= 400
##$SIOLD= 16384
##$SREGLST= <1H.CDCl3>
##$SSB= 0
##$STSI= 0
##$STSR= 0
##$SW_p= 3205.1282051282
##$SYMM= 0
##$S_DEV= 0
##$TDeff= 0
##$TDoff= 0
##$TI= <>
##$TILT= no
##$TM1= 0
##$TM2= 0
##$TOPLEV= 0
##$USERP1= <user>
##$USERP2= <user>
##$USERP3= <user>
##$USERP4= <user>
##$USERP5= <user>
##$WDW= 1
##$XDIM= 8192
##$YMAX_p= 0
##$YMIN_p= 0
$$ End of Bruker specific parameters
$$ ---------------------------------
##NTUPLES= NMR FID
##VAR_NAME=  TIME,          FID/REAL,        FID/IMAG
##SYMBOL=    X,             R,               I
##VAR_TYPE=  INDEPENDENT,   DEPENDENT,       DEPENDENT
##VAR_FORM=  AFFN,          ASDF,            ASDF
##VAR_DIM=   8192,          8192,            8192
##UNITS=     SECONDS,       ARBITRARY UNITS, ARBITRARY UNITS
##FACTOR=    0.0002768,     1,               1
##FIRST=     0,             0,               0
##LAST=      2.2672688,     0,               0
##MIN=       0,             -2230742,        0
##MAX=       2.2672688,     2099935,         0
$$ Real data points
##PAGE= N=1
##DATA TABLE= (X++(R..R)), XYDATA
0@%%%%%%%%%%%%%k4L2l2M8m8P2r2R2j15J39j63J87k12K46k75L21l67M15m81N42
33B85o18O96p76Q77r77J097j224J355j509J669j852K045k256K495k745L030l336
50a744L671m047M459m930N449o033O709p477Q383r451J0738j2335J4353j7030
64i285K0733k6223L5229n2543R7950m54777j468073l73753L89485R24558J191387
75B74688J189601O35646j27872q84853j266481j164287o18815P5636Q00978J200503
85A14744J072342N77640M3225n74552j126277j224366p32316J712O65228J052846
95a29774J067708P22710J47531n29562j035647j114180p49842j30797N34585R75451
105b41817J011128P12453K12891m09697r16927j031394p49493k36437L75732Q56929
$$ plain form
0 0 0 0 0 0 0 0 0 0 0 0 0 0 0 -24 8 -24 24 -24 48 -44 48 -67 72 -91 96 -116 130 -145 176 -191 224 -257 285
33 285 -333 363 -413 464 -513 584 -640 715 -794 875 -977 1068 -1188 1307 -1438 1592 -1744
50 -1744 1927 -2120 2339 -2591 2858 -3175 3534 -3943 4440 -5011 5727 -6608 7745 -9285
64 -9285 11448 -14775 20454 -32089 65861 -388916 -1856989 -2230742 -1841257 -916699 274688
75 274688 1464289 2099935 1972063 1087210 -179271 -1343558 -1962373 -1886737 -1085759 114744
85 114744 1187086 1764726 1807951 1233399 107122 -1117244 -1849560 -1847848 -1182620 -129774
95 -129774 937934 1660644 1808175 1278613 242966 -871214 -1621056 -1751853 -1217268 -241817
105 -241817 769311 1481764 1694655 1284958 368031 -663363 -1412856 -1649293 -1273561 -416632
115d16632R69097P21663K65313k82674p44437r33851p95624l48199K84504P68662
125e12178Q80626P15814L70034j50831o63201q92888p80064l99019J47838O36830
135f47039Q54580P57613L90668j26474n67254p76605p48229m57855N8616N54552
145g07427P79548P12109M22763j8855m45786o99553p22373m82999l1880M22102
155g72351O90783P12909M82678N6151l73617o37806o94133n11627j09041L37455
165h18599O25957O81606M93296J14504k85958n61424o55262n17111j59882K50064
175h32809N41723O38925N07590J77996j99799m87962o16159n21631k13233J66843
185h38516M67406O01801N10286K20244j30061m18528n69914n14725k55550R0812
$$ plain form
115 -416632 552465 1274128 1539441 1256767 512330 -421521 -1217145 -1565344 -1280840 -512178
125 -512178 368448 1084262 1454296 1303465 640264 -252624 -1032688 -1431707 -1283869 -647039
135 -647039 207541 965154 1355822 1229348 662094 -114511 -862740 -1320595 -1261979 -707427
145 -707427 72121 784230 1206993 1188138 742352 42799 -679574 -1162573 -1194453 -772351
155 -772351 -81568 631341 1114019 1170170 796553 158747 -535386 -1047013 -1156054 -818599
165 -818599 -192642 488964 982260 1096764 810806 249382 -405880 -922991 -1082873 -832809
175 -832809 -291086 347839 855429 1033425 833626 345664 -270495 -792126 -1005359 -838516
185 -838516 -371110 230691 740977 961221 831160 412632 -157282 -672007 -927557 -836745
195h36745L93604N55043N05038K62396o1033l51620n24203n02865k85253K7406
205h18232L23418N06473M96741K94580n819k92355m74512m79994l07150k9036
215g85886K57934M56192M75938L13581M6172k28121m25351m60986l22294p5208
225g48029J98163M02593M51731L28477R3195j73412l78310m32685l28523j16199
235g02999J41372L53804M24732L34308J30062j18738l26170m07250l36232j47835
245f54946R3304L01751L92918L37945J62180p5888k81873l73739l29447j74873
255f02668M6541K54133L63783L32031J82050l0674k27577l40224l28185j97329
265e48119Q858K10044L26252L21693K03408R636j86856l10624l17734k10650k6999
$$ plain form
195 -836745 -443141 111902 616940 879336 818303 466683 -57520 -560385 -845638 -818232
205 -818232 -494814 11659 508400 802980 797161 504806 30294 -449700 -756850 -785886
215 -785886 -527952 -71760 404178 717759 763931 535810 110459 -350527 -672821 -748029
225 -748029 -549866 -147273 304458 632935 726130 552718 174408 -258277 -586800 -702999
235 -702999 -561627 -207823 216909 551217 681279 562541 236371 -170879 -507111 -654946
245 -654946 -561642 -259891 133027 470972 633152 557264 275391 -98348 -427795 -602668
255 -602668 -556127 -301994 61789 393820 575870 545196 317619 -22605 -350790 -548119
265 -548119 -539261 -329217 -2965 318728 522136 531772 344916 34292 -283442 -494092 -521091
276e21091J65913K94352L10643K14775M0294j47074k74991l00863k20557n8422
286d97021J26938K64076K96443K17952O5381j04179k36352k86993k30325q3468
296d67548R4012K29980K75959K21752R0558p0730k07931k69035k27916j01572
306d32471N7294J94523K60236K26090J06063m4894j73367k42326k25745j23931
316c98528K6949J67637K40669K20145J19168j7586j42239k20163k23092j38312
326c65352M065J38547K15652K13569J35156P228j18738j99899k09376j43441k3788
337c46377J06586J95407K08694J42040K5156r2275j72974j97780j53424m6098
347c31045Q2408J73819J95386J46307M7261o6981j55297j87255j53108o1889N5988
$$ plain form
276 -521091 -355178 -60826 249817 464592 504886 357812 82821 -218042 -438599 -497021
286 -497021 -370083 -106007 190436 408388 473769 369590 133238 -153755 -384080 -467548
296 -467548 -373536 -143556 132403 354155 444713 373983 166052 -102983 -330899 -432471
306 -432471 -375177 -180654 79582 305672 411735 366841 193474 -48852 -274597 -398528
316 -398528 -371579 -203942 36727 256872 376040 358454 216215 -3948 -227040 -365352
326 -365352 -361287 -222740 -7088 206481 341637 348865 230127 30228 -179148 -322589 -346377
337 -346377 -239791 -44384 164310 306350 331506 239231 66257 -131523 -284947 -331045
347 -331045 -248637 -74818 120568 266875 314136 247155 91858 -95397 -248505 -310394 -254406
358b54406J50705J85582J50618O0999m6151j34076j72781j51164p4875L2280J28496
369a24773J72429J50933P4028k7144j15259j57497j48096q5344J1276J07769J59478
380A7800J48154Q2558r073r4915j45190j43485r1859m255Q5756J44144J44072
391A33707R1384P188p8322j31835j35881r6306j9586O7270J28852J38551R6626
402B01648K0040o1289j16593j30725r8300l1134M9662J13007J30573J00186L2342
413B09417m5466j03524j21821r9918m1115L3557R7280J22514J01642M3420l0454
424A65532q9661j15086r8888m8646K0552Q1709J12337J01645N1733j6908p6975
435H7344j05563r8357n5157R153O7143J02389J00092N7858m836o2725r7977r5793
$$ plain form
358 -254406 -103701 81881 232499 293498 247347 113271 -59510 -210674 -285549 -253269 -124773
369 -124773 47656 198589 272617 245473 130214 -27283 -175379 -260723 -249447 -141678 17800
380 17800 165954 248512 239439 144524 -666 -144151 -236010 -240265 -154509 -10365 133707
391 133707 225091 232279 153957 22122 -113759 -210065 -229651 -162381 -33529 105022 201648
402 201648 221688 160399 43806 -86919 -185219 -216353 -166691 -53684 76889 177075 209417
413 209417 163951 60427 -61394 -161312 -202427 -168870 -71590 50924 152566 195986 165532
424 165532 75871 -39215 -138103 -186749 -166197 -84488 27849 129494 181227 164319 87344
435 87344 -18219 -116576 -171733 -162580 -95437 6952 107044 164902 160066 97341 -636 -96429
447i6429n9035j232N4834R0887R6317O2973O736n0331q7864r3409o2249j0135
459a48937M2544Q1118R0855O5849J6506l8431p9150q9390o3869j7870L1034P0457
471c9284Q6646O8090K3024k8360o8541q3346o5180k4705K1257O1665P9867O8090
483I9223L0457j6716o0738p8670o4693l0054J2483N1509P4239O7118L4395r357
495A09196n0297p0993o3752l5773M348M3617O7070O4339L8996J210m2289o6814
507a142o1392l7907l577L5398O1465O3448M1467N360l3556n8883n8918m1904r306
520i9447K9116N4344N7767M3031J2733k5578n2980n6570m2028j4824K0399M8958
532b5079N5731M4974J5969j8922m4529n3252m4304j9141J6613M1491N0740M3467
$$ plain form
447 -96429 -155464 -156696 -101862 -10975 85342 148315 155051 104720 16856 -76553 -138802 -148937
459 -148937 -106393 -25275 65580 131429 147935 109504 30354 -59036 -122905 -140775 -109741 -39284
471 -39284 47362 115452 138476 110116 41575 -41771 -106951 -131656 -110399 -48734 31133 99223
483 99223 129680 112964 52226 -26444 -91137 -121191 -108708 -57199 17040 84158 118553 109196
495 109196 58899 -12094 -75846 -111619 -107271 -63654 3416 67755 106751 107961 65672 -1142
507 -1142 -62534 -100441 -104018 -68620 -7155 56293 97760 103120 69564 10681 -48237 -90141 -99447
520 -99447 -70331 -15987 41780 84811 97544 71966 18986 -37584 -79612 -94436 -74037 -25079
532 -25079 30652 75626 91595 72673 28144 -25108 -69412 -88553 -71940 -30449 20291 63758
544F3758K1522j1404l9160n0467m3599k1997Q380L5699M7360M4307K3204p029
556G0574l1427m4946m4689k5344O007K9980M2307M1534K6678n45k6408m1283m2861
569d0423k6808K47K2861L8746M1163K8127L300k0485l7324m2735k9007l407J9830
582d5915L4284L8942K8634P245j6424l3108l7506k8717p931J3662L0017L6833
594B0016K8982J0807j0697k8408l6942k9569j1139R081K5992L4424L0028J2719
606E5294p216k5307l3186k9216j3071N066K1767L2739K8899J4651l290k0237l0819
619c926k7796j5397R73J7988K9864K8010J6669j77j7247k8680k6601j6263k181
632d4764J3783K7074K6471J8351K425j3087k4858k6212j7120m950J1132K3792
$$ plain form
544 63758 85280 73876 34716 -15751 -59350 -81347 -72967 -37268 10092 54399 77603 70574
556 70574 39147 -5799 -50488 -75832 -69825 -39845 2462 43996 70674 70129 43721 2438 -40423
569 -40423 -67231 -66984 -44123 -5377 35786 63913 67213 46728 9404 -33331 -62338 -65745 -45915
582 -45915 -11631 27311 55945 63190 46766 13658 -23848 -52565 -60496 -46834 -16817 20016
594 20016 48998 59805 49108 20700 -16242 -45811 -56950 -47869 -21877 12547 42575 55294
606 55294 48078 22771 -10415 -39631 -52702 -47636 -25869 6870 35769 50420 47130 26893 -3926
619 -3926 -31722 -47119 -46146 -28158 1706 29716 46385 46208 28961 281 -26320 -42583 -44764
632 -44764 -30981 -3907 22564 40915 43340 30253 5395 -20817 -37937 -42887 -31755 -7963
644g963K6231J8860N407j0885k2105k4284j7508p701P430K1063K4319J9084P333
657C9281q047j9012k2664j8224r134N034J7569K3074J9012R420m600j6398k1070
670e759j8881r646L110J4592K0519J9104J0676k758j3822j8946j8190j1195R9
683c1097J2405J8206J8947J2030q47j0617j7545j8028j2440p97R947J6751J7488
696A4403J2751J945q724j5172j7929j2620k193P753J4149J5834J3872K968o379
709B0658j3747j6189j2885m395N643J2842J5618J3036M793m567j1843j5181j3106
722a9323n013M063J0608J4610J2240O277k390j0651j4316j2679n798J833R105
735a1434J3092J2835P341j359q353j3391j2312o487M7P542J2599J1480Q064j03
$$ plain form
644 -7963 18268 37128 42535 31650 9545 -14739 -32247 -39948 -32518 -11455 12864 31948 39281
657 39281 31234 12222 -10442 -28666 -37800 -32766 -15197 7877 26889 36309 31709 15311 -5759
670 -5759 -24640 -34286 -31176 -16584 3935 23039 33715 30957 17135 -1811 -20001 -31196 -31097
683 -31097 -18692 -486 18461 30491 29644 19027 1482 -16546 -28986 -29783 -19836 -3085 14403
696 14403 27154 29099 20375 5203 -12726 -25346 -27539 -19786 -5637 10197 24069 27037 20658
709 20658 6911 -9278 -22163 -26558 -20915 -8073 7545 20581 25374 20807 8964 -6217 -19323
722 -19323 -24336 -20273 -9665 4945 17185 23462 21072 10421 -3895 -16574 -22372 -20539 -11434
735 -11434 1658 14493 21834 20475 12122 -1269 -13581 -20068 -20021 -12479 120 11600 19664 19561
749A9561o869j1092j2426p584n56N836J0576J1859Q214J695n215j0944j1242q117
763a6304k109M636R525J1519P950K783m078r043j0779p911l384L182Q364J0162
777D513Q744L801k659q126r956q306m027J720P656R106Q319M802j981o284r441
792b119q277l909J036N203R075P986M825j36n899q044p400n549j67N014P737P889
808G265N079Q01m315p510p700n421n25L535P206P248M898J221k811o447p805m871
824a0152j695L118N856O299O065K507k576n538p203n344k723K049N320O509N779
839H271K284j322n369o080n718k100P40M417O603N047L318m58m463o060n390k705
855h985M93L324N461M991L661j40l137n040n707l803L9L039N158N224L331M39
$$ plain form
749 19561 12692 1600 -10826 -18410 -18966 -13130 -2554 9305 17519 19214 13999 3055 -8187 -16304
763 -16304 -18413 -13777 -4252 7267 15217 18000 13922 4879 -5900 -13811 -17195 -14013 -5649 4513
777 4513 13257 17058 14399 6273 -3683 -11989 -16016 -14296 -6640 2466 10785 15587 13606 7322 -2119
792 -2119 -10396 -14305 -13269 -8066 1009 8995 13820 13684 7785 -259 -7659 -13208 -13375 -8361 -624 7265
808 7265 12344 13145 8830 1320 -6380 -11801 -12326 -8791 -1585 5663 10561 11782 8971 2524 -5281 -10152
824 -10152 -11847 -8729 -2873 3426 9491 11998 9422 3884 -3319 -8663 -11386 -9337 -4017 2492 8271
839 8271 10555 9233 3864 -2216 -7934 -10034 -9294 -4877 1726 6773 10091 9633 5170 -890 -6280 -8985
855 -8985 -8492 -5168 293 5284 8945 8805 5668 628 -5079 -8882 -8843 -5804 -646 4578 7909 8348
871H348k527m419n486l298q95K107M466N643L391Q66k382l915m470l921j032J601
887e923L247M427M114J270p35l858m346l334j755O23L307M650L273J881l40l363
903C138l839m031j365J46K811L637L874J781k20k301m000l168k422pJ935L871
919a60L360K538j45j677l695l368j911n71J729L377L191K296K39j500k348l358
935b003k949o67J720J965L882K499Q56j541k368k681k588p80L41K775K645K238
951C344J117l72k189k142l038j071M64J569K720K741R17k5j893k362k297j180
967c697Q2J529J803K579J475K39j779k053k288j608lM23L133K080J495K54r43
984B721k088k235j434q91J524J411K221J530O07n62j867k134j385m20N31J443
$$ plain form
871 8348 5821 1402 -4084 -7382 -8277 -6170 -1704 3939 7330 8196 5814 1899 -2571 -6492 -7524 -5923
887 -5923 -2676 1751 5865 7135 6400 2542 -1804 -5138 -6893 -6270 -2963 1687 4960 6841 6501 3138
903 3138 -701 -4732 -6097 -5951 -3140 497 4371 6152 5932 3631 -369 -3537 -5959 -5966 -4031 -160
919 -160 3200 5738 5593 3916 221 -3147 -5058 -5629 -3900 -523 2668 4964 5203 3703 1355 -2003
935 -2003 -4952 -5619 -3899 -1934 1948 4447 5303 3762 1394 -1287 -3875 -4655 -4314 -1539 1106 3344
951 3344 4461 4089 1900 -242 -3280 -4351 -3887 -2318 402 3143 4060 4035 2142 -220 -2517 -3697
967 -3697 -3615 -2086 -283 2296 3771 4010 2231 178 -2110 -3718 -3721 -3298 -165 1915 3410 3664 2721
984 2721 633 -1602 -3036 -3927 -2403 -992 1229 2759 3366 2804 937 -1197 -2582 -3002 -2471 -1028
1000a028J846J788N40m22j598j435j843q50L28J337J688J303J562o24j109j390
1016I3k270p78M76Q39K073R42J299p61p73j479o31j849M85O43J198J916Q87j55
1034B155l64j492j283j176l6Q40P63J231J125L71o89l19j948j373k22L92J603
1051d22J020O98O46l0r42j544j018o13M58Q98Q67Q71Q26l78l66j167o78o60K8
1070a506L10Q76J500K80Q3m80j244q07n02l93J407M23Q87N26K43l15j292p87n40
1089a331L35J5N40Q80N85L69m31j8j490m48k45k1O25J146P34J68l82m80n5j412
1109i16m76L7P94O98N30J14P10p52p04n74q31j15P17P41P03J60R6n8r04o46j68
1130h44O1j58O95J038J68J25o94l29o08j29n04K00Q31P92L43k4l40o30R6p12l94
$$ plain form
1000 -1028 818 2606 3146 2724 1126 -309 -2152 -3002 -2674 -1337 351 1654 3216 2592 1483 93
1016 93 -2177 -2955 -2479 -1640 433 1375 2674 1913 1140 -339 -970 -2819 -2334 -1691 -493 1423 2310 2155
1034 2155 1791 299 -984 -2160 -2196 -1356 -593 638 1763 2134 1445 1126 -822 -2195 -2417 -2025 -422
1051 -422 598 1296 1942 1912 970 -574 -1592 -2205 -1747 -849 18 889 1715 1337 971 -196 -874 -1534 -1506
1070 -1506 -1196 -320 1180 1460 1543 1063 -181 -988 -1490 -1883 -476 -53 834 1360 1603 1288 -4 -791 -1331
1089 -1331 -996 -981 -441 439 1024 1393 962 944 -546 -994 -1239 -1260 -635 511 1245 1413 1031 551 496 -916
1109 -916 -1392 -1355 -561 137 667 781 1491 739 35 -539 -1370 -1485 -768 -27 676 836 932 874 -30 -676 -844
1130 -844 -783 -941 -246 792 960 1085 391 62 -546 -675 -1179 -979 -148 644 987 963 623 -7 89 -623 -1017
1151a017l59Q32O32O92j34l16J20r86K54m65P6j81N94L14P98Q9m62p83l74j89
1171h65p4M23K35M95M2M53j85J85o12p71q1K75M27J89J17O73o94l54j52k60K01
1192c33j34o61J800q8l75K82K80r43m60nJ29M32K09M30K04m68N48m79r49q9k99
1213i69L12N05N95L78J6m92l97k29L08q25M76K11P22k32O13k73m36k10m41j20
1233d88K02K40K12K53m13L69j33m28j39J48o95O78K15JK96J8j61k47o98J47L23
1254c00l12K34J26L97M04k83l93K30j62m2N20j021M78M91J98n7k83l58J25p58
1274g66L13M97j83m2O79k24N2l68k86j29R0L27n3N38l63K90k86K18l85l37n1J20
1296c49J87J97L61q1j5k64k8P8o54M39L86j7K91J91l25k88J10o64K84j26j38N96
$$ plain form
1151 -1017 -1376 -544 88 780 646 330 450 -536 -282 -747 -671 -852 -258 56 854 943 481 -302 -676 -865
1171 -865 -939 -516 -281 214 256 709 524 709 97 -674 -755 -480 -53 136 253 926 232 -122 -274 -534 -333
1192 -333 -467 -1128 672 584 209 491 771 -172 -632 -637 -508 -76 133 563 767 299 847 368 -581 -670 -969
1213 -969 -657 -152 443 821 837 345 -52 -281 27 -798 -322 -111 611 379 992 719 283 73 -368 -488
1233 -488 -286 -46 166 419 6 375 242 -186 -325 -177 -872 -194 21 22 318 336 175 -72 -770 -623 -300
1254 -300 -612 -378 -252 145 549 266 -127 103 -59 -101 419 -602 -124 367 565 508 225 -133 -8 -766
1274 -766 -453 44 -139 -181 498 274 326 -42 -328 -457 -367 -40 -93 445 82 372 86 304 -81 -418 -469 -349
1296 -349 -162 35 396 315 300 36 8 86 -568 -129 257 240 531 722 397 109 219 -445 -161 -287 -425 171
1318A71k93K90J52m19L34m35K1K8J51J5J38M7J21l72N79k91n83K41J12j56J95
1339D6K34k18jj24J93k91j15K35L7J73L95l67l40K55l32J42k75k55O86K4L17j44
1361B75j01l92K35k30l70J92K9J89O9Q2M86l43k26O0m22M83j87L33n1L49j17n45
1383b02L20m02L87m71J04o7O31p37L57J60j72Q7l37N2k43L80J85j1K21p76J290
1404G56r02R6L8om5K3K56J28m82L56m6l96L4j80K58j83K23k10O22o55K02jk99
1427d13k21N36J08j37L40n88Q90m50j62j85k70N54j19J53j0K90K6l29K06l57J38
1448@k52L71m11N05k31J04l11k92R00r36M51J64l22R39n31o40R28o8L51r97J01
1469a77J29n6J83L3k00j88L8J22L07l92K03r0K65m47L38Q8j32k18N28o04J86Q9
$$ plain form
1318 171 -122 168 320 -99 235 -200 -179 -151 0 15 153 200 321 -51 528 237 -346 -105 7 -149 46
1339 46 280 62 61 -63 130 -161 -276 -41 -4 169 564 197 -143 112 -220 -78 -353 -608 78 102 419 275
1361 275 174 -218 17 -213 -583 -391 -362 -173 -104 -22 464 121 -105 -45 -467 16 -171 162 111 460 343 -202
1383 -202 118 -284 103 -368 -264 -331 300 -437 -80 80 -92 -5 -342 -290 -533 -153 32 21 242 -534 756
1404 756 -146 -50 -12 -18 -63 -40 216 344 -138 218 172 -224 -190 -370 -112 -295 -72 -282 340 -315 -113 -114 -413
1427 -413 -634 -98 10 -127 213 -375 515 65 -97 -282 -552 2 -117 36 26 316 342 13 219 -138 0
1448 0 -252 119 -292 213 -18 86 -225 -517 383 -553 -102 62 -260 679 148 -492 436 368 719 -278 -177
1469 -177 -48 -104 79 112 -88 -276 -238 -116 191 -201 2 -88 177 -270 68 156 24 -194 334 -270 -84 5
1491EP5k71K92O32q83N23l39k91N3O26m00N4m20N15m5r6j12L94m92m26O26J62
1513A82k04k7J08k18K49l93O31n39M84k16L65n95N54n9j62o04k31Q19k55L38K0
1534B47k22K14l53o02P19n49J3L35K28K85k26j42L89o35M84o14K67j27K17K19
1554A47j25M38l08r9l54J29M3L81l92L24n01P05m90lL69n87K57R1k88K32N12p5
1576D06k08L15l53j80N8L75n60M1j65M01K71m41K80o5l52J70k28q5R5O10k39k86
1598a40N81l28j56o5p3L7L10j13K3K96M9p76O95m53k25M51K2Q6J90P3n81Q3n50
1621e64N88K57j001Q12J51p7l3K94o85K62J50r4l5P1Q28q74N36n38n18M81%p03
1643f92P30J93J47j15j52m9K83m86l4J75l23j93Q03j12K09k10j05l94j6K46k55
$$ plain form
1491 5 80 -191 101 733 -150 373 34 -257 -204 422 22 76 -344 171 126 30 -82 312 -180 -606 20 182
1513 182 -22 -49 59 -159 90 -303 328 -211 273 57 422 -173 381 322 160 -444 -675 144 -111 227 247
1534 247 25 239 -114 -716 3 -546 -533 -198 30 315 89 -53 336 -299 185 -429 -162 -289 -72 147
1554 147 22 460 152 53 -301 -172 -129 252 -140 184 -317 388 -102 -105 264 -323 -66 25 -263 -31 481 406
1576 406 198 513 160 -20 38 413 -147 -106 -271 130 401 -40 240 175 -177 -7 -235 -320 -225 385 146 -140
1598 -140 441 113 -43 -108 -181 -144 166 53 76 372 421 -355 340 -113 -338 113 135 221 411 484 -97 -14 -564
1621 -564 24 281 -720 92 243 166 133 427 -258 4 154 60 25 96 924 50 586 48 -470 11 11 -692
1643 -692 38 231 378 263 111 62 345 -141 -175 0 -323 -516 287 175 384 174 69 -325 -341 -95 -350
1664c50o9P77k40J86QJ10m94K2P3k77O76l98j54O20p87k67Q79q52P30k93L6J32
1686F8J44q4o2ml46M77k54J06l15N40m42L47M11k99m10j52J13OJ59l99M1O31J15
1709C91k65l18J25j72K54k22O74k0m59l78q1P25n82N47l27N85n31K44J38J20m77
1730b9K33k61L14l50n80O47j34K64j97j02L36l42k20M44k93L68j38L3J49j91l23
1751c72L47L00m45K15M28o05K1j000J206R8j69l93K52p6k32N55pm04Q17j78r8
1772B60j2o17L26r5K45k6k80M38k90j32J98o2L4L1k51N61O7n09l7m51O07K64n88
1795c19j58O43m89L37j14J65M35n71ol4K79N55p30N39q14K48O36m98l83J16K22
1816E9n2k03K05M87j19o27L47m32l8N88l78M22k30J81l34N09j04n88L38R7j98
$$ plain form
1664 -350 -419 358 118 304 312 422 -72 -50 23 -254 422 24 -130 490 -297 -564 315 -537 193 -100 -64 68
1686 68 212 128 66 62 -284 193 -61 45 -270 270 -172 175 586 287 -123 -275 -162 -156 3 -396 -355 276 391
1709 391 126 -192 -67 -239 15 -207 467 447 -12 -390 -471 254 -328 219 -108 477 -54 190 328 448 -29
1730 -29 204 -57 257 -93 -673 -26 -160 104 -93 -195 141 -201 -421 23 -270 98 -40 -7 142 -49 -372
1751 -372 -25 275 -170 45 473 -132 -111 -1111 95 193 24 -369 -117 -193 -425 130 123 -281 536 358 260
1772 260 248 -369 -43 -138 107 81 -199 239 -51 -183 15 -47 -13 18 -233 328 395 -114 -151 -602 5 269 -319
1795 -319 -477 166 -323 14 -100 65 500 -71 -77 -111 168 723 -7 532 -282 -34 602 104 -279 -163 59
1816 59 7 -196 9 496 377 -250 97 -335 -373 215 -163 259 29 210 -124 385 281 -307 31 128 -70
1837g0n3L76o7j67o4L21p95M60M16m36Pq7Q7l88M70K70k64J6K51k09J15l36J61
1860A4j28r8L75k61K67j13N9J82l95K4rJ47k41J18m6j1k83M80K5J24m48M2Q2J23
1884B9j83M47k85n01o5O83N3m09m0L85j53N6l10L00m10N87m54J01K41k16J51k91
1906b84k7J9N33k59j83M85n35Q55q02L35k55k27P18K21p75N60m12p3L69o99Q43
1927D07j36m83M27q4l02N7j05r5L94J74j44j20m5p9M0J35O1m3o2l07O13r6q67
1950f60M07J24P6J41k81L88o21M81O3M9j32k73L28j07N09m34N13r13j43M18K38
1971A71j17j27J34PJ07k41k34M15o3L04k12q5k1m7J0n8P3J68O4p40N96k54K34
1994H4j40o3J09p78Q14l48l28R35m08O57p18K70R9l86q8J22j65q5J72N07m6l38
$$ plain form
1837 -70 -123 253 186 19 -45 276 -519 -59 357 -79 -72 -159 -72 -460 10 280 16 32 283 74 189 -147 14
1860 14 -114 -212 163 -98 169 56 115 297 -98 -74 -83 64 -177 -59 -105 -116 -399 81 106 230 -218 -176 -94 29
1884 29 -154 293 8 -493 -558 125 178 -231 -271 114 -39 17 -293 7 -403 184 -270 -169 72 -144 7 -284
1906 -284 -311 -292 241 -18 -201 284 -251 604 -198 137 -118 -345 373 594 -181 379 -33 -106 263 -436 407
1927 407 271 -212 215 131 -171 -114 -219 -314 80 254 110 -10 -55 -134 -94 41 102 59 -3 -310 303 207 -660
1950 -660 -253 -129 -53 88 -193 195 -426 55 118 167 35 -238 90 -17 492 58 571 -342 -485 -67 171
1971 171 54 -73 61 68 175 -66 -300 115 52 356 144 59 38 -9 1 -57 16 184 248 -492 104 -150 84
1994 84 -56 -119 -10 -788 26 -322 -650 285 -123 534 -184 86 185 -201 -289 -167 -332 -417 -245 262 216 -122
2016a22R9J22n38N1J91J50J73j68l04K28M15n27L0Q5j79K42K59l20K98k91J11
2037EL86p12K99j21M53j26k33j6j30K1PK40kK3m71N54r7k5o03N27j70L59M23n36
2061E5J38j0m80K40j23RJ34m0J49k04K15j54L83l59M60q23R53p29m2L37L7J10
2083B56m56N32l44K43l42j27J69J45j5k46j57M69n40O89j33m75Q42K6P1p47o3
2104b03j12J08L57m22P39l14j49r8K21K17m12l27P86q0q74Q77n85L13K80k05p4
2125D3M00j75n23O19j85k33K76j35k06N91n04J53J77k95N3Jk14k8L64m07M54j57
2147F9J00l55J67n4M21j89l02O08k2n03L58k15l25L56rJ06p47N11K05l67L11j94
2169g0O55o51M55m73q5N6k58M42J28j81J05J12J44n43j35J97K21k58M40r21N28
$$ plain form
2016 -122 -23 99 -439 -388 -197 -47 126 -42 -346 -118 297 -230 -200 -115 -294 -52 207 -113 185 -106 5
2037 5 391 -321 -22 -143 310 184 -49 -65 -195 -174 -167 73 71 94 -377 177 80 55 -548 -21 -191 168 591 55
2061 55 193 183 -297 -57 -180 -171 -37 -77 72 -132 83 -71 312 -47 413 -410 543 -186 -228 109 146 256
2083 256 -200 332 -12 231 -111 -238 -69 76 61 -185 -342 127 -413 276 143 -332 510 536 607 -140 -203
2104 -203 -315 -207 150 -272 467 153 4 -94 127 344 -68 -395 391 311 -563 314 -271 42 322 117 43
2125 43 443 268 -255 364 179 -54 222 87 -119 472 -32 121 298 3 56 57 -157 -185 179 -228 226 69
2147 69 169 -186 -19 -73 348 159 -143 465 443 -60 298 83 -242 114 105 211 -536 -25 180 -187 124 -70
2169 -70 585 -66 389 -84 -169 -113 -371 71 199 18 123 235 379 -164 -299 -102 119 -139 301 -620 -92
2190i2M83o40l75Q66j96j85K42k85M90n99O68l13PJ1o7M09j79k93R9l03L42l81
2212b91K82n15P54O0l01J19k67j89O46m71K62j71j39O5k41L67l01K35J7K07j55
2233b7K95no76L38r3N31k28q0k19K36l40K70P1p0K46k59j47N34o20k03K50j71
2255c67Q93l66K39k85r3J55k80R3K7j82J55j53O60M4o20O0O14o88Q3l08J42K72
2277I5j23j1l52O70jk52l61N91l04l86J93JN49k66qq7N0%M2k77n67P68K08j39
2301C3K46o23n0O79n04L74l84J57K07j89k32J7O8Q4K02K70m81j78L81j23j78o9
2323b93L04M1k13Q7L95m19N15o23k3J00j55M59m6r2k44L27l3j18j87L32P5m9k8
2346A12j89J68j08O01m92k19j05J96J5r2J75o10M43L4j79N95K03j170L13Q08o57
$$ plain form
2190 -92 391 -249 -624 242 46 -139 103 -182 308 -291 377 64 71 82 15 424 245 -48 51 -252 90 -291
2212 -291 -9 -524 230 290 -11 108 -159 -348 298 -173 89 -82 -221 -156 -397 -30 -331 -96 -79 128 -27
2233 -27 268 263 -413 -75 -168 363 135 55 -164 72 -268 2 73 3 249 -10 -157 377 -243 -446 -196 -367
2255 -367 526 160 399 114 21 176 -104 -11 16 -166 -11 -164 496 540 -80 -20 594 -94 -11 -319 -177 95
2277 95 -28 -39 -391 279 278 26 -335 256 -48 -434 -241 -240 309 43 35 -52 -2 -2 40 -237 -804 -36 172 33
2301 33 279 -344 -394 285 -219 155 -229 -72 135 -54 -286 -269 -201 -117 85 355 -126 -304 77 -46 -224 -293
2323 -293 11 52 -161 -74 321 -98 417 -206 -229 -129 -284 175 129 37 -207 120 87 -31 -218 114 189 140 112
2346 112 -77 91 -17 584 92 -127 -232 -36 -21 -113 62 -548 -105 -71 -250 345 548 -622 -309 499 -158
2367a58J9K21p21R38j93m58L32J55j19k91Q14l73j96k30J65M83l42m62Q90m34
2387D0n5L62Jn66M47m03K07J95p0l97k96R65n94M11n11j64L25J97J79m21M54Q1
2409C87o83L97q7M1K4R6k84K87n19K31L47M72n33L05n30M72m44J28j02n4K72l01
2431g8j41L57M9l34M14j60p7k78k54M90j67l59K81L30r5j60J43P8k32r5J31j54
2453c11K82k52j36M24k57K81j21K13k9j74J39n79J08J13O31j08l47j1Q7k63P34
2474D24p70L14j68K51L94p34K24K01k56pJ94k81M10k67J4L23k09J5m80M52K30
2495B74n26L13j82j72j81N11r7m7L17R9m06L1k65L37n1k33M24m68L15j28M64j30
2517A99j78J56l39K5j59N79k24k20M56J48p85N90j2R0j75k63j0k59N26l43M36
$$ plain form
2367 -158 -139 82 -639 299 106 -352 -20 135 16 -275 539 166 -30 -260 -95 388 46 -416 474 40
2387 40 -15 347 348 -218 229 -174 33 228 158 -239 -535 430 -164 247 -264 -428 -103 94 273 -148 306 387
2409 387 -296 101 14 55 79 175 -109 178 -341 -110 237 709 176 481 -49 423 -21 107 5 -49 223 -78
2431 -78 -219 138 187 -147 267 107 30 -248 -502 -12 -179 -538 -257 73 -22 -182 -39 39 -193 -288 -157 -311
2453 -311 -29 -281 -417 7 -250 31 -90 123 94 -80 59 -520 -412 -299 332 224 -123 -134 -47 -310 424
2474 424 -346 -32 -200 51 445 -289 -65 136 -120 -127 67 -214 196 -71 -57 266 57 72 -408 44 274
2495 274 -252 61 -121 -293 -474 37 -60 -107 210 309 -97 -66 -331 6 -45 -278 146 -322 -7 -135 329 199
2517 199 21 177 -162 -137 -296 283 59 -161 295 443 -342 248 236 326 151 -112 -122 -381 145 -198 238
2538B38K44o11k3k71R7N95l95o72N59N46k76o8K43l86K93n00N72l40K56o3m35
2559c97M90J95o43J29K97j05n7n5l3L09j70k0J3L25l35M7L88k88Pj63m48Q25k93
2582A8J13k63J87m86M87lm1m69L54m6L00j30l66M56m29P77j44l51J76k57k1j31
2604b69L48m01J61L9K47j66J35M16m67J96o08K68J40k23L9q8m6M31l65L2L03j63
2626d1K05l99L67l9K77r69J139r13K15q2L3O87l11o25J64L28J49k42n7L38k01
2647B3Kj35k33J17nk7L33p5p3K01m12J48Q9O31n06L41o68jK27k11L48m65L18L89
2671C56j05m1j40J30k59L7L15n16M3J69j40L34m93L50K07n22p6j20P49%o30J57
2693a95K02j17L25p8j32J52J84l41K2q2K26l94l7M78j91l22M14k22J16j39J80
$$ plain form
2538 238 482 -129 -152 -423 -326 269 -126 -798 -239 307 31 -37 206 -180 113 -387 185 -155 101 38 -397
2559 -397 93 288 -355 -226 71 -34 -91 -146 -179 130 -40 -60 -47 278 -57 -10 378 90 97 -66 -514 311 18
2582 18 131 -132 55 -431 56 53 12 -457 -103 -149 151 21 -345 111 -318 459 315 -36 140 -117 -138 -269
2604 -269 79 -322 -161 -122 125 -41 94 510 43 239 -369 -101 39 -184 -145 -233 -279 152 -213 -181 122 -41
2626 -41 164 -235 132 93 370 -599 540 -373 -158 -240 -207 480 169 -456 -292 36 185 -57 -114 224 23
2647 23 25 -110 -343 -226 -231 -258 75 0 -73 128 -284 -136 -47 584 78 419 -249 -250 -23 -234 114 -351 -33 356
2671 356 251 210 70 200 -59 -22 293 -223 -180 -11 -151 183 -310 40 247 -275 -351 -471 278 278 -352 -195
2693 -195 7 -110 215 137 5 157 341 0 22 -60 166 -228 -265 213 22 -300 114 -108 8 -131 49
2714D9K57J64k99j88Q7l06O53m48N02l90j15N1N7O12o62K50n61k20J41O34o4O5
2736B69l02k80J15J76K53l65N6M08l2k65q1M26n53J33n00P34l25k31N19j46n0
2757d1K3l10N37m28L62k21p4P39p49j89K56N61j83k9p0k46K06j71P0K60m41K27
2779H9k4N5K52j61l02K17J08q4j3j9j9J16J13p67Q84m52q1r9j39L38M21m73L4
2802fL48l86j18L93k87K21J09n41j88J76M71Nj88J44l43N48l22J77J95m88K65
2823A85k77PO44m93J0M35k44j64k6n14K3L42L45J21o85K62k63K96j95j36L67q2
2845d2J0m00L20k49M69L22n25p9K97L0k5j2j18pk07K05r0J94k27N1m7J9L13k53
2869e1N10m87M2J06j88n38O07M8k6j34K25J02r5m16j53M93L3j06r9K44k24M03
$$ plain form
2714 49 306 470 171 -17 70 -236 417 -31 471 81 -34 17 74 686 24 274 -287 -507 -366 268 204 269
2736 269 -33 -313 -198 -22 231 -134 -78 330 298 33 -48 378 -175 -42 -542 192 -133 -364 155 9 -41
2757 -41 -18 -328 209 -219 143 -78 -152 587 -162 -351 -95 466 283 254 184 -62 144 -27 43 303 -138 89
2779 89 65 120 372 211 -91 126 234 150 137 118 99 215 328 -439 445 -7 -88 -187 -326 12 433 -40 -6
2802 -6 342 -44 -162 231 -56 165 274 -267 -455 -279 192 197 9 153 -190 358 36 213 408 -80 185
2823 185 -92 -85 559 66 76 511 267 103 77 -437 -414 -72 273 394 -291 -29 -292 4 -191 -327 40 -42
2845 -42 -32 -432 -112 -361 108 430 -95 -174 123 153 128 116 -2 -9 -216 -11 -101 93 -134 -83 -130 -111 202 -51
2869 -51 459 -28 14 120 -68 -606 1 49 23 -111 114 216 121 -295 -448 45 78 -28 -127 117 -107 296
2891B96j34p8M58p07J3M71o8J72p28K91J8K23l32j34j10J90O4N4k31N26O3m23
2913a06j61o3K91k74N91n42L24k72J49k7l5R6L12k70k06J19K0L5O3n7N11o30K26
2936I4qm88N39k36J28k96K90m9K8j47l1K0j0K01j95l5J30k9K3K16L0K33l25m52
2960c69M98J48M7k70k50M19kk26q4K51j81k90L78Lk54l17J051j31n02K15j17J0
2982B7k25K75j39k39J02L84J63o05K91J66o06O55j18q31N01N11j65j49M13m36
3002b5k31J37M70k61J93j10Q3p63N12q0k86N91l20l5N51o69K67jJ20o2m0J8k14
3025a55R2k07O95p30M95l57L7J87J40Qj55M34m48N5q1l10J38j15L69k9m47k59
3047f43N25L7QO4j21K62k2l6Jo02M64n9N43m19P24l45j37l04N90p40M97m14j87
$$ plain form
2891 296 162 84 542 -165 -152 319 251 423 -305 -14 4 227 -105 -239 -349 -159 -95 -41 -272 254 317 -106
2913 -106 -267 -330 -39 -313 278 -264 60 -212 -63 -90 -125 -29 283 13 -193 -74 -54 -19 44 -13 498 -132 94
2936 94 86 -402 137 -99 29 -267 23 -26 2 -145 -176 -156 -166 35 -160 -195 -65 -94 -71 145 175 408 83 -369
2960 -369 129 277 324 54 -196 223 221 -5 -89 162 -19 -309 69 72 -182 -499 552 421 -81 134 17 27
2982 27 -198 77 -62 -301 -199 185 348 -257 34 200 -406 249 131 -700 -199 312 147 -2 411 -25
3002 -25 -256 -119 351 90 283 173 256 -507 5 -75 -361 230 -90 -125 426 -243 24 23 143 81 41 59 -155
3025 -155 -63 -270 425 -305 190 -167 -130 57 197 205 50 484 36 91 10 -300 -162 -277 92 63 -384 -643
3047 -643 -118 -81 -73 -9 -130 132 110 74 75 -527 -63 -122 421 2 726 381 244 -60 530 -210 287 -127 -314
3070c14K62m34N32K53n70M07J01k56K51m80k5M19m42P48p04k1P91r00L31k55K08
3091i8q9L78j66P3n30L28L54Q8m98k87O87m5K10l19K63n10l5J06j59N13k20k17
3113a73j41N20M08p13M40m82K37l71J41m7m1j8R8k04M36K19n13L00j35j12L22
3134A71o4l12N3j82K90K74m41P78p05L44J53k25L25o42kJ99l34K85j8k6M26J66
3156E13m33Q8l05L45l01n9j46O01k81m81O99o75L37J12L74p33O03K0mo10J86L65
3178B15l75l8K66m13M51j60J74j46R0l12N83k59L6J27q58P99j64j75L11o24N99
3199A27j20m55K92j76R0L62r2L7P8j97J47n56L32j53O55k9m59l01N45M14m49M0
3221A32M14n53l96K54n9J99L54m65R7J35n16M04j42K12P7k84L1K99o07L57n4k50
$$ plain form
3070 -314 -52 -486 46 299 -271 136 237 -19 232 -248 -273 146 -296 452 -252 -273 518 -382 -51 -306 -98
3091 -98 -187 191 25 98 -432 -104 250 338 -160 -447 240 195 405 86 349 -161 -196 -90 -249 264 44 -173
3113 -173 -314 206 614 -99 341 -141 96 -275 -134 -181 -222 -240 -142 -346 90 309 -204 96 -39 -151 171
3134 171 107 -205 -152 -334 -44 230 -211 567 -138 206 359 134 459 -183 -185 14 -320 -35 -53 -79 347 513
3156 513 80 168 -137 208 -93 -152 -298 303 22 -459 240 -435 -98 14 388 -345 258 278 274 -336 -150 215
3178 215 -160 -198 68 -345 106 -54 120 -26 64 -248 335 76 112 239 -619 180 16 -159 152 -472 127
3199 127 7 -448 -156 -332 -242 120 28 65 143 -54 93 -463 -131 -284 371 342 -117 -418 127 541 92 132
3221 132 546 -7 -403 -149 -208 -9 345 -120 -23 112 -404 0 -142 70 147 -137 -106 193 -414 -57 -111 -361
3243c61L08J88m85l70P09n2J66j24K59m87J17P76n32Q5n49O10o6l05J88k07J20
3264a2k15J72k74L96J20j06k30R9J75k43M92m39J76j6lJ81J0n64R1L97Kk05j45
3287a41J78J93m51K47K59q4k06J79J82l51M1K28n62O9P1J90p4k2j01M90l6l57
3309e8K30n6j97j74P1K03J52k67P5O84m67J59n0m00J38k73N20r6j5k07j56N2N10
3332C78l42o8J16r7jJ60m71O71k48J83r8l18Q1k88L11j8lk59L63m41K88K81k83
3355a03m2o8N06m40M88l10K31p0o23K89M17l38K94L06j084M37O1k09K89M0j84
3376a13O42n46N94l01k27K24k54Kl69Q1J71K03j27PJ37l02L94J95o58K40J02j19
3398b4N3J26j21m72N66O6L49k60n50j04Q91n22J42J09o5m96Q05o59J70k61J77
$$ plain form
3243 -361 -53 135 -350 -720 -11 -63 103 -21 238 -249 -132 644 112 197 -352 258 192 -113 75 -132 -12
3264 -12 -227 -55 -329 67 187 81 -149 -50 125 -118 374 -65 111 95 92 273 283 -281 -190 207 209 4 -141
3287 -141 37 230 -221 26 285 201 -5 174 356 5 46 274 -288 -219 -148 42 -32 -54 -155 335 299 -58
3309 -58 172 116 -81 -255 -184 19 171 -96 -21 663 196 355 305 -95 43 -230 290 194 179 -28 -184 -132 378
3332 378 36 -32 84 -13 -14 146 -325 346 98 281 183 -135 -54 -342 -31 -49 -52 -311 52 -389 -101 180 -103
3355 -103 -145 -213 293 -147 341 31 262 192 -431 -142 275 -63 231 537 -547 -110 -49 -258 31 71 -113
3376 -113 529 -17 577 276 49 273 19 21 -348 -267 -96 107 -20 -13 124 -178 216 411 -247 -7 95 -24
3398 -24 29 155 34 -438 128 194 543 283 -267 -371 520 -2 140 249 184 -312 493 -166 4 -257 -80
3419h0L0N4J96o0J56m57N91j82l03o3M4m99P45k1M5j19j6p3Q22q17L06k41m23
3442c65O65n03J7L49l18J99J09l83L77l84O70n36r5J41n2J18j52J35m69K25J48
3463a04J93k6m87N73k77j01L38l15J59n0K41J1l11j28M0J25j46R8M04r3J04j93
3485E5M3k14J36j10l87K09k12O54p8j32L54k67K1k03J86j9r3L20o30K04O4K66
3507A67l30l53K45K10M15l08l35J46qK37N1n0m47N19JP2k12q6K2J55R6k35q9n9
3531a76P15n79k13J31P0J65m80K86j32M12p6J82l69K24l70j0K20q3R0J16J1K53
3553C87n57J55j44k01M02k97J67q8R79q67j02K42n9K87k42J21J67l31m48l4L45
3574a18K14L6O7k24K24k62n4L81o61J82L23r5k77R9L60m96j45Q7J67R6k31N46
$$ plain form
3419 -80 -50 4 200 140 296 -161 430 248 -55 -118 -74 -573 172 151 196 77 61 -12 810 -7 299 58 -365
3442 -365 300 -203 -186 163 -155 44 153 -230 147 -237 433 -103 -198 -57 -109 9 -143 -8 -477 -252 -104
3463 -104 89 63 -424 149 -128 -229 109 -206 -47 -97 144 155 -156 -284 -244 -119 -265 -167 237 144 248 55
3485 55 98 -116 20 -90 -477 -268 -480 174 96 -36 318 51 72 -131 55 36 -57 263 -367 -163 -99 167
3507 167 -163 -516 -271 -61 354 46 -289 -143 -151 86 137 87 -360 159 160 232 20 -66 -44 111 207 -28 -117 -176
3531 -176 539 -40 -253 -122 -52 113 -367 -81 -213 199 123 305 -64 160 -210 -220 0 -83 7 123 134 387
3553 387 -170 -15 -159 -360 42 -255 -88 -176 803 -64 -166 76 17 304 62 183 350 19 -429 -463 -118
3574 -118 96 132 199 -25 199 -63 -117 264 -397 -215 108 13 -264 -165 195 -301 -446 -359 -192 -96 -327 219
3596B19m42L24K82k53m30m1K24K34q0j78J50K4l23K07M81p15N05J18j50j82K76
3617B50k43J61k23N00o37Q88p64q5l80M62k6l35K65K24n4j83R1J93l9K54n43n35
3639g59J312m95J9j04P4j42j97k32M33J01J09k07L86l26M22j85K39r8n20J43j75
3660b02M58k80K13k41j52L85n15L37K29j15k26NN7L95n96J13K22K94k77l70N54
3681B88l78K52l05M99m93J27n43P00j54j82K42k50L60k56N24n50M21k73n3L79
3701C55j93l52J10k7R7L66l00K13K26o49J50M5m67M55K98l19J82j22q1j21L13
3722A79l72M2J75l79p6K47J12K24j32j96J65N97n87L69n05K37j35J94k15k41O41
3743C44k77l95J055q57k34K52N94m25l08j31L93m55m6O06j85M39p6j96p08K75
$$ plain form
3596 219 -223 101 383 130 -300 -341 -117 117 37 -141 9 33 -290 -83 398 -317 188 306 156 -26 250
3617 250 7 168 -55 445 -192 696 -68 -153 -533 -71 -97 -432 -167 57 3 -180 -89 104 65 319 -224 -759
3639 -759 553 58 77 -27 47 -95 -292 -524 -91 10 119 -88 298 -28 394 209 448 350 -170 -27 -202
3660 -202 256 -24 189 -52 -204 181 -334 3 232 117 -109 -104 -47 348 -248 -135 87 381 104 -266 288
3681 288 -90 162 -143 356 -137 -10 -553 147 -7 -189 53 -197 163 -93 431 -119 302 29 -24 355
3701 355 162 -190 -80 -107 -10 356 56 269 495 -154 -4 41 -426 29 327 8 190 68 -13 -134 179
3722 179 -193 -151 24 -355 -431 -184 -72 152 20 -176 -11 586 -1 368 -137 100 -35 159 -56 -297 344
3743 344 67 -328 727 -130 -364 -112 482 57 -251 -382 11 -444 -490 116 -69 370 294 98 -610 -335
3763c35J76K18j00L26N8j37n05J58K89k73L68l91o6J57m29K94M24m64J54M68n9
3784C31K7l26J98j37l91M16j03k99rL64N04n22l05N2L99p56O17l72L85J39l30
3805a18N42k94p76M19j12N48J8k03k61j96N10n99Q62J64m10p98R17p1j33l49J71
3826a69L33j85m8K83l72M92p16J17N95n52K39k24J55L4q1J98o96L75K24J78l27
3847a47L40l69J96J32j82K07k10J98R2l39J22k38J43N15l60l02Q0L91l34J16P7
3868A28k56K19o4k14L7N49m88L53Rk29n6n2o1L2L49J1p04O9J79J29m8R6j50M75
3892C13l09L02L1n42K24Nk80K53J63m31j5j07M03J34n2M2n42L95m35M5n0M87K96
3915C30j36j23j68N0j13N29l07o46N38J80l39K28l14L64%l61J33L29k49kj66N27
$$ plain form
3763 -335 -159 59 -41 285 343 206 -299 -141 148 -125 243 -148 -214 -57 -486 -192 232 -232 -78 390 331
3784 331 358 32 230 93 -298 118 15 -284 -293 71 575 53 -252 -200 199 -557 60 -312 73 212 -118
3805 -118 424 130 -646 -227 -339 209 227 24 -237 -433 77 -522 340 504 94 -704 213 142 9 -340 -169
3826 -169 164 -21 -69 214 -158 334 -382 -265 330 -222 17 -207 -52 -18 -99 99 -597 -222 2 180 -147
3847 -147 193 -176 20 152 -30 177 -33 165 257 -82 40 -198 -55 460 100 -202 -122 269 -65 51 128
3868 128 -128 91 27 -187 -150 399 -89 264 273 44 -12 -64 -125 -93 256 267 -437 -368 -189 -60 -108 -12 -162 313
3892 313 4 306 337 -205 19 24 -256 -3 160 -271 -286 -393 10 144 92 134 -408 -13 -448 -403 -453 34 330
3915 330 194 71 -97 -47 -160 369 62 -584 -46 134 -205 23 -291 73 73 -288 -155 174 -75 -77 -243 284
3937B84n14L18O3k42J41k97J66q4M29j97N26n22j25L22l76l3J2K4l52M14J5j1
3959c9K61k60j41q1J80J36j00j67j23O45k26K29m02N0l0M9L84K30q17j01L94j06
3981c5K31l10O08n67Q9l63P55l01O3m5m09M00r6J4J92k47R0J62k34l7k47P31p28
4004b84M28r5K39K25m84j91o5N29j89m27L19l33Q13k64n05J53L68k01j00O40j60
4025D16j47j59J42m1J69k10k75k13M47k06q8l6J4L22k15q0N09J50n49l03K85M45
4047C77k59k35J58o25O16J80k05L46m97K72k48p5M8L8N02p22M19m68O30r5l54
4068a97q8L91K1j50J23k90k34J58N34k16o48M43M10j4o3j40j52N8j4l18K24k05
4090c67K82n65N05K81l84M10q4k79J22k93J21L19J31N08p62o0O3j17m1K1N9l37
$$ plain form
3937 284 -230 88 151 -91 50 -247 -81 -165 264 67 593 71 -54 268 -108 -141 -129 -105 -457 -43 -28 -39
3959 -39 222 -38 -179 -260 -80 56 -44 -211 -334 311 85 314 -88 -38 -68 -19 365 595 -222 -323 71 -35
3981 -35 196 -114 494 -73 16 -347 408 107 170 125 -284 116 20 34 226 -21 69 231 -3 -40 -287 444 -284
4004 -284 144 49 288 513 29 -162 -227 302 113 -314 5 -328 485 221 -284 -131 237 36 -64 576 416
4025 416 269 110 252 211 380 170 -105 -318 129 -77 -165 -201 -187 135 -80 -160 349 499 -50 -353 -68 377
4047 377 118 -117 41 -584 32 212 7 353 -144 128 -120 -195 -147 -109 393 -329 90 -378 252 157 -197
4068 -197 -285 106 127 -23 100 -190 -424 -266 268 52 -596 -153 257 243 180 40 -112 -54 -68 -386 -162 -367
4090 -367 -85 -650 -145 136 -248 162 78 -201 -79 -372 -251 68 199 707 -55 -115 -52 -169 -210 -189 -130 -467
4112d67P24j62m29M63l5J98k97L9J39o18P17p06J04M08l56O3l65R11n95P4j6K5
4134a81P7L78m38M33o6K9l22J18L17m04k32L53K88k98j12o8N32o71j8Q2K51j45
4156i7%J99Jn24R01l57M50m10J22J13l98P3LK08n60J74N52n33L64k55k59K35j28
4179a26K42l45K23k58j46L03J89j96L02L92q70J67K10l68K76m4L5n3J46j14j10
4200a45n9L59j53L41n35L80J90l11M0J01j55J3n0k54O39n56K55j19m31K77M71
4221B98j72R6K76q29O01l96K69M4o68J148o03j21J18l06L77m11L84l26M68p62
4241e15P01n14R16o82J08L10l46N6j19j58M74Qp84O16l76P7P6L23j4q0J97l55
4263h1k10M49k3k50j63J95L51l33L23k51O4p0l47K32q8J38l78L3L95Q9r5l97K63
$$ plain form
4112 -467 257 95 -334 129 94 292 -5 34 173 -445 272 -434 -330 78 -278 -215 -580 331 -264 -190 -206 -181
4134 -181 -104 274 -164 269 203 232 -90 28 345 -59 -291 62 350 52 -60 -128 404 -267 -285 -203 48 -97
4156 -97 -97 102 103 -421 480 123 573 163 285 398 0 73 76 284 -276 -102 450 -83 281 26 -233 2 -126
4179 -126 116 -229 -6 -264 -410 -107 82 -114 188 580 -290 -123 87 -281 -5 -49 -14 -67 79 -35 -145
4200 -145 -204 155 2 343 -192 188 378 67 107 208 53 66 16 -238 401 -155 100 -19 -450 -173 298
4221 298 126 222 498 -331 270 -126 143 187 -481 667 64 -57 61 -245 132 -279 105 -221 247 -515
4241 -515 186 -328 588 -94 14 324 -22 34 -85 -243 231 239 -545 71 -305 -228 -152 171 157 77 274 -81
4263 -81 -291 158 135 -115 -278 -83 268 -65 258 7 71 1 -346 -114 -202 -64 -442 -409 -14 75 -20 -417 -154
4286a54q4J93J22j57M2K52k43l76n8M67rk13L75K32J0n44j08L46n2j31J75j84
4308i9N62l92j09K08j53J7l06m3M50R6j89L17p5J42j99j88q5m6K7o16L17O29k76
4331a1M5JN4l63K81R4l1J12m16N56l40k6p0O1j62K75R7O3n24K9L24k41K25m1K7
4356A9L60m90Q36o70o14KN43J21j34o7L62n10j04L97L37p4k57m24m31Q11l89O49
4378B73m58M65k40j18J28L0P8J55n3L5ml51L60l94J65j10K98k41q4q8K91k13J53
4401G7K1k14k87K16l12N37K48k47j06K49M0m14J48L83o19N35R2r4l47j23L39L3
4423A55l72M64r4k18N41m18j8l4j88j68K63q8K33J4J11l28N39n36N15p89M50K52
4445B86q56N66k49K46N3k80P7K27K86J2q81N41j85rL20m75K30l94M90m65N15r5
$$ plain form
4286 -154 -238 -45 77 -80 -38 214 -29 -405 -463 4 -5 -218 157 389 399 -145 -253 93 41 -90 85 -99
4308 -99 463 71 -38 170 17 34 -272 -315 135 231 42 359 284 426 227 39 -46 -92 -65 -681 -364 265 -11
4331 -11 34 35 89 -274 7 101 70 182 -234 322 -18 -44 -114 -53 -215 60 157 220 -304 -275 49 -192 33 -8 19
4356 19 379 -111 725 55 -559 -557 -14 107 -27 -94 268 -242 -346 51 388 314 57 -367 -798 13 -376 273
4378 273 -185 280 40 -78 50 80 158 313 260 295 291 -60 300 -94 71 -39 259 18 -66 -154 137 -76 77
4401 77 98 -116 -403 -187 -499 38 286 39 -67 182 222 -192 -44 339 -280 255 347 253 -94 -217 122 155
4423 155 -217 247 153 -65 476 58 40 6 -182 -350 -87 -175 58 72 183 -145 394 -142 373 -416 34 286
4445 286 -570 -4 -253 -7 46 -234 -157 70 356 368 -513 28 -157 -166 154 -321 -91 -485 5 -460 55 -40
4467d0M25k64l00k81M83k6M1l94j53J90Q0q1M62m55L52M97q18P43l54n9J24J42
4489C14M8p03L61K25j05j45pj30q3L8P24J18m50J2j91j74K19k38l76N64L27j90
4511A58J2m59K39M6m4K84k13L85j80m66M03m77N06l2J25j95m65M01m13N47L4j25
4533G1m01N11K2j58J48m31P30l08J27j90j58K65j55pp6J64J50j79p3K9L40m67
4555d6j43L17l67P1P4k64K64k19J2O03k58l9l64N63k35M83m00L54P2j78J07m01
4577FK50k22j31J09j22K45K06m03K37j66r0P6J5l63J07J34J87O28m50l32L73l68
4599g4L98l33k09O3M30l19L66p16L58N65n36j21J4o1j13K35K90n37L75M8l92M41
4621A72k76p3J86K68j09p40P45M6j99Q7J87k93k9l46M05K18k13j28M26l34j02
$$ plain form
4467 -40 385 121 -179 -460 23 -3 38 -356 -509 -319 -239 -320 142 -313 39 536 -282 461 107 48 172 314
4489 314 362 -341 20 245 140 -5 -12 -142 -225 -187 537 655 205 217 26 -148 71 -167 -543 21 348 158
4511 158 170 -289 -50 -4 -48 236 23 408 228 -238 165 -312 194 162 287 92 -373 28 -385 162 196 71
4533 71 -330 181 203 45 193 -238 492 184 311 121 -37 228 73 66 -10 154 304 125 52 81 421 -46
4555 -46 -189 128 -239 -168 -94 -358 -94 -313 -301 302 44 5 -359 204 -31 452 52 406 478 300 407 6
4577 6 256 34 -97 12 -110 135 341 -62 175 9 -81 -5 10 -353 -246 -112 75 703 253 -79 294 -74
4599 -74 324 -9 -218 -155 275 -44 322 -394 -36 529 -7 -128 -114 -175 -288 -53 237 -300 75 123 -269 172
4621 172 -104 -177 9 277 168 -572 173 219 20 107 294 1 -28 -374 31 249 36 -92 334 0 -102
4642a02J42M61j19l10K26m70Q3J69m8l59N20q9j05M51n50JK98M7j38lN1Q1l03
4665f6l80N30k43J09L03m59N46m82K70q0J07k55O6N0M07m45J14l64o6K08J7K14
4687A01j06m77P40k34j37O8M0p1M5j85R7L45M4j02k5p0J22q38N85m4L33k40j60
4710a69L21j48j54n0r9K08j11L81p24P95p6p7j29L6k22j21K67J84m2k84N3n9K36
4733A6m1k77L54M9n36M99K12j96J60m97q8N94m43kJ32M17l92j24J47l3j73J15
4755a07J13J24k97l17J058m30Q4l89m3L59o06J72K00j38J03or2j9M01K88n39L42
4777B61k60J90m5m58J47L62p17J5L02K14j08j23L68l83K32M1L14m24k8N28n28
4798a00m09L49M07p43M50k3J08j41K04P1r2J11j79P4j08J58q5K42k04j92j83M7
$$ plain form
4642 -102 40 501 382 72 298 -172 -89 80 32 -327 193 104 -1 450 -100 -99 199 246 108 105 156 237 -66
4665 -66 -446 84 -159 -50 253 -206 340 -142 128 48 155 -100 -34 16 423 -22 92 -272 -338 -130 -113 101
4687 101 -5 -482 258 24 -113 -45 -5 -76 -31 -216 -119 226 270 168 143 73 195 -643 -58 -102 231 -9 -169
4710 -169 152 4 -150 -200 -299 -91 -202 179 -545 250 174 97 -32 4 -218 -339 -72 112 70 -214 -161 -220 16
4733 16 -25 -302 52 101 -435 64 276 80 240 -257 -345 249 -194 -196 -64 353 -39 -163 -16 -49 -222 -107
4755 -107 6 130 -167 -484 574 144 228 -161 -204 155 -451 -279 -79 -217 -114 -120 -212 -231 170 458 -81 261
4777 261 1 191 146 -312 -165 197 -520 -505 -203 11 -97 -220 148 -235 -3 38 352 -72 -100 428 -100
4798 -100 -509 -160 247 -496 -46 -69 39 -102 102 173 81 192 13 87 -21 137 52 294 90 -102 -285 -238
4820b38L11R2l38M46j96j41J82m07N0N06k96J39j71K99j71m88L82r8J03j2Q0k26
4842a92P04l66n9k22K15j17J96r3k81L0O1M26l10J76m8K66n86l59P44M7k93J81
4864A20P3j21k02J44N24p30o1L85J42Q9p70P97m96J81K65m36j56K24n8L32k58
4885a2j38j93L44q8L4j28q2L70m08L15J97l02j32K99K0j23n7o4k69OK48L37l81
4908b07R5M87n60J27p5K56P7n82K64L82p85Q29m15n2L70m73N06m41M34l85m5P9
4930a14M53l28J3n7k2k50Q53l03j76L08j54o48L00J83k00J33l97J81K68k86M30
4951A87j79J19K61m33K31R3l95J61k99J0l3L1M40k56K9R9n3l7p7K45J49m50j0
4974a67L45j27l5J22J15L8O7l31R2l11J18Q6jo1K05k02j13O6q0j18M47r8l25Q3
$$ plain form
4820 -238 73 165 -173 273 77 -64 118 -289 -239 267 -29 110 -61 238 67 -421 -39 -137 -34 -46 34 -192
4842 -192 512 146 87 -135 80 -37 159 66 -215 -185 -124 302 -8 168 120 386 -200 -559 185 232 -61 120
4864 120 193 72 -130 14 538 -192 -253 132 274 363 -407 390 -106 75 340 -96 -252 -28 -86 246 -12
4885 -12 -150 -343 1 -87 -53 -181 -263 107 -301 14 211 -91 -223 76 96 -27 -84 -148 -417 -411 -163 174 -207
4908 -207 -112 375 -185 -58 -133 123 200 -382 -118 264 -521 308 -107 -159 211 -262 244 -197 237 -148 -193 -114
4930 -114 339 11 24 -33 -55 -305 548 245 69 377 223 -425 -125 58 -142 -9 -406 -225 43 -243 187
4951 187 8 127 388 -45 186 279 -116 45 -254 -244 -277 -246 194 -62 -33 66 13 -24 -101 144 293 -157 -167
4974 -167 178 51 16 138 253 291 358 27 119 -192 -74 12 11 -50 155 -47 -160 -94 -174 -292 155 57 -268 -185
4998a85J26k2K91l28l42O81m66L30L93k03M9o71K96K98P00r23j34j52O64o32L19
5019H9j38J31J16l7J98l09k08K17qP1K6k26NO8r2L73m28K08l08M3ro2J76J24j08
5044h8M43j76q6K60m68KL15J3k34K2K92l92l27M74k4J97l30K20m62P70m85l82
5066d46o8P31m64M34j14k55J96K35k62j42mj21k59K51N91k27K00l5l90MK42L02
5088C99j85k50k42N15n80J42N40n48nM33m44j15L77j70m3L21k53M14m82L06n26
5109c96K36L14m70N37k3n0m93Q58l87L8k08j21j47L01j98O06j9l52J97k24J77
5130A76j25l97N50k59M6J56k34l1N23k20J23k87J39K74o18J68P7o7N1k01l5K38
5152D7J00k61K45k17K84m66O24L85r16M94j22o03L92r6l14M06Q5R9l36N37k87
$$ plain form
4998 -185 -59 -81 210 -118 -460 221 -245 85 478 275 324 -347 -51 247 947 24 -110 -262 402 -230 89
5019 89 -49 82 198 161 359 50 -158 59 51 122 148 -78 -73 -5 -97 276 -152 56 -252 -209 -218 -280 -104 20 -88
5044 -88 355 179 93 353 -115 -113 202 215 -19 3 295 -97 -424 50 26 223 -107 113 -349 421 -64 -446
5066 -446 -514 217 -247 187 73 -182 14 249 -13 -155 -159 -280 -539 -288 303 76 276 241 -149 -145 97 399
5088 399 214 -36 -278 237 -343 -201 339 -209 -214 219 -225 -340 37 -133 -176 145 -108 306 -176 130 -396
5109 -396 -160 154 -316 221 198 148 -345 513 126 164 -44 -165 -312 -11 -209 397 378 26 223 -1 176
5130 176 51 -346 204 -55 -9 147 -87 -118 405 185 308 21 160 434 -184 -16 61 -6 45 -156 -191 47
5152 47 147 -114 131 -86 198 -268 356 741 -175 319 197 -406 -14 -110 -424 -18 67 166 -170 367 80
5173H0k27J40j86j43P0M55K99k98j63o31M52L75m54N34l88P33m89J52n50L17K28
5194C06m63J52n6l41O61l17k27M18m17L14J10L64o1l54N4J71q80K22O99m57J09
5215Gj32K67Q6j89l91j06L53K55K19On36K24L25N1n67K25J5l53J17N97j2m51M73
5238D83n13k31n11J006o2j17j26O70l49p5o16M61j46j96L15j57R9J31k36L10o37
5259d97N05l48j36K45J20l0K17J13p76N02J9j32j21N07L7l74M01r4j36q8J68K18
5281C20k63o8M13J82p24Q5p3O5n72L85J22M4j74L70k67O2K24k07r2J21K87o95
5303d55N23J38l30M22k40n7J35j76J7L58l91L2J18K76l23n6L94l30J31m0J01n19
5325b72l4J79K81ll36L53k62m41P46P1m67j14K56o33P57M63o24M18j37N5n40L7
$$ plain form
5173 80 -147 -7 -193 -336 -266 189 488 190 27 -604 -152 223 -231 303 -85 648 159 311 -239 78 306
5194 306 -157 -5 -61 -402 259 -58 -285 133 -284 30 140 504 443 89 143 314 -566 -344 355 -102 7
5215 7 -125 142 228 39 -352 -458 -105 150 369 375 -161 63 388 439 -128 97 112 -241 -124 473 461 10 483
5238 483 -30 -261 -772 234 172 55 -71 599 250 175 -441 20 -126 -322 -7 -164 -65 66 -170 140 -497
5259 -497 8 -340 -476 -231 -111 -141 76 189 -587 -85 -66 -198 -319 188 225 -149 252 158 22 -66 102 320
5281 320 57 -11 402 584 -140 -55 -128 -63 -635 -250 -128 -84 -258 112 -155 -93 131 -76 -168 -47 240 -455
5303 -455 68 206 -124 298 58 1 136 -40 -23 335 -56 -24 94 370 47 -9 385 55 186 146 247 -272
5325 -272 -306 -127 154 151 -185 168 -94 -535 211 282 -185 -299 -43 -676 81 544 -80 338 201 256 -284 -247
5347b47o1K17J99Rj79N40p58M81l02J00j27M99l00k56K74l06l7K95r6M33m43J50
5369H5L03o11m0N84n02J03j28j6L60K56o24N7k16J43N3L00q32N65J43m7j34l82
5391e80P29K0q3n69P59j91l5k76L05j08k18J89O2J97m11j37M60m0k36k26O56m86
5413b19N40k54P5K20o64K48L41k57J98l62J89J59l26M85n67P1J84K57o11j3Q2
5434b24n0K5N54l15M80m00l50K51M2K02n65J05L42k77l2J96m8L59k30m1L13m24
5456h7M45m89m3K96k80j22J68L76q43P38l96K33P1m19O20J56l22L33k36n67R3
5477b75N11qM2L5o15J15P14m18J1L70n31K8l60M45L21o55M75q86N48L00R7k0M
5500B48m69J34N6l68M28K28m10K24k76J54K49q2K9j67jJ02Q3K69n23k74l82P22
$$ plain form
5347 -247 -308 -91 108 117 -62 478 -280 201 -101 -1 -128 371 71 -185 89 -217 -254 41 -55 378 -65 85
5369 85 388 -223 -263 321 -181 -78 -206 -222 138 394 -230 -173 -389 -246 -193 107 -725 -160 -17 -64 -198 -580
5391 -580 149 169 86 -483 276 85 50 -226 79 -29 -247 -58 4 201 -210 -347 113 73 -163 -389 267 -219
5413 -219 321 67 142 362 -302 -54 287 30 228 -134 55 214 -112 373 -194 -123 61 318 -293 -306 -224
5434 -224 -274 -249 305 -10 470 70 -280 -29 13 215 -350 -245 97 -180 -212 -16 -64 295 65 24 337 -87
5456 -87 358 -131 -174 122 -158 -280 -112 264 -579 159 -237 -4 67 -352 268 424 102 435 199 -368 -275
5477 -275 236 228 270 305 -310 -195 519 101 112 482 -49 -21 -381 64 385 -270 205 -681 -133 167 264 244 248
5500 248 -221 -87 -31 -399 29 257 -153 71 -205 -51 198 116 145 -22 -23 79 162 431 -92 -366 -748 -26
5522b6M61l01l16k70M8Q49j74J9l8o3k83k38M19l54P64n15q4p6J62j4j03j03m5
5545b81P63l01k55J37j59K34J79k10j12K00j93j58l19Q22o44L29l5L0J57l03l69
5566d88O48J60m61N10r50Q91l56n0K66l64K9kJ4K19qK93p5m06j01O22l16k17j55
5589b97j06O27k71k2L68j11m80mK65k32K45k45m02R61n74O39k68o9L34n06k2J68
5611bj47RN2K33J50l84o9j55j16P1Q16o77k59J70l2O27k25l31L3K13m7R2k32P6
5635a34O76o41K13l66K85j1q3o8k64L27j70j6J64J13J45J43j88J42m00j00L51
5656A18k35m60M41O8K00m20J13O3K21O8o68L11M80k59R5k44J79j72J6L02M02r87
5678c68N9Kq1L80n4O62n77k23l20P25l39m01M50K17n8L71o91O73n47q3K53o1M63
$$ plain form
5522 -26 435 134 -182 -452 -404 445 271 290 252 189 -94 -332 87 -267 497 -18 -102 -178 -16 -30 -133 -236 -281
5545 -281 482 181 -74 63 -96 138 317 107 -5 195 2 -156 -475 347 -297 32 -3 27 184 -119 -488
5566 -488 160 320 -141 369 -581 310 -46 -96 170 -194 -165 -167 -153 66 58 351 276 -130 -231 391 75 -142 -297
5589 -297 -403 224 -47 -69 299 188 -292 -296 -31 -263 -18 -263 -665 296 -278 361 93 24 358 -148 -170 -2
5611 -2 -149 -140 -88 145 295 -89 -158 -313 -429 -358 458 -219 -478 -308 -340 287 62 -269 -236 -23 -70 22 -210 -134
5635 -134 542 -99 114 -252 33 22 -61 -129 -393 -66 -236 -252 -88 25 170 313 125 267 -133 -233 118
5656 118 -117 -577 -136 -68 132 -288 -175 -112 109 177 -491 -180 300 41 136 -108 71 -101 -85 217 619 -368
5678 -368 -309 -307 -388 -8 -62 600 23 -200 -520 205 -134 -535 -85 132 74 445 -246 427 -120 -203 50 -11 452
5701D52m34R8L1k11j78O15q07L71p2q3K87l3j77J87M3k11N27j43o61L64J60o63
5723e38N86r6J57p5l8J45N1k79L29l66K23l16N73J43l16o6k20J78j49K59k33K25
5745A77j4j74j15k42P28n13L81n39K60Q5j64j79L48P2l62R3L64l47L38K3P8j65
5767A33k01P9K81m41J61M27k69K4m98J13j9P0K6J97j79L92k28j66L45l64Q3K71
5789B37j76N5J89m08k53O08p40L78q3L4M65J86p76m2k3j93P41J23r0j10m16M55
5811A61P3l75K48l05J05j67J55N1J31P4j9L01l58l49N60l29J60K2j93L82l81J41
5833H8o4m35O0L69J83k05Q3N5J72k98j38k51L98k1L63j5n40L84k49J01Jn40M29
5856g0r5K07K47j53K73l98l86N04j25l65L11J88l78K47j88L36Q7q3n62N51p9k05
$$ plain form
5701 452 18 116 147 -64 -242 373 -434 -63 -135 -218 69 36 -141 46 89 -122 405 262 -399 -35 125 -538
5723 -538 48 -48 109 34 -4 141 192 -87 242 -124 99 -217 356 499 183 117 -103 75 -74 185 -48 177
5745 177 163 -11 -126 -368 360 -153 228 -311 -51 34 -130 -309 39 111 -251 -158 206 -141 197 220 298 133
5767 133 -68 11 292 -149 12 439 170 194 -304 -191 -210 -140 -114 83 -96 296 68 -98 247 -117 -34 237
5789 237 61 116 305 -103 -356 252 -488 -110 -193 -159 306 492 -284 -326 -349 -542 199 322 232 122 -294 161
5811 161 234 -141 107 -198 -93 -260 -105 -54 77 151 132 433 75 -274 286 -43 117 139 -54 328 -53 88
5833 88 24 -411 -351 18 201 -4 79 134 306 8 -130 -381 17 -4 359 344 -196 188 -61 40 41 -499 -70
5856 -70 -165 42 289 136 409 11 -375 129 4 -361 -50 138 -240 7 -181 155 242 159 -403 148 69 -136
5878a36K90j51J85q8l19J61K15K18k70o88O94r9L00m42j14K28J9J37m23K95q4
5899g2l45L18k18K79K7j75O9l5L73l43j92J48M99l91k58L80M18n35k97M56j33
5920b7M04n35P18l66j06J19n28Q40m11k87K83n1rq6J22L0J92k47N01l57j76j97
5942a74K27j79R3Q1j5J03J44k17l98M89m57K9L24%n00O50j58q2J69j25j66K79
5964A17l57j13J72K40O8m25l9L50K54o29o9M70J36L69l00p33N70j20k82L26J10
5985A15q0n43P7K87m49J220m49J2l57K66p5J45m35Q54o56k0j66J61kl0K06k11
6007a30k4K39n8k17M9j1K33k19j74p1J94K43m2l65O20j45k88j69Q6L64K2n9l25
6030b47l49K03O93m56k22M38L37m32qJ95M19l77l58r6J65K25l07O9M5L82M34m39
$$ plain form
5878 -136 154 3 188 100 -219 -58 157 375 105 -583 111 12 312 -130 -244 -16 3 140 -283 12 -72
5899 -72 -417 -99 -317 -38 -11 -186 -117 -152 221 -122 -314 -166 333 -58 -316 64 482 -53 -350 106 -27
5920 -27 377 -158 560 194 88 207 -321 519 108 -179 104 53 44 -42 80 110 302 55 556 199 23 -174
5942 -174 53 -126 -33 48 33 136 280 63 -335 154 -303 -274 50 50 -450 200 42 -40 129 4 -162 117
5964 117 -240 -353 -181 59 127 -298 -337 13 267 -362 -431 39 175 544 244 -489 81 -39 -321 5 115
5985 115 35 -508 -431 -144 -593 627 178 190 -167 99 24 169 -266 588 -68 -88 -254 -93 -95 -125 81 -130
6007 -130 -154 85 27 -190 -141 -152 81 -138 -312 -383 -189 54 12 -353 267 122 -166 -335 -249 115 137 78 -247
6030 -247 -596 -393 300 -156 -378 60 397 -35 -43 152 571 194 -164 -260 -95 130 -177 -108 -63 319 753 314
6052C14k47K56k18J49r4k11ql8K39j08q6J52L8j27J94l29n2R7J59l50L70J72j6
6075B56j40j74r2M60l40J87k70J81M85l79m81N9J0J20k9J8k80M65m24M12N20n36
6097B8j15K40M03r92P36m57K95k77nl52J34R39m12k93K98p67J028n96N98m87K13
6118A59l39J57R2M9j48j47O01p9N7n41R0m0pJ95j14j09K86l54J29N94m12p8l36
6141b95L08j3M0j04O21p16l53P93M9q5l98M5J96r0l22O39q02N58n2K09l70J23
6163a9k01P56l96k86M22j28j0k85R4lK93m1j43k04k0J65j04k75Q08j65k03J73
6185B28k3j76O9k41M51j067N97%k63L44M11j85j79k92L88M7j61L6k40L42K24N
6207C15o50L1K88M4j92J68K56p76P69j92p3l2M04l16kR29j394N30j36J81j8n1
$$ plain form
6052 314 67 323 105 254 160 -51 -59 -97 142 34 -52 100 138 11 205 -124 -176 -79 80 -270 100 272 256
6075 256 116 -58 -150 310 -30 157 -113 68 553 174 -307 -248 -238 -118 -147 -129 -409 56 -368 44 564 28
6097 28 -87 153 556 -436 300 -157 138 -139 -144 -496 -362 577 165 -128 170 -597 431 -165 433 -54 159
6118 159 -180 -23 69 118 -30 -177 424 345 402 -139 -49 -89 -96 99 -15 -124 162 -192 -63 531 119 41 -295
6141 -295 13 0 40 -64 557 -159 -512 281 330 245 -153 -108 88 -2 -324 315 -487 71 19 228 -142 -19
6163 -19 -220 536 140 -146 276 148 138 -147 -53 -56 237 196 53 -151 -171 -6 -110 -385 423 258 55 228
6185 228 205 29 98 -143 308 -759 -162 -162 -425 -81 330 145 -34 -326 62 109 -52 -16 -256 86 310 315
6207 315 -335 -304 -16 28 -164 4 260 -516 253 61 -12 -44 360 44 42 971 -423 107 -29 152 134 83
6229H3j85j87n33J002m14M45k21m1J37k46n5J29M60k11j27M66l77K27l14K89m05
6250g8L07N78j175O57m23K97N5K22m27m5r6N09k87j31L01k82m49R34l90o88J410
6271G99o19o64N35Qj20j97Q9Q5R1L36p86L20L21l62l15n1P55k3n38M49K8L24k47
6294B18k91K67O6o24K44j1L08k53J93J21j38k73k67N98M1j70P8j28J90J27j52
6315A44l58N17m18m7Q3K01j16L4L36q33L73K22n8K63o35O6P23k18k55n95O55K13
6337B97n68l8K79j8L22o55k90R57j78RJ7K5l37O0J94j21QJ82j00l17L86J77p06
6360d15k74K80K29k20L38K03O2p0j26l02O78m78l1O1K7j8j50J98R1k56O06n07
6382g4K49K2P5l03N06l78n0j56K7k42L68l57K96k63o6O02o85N09K25k70k45J65
$$ plain form
6229 83 -102 -289 -822 180 -234 211 -10 -51 86 -160 -215 -86 374 163 36 502 125 352 38 327 -78
6250 -78 229 807 -368 289 -134 163 218 440 13 -32 -128 381 94 -37 264 -18 -467 467 77 -611 799
6271 799 180 -484 51 59 -61 -258 -169 -84 7 343 -443 -123 198 -164 -479 -530 225 202 -336 113 141 465 218
6294 218 -73 194 260 -364 -120 -131 177 -76 117 238 100 -173 -440 158 199 29 107 -21 169 296 144
6315 144 -214 303 -115 -162 -79 122 6 40 376 -457 -84 138 80 343 -292 -226 497 279 24 -571 84 297
6337 297 -271 -309 -30 -48 274 -381 -671 286 108 117 134 159 -178 -118 76 -45 -37 145 45 -272 114 291 -415
6360 -415 -689 -409 -180 -400 -62 141 203 133 7 -295 383 -95 -126 -65 -38 -56 -206 -8 83 -173 433 -74
6382 -74 175 197 272 -31 475 97 47 -109 -82 -324 44 -313 -17 -280 -346 256 -429 80 305 35 -210 -45
6404d5L67M73q50p0J83m2l23L60O2K46m60M14l53j28K94k37p0J63n6m82M17l88
6426e25M84L97m50M53l31r6j5K91K74n29M4K49L46n37l8J13o7m58K96L71L4m93
6448a87O10o41J32K52m01r8P97p66j6r4N64j53j78j38P42o56J88K65m17J70j09
6469a34O38m27J79n00J43N9M87m46J16m97O21l59L04o78Q17n62K74O3k57L80j93
6490B8j81M36P3m09J66j6j4K2j21J49k40m45N81j31OK20L6J6n09M19k30M3K18
6513A17j25O00p00J25R9l98O05J1n86o22R81K5l79L37J02K55m00NnP1l55m4M22
6536A41m64M49n22K04M29j45p6N0N6N8j81M56m26n73N32J5J16q4k0m6K83O03l85
6559D70r74P99l07J74r7j06l82m12J143j03k53J26n5K34mk83j08J63O09n14K26
$$ plain form
6404 -45 322 795 -55 -125 58 16 -307 53 115 361 -99 315 -38 -166 128 -109 -179 -16 -72 -554 -137 -525
6426 -525 -41 356 -94 359 28 -68 -83 208 482 -47 -3 246 592 55 17 130 63 -395 -99 272 306 -187
6448 -187 423 -218 -86 166 -235 -333 464 -302 -318 -412 152 -1 -179 -317 425 -231 -43 222 -195 -25 -134
6469 -134 504 77 256 -244 -101 -42 445 -1 115 -382 239 -120 184 -494 323 -239 35 98 -159 221 28
6490 28 -153 283 356 -53 113 97 83 105 -16 133 -107 -552 29 -102 -96 124 160 176 -333 86 -144 -101 117
6513 117 -8 592 -108 17 116 -282 323 334 -252 -874 107 132 -247 90 192 447 47 52 47 118 -237 -281 141
6536 141 -323 126 -396 -192 237 92 16 66 122 180 -1 455 29 -544 -12 3 119 35 15 -31 252 855 470
6559 470 -504 295 -12 162 65 -41 -423 -835 308 205 -48 78 23 257 253 -30 -138 25 634 120 346
6580C46l53J43L7k27m0n80N03Q2K66O7k47p4l6o3L82k93r8n6L18J64j94Q0n92
6603d65K52J60p7J80l28L21k1j19p3L04M3l90RK90K22o32N00Ok0J10m36L53k09
6626b0j93J89K40l24N21m93J21N7n3J79R9N9o06J42L20k50k57K04K25L67q45N64
6648B46J17n74P71n86J54j99L49k21j12J48J68p13K35L17k5K14j74l13L66o5l31
6669b28K53k84M23p1l22j29M02m64P00m59N68q5m43j51K77l22P3k24M89N2O9l78
6691b54J8J95o7K73l14K27l60N56Q5M2l61j03J04M5q8K2Oj90K29K03j79J90K3
6714C02j25p0J75L34o18l07K62PL09l26j73j65P53m95K89l97k82L91M16p9L60
6735E61n82N24n84K18m53L08Q5J62j89kJ39m66K27J52M71j56J49p00l12N93p1
$$ plain form
6580 346 -7 136 173 -54 -94 -674 -171 -89 177 244 -3 -77 -113 -176 206 -87 -185 -241 77 241 47 127 -465
6603 -465 -213 -53 -130 50 -278 43 22 -97 -170 134 177 -213 -204 86 308 -324 176 182 162 272 -164 189 -20
6626 -20 -213 -24 216 -108 413 -80 41 98 45 224 323 382 -224 -82 238 -12 -269 -65 160 527 -318 246
6648 246 363 -211 560 -26 128 -71 278 57 -55 93 261 -452 -217 100 75 289 115 -198 168 103 -228
6669 -228 25 -259 164 93 -229 -358 44 -420 280 -179 389 304 -139 -290 -13 -335 -262 -486 3 55 124 -254
6691 -254 -236 -41 -108 165 -149 78 -282 274 359 401 40 -63 41 86 -2 20 26 -164 65 268 89 279 302
6714 302 177 107 282 616 -2 -309 -47 -40 269 -57 -230 -395 358 -137 152 -245 -527 -136 280 201 561
6735 561 -21 503 -81 137 -316 -8 77 239 50 48 187 -279 -52 100 571 415 564 -136 -448 145 74
6756G4m44K36K31k76L50k13M62q09K15j24R9K41j03L89m02J33K7n62P04m7o81
6777e00P91k92j68K74l37m7O77m9m90k83R14K08o74j86K65j97J18N1J13k31M75
6798D32k89K48o18N8M41l24J94m16L23K29o5n79j72N79K61l72n4L33o20J47pj00
6820c71J38O37m55l9J73l90M20j34L62l30l56J32K21R2l6L23o75L20Q8j04q4J52
6842H4k30L5M81l53O4L81o46N72m10J02K99J39p82O64Lr51P65m47P46q65M18m84
6864d15P80k86L20k16K29m14l56O31l53L2k93M28k43K13jl72O8N17m03k6J8J35
6886gR0J35k32J84j34K24J77Nr15Q03Ll50J61J17l6n24O72j28m14O09lj65J4j92
6910I4J08j48k91K42M9j28Q66n93l17L12l53O0M2k61N92l11j82M17l87J27j5J70
$$ plain form
6756 74 -370 -134 97 -179 171 -42 420 -389 -174 -298 -199 42 -61 328 -74 59 86 -476 228 181 -500
6777 -500 291 -1 -169 105 -232 -279 398 349 -141 -424 490 698 24 -162 103 -94 24 75 188 -43 432
6798 432 143 391 -227 -169 272 -52 142 -274 49 278 213 -366 -538 41 302 -70 -124 209 -411 -264 -271 -371
6820 -371 -233 404 -51 -90 83 -307 113 -21 341 11 -345 -213 8 100 64 387 -288 32 120 16 -68 84
6842 84 -146 -111 370 17 81 462 -184 388 -22 80 379 518 -264 400 403 -548 217 -230 516 -349 69 -415
6864 -415 365 79 399 183 412 -2 -358 273 -80 -48 -341 87 -156 57 56 -316 -248 269 -134 -160 -142 -7
6886 -7 83 218 -14 170 36 260 437 442 -473 330 333 -17 144 261 225 -299 373 245 -169 440 437 272 286 94
6910 94 202 54 -237 5 54 -74 792 199 -118 194 -159 -99 -57 -318 274 -37 -219 198 -189 -62 -77 93
6932I3m64R0n6L21k34O24m71Q1n0K15k79M45l79J84k79R3N88l30j23O2j59J91
6954A63m15Q1J88R0J56J14l35Q2l58q7L77l4L33l68K67k49K88o43J15J61O5K2
6976A3ll21k38O92J67k06n41K39N36j95l86K40K13L09m37P7k76J23k76N4O9J80
6998C3l60L70n43J077l60n03O58k56k82L76j76k2M1k13nk57K13N99k30n75L64
7019e1m61P07j53J20L9m6j14L95p50L33k79J49j57L92j49p3J32l1K4j5j7O41n29
7042A07m02L49M3o1j01J79k02l6L83k46k9K54n41N9M64n97J64o6M94m73M4Q5J48
7065A9L52o02L69p2j02o5J56J16p2j87P6J75o8K65j70n18j10M97krJ7j36M00p16
7089c87L04J42K29l21J32j43p3M54o8n09O79k0j97m40N59p31N60k44L68p15O58
$$ plain form
6932 93 -371 -281 -337 -16 -250 374 -97 -16 -66 149 -130 315 -64 120 -159 -66 522 192 69 131 -28 163
6954 163 -252 -171 17 107 263 377 42 124 -234 -321 56 22 355 -13 254 5 293 -350 -235 -74 -9 13
6976 13 10 -311 -549 143 310 104 -437 -198 338 143 -243 -3 210 519 82 159 -117 6 -270 -216 -147 33
6998 33 -327 43 -500 577 217 -286 372 116 -166 210 34 12 53 -160 -165 -422 -209 390 160 -415 -51
7019 -51 -512 195 42 162 201 155 41 436 -314 19 -260 -111 -268 124 -25 -98 34 3 27 12 -5 636 107
7042 107 -295 54 97 36 -65 114 -88 -124 259 13 -16 238 -303 -244 220 -377 -213 -279 215 -258 -214 -129 19
7065 19 371 -231 138 66 -36 -101 55 171 99 -88 -12 163 95 360 190 -328 -438 59 57 48 65 -71 329 -387
7089 -387 -83 59 288 -33 99 -44 -117 337 269 -240 439 419 222 -218 341 -390 170 -74 294 -421 237
7110B37j81l90K44k01M25l21L17M19p24K39K30m50K20l57J09k61L42O6k95P05
7130C73n29J83K49l70r8Q3j16L39Pj75M62o89O6J59J1m08P26p49M44L5M82k93
7152A92n24M93k06k09M52n67J3K36m83O03R8n52O50n01K25j7K94m70n1K5k29M45
7174h3k87N25m37M01o3M05k67L27o21M08n79L35K1qj86N21p31R09m69m53O3J38
7196a31Q02q53k35N59l65N65m51K23k59j47K49L23n88o3K2M54J42j92M17k83k5
7217A64m86M67k5k8N6m13K20M72n91M60k24l86K47k04P28n43J79k56l9R02o85
7238A5R9m11N06m3K07J7k60k59pK59m62j43M35K21q98J111k28l82O71m07k51m2
7260b52L66M7k83R0K80n39O8O00n11M72o90M56K04l73L60l93pK45k33N60o21l17
$$ plain form
7110 237 56 -334 -90 -291 134 -187 130 549 -175 64 294 -156 64 -293 -184 -445 -103 -37 -332 373
7130 373 -156 27 276 -94 -192 -109 -225 114 121 -54 408 -281 -215 -56 -45 -453 273 -476 -32 3 485 192
7152 192 -332 161 -45 -254 198 -369 -356 -120 -603 0 98 -454 196 -305 -80 -97 197 -273 -324 -299 -528 -83
7174 -83 -370 155 -282 119 56 461 194 521 -100 308 -271 64 85 77 -109 412 -319 590 121 -332 -269 -131
7196 -131 671 -182 -417 142 -223 342 -109 114 -145 -292 -43 280 -308 -371 -349 105 247 55 472 189 164
7217 164 -322 145 120 92 148 -265 -45 427 -164 296 72 -314 -67 -271 457 -86 93 -163 -202 700 15
7238 15 114 -297 209 166 373 390 130 -129 -136 123 -339 -482 -47 174 -724 387 159 -223 448 41 -210 -252
7260 -252 114 161 -122 -32 248 -291 -223 377 -134 338 -352 104 308 -65 295 -98 -105 140 -93 467 -154 -471
7282d71P49k14l86O9O02l24L61l30l17L4N52o41M44k49J4L33o41J0M32n2O7Q3
7304A25m03J79R4j74m6M02j50J87J7m7j61P7j15l48L37K8l67J73J45P8m77M86
7326D0o66O63j83k09N09K06n53L63L5o86L56K48K7Q2j39j41l2J16J18k05K4J41
7348A14J14l57J68J3q4Q0J98j70K06M1J08l49J13N8p75L37j10K24k91K18K2J45
7370B3L91n44O9J17l7o9K12l63J32k50M90jk36l88N20L21k68j44R8M3n0l06J25
7393a15K84k23J25j63J7K38J10k9l54K31J45R9m13J53K7k18j3J75o0k3q7Q3P4
7416F3K37m87N30n90J56OL22j17j50L19o15O25l24l55j86P08j27J2k40L98k54
7437f9p3R2K27J72J2n02K48m0J41m47K18k14M11k71K15j44l25K11k08K42o7O16
$$ plain form
7282 -471 278 64 -322 -253 349 25 386 56 -261 -227 325 -316 128 -121 -107 226 -415 -405 27 -25 42 125
7304 125 -278 -99 -5 -179 -225 177 27 214 231 184 23 100 -15 -363 -26 2 -365 -192 -47 31 -446 40
7326 40 -626 37 -146 -355 154 360 -193 170 205 -481 -125 123 150 232 93 -48 -80 36 154 -51 -27 114
7348 114 228 -129 39 52 -32 48 246 76 282 323 431 82 195 253 -522 -185 -295 -71 -362 -144 -122 23
7370 23 414 -130 -61 56 19 -50 162 -201 -69 -319 171 170 -66 -454 66 387 119 -25 73 116 66 -240 -115
7393 -115 169 -54 71 -92 -75 163 273 244 -110 121 266 365 -48 105 132 -86 -99 76 16 -7 -94 -11 63
7416 63 300 -187 343 -247 -91 -85 237 120 -30 289 -326 299 -25 -380 -566 142 15 27 -213 185 -69
7437 -69 -142 -50 177 349 361 -141 107 67 208 -239 -21 -235 176 -95 120 -24 -349 -138 -346 -104 -171 445
7459D45j30o38K12J46M72l05j49J08J2qk94j56P4J15k6K64Q1L6o91J95O07p20
7481c50Q74r38J15P10m92J14r4J35j85L95m31p8Q5J68O1J51k73J87q6K33j04K3
7503B20j96k92j24L17j80M11K08r31N70L84l26J8P7q0L7K69m49k7L94q78P48M56
7525F26q93M34l60O36m03M0l01J1p2J78M08j49J05m32J96q4m6J27M35l66J61J98
7547D49q36J25M67j1m59J74l78L85rL21p15N75k08L68n23P79n80J80j28j28L79
7568B27k9N00j204O87k21K05J81j29m78j86J11K24K21j93O16m87l77K61J73l03
7588b01K33Q0j7J39j83j58j7j55M04J4m00L38j3J70J55n45M58l30n53O67N9K5
7610A70l94j40K72l15O3j4N09n2j00J00O3j15M44l19r4L46k24k03m74K82J50J00
$$ plain form
7459 445 315 -323 -111 35 507 202 53 161 173 165 -129 -285 -211 -96 -122 142 223 259 -432 -237 370 -350
7481 -350 524 -414 -299 411 -81 33 -61 74 -111 284 -147 -225 -140 28 89 240 -33 154 68 301 197 220
7503 220 24 -268 -392 -75 -255 156 364 -567 3 387 61 79 156 76 113 382 -67 -94 300 -578 170 626
7525 626 -267 167 -193 443 40 80 -221 -210 -282 -104 304 155 260 -172 24 -60 -106 21 456 90 251 449
7547 449 -387 -262 205 194 -265 -91 -469 -84 -93 228 -487 88 -120 248 -275 504 -76 104 -24 -152 227
7568 227 198 698 -506 181 -40 165 346 217 -261 -447 -336 -112 109 -84 532 45 -332 -71 102 -201
7588 -201 32 112 95 234 51 -107 -124 -279 125 139 -261 77 64 234 389 -156 302 -28 -581 86 145 170
7610 170 -224 -364 -92 -407 -344 -358 151 99 -1 99 162 47 491 172 78 424 200 -3 -477 -195 -45 55
7632E5j42j1o2M94k22k09k40J68j04L98K27k77k55M61m62K70k03m94N80K46J18
7653C36o30m7L7R8M00k32K4K26j2l51J15l44L52j61j25L97j00l13L50p03P05Q5
7675A07m86N22J97l10M2L5o8q8L35J5p63J56L93l51K23M05k93L85j48m89J82Q1
7697H2K48k52J29j02p5j94K04l3j46J54J71O4m32Q6J13K64n75kP08k38m19L22
7719G7N7l40M71k98J25m08M44k88J8k23j19L99l63L89n8L37n9j43q7l31O00k74
7741g4J47l5r5L49m42M27j59q6J40o0j28J92m16L4O62n35m18K00J72l02O36k54
7763d5J87l08K68n03k26N03q3J36L98o43L83p5k53M26j48l94R27o35O2j46m68
7784f37K93L99m9O4l05M44J09K30n32j78N49j31n54J8K79L59m77L09p3k36L92
$$ plain form
7632 55 -87 -98 -160 334 112 -97 -337 -169 -273 125 352 75 -180 281 -181 89 -114 -608 -28 218 336
7653 336 -294 -341 -304 -206 194 -38 -14 212 200 -151 -36 -380 -28 -189 -314 83 -17 -330 20 -683 22 107
7675 107 -379 143 340 30 72 107 39 -49 286 301 -462 -306 87 -264 -41 364 71 456 308 -181 1 82
7697 82 330 78 207 105 30 -164 40 7 -139 15 186 250 -182 -96 17 281 -294 -296 412 174 -245 77
7719 77 134 -206 265 -33 92 -316 128 -160 -142 -365 -484 -85 -448 -59 -117 220 161 18 -69 -400 200 -74
7741 -74 73 38 -57 292 -150 277 118 32 172 112 -16 176 -240 -206 456 -79 -497 -297 -125 -427 209 -45
7763 -45 142 -166 102 -401 -627 -124 -207 -71 327 -316 67 -8 -261 165 17 -377 550 -85 -23 -169 -637
7784 -637 -344 55 6 70 -235 209 318 548 16 -162 387 256 -298 -280 -1 358 -119 190 117 -119 273
7805B73k22O44q68L90m92K96K1l93K31M53j90P4o15L30j50m30Q05K4j27l04L09
7826E9j60P1N3m94J44k6O20j4k91J93n34J38P00m71J88j86K66m51n2M31n43M09
7848E0L3j30J3M2p6J49N83m88k06Nj22l01N67j92J87k06K55o5L2n48J60L61K09
7871C12k02K24o08J38L26k67M55r58P13k88L04P3K85n63K27n89N91l75R5J47j38
7892i8r6l61M88j18j57N26l19Q3J90k32K84k87n8J60%k28L09n36N69n93N47K14
7914B87k8m19l9N76n22K43M82K17q32J86k81P8K01Q6n64j89N19j09om25M54n0
7936a35L9K85k92J97j63j21K09N07m41o1K37l59K36mj43K22L5m19l41M17N0l93
7958d38M40k3k2N38m15j06L77o45K90nJ50l60L79M1k70j98J49Q3j70k29N03N5
$$ plain form
7805 273 51 695 -173 217 -275 21 42 -351 -120 333 143 217 -398 -68 -218 -648 157 181 54 -250 59
7826 59 -101 -30 23 -471 -327 -353 267 253 -38 155 -379 -241 459 -12 176 -10 256 -195 -247 184 -359 50
7848 50 83 -47 -34 8 -68 81 664 176 -30 -25 -147 -448 119 -73 114 -92 163 98 130 -418 -258 103 312
7871 312 110 334 -274 -136 190 -77 378 -580 133 -155 149 222 507 -56 171 -418 173 -202 -107 40 -98
7892 -98 -194 -555 -67 -185 -342 184 -135 -52 138 -94 190 -97 -155 5 5 -223 86 -450 119 -474 73 287
7914 287 259 -160 -199 377 -145 98 580 797 -35 151 -130 -52 149 235 -329 -518 1 -108 -114 -539 -85 -135
7936 -135 -96 189 -103 94 -69 -190 19 526 85 24 261 -98 138 134 -9 213 248 -171 -512 -95 -45 -438
7958 -438 2 -21 -43 495 80 -26 351 -294 -4 -9 141 -219 160 201 -69 -267 -118 -35 -205 -434 69 124
7980A24M43q31l55Q82l09M8J25o60K02K23M9k17M18o5K06m56K01r8j50N28m30
8001a22M24m13n6j44L91M4r5l0J14M70o56L68n20j74K26m5j26J34J10L98j66k50
8023a18k15N0K97R8M96p89K14l52P40o26P06o97J73Q4J35n03N25k2n76M11L7j72
8045a04O12k69o70O09j68M19n84M13o65P46j61m59j3M75j72K51k89L6r8N7L23
8066B89l32o0k37J99K99l00M46l00J82L79p60J80o5j1j98N28q2j36L15l94J05
8087D7R8M1k93q1J90q9o0K35r8J81m32k90P73n14L37jj46j85K88K29J15j234O58
8110b31L56j66L1J38r6n54P02l02J1J54M81j01o67M60o29N87l37j0J28N94q65
8131c16L10q16O40L68M7k88k26L92j42k9K33pn02J02M05l55N01N1k52k07k2J73
$$ plain form
7980 124 567 -264 -619 263 -46 2 127 -533 -331 -108 -59 -276 142 77 283 -173 28 -70 -220 308 -122
8001 -122 302 -111 -167 -311 80 124 29 -1 113 583 -73 295 -225 -399 -173 -218 -344 -210 -100 298 132 -118
8023 -118 -333 -283 14 112 608 -181 33 -319 421 -205 501 -196 -23 61 196 -307 218 196 -380 31 68 -104
8045 -104 508 239 -431 178 10 429 -155 258 -407 339 178 -281 -294 181 9 260 -29 7 -91 -34 289
8066 289 -43 -103 -340 -141 158 -142 304 4 186 565 -195 -15 -80 -91 -289 239 157 21 336 -58 47
8087 47 145 186 -107 -188 2 -87 -147 88 -10 171 -261 -551 222 -292 45 44 -102 -287 1 230 345 -889 -231
8110 -231 125 -41 -10 128 32 -522 180 -122 -111 43 524 423 -244 216 -413 174 -163 -173 -45 549 -316
8131 -316 -6 -822 -182 186 233 -55 -281 111 -31 -60 173 166 -336 -234 171 -184 317 368 116 -91 -113 60
8153F0K13j13j12J40l62K69j50q8K18k8p6M22k02n23O1J60M43k44J11j00m09K19
8175i1K14l07K2M34m17j80r9N11k12M05n27M01j84k54k24M42
$$ plain form
8153 60 273 160 48 188 -174 95 -55 -143 75 47 -29 393 191 -332 -271 -111 332 88 199 99 -310 -91
8175 -91 123 -184 -162 272 -145 -325 -424 87 -125 280 -247 154 -30 -284 -508 -66
8191f6
$$ Imaginary data points
##PAGE= N=2
##DATA TABLE= (X++(I..I)), XYDATA
0@%%%%%%%%%k4M8o5Q9r6J20j44J82k30K64l36M08m80N76o93Q26r49J104j292J484
29G92j707J956k237K549k884L267l680M138m645N193n801O461p192P984q843R792
45E143j0819J1946j3176J4522j6007J7628j9425K1411k3614K6085k8852L1995
57A6837l5587L9738m4615N0421n7488O6299p7655R2933j14697J48498k08676L48810
69B24818j304874p60652J788873J015612R51528J18953m21447j208100j225179
78h20468j026962k09253M87986J109430J193393R95047K47320m53464r46294j053218
88d76483j015365m82797L10115J007321J169372R44161L69525k67300q25563j085815
98c52829j006734m82222K25543Q34095J094270R64185M43543j89632p03204r84599
$$ plain form
0 0 0 0 0 0 0 0 0 0 0 -24 24 -41 48 -48 72 -72 110 -120 144 -192 216 -264 312 -381 445 -504 600 -692 792
29 792 -915 1041 -1196 1353 -1531 1736 -1944 2194 -2451 2742 -3059 3402 -3790 4194 -4649 5143
45 5143 -5676 6270 -6906 7616 -8391 9237 -10188 11223 -12391 13694 -15158 16837
57 16837 -18750 20988 -23627 26794 -30694 35605 -42050 50883 -63814 84684 -123992 224818
69 224818 -1080056 -1840708 -51835 963777 1915305 2034258 1612811 404711 -820468
78 -820468 -1847430 -2056683 -1568697 -459267 734126 1729173 1976493 1523029 576735 -476483
88 -476483 -1491848 -1974645 -1664530 -657209 512163 1456324 1825849 1558549 732986 -352829
98 -352829 -1359563 -1841785 -1616242 -782147 312123 1276308 1719851 1530219 827015 -157584
108a57584r62206n26842J19886O74972R69205R35322N19633q6424o02875q88708
118e621q90294n66777l7118N12498R06585R35233N45236K753m49526p76182q82770
129g05983o22748j05826M21856P96595Q83987O12929J20869l88034p54580q30383
139e71318n85412j68999K88931O92904Q43713O18478J66038k93036o35782p58805
149d03288o00978k42045J98491N94192P70952O28789K63939j72882n59203p31781
159b53814o10463k87324J16709N07036P18599O30560L08128j05007m81644o71558
169a28778n97863l29937M2310M25184O50907O06018L45028k3255l92032o07141
179i559n83648l66019k4653L46317N87030N87979L81996M2418l18055n47684n60326
$$ plain form
108 -157584 -1119790 -1646632 -1526746 -851774 117431 1052753 1572386 1485962 883087 -5621
118 -5621 -895915 -1462692 -1499810 -987312 -80727 854506 1399742 1402495 952969 176787 -705983
129 -705983 -1328731 -1434557 -1012701 -216106 667881 1280810 1401679 1013645 259065 -571318
139 -571318 -1156730 -1325729 -1036798 -343894 499819 1118297 1284335 991299 355517 -403288
149 -403288 -1004266 -1246311 -1047820 -453628 317324 946113 1210052 1037170 477967 -253814
159 -253814 -864277 -1151601 -1034892 -527856 190743 821303 1129431 1024424 542780 -128778
169 -128778 -726641 -1056578 -1014268 -589084 61823 667841 1012869 989614 597582 -9559
179 -9559 -593207 -959226 -983879 -637562 -50532 537447 919443 961861 643806 96122 -464204
190d64204l87246q1616K68787N16958N60863M02722J00896k44484m84383n36711
200c48418m06156j31272K01491M52953N26904M15331J50774j75161m27488n08401
210b49443m10034j66643J40085L88174M89739M19038J89683j15576l64845m69865
220a49687m10412k03348Q3298L30492M50731M12578K20390n8382l04730m34515
230f3585m06974k28960L4909K71748M09271M04408K45107r915k49598l91589l94155
241c79333k50571j3828K21568L71213L88201K60566L6091j96895l54585l82285
251b99858k61910m9070J69942L25880L69467K72798P1302j51351l11951l55098
261b19849k70237q8939J22329K89450L50110K77136J01223j02973k68166l36124
$$ plain form
190 -464204 -851450 -933066 -664279 -147321 413542 816264 917160 672676 188293 -348418
200 -348418 -754574 -885846 -684355 -231402 295502 710833 861607 686446 258958 -249443
210 -249443 -659477 -826120 -686035 -297861 191878 610916 800599 685023 320178 -149687
220 -149687 -560099 -763447 -680149 -349657 101074 513652 734042 675660 370930 -63585
230 -63585 -470559 -699519 -664610 -392862 16409 420817 665924 656009 406411 14822 -379333
241 -379333 -629904 -643732 -422164 -50951 337250 597816 633907 437012 82427 -299858
251 -299858 -561768 -610838 -440896 -115016 254451 527249 598551 447200 135249 -219849
261 -219849 -490086 -579025 -456696 -167246 182864 460000 561223 458250 190084 -146040
271a46040k77554j16660Q3463K50203L24556K77612J27312o4824k32031l11788
281h5751k74641j37205M3901K09613K98261K76816J48047l3148j95971k80176
291c0254k64537j58525O595J74111K76400K69892J61313j771j57672k54153k59106
302b37707j71722j9066J41233K44850K56309J75527K8501j27860k31699k44936
312a86570j74612m4653J03286K16394K48825J85177M9599r9479k03909k29283
322a35225j78786o9189P3438J92298K35215J84239O8690o7221j76178k19724j82487
333b74930q0466M8655J61225K13906J88130Q9441m1896j54329k01978j76873r3495
344c22610J9639J32288J99901J88005J00109j9267j25616j84710j77118j06624
$$ plain form
271 -146040 -423594 -540254 -456791 -206588 117968 395580 522892 458068 226037 -85751
281 -85751 -360392 -497597 -453696 -244083 54178 330994 479041 445893 249922 -30254
291 -30254 -294791 -453316 -446721 -272610 3790 273682 434995 433224 275552 21399 -237707
302 -237707 -409429 -428495 -287262 -42412 213897 389424 417925 290065 58366 -186570
312 -186570 -361182 -405835 -302549 -86155 162670 347847 397446 297967 94058 -135225
322 -135225 -314011 -383200 -309762 -117464 117751 301990 370680 303459 127281 -92443 -274930
333 -274930 -355396 -306741 -145516 68390 256520 345961 304065 149736 -52242 -229115 -322610
344 -322610 -302971 -170683 29218 217223 317332 298065 172449 -12261 -189379 -296003
354b96003K270J08318J79083J81056J13178K407j04473j69477j70021j12461j5511
365b81634Q5540J58052J73286J20585K2035q1835j51504j63289j16912l0582O3652
376b02606J38270J64939J27157L7052o2952j33710j54766j20659m3392M6293J20827
387h3547J52646J26444N1606m2592j16472j45993j22200n3175L0006J02728J40336
398C9787J26529O2539k5675j00049j35344j20322o2228J5627Q6364J28739J22900
409A38867P0135q989q3018j24927j17976o8994K019P0128J16182J18766P5755
420A87948N607o7335j12960j14904p4610r564N6819J04103J12268P9664J7675
431A84711n1770j01042j09784p8508k0904M4010R2317J06068Q0669K8282l7645
$$ plain form
354 -296003 -293733 -185415 -6332 174724 287902 290309 185836 16359 -153662 -266123 -281634
365 -281634 -196094 -38042 135244 255829 277864 196029 44525 -118764 -235676 -266258 -202606
376 -202606 -64336 100603 227760 264812 201860 68150 -86616 -207275 -250667 -204374 -83547
387 -83547 69099 195543 247149 204557 88085 -57908 -180108 -233283 -203277 -100549 39787
398 39787 166316 228855 203180 103131 -32213 -152535 -214763 -199136 -112772 15967 138867
409 138867 209002 200013 116995 -7932 -125908 -194902 -192883 -122755 -6573 112193 187948
420 187948 193555 126220 13260 -101644 -176254 -185818 -128999 -24896 87372 167036 184711
431 184711 132941 31899 -77885 -156393 -177297 -133287 -40970 65098 145767 174049 136404
442A36404q8458j04262q1487k9562L1910Q1394R8366Q1134L5645k4313p6295r7285
454c6809q1048l8113K0975P0082R1300Q0190M1753j2410o3835q9772q2036m3533
466a43256J0610O0403Q2619P7661M7438k122n4034q2681p8581m8822J531M9447
478g9787P4979P5539N0977N328m2400p2449p7696n3294n693M1175O6796P1840
490E5315N3477J3384l3762o5128p2700n3744j3978L0530N8800O8856N4621J7663
502A13334k3778n5446o9359n6218j9665K2152N2012O3872N6691K3153j6864m9032
514D0852o4056n4707k3603J2780M4099O1604N5507K5168q909m0088n8464n5741
526f5558k8221P590L6552N3844N4220L1020l295l3870n4565n2029l0806L8K9689
$$ plain form
442 136404 47946 -56316 -137803 -167365 -135455 -54061 44305 125439 161084 136771 60476 -36809
454 -36809 -117857 -155970 -134995 -64913 26387 106577 148330 135920 72085 -17687 -99723 -143256
466 -143256 -132646 -72243 10376 88037 135475 133353 79319 -3362 -81943 -130765 -129234 -79787
478 -79787 -4808 70731 121708 127036 84636 12187 -65509 -118803 -124496 -83321 -16525 55315
490 55315 108792 122176 88414 23286 -49414 -103158 -117136 -86606 -27806 41050 95671 113334
502 113334 89556 34110 -35249 -91467 -111132 -88980 -36968 26904 83595 106748 89884 40852
514 40852 -23204 -77911 -101514 -88734 -44635 16969 72476 97644 88735 48647 -9817 -65558
526 -65558 -93779 -86189 -49637 4207 58427 89447 86152 52282 -2283 -54312 -85118 -85080 -55391
539e5391N1571N2118L1387K633k5248m7864n1737l3430m721K3765M5276M8882
551C7241L4517Q265k1528m2968m7873l4494j1183J7980M1856M6621L3605J0872
563G2911j4592l6291m5013l5819j3282J1861L5904M3243L4810J5761r189l2603
575B7701m1539l5101j8764P619L1061M1144L4226J7598n182k7781l8621l4931
587d2570j9846L775K5861L6308L3449K0767j483k1807l3842l3830k2139j231K1725
600c4863L2625L2937K1904K870j7910l1701l2762k3138m080J7239K8588L1281
612B2990K3169O369j4986k6706l1419k4055p020J2908K6008K9475K4070Q562j0070
625C9295k3929k9055k4005q912Q896K1535K7353K4129J0969o745k1496k6964k4012
$$ plain form
539 -55391 -3820 48298 79685 82318 57070 9206 -42531 -75961 -80682 -56917 -11641 37241
551 37241 71758 80023 58495 15527 -32346 -66840 -78023 -60043 -18187 28434 62039 72911
563 72911 58319 22028 -22985 -58804 -72086 -60225 -24321 18922 53732 69493 60304 27701
575 27701 -13838 -48939 -67703 -60084 -29023 12121 46347 63945 58763 30982 -7639 -42570
587 -42570 -62416 -58641 -32780 3528 36977 57744 56261 34454 612 -33218 -55357 -56588 -34863
600 -34863 -2238 30699 52603 55473 37563 5862 -26900 -50038 -54118 -36879 -8291 22990
612 22990 46159 52528 37542 10836 -20583 -44638 -51658 -38750 -12742 16733 40803 49365 39295
625 39295 15366 -13689 -37694 -46606 -37710 -16175 11178 35307 46276 39531 18035 -8929 -32941
638c2941j1061N660J7985K5622K4136J3196m416j7479k4706k3593j2524L070J5405
651b1646K2652K3406J4283o10j4886k2843k2537j3627N9J1670K1014K3017J4789
664C4741J141j1162k0970k1896j4992j793Q960K0090K1090J4961L883q463j7556
677H034k1780j4524m621P234J7039J9494J5696N733n606j6183k0033j4900o701
690c1118M963J4313J9148J5456O949l488j3482j8580j5093p672K573J3126J6962
703D057J4906Q144j417j0742j6343j5772q294O10J0037J6244J4137R083L79r579
717A5450j4893j4785r785n74Q801J3786J4397R422J419o701j2876j4368j0232
730b0939k253O889J1854J3983J0050K836n352j1538j3495j0062l694M728J0984
$$ plain form
638 -32941 -44002 -38342 -20357 5265 29401 42597 38181 20702 -4004 -27597 -40121 -37051 -21646
651 -21646 1006 24412 38695 38085 23199 356 -22181 -35808 -35749 -24079 -3065 19952 34741
664 34741 35882 24720 3750 -18146 -33138 -34931 -25971 -5881 15209 30170 34053 25590 8034
677 8034 -13746 -28270 -32891 -25657 -8618 10876 26572 32305 26699 10516 -9517 -24417 -31118
690 -31118 -26155 -11842 7306 22762 29711 26223 12741 -5839 -20932 -28604 -26031 -12905 4057
703 4057 18963 27107 25690 14948 -1395 -17167 -25461 -24851 -14814 1430 15567 24650 25029 15450
717 15450 557 -14228 -24013 -24587 -15786 -2000 12397 21819 23238 16537 3661 -10707 -20939
730 -20939 -23192 -16303 -4449 9534 19584 22420 17068 5530 -7965 -18027 -21721 -16993 -6009
743f009J2331J0610M175m567r543j2474j0563m588L257R779J1794J0038M894j864
757A7270q566j1185j1201m472J500P840J0877J0162N630q76o895j0819j0279n842
771a6856J87O306J0118J0260N878L50n458j0028r898o397o51N796Q497R655O774
786A4533Q57l972q660r720o593j367L580Q201R103O566K565l642p552q741o855
801a1697k635K947O376Q544P187L154k583o316p853p237k220R09O361P280P160
816I377L233j173n802p248o475l629M56N130O769O626L561J07l875p514o503m046
832a1006J20L939O498O730L893N62l064o624o351m255m70K601O238N934M002Q95
848I642k147n996n312m612j290K078N209N917M437J426k383l971n669m643k027
$$ plain form
743 -6009 6322 16932 21107 16540 6997 -5477 -16040 -20628 -17371 -7592 4202 14240 19134 17270
757 17270 8704 -2481 -13682 -18154 -16654 -8814 2063 12225 17855 16979 10084 -735 -11014 -16856
771 -16856 -16669 -10363 -245 10015 15893 16243 10785 757 -9141 -15538 -16189 -10393 -1896 7759 14533
786 14533 15390 11418 2758 -6962 -13555 -14922 -11342 -3141 5962 12528 15093 11451 3899 -4842 -11697
801 -11697 -14332 -11385 -5009 3535 10722 13876 11293 4977 -2876 -10113 -12333 -11424 -5063 2217 9377
816 9377 12610 11437 5635 -1613 -8088 -11717 -11261 -6131 638 7264 10825 10932 7057 -457 -6960 -11006
832 -11006 -10886 -6947 -449 6281 10174 10736 7672 1048 -5303 -9558 -10028 -7427 -1189 4745 8747 9642
848 9642 7495 1499 -3813 -8425 -9715 -7637 -2428 3489 7926 9352 6969 2998 -2671 -7314 -9341
863i341J460N186M856M421K122j258l789n117m391k704Q04M074N053M388K246
878H010o93l219m479m636k525PL470M247M359K779k80k533m484m213l032K16K455
895d551L503M457K944J31j960l563l956l167p54J953L822L553L348M62j283l956
911I83l143l542pR47K600M452K502J480j463k514l926k601j418Q78K644L824K385
928D081J467o88k294l284k675j787M34J976L137K945J467k59j334l007l158j803
944d782k74J714L212K938J385n8p00l181k825j271r28J344K721K847J521N58o00
961C621k450l769j323n76J150K047K807J690R85j087j912k242j986r21Q57J401
977a708K615J738Q40m00j736k439j437j151L93J828J951K131P20Q3j412k534j728
$$ plain form
863 -9341 -7881 -2695 2161 6582 8704 7446 3657 -1460 -5851 -8555 -7751 -3677 1376 5764 8010
878 8010 7317 4098 -381 -5017 -7542 -7535 -4065 182 4541 7320 7040 4507 23 -4190 -7222 -7006 -4551
895 -4551 -1048 3409 6353 6484 4524 961 -2995 -6162 -6916 -4963 -1141 2412 5760 6222 4939 983
911 983 -2160 -5702 -5709 -4762 -2162 2290 4792 6272 4809 2295 -1631 -4232 -5650 -4772 -2128 1696 4081
928 4081 5548 4860 2566 -718 -3393 -5180 -4746 -2770 367 3312 4779 4520 3186 179 -2979 -4782
944 -4782 -5056 -3342 -130 2808 4193 4135 3435 254 -2571 -3842 -4770 -3426 -705 2142 3663 4221 3621
961 3621 1171 -2598 -3921 -4497 -3347 -1300 1507 3197 4182 3095 1183 -1059 -3045 -3966 -3109 -1708
977 -1708 907 2645 3485 3085 1349 -1090 -2527 -3678 -3285 -1457 494 2625 3345 3428 2016 -518 -2246
994b246j197M06J454J446K083Q84L89j617j261j524j711n71J291J970J548J120
1010B464N69j028j251j868j199q05P99J809J331J276R21q80j360j458j600m22
1026b702M17J347J278J680L4J14j011j522j149k76L33N01J362J177O16k78n12
1043A409j586r28j061j54J337J246J096Q04n61m98j367j510o59P01L60J252J388
1060A269L33L39j89j512p81j343j48N35J076J040M04O95j35j214o08j002n03K03
1078a541Q17Q41L54Q24l08Mj311m22p32q5P28J043P88K5K14m27j688J52p98K01
1098a321N99O53N80O97K09o99q64J33j153k65M56Q08J140L06j59k29l62j174m07
1117a052j26K02M94J004R5J60k1m66n31l25r06N3R14M94Q87N9j29m33m86p50n17
$$ plain form
994 -2246 -3443 -3037 -1583 -137 1946 2830 3219 1602 341 -1183 -2894 -3465 -2174 -204 1344 2464
1010 2464 3033 2005 754 -1114 -2313 -3118 -2319 -510 821 2097 3018 2138 778 -680 -2280 -2702
1026 -2702 -2285 -938 340 2020 2054 2168 1157 -365 -1514 -1790 -1457 -956 406 1583 2199 1921 1409
1043 1409 -177 -1105 -2166 -2320 -983 263 1359 2163 1602 1104 -263 -1773 -2432 -1731 -1371 -119 1269
1060 1269 1602 1941 1752 240 -541 -1884 -2032 -1497 -421 619 1023 1718 1583 369 -239 -1241 -1744 -1541
1078 -1541 -724 117 471 1295 987 991 -320 -742 -1474 -1559 -831 212 1000 1025 1239 812 -876 -724 -1522 -1321
1098 -1321 -722 -69 511 1208 1417 718 -146 -13 -1166 -1431 -975 -167 973 1279 1120 891 529 -645 -1052
1117 -1052 -1178 -976 -482 522 617 777 756 290 -241 -566 -1472 -1419 -505 -11 876 935 806 373 -113 -863 -1380
1138a380J85M23R00N09K96L45n52l33o69k71n78L70P25Q08l04Q36n41m69l05n14
1158e19m40N37p2J26M09J065l20m06j029K06n22M5Q59l0M23N36No51m62m64K15
1179d89l23M78J37R36K76j95L9o22j049K3O62k03M31N72j17J83n0m24n26q37M45
1200f53oK09Q87j34J03n4m01j75j63K5l38K60M07M82R8p8l20m6r88J3L25M4N50
1223D7M91J88n05m65k33j08K57k45l04L66J163n35N78m31m95k3K22n41Q8R4R82
1244E91K7n1j92m44J23l64k48l23Q85j05R19l38k73k01Q6k98J75r4k61J51Q25
1265E90k92j49J94n21K9j98m05P17J63N33l89K91j64m63k23J78o46O48K3M61l0
1286C47j12j6k91J75m64L93m04r5j5N99L26k96j32k49j74J43J08l70N90P5m6N5
$$ plain form
1138 -1380 -1195 -772 128 637 933 1278 726 393 -276 -547 -1125 -755 -30 778 474 1310 769 300 -5 -519
1158 -519 -959 -422 -494 -368 41 1106 786 380 -649 -443 -965 -920 -61 -91 332 868 873 222 -240 -704 -489
1179 -489 -812 -334 -197 739 1015 820 859 237 -812 -789 -127 -330 101 673 556 739 689 265 -261 -1098 -653
1200 -653 -659 -450 437 303 406 352 -49 -224 -387 -362 -700 -440 -33 449 547 469 149 103 -885 -872 -547 -503 47
1223 47 538 726 221 -244 -477 -585 -328 -573 -877 -511 652 117 695 264 -231 -254 -32 -573 -485 -391 591
1244 591 618 567 375 -69 54 -310 -558 -881 4 -101 818 480 207 6 92 -206 -31 -125 -386 -235 590
1265 590 298 149 343 -178 -149 -347 -752 -35 128 661 272 563 399 -64 -287 -109 -755 -107 -84 377 347
1286 347 235 219 -72 103 -361 32 -372 -467 -482 117 443 147 15 -234 -408 -265 -157 -527 63 138 92 147
1308A47J23n46J11j32N0K30j31J34L53q8M8l29J63l36l97N12Q4K23mj2K10O6p62
1331b83K41K03j04K7J03O1l28L27k49l56J27k16L1J02M31p0L07K56j58j37n37
1352b22m00K37l48O31P86n05m89L25j67m6K04m03n02N46M14M47M71k99m69o38
1372d27N8L50k04J20J69L9L59m26K13K64p86L33l9o71Q56m70O52j08k3j26n51
1393d18K31m1j9l63P04N49l0m09j05l55l4n5j51M50J80j81L36j51k23l14M05j91
1415a85M5j1j1j28R59l92J1n6l91K16n90L03O1N24k15q0l4K04p13M33j21j93M59
1438I5L47Jl78j87ll4N36n65j02P86m05K68j52j86k44M9j86MK94K10k80N05K76
1461F49k70k92k32L38k00N5J56l05K29Q8j86J28k81q6M37p74M78L47m20M21p5
$$ plain form
1308 147 270 -276 -165 -297 -247 -17 -148 -14 339 251 299 -30 133 -203 -600 -88 -4 219 215 203 413 479 -283
1331 -283 -42 161 57 84 187 248 -80 247 -2 -358 -231 -447 -416 -314 117 47 354 610 452 315 -222
1352 -222 -622 -385 -733 -102 684 179 -310 15 -152 -198 6 -397 -899 -353 61 508 979 680 211 -427
1372 -427 -369 -19 -223 -103 66 105 464 38 251 515 -271 62 23 -648 208 -262 390 282 259 133 -418
1393 -418 -187 -228 -247 -610 94 643 613 204 99 -256 -290 -345 -496 -46 134 -47 289 138 -85 -399 6 -185
1415 -185 -140 -151 -162 -290 669 277 288 232 -159 57 -533 -230 -169 355 140 60 26 230 -483 -50 -171 -364 95
1438 95 442 443 65 -122 -125 -159 377 -188 -290 496 91 359 207 21 -223 -174 -360 -356 -62 148 -132 373 649
1461 649 379 87 -145 193 -7 48 204 -101 128 216 30 158 -123 -209 228 -546 -68 279 -141 280 205
1482B05N82q43m11K63L3M37j32O2l86O70k58m61N0l76nL79M95m04M11j79J42k07
1504F7j66R6m68K76K36l9O2L06k32j26m1P0m3k24L73L52p18L38k23K07M2l98L42
1527H9kj52J64N10o87mL35o2n74N08l01J43r9L56L53j41Oo79L11N8O9l84j04K33
1551e4j19L96q15R18o15Q7N2P81l02l15L56k85l8k46O74m58l27M9K27p3J21J96
1573B10K24l78m84N25j75J71j44L34m67O78o40k84J56k38N48K06p64M05P53k01
1593D35J3m19J19P2k82m13O19n26J46K22L99n16n8k27N55m62o21N80O58m35K00
1614E9R4j99l4n00O56n72mQ29n50P6N7N00p34j85M93P5K48k60q8J44K56l21lN5
1638I2M1l98M1K6KR6j26m66Q00j99q3M40l54k6K22l98L68njl23r9O83n63P70m10
$$ plain form
1482 205 787 -56 -467 -204 -171 266 134 196 -190 480 222 -239 -189 -565 -570 -191 304 -100 311 132 274 67
1504 67 -99 -3 -471 -195 41 2 64 370 138 12 -29 41 -2 -226 147 499 -219 119 -104 103 145 -253 89
1527 89 87 -65 99 609 -78 -82 253 191 -383 125 -176 -33 -132 224 577 436 442 -237 74 132 201 -183 -287 -54
1551 -54 -173 223 -592 326 -289 -202 -150 631 329 14 370 85 47 -199 475 17 -310 -261 -34 -107 14 210
1573 210 434 56 -428 97 -78 93 -51 283 -184 494 -146 -430 -274 -512 36 242 -522 -117 636 435
1593 435 448 29 148 220 -62 -475 144 -382 -236 -14 385 -131 -189 -416 139 -323 -944 -364 294 -141 59
1614 59 153 -46 -80 -580 76 -496 -500 329 -221 -145 -88 412 -322 -507 -14 61 309 49 -39 105 361 40 37 92
1638 92 133 -265 -224 -198 -196 -100 -226 -692 108 -91 -174 266 -88 -114 108 -290 78 73 72 -251 -350 333 -230 540 130
1663A30j54l2N40j37k60k9k63N10o01L91k00K20No6l19k61J28M73j20K21kl76
1685b02J51M39p02M08m95N63n29L52K58R7K1r6J41p78L51M6o03P08k12K42L7K28
1707D25l17J92J04j077O12kJ54K32p58O98j07j73l32L41l73K11M1M9M22m18K34
1728A58m8k48q4L05J93m22N3m8J60K91l7M0n07M29n10J47K23K92k48k5k38J22
1750bj5L7j74k19R61r89J00M51N8O5o75N74K3k07K22k44p5J38M51n00J59m93L98
1773D4J9K12nk19Q8L81p92L36N1j56mK57L10m26j35R6J11n9M2p33L84J56J07o7
1797bj12k6m0L50m21N24n43QM11j86N9L46Q7n17L39n93N16k38n0L9L41l02p7J29
1821D2j3K94n99M57J3K13n45K67Q3k11j4m29N46L01l19k97K09j4j87M04m76l02
$$ plain form
1663 130 -24 -56 484 347 87 58 -205 305 -296 95 -105 115 120 54 -265 -526 -398 75 -45 176 174 -202
1685 -202 -51 388 -314 94 -401 162 -367 -15 243 340 361 265 406 -372 -21 25 -578 130 -82 160 197 425
1707 425 108 300 404 -673 -61 -63 91 323 -435 263 156 -17 -349 -8 -381 -170 -129 -80 342 -76 158
1728 158 110 -138 -222 83 276 -146 -93 -141 19 310 273 313 -194 235 -275 -128 95 387 139 114 -124 -2
1750 -2 -17 20 -154 -373 588 -401 -301 150 208 273 -402 172 195 -12 210 -34 -109 29 480 -20 139 -354 44
1773 44 63 275 270 51 139 520 -272 64 115 -41 -45 212 522 96 -39 57 168 109 151 -582 -198 -42 65 -2
1797 -2 -114 -140 -180 170 -251 273 -270 -262 149 -37 22 368 455 -62 277 -316 200 -38 -88 -49 292 -10 -87 42
1821 42 29 323 -276 181 194 407 -138 129 212 1 -13 -442 104 405 86 -211 -2 -16 -203 201 -275 -577
1843e77P20K0j69K77n51K71r1N29j051J70Q47r5pk42n65K32K04J11r6M69m3m9
1865C14j22k8L2j59p6k43k55L14M65m25K37J01R5K0J03m34M59l35rk94JN14m77
1888b02N36n12K85J64m35j6M86k31m07K74K2K2Q2r6Q2L35m4k45l58K56l32N18
1910A84o11N34m84j2M81j54M98m19J14N5l39L12J90k53j79O6n84M92O26l72j32
1931A3L84l35J54m04N2J4O3J98K93l5l05n56J004o86r1M1M40l67l02O06l91n03
1953g13P83om04L76j0j78K49l31k6M95k88M22n30j06lL71J98r3n2j00k2q9L71
1976C14m22P33m44jn72L87O33n07j66k15L84r31P15q5K76j46M02q9q61N02l43
1997d36O34L91p35q8M00r6l20L64p46R30k40j06k28L68J74l16n18O64k3K25n41
$$ plain form
1843 -577 143 163 -6 271 -280 -9 -100 429 -622 -452 395 300 293 51 -514 -282 -78 33 -63 406 363 314
1865 314 192 164 196 37 -39 -282 -537 -223 242 -183 54 155 250 270 373 -61 398 63 54 -240 -239 275 -202
1888 -202 334 -178 107 271 -164 -180 306 75 -332 -58 -36 -14 68 -28 54 389 345 100 -258 -2 -334 184
1910 184 -427 107 -377 -389 92 -62 436 17 131 186 -153 159 349 96 -83 -17 -601 -109 517 145 13
1931 13 397 62 216 -188 -136 -122 -59 139 432 397 92 -464 540 -146 -237 -196 244 -123 -425 181 -210 -713
1953 -713 70 64 -340 36 26 -152 97 -234 -260 235 -53 369 -161 -267 -270 101 299 206 154 54 32 -57 314
1976 314 -108 625 181 180 -392 -5 628 121 -45 -260 124 -807 -92 -177 99 -47 355 266 -595 -93 -436
1997 -436 198 589 -146 -234 166 70 -250 114 -632 298 58 -48 -276 92 266 -50 -568 96 73 298 -243
2018b43Q0L29j69q3L69k50P9k21K72l81L75m87M58j65J52P8m32l01O55J06m01
2039a80L06n35L89k40L41k50J24J80J7k48M08m58Q1K36R7k54K4k71L15K26q42
2060e34L38N6QP10r19J54J82j42K00o8N31m43m49P34L1m57L65m63J69k06K84J33
2082B14l91J28N70r02M6P67j64J7j88j5N3Lj55l19Q13p45K71J44m24M11K17p8
2104B73k62j35K43k5J8m84J025q22l01K82L68K60o20K39k11K30k24N4J56M56l42
2125A78K3J12j59k9k66L68J8N9l0o87O85j52j53J25m13J90M41l69l44N99k45k7
2147g6K38L84o00n7J1J26M07m90J60L86r06N28M56j97m67j17L42j7M2kJ8m41P54
2170D82j17l97J69j81j21j31N91p97K93K15k26K62m42N06j3l70M4L59m5K33k54
$$ plain form
2018 -243 -163 166 -3 -86 283 33 112 -109 163 -218 157 -330 128 -37 115 193 -239 -540 115 221 -180
2039 -180 126 -409 -20 -260 81 -169 -45 135 152 -96 312 -146 -65 171 268 14 38 -233 82 308 -534
2060 -534 -196 -140 -132 578 -341 -187 -5 -147 53 -15 516 73 -376 358 389 -68 297 -166 3 -203 81 214
2082 214 -177 -49 521 -381 -335 432 268 285 97 82 135 138 -17 -336 477 -268 3 147 -277 134 351 273
2104 273 11 -124 119 94 112 -372 653 -169 -470 -188 180 440 -180 59 -152 78 -146 -92 64 520 178
2125 178 201 313 154 125 -141 227 245 304 274 -413 272 120 -33 92 -321 -131 310 -59 -403 196 -49 -76
2147 -76 162 546 -54 -111 -100 26 433 -57 103 489 -417 111 567 370 -97 -214 128 111 153 151 169 -272 482
2170 482 365 -32 137 -44 -165 -296 295 -502 -209 6 -220 42 -400 106 93 -277 -233 126 81 314 60
2191F0m5L43l31n7M4p17M37K41J56j27M4L85l44m69K60J24J7K0J79n14R01p49
2213a42N4K07N0k63J68O9n35K64K18m84M8O17J09m49M34k76J30k29K08k6l00L53
2235B25k49L30j37k45j8Q8k15L59R4k39j85j66N79k18q0K72o38O75j91m86L35
2256a10M16m2o8k61r8K83n56L38k27o3M87PN03n03j54L66m82J83n66N70j62L83
2278B44J4J37P9o86RK08J13J10m09R6j93M01m91L14k65L27K01m02L56k06M59j66
2300B50o14Q89k18j05l26N3L81m46K33m12N05q1K49k74P8k75j91j19R0N02l94
2321b25M12J14q91M39j75M49m53J53L1N8J36k4l34K65O2Q5o6m95M41k60N57j24
2343A55l15N00j19k25j03K16j86j44K10k29L90K8j5p3l30K90J21j24J9J9k64O92
$$ plain form
2191 60 15 358 27 -30 14 -703 -266 -25 131 4 48 433 89 -380 -120 4 21 41 220 -294 607 -142
2213 -142 -88 119 169 -94 74 143 -392 -128 90 -394 -346 271 380 -69 365 89 219 -10 198 172 -128 225
2235 225 -24 306 169 -76 -94 -6 -221 138 232 -7 -192 -358 221 3 -77 195 -443 232 41 -445 -110
2256 -110 306 264 196 -65 -163 120 -436 -98 -325 -388 99 106 609 106 -48 318 -164 19 -547 23 -139 244
2278 244 258 395 474 -212 -203 5 118 228 -181 -85 -278 123 -368 -54 -319 8 209 -193 163 -43 416 250
2300 250 -364 525 307 202 -124 -71 310 -136 97 -315 190 109 358 84 162 -113 -304 -423 -333 169 -225
2321 -225 187 301 -590 -151 -326 123 -330 -177 -146 -88 48 24 -310 -45 17 102 36 -459 -18 -278 279 155
2343 155 -160 340 221 -4 -107 109 -77 -221 -11 -240 150 178 163 90 -240 50 171 47 66 85 -179 513
2365E13o21J91jl14j20L53M54l42J06j47K08l33K79q5J84K7l57j18J67l21O3M8
2387a66J65k51j6K61l7M21m50N38l60j88l4L0K1K05J96n97K35P4K6K07o34L91
2409C7n21J32L72j81K18k93P33p32O18m46L89l5l35R8Ll3K38m16N60p94n5L99
2431d4l53M00l63M99j07L15ro56Q14n88L17m44L58o57R6J000m04j63K12m00L26
2452A49M70l62n7k83K28k87K59k76l4N5k32L58J37k29k89K40m80Q00N5J04r4j22
2474A10l41j01M0R2L82l20M49r9k56J22l31J55K36n20K88L35N2j60J2p64Q75m49
2496a93N8M05l43J70j7K0m57O32L06p50J10K83n50rL2L86N9q5j9M0n00M33K11
2519B22k33k68N6K01j15k7K08r8o1k0L44m69K72l9k42M20o49O03k43k7J23n00
$$ plain form
2365 513 -108 83 82 -232 -352 1 455 113 219 72 280 -53 226 141 325 352 -5 -123 44 -277 -214 -166
2387 -166 -1 -252 -268 -7 -44 377 -73 465 105 -83 -117 -87 -66 139 335 -262 -27 47 73 280 -354 37
2409 37 -484 -352 20 -161 57 -236 497 -235 383 -63 326 291 -44 54 57 24 262 -154 406 -388 -443 -44
2431 -44 -397 3 -360 139 32 347 338 -318 496 -92 225 -219 139 -518 -422 578 174 11 223 -177 149
2452 149 619 257 200 -83 145 -142 117 -159 -193 -138 -370 -12 125 -104 -393 -153 -633 167 222 326 232 110
2474 110 -231 -332 -292 -200 182 -138 311 212 -44 78 -253 -98 138 -382 -94 241 293 133 145 -619 256 -193
2496 -193 -135 270 -73 97 80 100 -357 275 581 -169 -59 224 -326 -335 -303 83 142 57 38 78 -422 11 222
2519 222 -11 -279 -223 -22 -137 -164 44 -54 -115 -135 209 -260 12 -27 -269 151 -498 105 -138 -165 -42 -542
2541e42Q46l63j6m53Q40j21j60m12M45J12M7m04l8N47p10M95L89m46k39M61k00
2562G8n3k55j92O00m34K84P8l53K77J31j59k4k40k2K86n7J92J8l39j13N74j85
2584I2J85l74K72j27o5J83l08k15M92J32Qn36L82m27M42L65n19j38o1O69j037
2605e85J074n65R0M9l40j76L19K38j76K90m86P38o62M96o46K8M93l00j29K83l70
$$ plain form
2541 -542 304 -59 -75 -528 312 191 31 -381 64 176 223 -181 -219 328 -382 113 502 56 -183 278 78
2562 78 25 -230 -422 178 -256 28 106 -247 30 161 2 -22 -262 -284 2 -55 137 155 -184 -297 277 92
2584 92 277 -97 175 48 -17 166 -142 -357 135 267 275 -261 121 -306 136 501 -18 -156 -217 452 -585
2605 -585 489 -76 14 63 -277 -453 -134 104 -72 218 -268 470 -192 304 -342 -314 179 -121 -250 33 -337
$$ [...]
8191a63
##END NTUPLES=NMR FID
##END=
