##TITLE=1H_DE-80
 200.13MHz, D2O,
 8 sc
 
 22.1.2025
##JCAMPDX= 6.0         $$ Bruker NMR JCAMP-DX V2.0
##DATA TYPE= NMR FID
##DATA CLASS= NTUPLES
##ORIGIN= UXNMR, Bruker Analytische Messtechnik GmbH
##OWNER= pz
$$ XWIN-NMR		Version 3.5
$$ Wed Jan 22 16:31:42 2025 Russian Standard Time (UT+4h)  she@DPX200
##.OBSERVE FREQUENCY= 200.1313
##.OBSERVE NUCLEUS= ^1H
##.DELAY= (6, 6)
##.ACQUISITION MODE= SIMULTANEOUS
##.ACQUISITION SCHEME= undefined
##.AVERAGES= 8
##.DIGITISER RES= 18
##SPECTROMETER/DATA SYSTEM= spect
##.PULSE SEQUENCE= zg30
##.SOLVENT NAME= D2O
##.SHIFT REFERENCE= (INTERNAL, D2O, 0, 14.3821)
##AUDIT TRAIL= $$ (NUMBER, WHEN, WHO, WHERE, WHAT)
$$ ##TITLE= Audit trail, XWIN-NMR		Version 3.5
$$ ##JCAMPDX= 5.01
$$ ##ORIGIN= Bruker BioSpin GmbH
$$ ##OWNER= she
$$ F:/spectra/data/she/nmr/H-C/1/audita.txt
$$ ##AUDIT TRAIL=  $$ (NUMBER, WHEN, WHO, WHERE, WHAT)
(   1,<2025-01-22 16:31:03.64 +0400>,<she>,<DPX200>,
      <created by zg, POWCHK disabled, PULCHK disabled
       configuration hash MD5:
       00 E9 B6 7A A2 85 ED C7 34 08 36 98 17 FE 4E 26
       data hash MD5: 16K
       C3 5E A8 74 A5 BD E9 D4 82 F3 16 59 BF BD A7 90>)
$$ ##END=
$$ 
$$ hash MD5
$$ 44 6D CD C4 B6 30 33 6D 6E 5D 30 30 43 EB 4A 85
##$RELAX= 
##$RELAX= 
##$RELAX= 
##$RELAX= 
##$RELAX= 
##$RELAX= 
$$ Bruker specific parameters
$$ --------------------------
##$DU= <F:/spectra>
##$EXPNO= 1
##$NAME= <H-C>
##$PROCNO= 1
##$TYPE= <nmr>
##$USER= <she>
##$AMP= (0..31)
100 100 100 100 100 100 100 100 100 100 100 100 100 100 100 100 100 100 
100 100 100 100 100 100 100 100 100 100 100 100 100 100 
##$AQSEQ= 0
##$AQ_mod= 1
##$AUNM= <au_zg>
##$AUTOPOS= <>
##$BF1= 200.13
##$BF2= 200.13
##$BF3= 200.13
##$BF4= 200.13
##$BF5= 200.13
##$BF6= 200.13
##$BF7= 200.13
##$BF8= 200.13
##$BYTORDA= 1
##$CFDGTYP= 0
##$CFRGTYP= 5
##$CHEMSTR= <none>
##$CNST= (0..31)
1 1 145 1 1 1 1 1 1 1 1 1 1 1 1 1 1 1 1 1 1 1 1 1 1 1 1 1 1 1 1 1 
##$CPDPRG= <>
##$CPDPRG1= <>
##$CPDPRG2= <>
##$CPDPRG3= <>
##$CPDPRG4= <mlev>
##$CPDPRG5= <mlev>
##$CPDPRG6= <mlev>
##$CPDPRG7= <mlev>
##$CPDPRG8= <mlev>
##$CPDPRGB= <>
##$CPDPRGT= <>
##$D= (0..31)
0 0.7 0 0 0 0 0 0 0 0 0 0.03 0 0 0 0 0 0 0 0 0 0 0 0 0 0 0 0 0 0 0 0 
##$DATE= 1737549062
##$DBL= (0..7)
120 120 120 120 120 120 120 120 
##$DBP= (0..7)
150 150 150 150 150 150 150 150 
##$DBP07= 0
##$DBPNAM0= <>
##$DBPNAM1= <>
##$DBPNAM2= <>
##$DBPNAM3= <>
##$DBPNAM4= <>
##$DBPNAM5= <>
##$DBPNAM6= <>
##$DBPNAM7= <>
##$DBPOAL= (0..7)
0.5 0.5 0.5 0.5 0.5 0.5 0.5 0.5 
##$DBPOFFS= (0..7)
0 0 0 0 0 0 0 0 
##$DE= 6
##$DECBNUC= <off>
##$DECIM= 32
##$DECNUC= <off>
##$DECSTAT= 4
##$DIGMOD= 1
##$DIGTYP= 9
##$DL= (0..7)
0 120 120 120 120 120 120 120 
##$DP= (0..7)
150 150 150 150 150 150 150 150 
##$DP07= 0
##$DPNAME0= <>
##$DPNAME1= <>
##$DPNAME2= <>
##$DPNAME3= <>
##$DPNAME4= <>
##$DPNAME5= <>
##$DPNAME6= <>
##$DPNAME7= <>
##$DPOAL= (0..7)
0.5 0.5 0.5 0.5 0.5 0.5 0.5 0.5 
##$DPOFFS= (0..7)
0 0 0 0 0 0 0 0 
##$DQDMODE= 0
##$DR= 18
##$DS= 0
##$DSLIST= <SSSSSSSSSSSSSSS>
##$DSPFIRM= 0
$$ [...]
##$SUBNAM0= <"">
##$SUBNAM1= <"">
##$SUBNAM2= <"">
##$SUBNAM3= <"">
##$SUBNAM4= <"">
##$SUBNAM5= <"">
##$SUBNAM6= <"">
##$SUBNAM7= <"">
##$SUBNAM8= <"">
##$SUBNAM9= <"">
##$SW= 18.0517328524113
##$SWIBOX= (0..15)
0 0 2 0 0 0 0 0 0 0 0 0 0 0 0 0 
##$SW_h= 3612.71676300578
##$TD= 16384
##$TD0= 1
##$TE= 0
##$TE2= 300
##$TE3= 300
##$TEG= 300
##$TL= (0..7)
0 120 120 120 120 120 120 120 
##$TP= (0..7)
150 150 150 150 150 150 150 150 
##$TP07= 0
##$TPNAME0= <>
##$TPNAME1= <>
##$TPNAME2= <>
##$TPNAME3= <>
##$TPNAME4= <>
##$TPNAME5= <>
##$TPNAME6= <>
##$TPNAME7= <>
##$TPOAL= (0..7)
0.5 0.5 0.5 0.5 0.5 0.5 0.5 0.5 
##$TPOFFS= (0..7)
0 0 0 0 0 0 0 0 
##$TUNHIN= 0
##$TUNHOUT= 0
##$TUNXOUT= 0
##$USERA1= <user>
##$USERA2= <user>
##$USERA3= <user>
##$USERA4= <user>
##$USERA5= <user>
##$V9= 5
##$VALIST= <valist>
##$VCLIST= <CCCCCCCCCCCCCCC>
##$VD= 0
##$VDLIST= <DDDDDDDDDDDDDDD>
##$VPLIST= <PPPPPPPPPPPPPPP>
##$VTLIST= <TTTTTTTTTTTTTTT>
##$WBST= 1024
##$WBSW= 4
##$XGAIN= (0..3)
0 0 0 0 
##$XL= 0
##$YL= 0
##$YMAX_a= 131176
##$YMIN_a= -142579
##$ZGOPTNS= <>
##$ZL1= 120
##$ZL2= 120
##$ZL3= 120
##$ZL4= 120
##$ABSF1= 10
##$ABSF2= 0
##$ABSG= 5
##$ABSL= 3
##$ALPHA= 0
##$AQORDER= 0
##$ASSFAC= 0
##$ASSFACI= 0
##$ASSFACX= 0
##$ASSWID= 0
##$AUNMP= <proc_1d>
##$AZFE= 0.1
##$AZFW= 0.1
##$BCFW= 1
##$BC_mod= 2
##$BYTORDP= 1
##$COROFFS= 0
##$CY= -3
##$DATMOD= 1
##$DC= 2
##$DFILT= <>
##$DTYPP= 0
##$F1P= 0
##$F2P= 0
##$FCOR= 0.5
##$FTSIZE= 0
##$FT_mod= 4
##$GAMMA= 1
##$GB= 0.15
##$INTBC= 1
##$INTSCL= 1
##$ISEN= 128
##$LB= 0.25
##$LEV0= 0
##$LPBIN= 0
##$MAXI= 10000
##$MC2= 0
##$MEAN= 0
##$ME_mod= 0
##$MI= 1.114404
##$NCOEF= 0
##$NC_proc= 0
##$NLEV= 6
##$NOISF1= 3.799351
##$NOISF2= 2.8
##$NSP= 1
##$NTH_PI= 0
##$NZP= 0
##$OFFSET= 14.38212
##$PC= 1
##$PHC0= 239.8508
##$PHC1= 25.7922
##$PH_mod= 1
##$PKNL= yes
##$PPARMOD= 0
##$PSCAL= 0
##$PSIGN= 0
##$REVERSE= no
##$SF= 200.129724274929
##$SI= 16384
##$SIGF1= 3
##$SIGF2= 2
##$SINO= 400
##$SIOLD= 16384
##$SREGLST= <1H.CDCl3>
##$SSB= 0
##$STSI= 0
##$STSR= 0
##$SW_p= 3205.1282051282
##$SYMM= 0
##$S_DEV= 0
##$TDeff= 0
##$TDoff= 0
##$TI= <>
##$TILT= no
##$TM1= 0
##$TM2= 0
##$TOPLEV= 0
##$USERP1= <user>
##$USERP2= <user>
##$USERP3= <user>
##$USERP4= <user>
##$USERP5= <user>
##$WDW= 1
##$XDIM= 8192
##$YMAX_p= 0
##$YMIN_p= 0
$$ End of Bruker specific parameters
$$ ---------------------------------
##NTUPLES= NMR FID
##VAR_NAME=  TIME,          FID/REAL,        FID/IMAG
##SYMBOL=    X,             R,               I
##VAR_TYPE=  INDEPENDENT,   DEPENDENT,       DEPENDENT
##VAR_FORM=  AFFN,          ASDF,            ASDF
##VAR_DIM=   8192,          8192,            8192
##UNITS=     SECONDS,       ARBITRARY UNITS, ARBITRARY UNITS
##FACTOR=    0.0002768,     1,               1
##FIRST=     0,             0,               0
##LAST=      2.2672688,     0,               0
##MIN=       0,             -142579,         0
##MAX=       2.2672688,     131176,          0
$$ Real data points
##PAGE= N=1
##DATA TABLE= (X++(R..R)), XYDATA
0 0 0 0 0 0 0 0 0 0 0 0 0 0 0 0 0 0 0 0 0 0 8 -8 8 -8 8 -8 13 -15 16 -16 21 -24 24 -30 32 -37 41 -46 53 -56 63 -69
42 -69 77 -85 93 -105 116 -127 140 -155 170 -189 208 -231 254 -282 314 -350 396 -449 512 -595 700
63 700 -843 1047 -1363 1905 -3023 6233 -37249 -142579 -103369 -77805 -64020 41802 119823
76 119823 73767 48204 48209 -27669 -82697 -46753 -44135 -61614 5271 64734 44331 53551 75062
89 75062 5676 -67065 -59094 -61163 -67935 6094 75479 60799 48968 46647 -15350 -66859 -44909
102 -44909 -31913 -36488 7980 47692 30313 28780 43204 4816 -36854 -29935 -35413 -50746 -9895
115 -9895 39522 39037 38983 44247 2017 -43106 -38836 -31505 -31581 3652 36877 28048 21994 27100 895
130 895 -26554 -19880 -19493 -29098 -8125 19119 18794 22279 32472 11781 -17470 -22044 -25009 -30915
144 -30915 -9455 18645 22924 23439 26059 6985 -15923 -18873 -20594 -24269 -8029 12667 16213 19689
158 19689 24585 10157 -10819 -16630 -20017 -23584 -10213 10264 17260 20190 21787 7831 -10023
171 -10023 -15845 -18153 -19274 -7144 8367 13198 15977 18234 8270 -6005 -11762 -15471 -18012 -9263
185 -9263 4786 10888 15328 17089 8976 -3975 -11098 -15134 -15621 -7975 3641 10054 13945 14662 7238
200 7238 -3380 -9259 -12703 -13894 -7178 3221 9173 11839 12768 6494 -2499 -8592 -11814 -11504 -5683
215 -5683 2515 7429 10431 10159 4852 -1980 -6628 -8913 -9165 -4724 994 5505 8346 8760 5408 -348
231 -348 -4927 -7756 -8427 -5366 66 4465 7527 8095 5140 303 -4136 -6872 -7294 -4615 -1 3787
247 3787 6410 6651 4588 303 -3554 -5978 -5892 -4098 -201 2816 5402 5936 3868 566 -2621 -4720
263 -4720 -5258 -4008 -950 2317 4298 4911 3588 733 -1375 -3985 -4962 -4168 -1336 1344 3947 4836
279 4836 4047 1804 -1277 -3752 -4382 -3489 -1621 1530 3438 4446 3382 1479 -1551 -3385 -4210 -3516
295 -3516 -1338 1353 3334 3824 3103 1534 -1028 -3023 -3724 -3007 -1243 776 2696 3484 2657 1091 -957
312 -957 -2684 -2883 -2541 -1104 635 2410 3304 2609 1272 -640 -2178 -2850 -2817 -1312 431 2049 2891
329 2891 2447 1220 -557 -1764 -2915 -2619 -991 368 1724 2334 2026 805 -663 -1849 -2276 -1762 -1063
346 -1063 242 1565 2202 1582 619 -242 -1450 -1941 -1667 -768 264 1187 1329 1329 845 -180 -1069 -1554 -1582
365 -1582 -661 46 895 1495 1270 1033 -203 -1166 -1256 -1531 -699 269 963 1321 1033 1055 -38 -763 -1369 -1184
385 -1184 -856 -127 772 1233 941 634 87 -811 -1161 -1170 -544 80 599 1041 962 226 -11 -569 -681 -894 -586
406 -586 -30 485 1059 1100 719 250 -614 -1043 -733 -588 -230 391 867 872 644 -5 -667 -654 -492 -524 -67 393
428 393 703 643 499 278 -408 -1035 -657 -341 92 384 749 359 403 74 -182 -530 -425 -418 220 287 736 548
450 548 342 -65 -279 -723 -234 -385 -223 334 431 516 357 246 -455 -478 -320 -244 70 138 636 465 223 -30
472 -30 -309 -727 -655 -283 -155 238 557 562 426 29 -211 -421 -463 -360 -221 150 380 475 457 -225 -161 -355 -772
495 -772 -353 -251 475 322 101 279 278 -96 -242 -228 -310 170 446 242 249 234 163 -435 -193 -259 -188 183 58 275
519 275 376 289 157 -181 -338 137 -327 -185 -230 429 6 90 27 -231 -240 -283 -245 -14 81 449 121 109 365 -187
543 -187 -210 -230 -379 -21 59 373 355 31 248 -4 123 -237 -373 -7 -115 343 411 188 179 -327 -213 -243 -194
566 -194 126 -70 354 556 129 -226 97 -254 -255 -83 -136 87 122 301 235 174 -365 -268 -32 -85 115 251 254 152
590 152 123 224 -15 -50 -225 -204 60 191 164 131 246 -249 -210 -249 -208 117 103 179 39 82 -90 184 -10 -100
614 -100 -20 -164 -30 173 -25 197 173 -73 239 -234 -40 -290 203 -18 209 38 96 52 19 -49 -185 -116 -50
637 -50 133 163 -155 1 108 234 -142 -307 54 -17 -27 -65 57 83 -134 -204 -151 -38 -3 -69 34 222 160 25
661 25 14 61 -38 15 104 -123 55 94 305 164 21 113 -56 181 -3 153 -140 227 -13 -131 191 -102 4
684 4 -236 -107 -79 22 145 106 12 62 127 -4 -64 29 130 30 -23 38 146 -31 -28 -193 107 -146 84 387 149
709 149 168 24 64 28 74 -227 -91 142 -326 110 46 -54 -141 72 175 -135 18 -30 32 79 44 144 126 58
733 58 15 -152 -164 -174 110 158 207 -25 62 136 56 17 -36 -113 49 44 120 212 105 -47 -92 115 -331 -40 208 19
759 19 -49 -243 81 -56 146 -428 -27 318 -159 -28 59 107 -90 209 -133 -156 63 29 -38 -117 -239 361 313
782 313 -20 110 -203 -115 -11 -86 -44 -139 -318 -33 132 -319 -214 147 48 -100 -59 -197 -158 309 -224 -121 -20
805 -20 -176 -274 -264 -17 -14 103 -43 6 56 172 -126 -173 -61 -460 19 135 76 -57 -57 -157 -67 -130 -51 7 146
830 146 143 -192 -125 289 30 -179 4 201 276 134 210 -89 -144 270 -123 -41 -216 209 2 -195 28 -87 268
853 268 -399 150 26 44 29 152 182 56 2 14 -75 22 67 -90 209 -42 72 -43 -137 -86 214 15 -28 -130
877 -130 -181 158 301 1 99 -353 152 82 -192 27 -56 -5 164 -87 -132 -62 -102 131 56 180 200 349 -284 -398
901 -398 -14 91 -87 290 -40 -163 -71 180 -222 -33 86 -196 -121 20 -35 -68 60 84 -95 121 24 39 -381
924 -381 -312 -147 -15 -176 323 63 -86 -18 -141 -88 45 12 68 -22 32 245 206 -34 104 137 -210 49 17 -24
948 -24 136 -2 -201 300 -288 135 -12 169 -137 -10 447 -10 17 -22 19 -202 -75 159 -234 -198 -54 -92
970 -92 43 35 59 -275 -62 -297 -21 -74 -318 -99 264 104 -147 0 189 -28 169 -35 50 77 71 -132 -191 150
994 150 -116 -138 -272 -78 -237 15 -65 71 209 86 -238 184 106 -62 -76 -197 -23 -160 -98 -153 -83 162 -119
1017 -119 -33 54 26 85 90 -100 123 -140 36 34 171 -15 73 115 -16 126 -80 48 -197 -115 268 -314 80 -158
1041 -158 18 101 118 58 58 -220 51 168 23 31 52 91 -33 100 -45 77 50 240 -313 -52 -400 -34 37 1
1065 1 239 180 78 -434 48 33 -88 -69 -114 -29 7 -133 126 -16 146 52 27 -287 108 227 -143 -110 60 -127
1089 -127 236 19 225 101 74 -171 -104 110 61 -51 351 27 -44 -61 -154 3 137 -254 -13 377 -229 -154
1111 -154 231 -94 -289 -203 -126 -186 160 276 -222 82 2 -56 23 -113 253 176 -116 -70 239 -145 -420 70 133
1134 133 126 397 41 -144 89 89 63 -182 -255 48 -475 -29 -183 131 149 226 9 72 -146 -5 -78 134 134 -172
1158 -172 -108 -67 -101 153 -47 -211 28 70 64 -64 -91 -37 22 6 93 3 194 26 -187 -249 -100 204 32 -1 -48
1183 -48 -68 178 -109 -191 -136 -119 -89 8 -155 -154 167 -75 74 -177 323 139 156 112 275 521 -11 -127 -233 -219
1207 -219 -210 56 -25 1 -37 -113 113 96 265 -141 -214 73 -204 -3 128 -158 126 75 144 -26 39 -57 -98 108
1231 108 -110 -221 -120 110 102 -148 73 173 9 238 173 162 127 -257 -302 -56 -254 86 -20 -156 -35 -58
1253 -58 -175 189 -97 27 -105 -62 -19 -58 -103 138 -23 -110 67 12 233 -4 -106 155 -154 -186 -178 90 -17
1276 -17 -233 -123 -21 -35 52 -28 -88 105 -37 -64 52 27 11 -62 -198 19 -46 -57 200 373 119 97 -208 18
1300 18 -217 -55 -6 126 -15 -187 249 -136 -7 -177 -224 67 97 48 -7 -79 -78 -195 196 28 7 258 -175
1323 -175 -161 -183 75 -156 -23 -21 23 73 -98 288 95 -72 170 -64 -25 140 -31 -408 47 -287 108 -170
1345 -170 84 71 -52 -6 202 -16 -5 211 -55 -29 -145 125 -100 -90 -176 248 31 163 -239 185 237 -78
1367 -78 -85 -206 98 211 21 268 -210 22 24 -174 -73 -189 217 -155 38 101 129 131 -243 18 -122 -4 119
1390 119 -93 160 -65 46 -263 -50 -104 -19 -48 99 -1 173 141 10 110 -33 -142 -165 58 -84 -34 41
1412 41 -342 90 -37 -119 79 37 -283 -268 252 -130 136 86 82 -28 -209 -156 266 165 13 -43 -84 74 -31
1435 -31 79 -85 -137 225 -76 50 -23 -40 -164 148 -36 -44 -68 -74 119 95 -248 305 51 39 -306 -196 -239 -95
1459 -95 189 124 32 -202 54 27 2 -55 -163 35 -102 198 54 -93 -90 -154 266 97 -232 -39 -114 -60 -87 -350
1483 -350 52 6 157 -72 -50 207 1 -86 -11 129 -202 -148 214 16 31 244 208 -232 76 -238 8 287
1505 287 -57 -27 112 0 176 -245 -46 102 105 87 71 -11 10 22 -156 296 -14 -62 26 -1 -158 10 235 6
1529 6 -1 -51 -52 133 74 -74 36 78 -12 -20 -323 111 137 -83 -46 -112 -72 -263 -216 -224 -51 -122 -156 152 -65 -25 -230
1556 -230 -165 369 -161 198 29 259 211 -147 -88 23 -229 -60 -103 129 -2 -101 151 192 185 -127 64 134 -3
1579 -3 -235 138 330 149 31 260 -261 -59 -14 -342 -157 136 31 101 256 115 -36 -24 -50 -205 26 29 10
1602 10 -157 367 3 -166 31 -60 24 35 -68 -129 61 17 -376 -12 167 37 222 204 -32 -39 68 106 -113
1625 -113 92 235 -111 4 -114 208 36 -7 207 278 -126 -30 185 56 -24 87 -52 -38 -44 84 -168 -68
1647 -68 -107 -14 32 66 74 -209 -41 86 -12 -21 35 -100 161 215 103 12 239 67 -44 111 -52 -46 94 12 -163
1672 -163 -171 -14 -161 14 -145 -18 -86 -222 -107 -325 34 -273 337 -162 -351 -17 -124 -62 152 -20 16 194
1694 194 -78 316 -100 135 82 -94 -276 -56 189 -129 144 18 -194 -142 95 224 76 29 -47 -57 -20 78
1716 78 100 27 92 78 -22 -118 -27 35 -56 -161 166 99 107 95 209 171 81 -107 247 -13 28 3 21 234 -67 -47
1742 -47 -113 -73 -137 -217 397 -8 -153 16 126 118 -361 0 -124 -161 23 6 -98 -283 -181 -191 2 170 -128
1765 -128 121 -134 -145 133 -67 -166 -72 105 -141 89 -40 -146 125 44 -68 265 -94 150 275 -8 -58 -51
1787 -51 -303 97 -36 132 193 52 227 -180 314 -29 -183 -259 148 -22 52 28 -7 -238 -157 5 124 95 53
1810 53 -101 -19 144 -41 -16 188 100 136 165 -63 -175 -51 -8 66 93 -42 303 18 -212 94 59 6 -36 10
1834 10 -84 -64 -11 -42 152 59 -65 -248 112 -48 154 128 16 195 295 -238 92 -76 8 198 101 14 114
1857 114 27 264 -45 177 -154 201 -253 -299 243 32 114 -180 0 -72 -157 -102 26 221 -11 -170 262 -31
1879 -31 44 70 -55 72 -40 -52 306 250 193 20 -227 -17 -70 -129 -84 140 369 -33 58 -69 37 195 -95
1902 -95 -115 -17 -124 -15 142 169 -64 -285 -149 -79 16 198 -102 19 153 -32 -122 56 -32 -241 143 262 -31
1925 -31 351 56 -63 -4 -183 25 -117 111 -95 232 -145 -95 82 46 64 -39 -226 -16 19 -105 -51 -38 -57
1948 -57 -51 -138 -20 34 -31 13 -11 -52 57 -37 -33 18 140 41 -194 -35 130 333 -25 276 -16 -265 111 60 196
1973 196 282 53 -166 -93 18 -222 -51 -103 209 -178 -110 132 86 -91 -183 85 154 110 27 86 39 129 -73 93
1997 93 -79 24 -23 -83 -81 -91 23 27 120 85 -154 387 17 -74 381 146 19 150 305 76 -170 166 -243 -34
2021 -34 -164 87 -128 -194 -7 113 199 141 64 255 -101 -169 164 182 120 -110 9 -29 -14 170 85 75 -165 277
2045 277 -57 -47 205 -232 215 -279 206 346 93 -161 -48 -27 257 173 186 93 153 15 -77 203 -107 250
2067 250 142 -80 -128 -173 3 -28 -256 4 -256 239 -65 -125 -108 68 54 -95 98 352 43 -134 241 -72
2089 -72 203 -35 68 11 79 37 71 -227 -90 -84 -146 -61 48 47 117 -87 -294 -125 -140 -275 66 -93 180 72
2113 72 -199 290 -15 -50 34 55 83 -88 24 -82 -155 142 -214 76 -159 -163 -40 -89 -136 104 42 -95 76 -28
2137 -28 238 115 6 -75 62 -266 17 56 9 -48 -52 -178 -211 -232 -13 3 -48 11 -44 64 171 284 70 11 -32
2162 -32 97 -112 12 64 125 3 -17 122 76 293 -225 -252 52 -103 -10 -41 -86 69 -163 113 -147 -102 122
2185 122 -140 67 -176 -289 -36 73 -168 192 299 -182 -89 -143 -143 68 -122 -6 -57 207 64 -222 -12 170
2207 170 268 55 -71 42 196 50 -284 121 242 -253 58 51 -192 116 8 -106 178 84 56 -193 -47 -83
2229 -83 -59 51 -149 -81 -13 -122 66 26 -102 36 -41 -207 -50 65 -202 -198 -64 67 46 43 -246 -221 -26 -54
2253 -54 -46 -66 141 349 95 129 -126 119 51 -221 214 28 -174 147 -171 -47 -58 127 -54 -5 74 -263 14
2276 14 -86 -182 -38 -23 -84 30 100 -351 37 -6 -182 17 -118 278 175 181 -86 -152 65 29 -8 -20 -211 -135
2300 -135 46 -154 -83 -167 -48 31 40 -97 -295 -69 -2 79 -199 115 -73 -195 90 -17 52 215 48 -261 173
2323 173 -351 -65 90 -127 -151 -364 -128 -21 153 -45 -2 -177 -74 -242 182 246 -103 -460 -202 -167 -182 78
2345 78 75 88 81 -37 50 -53 64 6 -188 7 -111 150 -138 -95 -58 176 -53 -50 -10 -193 234 -15 -29 36 55
2370 55 221 76 115 -280 -167 37 213 168 92 153 216 259 -251 176 348 13 -13 -186 -107 -4 20 -183 -70
2393 -70 63 57 -144 282 10 20 140 -191 266 -287 -132 266 39 -71 90 15 82 -140 100 -61 -6 85 -176
2416 -176 16 -310 12 148 -116 -56 25 333 184 154 297 -352 15 0 -34 102 -471 28 -45 -174 461 175
2438 175 -378 -25 -52 170 59 -246 -328 -170 33 -191 -135 35 19 276 134 51 -45 158 256 70 121 -38 268
2461 268 81 69 227 26 64 -78 15 -115 -155 145 129 14 -218 -110 46 -9 172 -75 -61 102 -141 90
2483 90 69 -240 -197 -69 157 321 -73 108 252 34 -54 -9 -198 49 43 -124 -165 221 -77 140 -122 -104 -184
2506 -184 117 21 -19 -46 -131 150 101 163 -17 194 -267 48 54 138 75 -33 280 81 -144 -17 -26 51 -134 -67 -96
2531 -96 0 -130 -173 36 -15 -226 -124 44 -121 -20 -42 -331 -78 -57 -150 -161 -444 -35 -178 -203 -54 -219 178
2554 178 156 -117 -135 200 192 27 -33 -48 252 74 126 -205 124 229 -32 -91 -63 63 48 83 82 -48 -53 -179 181
2579 181 167 195 -155 294 57 -87 128 -31 147 40 265 -229 169 49 -51 86 -7 110 -12 -57 -170
2600 -170 41 -46 14 -104 100 -8 150 -58 47 83 157 32 1 162 247 -70 -133 96 52 -263 -14 -277 54
2623 54 -123 -94 257 -20 -20 -14 68 -149 -125 -61 132 -80 14 50 -168 -146 111 25 0 131 63 123 60 -88 -23 -12
2649 -12 -244 -9 57 181 50 -139 -197 508 -28 210 -175 -494 240 128 86 62 199 -89 -98 12 29 -72 179
2672 179 -2 -93 -175 -377 153 -41 140 119 -124 212 96 35 -63 -47 123 95 160 34 -112 -66 130 71 -206
2695 -206 -154 150 -48 -29 35 84 -243 -28 79 -9 -116 53 -15 -26 102 134 -76 -47 -131 98 51 -269 -20 106
2719 106 33 151 -265 -68 -200 79 247 69 -239 -46 -241 -86 -73 23 -84 -196 90 7 -106 -127 23 12
2741 12 154 183 243 -265 251 101 -132 -32 138 -43 -110 -104 -81 -73 -91 -30 -111 308 -135 -91 -81 -94 -190 -80 -105 -39
2767 -39 126 156 -47 -273 263 21 -148 81 17 24 -112 185 64 -64 -88 244 -74 74 -179 -369 74 -205
2789 -205 75 -64 195 -134 -277 -21 -38 133 -68 130 203 227 116 -178 -154 55 20 37 42 -57 -132 155 260
2812 260 91 -111 -163 29 60 -72 154 -15 -94 -20 -78 -264 29 113 16 70 6 -141 -91 165 -135 26 -95
2835 -95 -66 -59 -304 21 49 -250 25 -117 12 -4 -1 -34 228 -252 111 29 -11 205 -93 196 -110 93 60 -432
2859 -432 92 136 196 480 127 207 164 -200 185 -32 -46 -3 -152 148 -54 268 -157 -24 180 -10 161 117
2881 117 229 40 101 148 -23 -51 34 1 90 117 333 151 -68 80 -36 104 192 20 329 113 -107 12 -83
2904 -83 -279 251 -104 -104 71 -152 -43 -50 -397 -27 69 -268 -35 -71 -41 16 -225 9 -46 22 69 -109 6 -57
2928 -57 -149 194 -281 -42 168 -52 -147 139 -6 51 -42 5 143 -9 181 175 95 434 129 -198 -1 -105 -31
2951 -31 44 149 -104 -158 -115 -66 44 -174 -82 -282 -135 64 66 -156 -86 67 157 -176 -136 -16 207 169 -230 -72
2975 -72 -25 20 31 341 -113 -94 63 -166 144 -72 79 114 27 -26 25 179 -106 -305 116 46 -111 -73 67 119
2999 119 2 -99 -247 -169 161 -230 91 24 70 82 -106 -141 93 -129 129 -161 -353 227 200 119 212 -87 -213
3022 -213 -44 377 -50 225 284 -186 -53 91 -167 20 156 165 16 31 223 96 -110 208 95 114 21 114
3044 114 160 224 -42 100 121 -38 97 -10 270 -49 48 199 84 -112 109 289 -135 -97 -44 145 -125 -164
3066 -164 39 -32 204 -172 -163 -175 -92 -101 -223 -196 244 -31 93 -184 53 121 -135 133 238 107 196 -37 136
3089 136 37 -244 145 -185 -133 179 72 18 -84 0 240 -39 -24 39 143 85 -37 72 -57 155 -73 22 -294
3112 -294 -235 -103 72 189 238 42 -149 -156 260 -131 119 32 156 57 287 208 154 -101 119 165 30 115 -108
3135 -108 -148 10 184 -93 -5 -18 -44 22 -89 -272 177 -45 -92 257 344 39 -148 51 67 -225 76 36 120
3158 120 -302 50 11 95 -4 22 28 -212 90 -16 -145 -259 -188 0 190 -163 -35 -161 -63 -323 -110 -17 47
3181 47 108 104 146 41 -198 -45 -68 49 39 -42 273 126 111 -13 -240 24 -216 -146 40 -13 44 -173 42 -15
3205 -15 -34 -99 -118 198 -109 13 41 -234 -45 36 -190 201 -222 -41 210 -74 -126 -245 -120 14 34 38 112 237
3229 237 -114 -81 -9 -90 -147 42 119 2 296 -31 58 -25 16 -50 -45 63 27 83 49 66 85 140 148 62 7 113 -33
3256 -33 -62 -120 -36 8 35 32 69 -3 -26 -61 -256 -97 159 -44 -318 30 -113 -239 -170 -4 231 -70 134 232 -177
3281 -177 8 -199 28 -267 87 130 82 -112 22 -102 -28 66 -69 -100 171 2 -1 84 -122 -95 -44 117 -163
3304 -163 -251 -58 199 38 71 250 -184 212 -18 -204 -124 65 -3 -6 -220 -179 179 -148 159 52 58 102 -195
3327 -195 221 44 -16 21 -34 189 -142 126 218 -153 78 76 53 -51 31 260 169 22 -9 -191 45 36 -28 290
3351 290 218 53 -6 53 -143 149 25 -229 123 -132 -178 108 -109 -28 106 212 -52 72 -101 -152 -164 -198 198
3374 198 64 75 218 -234 107 -222 -202 -3 -100 -16 -21 26 -98 88 291 87 -54 189 -78 -24 97 122 101
3397 101 30 -103 266 -168 279 1 -21 -6 102 320 -154 5 13 -95 93 122 -183 -50 -69 -194 -102 194 -9
3420 -9 -170 30 -125 236 138 43 -170 -129 184 161 -166 -255 109 194 -265 -127 -63 245 -111 152 194 -7 -308
3443 -308 -261 259 260 14 27 -250 151 -68 -57 -7 -196 -3 -4 106 -370 104 -30 -82 225 255 114 -143 82
3466 82 186 154 135 -96 -52 96 122 -46 222 -121 -184 162 48 329 -117 15 -263 85 -130 157 49 113
3488 113 -3 175 114 119 23 14 338 297 -5 -21 173 10 13 54 25 -79 101 -115 -36 6 63 34 -143 51 -1 -112
3514 -112 10 86 98 -212 106 153 65 222 168 -175 131 -265 5 -253 36 -112 -149 -66 -106 119 195 -91 110
3537 110 290 -103 -276 159 9 -208 -284 -150 -171 40 237 -25 -166 -128 -115 -93 88 49 -261 20 -54 -248
3559 -248 112 -13 159 -24 -149 -4 -98 115 97 160 236 -75 -47 309 295 -67 1 -242 15 113 146 -156 -125
3582 -125 -17 -272 -136 -30 -104 -330 -27 -129 -28 -95 -161 44 179 -27 33 148 -103 -156 68 -30 -248 -21
3604 -21 97 98 124 -250 171 -107 65 95 147 28 -44 -69 -85 228 189 -89 150 52 -77 -11 83 10 -181 101 11
3629 11 149 104 89 -41 96 -176 -81 -189 -212 150 -133 46 -82 114 11 159 54 187 -134 -43 172 -50
3651 -50 -140 -136 81 -12 14 -13 -14 325 -78 222 256 -112 -45 104 125 24 54 -94 -14 2 225 137 -88 167 77 31
3677 31 -211 -24 -299 151 163 -56 -214 297 -57 -104 -220 139 -37 117 256 65 -259 -236 212 -39 26 233
3699 233 4 81 -97 -87 247 36 115 -56 -92 3 114 -51 -150 -134 -228 -3 15 141 153 -165 -192 -134 280 81
3723 81 207 231 -22 -145 118 72 63 171 -153 3 -76 25 -169 123 137 -158 -126 41 -60 237 -73 -157 177
3746 177 107 -10 -114 160 221 -112 -99 191 -274 -117 33 -39 -96 -74 -247 -74 344 81 -42 172 -66 -295
3768 -295 92 -142 155 70 142 60 159 -203 -212 -252 -62 83 25 -132 45 -18 59 117 -23 -216 183 -269 172 97
3792 97 -37 -84 41 -17 49 249 -247 164 15 -175 -118 -173 -120 -67 -190 -239 -53 -399 -88 -204 -55 -8 117
3815 117 -99 284 182 50 -16 153 187 -234 16 -132 -43 -95 71 271 259 -35 29 -153 -40 -43 192 32 -53
3838 -53 -224 90 -81 347 112 -201 133 324 -90 0 65 -168 -36 69 -103 32 -56 -285 148 152 -86 78
3860 78 292 3 29 -23 -69 -27 -95 -22 -259 208 -98 -156 -52 50 -113 -196 -136 196 54 -130 -160 -91 -10 -127
3884 -127 79 -88 -227 -38 102 -111 -25 132 160 -73 36 -12 -63 125 25 164 -84 170 8 56 64 -216
3906 -216 41 -224 27 50 207 114 -2 -127 70 74 -254 -158 -206 91 5 199 43 68 -69 -31 -5 108 188 206
3930 206 68 -157 158 46 -143 -176 6 -82 241 35 147 175 3 132 -54 -27 287 136 -56 -58 242 -91
3952 -91 53 7 -112 7 134 -125 -35 -113 148 136 71 98 166 225 80 134 -67 -137 -14 201 21 207 -278 76
3976 76 29 177 -106 232 127 -66 218 -203 16 10 -49 -249 -128 -42 -84 50 114 196 130 200 -72 -10 -147 195
4000 195 22 360 155 86 167 -39 104 46 -2 144 122 9 -9 67 -159 133 155 -195 -113 343 195 33 -9
4023 -9 -264 -125 -30 -106 139 29 -41 63 73 274 211 30 22 65 180 -28 -48 47 -167 -68 163 -149 73 82 36
4048 36 -93 -16 105 130 7 -25 -17 3 24 181 -169 -295 -67 -149 338 58 -161 97 -168 2 -194 116 -7
4071 -7 142 -64 -85 36 -39 -223 138 -64 -66 36 103 6 56 187 -15 -123 7 -75 -155 -57 -32 -144 -140 59 151
4096 151 113 39 -226 -11 -41 -10 11 159 -200 -187 146 70 240 265 44 -14 16 179 80 -16 -41 -149 -17 155
4120 155 -146 95 -126 101 1 81 258 32 234 -125 -208 73 71 25 118 -185 70 -52 123 -218 -4 191
4142 191 -22 214 -344 -242 140 -143 -36 32 -99 -165 -102 -72 -157 190 163 50 119 -77 -17 140 -107 -119 -245
4165 -245 -197 140 65 -55 9 -49 137 23 -14 66 16 78 27 -24 -130 -46 46 -24 92 -167 137 -174 -270 55 -17
4190 -17 352 60 -29 314 -61 396 -127 -351 157 97 -249 -44 90 -58 155 -408 81 -164 -39 -197 -119
4211 -119 61 42 115 46 150 -48 132 -33 -135 -160 37 117 -88 -53 45 -134 -105 229 -46 -51 240 -118 -40 -210
4235 -210 36 167 7 -58 -89 57 -167 -5 12 -65 -1 -125 -43 -143 135 -64 -117 -45 -162 -306 193 -30 -76
4258 -76 20 -139 -199 310 151 10 4 -214 57 -217 126 52 -69 -115 -284 176 160 -40 -35 48 -4 217 144 -213
4282 -213 -64 144 210 -134 175 54 187 1 -39 5 -58 -157 -25 -54 -66 106 119 -178 16 24 -17 228 106 -66
4306 -66 8 -176 -221 -82 -223 -77 3 99 188 -44 169 184 5 -37 -86 15 -48 72 124 -95 -233 -8 -183 -24
4330 -24 129 -152 258 -307 -107 176 162 398 492 -194 2 208 -53 143 96 -48 -79 88 -100 24 -32 -17
4352 -17 181 345 42 12 67 35 222 -94 -10 -17 -148 -88 89 225 41 -89 21 -202 109 -168 58 -30 177
4375 177 54 23 91 -58 50 -37 73 -281 -154 -91 -129 -93 -60 191 191 83 -249 -106 66 -3 40 -42 8 -36 -176
4400 -176 -79 106 74 189 280 162 -85 -41 -23 184 -205 -410 353 37 3 139 -134 -21 -134 15 15 -139 -33
4423 -33 161 192 -141 94 -94 -42 159 -35 -83 390 -99 115 -30 1 -381 27 -82 -143 -161 121 -103 189
4445 189 -221 -13 197 171 133 -125 -94 -150 -239 -218 228 234 142 -41 212 -31 204 -16 -78 -112 -3 58 -66 104
4469 104 -210 -16 -108 -29 69 186 153 54 -298 198 259 -127 29 323 -48 187 14 186 -36 -116 -107 216 157
4492 157 77 164 -25 -30 -24 -79 -117 -172 224 14 98 -63 51 -115 150 27 -40 -24 -168 178 -377 170 237 -218
4516 -218 -137 42 -118 215 -31 -63 4 51 241 -113 65 -48 -375 174 125 8 -164 -119 -22 -26 63 21 43 -267
4540 -267 205 -193 17 -33 -29 -143 130 -168 -5 76 -234 -196 117 70 -14 -49 -91 -60 -385 -183 -109 39 -127 47
4564 47 228 183 48 31 176 127 229 -76 63 -3 -112 -31 261 -25 243 193 115 -42 -84 -191 -7 -25 -51 -7
4588 -7 27 -105 -329 139 -231 -65 150 -233 -235 -7 -44 -394 47 105 -23 18 -224 6 -87 -59 -98 5 -280 -1
4612 -1 -62 46 121 110 76 -26 -274 46 219 124 -172 -54 14 -61 -24 81 -44 -179 175 -43 -46 192 72 0
4636 0 -145 -267 -3 -52 -86 174 221 153 45 -11 -89 141 -87 345 148 -30 -73 188 -38 -153 -27 -43 78
4659 78 326 26 102 19 37 44 229 163 -181 176 3 -53 -49 -232 -117 13 57 281 126 -141 18 -422 106 -71
4683 -71 -94 -43 -138 -106 73 -188 -282 33 21 -7 -168 -196 20 -75 -307 213 87 -34 -1 222 2 183 -13 -160
4707 -160 402 -107 -168 40 -119 88 -238 75 48 -232 -111 84 95 164 -237 92 -122 -200 -225 -237 -184 9 -155
4730 -155 -129 -141 -90 -59 241 45 31 -90 -205 -14 254 -12 -224 2 24 -208 194 -105 266 207 166 -193 -15
4753 -15 -4 17 -104 160 -48 151 176 2 112 -9 -214 -18 -51 53 28 238 -117 59 -79 149 -10 -20
4775 -20 222 127 -225 -112 -7 45 54 -17 -165 64 -47 -215 61 66 -60 23 184 38 92 153 -152 -111 49 111
4799 111 88 -82 -34 -188 117 259 -177 -32 -74 54 -36 -75 -84 112 207 10 -77 95 213 -103 69 -288 -158
4822 -158 18 -6 -93 -207 -14 1 44 23 -32 66 86 -94 -265 109 -20 113 -78 -36 49 103 -10 164 132 -192
4846 -192 -87 -50 -79 -160 -73 153 213 65 42 74 163 -45 73 83 -169 -93 214 138 62 10 143 -167 -113 253 -114
4871 -114 -297 -38 -25 -27 -201 5 285 -65 -107 -26 154 26 -304 64 -181 178 -95 -93 48 132 136 101 43 150
4895 150 63 284 -113 58 101 -52 88 -98 -132 -34 97 -20 -62 -14 -93 -80 124 161 -200 -116 128 76 189 -72
4919 -72 119 52 147 28 -50 -17 -119 -158 -149 192 -157 -114 -109 125 2 92 -2 -190 -27 -43 -189 -123 45 -74 57
4944 57 -42 72 153 31 305 61 -60 93 23 -75 151 -62 138 98 106 70 -116 -212 -79 32 41 182 -67 118
4968 118 -8 -42 29 -223 247 -309 -9 77 17 -201 -54 37 -114 175 -110 -73 -174 -5 123 -272 138 -83
4990 -83 125 273 -144 -84 113 51 90 -4 96 -210 -271 40 181 -140 -39 2 -46 1 -226 -259 255 87 -50
5013 -50 192 49 118 153 -80 56 -260 -179 -246 60 44 -206 170 -21 78 156 135 -141 -25 304 -93 104 41
5036 41 -222 -183 233 0 -129 -235 212 46 177 32 134 7 51 42 -271 50 69 96 -140 -43 -161 -68 99
5059 99 84 -55 -28 179 74 178 261 -264 -218 214 -72 59 -137 -154 -121 -130 -98 9 151 -17 -208 289 -114
5082 -114 -28 -218 -111 -88 -29 188 -27 -99 16 -351 75 -137 -23 -55 -131 91 -79 -1 307 46 171 26
5104 26 193 368 95 -36 144 -4 0 121 308 -48 -42 -227 274 -83 -172 -9 -42 -22 -249 347 48 -104 -157
5127 -157 -90 49 -135 99 -42 -195 55 44 50 184 -26 104 -192 100 363 -68 0 -48 -256 -117 90 -42
5149 -42 -134 115 25 -89 171 -15 -13 -31 -66 -431 -176 6 154 -435 19 -75 24 125 120 -265 33 -42 -82 179
5173 179 1 40 -145 -54 -228 -89 -72 -107 59 46 88 -47 -7 72 7 -124 -248 -48 150 -50 81 -61 -74
5196 -74 -190 29 249 -246 89 -297 83 2 98 -75 -46 -13 42 -61 113 146 -195 9 -87 25 88 155 -144
5219 -144 108 227 94 -70 86 157 -102 133 32 40 -252 -21 158 -85 -175 -241 103 99 126 -42 47 -38 234
5242 234 -221 181 -75 -135 13 -6 -349 197 -177 -206 258 104 81 -291 64 -157 196 -54 -136 40 65 228
5264 228 -23 19 35 309 110 14 -31 173 46 126 198 16 96 -286 -40 171 -13 -15 1 26 55 75 139 38 -3
5289 -3 58 -175 5 -187 34 192 75 -134 -214 -440 -66 11 271 52 -87 189 169 214 -156 55 132 -66 170
5312 170 154 52 -107 -215 -23 -142 -113 150 -82 -94 -223 129 181 -103 41 -25 -312 388 39 137 213 -17
5334 -17 -272 -67 -77 71 45 -253 90 -332 -232 -18 164 -34 -75 -278 195 18 135 -14 78 -9 -230 -90
5356 -90 -18 121 120 49 -97 -18 -85 168 260 -291 70 98 60 104 -247 -60 -219 58 -77 111 -98 56 175 128
5380 128 114 -191 -25 -223 -178 209 205 204 -123 -53 318 -142 39 57 -28 -211 -77 -75 104 86 -71 91 -64 -116
5404 -116 55 30 -131 164 225 5 -175 132 -236 60 106 -242 -82 1 -192 -156 -108 243 -42 179 -237 8
5426 8 -141 36 205 -77 340 -265 225 164 60 -83 261 -137 219 26 -73 35 -214 126 -16 17 -236 -67
5448 -67 191 -7 -124 142 -100 -163 3 -13 -258 -52 175 187 55 64 120 -107 159 268 95 65 -67 -7 27
5471 27 8 -27 131 108 58 -156 -56 -25 159 133 -53 -335 -84 -232 -29 -247 236 45 -559 -115 -216 114
5493 114 120 -140 236 105 -74 -181 -36 -98 127 109 5 165 -353 -379 176 -23 -123 20 -99 107 159 -17
5515 -17 -148 191 171 9 -14 -199 100 30 292 216 -43 44 -325 -90 10 114 -46 161 -200 -49 3 -97
5537 -97 141 -198 -157 -1 120 -4 220 -119 98 28 442 -40 -99 -14 235 -300 22 -24 -69 -51 -182 -167 -17
5560 -17 160 -82 -122 -69 -43 25 59 8 -227 24 354 -402 -57 -168 -1 -75 -157 72 14 -130 -2 13 -200 44
5584 44 50 -108 -52 -283 -140 -128 -37 -151 -204 -84 57 -57 108 -53 -178 -168 -11 -51 26 156 -258 66 45 66
5608 66 -137 143 6 -52 104 11 77 206 -82 -35 294 289 -29 -10 -141 98 201 99 -194 -47 129 -297 82
5631 82 211 -111 -162 62 196 45 126 39 -336 195 -24 66 244 -152 49 177 -201 269 -39 231 93 -71
5653 -71 183 128 5 231 113 221 114 67 11 -298 149 -142 -113 -56 18 -114 -136 -169 295 -228 -1 47 300
5676 300 130 -177 165 106 -23 161 3 -186 32 -41 -185 -66 -172 -101 37 -219 -236 93 42 -165 -281 268
5698 268 125 -144 -238 125 197 -10 -195 -8 151 -49 -66 -29 10 152 105 61 246 14 113 -25 -226 155 2
5721 2 68 164 29 268 245 157 179 136 62 -130 -62 -147 116 109 120 15 167 52 -250 47 27 -204 14 52 118 182
5747 182 136 -76 -71 117 106 27 -88 430 -128 10 43 -75 -130 -54 97 128 142 -51 144 -343 -102 158 200 209
5771 209 -56 301 175 -132 164 -54 -35 -86 67 113 -257 122 -288 -90 55 -232 49 24 497 -25 -15 166
5793 166 150 10 -229 27 158 6 109 12 79 182 162 223 37 12 47 -195 117 349 215 -125 -133 29 8
5816 8 -425 100 65 45 -49 -253 -219 -290 -107 -33 -189 24 -158 -170 51 28 -142 39 -16 -46 196 -127 134 -37
5840 -37 73 253 -26 -25 183 -161 -36 93 13 20 52 -154 38 -22 87 200 141 108 12 -146 -139 -100 92 21 79
5865 79 17 280 29 -258 66 61 -54 279 -139 -55 85 -80 -188 182 196 -220 67 330 -71 77 -223 184
5887 184 230 138 74 154 317 -157 17 207 -28 143 118 -207 112 -47 -170 -99 -182 194 39 67 -37 -23 87
5910 87 34 137 187 244 -42 320 158 -51 -100 -91 -220 -62 171 -449 -160 -85 1 105 -99 99 146 -154 -123 17
5934 17 39 131 -158 208 284 -177 -87 -90 -65 64 -208 75 128 -238 -44 -127 224 138 -187 -241 -149 -52 -215 -167 70
5959 70 -134 -94 110 -86 -6 192 65 -217 124 59 50 -80 46 -127 35 77 -385 101 -25 -145 -166 20 299
5982 299 52 -72 213 113 119 154 221 20 -257 -136 17 -131 -119 110 116 -188 -49 319 -115 67 38 178 -184
6005 -184 31 45 65 250 38 246 193 32 -142 170 160 148 -234 -256 -142 245 127 60 80 -294 221 81 -59
6028 -59 -15 36 -64 -195 -244 -258 -56 64 -91 -49 117 106 190 -7 56 68 106 -32 -290 169 97 234 245 -117
6052 -117 60 274 55 -70 268 24 130 -95 -422 66 -90 26 -54 -265 236 -91 69 24 -95 239 69
6073 69 48 -58 -58 -128 -33 -106 -208 -119 28 -139 164 37 53 -92 103 -223 407 -24 -58 -146 -283 -232 -78 -115
6097 -115 -175 -313 23 100 233 158 -223 -33 22 -107 -214 -38 110 -118 24 54 -83 159 -155 243 11 -31
6119 -31 -76 156 -313 -297 68 -46 -106 -154 162 -98 -3 17 152 -75 -72 -52 -248 103 67 -203 142 77 139 32
6143 32 -41 -35 -113 -207 -74 143 161 -235 -64 123 29 238 48 155 -79 238 -108 -28 65 274 -112 -59 -101 -247
6167 -247 -178 -29 -94 -240 106 17 -2 -116 -13 164 -126 -21 -199 -159 158 -8 0 -40 182 306 -351 -163 -106
6190 -106 -120 95 -85 -218 174 -248 -10 -410 -275 -198 -216 -104 103 4 125 -59 -30 -100 -133 -90 -201 43 -101
6213 -101 -309 134 -128 146 -109 64 16 181 149 86 -225 -159 -145 113 135 -42 556 118 52 -34 116 58 209
6236 209 -301 239 31 41 96 -135 86 -68 15 -174 -133 -71 -103 -149 -174 4 -37 -276 -84 203 -122 -105 -276
6259 -276 167 24 -185 8 156 22 170 -49 -282 102 99 87 -157 -49 135 29 -105 -262 115 -115 -103
6280 -103 -102 174 -199 143 145 -4 -85 170 -89 -93 71 -13 13 62 -57 -78 -1 -1 -101 -228 -66 -93 39 118 53 121
6306 121 6 94 191 -118 174 109 -144 -159 301 -66 -203 249 35 6 35 -279 -37 -180 198 207 -212 348 -146
6329 -146 0 -162 -52 -20 -5 -149 -93 183 -161 -279 -230 -217 16 126 -27 -79 -83 -39 -191 308 -52 143 -16
6352 -16 90 -25 101 55 8 343 -58 148 78 20 -377 -202 -435 44 137 -78 60 -55 13 -100 -318 -286 171
6375 171 202 95 -165 -75 -196 150 -20 -38 -63 -169 109 -53 114 253 226 95 145 -109 194 -284 -22 -173
6397 -173 -199 106 145 157 -330 70 291 -70 111 -80 -88 24 -19 83 -95 -70 183 107 9 -194 32 -26 221
6420 221 -45 128 -128 -73 -122 106 -18 -62 187 -26 -140 -17 168 -213 -78 45 -92 -71 -4 276 139 181
6442 181 462 199 89 -6 -43 -239 53 -90 -75 216 -63 -48 -43 68 16 120 -38 50 42 -165 -260 21 -149 161
6466 161 58 -35 -43 -114 85 -111 81 -151 -162 -138 -70 29 245 -212 -25 9 -84 31 132 304 -45 7 10 -146
6490 -146 15 -150 -20 9 -27 -56 50 19 -229 17 26 166 -11 199 -38 -339 -68 140 242 222 41 -6 -127
6513 -127 119 145 127 88 -88 18 -10 148 -29 -5 109 -86 -22 5 -169 -45 -289 -39 -248 -85 -24 -138 -147
6536 -147 -290 44 182 -5 27 0 65 -13 114 -86 -26 49 -99 -97 38 -74 89 24 127 77 84 -53 39 -62
6560 -62 -20 -181 -20 -48 28 -83 121 1 42 3 -119 51 -60 67 -133 -220 -81 -163 15 111 63 224 20
6583 20 76 -85 -87 161 268 24 143 71 13 148 140 67 -61 -140 -141 -143 159 -69 -212 101 2 -145 -91 86 153 73
6609 73 135 16 80 239 165 -51 132 -132 316 42 -17 124 -11 166 -43 20 -23 181 -212 265 -22 -155
6631 -155 -3 192 123 -74 -27 131 -119 141 -27 -44 172 347 -8 -12 5 -83 18 70 33 98 322 -309 -90
6654 -90 96 110 17 149 295 -252 67 -353 -78 -210 -138 -372 -20 -4 46 1 269 -87 287 215 129 -251 117
6677 117 194 267 -143 -165 146 -76 140 3 50 77 209 -96 -267 -78 -13 178 58 -139 -31 -89 -254 72
6699 72 375 126 -19 85 -184 70 106 -10 61 14 273 -103 -1 33 -97 -17 134 -181 68 -268 -392 -13
6721 -13 96 -58 -5 -49 -62 -133 18 130 -310 -34 57 -316 -97 -232 -124 -80 97 21 143 184 -58 -269 65
6744 65 -31 -155 133 103 310 129 -53 219 -272 -10 -10 -165 127 -106 -21 -249 -143 -18 59 77 -57 -216 -215
6767 -215 177 -174 -18 -34 162 -266 -145 150 -293 -109 162 -170 -35 26 72 151 -55 3 97 -73 47 -156
6789 -156 27 -7 -100 -172 60 -214 41 250 -184 -134 96 -136 34 -150 -82 57 171 -88 -37 -156 145 -149
6811 -149 -154 19 44 -218 -25 246 -50 147 169 119 34 -357 108 -122 -83 -14 40 70 53 184 47 85 119 -3
6835 -3 131 131 193 228 -67 -138 -86 18 61 -95 149 -226 212 -78 96 -228 186 -86 125 101 4 167 -90 44
6859 44 144 -66 6 184 267 -107 150 48 -29 -85 -67 -243 -55 165 167 -216 133 -186 80 -76 -10 -40 67
6882 67 -67 -263 -66 -208 56 32 196 -245 -85 39 -34 -28 195 57 231 -86 -167 -61 -177 -23 -196 -37
6904 -37 -40 124 16 -25 2 26 -14 -83 -4 259 -217 -55 176 50 87 74 59 97 -31 110 -112 33 -7 334 -18
6929 -18 -134 -91 -92 36 -427 141 -159 -42 95 4 -265 39 -99 145 12 -112 74 16 -127 -211 120 164 230
6952 230 123 30 -111 -309 -104 -97 347 13 -165 -4 69 72 18 176 -110 -5 169 35 159 -333 -242 226 140
6975 140 128 59 165 264 -64 -225 199 146 -43 245 -124 135 127 -154 -177 87 -99 2 33 -151 -36 -153 -156
6998 -156 27 183 -366 -256 -282 -246 133 78 21 -43 -97 -161 -61 323 -37 -195 -105 30 245 176 -16 61 -118
7021 -118 -50 28 69 -145 -251 -72 207 47 -78 -6 81 73 66 98 -188 186 214 -19 31 59 -103 109 189 -86 61
7046 61 135 -95 182 15 -119 41 95 -13 239 119 -35 115 -167 145 34 127 26 -22 130 126 -68 81
7068 81 91 9 379 40 -129 120 325 -87 -90 -192 111 73 111 -249 84 200 151 258 -53 -95 78 -14 48 -164
7092 -164 -328 122 210 -96 -209 -17 131 -339 -257 64 38 184 2 54 -230 102 141 -207 -117 -12 1 -24 -25
7115 -25 -20 128 -83 -71 202 39 -10 110 -128 143 165 -47 -64 -33 -158 -157 -131 64 27 238 -174 50 -137 76
7139 76 -212 82 149 62 -227 33 213 218 -244 -104 123 153 -4 125 -164 -409 136 118 -181 -108 -257 56 -81
7162 -81 -43 30 -120 4 -291 364 -58 -113 -13 28 13 16 277 5 394 -90 -160 -139 23 59 221 206 -3 124
7186 124 -450 -15 -230 -129 -131 0 20 -221 -88 44 -139 125 -149 79 145 -208 99 -132 229 -139 -379
7207 -379 145 -97 92 122 104 32 -10 -150 211 318 -4 41 -77 -16 3 -248 -112 -189 81 -19 169 -92 -30
7230 -30 -129 -58 163 -200 -79 137 -265 124 102 -15 -371 251 -119 -178 185 156 -10 1 -118 -58 -365 57 217
7253 217 -69 58 -350 -60 -132 163 2 -160 -187 152 48 103 -105 33 -12 161 385 93 -47 134 340
7274 340 83 -54 90 -23 151 5 150 119 85 157 64 41 -113 -114 36 44 70 41 170 221 -23 124 -31 -61
7298 -61 -195 42 -144 94 163 -13 443 7 -35 75 -92 -188 58 -9 -4 44 -50 8 36 152 -11 19 -157 -446
7322 -446 8 446 118 -97 58 77 -124 98 -14 -255 -85 184 194 30 -22 -36 -54 14 75 -35 114 -46
7344 -46 86 261 117 -69 115 -184 253 249 379 -16 76 98 -30 73 32 32 189 75 -129 -71 -85 -170 38 117
7368 117 -110 -30 -82 278 199 70 117 -43 13 -32 58 -36 194 -75 -9 -261 118 -128 75 -143 -45 115 -178
7391 -178 122 -189 67 -34 -8 87 -36 -149 -27 110 79 -23 -112 -163 -327 -33 -174 -47 -8 -60 210 -15
7413 -15 -28 269 41 124 149 16 168 -28 -264 69 114 -39 -115 -159 -146 22 51 -104 -13 -99 23 75 154 -285
7437 -285 -18 112 -105 129 282 -155 92 -136 -370 -298 39 1 -198 -106 20 66 41 -66 -64 -38 34 -50 217
7460 217 -366 -144 -11 152 134 -138 78 -49 242 20 -193 28 45 -143 122 31 -116 -90 -261 28 -87
7481 -87 -31 -139 168 -118 43 -5 -91 198 32 -47 122 36 -250 -78 -50 276 -55 -187 -302 244 41 -122
7503 -122 -89 34 101 -78 129 132 -17 -206 41 61 -134 210 68 130 -71 -109 -138 298 -187 163 112 -337 -64
7526 -64 47 101 -181 -28 -77 -28 71 -160 -33 108 -142 -33 41 35 186 -12 18 -11 -63 -134 162 321 -25 -107
7550 -107 -116 -28 -127 -135 -280 116 -81 72 33 -3 -243 -183 106 -116 -25 -94 -204 -2 348 48 -275 38 159 -261
7574 -261 74 12 25 -97 -21 -167 -175 52 -378 -45 217 -17 -3 -40 11 105 370 260 -1 60 -25 -312 -215 -91
7598 -91 26 25 -97 -162 233 105 -156 17 32 -98 -67 180 163 79 -22 360 -83 -95 119 -13 118 -86 -70
7621 -70 48 68 -58 223 -14 -103 -74 51 324 -105 -91 113 -28 90 -275 -298 -111 134 -232 176 -19 -215
7643 -215 119 -377 -149 102 -16 -220 -87 161 -181 -13 -42 -17 -207 -85 -99 -324 -67 -55 -184 133 -29
7664 -29 -155 113 -119 -203 277 16 -145 106 69 -16 -101 -156 10 -175 0 80 44 43 100 104 169 -56 -45 67 -8
7689 -8 163 48 149 156 135 113 240 -162 101 -156 -177 96 -274 51 -17 132 -98 395 41 -111 -162 -152 322
7712 322 155 212 -101 73 -9 87 -109 3 -8 -167 100 -246 -171 57 55 -88 -74 42 7 -268 13 -14 59 -350
7736 -350 -124 -71 75 -193 -300 -120 81 -163 -153 157 -121 164 160 37 20 -268 205 239 -243 -138 -22 -104
7758 -104 58 -112 22 -63 319 -103 -175 -88 5 36 21 -110 -24 -219 -151 63 -63 103 -134 -7 70 227 -125
7781 -125 -30 -110 187 38 167 -141 -116 60 200 19 -80 -58 163 97 -143 -38 -231 -40 -329 -37 311 -95
7803 -95 -122 33 246 -35 -28 186 -176 -125 -16 36 129 -50 190 -62 153 -86 -248 -83 157 54 21 167 191
7826 191 -73 -55 -156 6 215 -63 -149 -67 -104 -29 -20 -104 197 211 -57 -88 4 95 -233 -38 -158 139 -388 -328
7850 -328 -31 82 -1 187 -74 100 -33 24 -234 -144 -43 -349 38 -209 -24 205 196 -84 -250 -240 -130 38
7872 38 -177 -109 69 270 123 10 168 -46 23 -273 46 -262 77 -211 -25 -207 258 -171 66 -89 -74
7893 -74 208 154 -46 -36 -444 257 -22 -133 128 -108 26 -225 -181 -358 49 75 -267 -121 181 187 -366 -26
7915 -26 -8 -310 -151 15 -256 167 132 204 -146 -14 114 -5 -2 8 -25 -89 69 229 -51 -34 81 -37 -70 -308
7939 -308 -152 -197 -196 210 5 179 -29 -12 156 161 171 157 -40 51 11 -126 -136 0 113 -10 220 88 -46 149
7963 149 14 91 82 -68 -43 31 -115 -33 192 17 43 99 -78 54 24 -259 295 -302 105 282 90 171 -220
7986 -220 130 142 18 123 2 20 -166 144 8 60 20 -111 255 -1 -64 -11 26 23 -22 -12 37 -46 16 72 -378
8011 -378 -14 -240 -46 -18 134 -144 -279 -80 226 -121 36 -71 -40 -18 -88 -66 -174 0 -307 -37 -213 -32
8033 -32 260 177 -125 -88 -180 -182 211 107 126 112 34 103 83 -87 45 -125 -154 50 131 158 -106 -357 149 96 267
8058 267 -99 -388 -123 226 270 -117 98 -21 -122 33 236 235 51 -39 40 -151 68 -17 114 161 -166 91
8080 91 63 82 118 8 82 233 -2 -95 -133 157 -150 -11 -267 57 61 -227 -106 -241 92 41 129 95 314 284
8104 284 -248 -13 26 145 210 -148 239 171 -75 271 -176 -155 -7 142 176 151 -155 -31 -53 -6 -260 -9 7
8127 7 202 116 38 38 45 -300 51 126 206 107 154 206 307 -41 -182 153 -68 194 -104 -210 -139 79 39 -84 -48
8152 -48 120 -23 165 106 -33 -57 134 84 -115 91 243 155 177 -225 -11 65 -68 168 52 -279 55 -131
8174 -131 7 162 -270 241 106 90 51 197 -438 -10 60 -5 35 84 -337 -165 -219
8191b19
$$ Imaginary data points
##PAGE= N=2
##DATA TABLE= (X++(I..I)), XYDATA
0 0 0 0 0 0 0 0 0 0 0 0 0 0 0 -8 8 -8 8 -8 16 -16 16 -24 24 -32 39 -43 48 -56 67 -78 88 -102 115 -131 147
35 147 -164 186 -209 233 -259 289 -320 356 -392 436 -481 532 -586 644 -710 782 -863 950
53 950 -1050 1160 -1284 1426 -1587 1776 -1998 2264 -2592 3004 -3541 4275 -5342 7048 -10218
68 -10218 18148 -86210 -92171 37887 34957 106942 131176 44377 -38530 -29305 -72660 -97480
80 -97480 -32336 17217 2363 51293 93250 43663 2167 8944 -48805 -102356 -57476 -5518
92 -5518 3598 59226 102351 49813 -8019 -17614 -55624 -83341 -32328 14439 12671 38716 63464
105 63464 26762 -4673 1644 -26534 -59540 -33784 -6666 -7490 26758 65270 41202 7254 -975
118 -975 -33133 -63611 -35786 404 8172 31258 51102 24778 -3238 -3929 -21183 -40645 -21216
131 -21216 -1660 -3033 13610 36351 24905 8454 7073 -12546 -37935 -28610 -10802 -4487 15268
144 15268 36957 27306 8806 1517 -15348 -32015 -23010 -8027 -2871 12329 28301 21813 9406
157 9406 5125 -10189 -27519 -22972 -10404 -4323 10071 26156 23049 11045 2983 -11176 -24590
170 -24590 -20720 -9317 -2674 9546 21188 18233 8866 3482 -7536 -19081 -17032 -9927 -4532 6282
184 6282 17825 17339 10350 4261 -5888 -16895 -16702 -10484 -3743 6497 15519 15582 9864 3480 -6028
199 -6028 -14636 -14159 -8924 -3685 5271 13581 13611 8853 2775 -5446 -12233 -12858 -8012 -2434 4932 11279
215 11279 11343 7170 2587 -4318 -10036 -9908 -6743 -2607 3332 8442 9277 6651 3144 -2440 -7674 -8758
231 -8758 -6737 -3191 2343 7181 8345 6640 2938 -2280 -6501 -7768 -6304 -2989 1935 6239 6632
246 6632 5744 2715 -1464 -5332 -6303 -5700 -2572 1207 4745 5828 4725 2672 -911 -4475 -5781 -4594
262 -4594 -2431 1054 3929 5245 4750 2729 -503 -3337 -4603 -4329 -2962 277 2858 4555 4234 2881
278 2881 69 -2692 -4757 -4504 -2563 168 2735 4125 4534 2922 224 -2797 -4027 -4034 -2564 106
294 106 2814 4028 3889 2424 -190 -2086 -3529 -3760 -2226 -41 1951 3060 3377 2138 107 -1839
310 -1839 -2902 -3298 -1988 -209 1580 2891 2904 2073 434 -1348 -2853 -2594 -2026 -233 1342 2648 2985
327 2985 2009 197 -1555 -2447 -2751 -2250 -367 1172 2242 2271 1461 340 -1218 -1831 -2380 -1445 -320 1100
345 1100 2051 2147 1571 283 -1063 -1658 -1639 -1085 -175 786 1499 1853 1138 460 -475 -1639 -1713 -1100 -142 494
365 494 1347 1554 1273 537 -614 -1119 -1735 -1055 -313 642 1032 1349 1334 323 -600 -1187 -1186 -996 -450 504 967
386 967 1101 955 145 -430 -796 -1100 -1106 -187 439 848 1127 687 188 -419 -581 -1028 -816 -402 377 305 899
407 899 754 393 -77 -603 -836 -926 -215 125 436 809 897 355 -299 -694 -966 -948 -162 66 570 711 733 213
429 213 -381 -752 -702 -532 -103 217 616 416 662 233 -201 -573 -386 -704 -290 9 521 711 267 203 -204
450 -204 -327 -778 -360 -374 155 502 628 678 376 -105 -314 -656 -430 -425 243 212 482 222 105 -281 -394 -585
472 -585 -551 188 -29 123 560 538 45 -34 -413 -436 -330 -245 267 118 203 446 -82 -127 -144 -404 -252 -163 209
495 209 432 498 295 241 -192 -114 -395 -518 -39 -190 145 284 387 215 -7 -238 -215 -645 -194 99 256 242
517 242 290 116 -228 -553 -556 -289 -191 27 190 256 358 -134 -299 -370 -206 -31 -117 -168 438 311 548 273 -324
540 -324 -383 -467 -145 149 182 211 321 132 19 -42 56 -225 -271 -265 -8 380 208 180 127 174 -230 -323 -178 128 238
565 238 297 286 335 40 -68 -86 -197 -117 -100 -31 -124 381 519 409 25 47 -57 -9 -272 -20 -131 234 198 282
589 282 162 -224 -316 -143 -63 133 433 301 164 -154 -56 -186 -174 -198 -174 -35 195 273 -40 241 30 -449 79
612 79 -114 -149 124 88 59 293 73 -188 -119 -464 -135 -262 28 -57 107 145 104 18 44 -106 -178 45 157 219
636 219 203 307 275 -83 -36 -293 -110 110 -86 21 137 164 -24 302 -89 -44 -184 -82 -125 87 182 -15 108
659 108 115 134 3 -154 -150 78 15 311 158 -79 -113 -181 -141 -308 43 30 43 -100 -8 147 -307 -279 -137 -228 90
684 90 168 -47 156 -194 -83 -163 68 -136 -226 -119 -102 168 -87 195 137 -172 -330 -168 -167 82 63 74 277 -252
708 -252 -188 125 -85 30 -206 -187 91 -136 -88 -17 -94 -49 64 -316 189 -299 -334 23 1 164 34 241 6
731 6 -172 -228 329 -78 219 122 -210 -47 -176 11 -48 -169 -54 56 -141 26 223 113 -56 149 216 103
753 103 19 105 -43 111 102 246 50 -25 -61 -296 -114 234 259 -248 150 -142 -170 94 68 -131 -36 50 -125 -62
777 -62 58 -148 51 -213 3 -142 176 -32 -75 40 125 -176 -71 111 -76 43 -190 58 255 131 -76
798 -76 261 223 -299 -269 -7 48 224 341 140 109 -36 10 -193 90 14 -9 -154 89 203 20 150 -104 -252
821 -252 151 -76 159 140 218 107 58 89 195 52 30 -121 -262 88 158 -21 93 -8 132 -230 -72 -91 59
844 59 268 -2 97 -224 131 183 149 -85 3 -267 30 -32 -65 56 47 -167 227 79 131 9 72 125 267 67
868 67 -66 -29 94 -96 -67 -41 -182 159 -48 118 80 -128 156 -110 -37 37 111 200 -359 144 -98 107 -25
891 -25 -174 4 51 -73 125 -388 -184 -137 -35 -31 -265 -158 52 34 -60 81 -43 92 70 -164 122 -7 -21
914 -21 55 -298 -204 -86 -43 -159 31 -188 48 243 -83 256 86 -166 -14 -168 -63 43 43 240 -99 -28 -64
937 -64 -145 -11 -153 157 75 71 183 -297 91 -66 -63 61 125 217 4 29 -204 27 76 81 148 90 200 198 351 56
963 56 114 -194 -169 13 42 -148 -143 -104 269 -39 -73 -100 197 -6 197 18 157 -132 -214 -54 -212 -160 -14 95
987 95 35 248 -164 274 57 155 -12 -171 -39 -21 56 154 3 -85 171 -24 -75 -370 -162 53 61 27 -260 -328
1011 -328 -28 24 60 120 112 71 -50 -148 93 99 -160 -68 -160 33 50 -122 143 289 155 87 177 168 -266 214 181 38
1037 38 88 266 66 162 -107 -171 111 170 32 -251 -111 -36 -91 54 144 230 35 73 -229 -212 -189 278 242 -142
1061 -142 -123 160 -83 -118 -49 56 236 351 -245 -48 -21 58 -274 -52 53 -134 -51 23 9 210 -140 62 74
1084 74 74 -52 323 102 -11 183 55 -125 -280 -15 194 -242 -166 -8 -8 -120 -145 -230 19 262 217 165 197 122
1108 122 219 98 -61 87 -98 4 -76 101 -137 35 -142 -97 176 -228 -127 24 131 55 159 -313 140
1129 140 -134 -129 -26 -48 -83 69 -66 115 121 -105 -38 -217 -2 25 120 -127 -96 -16 -66 -114 232 143 -35 110 306
1154 306 -98 -115 -126 1 -21 -120 226 -82 57 29 32 -24 -147 173 89 -16 -68 -35 -104 174 -164 -86 -46 208 150
1179 150 185 76 -302 -145 114 59 -37 -120 23 -209 -1 -51 -182 -153 365 193 57 114 317 49 -41 -156 158
1202 158 186 133 73 -158 -70 308 -52 -88 -155 73 -34 -214 200 68 -361 53 257 -121 35 -29 -141 106
1224 106 -19 128 -116 55 -12 28 -94 300 -149 231 -6 11 78 -21 -103 63 56 -34 -72 63 -59 351 81
1247 81 164 46 -95 41 18 79 26 101 128 -70 311 76 123 -64 -165 71 72 -321 -119 -166 -159 152 33 -175
1271 -175 -11 89 48 -12 38 -27 -7 29 137 -212 167 -467 -81 84 -41 -129 -81 -116 -302 -183 -48 -47 61 2
1295 2 -39 131 -165 -72 -104 70 -8 -117 284 -65 -218 -14 82 -60 -64 -121 34 222 195 -230 -140 -33 -336 208
1319 208 255 47 -140 -140 91 -20 -140 -156 50 210 82 81 -41 375 112 -65 192 -9 216 -38 -227 -97
1341 -97 -261 58 195 -36 -174 -9 26 -156 -6 -51 100 38 186 -86 -56 178 -44 -16 70 -1 -112 67 130
1364 130 -247 -101 119 -24 54 56 -131 -103 57 -271 -247 7 -133 245 144 -196 189 -43 -81 148 -28 61
1386 61 -197 223 71 124 56 53 -1 296 161 101 49 -60 -235 -60 -35 175 40 -91 151 -5 -14 56 -49 124
1410 124 16 -78 -68 48 94 -41 220 -23 -93 99 -99 -46 67 118 -212 117 -167 -172 -277 -8 -13 -10 -41 16 -126
1435 -126 137 17 15 27 -54 47 253 -172 -6 89 61 -119 -39 62 77 -20 171 18 76 -12 -273 -82 -80 53
1459 53 246 294 146 0 87 108 -85 268 274 -73 309 30 113 92 -314 -20 -39 -173 -102 10 21 -109 58 -70
1483 -70 16 91 -158 -49 -47 1 89 37 -28 -14 -26 -142 -12 85 -62 -74 27 -107 142 -75 417 164 59 -130
1507 -130 65 139 -33 -25 123 161 -131 -4 89 -67 -149 -54 20 140 -183 -391 275 67 94 -249 148 -149 -94
1530 -94 21 -31 179 -78 202 -21 129 -140 -40 60 91 53 -135 23 212 -253 -428 305 -78 157 159 -114
1552 -114 55 2 -66 10 49 39 319 106 189 9 -100 -272 -67 195 29 29 308 -185 -275 108 -73 -51 -17 -95
1576 -95 -155 -248 98 -106 70 77 -5 81 -218 59 106 -32 63 -57 -62 25 -83 194 -273 9 31 -22 -215 124 197
1601 197 -162 82 -128 -58 41 -33 -53 17 -76 39 5 77 -108 -137 -227 -114 -27 86 199 -42 177 43 100 55
1625 55 -33 -274 109 23 -194 -49 -68 -170 -41 101 197 7 9 -13 187 -85 -41 106 -140 27 76 32 114 315
1649 315 -178 4 -30 -88 -123 81 -136 -110 -74 178 -200 -55 -18 90 15 -137 106 -53 -214 103 -159 85
1671 85 65 -70 205 -118 138 -238 361 -18 -29 -94 -77 -74 -70 158 -72 68 -63 -28 -173 113 181 -50 65 84
1695 84 155 16 13 13 133 -100 -131 87 -131 -60 173 -89 64 14 31 89 98 259 -37 112 -114 22 -130 63
1719 63 89 -31 -121 -80 -52 -1 243 108 -80 -94 105 99 240 -29 -21 -81 172 143 109 -23 -175 -70 22 80 68 -88
1745 -88 250 49 207 -90 24 -66 69 -10 -32 -102 43 -70 -260 -233 125 77 236 -70 253 103 75 185 -254
1768 -254 -117 25 105 -67 -94 42 206 6 -30 11 -133 -250 303 101 76 -176 1 2 -342 131 -39 -52 149
1791 149 -132 -96 -14 91 131 104 77 -188 138 100 70 -78 -138 -103 175 19 -114 29 66 31 -413 239 225 -94
1815 -94 34 66 128 278 -35 52 -126 -6 -176 -198 198 26 1 -197 159 129 -349 173 167 -48 55 213 198
1838 198 -94 146 83 -28 66 -256 -27 -220 -59 145 150 -239 289 140 139 14 -152 -168 -71 -121 -357 -47 284
1861 284 64 -113 -250 -123 129 76 70 -47 -144 271 -25 231 -212 111 49 134 90 -139 -192 -34 19 380 -20
1884 -20 -222 18 -93 -9 112 -8 -286 -177 60 -10 -153 -132 -6 7 38 -91 -88 -68 72 31 -119 20 75 -31
1908 -31 104 110 8 -71 -100 -254 101 -225 -22 35 -434 128 -107 -194 -91 190 -63 -311 -116 -45 -85 3 33 -12
1932 -12 79 112 -134 -74 -43 -20 26 36 -49 21 6 21 -45 -25 -72 -58 -20 -37 -64 212 203 64 -79 167 64 104 -221
1959 -221 -125 -189 -71 73 12 -101 25 -8 -79 34 -77 143 -28 -115 -109 -104 95 69 22 -172 -97 -238 24 -152
1983 -152 -124 87 -139 261 -104 28 -316 -109 -36 -182 29 -231 212 3 164 -88 -175 228 0 143 -54
2004 -54 -96 222 -118 -213 -14 -195 23 -96 31 -92 19 -30 44 15 156 -201 -13 -97 -22 194 123 42 -151
2027 -151 51 296 47 101 79 217 142 174 196 123 87 -426 82 146 200 83 19 33 -61 23 10 -204 226 67 235
2052 235 141 -148 -146 -217 -47 134 160 71 181 -120 -66 156 -107 -177 -79 124 -90 -24 34 -238 -98 168 -49 55
2076 55 -49 -235 -16 -6 -296 -69 47 -12 -50 176 -117 35 126 144 28 -96 97 52 159 114 57 -101 -138
2099 -138 -174 -106 14 -169 66 -52 -87 13 -92 118 98 -63 30 -103 -99 229 -27 16 -199 -121 -85 -70 -93 -105
2123 -105 9 -172 41 78 -20 -87 77 196 -43 127 133 256 -101 55 55 213 66 55 100 43 -219 110 -123
2146 -123 -40 105 -156 -5 -17 -187 -79 -337 -36 -50 -104 81 -47 205 -11 43 -57 -145 -51 -109 -71 -20 109
2169 109 -79 43 -176 167 -100 245 315 53 6 -72 -80 -31 -1 67 -156 -101 31 7 179 -59 -74 54 -83 -330
2193 -330 -53 -24 132 -178 38 -37 61 -119 -150 95 24 11 315 100 -220 -161 76 57 106 89 -5 83 -218 98
2217 98 303 -307 79 316 -155 -42 11 -10 9 -120 -150 -34 -152 52 36 78 -97 143 13 35 301 -45 111
2240 111 -148 -36 49 -195 -142 51 -18 -3 -41 -122 80 31 -105 -179 -189 114 102 -87 -160 -216 241 119 -47 -48 266
2265 266 -116 21 184 -125 -247 -103 -35 -211 -19 -57 204 -97 -86 92 -336 347 -47 -43 -135 84 70 -263
2287 -263 -2 6 155 156 273 -199 112 235 -334 -42 -221 -256 105 -319 123 -14 9 -33 -103 111 43 -205 137
2310 137 65 -167 305 -81 331 16 -167 -185 123 49 48 -94 75 154 182 125 -65 -257 -382 -183 -210 123 -375
2333 -375 -413 -97 116 -78 216 103 -29 -68 191 106 27 235 59 -319 78 -164 288 -11 216 86 87 -193
2355 -193 -160 115 -230 -125 -31 -20 144 154 -125 169 48 81 -89 65 210 -46 -296 -103 -167 39 23 47 96
2378 96 84 -121 223 193 200 78 -216 35 135 -144 -98 124 32 85 175 -310 -105 -3 37 -36 232 25 9 28
2402 28 -140 313 -105 57 -7 56 32 21 103 83 112 224 -117 -283 -94 -264 -107 -52 49 -59 -335 -54 210
2425 210 -51 -365 77 -91 105 -158 -28 -74 90 97 90 228 -143 -54 197 97 133 -143 240 -181 204 79
2447 79 28 55 -137 123 140 -138 -120 120 -40 113 128 -100 -215 -204 206 214 -192 -62 -106 241 71 -138 -79 -40
2471 -40 269 19 -167 208 -40 16 -22 -260 -26 -111 224 -187 98 197 -275 74 225 17 -172 119 171 -57
2493 -57 219 -484 216 -27 128 103 1 -50 192 150 -68 279 -158 237 360 -98 13 13 203 -133 -21 91
2515 91 -96 197 61 51 33 435 185 -169 -409 34 288 -87 21 131 -31 19 35 -27 301 309 9 83 99
2538 99 105 -174 6 -116 215 180 43 -135 104 -96 47 191 174 112 -27 30 149 70 1 -128 90 100 109 30
2562 30 -158 -34 -98 23 36 303 98 53 -56 -244 -27 -45 152 -54 -46 -106 -180 -185 207 -136 -155 5 328 178
2586 178 -12 321 148 170 55 -123 65 289 92 -40 -105 78 117 -33 -240 46 -64 48 -50 11 -15 -25
2608 -25 -115 -184 178 -1 -27 176 125 84 -95 -87 133 -255 56 -107 63 87 126 267 -142 -193 255 68 -172 -78
2632 -78 -166 -10 173 27 -107 28 279 115 -86 139 285 -50 -189 -387 -201 -25 -19 -32 217 10 -14 42
2654 42 -343 -62 -255 57 -37 23 -168 28 -89 -107 12 -116 109 -362 -110 164 48 170 -89 -207 61
2675 61 62 244 -28 174 -48 -68 -9 9 163 30 34 0 -149 72 -189 -31 40 -59 129 -175 152 -3 185 -100
2699 -100 105 150 -4 121 115 -121 179 -27 -311 -192 -75 -46 -200 -57 147 20 -200 49 -23 257 151 38
2721 38 -41 -182 191 85 65 137 135 -29 4 154 -87 153 -85 -172 -53 62 -8 93 144 -1 -64 51 -46 -26
2745 -26 235 164 -66 157 -194 -31 77 40 -70 -124 322 77 131 -14 -33 93 223 -19 453 166 -24 -90
2767 -90 -99 61 -81 128 -159 -126 -81 90 -82 -260 -59 142 -7 200 -128 -53 108 -84 19 -5 43 -4 -36
2790 -36 -56 251 50 -101 60 91 -99 -158 40 -98 124 275 -104 -345 -1 38 -90 -374 -183 -41 -209 -95
2812 -95 25 -24 -102 1 9 16 -85 32 172 -142 -23 258 -210 79 31 293 -151 -182 -34 -195 -125 312 16
2835 16 -65 227 39 164 69 -33 -46 -220 -74 53 -65 -7 -43 -24 -39 98 -131 -54 -8 -91 -212 80 183 17
2859 17 137 42 26 -42 39 140 -40 101 28 -82 -165 146 42 -60 -74 -196 126 283 -110 142 44 144 -198
2882 -198 -93 130 65 184 38 -42 -175 -108 -8 -92 -225 51 -112 239 78 350 -242 233 44 39 20 45 26
2905 26 83 -221 -63 -118 -44 155 -137 -161 262 -96 129 163 19 -152 22 -22 -41 -143 331 -22 -170 25 122
2928 122 -87 108 -298 -79 -55 -189 -181 124 -322 108 -18 -24 7 127 111 36 244 2 -135 -338 35 111 -17
2951 -17 -247 -81 122 108 52 81 83 -85 121 -226 302 -101 -271 -67 -238 92 260 -166 145 5 -180 150
2973 150 -52 -114 -103 72 -295 -48 95 -126 -209 -153 1 290 252 -47 -259 -209 122 268 -30 171 186 -370
2995 -370 67 122 -202 28 -38 87 -86 -65 -94 125 -21 131 -27 154 -101 -85 -61 -280 -109 48 117 61 -137
3018 -137 -63 -134 -113 10 83 -138 41 -100 -12 53 206 -1 31 230 121 -30 -21 -18 -77 -15 -316 -17 -124 -48 -100
3043 -100 7 119 265 -31 17 225 -78 24 59 242 -66 -71 -6 103 -100 -170 -183 61 -396 236 -62 74
3065 74 -175 -173 68 227 21 -92 -65 156 127 -202 -135 -67 195 -74 109 197 -14 -46 -64 -85 -44 9 -297 18
3089 18 184 75 -92 35 -68 -109 -50 132 -17 133 -123 82 206 291 214 -39 306 -160 -142 -70 220 64
3111 64 55 39 -203 -80 44 -245 60 7 -44 251 136 -294 92 -39 -12 82 116 136 9 -116 13 -74 -23 -169
3135 -169 -38 26 21 -97 351 -141 -84 -68 -433 -57 36 -310 -18 -319 -45 -155 -63 -23 -46 -17 -111 -24 23 -93
3159 -93 93 -21 -108 -109 204 234 23 5 -43 73 300 170 152 110 -115 279 24 77 -329 25 175 -206 -320
3182 -320 -58 78 17 -108 55 -50 51 -81 -60 212 -130 -235 119 113 -88 162 -37 133 74 -4 -86 87
3204 87 100 61 32 -120 -223 -99 -118 -59 31 -6 -65 -37 -17 171 -50 191 -202 -66 6 -125 189 82 -47 249
3228 249 -4 117 -97 47 -173 118 66 -28 -30 159 -37 12 -66 -172 -32 24 -57 -104 83 -92 -22 207 -18
3251 -18 229 -5 -97 41 -94 -28 36 335 -36 17 -31 38 38 -97 267 264 84 -224 38 139 -275 77 99 93 58
3276 58 -265 -8 -58 -63 230 -136 312 234 -243 -293 -91 -222 187 167 75 151 67 -362 -95 -48 -194 23 -284 226
3300 226 27 236 133 154 103 -46 217 -85 -148 -101 303 51 2 178 -85 -239 56 163 144 141 -17 194 -162
3323 -162 8 108 102 110 -220 -48 138 -59 -1 45 12 36 8 316 -149 173 -162 200 237 -165 80 -22 -83 -31
3347 -31 2 -118 -130 -85 -6 226 26 343 -63 -15 -117 202 -135 -250 77 203 -15 89 -31 -42 54 25 -339
3370 -339 -192 171 55 -3 -21 49 88 -182 44 74 39 10 -46 -51 147 57 101 48 16 119 130 16 -72 -123 34 318
3396 318 61 25 -21 96 194 50 -37 96 212 205 -228 240 -113 -92 97 21 61 -137 29 -120 -57 -80 39 -240
3420 -240 42 -27 -149 -135 148 28 -203 3 91 -38 -242 -60 177 -176 -17 187 -190 171 -146 -101 196
3441 196 -103 -56 -165 -9 37 374 123 154 5 -152 -129 -150 140 -1 -157 -221 -118 101 179 219 31 -313 -153
3464 -153 69 -176 48 -57 -2 -73 -185 -67 -109 133 -34 237 269 30 -106 -35 25 -92 26 -85 62 -75
3486 -75 -159 133 200 -16 -243 33 -108 63 -152 -43 -43 -241 75 -158 69 -6 49 -166 -78 -159 10 -158 103
3509 103 -40 146 209 23 113 298 23 -6 -149 152 126 443 51 -146 -24 93 74 76 26 -128 -46 -179 106
3532 106 -125 111 77 -118 -23 52 24 -27 -293 -50 316 -54 -142 63 -182 205 111 -221 -87 12 -27 -21 196 78
3556 78 -231 -13 -26 -129 273 -182 109 64 -39 31 -159 7 90 200 150 94 -294 1 -11 42 -18 181 -250
3579 -250 -216 -440 30 -27 177 94 -179 -138 -25 109 -176 222 191 -154 22 35 22 229 -172 42 53 5 62
3602 62 95 -133 -75 -285 182 -54 -116 104 147 201 154 -435 13 86 124 -21 -14 -206 252 123 -14 -285 74 207
3626 207 171 296 -313 -249 -96 228 -70 -30 13 34 107 -105 9 -89 -203 -44 -16 157 -146 -91 -279 -81 55
3649 55 -184 170 -22 -238 79 168 128 214 -69 -294 314 -2 -420 363 -94 178 19 86 -50 -52 120 -77
3671 -77 -82 -179 140 -18 -54 -346 62 -48 48 -273 254 48 97 5 -30 -202 164 15 144 208 -57 131 41 176
3695 176 -215 -40 0 -64 25 -77 190 201 45 -111 -4 -153 348 -81 -98 404 -30 -8 -402 20 -352 -126
3717 -126 -49 -67 195 -46 -278 59 199 -38 -82 47 17 193 140 -199 -56 125 19 200 -113 -225 198 92
3739 92 -43 37 -51 44 -174 170 53 30 9 50 41 -34 254 207 -3 276 38 7 -229 149 3 222 -58 -155
3763 -155 -163 -168 -24 44 107 219 35 -15 72 -31 -320 85 -62 -160 89 131 9 -55 -7 -71 -34 265 20 -161 -16
3788 -16 -92 -93 72 -19 158 2 -69 155 24 -48 39 197 -31 -82 186 -110 -94 -65 -119 268 -243 -73 11 -37 80
3813 80 27 301 191 95 88 -7 259 -79 4 187 -75 78 -63 8 0 -219 -9 199 -111 52 6 -232 -60 74
3837 74 106 7 -127 158 36 89 181 193 312 -24 197 298 -24 63 -313 -190 -53 -218 218 28 146 -276
3859 -276 160 62 -136 -111 123 203 10 -132 79 3 233 1 -15 -313 -119 -106 -133 8 19 267 168 336 190
3882 190 -101 -95 109 96 58 112 -208 -225 -207 145 -198 -219 67 171 136 -64 115 -25 -115 88 21 121 116 1
3906 1 293 -88 8 128 142 -122 63 293 -313 302 226 -102 36 87 -53 23 245 -93 238 125 -56 48
3928 48 -42 218 15 164 -123 -2 -189 -7 58 -146 -220 -431 -124 144 17 7 71 -167 65 -261 14 88
3950 88 248 -68 144 -26 -183 164 -19 124 13 157 -235 -494 -57 -164 37 -83 -146 -14 -53 200 78
3971 78 -52 -10 -12 37 -251 -92 107 291 200 111 173 83 -158 110 -7 74 -15 220 -12 -30 191 74 -121 -22
3995 -22 -28 -21 120 -27 20 46 -99 -70 -87 24 -28 -19 213 7 86 -121 2 37 154 56 57 20 237 -11 -82 -31 -233
4022 -233 -1 -218 36 -413 -67 46 241 51 10 -48 -294 273 -159 61 -23 17 267 187 -21 65 -77 117
4044 117 160 -40 -42 -155 -218 -16 -68 -139 -55 -20 37 -27 -16 213 179 206 -162 -80 -57 -19 96 23 42 237 -296 158
4070 158 -161 -98 -47 -194 -24 -50 -9 -178 -231 -276 -12 8 83 78 -42 68 -2 -55 135 -24 31 114 159 101 -16
4095 -16 46 75 191 -39 -257 -212 67 -32 -16 -94 -37 327 216 -186 -220 31 -248 -162 86 69 179 -178 121 -122
4119 -122 -126 60 -147 248 -198 -55 -135 83 40 -47 -27 -27 50 -73 39 -70 -144 -138 -210 50 -27 79 227 100 114
4144 114 -133 -110 -133 -105 -12 -149 -188 -177 216 19 -37 1 -55 -91 -221 -162 -10 179 -85 137 -223 -5 -88 -149
4168 -149 -64 -146 -269 26 142 131 -312 177 102 -97 202 -173 109 111 -95 -2 -113 -163 29 -64 -46 -54 -50 73 -58
4193 -58 -278 31 -67 -151 -122 61 -85 -342 130 -101 -176 194 158 91 294 192 -82 276 15 -107 -145 242 -199
4216 -199 -84 31 185 -12 -237 -29 -17 223 -16 425 300 -189 -18 80 245 -84 28 -18 -8 -59 272 -59
4238 -59 -18 65 -77 181 167 -376 116 -105 316 80 -3 66 140 54 -8 135 -144 -231 -186 -9 184 -154 -62 -123
4262 -123 -148 121 227 -94 140 -33 39 198 35 103 -115 -135 -104 -15 -173 125 481 131 -138 -171 -151 -43 56
4285 56 77 -9 71 -15 -76 50 258 -28 17 -31 172 12 -199 23 -110 189 209 57 238 83 -84 186 147
4308 147 -38 -227 269 -147 116 177 167 198 104 -39 -160 88 -95 123 -84 -158 206 163 270 272 -185 -93 -74
4331 -74 -103 209 -77 107 210 -23 -181 -180 330 95 132 -98 -226 98 -118 55 174 -32 -156 -33 40 56
4353 56 -143 134 -83 -201 -15 -132 -2 242 202 367 233 -47 267 191 301 -58 80 -210 -53 -145 -165 36
4375 36 -172 -94 -108 -178 76 -290 124 -60 49 -58 39 61 -171 123 -170 119 -127 150 41 112 -169 55
4397 55 41 111 -25 4 -59 -102 -59 185 104 -105 291 -116 73 -41 27 84 67 -20 191 243 -5 -71 34 151 382
4422 382 36 -154 -43 -162 -144 -79 -47 -80 -70 -153 -58 -80 -217 61 170 94 83 -143 -157 25 -239 -62 -380 133
4446 133 79 43 -18 156 263 -156 -319 -152 21 -110 88 -19 18 -85 -125 6 -41 -302 71 373 -293 105
4468 105 247 198 -10 -295 -286 153 4 -30 8 -131 -17 -129 112 -55 -93 59 248 -233 -3 77 -14 -17 -11 -142
4492 -142 -314 179 -39 -8 -122 -92 27 -69 -317 189 78 82 23 122 144 122 36 -125 -356 -28 -26 -48 -96 -177 134
4517 134 -115 -159 -73 75 163 -75 45 167 -4 -12 -196 -96 37 22 -22 -50 -37 -133 -112 145 -135 182 15 -27
4541 -27 -167 88 -67 -212 -27 113 -39 -52 38 98 -73 -155 21 134 -159 -97 235 -110 90 241 -34 186
4563 186 75 -59 -110 324 -111 -4 -117 134 -16 116 264 221 31 46 207 -87 62 -89 -89 -95 110 -227
4585 -227 -25 -198 -87 -30 -240 -42 -111 213 -60 27 -62 45 -135 22 75 44 -22 -249 -93 -176 -31 -85 93
4608 93 93 -168 -60 65 -10 -69 -15 99 21 293 121 -7 38 345 204 113 -156 122 304 209 42 -113 344
4631 344 269 170 -13 -16 -7 -186 49 42 -123 107 133 -172 88 170 -107 120 26 66 -40 4 -367 147 -242 131
4655 131 -111 139 -97 166 184 117 -170 18 3 280 26 28 -79 -31 223 -236 -290 -6 -59 116 -351 -186 6
4678 6 184 49 -302 176 199 -12 -122 -22 -87 -2 50 107 -81 166 72 -100 -83 -109 91 153 34 208 94 -198
4702 -198 12 -240 -85 -186 112 -67 -173 -289 -96 211 31 -132 150 -77 -156 -197 44 -87 40 355 -13
4723 -13 34 -297 -117 79 -40 181 -46 151 -85 -344 12 -126 -170 104 300 117 177 -116 51 -67 65
4744 65 206 163 -60 191 3 -119 -257 202 -104 -45 38 -95 -219 175 -85 105 -50 -7 -134 -159 42 52
4766 52 -82 -256 -100 -104 -59 -23 173 232 -52 -64 205 95 68 57 -36 109 97 -88 16 -28 74 -200 143 -28
4790 -28 -125 25 57 225 95 446 -25 -187 189 -20 -50 202 54 -177 235 -5 143 -311 -127 -26 -52 -158
4812 -158 -264 97 25 -382 147 -5 -301 -134 -27 58 -212 -136 -239 -192 -5 210 -5 53 -107 196 50 -252
4834 -252 -58 -23 -18 24 170 98 130 119 74 -78 -305 -5 -9 -100 -177 149 302 56 220 106 73 12 230 -40 -184
4859 -184 -88 76 -57 194 -66 140 -107 47 -184 127 35 146 47 109 -223 -170 -102 252 54 153 134 226 -120
4882 -120 -1 120 94 18 -30 -221 -44 -256 89 -56 -21 -166 -103 -40 -72 255 -411 107 -239 -71 -24 -7 -260
4905 -260 247 -80 -99 -39 16 44 -216 -148 250 -34 18 -138 -121 97 -252 -259 39 -278 -184 84 -21 -31 72 -288
4929 -288 -125 8 -47 55 198 88 135 163 36 371 83 -129 183 329 138 -172 14 175 -80 -193 -57
4950 -57 44 82 -40 -198 -95 156 89 -147 217 4 273 -52 -26 -209 -109 -72 -368 43 -71 195 -31 95
4972 95 61 -258 12 -81 -147 111 8 -153 42 -145 -39 246 91 55 -138 -178 -106 -217 -65 -308 -149 -246 156
4995 156 -198 69 243 287 168 264 -65 39 32 -133 -37 -167 28 264 75 -48 174 170 92 -264 -79 -183 88
5018 88 -182 28 -29 -297 20 -4 181 -44 85 31 -115 -229 185 -9 -355 -21 72 236 -124 -222 -71 169
5040 169 300 -76 2 80 -66 -407 180 -49 -93 -72 -120 48 -290 -89 0 141 -21 118 183 -226 246 -192
5062 -192 55 199 27 172 -98 62 -10 -37 4 -60 -181 8 -288 -24 38 -270 -76 -21 15 -68 92 88 -28
5085 -28 -173 -135 197 -38 117 -16 -367 -75 -180 133 90 88 -93 -171 259 -8 -135 101 9 46 292 -27 26
5108 26 45 65 81 131 99 -111 234 286 64 -86 -243 -126 122 33 125 -171 49 272 -32 -129 -147 -18 -75 -12
5132 -12 -196 -37 -44 -100 -221 -110 17 251 -67 67 -53 110 -106 245 230 20 -159 -231 222 -210 140 -51
5154 -51 0 -1 40 -168 62 -18 36 -61 -330 263 40 190 68 275 -384 164 24 156 -291 72 -172 20 107
5177 107 107 -183 140 225 -138 -78 -42 77 -42 -56 71 55 299 215 -141 86 75 -198 180 38 -35 123 -94
5200 -94 -388 59 19 28 -61 156 93 114 -437 -43 60 38 -49 -98 343 128 -60 249 82 -17 130 -160 -3 -186
5224 -186 -157 158 -10 -28 111 97 -184 218 284 -193 -104 -147 -68 -133 -33 -44 12 39 -24 121 37 -47 238 -15 37
5249 37 73 21 92 -53 -97 24 -196 184 181 282 113 340 -149 -84 -8 -76 -129 -177 -97 -148 -89 43 174 -251 -120
5274 -120 12 62 133 4 164 -255 7 57 34 102 50 15 -1 -43 -166 40 -138 108 -336 176 2 -21 -276
5297 -276 -186 -70 30 43 12 -330 -72 27 -121 183 -235 -92 -54 82 -7 271 272 -185 -54 22 100 -123 69
5320 69 -141 -110 -49 -192 -153 48 151 -31 -350 -159 91 -170 95 -95 121 -80 -59 176 -75 24 4 105
5342 105 174 -3 -264 27 248 -172 -47 -269 225 136 428 163 -98 -85 233 173 83 256 -35 269 -117 -3
5364 -3 -96 -54 213 -67 157 58 25 -74 2 106 -50 -104 125 -245 180 -233 44 -74 72 -139 -165 -212 2 123
5388 123 69 144 -139 117 -65 -195 -260 -238 -166 51 34 -208 -120 -347 223 -20 -175 -47 -134 90 -132 159 116
5411 116 124 -60 52 -101 68 -153 3 49 42 111 -285 -114 -97 232 -124 265 -58 161 22 211 -157 11
5433 11 -40 78 -1 90 -198 374 -72 107 -4 -297 -156 -100 -135 -9 13 -84 172 -27 126 -65 -128 62 -219
5456 -219 92 218 141 -6 113 218 30 242 -213 74 -25 -79 -93 -141 70 93 133 198 -114 31 -33 -249 -70
5479 -70 165 -97 37 -185 -224 -50 -83 -197 100 -28 -22 51 -220 -217 60 41 -150 174 34 106 87 6 71 -115
5503 -115 291 47 -20 10 -68 35 -14 -52 -24 69 -160 -52 -23 -138 128 116 67 -48 -117 -138 -279 -14 -264 152
5527 152 -248 -97 -69 89 155 34 53 -269 34 -53 36 -12 -282 198 175 -335 16 -197 -237 -132 295 -167 40
5550 40 -102 118 90 -101 -47 -121 -136 92 1 -51 -221 -31 -133 46 -74 -99 -5 98 -47 -342 39 -65 -54
5573 -54 -5 65 -109 -16 -22 97 244 -86 -48 -18 124 -57 -155 48 -13 -367 158 -20 144 170 104 171 -214 -25
5597 -25 -52 77 -80 110 -80 63 -220 -284 -240 62 -295 -116 240 73 219 85 -79 30 34 -25 -24 83 -6
5620 -6 -72 -192 244 159 20 -205 18 166 -19 -227 67 -217 103 -47 -55 151 -44 -96 6 0 -53 -95 145 176
5644 176 10 22 178 132 -230 -110 -258 81 3 20 -209 -191 78 -110 -2 160 -74 -69 71 -109 -172 -30 -48
5667 -48 -61 286 -261 98 -55 -30 182 -9 -23 80 34 -104 -22 40 -96 -36 321 -122 24 -82 -26 225 -247
5690 -247 139 -163 37 -8 101 -29 65 26 -78 -152 -137 -342 197 141 38 186 165 -177 229 169 -157 58 42
5713 42 -204 3 -96 200 115 135 101 216 205 -126 -28 120 106 -49 -120 176 175 -4 274 174 -79 -156 136 -97
5737 -97 18 237 -241 -72 -120 -229 52 -162 136 -47 -37 -20 -21 -164 75 277 43 212 -61 -245 -180 98
5759 98 76 2 42 -65 -71 -227 -68 -14 -10 229 140 -206 84 -87 -311 -86 -65 -54 93 -118 -94 204 83 -72
5783 -72 -57 110 -35 57 29 -236 -60 -350 128 95 -68 -29 -87 10 175 319 -33 102 -36 -101 -256 -205 -164 -124
5807 -124 -98 -20 -57 41 181 -217 -99 125 -2 83 -291 19 175 122 80 -20 56 -74 98 178 -140 -77 -68 -77 99
5832 99 46 16 -124 -160 -66 -117 62 368 272 326 77 253 -21 -244 -57 -43 34 15 -232 106 367 -21 -95 -175
5856 -175 36 -219 -3 84 29 -103 -175 174 -26 43 -84 -21 8 41 -276 -319 -25 -94 67 83 108 52 -15 -16 233
5881 233 -74 -106 132 -55 -212 163 -105 59 -92 87 -122 186 33 31 187 20 -295 198 -36 34 20 152
5903 152 -103 313 -214 136 114 275 107 166 186 -118 146 26 -147 -137 -184 -106 170 -11 116 -52 -221 -55
5925 -55 82 -80 158 -31 -126 -93 14 3 21 -130 -80 19 -128 -101 -42 -11 -53 34 103 134 12 23 30 -52 103 320
5951 320 75 315 -105 -165 -97 6 -51 133 -56 -315 -30 4 -103 108 124 44 -1 144 277 32 221 -187
5973 -187 156 74 32 -51 -154 47 306 297 -212 -70 164 -45 39 -113 -99 6 3 -94 -143 -60 -168 172 116 189 -282
5998 -282 113 -248 142 67 -54 -129 -200 158 227 -9 -99 -182 140 90 -67 82 -176 -36 154 -83 85 -241
6020 -241 -218 76 -145 -185 -188 154 88 -219 -18 64 38 108 69 -182 80 39 106 155 10 -118 198 -171 167 -176
6044 -176 -109 -6 100 -206 53 123 36 -181 2 60 -150 -30 15 -83 124 144 66 -20 15 35 199 13 106 239
6068 239 74 258 155 98 245 93 0 -80 30 -182 -39 -33 -56 214 -94 81 -281 -21 -88 27 -118 -345
6090 -345 -39 103 -109 -231 -53 131 199 42 -200 -120 90 199 121 -33 12 -153 -97 -93 81 255 -116 144
6112 144 3 -17 -318 -285 76 -29 129 -89 141 6 183 247 -9 93 -276 -60 31 -125 -141 -122 -175 -108 -40
6135 -40 103 102 12 -185 -184 -59 -98 42 146 237 -320 117 -94 171 -97 -96 -195 126 -138 58 -56 37 116 260
6159 260 94 -131 -45 86 201 138 -218 -228 -71 -98 217 72 -113 185 67 -344 61 24 29 -133 59 321
6181 321 231 -41 6 -58 -106 -173 -66 -367 -38 -135 357 -212 80 20 -60 154 -116 143 -20 462 -151 -11 44
6204 44 -20 14 -101 30 -46 -371 -156 9 146 139 -43 -24 -178 135 456 235 -27 98 -294 6 -130 119
6226 119 17 -66 -53 -167 38 -22 -376 -27 131 10 143 -73 23 29 238 101 211 292 159 45 143 72 64 -10
6250 -10 26 -64 31 247 -208 98 4 -152 19 119 8 25 172 0 -61 -48 -172 230 15 41 -143 143 -74
6273 -74 -76 -233 10 201 146 29 -200 267 -166 -144 -11 287 200 164 165 -197 137 132 -52 102 -131 -37 226 19
6297 19 -235 6 -16 -111 6 -188 338 -35 75 180 -91 255 99 -61 152 -21 359 81 29 -147 95
6318 95 -214 -193 -266 57 -128 12 98 219 -80 70 107 50 -161 235 -71 15 154 104 96 39 -397 -47 -207 -80
6342 -80 57 93 309 148 -209 36 220 -7 -145 -64 -162 -150 69 -45 -171 16 -60 52 -163 -164 -103 -234 70
6365 70 10 -105 -30 -153 21 2 -211 60 -148 -161 195 119 52 2 -423 -45 -60 -401 29 -12 -18 168 79 -263
6389 -263 12 41 33 151 26 273 -49 205 -3 -131 -208 -80 -15 -45 129 -223 141 -99 148 129 -89 164
6411 164 -97 -177 -146 149 -73 -328 -174 41 38 -287 -9 -75 149 -139 210 -170 102 -46 -54 97 59 -121 -135
6434 -135 166 78 -45 -4 -234 327 141 -81 -10 35 -101 -5 -56 -215 -81 -178 169 -116 -42 124 10 -63 -206
6457 -206 -159 39 -248 190 -73 26 103 63 -140 -136 70 -16 25 96 -22 -180 -215 -88 197 47 2 -78 -148 -105 188
6482 188 -42 -97 108 132 67 205 50 -90 163 -83 16 94 56 126 -53 128 -48 -80 99 42 -308 220 12
6505 12 -195 376 300 129 -77 69 -141 24 -2 -67 61 267 64 -57 43 117 -195 266 -184 36 -232 264
6527 264 -66 -97 121 83 -148 -55 -69 184 -112 -167 -121 -114 66 -228 67 -199 266 -177 -155 -280 42 -12 -73 -130
6551 -130 -89 321 -54 -71 -53 -122 -188 -26 -124 -38 -147 -213 68 22 30 107 43 -84 -189 -54 109 -10 -68 -106 -74
6576 -74 95 -51 -5 -73 41 238 -66 138 364 -74 -205 -152 -155 -170 -235 28 17 -52 151 325 112 -2 149
6599 149 147 139 146 183 31 116 53 17 184 -66 75 28 25 22 -2 202 -18 310 172 83 223 -71 184 26 248 -112
6625 -112 49 -250 198 -184 41 121 -80 -83 -1 -242 -75 193 -130 -198 164 -180 -139 100 -171 -187 -129 132 -255
6648 -255 69 -56 121 48 -79 146 -123 -268 -299 108 41 -305 -87 186 -14 -66 115 14 8 120 108 168 0
6671 0 -285 48 -90 -148 -29 -168 -3 -40 -42 80 -40 -157 -54 309 230 209 -144 321 -229 242 242 39 97 237
6695 237 52 -15 -1 -296 17 -111 250 -70 -2 150 -83 -319 59 -162 16 157 -78 130 237 201 19
6716 19 116 51 165 -3 277 269 20 84 -307 -220 180 176 124 53 238 -323 22 28 62 72 -183 173 65 -110 -51
6741 -51 8 312 -163 82 -164 224 92 76 -23 -5 117 93 276 80 -74 129 213 -162 -190 -4 -239 176 -254
6764 -254 -46 13 -49 12 -72 78 -113 88 50 296 -114 153 283 96 95 198 206 188 -135 124 -24 25 97 46
6788 46 50 -76 -28 -13 -122 -119 24 108 -1 10 -156 30 105 -72 331 -220 86 70 -52 -29 139 -6 -119 42
6812 42 -150 -81 -122 -127 -133 -104 -133 -87 -198 -76 -70 -261 -330 -59 -28 141 -152 19 -115 -348 172 33 24 39 94 -26
6838 -26 246 104 85 49 -16 202 71 147 128 50 265 50 188 162 -31 20 -28 55 199 -121 -439 175 -298 144
6862 144 -31 -166 115 217 69 191 -156 85 234 -21 -69 -57 -93 245 134 -172 -31 -61 -139 -103 -227 118
6884 118 -51 -137 123 19 -220 -92 -91 -68 81 -160 165 22 -167 10 7 123 2 -33 150 120 -46 -68 -139
6907 -139 -115 -19 -207 -189 15 -89 111 44 222 44 141 375 62 81 321 -129 -99 -41 210 260 253 -79 8 58
6931 58 -162 -113 110 -83 17 283 -107 -120 -190 147 -150 1 -36 94 -20 -118 3 -10 -66 -97 178 9 159
6954 159 -189 12 -46 59 -184 -66 -20 94 154 -331 -42 -289 -264 -7 -3 289 -114 -18 -244 38 64 -267 -105
6977 -105 147 27 -188 238 115 -69 13 -215 135 -53 161 -45 203 190 -40 40 -207 -5 239 -207 -159
6998 -159 -83 -74 -275 -208 188 14 -93 132 107 -61 105 -145 169 172 35 -221 75 -110 -102 61 94 70 -20 294
7022 294 -301 121 -94 -123 -77 -6 -138 249 200 66 -3 89 -79 -98 46 44 -36 -3 154 202 249 -67 -7 -171 67
7047 67 40 87 -37 65 -118 -76 -165 7 -2 -275 125 155 -345 -310 83 -72 -150 -192 -159 -115 50 -83 -68 -199 -16
7072 -16 42 -90 20 -6 29 -32 -47 161 -297 14 -57 191 109 -132 185 -59 3 159 14 52 201 177 -5 317
7096 317 170 209 -37 -85 -119 -243 -43 -41 -47 -127 -98 -194 25 342 -84 113 116 -120 107 -124 -45 463 110 30 -19
7121 -19 23 -9 -20 -69 90 -122 -59 16 -132 121 136 43 122 -27 -232 -138 -72 350 -51 -44 26 -105 120 -136 -12
7146 -12 -167 -24 71 -1 56 191 71 -61 -62 -325 12 40 -8 -373 11 0 -18 -39 -98 -58 200 110 -61 -82 -8
7171 -8 55 164 190 72 -154 125 146 -2 -74 -12 12 -199 51 172 53 -77 101 68 135 -20 -89 86 -57 -121
7195 -121 70 151 -12 57 -97 354 176 -116 -106 -10 235 187 41 85 -17 58 -29 -295 25 46 248 9 -5
7218 -5 -245 154 -80 -82 32 90 -135 145 66 194 -79 -181 6 -23 -234 357 -33 187 130 56 130 248 -26
7241 -26 -133 -105 262 -64 -49 257 -16 39 95 -166 130 85 -58 -128 133 -176 -89 -19 46 138 95 41 152 150 49
7266 49 -40 -195 52 -329 10 -52 -125 87 -51 69 -194 221 -111 57 -174 129 156 28 100 -90 25 183
7288 183 -42 62 8 -198 175 218 43 324 26 11 -116 -180 126 -25 -172 -162 -101 14 188 123 43 138 9
7311 9 6 1 0 33 73 -18 -141 59 -23 48 147 15 101 116 306 146 187 179 206 -40 -142 271 -29 -91 -98 -124 115 53
7339 53 160 51 25 -131 -190 -40 61 -2 56 8 345 323 335 -23 -84 -32 131 -114 -236 -331 59 -15 -57 41 93
7364 93 164 73 99 -135 -104 -17 -97 -18 89 35 98 -84 -75 51 2 -10 127 -53 291 317 -132 -140 76 -55 -88 -91 47
7391 47 -9 126 -261 -491 163 216 -213 -71 -51 78 -118 114 79 -88 -332 -70 35 -117 129 15 55 16
7413 16 -197 100 17 191 26 -6 107 75 71 -71 155 -191 253 40 27 -128 -182 -145 -214 134 80 -111 -204 -176
7437 -176 -242 -158 -84 78 -106 5 250 154 131 -103 -123 -47 -51 252 -134 -15 -109 32 -279 66 207 58 -97
7460 -97 164 -212 27 56 -174 -84 -91 -214 -84 -306 115 -200 0 24 243 -33 -153 -252 -290 -13 132 -101 -175
7483 -175 251 37 152 -306 48 -5 -11 56 40 -31 13 -53 -62 316 -42 146 238 -29 -20 143 116 67 134 180 117 132
7509 132 -357 79 -212 -198 -75 339 -12 -151 38 112 -1 -43 6 -78 -136 -29 -288 153 20 -73 160 -261
7531 -261 19 -176 37 -95 -252 -3 -13 36 46 -114 -399 35 -148 -123 146 115 129 11 -79 112 -76 -297
7553 -297 -239 -93 -160 -50 145 222 -76 -398 82 -117 35 164 8 -61 -125 261 -68 -177 185 -177 -122 47
7575 47 56 -9 56 -201 -51 -152 -76 -133 131 -65 192 -86 39 115 59 168 -235 -213 -79 97 -139 126 63 -13
7599 -13 168 -79 -147 49 59 76 117 48 42 388 -38 31 87 262 45 18 -36 -75 -42 -277 -66 111 -53 86 -341
7624 -341 86 18 -326 -160 131 -203 -47 -332 44 -76 -37 331 -243 -305 321 -71 -71 147 -65 304 -26 16
7646 16 42 149 128 62 -77 70 138 41 155 15 -7 57 -30 3 114 -77 -66 -61 142 138 115 -32 74 62 -206 -89
7672 -89 103 254 95 -136 56 83 -145 120 26 -207 -66 145 -142 -6 -156 70 -39 -113 157 186 127 98
7694 98 71 -297 190 177 80 84 -9 -147 9 -154 -183 -143 -6 -90 146 77 206 -81 -268 59 -55 150 -15 -121
7718 -121 -151 1 -154 -113 107 332 77 -68 370 7 -185 44 83 58 -136 31 31 -65 209 -119 -33 -234 86
7741 86 -43 126 70 56 112 -175 104 84 38 86 22 -226 126 19 -1 -165 -78 131 124 -118 -298 -2 36 -223
7765 -223 110 -71 -184 -94 -198 -36 -75 -205 51 31 243 -31 31 -71 -150 187 47 -159 87 232 169 94
7787 94 18 -273 -194 68 -227 70 12 116 -324 73 251 -280 -20 -30 -107 -222 147 156 -110 27 -60 144 -83
7810 -83 171 121 68 105 -55 19 -300 40 67 -58 235 82 -102 -43 23 209 -119 57 -19 -161 -119 77 -118
7833 -118 7 165 129 -261 -18 221 -311 -75 -1 -38 -188 0 -22 159 8 -365 101 -198 -153 45 80 -15
7855 -15 -29 -194 -82 141 225 -20 -121 -73 199 -164 216 156 68 34 109 -142 -68 65 -183 102 -31 10 210
7878 210 83 -17 -121 -385 23 39 -85 -102 -86 -85 159 73 -35 -154 81 -105 64 -210 -163 245 -186 40
7900 40 86 174 -78 -38 105 211 -30 122 90 -85 -134 -103 85 287 96 -162 -175 307 99 3 393 76 -41
7923 -41 -154 -171 -19 -180 143 202 28 -256 -41 -404 205 -103 58 59 -35 -37 -3 30 150 51 220 26 -214 -82
7947 -82 -67 3 -176 3 -214 34 117 87 -92 42 146 -96 -12 -106 -29 8 -60 99 135 137 176 254 48 -66 2
7972 2 79 98 -69 25 -91 28 -26 78 -351 -19 -163 9 93 163 -79 -14 -221 -132 -34 105 5 -51 -27 201
7996 201 -134 46 63 -165 -49 98 -58 86 149 -41 114 216 235 -207 -270 130 85 -104 -112 56 -56 3 126
8019 126 -21 227 -179 75 -89 -166 -8 -208 228 -3 355 53 -27 189 147 -97 17 77 -241 -139 -100 169
8041 169 250 41 -11 6 -25 41 70 45 18 -99 102 32 -208 -41 -154 75 221 -86 137 -183 19 0 122
8064 122 80 114 45 253 21 -2 162 179 4 42 25 10 26 -36 -196 114 -150 -122 -27 -63 171 19 271 74
8088 74 -19 50 -37 190 303 70 -191 -48 134 181 108 103 -14 -7 -248 -40 -84 -11 -121 -171 155 -158 -100 -62 -237
8113 -237 -304 158 156 49 -42 34 8 -8 -32 -169 -105 207 -224 -129 -48 -107 238 -218 -101 56 160 189 -41 36 376
8138 376 261 122 164 -498 49 -41 72 311 -61 297 145 -2 19 -35 205 -5 -93 49 124 -247 -107 212
8160 212 21 -7 26 163 -139 -71 -79 134 -18 92 -83 248 -119 -63 432 -133 65 158 -188 -45 -81 -236 15
8183 15 201 160 145 49 -192 72 12 37
8191C7
##END NTUPLES=NMR FID
##END=
