##TITLE=1H_DE-79_NaOH

 8 sc, 
 24.12.2024
##JCAMPDX= 6.0         $$ Bruker NMR JCAMP-DX V2.0
##DATA TYPE= NMR FID
##DATA CLASS= NTUPLES
##ORIGIN= UXNMR, Bruker Analytische Messtechnik GmbH
##OWNER= root
$$ XWIN-NMR		Version 3.5
$$ Tue Dec 24 14:35:48 2024 Russian Standard Time (UT+4h)  she@DPX200
##.OBSERVE FREQUENCY= 200.1315
##.OBSERVE NUCLEUS= ^1H
##.DELAY= (6, 6)
##.ACQUISITION MODE= SIMULTANEOUS
##.ACQUISITION SCHEME= undefined
##.AVERAGES= 8
##.DIGITISER RES= 18
##SPECTROMETER/DATA SYSTEM= spect
##.PULSE SEQUENCE= zg30
##.SOLVENT NAME= D2O
##.SHIFT REFERENCE= (INTERNAL, D2O, 0, 15.7039)
##AUDIT TRAIL= $$ (NUMBER, WHEN, WHO, WHERE, WHAT)
$$ ##TITLE= Audit trail, XWIN-NMR		Version 3.5
$$ ##JCAMPDX= 5.01
$$ ##ORIGIN= Bruker BioSpin GmbH
$$ ##OWNER= she
$$ F:/spectra/data/she/nmr/H-F/1/audita.txt
$$ ##AUDIT TRAIL=  $$ (NUMBER, WHEN, WHO, WHERE, WHAT)
(   1,<2024-12-24 14:34:26.29 +0400>,<she>,<DPX200>,
      <created by zg, POWCHK disabled, PULCHK disabled
       configuration hash MD5:
       00 E9 B6 7A A2 85 ED C7 34 08 36 98 17 FE 4E 26
       data hash MD5: 16K
       AD CB C6 4D 66 7F 02 BE 20 1B 26 E4 38 0D D5 60>)
$$ ##END=
$$ 
$$ hash MD5
$$ AC 8E 02 F8 1C 3D C4 F0 10 5C A4 F2 F5 2C 30 AE
##$RELAX= 
##$RELAX= 
##$RELAX= 
##$RELAX= 
##$RELAX= 
##$RELAX= 
$$ Bruker specific parameters
$$ --------------------------
##$DU= <F:/spectra>
##$EXPNO= 1
##$NAME= <H-F>
##$PROCNO= 1
##$TYPE= <nmr>
##$USER= <she>
##$AMP= (0..31)
100 100 100 100 100 100 100 100 100 100 100 100 100 100 100 100 100 100 
100 100 100 100 100 100 100 100 100 100 100 100 100 100 
##$AQSEQ= 0
##$AQ_mod= 1
##$AUNM= <au_zg>
##$AUTOPOS= <>
##$BF1= 200.13
##$BF2= 200.13
##$BF3= 200.13
##$BF4= 200.13
##$BF5= 200.13
##$BF6= 200.13
##$BF7= 200.13
##$BF8= 200.13
##$BYTORDA= 1
##$CFDGTYP= 0
##$CFRGTYP= 5
##$CHEMSTR= <none>
##$CNST= (0..31)
1 1 145 1 1 1 1 1 1 1 1 1 1 1 1 1 1 1 1 1 1 1 1 1 1 1 1 1 1 1 1 1 
##$CPDPRG= <>
##$CPDPRG1= <>
##$CPDPRG2= <>
##$CPDPRG3= <>
##$CPDPRG4= <mlev>
##$CPDPRG5= <mlev>
##$CPDPRG6= <mlev>
##$CPDPRG7= <mlev>
##$CPDPRG8= <mlev>
##$CPDPRGB= <>
##$CPDPRGT= <>
##$D= (0..31)
0 1.2 0 0 0 0 0 0 0 0.06 0 0.03 0 0 0 0 0.0002 0 0 0 0 0 0 0 0 0 0 0 0 
0 0 0 
##$DATE= 1735036466
##$DBL= (0..7)
120 120 120 120 120 120 120 120 
##$DBP= (0..7)
150 150 150 150 150 150 150 150 
##$DBP07= 0
##$DBPNAM0= <>
##$DBPNAM1= <>
##$DBPNAM2= <>
##$DBPNAM3= <>
##$DBPNAM4= <>
##$DBPNAM5= <>
##$DBPNAM6= <>
##$DBPNAM7= <>
##$DBPOAL= (0..7)
0.5 0.5 0.5 0.5 0.5 0.5 0.5 0.5 
##$DBPOFFS= (0..7)
0 0 0 0 0 0 0 0 
##$DE= 6
##$DECBNUC= <off>
##$DECIM= 24
##$DECNUC= <off>
##$DECSTAT= 4
##$DIGMOD= 1
##$DIGTYP= 9
##$DL= (0..7)
0 120 120 120 120 120 120 120 
##$DP= (0..7)
150 150 150 150 150 150 150 150 
##$DP07= 0
##$DPNAME0= <>
##$DPNAME1= <>
##$DPNAME2= <>
##$DPNAME3= <>
##$DPNAME4= <>
##$DPNAME5= <>
##$DPNAME6= <>
##$DPNAME7= <>
##$DPOAL= (0..7)
0.5 0.5 0.5 0.5 0.5 0.5 0.5 0.5 
##$DPOFFS= (0..7)
0 0 0 0 0 0 0 0 
##$DQDMODE= 0
##$DR= 18
##$DS= 0
##$DSLIST= <SSSSSSSSSSSSSSS>
##$DSPFIRM= 0
$$ [...]
##$SUBNAM2= <"">
##$SUBNAM3= <"">
##$SUBNAM4= <"">
##$SUBNAM5= <"">
##$SUBNAM6= <"">
##$SUBNAM7= <"">
##$SUBNAM8= <"">
##$SUBNAM9= <"">
##$SW= 24.0689530833862
##$SWIBOX= (0..15)
0 0 2 0 0 0 0 0 0 0 0 0 0 0 0 0 
##$SW_h= 4816.95568400771
##$TD= 16384
##$TD0= 1
##$TE= 0
##$TE2= 300
##$TE3= 300
##$TEG= 300
##$TL= (0..7)
0 120 120 120 120 120 120 120 
##$TP= (0..7)
150 150 150 150 150 150 150 150 
##$TP07= 0
##$TPNAME0= <>
##$TPNAME1= <>
##$TPNAME2= <>
##$TPNAME3= <>
##$TPNAME4= <>
##$TPNAME5= <>
##$TPNAME6= <>
##$TPNAME7= <>
##$TPOAL= (0..7)
0.5 0.5 0.5 0.5 0.5 0.5 0.5 0.5 
##$TPOFFS= (0..7)
0 0 0 0 0 0 0 0 
##$TUNHIN= 0
##$TUNHOUT= 0
##$TUNXOUT= 0
##$USERA1= <user>
##$USERA2= <user>
##$USERA3= <user>
##$USERA4= <user>
##$USERA5= <user>
##$V9= 5
##$VALIST= <valist>
##$VCLIST= <CCCCCCCCCCCCCCC>
##$VD= 0
##$VDLIST= <DDDDDDDDDDDDDDD>
##$VPLIST= <PPPPPPPPPPPPPPP>
##$VTLIST= <TTTTTTTTTTTTTTT>
##$WBST= 1024
##$WBSW= 4
##$XGAIN= (0..3)
0 0 0 0 
##$XL= 0
##$YL= 0
##$YMAX_a= 181237
##$YMIN_a= -254586
##$ZGOPTNS= <>
##$ZL1= 120
##$ZL2= 120
##$ZL3= 120
##$ZL4= 120
##$ABSF1= 10
##$ABSF2= 0
##$ABSG= 5
##$ABSL= 3
##$ALPHA= 0
##$AQORDER= 0
##$ASSFAC= 0
##$ASSFACI= 0
##$ASSFACX= 0
##$ASSWID= 0
##$AUNMP= <proc_1d>
##$AZFE= 0.1
##$AZFW= 0.1
##$BCFW= 1
##$BC_mod= 2
##$BYTORDP= 1
##$COROFFS= 0
##$CY= 11.3945322036743
##$DATMOD= 1
##$DC= 2
##$DFILT= <>
##$DTYPP= 0
##$F1P= 15.6554695791079
##$F2P= 12.8336369535428
##$FCOR= 0.5
##$FTSIZE= 0
##$FT_mod= 4
##$GAMMA= 1
##$GB= 0.15
##$INTBC= 1
##$INTSCL= 1
##$ISEN= 128
##$LB= 0.24
##$LEV0= 0
##$LPBIN= 0
##$MAXI= 10000
##$MC2= 0
##$MEAN= 0
##$ME_mod= 0
##$MI= 1.114404
##$NCOEF= 0
##$NC_proc= 0
##$NLEV= 6
##$NOISF1= 3.799351
##$NOISF2= 2.8
##$NSP= 1
##$NTH_PI= 0
##$NZP= 0
##$OFFSET= 15.70392
##$PC= 1
##$PHC0= -26582.29
##$PHC1= 22.18744
##$PH_mod= 1
##$PKNL= yes
##$PPARMOD= 0
##$PSCAL= 0
##$PSIGN= 0
##$REVERSE= no
##$SF= 200.130013532006
##$SI= 16384
##$SIGF1= 3
##$SIGF2= 2
##$SINO= 400
##$SIOLD= 16384
##$SREGLST= <1H.CDCl3>
##$SSB= 0
##$STSI= 0
##$STSR= 0
##$SW_p= 3612.71676300578
##$SYMM= 0
##$S_DEV= 0
##$TDeff= 0
##$TDoff= 0
##$TI= <>
##$TILT= no
##$TM1= 0
##$TM2= 0
##$TOPLEV= 0
##$USERP1= <user>
##$USERP2= <user>
##$USERP3= <user>
##$USERP4= <user>
##$USERP5= <user>
##$WDW= 1
##$XDIM= 8192
##$YMAX_p= 0
##$YMIN_p= 0
$$ End of Bruker specific parameters
$$ ---------------------------------
##NTUPLES= NMR FID
##VAR_NAME=  TIME,          FID/REAL,        FID/IMAG
##SYMBOL=    X,             R,               I
##VAR_TYPE=  INDEPENDENT,   DEPENDENT,       DEPENDENT
##VAR_FORM=  AFFN,          ASDF,            ASDF
##VAR_DIM=   8192,          8192,            8192
##UNITS=     SECONDS,       ARBITRARY UNITS, ARBITRARY UNITS
##FACTOR=    0.0002076,     1,               1
##FIRST=     0,             0,               0
##LAST=      1.7004516,     0,               0
##MIN=       0,             -254586,         0
##MAX=       1.7004516,     181237,          0
$$ Real data points
##PAGE= N=1
##DATA TABLE= (X++(R..R)), XYDATA
$$ [...]
$$ plain form
1914 236 142 230 -141 -400 11 45 83 -305 12 155 155 -72 -31 92 109 41 31 89 -197 -145 322 -218 -114 -297
1938 -297 -74 173 217 -120 -120 214 114 -22 -79 151 -114 -193 -318 -14 -205 126 -101 586 57 -115 289 246
1960 246 -23 -272 -70 6 350 -54 -149 -66 -44 54 -59 -44 -387 272 -86 38 -249 -84 -21 -219 -142 -168 3
1983 3 16 74 -13 -140 -8 132 42 -143 -49 -188 -260 -166 -66 13 88 154 206 98 -245 35 96 262 -28 8 260
2008 260 139 -152 -331 26 -87 320 243 -503 -147 185 365 -102 -71 -140 79 126 -97 -57 -63 5 353 89 -69
2031 -69 145 188 59 -65 -65 -40 158 175 -170 158 15 170 98 -87 111 248 234 255 208 -202 105 44 -2 220
2055 220 166 121 -168 -108 -219 -221 338 156 27 -315 -30 27 -200 -203 -127 198 57 33 -140 77 24 -95 -20 99
2079 99 185 -339 7 -124 280 -292 -221 20 -180 -190 -75 -61 573 -75 62 208 -76 69 -161 317 -348 11
$$ packed form
1914B36r4Q8l71k59M11L4L8l88L17J43%k27M1J23J7o8j0N8k86N2M67n40J04j83
1938b97K23K47M4l37%L34j00j36n7K30k65p9j25L04j91L31k27O87n29j72M04m3
1960B46k69k49K02P6L44m04r5Q3K2R8j13J5l43O59l58J24k87J65O3j98P7k6J71
1983CJ3N8q7j27J32J40r0j85R4j39p2R4J00P9P5O6N2j08l43K80O1J66k90L6K52
2008B60j21k91j79L57j13M07p7p46L56L32J80m67L1o9K19M7k23M0oO8L48k64j58
2031f9K14M3j29j24%K5J98J7l45L28j43J55p2j85J98J37j4K1m7m10L07o1m6K22
2055B20n4m5k89O0j11kN59j82j29l42K85N7k27lP6L25j41k4j73K17n3j19P5J19
2079I9Q6n24L46j31M04n72P1K41k00j0J15J4O34o48J37J46k84J45k30M78o65L59
$$ plain form
2101 11 263 -12 5 -129 -68 266 54 -207 249 -49 259 43 -146 -263 -24 113 -3 101 -154 -102 75
2122 75 160 17 -82 -36 -144 168 125 40 116 294 -152 -281 12 309 345 60 391 -170 82 54 67 -523 310
2145 310 300 82 -258 -119 62 -61 152 -65 176 9 12 -400 -282 177 -24 90 0 16 320 506 95 -133
2167 -133 84 -66 -149 -32 -27 -178 -547 549 106 -36 -123 69 -26 -51 11 -147 50 -37 297 -231 -47 -154
2189 -154 179 -74 -196 -163 -134 186 -141 -21 -147 -207 194 -75 -69 136 -7 43 56 -13 -180 -34 128 223 208
2212 208 -134 108 -124 57 117 26 -35 -38 99 -469 -500 50 443 166 -79 76 57 279 231 134 -265 -82 312
2235 312 51 -34 -30 132 244 162 118 -73 -45 211 360 85 2 327 355 8 -44 -102 205 83 -120 -261 -96
2258 -96 -186 -21 123 -233 -138 161 -74 -45 136 191 36 187 146 -202 222 -10 -116 -35 180 109 182 35 -223
$$ packed form
2101A1K52k75J7j34O1L34k12k61M56k98L08k16j89j17K39J37j16J04k55N2J77
2122G5Q5j43r9M6j08L12m3q5P6J78m46j29K93K97L6k85L31n61K52k8J3n90Q33
2145C10j0k18l40J39J81j23K13k17K41j67Lm12J18M59k01J14r0J6L04J86m11k28
2167a33K17j50q3J17Nj51l69J096m43j42q7J92r5k5O2j58J97q7L34n28J84j07
2189a54L33k53j22L3K9L20l27J20j26o0M01k69OK05j43N0J3o9j67J46J62R5j5
2212B08l42K42k32J81O0r1o1lJ37n68l1N50L93k77k45J55j9K22m8r7l99J83L94
2235C12k61q5MJ62J12q2m4j91K8K56J49k75q3L25K8l47n2n8L07j22k03j41J65
2258i6r0J65J44l56R5K99k35K9J81N5j55J51m1l48M24k32j06Q1K15p1P3j47k58
$$ plain form
2281 -223 -153 31 276 211 -16 -22 -75 143 177 -100 -71 -30 -54 14 -136 -236 94 -86 152 62 -60 215 -95 96
2305 96 40 -112 -238 107 -154 4 -65 60 8 313 -25 40 37 87 58 -2 100 113 66 -165 15 30 21 73 223
2330 223 -171 184 -56 -75 14 -67 165 63 -35 -248 -33 -219 288 -111 -40 -293 48 83 20 -133 -340 29
2352 29 8 -217 -113 86 128 1 23 93 7 -92 183 -256 -458 -150 251 -158 -237 -455 -220 -255 -226 150 -204
2375 -204 -7 -40 188 -263 -85 -259 46 340 -75 63 -216 91 201 -47 -233 -164 165 200 52 261 32
2396 32 6 132 -107 39 -2 115 201 -232 75 47 5 -57 117 -196 322 144 -293 -194 -97 53 239 4 -389
2419 -389 217 -145 -143 24 33 77 327 107 -55 -312 163 231 141 -289 165 104 -185 246 57 -390 82 -67 -311
2442 -311 -423 -167 252 55 -93 37 445 206 -32 -216 -47 -157 -100 340 -23 160 133 -229 -71 142 -132
$$ packed form
2281b23P0J84K45o5k27on3K18L4k77K9M1k4O8j50j00L30j80K38r0j22K75l10J91
2305I6n6j52j26L45k61J58o9J25n2L05l38O5lN0k9o0J02J3m7k31J80J5rN2J50
2330B23l94L55k40j9Q9q1K32j02r8k13K15j86N07l99P1k53L41L5o3j53k07L69
2352B9k1k25J04J99M2j27K2P0q6r9K75m39k02L08M01m09p9k18K35l5K9L76l54
2375b04J97l3K28m51J78j74L05K94m15J38k79L07J10k48j86O9L29L5j48K09k29
2396C2k6J26k39J46m1J17Q6m33L07k8m2o2J74l13N18j78m37R9R7J50J86k35l93
2419c89O06l62KJ67RM4K50k20j62k57M75O8r0m30M54o1k89M31j89m47M72j49k44
2442c11j12K56M19j97j48J30M08k39k38j84J69j10N7M40l63J83k7l62J58K13k74
$$ plain form
2463 -132 -330 156 147 -169 -128 263 80 -107 -121 54 -26 -123 84 -140 29 285 186 119 269 59 271 -64 -128
2486 -128 -28 105 -30 564 -48 46 95 -24 -93 368 387 -248 -106 57 -275 -288 -86 139 10 345 -90 13
2508 13 264 -53 214 85 -161 -153 271 -96 -66 -94 -192 279 -70 52 -233 -59 -28 -164 -112 -204 -266 478 -11
2531 -11 -83 -301 -178 34 37 138 -24 97 -122 -226 -113 -34 -85 -94 -175 -160 -92 38 -2 -288 66 151 272 -141
2555 -141 49 142 336 144 -65 172 -240 158 142 8 -311 277 136 -59 -29 77 -102 -91 67 -122 -17
2576 -17 -338 4 -67 219 -29 94 100 -203 262 9 -39 -210 -65 -49 -176 9 -274 113 -68 -168 173 -191
2598 -191 77 -83 -29 115 -177 201 -88 -258 -48 -152 209 -114 26 54 -11 161 282 119 173 259 62 -115
2620 -115 -147 299 -11 147 -28 -274 235 -40 207 68 196 -330 -50 -222 91 4 -38 -4 54 106 -144 1
$$ packed form
2463a32j98M86rl16M1L91j83j87j4J75q0r7K07k24J69K56r9o7J50k10K12l35o4
2486a28J00J33j35N94o12R4M9j19o9M61J9o35J42J63l32j3K02K25j29L35m35J03
2508A3K51l17K67j29k46QM24l67L0k8r8M71l49J22k85J74L1j36N2r2o2P44m89
2531a1p2k18J23K12LJ01j62J21k19j04J13P9n1rq1J5O8J30m0k86L54Q5J21m13
2555a41J90R3J94j92k09K37m12L98j6j34l19N88j41j95L0J06j79J1J58j89J05
2576a7l21L42p1K86k48J23Ol03M65k53m8j71J45J6j27J85k83L87j81j00L41l64
2598a91K68j60N4J44k92L78k89j70K10j04L61l23J40K8o5J72J21j63N4Q6j97j77
2620a15l2M46l10J58j75k46N09k75K47j39J28n26K80j72L13q7m2L4N8N2k50J45
$$ plain form
2642 1 128 -81 -120 -55 -411 -40 -47 -66 170 322 193 -13 23 -244 -99 24 25 4 -644 -94 74 150 -309 95
2666 95 414 41 -162 -116 196 118 -233 -362 99 -286 -185 205 -200 -4 175 147 -469 -87 93 -205 -154 -187
2688 -187 147 -143 17 276 47 306 -242 -242 22 -34 -89 110 52 28 -108 136 -111 73 143 264 -313 -10
2710 -10 7 -273 30 145 189 -35 -16 278 27 -241 145 124 85 -69 90 142 261 -261 -87 -80 50 -252 -52
2733 -52 -345 49 -318 19 258 10 -241 -166 177 105 369 -158 -110 104 253 22 -107 -142 112 216 -255 -263
2755 -263 187 336 -16 69 -189 213 -115 -162 -111 -12 156 55 -56 187 20 -98 -67 -4 76 41 421 -92 73
2778 73 257 275 61 119 34 82 338 15 -255 -36 -166 228 -64 -114 123 -177 215 -317 -41 150 64 -411
2800 -411 74 320 -34 89 -92 0 -316 -4 -150 202 -158 -50 140 93 148 -298 122 -94 -24 -8 -26 -102
$$ packed form
2642AJ27k09l9O5l56L71pj9K36J52j29k06L6k67J45J23Jk1o48N50J68P6m59M04
2666I5L19l73k03M6L12p8l51j29M61l85J01L90m05J96J79k8o16L82J80k98N1l3
2688a87L34k90J60K59k29K59n48%K64n6n5J99n8k4j36K44k47J84P0J21n77L03
2710a0J7k80L03J15M4k24J9K94k51k68L86k1l9j54J59N2J19n22J74PJ30l02K00
2733e2k93L94l67L37K39k48k51P5L43p2K64n27M8K14J49k31j29l5K54J04m71q
2755b63M50J49l52Q5k58M02l28m7N1R9J68j01j11K43j67j18L1O3Q0l5L80n13J65
2778G3J84J8k14N8q5M8K56l23k70K19j30L94k92n0K37l00L92n32K76J91q6m75
2800d11M85K46l54J23j81R2l16L12j46L52l60J08J90m7N5m46M20k16P0J6j8p6
$$ plain form
2822 -102 73 50 80 -4 157 84 -199 -14 10 169 122 -331 14 213 -465 -29 -16 -17 139 13 38 198 -21
2845 -21 -4 -93 -61 -84 81 145 -252 -109 -122 183 -94 -7 241 176 54 62 121 -76 112 75 -168 -38 223 19
2869 19 108 -55 -222 287 117 -163 142 -150 -134 81 428 -125 -88 214 -196 -155 165 22 134 159 -263 -483
2891 -483 -249 -152 -239 60 -318 -11 168 98 51 6 33 89 -181 -68 -9 -276 332 -70 220 12 3 173 -301
2914 -301 -117 -164 191 200 -116 189 4 -40 -242 -45 -42 305 -139 -120 -43 -256 -122 226 38 43 -16 -50 95 -71
2938 -71 40 6 -59 238 232 -209 186 65 -291 150 65 124 154 -33 61 8 301 61 -3 -62 48 -113 92 24
2962 24 -31 -292 -60 -115 -58 -164 -34 57 82 30 203 32 -48 -169 -121 194 -13 -84 -256 -146 -253 -122 113
2985 113 17 58 -147 113 -46 190 133 -74 320 -59 -262 -254 66 167 -12 123 129 -153 76 213 -218 -138 -25
$$ packed form
2822a02J75k3L0q4J61p3k83J85K4J59m7m53L45J99o78M36J3jJ56j26K5J60k19
2845b1J7q9L2k3J65O4l97J43j3L05k77Q7K48o5j22QN9j97J88l7k43J30K61k04
2869A9Q9j63j67N09j70k80L05k92J6K15L47n53L7L02m10M1L20j43J12K5m22k20
2891d83K34R7q7K99l78L07J79p0m7m5K7N6k70J13N9k67O08m02K90k08rJ70m74
2914c01J84m7L55Rl16L05j85m4k02J97LL47m44J9P7k13J34L48j88Nn9l4J45j66
2938g1J11l4o5K97om41L95j21l56M41q5N9L0j87R4n3K93k40o4n9J10j61K05o8
2962B4n5k61K32n5N7j06J30R1K5n2J73j71q0j21M8L15k07p1j72J10j07J31K35
2985A13r6M1k05K60j59K36n7k07L94l79k03QL20J01j79J35Ok82K29J37m31Q0J13
$$ plain form
3008 -25 122 -107 10 52 1 284 -89 139 199 127 68 215 154 96 -75 77 193 216 -63 -142 125 -109 456
3031 456 379 -97 144 -177 -45 -11 -283 232 13 335 85 131 -90 -243 328 -67 42 101 9 121 -34 -289
3053 -289 -25 -35 -67 53 -15 -280 137 -188 -374 -57 4 171 89 -13 14 61 -172 53 190 115 -49 -8 383
3076 383 -305 -111 78 -36 158 67 144 -89 56 -148 295 -90 204 34 98 360 84 -485 -55 -249 -307
3097 -307 -108 31 23 -1 233 -120 -322 95 133 -134 -42 187 -175 -34 70 106 93 113 66 -121 -109 -158 126 -139
3121 -139 8 227 -25 -246 -21 -164 236 -212 220 95 -106 -33 -160 -178 239 104 21 -160 187 -112 -185
3142 -185 -225 -97 -49 -235 -174 -185 66 -145 1 508 197 253 35 86 10 -128 -91 50 -105 101 -114 133 155
3165 155 -203 -177 -269 -73 81 129 -128 -202 27 10 -64 120 -39 313 39 -325 110 -246 303 -258 -81 33
$$ packed form
3008b5J47k29J17M2n1K83l73K28O0p2n9J47o1n8j71J52J16K3k79p9K67k34N65
3031D56p7m76K41l21J32L4k72N15k19L22k50M6k21j53N71l95J09N9r2J12j55k55
3053b89K64j0l2J20o8k65M17l25j86L17O1J67q2j02K7M7k33K25J37p5j64M1L91
3076C83o88J94J89j14J94r1P7k33J45k04M43l85K94j70O4K62k76n69M30j94n8
3097c07J99J39qk4K34l53k02M17L8k67R2K29l62J41J04L6j3K0m7j87J2m9K84k65
3121a39J47K19k52k21K25j43M00m48M32j25k01P3j27j8M17j35q3j81L47k99p3
3142a85m0J28M8j86O1j1K51k11J46N07l11N6k18N1p6j38L7J41j55K06k15K47K2
3165A55l58K6r2J96J54M8k57p4K29j7p4J84j59L52k74l64M35l56N49n61J77J14
$$ plain form
3187 33 -213 -26 -2 -41 -71 -43 33 10 -197 23 -136 49 45 285 -129 209 -18 54 -289 -281 -47 220 -212 -156
3211 -156 45 -171 -27 22 379 52 374 -153 -60 -17 -103 27 75 -415 -114 -77 118 28 19 204 84 -95 -138
3234 -138 216 205 118 75 -60 48 20 13 80 170 209 -191 385 93 -131 -86 -243 -114 -309 -96 75 -17 73 -83
3258 -83 322 114 -223 176 188 34 -233 -113 139 -121 82 -11 -349 62 36 56 138 203 13 38 -47 2 98 -215
3282 -215 -442 148 -135 116 17 -9 -67 67 -48 278 96 -82 221 42 -114 -150 36 -45 167 -68 264 -312
3304 -312 -151 85 113 -184 32 98 227 2 112 76 166 18 218 83 71 -217 128 -134 -50 14 12 -131 166
3327 166 -304 34 108 -84 -15 -89 -345 -195 -6 19 -12 -222 -55 -82 267 -165 -96 139 -22 259 134 5
3349 5 91 170 212 29 198 -143 -2 264 -127 -354 138 -59 105 -42 154 -24 161 287 -98 -226 -175 305
$$ packed form
3187C3k46J87K4l9l0K8P6k3k07K20j59J85mK40m14L38k27P2l43QK34K67m32N6
3211a56K01k16J44M9L57l27L22n27R3M3q6J30M8m90L01L7J95r0rJ85j20j79m3
3234a38L54j1q7m3j35J08k8pO7R0L9m00N76k92k24M5j57J29j95K13J71r2R0j56
3258h3M05k08l37L99J2j54k67J20K52k60K03r3l38M11k6K0Q2O5j90K5q5M9R6l13
3282b15k27N90k83K51r9k6n8J34j15L26j82j78L03j79j56l6J86q1K12k35L32n76
3304c12J61K36K8k97K16O6J29k25J10l6R0j48K00j35j2k88L45k62Q4O4kj43K97
3327A66m70L38P4j92O9p4k56J50J89K5l1k10J67k7L49m32O9K35j61K81j25j29
3349EQ6P9M2j83J69l41J41K66l91k27M92j97J64j47J96j78J85J26l85j28N1M80
$$ plain form
3371 305 221 -104 -363 148 16 181 57 106 190 -59 -238 15 -97 -49 38 30 62 -61 214 -205 -157 -110 88
3394 88 118 94 59 -58 -408 -226 -41 -9 82 313 148 -94 183 -162 -250 284 127 80 -9 40 235 -34 111
3417 111 -274 -362 -86 -42 15 -212 40 69 -110 146 132 -33 -209 65 101 -204 21 -28 249 73 20 134 334
3440 334 -49 -121 62 135 163 -71 -197 -23 88 -222 365 75 -198 -158 -37 -99 79 98 -189 -160 395 -133
3462 -133 -120 68 282 -39 244 23 -179 260 -178 -1 -109 168 265 71 -97 -47 117 186 222 28 -52 -131
3484 -131 -123 19 108 -253 -104 70 5 -72 412 73 -314 187 377 -3 -394 97 87 63 333 -77 -29 97 -142
3507 -142 -75 179 133 -159 143 -120 -120 250 15 -229 159 -64 216 -148 -113 -26 10 -165 95 -135 -156 -223 15
3530 15 141 220 308 -73 88 68 9 145 105 -306 138 -53 -82 72 -189 217 80 57 250 102 -454 0 -105
$$ packed form
3371C05q4l25k59N11j32J65j24M9Q4k49j79K53j12M8Q7qL2j23K75m19M8M7J98
3394H8L0k4l5j17l50J82J85L2R1K31j65k42K77l45q8N34j57m7q9M9J95k69J45
3417A11l85q8K76M4N7k27K52K9j79K56j4j65j76K74L6l05K25m9K77j76n3J14K00
3440C34l83p2J83P3K8k34j26J74J11l10N87k90k73M0J21o2J78J9k87K9N55n28
3462a33J3J88K14l21K83k21k02M39m38J77j08K77R7j94j68N0J64O9L6j94q0p9
3484a31QJ42Q9l61J49J74o5p7M84l39l87N01J90l80l91M91j0k4K70m10M8J26k39
3507a42O7K54m6k92L02k63%L70k35k44L88k23K80l64L5Q7L6j75K60k30k1o7K38
3530A5J26P9Q8l81J61k0n9J36m0m11M44j91k9J54k61M06j37k3J93j48n56M54j05
$$ plain form
3553 -105 41 119 -143 220 -87 -169 -345 -174 -28 -74 -249 301 45 -7 174 126 -163 -232 73 -145 -9 -167
3575 -167 65 -217 -77 119 -51 -307 34 -207 106 13 253 -87 306 285 -192 199 -38 -48 -190 302 36
3596 36 273 -459 42 -52 14 60 -153 -36 -278 75 -128 -214 -39 -202 -147 90 11 -314 -277 -227 72 229 19
3619 19 240 -119 168 202 86 71 -268 210 24 -20 208 -5 162 -210 -322 8 29 -478 91 95 -219 -115
3641 -115 -241 2 12 100 123 -103 -74 -161 -61 82 154 -164 -175 -360 159 -24 327 214 -38 230 76 296
3663 296 365 -345 -95 56 86 242 -77 -147 -159 240 -149 -200 -90 -65 -10 -25 -233 -68 -226 291 171 -40 22
3686 22 -21 -129 136 52 -46 -92 -15 -32 -216 18 30 -88 165 -167 -388 -67 -271 -31 -169 -214 72 143 -107
3709 -107 16 169 225 38 16 -69 329 7 -43 -261 -26 -55 316 -232 -239 222 -172 124 -147 -211 -109 -164 -191
$$ packed form
3553a05J46P8k62L63l07q2j76J71J46m6j75N50k56n2J81m8k89o9L05k18J36j58
3575a67K32k82J40J96j70k56L41k41L13r3K40l40L93k1m77L91k37j0j42M92k66
3596C6K37p32N01r4O6M6k13J17k42L53k03q6J75j63N5K37p9l25L7N0K99J57k10
3619A9K21l59K87L4j16j5l39M78j86m4K28k13J67l72j12L30K1n07N69Ml14J04
3641a15j26K43J0Q8K3k26K9q7J00J43P2l18j1j85N19j83L51j13k52K68j54K20
3663B96O9p10K50J51L0J56l19p0j2L99l89n1J10K5N5j5k08J65j58N17j20k11O2
3686B2m3j08K65q4r8m6P7j7j84K34J2j18K53l32k21L21k04K40j38m5K86P1k50
3709a07J23J53N6j87k2q5L98l22n0k18K35k9L71n48pM61l94K96k71o4J02n5k7
$$ plain form
3732 -191 -180 -42 162 199 85 57 -84 144 59 286 153 94 382 -13 258 -210 -222 -9 38 -209 -138 53 -105
3755 -105 128 -271 -92 310 -182 243 -60 -113 -74 -107 28 389 179 152 340 65 137 -30 146 184 186 210 -43
3778 -43 190 59 -159 115 61 -31 -170 -89 361 19 -69 279 -64 54 62 -166 8 130 168 -27 -86 -190 73
3801 73 71 -280 53 45 -24 -40 91 -111 29 -96 281 48 209 -232 -67 -121 203 64 -302 -64 -34 -46 -386
3824 -386 -264 -168 -224 -78 112 -4 -57 -210 -22 133 36 -111 57 137 181 -115 79 228 -100 -272 -101 -191
3846 -191 -98 226 54 145 -122 -164 -60 -58 42 67 -59 -327 -97 -220 9 39 117 -77 -40 15 -105 -28 -146 7
3870 7 -14 -370 31 28 -107 -8 -171 67 -182 -190 152 -90 -40 54 -164 -98 188 -98 108 189 237 -138 -198 -129 -36
3895 -36 45 -13 433 69 -282 -260 -11 -104 -91 -167 204 -247 19 11 -25 272 73 93 164 214 -99 69 -191 -67
$$ packed form
3732a91J1J38K04L7j14k8j41K28q5K27j33n9K88l95K71m68j2K13M7k47P1J91j58
3755a05K33l99J79M02m92M25l03n3L9l3J35L61k10k7J88k75P2j67J76L8KK4k53
3778d3K33j31k18K74n4r2j39Q1M50l42q8L48l43J18Qk28J74J22L8j95n9j04K63
3801G3kl51L33qo9j6J31k02J40j25L77k33J61m41J65n4L24j39l66K38L0j2l40
3824c86J22R6n6J46J90j16n3j53J88J55r7j47J68Q0M4k96J94J49l28j72J71r0
3846a91R3L24j72R1k67m2J04KJ00K5j26k68K30j23K29L0P8j94L7N5j20P7j18J53
3870Gk1l56M01lj35R9j63K38k49qL42k42N0R4k18O6K86k86K06Q1M8l75o0O9R3
3895c6Q1n8M46l64l51K2K49r3J3p6L71m51K66ql6K97j99K0P1N0l13J68k60J24
$$ plain form
3919 -67 240 23 -386 -21 250 -30 -147 52 43 -133 173 107 -121 -120 -56 -441 162 44 189 79 193 -79
3941 -79 68 -65 -156 -6 203 -65 -130 104 222 200 -25 59 -18 -193 57 65 -362 -84 -40 357 -160 -99 -247
3964 -247 139 -291 133 23 -65 81 -15 217 -151 -118 51 -96 -231 -234 -146 29 -137 -137 -35 -57 325 31 164
3987 164 372 -61 -9 -74 -241 -78 300 20 244 -122 -188 433 -57 234 -269 -253 182 -267 341 338 173 40
4009 40 149 -23 -142 -338 -16 -135 -26 93 94 -37 88 58 74 -29 121 -278 -315 220 -7 210 397 -18
4031 -18 128 -35 -124 0 -34 -190 -6 176 -97 43 -166 163 -265 112 307 -258 -110 96 113 11 -210
4052 -210 -23 203 187 36 98 227 -84 141 -229 450 228 -474 210 -9 -35 -164 75 -24 176 -117 -25 -106
4074 -106 -145 115 -56 148 -5 -230 -42 -24 213 -82 -61 -273 172 189 133 60 14 41 73 6 271 306 -41 -35
$$ packed form
3919f7L07k17m09L65K71k80j17J99rj76L06o6k28JO4l85O03j18J45j10J14k72
3941g9J47j33r1J50K09k68o5K34J18k2k25Q4p7j75K50Qm27K78M4L97n17O1j48
3964b47L86m30M24j10q8J46r6K32l68L3J69j47j35lQ8J75j66%J02k2L82k94J33
3987A64K08m33N2o5j67J63L78k80K24l66o6O21m90K91n03J6M35m49O08lj65j33
4009D0J09j72j19j96L22j19J09J19Jj31J25l0J6j03J50l99l7N35k27K17J87m15
4031a8J46j63q9J24l4j56J84J82k73J40k09L29m28L77J95n65J48K06J7j02k21
4052b10J87K26j6j51O2J29l11K25l70O79k22p02O84k19k6j29K39r9K00k93R2q1
4074a06l9K60j71K04j53k25J88J8K37k95K1k12M45J7n6p3m6K7L2o7K65L5l47O
$$ plain form
4098 -35 97 52 31 -150 -172 152 166 427 -120 62 -27 -14 -112 -394 -54 52 -246 -181 102 -39 30 -62 94 -125
4122 -125 77 131 33 123 181 -31 72 -164 144 323 -21 -67 79 157 -142 -75 -169 358 109 -154 -175 -163 -156 -292
4146 -292 -339 -11 243 17 257 303 96 -246 -208 43 44 -45 -171 -20 360 128 -153 172 129 -170 -114 6 -226
4169 -226 -336 142 122 199 134 201 -132 71 68 -14 -180 171 -90 28 -323 -36 178 -46 348 115 260 64
4191 64 375 91 -8 129 -142 95 136 -274 -86 -121 48 49 54 -260 41 87 79 45 117 -47 -563 51 -156 246
4215 246 68 220 96 154 -124 63 -113 5 140 -209 143 -54 112 208 167 -3 220 20 -317 70 -112
4236 -112 -12 -194 -368 -33 55 -33 -201 45 16 97 -261 -88 194 112 -75 -32 -318 99 -202 -152 127 -160
4258 -160 24 -241 -171 -77 147 -122 95 -166 -67 -152 138 183 -8 -115 11 -53 -125 -76 23 158 -215 20 110
$$ packed form
4098c5J32m5k1j81k2L24J4K61n47J82q9J3r8k82L40J06k98O5K83j41O9r2J56k19
4122a25K02N4r8R0N8k12J03k36L08J79l44m6J46P8k99O7r4N27k49k63k1J2Pj36
4146b92m7L28K54k26K40M6k07l42L8K51Jq9j26J51L80k32k81L25m3k99N6J20k32
4169b26j10M78k0P7o5O7l33K03lq2j66L51k61J18l51K87K14k24L94k33J45j96
4191F4L11k84r9J37k71K37M1m10J88l5J69JNl14L01M6ql4P2j64n16O14k07M02
4215B46j78J52j24N8k78J87j76J18J35l49L52j97J66R6m1j70K23k00l37L87j82
4236a12J00j82j74L35Q8q8j68K46k9Q1l58J73K82q2j87M3k86M17l01N0K79k87
4258a60J84k65P0R4K24k69K17k61R9q5K90M5j91j07J26o4p2M9R9J35l73K35R0
$$ plain form
4281 110 -208 50 -122 -150 139 188 271 117 61 5 68 251 233 -21 315 -82 7 161 54 -29 80 -41 -8
4304 -8 -16 -177 -22 -50 -101 -101 289 -71 -138 104 -165 -80 -159 -75 80 -229 25 100 318 -163 159 210 159 6 158
4329 158 -178 360 -46 217 100 -89 -19 0 -198 163 -223 -4 -309 -51 -107 -71 131 -70 -40 65 -106 227
4351 227 -35 169 2 170 140 18 50 -55 -217 -302 -122 150 -379 -15 29 126 150 -313 31 114 222 245 -168
4374 -168 -141 159 -326 -44 163 81 -204 -283 70 326 -251 227 50 55 -62 4 -142 266 102 8 -23 23 -133
4397 -133 -259 120 70 38 -257 -91 -216 -54 -142 44 68 11 37 101 5 -179 19 74 -172 -7 19 -317 278
4420 278 -30 -126 144 -254 466 -60 -94 -28 -23 -228 149 235 90 419 -237 -34 -31 -76 110 -375 138 162 -122
4443 -122 75 146 34 20 148 -22 119 -91 -70 -161 160 203 302 296 -54 -22 -156 -202 -178 126 -141 -12 131 72
$$ packed form
4281A10l18K58j72k8K89M9Q3j54n6n6O3J83j8k54L36l97Q9J54j07q3J09j21L3
4304hqj61J55k8n1%L90l60o7K42k69Q5p9Q4J55l09K54P5K18m81L22N1n1j53J52
4329A58l36N38m06K63j17j89P0J9j98L61l86K19l05K58n6L6K02k01L0J05j71L33
4351B27k62K04j67J68l0j22L2j05j62q5J80K72n29L64M4R7K4m63L44Q3J08K3m13
4374a68K7L00m85K82K07q2k85p9L53K56n77M78j77Nj17O6j46M08j64r4l1M6j56
4397a33j26L79n0l2k95J66j25J62q8J86K4n7K6O4r6j84J98N5k46J65K6l36N95
4420B78l08r6K70l98P20n26l4O6Nk05L77Q6j45L29o56K03Lm5J86m85N13K4k84
4443a22J97P1j12j4J28j70J41k10K1r1L21M3R9ol50L2j34m6K4L04k67J29J43n9
$$ plain form
4467 72 35 131 143 -176 106 25 -11 -112 23 -120 22 -186 -107 113 -100 -202 -21 17 -207 116 208 -296 -225
4490 -225 106 49 -80 -180 -74 178 108 411 -113 17 -32 -109 -57 17 36 406 337 263 262 52 230 -77 81 -163
4514 -163 -116 171 41 -82 -58 -10 -149 -148 301 -103 -302 -67 -183 -183 412 -124 174 106 -170 210 165 243 36
4537 36 397 -80 -142 -113 -138 144 -134 58 -155 79 41 253 296 -243 70 22 136 -45 -74 91 -67 -87 -4
4560 -4 -41 57 -89 -11 -110 -147 50 -214 36 -142 -60 11 249 -230 17 47 263 -82 -11 -140 -135 -73 292 231 57
4585 57 68 -76 -132 -32 133 51 -251 -78 -302 -112 126 -6 -46 77 378 -27 -83 -331 14 -107 -120 -220
4607 -220 -190 47 82 -442 -24 184 168 -97 -82 -269 -100 53 -76 128 -18 129 0 118 79 -100 -7 204
4629 204 29 37 -22 -11 -84 137 31 -246 110 -279 135 38 28 114 -378 -429 103 -251 105 -40 118 162 -46
$$ packed form
4467G2l7R6J2l19K82q1l6j01J35j43J42k08P9K20k13j02J81L8k24L23R2n04P1
4490b25L31n7j29j00J06K52p0L03n24J30m9p7N2P4J9L70o9p4jk10J78l07J58k44
4514a63M7K87j30j23K4M8j39JM49m04j99K35j16%N95n36K98o8k76L80m5P8k07
4537C6L61m77o2K9k5K82k78J92k13K34l8K12M3n39L13m8J14j81k9J65j58k0Q3
4560dl7R8j46P8r9l7J97k64K50j78Q2P1K38m79K47L0K16l45P1j29NO2L65o1j74
4585E7J1j44n6J00J65q2l02J73k24J90K38j32m0J23L01m05n6k48L45j21j3j00
4607b20L0K37L5n24M18K08j6k65J5j87J69J53j29K04j46J47j29J18l9j79R3K11
4629B04j75Qn9J1p3K21j06k77L56l89M14r7j0Q6m92n1N32l54L56j45J58M4k08
$$ plain form
4652 -46 -94 -78 -207 341 216 55 66 -30 -15 523 130 -159 165 366 -60 352 84 -135 23 21 -25 -21 -17 316
4676 316 97 68 -95 -300 -95 137 16 31 -45 94 40 43 50 -29 -121 36 -26 -216 -262 207 -348 -2 -171 -109
4700 -109 166 -65 -42 -86 12 -143 125 173 -81 -62 -195 125 75 2 45 1 174 47 -7 72 109 92 17 248 64
4725 64 409 15 -26 -65 -187 -15 -414 157 -257 -4 315 55 -81 -79 0 70 -404 -10 -53 -150 19 112 -34
4748 -34 60 -235 211 -35 -166 -188 -142 1 -43 -158 -15 164 50 -37 -128 60 -68 46 -167 431 -95 -181 -196
4771 -196 97 316 142 18 -177 -23 132 180 -48 -456 -229 180 -215 -22 216 7 38 98 212 -9 53
4792 53 115 95 -95 157 172 -188 197 19 71 -38 -97 -27 19 38 294 320 -27 26 -469 8 -249 151 258 15
4816 15 6 408 -232 150 -154 -26 96 205 -78 -146 -139 -16 166 -110 91 -248 133 -4 106 -240 2 -276
$$ packed form
4652d6m8J6j29N48j25j61J1r6J5N38l93k89L24K01m26M12k68k19J58km6MML33
4676C16k19k9j63k05K05K32j21J5p6J39n4LPp9r2J57o2j90m6M69n55L46j69O2
4700a09K75k31K3m4R8j55K68M8k54J9j33L20n0p3M3m4J73j27n4P9L7j7p5K31j84
4725F4L45l94m1l9j22J72l99N71m14K53L19k60j36KP9P0m74L94m3r7J69R3j46
4748c4R4k95M46k46j31k2M6J43m4j15J43J79j14q7r1J88j28J14k13N98n26q6j5
4771a96K93K19j74j24j95J54J55M8k28m08K27M09l95J93K38k09L1O0J14k21O2
4792E3O2k0j90K52J5l60L85j78N2j09n9P0M6J9K56K6l47N3m95M77k57M00J07k43
4816A5rM02o40L82l04J28J22J09k83o8PJ23J82k76K01l39L81j37J10l46K42k78
$$ plain form
4838 -276 86 114 -10 40 -123 -42 -301 -44 -300 -63 -14 17 -30 -10 -38 -305 -85 49 299 -163 -82 6 16 -5
4862 -5 38 450 64 -215 174 226 263 265 -9 62 266 -209 -22 -45 138 -56 69 5 -45 -91 -189 31 87 -114 -146
4887 -146 19 -35 -5 -23 -155 136 -160 -124 56 -53 266 -182 -132 19 101 264 -92 -103 133 -47 -207 -71
4909 -71 125 146 271 133 -262 20 -107 284 280 314 -174 -11 300 24 -258 -182 159 256 105 -187 154 2
4931 2 -34 2 38 17 189 -181 -187 291 -135 -5 28 -66 -44 -304 -163 225 -147 -15 -231 -290 168 -491 -563 146
4955 146 265 151 -5 -79 9 20 218 -234 -36 241 -157 -142 -63 -22 -97 65 126 -46 9 -180 -186 315 259 8
4979 8 280 -197 72 330 124 1 221 -57 222 79 -184 309 -115 -80 -95 -209 -38 73 -198 -127 19 -98
5001 -98 -126 304 -234 -1 12 -251 -108 -56 -145 -168 -94 42 100 -291 236 77 247 57 -40 9 -31 77 -131 -194
$$ packed form
4838b76L62K8j24N0j63Q1k59K57k56K37M9L1m7K0k8k67K20J34K50m62Q1Q8J0k1
4862eM3M12l86k79L89N2L7Kk74P1K04m75J87k3J83j94J25o4n0m6r8K20N6k01l2
4887a46J65n4L0j8j32K91k96L6J80j09L19m48N0J51Q2J63l56j1K36j80j60J36
4909g1J96K1J25j38l95K82j27L91mL4m88J63L11k76k82P6L41R7j51k92L41j52
4931Bl6L6L6k1J72l70oM78m26J30L3r4K2k60J41L88l72J32k16n9M58o59p2P09
4955A46J19j14j56p4Q8J1J98m52J98K77l98J5P9M1p5J62O1j72N5j89oN01n6k51
4979HK72m77K69K58k06j23K20k78K79j43k63M93m24L5j5j14J71J11k71P1J46j17
5001i8k8M30n38K33J3k63J43N2q9k3P4J36N8l91N27j59J70j90r7M9m0J08k08o3
$$ plain form
5025 -194 130 27 -14 -96 127 -104 -35 -62 -132 -32 -184 84 135 -211 -139 170 152 30 245 68 22 314 -45
5048 -45 54 -163 180 117 -366 -160 -142 -63 -25 -143 109 109 100 -258 30 -88 -267 -435 -180 -340 -169 -135 108 -194
5072 -194 -197 218 111 130 -62 -64 -2 120 -70 95 152 -261 25 -15 -89 26 -43 20 14 119 117 -69 -15 -44 43 -27
5098 -27 129 275 19 -22 -27 -11 24 -218 47 -168 174 -256 -8 -101 316 -141 124 110 -9 12 37 -4 -98 263
5122 263 -106 193 -18 51 -131 226 -33 136 -102 68 260 277 -52 167 25 -33 -197 50 -367 -121 326
5143 326 124 144 131 -40 82 111 -32 -297 -10 -56 -79 236 -242 -85 17 -196 112 30 69 198 -254 216
5165 216 -199 79 -17 173 119 162 156 -59 201 135 242 -269 -194 15 -95 231 -32 -81 361 -78 88 -246 180
5188 180 -37 92 -4 14 -158 -31 39 234 1 101 208 173 -198 -255 101 -241 275 -57 -58 127 -102 12
$$ packed form
5025a94L24j03m1q2K23k31O9k7p0J00j52K68N1l46P2L09j8j22K15j77m6K92l59
5048d5R9k17L43o3m83K06J8P9L8j18K52%rl58K88j18j79j68K55j60J71L4K43l02
5072a94lM15j07J9j92kO2J22j90J65N7m13K86m0p4J15o9O3oJ05kj86N4k9Q7p0
5098b7J56J46k56m1nJ6L5k42K65k15L42m30K48r3M17m57K65j4j19K1K5m1r4L61
5122B63l69K99k11O9j82L57k59J69k38J70J92J7l29K19j42n8j64K47m17K46M47
5143C26k02K0j3j71J22K9j43k65K87m6k3L15m78J57J02k13L08q2L9J29m52M70
5165B16m15K78r6J90n4M3ok15K60o6J07n11P5K09j10L26k63m9M42m39J66l34M26
5188A80k17J29r6J8j72J27P0J95k33J00J07l5l71n7L56l42N16l32jJ85k29J14
$$ plain form
5210 12 -158 -84 -252 -183 -33 -59 151 129 -197 17 -17 54 60 -305 -41 196 -46 -103 -3 -26 251 167 197 -39
5234 -39 -56 -359 -101 -56 150 78 156 165 -114 225 204 -342 253 171 -14 65 -229 -90 -66 265 355 -33 208 -64
5258 -64 269 88 -251 4 -31 84 -80 5 149 -82 -70 -188 -2 42 285 -203 -113 153 -444 -17 65 43 -141
5281 -141 -64 -260 -157 -325 0 -264 -29 59 298 72 -26 -57 -108 -43 210 225 117 83 110 102 -50 -212 -38 -241
5305 -241 -108 185 4 58 -66 -42 -138 53 284 2 51 63 -237 -64 -262 -766 -56 -104 -214 -14 384 44
5327 44 -223 -57 106 196 -99 129 112 -91 354 91 28 -256 -154 -188 102 109 44 -134 -137 -150 -20 -89 -214 -161
5351 -161 -96 -231 48 98 120 41 254 -246 44 -75 -117 -119 200 11 -26 -64 -52 -108 165 3 123 303 117 102
5375 102 60 -39 -82 205 120 134 198 43 -174 -42 88 -18 70 18 158 137 48 170 -42 -93 -84 -53 -31 185 -117
$$ packed form
5210A2j70P4j68O9J50k6K10k2l26K14l4P1Ol65K64K37k42n7J00k3K77q4L0k36
5234c9j7l03K58M5K06p2P8Rk79L39k1n46N95q2j85P9k94J39K4L31R0l88K41k72
5258f4L33j81l39K55l5J15j64Q5J44k31J2j18J86M4K43m88R0K66n97M27Q2k2j84
5281a41P7j96J03j68L25k64K35Q8K39k26r8l1n1O5K53J5j08l4K7qj52j62J74k03
5305b41J33K93j81N4j24K4r6J91K31k82M9J2l00J73j98n04P10m8j10K00L98l40
5327D4k67J66J63R0k95K28j7k03M45k63o3k84J02l4K90Po5j78lj3J30o9j25N3
5351a61O5j35K79N0K2p9K13n00K90j19m2kL19j89l7l8J2n6K73j62J20J80j86j5
5375A02m2r9m3K87q5J4O4j55k17J32J30j06Q8n2J40k1q9J22k12n1RL1K2K16l02
$$ plain form
5400 -117 -292 28 26 -148 -151 -76 -174 428 -377 -134 81 282 200 -47 234 -111 -350 -9 21 -214 -278 99 80
5423 80 113 -73 -407 315 -316 -2 63 190 24 -164 25 -290 -51 35 83 -143 -48 -52 -263 18 -47 -140 -68 113
5447 113 -172 -210 228 138 -217 4 -148 152 474 97 36 -126 -21 7 95 79 207 196 66 87 58 -72 60
5470 60 -114 89 45 84 -285 306 143 -198 -135 319 -172 -57 240 -108 -234 133 1 -309 -96 8 -222
5491 -222 -197 -118 -179 -293 -51 -9 -54 -9 -6 -95 251 -123 -87 177 -14 107 144 6 40 -168 -257 110 -170 -264 51
5516 51 105 -101 -83 269 -42 -87 -136 -66 -151 193 105 -240 -78 -79 379 -361 102 -275 -359 -474 90 -40 257 48
5540 48 44 -41 -59 5 -30 163 -290 -42 44 -12 -85 -71 85 -226 -117 -129 88 1 68 -20 230 -351 294 65 402
5565 402 -179 -214 72 35 -144 98 192 30 161 -54 97 29 33 -268 -58 -103 -147 -117 167 227 -176 362 -116
$$ packed form
5400a17j75L20kj74lP5r8O02q05K43K15K01q2k47K81l45k39L41L0k35o4L77j9
5423H0L3j86l34P22o31L14O5J27j66j88J89l15K39Q6M8k26R5mk11K81o5r3P2J81
5447A13k85l8M38r0l55K21j52L00L22l77o1j62J05K8Q8j6J28j1j30K1k9j30J32
5470F0j74K03m4L9l69N91j63l41O3M54m91J15K97l48j26L67j32l10K13J04k30
5491b22K5P9o1j14K42M2m5M5Lq9L46l74L6K64j91J21L7j38L4k08q9L67k80r4L15
5516E1N4k06J8L52l11m5m9P0q5L44q8l45J62jM58p40M63l77q4j15N64j30K97k09
5540D8mq5j8O4l5J93m53K48Q6n6p3J4J56l11J09j2K17q7O7q8K50n81O45k29L37
5565D02n81l5K86l7j79K42R4j62J31k15J51o8Ml01K10m5m4L0K84O0m03N38m78
$$ plain form
5588 -116 -151 233 -43 149 -160 230 129 297 114 -47 199 151 -64 132 98 90 -71 63 41 -118 215 11
5610 11 90 -306 -175 -175 -324 -117 39 -297 331 46 -99 23 -264 208 -229 -99 259 230 -187 -59 285 52
5632 52 614 -213 30 110 -24 -64 -2 198 102 149 157 -134 306 -148 -193 -351 112 -3 56 -194 -132 48 -233 147
5656 147 -274 91 12 267 67 38 207 133 -29 103 -41 -65 42 -28 -331 -176 -82 200 -113 -15 -146 -92 369
5679 369 -231 63 235 -284 41 -302 107 -173 -254 -143 -69 235 -70 179 -78 266 49 -36 -122 151 -214
5700 -214 51 105 -140 274 262 -51 92 -90 -2 149 35 -134 406 -171 7 -165 -25 356 136 -191 -378
5721 -378 -57 110 90 -199 3 -34 -234 70 132 31 203 -256 328 -75 87 101 382 -125 -59 -166 241 -186
5743 -186 80 -135 -190 147 -158 -37 -112 71 77 -168 -4 47 290 -318 89 97 -320 249 -241 275 20 26 65
$$ packed form
5588a16l5L84k76J92l09L90j01J68j83j61K46m8k15J96l4qj61J34k2j59L33k04
5610A1P9l96J31%j49K07J56l36O28k85j45J22k87M72m37J30L58k9m17J28L44k33
5632E2N62q27K43Q0j34m0O2K00r6M7Qk91M40m54m5j58M63j15N9k50O2J80k81L80
5656A47m21L65p9K55k00k9J69p4j62J32j44k4J07p0l03J55R4K82l13R8j31N4M61
5679C69o00K94J72n19L25l43M09k80q1J11P4L04l05K49k57L44k17q5q6K73l65
5700b14K65N4k45M14j2l13J43j82Q8J51j14j69N40n77J78j72J40L81k20l27j87
5721c78L21J67k0k89K02l7k00L04O2j01J72m59N84m03J62J4K81n07O6j07M07m27
5743a86K66k15n5L37l05J21p5J83Ok45J64N1K43o08M07Qm17N69m90N16k55OL9
$$ plain form
5766 65 -272 -5 356 -9 70 272 41 216 -58 -186 -104 29 -53 -225 -26 -172 32 -312 -74 360 -189
5787 -189 -89 158 -316 -320 -265 -178 -337 22 -211 308 -68 26 211 -118 -95 -70 -90 160 20 96 354 -37 112
5810 112 -93 -143 -365 294 94 -21 -349 161 -256 -88 22 -139 -73 -70 -10 -54 -47 230 -200 -119 69 -120 98
5833 98 -142 278 -122 302 96 -55 81 63 -44 127 -56 122 202 -229 6 157 -9 274 -6 -146 56
5854 56 13 -241 -6 -171 -110 -33 71 240 147 108 91 229 -56 -87 56 -298 272 45 -101 -3 -200 85 120
5877 120 -16 15 338 163 126 36 76 354 157 41 54 74 79 171 -119 -33 207 -38 175 -55 -175 168 -43
5900 -43 -69 -132 -7 47 -375 -145 -202 -72 -107 -212 -7 -63 -107 90 66 -6 -18 49 -161 -189 219 117 234 94
5924 94 -118 -143 70 73 171 -73 272 -248 42 -88 -1 -154 -146 -31 132 47 287 172 -79 12 171 91 -308 -117
$$ packed form
5766F5l37K67L61l65P9K02k31J75k74j28Q2J33q2j72J99j46K04l44K38M34n49
5787a89J00K47m74mN5Q7j59L59k33N19l76R4J85l29K3K5k0K50j40P6K58l91J49
5810A12k05n0k22O59k00j15l28N10m17J68J10j61O6LO0m4PK77m30Q1J88j89K18
5833I8k40M20m00M24k06j51J36j8j07J71j83J78Q0m31K35J51j66K83k80j40K02
5854E6m3k54K35j65O1P7J04J69r3l9j7J38k85l1J43l54N70k27j46R8j97K85L5
5877A20j36L1L23j75l7r0M0K78j97j16J3K0NR2k90Q6K40k45K13k30j20L43k11
5900d3k6o3J25N4m22K30n7J30l5j05K05n6m4J97k4p2j2O7k10k8M08j02J17j40
5924I4k12k5K13LR8k44L45n20K90j30Q7j53QJ15J63q5K40j15k51R1J59q0l99J91
$$ plain form
5948 -117 -295 -108 -359 -17 145 -69 -110 89 -74 -144 136 -287 -9 256 -159 502 0 194 -65 -30 -205
5969 -205 270 401 78 8 212 37 13 185 -52 -11 70 122 -133 185 -50 171 -76 200 -1 140 255 40
5991 40 -312 -149 98 -225 53 -248 -33 -164 -16 -206 -154 219 98 -26 -241 -228 11 58 -18 113 124 179
6013 179 -35 -75 34 274 -76 -148 -307 263 104 -259 275 -24 -7 -98 -107 34 121 164 101 -212 -95 -146 -217 -165
6037 -165 108 -211 -22 285 43 178 47 175 166 -26 113 -118 -146 71 315 338 53 5 143 519 -281 66
6059 66 -93 274 87 284 183 -3 7 224 -1 236 88 -91 -64 169 102 -92 234 -197 292 29 10 -160
6081 -160 -62 -408 -40 -117 128 -1 24 85 -125 -18 86 -257 -37 -115 -46 -77 -246 -247 -37 174 105 288 156
6104 156 -324 -376 -373 -67 -163 -311 -66 250 -217 42 -10 95 161 -63 -215 -47 -1 70 109 68 -32 -47 396 -225
$$ packed form
5948a17j78J87k51L42J62k14m1J99j63p0K80m23K78K65m15O61n02J94k59L5j75
5969b05M75J31l23p0K04j75k4J72k37M1Q1N2k55L18k35K21k47K76k01J41J15k15
5991D0l52J63K47l23K78l01K15j31J48j90N2L73j21j24k15J3K39M7p6J31J1N5
6013A79k14m0J09K40l50p2j59N70j59l63N34k99J7r1rJ41Q7M3o3l13J17n1p1N2
6037a65K73l19J89L07k42J35j31J28rj92J39k31k8K17K44K3k85m8J38L76q00L47
6059F6j59L67j87J97j01j86J0K17k25K37j48j79K7K33o7j94L26m31M89k63j9j70
6081a60R8l46L68p7K45j29K5O1k10J07J04l43K20p8O9l1j69jK10K11o9J83j32
6104A56m80n2LL06r6j48K45L16m67K59n2J05O6k24j52J68M6P1L9m1j00j5M43o21
$$ plain form
6128 -225 -229 -9 144 -4 79 150 -195 55 -110 -50 -221 256 -373 199 20 113 2 -344 114 285 -27 311
6150 311 -130 70 -37 -66 -62 -176 183 -223 43 -36 226 129 99 -20 -128 254 -107 233 123 -97 -252 -53
6172 -53 115 -3 124 -234 174 123 102 -22 -83 -235 172 -43 -332 341 -46 96 -110 -176 -25 -63 -282 19
6194 19 -51 -145 -20 3 -267 -25 -32 -135 65 -134 116 -31 75 -3 160 -127 -297 -43 -60 -30 -33 50 14 -128
6218 -128 -130 -126 128 263 271 104 -69 -150 93 -5 -261 67 -66 28 120 -2 -22 51 44 47 68 -11 557 152 47 -140
6244 -140 219 184 251 112 206 -205 160 -9 -96 -108 -45 -95 -262 57 -4 124 -129 -36 287 -75 77 -362 78
6267 78 -58 57 -179 -360 261 73 12 -124 49 -232 34 2 -175 -65 90 -167 -77 261 254 71 283 67
6289 67 223 -262 299 55 48 147 -315 -95 -127 -73 -108 -80 5 -74 56 117 -176 -20 -53 -145 5 22 0 -109 -167
$$ packed form
6128b25mK20J53j48Q3P1l45K50j65O0j71M77o29N72j79R3j11l46M58J71l12L38
6150C11m41K00j07k9Mj14L59m06K66p9K62r7l0j19j08L82l61L40j10k20j55J99
6172e3J68j18J27l58M08n1k1j24o1j52M07k15k89O73l87J42k06o6J51l8k19L01
6194A9p0r4J25K3k70K42pj03K00j99K50j47J06p8J63k87j70K54j7L0lQ3l6j42
6218a28kMK54J35Qj67j73q1K43r8k56L28j33R4R2j22k0P3pLK1p9N68m05j05j87
6244a40L59l5O7j39R4m11L65j69q7j2O3n0j67L19o1J28k53R3L23l62J52m39M40
6267G8j36J15k36j81O21j88o1j36J73k81K66l2j77J10J55k57R0L38pj83K12k16
6289F7J56m85N61k44pR9m62K20l2N4l5K8Q5p9J30O1k93J56l3r2J50J7k2j09n8
$$ plain form
6314 -167 -139 -138 -172 -244 224 -241 -110 16 -315 -196 253 -166 -57 71 -63 95 -16 -28 -118 -37 31 229 -73
6337 -73 201 80 26 82 74 -287 -62 -63 119 253 350 -19 -335 -50 -148 -60 -119 -147 190 262 27 182 74 -7 131
6362 131 70 330 -164 -32 194 -173 168 -66 157 67 23 -517 125 -55 -105 101 103 72 -54 368 123 158 -94
6385 -94 -35 134 48 -10 182 277 215 17 -61 11 -87 -46 -131 -102 -138 -78 66 -10 161 61 -208 77 -56 190 -231
6410 -231 218 196 186 291 50 47 -93 106 235 57 -302 -48 17 39 -331 57 -123 -33 -53 2 -96 9 20 -2
6434 -2 -241 -72 -79 -247 -15 159 12 96 262 -323 -117 93 116 -261 -263 38 -101 11 -61 572 220 50 2
6457 2 130 -159 -41 94 158 75 -6 145 123 -76 259 -232 -69 234 -128 -35 153 -133 209 116 -162 306 58
6480 58 -156 -131 -213 246 -417 -191 -74 62 5 -203 -84 112 114 363 225 -42 285 -4 138 42 33 345 10
$$ packed form
6314a67K8Jl4p2M68m65J31J26l31J19M49m19J09J28j34J58j11j2r0Q1O8J98l02
6337g3K74j21n4N6ql61K25jJ82J34R7l69l16K85r8Q8n9k8L37P2k35J55j08q1J38
6362A31o1K60m94J32K26l67L41k34K23r0m4n40O42j80n0K06Kl1j26M22k45L5k52
6385i4N9J69q6n8J92R5o2j98p8P2r8M1q5K9l6O0J44p6J71j00k69K85j33K46m21
6410b31M49k2j0J05k41lj40J99J29j78l59K54O5K2l70L88j80R0k0N5r8J05J1k2
6434bk39J69pj68K32J74j47Q4J66n85K06K10K3l77kL01j39J12p2O33l52j70m8
6457BJ28k89J18J35O4q3q1J51k2j99L35m91J63L03l62R3J88k86L42r3k78M68k48
6480E8k14K5q2M59o63K26J17J36n7k08J19J96KK49j38k67L27k89J42r6rL12l35
$$ plain form
6503 10 -88 232 62 -186 -9 102 53 144 -160 -120 138 -42 157 -121 21 209 -162 182 20 241 213 139
6525 139 -375 78 -22 124 29 86 188 126 -15 -194 235 31 -187 35 326 -103 -131 135 -407 204 -138
6546 -138 155 125 123 71 -177 107 225 46 -117 -219 22 -202 -111 -199 237 -241 151 127 -320 3 -62 -125 77
6569 77 96 -240 109 -135 19 3 -6 -48 183 -220 331 -435 -123 85 -84 -136 -285 42 109 164 -62 -83 -32 65
6593 65 64 0 -26 231 -269 -222 -63 52 148 -105 -86 162 241 -54 136 296 21 321 82 -144 96 -166 26
6616 26 17 -189 -83 162 -134 244 139 201 -76 246 286 59 -184 -205 54 -12 37 -192 5 -110 -178 -95 -160 145
6640 145 -169 -301 128 296 -240 52 122 61 25 -139 -335 54 -125 345 113 -49 81 -101 -96 275 33 -217
6662 -217 -141 -110 -91 224 -83 -249 -215 -132 203 94 118 142 -308 88 60 326 -114 5 -164 -31 234 129 -271
$$ packed form
6503A0r8L20j70k48J77J11m9R1l04M0K58j80J99k78J42J88l71L44j62K21k8p4
6525A39n14M53j00J46r5N7J02o2j41j79M29k04k18K22K91m29k8K66n42O11l42
6546a38K93l0kn2k48K84J18j79j63j02K41k24R1q8M36m78L92k4m47L23o5o3K02
6569G7J9l36L49k44J54j6rm2K31m03N51p66L12K08j69n2j49L27O7N5k26k1N1R7
6593F5jo4k6K57n00M7J59J15R6k53J9K48P9k95J90J60k75L00k39k26K40k62J92
6616B6rk06J06K45k96L78j05O2k77L22M0k27k43k1K59o6M9k29J97j15o8Q3o5L05
6640A45l14j32M29J68n36K92P0o1l6j64j96L89j79M70k32j62J30j82NL71k42k50
6662b17P6L1J9L15l07j66L4Q3L35j09K4K4m50L96k8K66m40J19j69J33K65j05m00
$$ plain form
6685 -271 40 -33 -115 -65 337 -32 -7 -326 5 -258 -69 -255 -149 276 28 23 -256 42 -123 85 -184 110
6707 110 86 -76 104 100 -42 -85 -222 -18 -125 46 -141 -286 -418 102 212 -164 -32 -187 108 388 -226
6728 -226 -237 -47 -39 -16 162 -182 107 253 -125 -24 0 157 -233 297 -45 -17 -177 -210 17 24 -202 -12 -312
6751 -312 258 1 -1 -229 -32 0 -109 -67 62 195 -40 17 -388 -70 87 -185 79 -32 -146 241 56 -5
6773 -5 -64 -36 -258 388 -30 18 113 -110 213 28 -123 157 0 -66 125 90 -185 184 133 -150 44 -72 79
6796 79 53 182 -93 15 -39 -128 27 45 294 252 87 -45 -166 40 -13 -40 150 112 -62 100 -6 -163 -53
6819 -53 -386 78 -69 -91 -219 -427 145 -105 312 -128 35 -33 31 306 -132 206 -27 -101 56 218 -108 -90
6841 -90 -114 -140 55 -35 41 -190 -161 -110 7 157 19 65 -108 47 -14 130 -331 130 -103 212 29 3 -86 -203
$$ packed form
6685b71L11p3q2N0M02l69K5l19L31k63J89j86J06M25k48nk79K98j65K08k69K94
6707A10k4j62J80mj42m3j37K04j07J71j87j45j32N20J10l76J32j55K95K80o14
6728b26j1J90QK3J78l44K89J46l78J01K4J57l90N30l42K8j60l3K27Pk26J90l00
6751c12N70k57kk28J97L2j09M2J29J33k35N7m05L18J57k72K64j11j14L87j85o1
6773en9K8k22O46m18M8R5k23L23j85j51K80j57o6J91l5k75L69n1k83J94j16J51
6796G9k6J29k75J08n4q9J55J8K49m2j65j32j21K06n3k7J90l8j74J62j06j57J10
6819e3l33M64j47k2j28k08N72k50M17m40J63o8O4K75m38L38k33p4J57J62l26J8
6841i0k4k6J95r0P6k31K9N1J17J50j38M6j73J55o1J44m61M61k33L15j83k6q9j17
$$ plain form
6865 -203 229 129 111 42 -260 162 88 101 -84 -17 40 -93 -115 -11 -182 -157 -60 -503 173 145 392 -25 70 85
6889 85 85 -68 -301 -89 -108 37 236 203 293 230 -183 24 -67 123 204 266 178 -62 -54 -5 -134 -60 42 -31 247
6914 247 -283 -71 187 -71 -99 101 -357 109 -107 -39 30 -64 156 -6 -161 -174 125 -85 -28 -15 103 -12
6936 -12 241 88 19 -27 -176 -420 -161 -85 93 23 -103 -51 -223 107 9 424 45 71 -142 -42 48 -89 48
6959 48 -30 6 -231 -105 213 225 74 -33 -70 16 78 -237 -353 46 -123 -233 251 -355 -48 -257 -317 -157 84
6982 84 272 15 -53 100 -51 72 101 70 355 -44 -7 239 -46 187 -256 -72 172 47 65 108 45 -291 143
7005 143 215 42 311 89 156 -167 -106 -103 94 75 -14 -611 104 -151 -386 -155 -58 176 -85 143 -124 2 92
7028 92 -140 241 -53 152 -220 236 32 -91 -146 134 -358 271 13 223 15 -293 269 40 41 92 24 19 -388
$$ packed form
6865b03M32j00j8o9l02M22p4J3j85O7N7j33k2J04j71K5R7m43O76k8K47m17R5J5
6889H5%j53k33K12j9J45J99l3R0o3m13K07r1J90Q1O2q8k40QM9j29P4J02p3K78
6914B47n30K12K58k58k8K00m58M66k16O8O9r4K20j62j55j3K99k10N7J3J18j15
6936a2K53j53o9m6j49k44K59P6J78p0j26N2j72L30r8M15l79K6k13J00R0j37J37
6959D8p8L6k37J26L18J2j51j07l7Q6O2l15j16L99j69j10M84o06L07k09o0J60K41
6982H4J88k57o8J53j51J23K9l1K85l99L7K46k85K33m43J84K44j25J8M3o3l36M34
7005A43P2j73K69k22O7l23O1LJ97j9q9n97P15k55k35K31R7K34k61K28k67J26R0
7028I2k32L81k94K05l72M56k04j23n5K80m92O29k58K10k08l08N62k29JN1o8nm07
$$ plain form
7051 -388 -165 68 -70 -175 124 114 166 17 62 -301 -234 -4 -50 112 310 30 197 -96 10 68 -162 -141
7073 -141 191 4 189 -116 -191 71 47 15 15 26 -12 84 -226 -18 73 97 39 21 62 -10 -197 -172 317 67 -20
7098 -20 -126 -236 -123 -51 -45 292 224 40 -214 -94 29 37 -265 40 -164 340 25 -157 159 -168 -62 -31 -190
7121 -190 -270 16 -38 -32 -173 149 -246 71 -70 -268 3 -103 63 -218 -87 -97 -9 -40 -166 -49 -60 -257 197
7144 197 -106 178 206 338 -102 202 152 -127 -9 169 425 123 183 -73 107 380 32 175 285 251 -8
7165 -8 -261 -96 -149 -15 -47 371 355 -200 129 -232 -82 400 108 285 43 -42 -104 256 175 68 -167 131 41
7188 41 -39 -253 -215 54 220 179 7 -7 -68 260 266 301 -162 1 -209 -440 230 67 226 129 412 -188 -61
7211 -61 -83 -115 -116 78 116 152 -133 81 -247 -173 -143 -314 -296 -63 318 4 -251 -142 -155 82 265 68 133 -167
$$ packed form
7051c88K23K33j38j05K99j0N2j49M5l63O7K30m6J62J98k80J67k93J06N8k30K1
7073a41L32j87J85l05p5K62k4l2%J1l8R6l10K08R1K4n8j8M1p2j87K5M89k50q7
7098b0j06j10J13P2OL37o8j84k54J20J23Ql02L05k04N04l15j82L16l27J06L1j59
7121a90q0K86n4Oj41L22l95L17j41j98K71j06J66k81J31j0Q8l1j26J17j1j97M54
7144A97l03K84K8J32m40L04n0k79J18J78K56l02O0k56J80K73l48J43J10l4k59
7165hk53J65n3J34l2M18j6n55L29l61J50M82k92J77k42q5o2L60q1j07k35K98r0
7188D1q0k14L8K69J66m1j72j4o1L28OL5m63J63k10k31O70j63J59r7K83o00J27
7211f1k2l2jJ94L8L6k85K14l28P4L0j71J8K33L81l14k55J09j3K37J83j97O5l00
$$ plain form
7235 -167 26 -56 -133 143 -9 43 199 -101 -89 -46 17 -2 328 43 -61 318 154 100 91 39 -82 12 255 -60
7259 -60 192 248 33 49 181 -78 -316 104 -104 -304 42 -114 119 362 309 -208 20 -115 -212 -11 32 97
7281 97 -70 161 -69 -202 264 56 -93 50 -107 28 -149 -91 -58 -67 47 223 -281 -187 243 115 110 -32 29
7304 29 -185 523 -299 -197 -307 196 -307 173 19 70 -197 212 -96 -419 -103 -169 -56 -284 -308 -46 381
7325 381 -209 92 69 -36 -2 -21 79 320 -18 -154 -82 -365 76 -51 81 260 -13 -116 -60 31 -105 -83
7347 -83 -77 -265 -45 119 -18 9 37 -253 209 255 -215 109 53 -146 -70 139 135 394 310 194 -309 22 -193 -43
7371 -43 -42 -137 -190 71 -24 129 -171 -298 305 13 -114 -54 148 -199 295 284 -164 78 152 462 114 -101 -146
7394 -146 463 -71 -68 174 -208 -300 -197 -65 -115 -252 53 155 -15 -23 128 -202 -49 69 108 198 20 207 150
$$ packed form
7235a67J93q2p7K76j52N2J56l00J2M3O3j9L30k85j04L79j64n4rn2j21R4K43l15
7259f0K52N6k15J6J32k59k38M20k08k00L46j56K33K43n3n17K28j35r7K01M3O5
7281I7j67K31k30j33M66k08j49J43j57J35j77N8L3rJ14J76n04R4M30j28nj42O1
7304B9k14P08q22J02j10N03n03M80j54N1k67M09l08l23L16o6J13k28k4K62M27
7325C81n90L01k3j05L4j9J00K41l38j36P2k83M41j27J32J79k73j03N6R1j36K2
7347h3Oj88K20J64j37K7K8k90M62M6m70L24n6j99P6K09mK59q4j16n03L31k15J50
7371d3Jr5n3K61r5J53l00j27O03k92j27O0K02l47M94j1m48K42P4L10l48k15m5
7394a46O09n34LK42l82r2J03J32n0j37L05J02j70qJ51l30J53J18L9R0j78J87n7
$$ plain form
7417 150 -105 -424 159 -284 -80 -109 43 -70 242 73 -231 -359 328 -167 176 91 242 -70 -240 288 15
7438 15 -75 323 272 -301 -54 87 130 -58 279 146 85 90 -129 180 128 -124 -229 -194 -43 -339 175 -260 19
7461 19 -14 -145 -44 113 -39 -125 123 13 75 -320 -43 -101 -34 217 -163 86 -170 144 353 -316 -88 121
7483 121 97 -48 -214 85 118 -298 46 -25 66 -276 -59 -270 98 -71 -25 -33 -119 95 51 197 80 135 257
7506 257 -260 180 68 21 -69 -119 -2 -48 68 82 132 28 -54 -159 49 -3 83 53 -303 -27 41 158 229 -45
7530 -45 135 -119 -113 -91 -373 211 -171 -100 -9 -106 -12 26 -153 114 -197 203 98 31 -492 276 193 -153 92 29
7554 29 -56 -14 -25 373 -52 -108 -14 92 -60 -131 -157 -66 211 -175 -17 186 0 -355 -130 -96 145 -67 274
7577 274 57 145 252 -130 -93 -371 -137 -126 149 74 -54 -17 106 -74 58 -190 -148 90 242 262 -165 106
$$ packed form
7417A50k55l19N83m43K04k9J52j13L12j69l04j28O87m95L43q5J51l12j70N28k73
7438A5r0L98n1n73K47J41M3j88L37j33o1Nk19L09n2k52j05L5J51k96N14m35K79
7461A9l3j31J01J57j52q6K48j10O2l95K77n8O7K51l80K49k56L14K09o69K28K09
7483A21k4j45j66K99L3m16L44p1R1l42K17k11L68j69M6qq6K14m4J46j17N5J22
7506B57n17M40j12m7r0n0J17m6J16J4N0j04q2j05K08n2Q6l0l56K76O8J17P1k74
7530d5J80k54OK2k82N84l82P1R1r7R4L8j79K67l11M00j05o7n23P68q3l46K45o3
7554B9q5M2j1L98m25n6R4J06j52p1k6R1K77l86J58K03j86l55K25L4K41k12L41
7577B74k17Q8J07l82L7k78K34J1K75p5j28L7J23j80J32k48M2K38J52K0m27K71
$$ plain form
7599 106 -23 367 -63 -135 76 46 176 -167 426 -280 -43 55 -138 -47 61 -74 -256 -59 53 211 -36
7620 -36 52 148 272 -59 57 -47 110 30 218 -100 75 339 -35 -46 -166 -29 -187 22 -74 -101 42 31 140
7643 140 -137 -20 -374 248 -10 50 -189 106 -106 -90 99 -228 -13 -54 -187 13 51 -182 -97 -64 -237 -327
7665 -327 28 -219 37 310 236 71 145 -288 104 251 56 62 65 25 234 -8 -140 -189 192 184 -66 -94 -60 94
7689 94 76 201 -65 -71 -391 197 -145 364 7 -76 -99 -238 54 315 316 -242 121 -39 66 -63 89 9 117
7712 117 83 77 -330 47 14 -226 -252 -246 107 -13 143 64 -252 25 -160 236 127 328 96 278 -251 22 235
7735 235 -36 127 -282 77 -178 -29 -43 -132 325 -38 77 452 -117 110 -182 -1 -14 -168 40 37 129 -110
7757 -110 334 -431 -29 129 -19 71 12 -61 391 -3 157 -172 -25 429 30 104 19 -130 202 -88 253 -101
$$ packed form
7599A06j29L90m30p2K11l0J30l43N93p06K37R8j93R1J08j35j82J97J12J58k47
7620c6Q8R6J24l31J16j04J57q0J88l18J75K64l74j1j20J37j58K09r6k7J43j1J09
7643A40k77J17l54O22k58O0k39K95k12J6J89l27K15m1j33K00L8k33Q5L3j73r0
7665c27L55k47K56K73p4j65P4m33L92J47j95OLm0K09k42j32m9L81qk50k8L4J54
7689I4j8J25k66ol20N88l42N09l57q3k3j39K92K61Jn58L63j60J05j29J52q0J08
7712A17l4om07L77l3k40k6OL53j20J56p9l16K77j85L96j09K01k32J82n29K73K13
7735B35k71J63m09L59k55J49j4q9M57l63J15L75n69K27k92J81j3j54K08lR2k39
7757a10M44p65M02J58j48R0n9p3M52l94J60l29J47M54l99P4q5j49L32k90L41l54
$$ plain form
7779 -101 -78 325 28 -75 346 -125 -208 164 -44 -105 -37 -123 140 27 -57 93 41 -200 85 309 -6 106
7801 106 -27 189 -162 -159 -31 -50 92 -81 -249 -103 74 51 -193 215 -90 -380 146 127 245 142 198 227
7823 227 -45 -385 -13 92 -98 -163 194 125 18 -69 116 -28 -129 -113 -75 -307 271 233 -49 -256 84 38
7845 38 -225 -19 -293 73 78 94 -63 -139 -262 79 -209 -27 -78 -88 -78 337 -81 -384 267 -39 26 17 113 -14
7869 -14 -85 73 -228 -67 12 -70 -167 -80 242 -164 -16 -156 164 56 -39 -60 -87 110 -430 164 -36 245 22
7892 22 55 -53 -73 6 148 17 23 53 21 -86 81 119 -39 -69 92 -97 6 161 95 -46 59 -185 148 -54
7916 -54 314 -102 -50 101 41 70 27 337 -81 -6 -350 90 25 -126 -149 -185 -115 41 105 -41 -199 173 -62 68
7940 68 -215 -325 188 151 -73 -83 -29 -263 32 37 67 166 5 108 6 162 -51 -194 -83 16 -54 -293 169
$$ packed form
7779a01K3M03k97j03M21m71q3L72k08o1O8q6K63j13q4J50n2k41K85K24l15J12
7801A06j33K16l51LJ28j9J42j73j68J46J77k3k44M08l05k90N26j9J18j03N6K9
7823B27k72l40L72J05j90o5L57o9j07q7J85j44j01J6L8k32N78l8k82k07L40m6
7845C8k63K06k74L66NJ6j57p6j23L41k88J82n1j0J0M15m18l03O51l06O5rR6j27
7869a4p1J58l01J61P9q2r7Q7L22m06J48j40L20j08r5k1k7J97n40N94k00K81k23
7892B2L3j08k0P9J42j31OL0l2j07J67L8j58l0J61j89J03J55o6j41J05k44L33k02
7916e4L68m16N2J51o0K9m3L10m18P5l44M40o5j51k3l6P0J56O4j46j58L72k35J30
7940F8k83j10N13l7k24j0N4k34K95NL0R9j61J03j02J56k13j43J11R9p0k39M62
$$ plain form
7963 169 235 222 192 -49 -334 -48 -218 267 -176 -369 266 166 83 194 -100 38 358 130 -30 -120 143 215
7985 215 137 -153 -215 98 -92 -210 46 -58 112 -6 -246 -203 80 -45 -160 -13 232 328 191 99 48 69
8007 69 -15 -68 280 -380 -110 217 -262 14 75 155 23 232 77 49 174 141 -181 205 12 -306 83 -20
8029 -20 -41 -85 272 16 43 79 -150 35 29 -186 4 -224 -120 46 126 -190 37 139 247 52 60 134 122 279
8053 279 26 286 88 260 -189 120 209 14 -21 115 -339 79 -99 -227 113 105 -76 30 -93 7 139
8074 139 -142 -299 -3 -70 -5 267 146 222 82 -126 198 -44 -250 -23 165 311 193 -67 96 -174 164
8095 164 -49 99 -144 -101 -152 65 -89 362 128 -209 -43 -175 121 -100 -233 120 204 34 41 -59 181 -119
8117 -119 -454 -10 20 26 -155 -142 207 237 -70 -73 -26 -13 -293 -261 -172 48 105 -103 -63 49 50 -211 -78 -313 65
$$ packed form
7963A69O6j3l0k41k85K86j70M85m43j93O35j00q3J11k94J38L20k28j60r0K63P2
7985B15p8k90o2L13j90j18K56j04J70j18k40M3K83j25j15J47K45R6j37r2n1K1
8007F9q4n3L48o60K70L27m79K76O1Q0j32K09j55k8J25l3l22L86j93l18L89j03
8029b0k1m4L57k56K7L6k29J85ok15J90k28J04J66Q0l16K27J02J08j95QP4j2J57
8053B79k53K60j98J72m49L09Q9j95l5J36m54M18j78j28L40qj81J06j23J00J32
8074A39k81j57K96o7O5K72j21P6j40k08L24k42k06K27J88J46j18k60J63k70L38
8095A64k13J48k43M3n1K17j54M51k34l37J66j32K96k21j33L53Q4j70Pj00K40l00
8117a19l35M44L0Oj81J3L49L0l07lM7J3k80L2Q9K20N7k08M0J12Jk61J33k35L78
$$ plain form
8142 65 92 15 323 -72 -113 -48 -225 -50 148 136 107 -124 -312 101 85 -79 288 -10 105 264 -213 -366 262
8165 262 27 -1 20 181 104 152 58 173 -18 -219 -82 49 62 -93 -101 175 -186 -78 -104 45 -44 113 291
8188 291 125 233 281
$$ packed form
8142F5K7p7L08l95m1O5j77J75J98j2k9k31j88M13j6j64L67k98J15J59m77j53O28
8165B62k35k8K1J61p7M8r4J15j91k01J37J31J3j55qK76l61J08k6J49q9J57J78
8188B91j66J08M8
8191B81
$$ Imaginary data points
##PAGE= N=2
##DATA TABLE= (X++(I..I)), XYDATA
$$ plain form
0 0 0 0 0 0 0 8 -8 8 -8 16 -16 24 -24 32 -40 48 -56 70 -81 96 -113 132 -153 177 -202 231 -263 302 -342
29 -342 385 -434 489 -547 612 -686 764 -850 943 -1046 1161 -1286 1425 -1576 1744 -1931
45 -1931 2143 -2379 2648 -2957 3314 -3734 4238 -4849 5612 -6603 7940 -9854 12836 -18179
59 -18179 30731 -123930 2505 178311 -711 24435 -95522 -14151 169511 46263 -124185
70 -124185 -117282 -29827 109140 47276 -33307 -50028 -10510 148566 67281 -160985 -65199 2634
82 2634 22095 94523 -62082 -91607 105322 80364 9339 -48043 -116044 3661 79940 3976
94 3976 -51069 -52844 74302 115415 -22600 -66071 -59432 -1409 87700 -33374 -92905 30300
106 30300 56635 69086 20659 -102821 -31650 54088 13202 -25554 -71052 -7531 100249 55181
$$ packed form
0@%%%%%Qj6J6j6K4l2M0m8N6p2Q8j04J26j51J77k09K45k85L30l79M33m94N65o44
29c42P27q19R23j036J159j298J450j614J793j989K207k447K711l001L320l675
45a931M074m522N027n605O271p048P972r087J0461j2215J4543j7794K2690l1015
59a8179M8910j54661J26435J75806j79022K5146j19957Q1371J83662j23248j70448
70a24185O903Q7455J38967o1864q0583j6721L9518J59076q1285k28266R5786O7833
82B634J9461P2428j56605k9525J96929k4958p1025n7382o8001J19705P6279p5964
94C976n5045j775J27146M1113j38015m3471O639N8023Q9109j21074n9531J23205
106C0300K6335J2451m8427j23480P1171Q5738m0886l8756m5498O3521J07780m5068
$$ plain form
118 55181 -18463 -62532 -30874 66436 12808 -67127 -40415 -8789 80253 81639 -55444 -53024
130 -53024 13405 30835 31067 -64602 -84746 37373 78970 38957 -33261 -58708 29568 51238
142 51238 -7184 -54451 -73079 27800 91365 5615 -31655 -25262 7789 70297 -7041 -90305
154 -90305 -31025 28605 56394 22965 -48666 -17542 40426 40952 -7807 -78552 -36870 44950
166 44950 36348 10305 -34227 -28664 64706 43262 -43878 -49105 -29302 29169 52752 -21379 -38535
179 -38535 11379 45873 37052 -35523 -58496 -7194 26929 33424 -19658 -47955 29484 54097
191 54097 10515 -21511 -55074 -9955 50287 4068 -33610 -18076 15900 54247 18630 -41731
203 -41731 -36506 2764 36653 4862 -46340 -13719 30131 41569 19393 -45444 -34881 29220
$$ packed form
118E5181p3644m4069L1658R7310n3628p9935K6712L1626Q9042J386j37083K420
130e3024O6429J7430K32r5669k0144J22119M1597m0013p2218k5447Q8276K1670
142E1238n8422m7267j8628J00879O3565q5750l7270O393L3051O2508p7338q3264
154i0305N9280N9630K7789l3429p1631L1124N7968N26m8759p0745M1682Q1820
166D4950q602k6043m4532N563R3370k1444q7140n227J9803N8471K3583p4131j7156
179c8535M9914L4494q821p2575k2973N1302L4123O495n3082k8297P7439K4613
191E4097m3582l2026l3563M5119O0242m6219l7678J5534L3976L8347l5617o0361
203d1731N225L9270L3889l1791n1202L2621M3850J1438k2176o4837J0563O4101
$$ plain form
215 29220 19454 -10440 -30067 -24807 37435 49261 -6197 -34252 -19894 21732 26294 -21731 -36969
228 -36969 -9610 33962 45427 -12885 -36373 822 18097 17861 -16431 -48626 723 43633
240 43633 22568 -8814 -28570 -3318 33094 10218 -30149 -36179 2008 41314 18265 -18849
252 -18849 -18678 2808 32404 10530 -41566 -27760 12096 27084 18625 -20527 -23214 21671 29186
265 29186 -2708 -32467 -27552 14421 29872 4278 -20806 -15004 24220 30454 -11340 -30698 -18756
278 -18756 11071 30992 -3601 -28535 446 24330 22278 -6569 -35455 -13700 21034 18240
290 18240 -8905 -24127 1263 29899 18181 -11737 -30159 -10297 24807 11609 -18478 -16107
302 -16107 3608 27807 20623 -20591 -26217 2164 18158 7610 -18448 -19729 11293 28810 11921
$$ packed form
215B9220r766k9894j9627N260O2242J1826n5458k8055J4358M1626M562m8025j5238
228c6969K7359M3572J1465n8312k3488L7195J7275k36l4292l2195M9349M2910
240D3633k1065l1382j9756K5252L6412k2876m0367o030L8187L9306k3049l7114
252a8849J71K1486K9596k1874n2096J3806L9856J4988q459l9152k687M4885P515
265B9186l1894k9759M915M1973J5451k5594k5084N802L9224O234m1794j9358J1942
278a8756K9827J9921l4593k4934K8981K3884k052k8847k8886K1755L4734k794
290A8240k7145j5222K5390K8636j1718k9918j8422J9862L5104j3198l0087K371
302a6107J9715K4199p184m1214n626K8381J5994j0548k6058j281L1022J7517j6889
$$ plain form
315 11921 -19540 -22199 7818 17777 -117 -18638 -17859 13294 30968 3026 -20206 -12758 7465
328 7465 18501 -2162 -25830 -11314 18143 24075 483 -19787 -8821 12549 14912 -6478 -26572
341 -26572 -7976 22142 18204 -3182 -16771 -7366 18237 14777 -15405 -23251 -2188 18915 16538
354 16538 -6621 -17126 -1 19699 10046 -17472 -21231 682 17719 13645 -9492 -17586 6728
367 6728 20975 3374 -16295 -18339 893 19669 8368 -14383 -11634 9985 18210 2399 -17144
380 -17144 -16609 4965 18558 2697 -15492 -6114 12350 15773 643 -18387 -13297 10021 14234
393 14234 -3302 -13120 -4000 13120 15954 -3499 -18949 -7403 11167 9925 -6229 -13351 -1500
406 -1500 16184 13964 -7773 -16855 -2295 11388 6420 -8334 -13688 1007 18381 10228 -10509
$$ packed form
315A1921l1461k659L0017R959j7894j8521P79L1153J7674k7942k3232P448K0223
328G465J1036k0663k3668J4516K9457N932k3592k0270J0966K1370K363k1390k0094
341b6572J8596L0118l938k1386j3589R405K5603l460l0182p846K1063K1103k377
354A6538k3159j0505J7125J9700r653k7518l759K1913J7037m074k3137q094K4314
367F728J4247j7601j9669k044J9232J8776j1301k2751K749K1619Q225j5811j9543
380a7144N35K1574J3593j5861j8189R378J8464L423j5130j9030N090K3318M213
393A4234j7536r818R120J7120K834j9453j5450J1546J8570j242j6154p122J1851
406a500J7684k220k1737r082J4560J3683m968j4754n354J4695J7374q153k0737
$$ plain form
419 -10509 -13981 764 12019 4924 -12328 -14173 5737 18389 6086 -10699 -11058 3091 13053
432 13053 2797 -14849 -12027 8380 16604 3446 -10622 -9534 5303 13539 -1177 -16491 -8101
445 -8101 8992 13779 2744 -11513 -8224 8994 11841 -4089 -15306 -6578 9186 12444 281
458 281 -12538 -4500 11569 8915 -6539 -12676 -4956 9612 12015 -3988 -10991 771 10372 6292
472 6292 -6575 -13062 -2587 10824 7622 -6996 -8901 3302 10253 4634 -7440 -12741 906
485 906 11872 2343 -7760 -5937 3593 12018 3951 -11384 -9838 4814 9226 462 -8671 -5735
499 -5735 6827 12119 439 -12544 -6321 6672 7103 -1117 -9124 -5547 9874 10951 -3738 -10006
513 -10006 -4043 5615 8242 -3239 -11294 -1798 10370 8640 -3957 -9722 -3110 6744 7112 -4990
$$ packed form
419a0509l472J4745J1255p095j7252j845J9910J2652j2303j6785l59J4149R962
432A3053j0256j7646K822K0407Q224j3158j4068J088J4837Q236j4716j5314Q390
445h101J7093M787j1035j4257L289J7218K847j5930j1217Q728J5764L258j2163
458B81j2819Q038J6069k654j5454o137P720J4568K403j6003p003J1762R601m080
472F292j2867o487J0475J3411l202j4618j905J2203O951n619j2074n301J3647
485I06J0966r529j0103J823R530Q425q067j5335J546J4652M412q764r133K936
499e735J2562N292j1680j2983O223J2993M31q220q007L577J5421J077j4689o268
513a0006N963R658K627j1481q055R496J2168j730j2597n765O612R854L68j2102
$$ plain form
527 -4990 -11421 518 10435 6651 -3360 -9280 -1722 9461 4324 -7969 -8338 1045 9569 6139
541 6139 -5237 -8072 1686 8605 1919 -8242 -6742 2774 8870 4534 -7014 -6648 4713 7164
555 7164 -142 -7522 -6821 3783 9515 918 -7479 -3694 4775 6751 -1341 -8810 -5156 5318 8330
570 8330 -1496 -7163 -1441 5947 5770 -2920 -9712 -2824 6855 5238 -2571 -6593 -827 7574 5418
585 5418 -4744 -8674 -1107 6981 4064 -4216 -5857 607 8045 4397 -6587 -6779 787 5995 3530
600 3530 -4796 -6201 2647 8102 2595 -6005 -6009 2175 6199 1515 -5733 -5274 3937 8113 551 -6020
616 -6020 -4502 2075 6208 -155 -7430 -2762 4949 6151 213 -6413 -3971 4288 5346 -2019 -6575
631 -6575 -2158 5738 5565 -786 -5823 -2523 4981 3992 -3750 -5507 -772 5121 5757 -2990 -6101 312
$$ packed form
527d990o431J1939R917l784j0011n920P558J1183n137j2293l69R383Q524l430
541F139j1376k835R758O919o686j0161J500R516O096m336j1548L66J1361K451
555G164p306p380P01J0604N732q597q397L785Q469J976q092p469L654J0474L012
570H330r826n667N722P388j77q690o792O888R679j617p809m022N766Q401k156
585E418j0162l930P567Q088k917q280j641O464P438l648j0984j92P566N208k465
600C530q326j405Q848N455n507q600mQ184M024m684p248M59R211M176p562o571
616f020J518O577M133o363p275M668P711J202n938o626K442Q259J058p365m556
631f575M417P896j73o351n037L300P504r89p742j757M735N893O36q747l111O413
$$ plain form
647 312 5043 2200 -3586 -5789 138 5840 3635 -3920 -5060 1460 5246 998 -4097 -5392 1337
662 1337 6421 1084 -4271 -3017 2184 5107 1427 -5877 -4274 3136 5401 178 -3954 -2866 3322
677 3322 5257 -337 -6235 -3278 4071 4196 -589 -4280 -2132 4096 4750 -2145 -5490 -1837 3774 3808
693 3808 -1465 -4947 -431 5085 3838 -2767 -4924 -1024 3694 3426 -2557 -4764 927 5121 2206
708 2206 -2669 -4402 -685 4349 1690 -3636 -3650 1291 4953 1775 -3364 -4050 730 4385 760 -4248
724 -4248 -2498 2298 4374 1319 -3595 -3308 2738 3788 -654 -3721 -2753 2617 4428 -116 -4017 -2035
740 -2035 2536 2933 -1230 -4214 -1759 3227 3861 -967 -4063 -722 2653 2573 -1811 -4507 -765 4206
756 4206 2601 -1716 -3409 -569 3434 2143 -2243 -4165 107 4000 2060 -2369 -2579 606 3968
$$ packed form
647C12M731k843n786k203N927N702k205p555j140O520L786m248n095j295O729
662A337N084n337n355J254N201K923l680p304J603P410K265n223m132J088O188
677C322J935n594n898K957P349J25m785l691K148O228O54o895l345L653N611L4
693C808n273l482M516N516j247o605k157L900M718k68n983k207N691M194k915
708B206m875j733L717N034k659n326j4M941L662l178n139o86M780L655l625n008
724d248J750M796K076l055m914K87O046J050m442l067R68N370J811m544l901J982
740b035M571L97m163k984K455M986O34m828l096L341L375q0m384k696L742M971
756D206j605m317j693K840M003j291m386j922M272L893j940m429k10L185L362
$$ plain form
771 3968 1471 -3360 -3282 837 3449 1135 -2314 -2823 1612 3420 136 -3366 -2930 1401 3380 640
787 640 -2753 -1858 2516 3278 -730 -3301 -2279 1571 2971 -247 -3231 -767 2758 2823 -1083 -3503
803 -3503 -1569 2066 2470 -1249 -3038 -393 3100 2055 -994 -3356 -784 3125 1770 -2031 -2752 87
819 87 3144 2219 -1833 -3250 -14 2545 1016 -2060 -2661 548 3329 1708 -2288 -2382 768 2651 499
836 499 -2392 -2547 1389 3014 991 -2410 -2018 683 2375 326 -2474 -1865 1958 2630 39 -2292
852 -2292 -1053 1327 1979 -426 -2656 -1342 1757 2185 -562 -1942 -683 1680 1856 -979 -2442 -622
868 -622 2076 1659 -869 -1972 -228 2228 1374 -1808 -2311 152 1667 1168 -1071 -1937 623 2430 402
885 402 -2108 -2016 322 2319 1018 -1687 -1673 1103 2445 67 -1651 -1618 777 1975 372 -2128 -922
$$ packed form
771C968k497m831P8M119K612k314l449n09M435J808l284l502M36M331J979k740
787F40l393Q95M374P62m008k571J022L850J400l218k984K464L525O5l906k420
803c503J934L635M04l719j789K645L493j045l049k362K572L909j355l801p21K839
819H7L057r25m052j417L236K559j529l076o01L209K781j621l996r4L150J883k152
836D99k891j55L936J625k023l401L92K701J692k049k800O09L823O72k591k331
852b292J239K380O52k405k230J314L099M28k747j380J259K363J76k835j463J820
868f22K698m17k528j103J744K456q54l182n03K463J515m99k239q66K560J807k028
885D02k510R2K338J997j301k705J4K776J342k378j718L3K395J198j603k500J206
$$ plain form
902 -922 1612 1768 -2 -2031 -1373 1318 1781 -470 -1963 -300 1408 1970 -143 -2058 -859 1514
918 1514 1322 -978 -1555 -208 1637 1336 -922 -1664 -104 1305 783 -1037 -1613 -6 2137 1400 -1004
935 -1004 -1757 -87 1351 689 -1136 -1509 493 1867 789 -1271 -1065 548 1345 322 -1502 -1076 1203
952 1203 1755 298 -1188 -1153 966 1803 -566 -1689 -1022 1267 1460 194 -1485 -818 1054 1170 -450
969 -450 -1583 -554 1221 1250 -507 -1344 -462 1481 612 -788 -1558 -704 1188 1380 -721 -1518 54 1388
987 1388 813 -886 -1038 -137 1642 786 -874 -1210 609 1086 546 -979 -1191 50 1444 785 -1104
1004 -1104 -792 187 1154 469 -1053 -1127 441 1106 248 -1005 -649 569 1653 605 -1428 -709 799
1021 799 744 -385 -1263 -543 875 904 -124 -1418 -600 843 739 -177 -1152 -291 1265 763 -379 -1029
$$ packed form
902i22K534J56j770k029O58K691M63k251j493J663J708N62k113j915J199K373
918A514j92k300n77J347J845l01k258p42J560J409n22j820n76J607K143p37k404
935a004p53J670J438o62j825l73K002J374j078k060K06J613P97j023j824M26K279
952A203N52j457j486L5K119Q37k369j123O67K289J93j266j679O67J872J16j620
969d50j133J029J775K9j757q37Q82J943q69j400p70Q54J892J92k101p97J572J334
987A388n75j699j52R01J779q56j660l36J819M77n40j525k12J241J394o59j889
1004a104L12R79R67o85j522p4J568O65q58j253L56J218J084j048k033P19J508
1021G99n5j129q78P20J418K9j028j294Q18J443j04r16r75Q61J556n02j142o50
$$ plain form
1039 -1029 -31 889 678 -710 -1016 138 1103 683 -268 -798 -131 992 196 -621 -1164 274 944 405
1057 405 -435 -839 301 1186 75 -1000 -703 40 751 216 -556 -514 540 1045 52 -1186 -606 530
1075 530 828 265 -838 -261 1030 762 -123 -755 -539 803 848 -521 -559 -158 704 431 -500 -588 -373 747
1095 747 551 -233 -703 275 579 521 -351 -1115 -222 698 295 -668 -394 260 570 583 -503 -773 143 301
1115 301 44 -780 -669 486 808 235 -590 -489 172 681 179 -950 -559 650 914 14 -595 -440 330
1134 330 409 208 -981 -455 585 476 -252 -477 -446 336 543 -450 -782 125 906 645 -117 -249 -13 432
1154 432 195 -113 -424 -26 524 403 -258 -736 20 229 217 -310 -347 218 626 300 -212 -534 342 373 214
1175 214 -572 -384 244 292 136 -584 -362 430 272 44 -406 -359 313 357 271 -390 -261 281 557 -162 -661
$$ packed form
1039a029R98R20k11j388l06J154R65m20r51n30O67J123p96q17n43J438O70n39
1057D05q40m04J140Q85j111j075K97P43P11n35p72M2J054N05r93j238N80J136
1075E30K98n63j103N77J291k68q85o32K16J342M5j369l8M01Q62k73r31q8K15J120
1095G47j96p84m70R78L04n8q72p64Q93R20m03r63K74O54L10J3j086k70R16J58
1115C01k57q24J11J155L22n73q25J01O61N09n02j129L91J209K64r00o09J55P70
1134C30P9k01j189N26J040j09p28k25L1P82K07r93l32R07P81k61p62j32K36M45
1154D32k37l08l11L98N50j21o61m78P56K09j2n27l7N65M08l26n12l22Q76L1j59
1175B14p86J88O28M8j56p20K22P92j58k28m50M7O72M4q6o61J29N42K76p19m99
$$ plain form
1196 -661 -75 269 340 -142 -515 -8 426 195 -247 -357 -64 250 370 200 -454 188 464 92 -248 -547
1216 -547 -20 338 163 -238 -148 188 396 26 -88 -473 -242 418 -109 -227 -197 157 85 136 -369 -268 -236 212
1238 212 67 -374 -115 90 301 160 204 -84 -9 134 -11 -506 -257 406 371 -413 -575 22 845 347 -267
1259 -267 -344 -76 146 375 -203 -270 70 119 177 -168 -351 -177 408 261 -165 -524 -22 471 -66 -467 -178
1280 -178 165 345 391 -135 -216 347 399 -194 -257 -299 224 337 61 -320 -262 492 202 -194 -208 103 170 278 -68
1303 -68 -342 -11 233 223 -89 -38 104 313 114 -317 -117 -317 173 -27 100 -385 103 152 -142 -166 10 99
1325 99 337 71 -290 -315 502 189 -108 -311 279 -241 54 -7 -148 -313 94 295 -73 -21 -343 -129 -60 -98
1347 -98 -315 -229 104 485 -23 -47 -48 373 -70 160 30 230 76 128 -133 -385 -192 139 273 48 -32 116
$$ packed form
1196f61N86L44P1m82l73N07M34k31m42j10K93L14J20j70o54O42K76l72l40k99
1216e47N27L58j75m01R0L36K08l70j14l85K31O60n27j18L0L54p2N1n05J01L2M48
1238B12j45m41K59K05K11j41M4k88P5J43j45m95K49O63l5p84j62N97Q23m98o14
1259b67p7K68K22K29n78o7L40M9N8l45j83J74N85j47m26l59N02M93n37m01K89
1280a78L43J80M6n26q1N63N2n93o3m2N23J13k76l81N8P54k90l96j4L11O7J08l46
1303f8k74L31K44j0l12N1J42K09j99m31K00k00M90k00J27m85M88M9k94k4J76Q9
1325I9K38k66l61k5Q17l13k97k03N90n20K95o1j41j65M07K01l68N2l22K14O9l8
1347i8k17Q6L33L81n08k4jM21m43K30j30K00j54N2k61k52J93L31J34k25q0J48
$$ plain form
1369 116 -251 15 -233 -464 230 -72 131 -193 -130 -5 231 128 -229 -179 311 31 155 86 -96 171 190
1390 190 95 68 -361 345 -17 49 165 20 -25 20 -69 -150 -4 -51 274 -106 -166 66 76 -10 -173 -46 -215 377
1414 377 -112 -424 2 133 -110 73 221 64 -172 22 362 -135 -61 -74 106 24 -95 -330 -30 122 -75
1435 -75 -196 -244 77 327 13 24 -196 221 58 53 -176 -136 -14 25 -20 -262 120 -233 188 -306 -70 -39 447
1458 447 199 151 -254 -249 7 98 -55 -110 132 28 179 290 -104 290 274 -74 -112 242 103 45 169 -27 -79
1481 -79 59 199 80 72 -138 172 -31 23 -145 1 214 278 -41 -155 126 142 153 -196 -163 -305 88 137 -285
1504 -285 -159 -88 -7 175 164 213 -108 -166 166 -3 192 180 -155 -44 -108 376 83 205 -215 50 -9 96 448
1527 448 -220 244 43 22 108 226 -8 -223 191 -289 133 85 -297 153 150 56 -47 121 -56 -109 -272 -89
$$ packed form
1369A16l67K66k48k31O94l02K03l24O3J25K36j03l57N0M90k80J24o9j82K67J9
1390A90r5k7m29P06l62O6J16j45m5M5q9q1J46m7L25l80o0K32J0q6j63J27j69N92
1414C77m89l12M26J31k43J83J48j57k36J94L40m97P4j3J80q2j19k35L00J52j97
1435g5j21m8L21K50l14J1k20M17j63nk29M0J22L9m5k42L82l53M21m94K36L1M86
1458D47k48m8m05NK56R1j53n5K42j04J51J11l94L94j6l48l8L54j39n8J24j96n2
1481g9J38J40j19qk10L10k03N4j68J46K13O4l19j14K81J6J1l49L3j42L93M9m22
1504b85J26P1Q1J82j1M9l21n8L32j69J95j2l35J11o4M84k93J22m20K65n9J05L52
1527D48o68M64k01k1Q6J18k34k15M14m80M22m8l82M50lr4j03J68j77n3j63J83
$$ plain form
1549 -89 81 50 128 -77 -365 345 -84 -16 -126 -65 21 119 -76 213 -205 115 200 37 266 -166 279 77 -124
1572 -124 -60 -247 17 88 413 -45 119 271 -232 -151 67 -311 -95 275 -283 -340 126 -100 -216 11 21 -11
1594 -11 93 127 -103 94 -87 58 -183 -343 -69 277 47 266 36 -321 -193 117 72 244 -21 59 151 -326
1616 -326 223 -483 -144 96 -190 -242 -51 34 209 -109 102 140 169 -126 96 -198 57 116 22 166 -57 -92
1638 -92 361 122 70 -103 -133 188 -265 64 -74 -22 -103 96 -345 -47 -99 172 -55 -7 -109 -429 287 -8
1660 -8 -48 -85 -62 234 -121 -354 -39 -51 253 -122 -266 -93 373 111 -15 -351 367 -170 279 -239 -3 110
1682 110 137 -63 -116 5 55 145 154 36 62 227 -266 -17 -241 -375 -3 -56 150 -42 -20 46 240 -287 -249 -184
1706 -184 167 328 -204 -159 -170 278 190 259 -163 -166 107 38 29 -94 -336 -160 126 -43 65 180 206 123 -237 -149
$$ packed form
1549h9J70l1P8k05k88P10m29O8j10O1Q6R8j95K89m18L20Q5j63K29m32M45k02k01
1572a24O4j87K64P1L25m58J64J52n03Q1K18l78K16L70n58n7M66k26j16K27J0l2
1594a1J04L4k30J97j81J45k41j60K74L46k30K19k30l57J28L10m5J72k65Q0R2m77
1616c26N49p06L39K40k86n2J91Q5J75l18K11L8K9k95K22k94K55N9r4J44k23l5
1638i2M53k39n2j73l0L21m53L29j38N2q1J99m41K98n2K71k27M8j02l20P16k95
1660hm0l7K3K96l55k33L15j2L04l75j44J73M66k62j26l36P18n37M49n18K36J13
1682A10K7k00n3J21N0R0Rj18K6J65m93K49k24j34L72n3K06j92K2O6J94n27L8O5
1706a84L51J61n32M5j1M48q8O9m22lK73o9rj23k42J76K86j69J08J15K6q3l60Q8
$$ plain form
1730 -149 315 283 32 214 -68 -68 79 325 223 -168 -116 395 -82 -118 -139 -220 180 280 -40 -312 33 -192
1752 -192 338 -62 -117 183 -82 -274 139 -141 22 -131 261 -112 -132 246 28 -14 -97 232 112 162 84 -17
1774 -17 -284 -341 4 -33 30 -119 -31 79 31 77 -337 -217 415 116 -594 0 89 -144 -197 -106 52 190 87
1797 87 65 -150 -223 286 251 -82 -216 42 171 -24 -83 -389 73 52 183 -37 -366 228 -11 -28 -399 226
1819 226 324 158 -72 -165 -1 -234 414 37 -6 -132 10 114 4 -11 -78 145 310 142 -294 -312 -165 53
1841 53 -107 -197 -83 -36 -301 -348 12 157 121 128 107 -340 -421 483 -203 -147 -398 -14 -256 316 170 -280 2
1864 2 -24 295 76 -671 4 608 -85 38 -101 6 -101 -50 -193 -77 244 9 32 -48 -283 44 228 392
1886 392 -424 -426 -88 307 -313 -165 -313 86 214 68 -172 150 83 326 -1 -66 -79 171 241 200 -78 -283
$$ packed form
1730a49M64l2k51J82k82%J47K46j02l91N2N11m77l6k1q1M00J00l20k72L45k25
1752a92N30m00n5L00k65j92M13k80J63j53L92l73k0L78k18m2q3L29j20N0p8j01
1774a7k67n7L45l7O3j49Q8J10m8M6m14J20O32k99p10N94Q9k33n3R1J58J38j03
1797H7k2k15p3N09l5l33j34K58J29j95n9l06M62k1J31k20l29N94k39j7l71O25
1819B26R8j66k30r3J64k33O48l77m3j26J42J04j10j5o7K23J65j68m36j8J47K18
1841E3j60r0J14M7k65m7L60J45l6Pk1m47q1R04o86N6k51L84k42N72j46m50K82
1864Bk6L19k19p47O75O04o93J23j39J07j07N1j43J16L21k35K3q0k35L27J84J64
1886C92q16kL38L95o20J48j48L99J28j46k40L22o7K43l27o5j3K50P0m1k78k05
$$ plain form
1908 -283 67 -17 -158 -151 -103 -8 123 -319 66 -163 170 -16 -197 -117 130 -23 251 -134 -40 198 83 196
1930 196 -363 -99 -29 29 252 -182 192 -7 531 217 82 -231 51 -55 -293 -190 -393 162 -47 -83 -126
1951 -126 386 264 -41 -194 -158 89 108 185 -222 82 48 -53 -158 158 -259 20 -17 202 -130 -285 -143 -14
1973 -14 29 -95 -44 -17 369 69 -235 -133 -74 29 159 -108 -269 -87 219 -31 -148 -5 213 263 53 11
1995 11 -49 197 27 329 -222 20 -236 231 79 -73 -169 127 365 -153 -314 25 224 227 -13 -117 -3 75
2017 75 210 -60 -279 -136 159 -127 -161 -17 -16 -20 243 -77 -130 -180 143 271 267 -75 -208 -318 241 -127 -225 24
2041 24 104 -250 -368 -279 208 11 -12 183 -509 94 241 25 -41 -182 102 -28 303 5 -328 -75 -103 -45
2063 -45 53 208 248 -161 24 -111 23 142 -55 -148 -29 -182 315 80 -40 -63 -227 -61 -199 17 -247 -14
$$ packed form
1908b83L50q4j41PM8R5J31m42L85k29L33j86j81Q0K47j53K74l85R4K38j15J13
1930A96n59K64P0N8K23m34L74j99N38l14j35l13K82j06k38J03k03N55k09l6m3
1951a26N12j22l05j53L6K47J9P7m07L04l4j01j05L16m17K79l7K19l32j55J42J29
1973a4M3j24N1K7L86l00l04J02N9J03J30k67j61J82L06k50j17J43K18N0k10m2
1995A1o0K46j70L02n51K42k56M67j52j52r6K96K38n18j61L39J99Lk40j04J14P8
2017G5J35k70k19J43K95k86l4J44JmK63l20n3n0L23J28ml42j33j10N59l68r8K49
2041B4Q0l54j18Q9M87j97k3J95o92O03J47k16o6j41K84j30L31k98l33K53k8N8
2063d5R8J55M0m09J85j35J34J19j97r3J19j53M97k35j20k3j64J66j38K16k64K33
$$ plain form
2085 -14 11 348 32 -116 -305 120 81 240 32 33 -2 144 213 -113 279 310 120 -191 -173 -121 -21 54 158 -281
2109 -281 156 76 101 -247 176 6 46 73 108 -266 -94 22 292 -172 85 43 -136 273 183 -18 -65 46 59
2132 59 -354 -197 -302 -62 236 -83 -440 57 334 189 6 -175 41 -228 -118 -25 305 -141 -144 241 -125
2153 -125 155 -2 326 -198 164 -111 -120 64 -132 -127 -111 323 306 -134 -139 58 372 40 262 -121 -36 188 13
2176 13 19 -416 257 14 209 -14 -151 13 397 198 -255 -268 -51 50 10 -84 -50 298 255 60 75 236 164
2199 164 231 -292 -308 142 51 125 -210 -238 -68 -2 229 13 -168 230 167 388 -178 -11 -7 278 310 -277 -36
2222 -36 -89 108 -334 179 26 92 50 -24 137 -64 252 57 -215 -70 -7 17 194 -149 -348 66 -27 -180 -234
2245 -234 -322 24 -60 118 -268 -35 215 211 249 -92 -262 211 -93 311 -367 -73 92 294 100 29 -70 83
$$ packed form
2085a4K5L37l16j48j89M25l9J59k08Jl5J46O9l26L92L1j90l11J8N2J00P5J04m39
2109b81M37q0K5l48M23j70M0K7L5l74J72J16K70m64K57m2j79M09r0k01m7J11J3
2132E9m13J57j05K40K98l19l57M97K77j45j83j81K16k69J10R3L30m46lL85l66
2153a25K80j57L28n24L62k75rJ84j96NJ6M34j7m40nJ97L14l32K22l83Q5K24j75
2176A3Om35O73k43J95k23j37J64L84j99m53j3K17J01m0r4L4L48m3j95J5J61p2
2199A64O7n23j6M50r1P4l35k8J70O6K31k16j81L98o3K21n66J67MK85L2n87K41
2222c6n3J97m42N13j53O6m2p4J61k01L16j95k72J45O3K4J77l43j99M14r3j53n4
2245b34q8L46q4J78l86K33K50mL8l41j70M73l04M04o78K94J65K02j94p1r9J53
$$ plain form
2267 83 318 27 -340 -259 363 -23 123 -150 438 50 203 -280 22 -151 207 89 -151 -157 -230 62 -230 150
2289 150 -36 -116 -79 305 405 38 -283 -75 -14 -72 -31 159 178 -335 -17 -42 15 163 86 118 -256 1 329
2312 329 70 163 -92 -146 -38 288 -23 -112 12 166 63 -41 -430 -249 136 -132 -4 13 104 43 149 -125
2334 -125 107 167 247 25 -219 -420 77 50 380 -129 22 276 34 84 109 16 233 235 28 -89 109 -72 13
2357 13 15 163 94 362 295 -187 11 -41 126 276 220 -190 -234 -6 -60 -402 -107 -115 190 -69 -451 218 -323 112
2381 112 235 85 -224 -170 94 143 207 -142 -93 33 -41 -299 -174 -125 98 -156 -80 -3 -192 -56 5 7 -121 259
2405 259 220 110 -256 152 -181 -57 -68 149 -192 -175 20 -75 -294 120 54 -116 -281 -37 -8 250 136 -142
2427 -142 179 190 2 381 -44 52 242 530 6 -269 -568 -169 296 76 18 -8 -278 220 129 102 61 -252
$$ packed form
2267H3K35k91l67Q1O22l86J46k73N88l88J53m83L02j73L58j18k40op3K92k92L80
2289A50j86q0L7L84J00l67l21K08O1n8M1J90J9n13L18k5N7J48p7L2l74K57L28
2312C29k59R3k55n4J08L26l11q9J24J54j03j04l89J81L85k68J28J7R1o1J06k74
2334a25K32O0Q0k22k44k01M97k7L30n09J51K54k42N0K5r3K17Kk07j17J98j81Q5
2357A3KJ48o9K68o7m82J98n2J67J50n6m10m4K28n4l42K95qL05k59l82O69n41M35
2381A12J23j50l09N4K64M9O4l49M9J26p4k58J25M9K23k54P6P7j89J36O1Kj28L80
2405B59l9j10l66M08l33J24j1K17l41J7J95r5k19M14o6j70j65K44K9K58j14k78
2427a42L21J1j88L79m25R6J90K88n24k75k99L99M65k20n8k6k70M98r1k7m1l13
$$ plain form
2449 -252 148 107 127 -170 -139 -64 268 -86 -214 -196 -193 -186 -138 -186 -78 71 43 -62 -274 -37 -17 19 -132 -203 120
2474 120 -29 -15 52 -89 -220 -27 69 -2 -10 202 197 -194 295 359 101 -154 -158 62 -6 -114 95 -96 -612 -121
2498 -121 242 102 296 110 26 162 -39 273 -335 -228 180 -53 -188 83 318 122 138 -157 -197 -419 -97
2519 -97 -56 -285 -153 146 106 165 -55 -78 185 90 -399 -191 -16 215 -92 283 -200 -288 126 -159 207 -18
2541 -18 -12 -32 -82 207 117 183 -197 -440 -195 -264 234 -66 -152 23 118 -66 62 161 -81 262 -20 165 5 41
2565 41 211 167 281 200 24 -164 -136 -76 -13 -30 153 -11 51 -124 169 -24 -288 -167 -140 377 -27 -45 168
2588 168 -154 133 73 27 207 -172 130 110 158 444 80 7 -266 -15 -6 -291 192 148 -135 325 0 -180 -40
2611 -40 293 122 -183 160 371 -79 -13 26 -122 149 208 -43 25 78 -74 207 -306 -125 6 -59 119 -99
$$ packed form
2449b52M00m1K0k97L1P5L32l54j28J8LPM8m8J08J49k8j05k12K37K0L6j51p1L23
2474A20j49J4O7j41j31J93R6p1qK12nl91M89O4k58k55mK20o8j08K09j91n16M91
2498a21L63j40J94j86q4J36k01L12o08J07M08k33j35K71K35j96J6k95m0k22L22
2519i7M1k29J32K99m0N9k20k3K63r5m89K08J75K31l07L75m83q8M14k85L66k25
2541a8Ok0n0K89r0O6l80k43K45o9M98l00q6J75R5j84J28R9k42L43k82J85j60L6
2565D1J70m4J14q1j76j88K8O0O3j7J83j64O2j75K93j93k64J21K7N17m04j8K13
2588A68l22K87o0m6J80l79L02k0M8K86l64p3k73K51Rk85M83m4k83M60l25j80J40
2611d0L33j71l05L43K11m50O6L9j48K71N9k51O8N3j52K81n13J81J31o5J78k18
$$ plain form
2633 -99 -196 -31 140 158 -8 -48 137 83 -252 235 -17 140 -188 74 -372 -299 -140 162 -38 54 -256 29
2655 29 -82 180 -15 -91 -11 41 -173 56 -347 -98 305 86 77 109 -158 -12 -23 176 -63 -132 -1 -100 -220
2678 -220 164 -143 85 345 -367 -238 -391 -102 16 -65 -233 -35 152 108 10 -75 68 139 46 191 73 -210
2700 -210 -8 -362 31 278 -146 -213 46 359 84 -6 -75 -58 278 -164 50 -44 2 139 193 310 129 -255
2722 -255 -71 58 432 12 46 251 -75 -10 101 -93 -222 298 -62 234 -273 -138 -4 1 -50 96 54 -18
2744 -18 -87 -8 -293 -59 444 -113 78 -20 -148 19 -34 78 351 -106 -97 -28 281 49 155 148 71 -50 -115 206
2768 206 246 99 48 135 42 178 -7 -142 -59 65 99 -251 33 25 -47 318 178 -104 -157 13 -109 35 93 123
2792 123 152 -158 -368 -140 -261 222 60 -148 -47 -110 -64 272 -83 -31 51 123 301 11 -211 53 125 -81
$$ packed form
2633i9r7J65J71J8j66m0J85n4l35M87k52J57l28K62m46P3J59L02k00R2l10K85
2655B9j11K62j95p6Q0N2k14K29m03K49M03k19rL2k67J46j1J99k39o9J31r9j20
2678b20L84l07K28K60p12J29j53K89J18q1j68J98J87m4r8q5J43P1r3J45j18k83
2700b10K02l54L93K47m24o7K59L13k75r0o9J7L36m42K14r4M6J37N4J17j81l84
2722b55J84J29L74m20L4K05l26O5J11j94j29N20l60K96n07J35J34Nn1J46m2p2
2744a8o9P9k85K34N03n57J91r8j28J67n3J12K73m57RO9L09k32J06pp7j21o5L21
2768B06M0j47n1Q7r3J36j85j35Q3J24L4l50K84qp2L65j40k82n3J70j22J44N8L0
2792A23K9l10k10K28j21M83j62k08J01o3M6L36l55N2Q2P2J78k90k22K64P2k06
$$ plain form
2814 -81 -20 48 -220 36 -118 -48 68 153 -50 350 -331 -207 -109 -126 -8 16 -148 -27 52 87 158 166 71 87 276
2839 276 -118 -180 -289 -238 -55 208 109 62 -49 -70 83 187 -30 -93 213 94 -51 217 38 -173 -99 138
2861 138 -159 156 -35 110 18 -98 -332 -162 47 -22 199 -50 226 152 262 -36 173 72 58 -57 33 -108
2883 -108 -13 -147 -20 288 261 -108 67 21 69 93 -78 -309 -89 17 -17 153 -429 5 -110 75 287 64
2905 64 114 -365 26 -106 -32 46 7 309 -330 161 -30 -22 -153 -247 40 -25 56 86 77 349 -11 155 -270 254
2929 254 -79 158 -126 70 37 -188 -325 112 -52 -135 145 98 -107 -283 164 -158 95 27 364 4 -108
2950 -108 178 12 28 -153 166 55 -111 1 -92 -59 106 113 -83 99 10 -16 -163 123 -145 268 -230 -7
2972 -7 168 -43 -85 114 47 -128 145 -92 91 -129 114 -33 100 59 224 -78 1 -2 -136 120 -59 -336 241
$$ packed form
2814h1O1O8k68K56j54P0J16Q5k03M00o81J24R8j7J18K4j64J21P9L5P1Qr5J6J89
2839B76l94o2j09N1J83K63r9m7j11k1J53J04k17o3L06j19j45K68j79k11P4K37
2861A38k97L15j91J45r2j16k34J70K09o9K21k49K76p4J10k98K09j01j4j15R0j41
2883a08R5j34J27L08k7l69J75m6M8K4j71k31K20J06l4J70n82M34j15J85K12k23
2905F4N0m79L91j32P4P8l9L02o39M91j91Qj31r4K87o5Q1L0rK72l60J66m25N24
2929B54l33K37k84J96l3k25j37M37j64q3K80m7k05j76M47l22K53o8L37l60j12
2950a08K86j66J6j81L19j11j66J12r3L3J65Pj96J82q9k6j47K86k68M13m98K23
2972gJ75k11m2J99o7j75K73k37J83k20K43j47J33m1J65l02P9lj34K56j79k77N77
$$ plain form
2995 241 447 252 -38 -16 105 -27 25 31 -208 179 -17 143 71 -47 -224 -263 158 -202 51 -440 -142 0
3017 0 154 124 -62 -78 61 14 -115 -202 -273 179 -33 -56 343 -266 -10 -248 26 148 95 -41 29 367 -181
3040 -181 102 -298 -136 45 -77 -102 -100 100 -28 -80 -43 -36 -242 94 249 -299 -161 -78 -9 -367 102 162 152 -228
3064 -228 -12 90 4 -174 210 60 127 245 21 26 -25 -178 -47 208 -152 196 74 46 -186 -142 -96 -14 -178
3087 -178 -48 106 57 -223 109 -272 438 -90 -285 -60 -34 -250 -222 -137 28 91 134 196 381 92 139 -50 155
3110 155 -149 171 -15 82 17 -64 -311 -163 -15 -81 -15 -126 47 57 249 8 -68 239 254 278 101 -352 -186
3133 -186 -13 -212 6 191 56 432 -29 -4 -75 283 -154 141 -72 124 -172 15 103 174 -64 -180 -135 105
3155 105 -19 -184 186 220 125 -281 122 74 -11 35 10 14 -37 130 295 -217 23 90 107 -25 225 -268 -101 -13
$$ packed form
2995B41K06j95k90K2J21j32N2Ok39L87j96J60p2j18j77l9M21l60K53m91K98J42
3017@J54l0j86j6J39m7j29q7p1M52k12k3L99o09K56k38K74J22n3j36P0L38n48
3040a81K83m00J62J81j22k5KK00j28n2L7Pk06L36J55n48J38Q3O9l58M69O0j0l80
3064b28K16J02q6j78L84j50O7J18k24Nn1j53J31K55l60L48j22k8k32M4M6Q2j64
3087a78J30J54m9k80L32l81P10n28j95K25K6k16K8Q5J65O3M3O2J85k89M7j89K05
3110A55l04L20j86R7o5q1k47J48J48o6O6j11J73J0J92k41p6L07J5K4j77m53J66
3133a86J73j99K18J85j35L76m61K5p1L58m37K95k13J96k96J87Q8P1k38j16M5K40
3155A05j24j65L70L4r5m06M03m8q5M6k5Mn1J67J65n12K40O7J7j32K50m93J67Q8
$$ plain form
3179 -13 -98 5 -74 139 -38 -128 137 38 -19 320 -188 44 -100 205 240 301 284 -118 -105 -20 -161 -133 377 130
3203 130 -145 -49 58 379 133 -190 -149 -37 195 -23 -184 -104 -3 -291 111 -45 35 -146 -141 156 -88 75
3225 75 -93 42 -40 159 58 283 54 -147 214 -203 291 175 -79 279 13 138 -134 47 177 404 142
3246 142 -117 10 20 -227 241 -171 263 80 -26 -176 -227 189 -365 242 -127 -82 -171 84 315 -40 224
3267 224 -103 -196 -45 109 92 -211 51 -195 92 86 2 22 -257 32 -46 70 -339 109 49 -152 -199 126 -33
3290 -33 128 261 -249 -278 -139 217 -223 77 75 69 54 403 -72 106 -223 111 59 -243 229 -189 43 -89 -264
3313 -264 -92 -67 -111 -46 302 -54 -97 -68 -63 79 -89 -114 35 290 -110 -75 -339 97 315 -242 139 350 -15
3336 -15 205 60 50 -62 111 111 -96 9 270 -60 -46 228 149 -150 -160 -197 -77 38 -394 -274 347 33 57
$$ packed form
3179a3q5J03p9K13j77r0K65r9n7L39n08K32j44L05L5O1j7m02J3Q5j41K8N10k47
3203A30k75R6J07L21k46l23M1J12K32k18j61Q0J01k88M02j56Q0j81NK97k44J63
3225G5j68J35q2J99j01K25k29k01L61m17M94j16k54L58k66J25k72J81J30K27k62
3246A42k59J27J0k47M68m12M34j83j06j50n1M16n54O07l69M5q9K55K31l55K64
3267B24l27r3J51J54j7l03K62k46K87oq4K0k79K89p8J16m09M48o0k01m7L25j59
3290c3J61J33n10k9J39L56m40L00koj5L49m75J78l29L34n2l02M72m18K32j32j75
3313b64J72K5m4O5L48l56m3K9NJ42j68k5J49K55m00L5k64M36K18n57L81K11l65
3336a5K20j45j0j12J73%k07J05K61l30J4K74p9k99j0l7J20J15m32J20O21l14K4
$$ plain form
3359 57 -38 -12 127 -138 -45 199 -426 293 210 -5 -157 -230 -66 -187 -43 -27 101 102 203 394 207 184 -72
3382 -72 35 230 -179 160 -140 136 -169 -171 94 0 -241 48 101 89 148 3 91 -206 132 14 61 152 -432
3405 -432 174 328 59 30 109 -132 49 29 67 403 173 59 -171 -223 55 171 17 19 143 90 149 -321 23
3428 23 -49 129 74 -1 -132 -77 -213 -125 -275 117 -231 -71 -73 198 -194 36 145 -8 -63 -409 544 51 -43
3451 -43 -69 -51 54 82 -334 20 -126 133 94 -115 -350 -63 80 -24 -22 52 -181 -6 -51 -47 -20 -37 166 -19
3475 -19 -165 -187 -147 64 41 -176 163 -12 342 -85 -275 -115 -39 11 -228 82 3 10 -92 -89 -15 -225 245 85
3499 85 167 68 174 -123 -62 283 251 -91 -154 50 -28 250 77 -244 -307 -238 -270 176 -330 -220 66 178 234 11
3523 11 -353 -63 -366 252 -6 -132 -45 -92 -307 -264 128 -256 -111 -142 48 -54 -3 -66 -34 27 -101 31 277
$$ packed form
3359E7r5K6J39k65R3K44o25P19q3k15j52p3J64j21J44J6J28JJ01J91j87k3k56
3382g2J07J95m09L39l00K76l05kK65r4k41K89N3j2N9j45Q8k97L38j18M7R1n84
3405d32O06J54k69k9P9k41J81k0L8L36k30j14k30n2K78J16j54KJ24n3N9m70L44
3428B3p2J78n5p5j31N5j36Q8j50L92l48J60kK71l92K30J09j53n5l46R53m93r4
3451d3k6J8J05K8m16L54j46K59l9k09k35K87J43j04KP4k33J75m5MK7j7K03j85
3475a9j46k2M0K11k3k17L39j75L54m27j90J60P6N0k39L10p9Pj02LP4k10M70j60
3499H5Q2r9J06k97O1L45l2l42o3K04p8K78j73l21o3O9l2M46n06J10K86J12N6k23
3523A1l64K90l03O18k58j26Q7m7k15M3L92l84J45l1J90j02N1o3L2O1j28J32K46
$$ plain form
3546 277 388 -248 250 134 -71 -235 -233 212 -277 141 293 -121 150 268 -83 -40 24 -242 234 67 -33
3567 -33 -233 -292 214 -9 -242 41 -108 -128 -187 -56 -325 -126 431 -31 33 15 14 -17 98 55 -15 -134 324 85
3591 85 -137 -2 -103 59 -24 203 -131 -126 147 250 228 165 -119 193 -35 336 -242 74 -178 -95 254 -159
3613 -159 109 5 -109 103 217 -48 -198 170 215 -106 -124 51 -133 214 167 -93 169 141 61 65 -178 365
3635 365 174 190 149 -126 19 63 -45 -20 -38 -67 -60 -160 -218 -24 52 -20 94 49 171 -176 136 145 32 -61 98
3660 98 63 -327 -192 -190 -198 -127 -110 -226 -63 189 -211 168 -298 -197 194 -80 -80 -53 -243 99 34 95 -184 147
3684 147 0 -252 114 359 38 130 -255 -114 171 -249 -40 -6 -257 19 -286 155 -40 399 157 -156 -136
3705 -136 -125 383 420 -131 298 30 -179 306 280 32 -66 334 31 -117 -86 113 12 -107 162 -154 149 -176
$$ packed form
3546B77J11o36M98j16k05j64KM45m89M18J52m14K71J18l51M3O4k66M76j67j00
3567c3k00n9N06k23k33K83j49k0n9J31k69J99N57m62O4j8jl1J15m3p0j19M58k39
3591H5k22J35j01J62q3K27l34NK73J03k2o3k84L12k28L71n78L16k52Q3L49m13
3613a59K68j04j14K12J14k65j50L68M5l21j8J75j84L47m7k60K62k8q0Mk43N43
3635C65j91J6m1k75J45M4j08K5j8k9Pj00n8J94P6p2J14m5J22l47L12Rj13r3J59
3660I8l5l90J35KqP1J7j16J63K52m00L79m66J01L91k74%K7j90L42o5O1k79L31
3684A47j47k52L66K45l21R2l85J41K85m20K09L4k51K76l05M41j95M39k42l13K0
3705a36J1N08L7n51M29k68k09M85k6k48r8M00l03j48L1J99j01j19K69l16L03l25
$$ plain form
3727 -176 -203 62 216 29 -124 23 79 -99 -36 8 272 -110 -164 257 233 -87 587 -180 9 26 321 3
3749 3 132 -12 -303 -9 -161 89 22 -58 -238 -127 272 -60 -154 111 91 101 -178 209 -313 59 105 -112 -109
3772 -109 -18 -67 263 -40 -167 243 29 81 -70 195 170 -149 361 193 98 -110 377 -244 82 150 131 -98
3794 -98 174 65 116 5 -40 -30 -151 -5 121 198 -376 144 -86 -195 56 28 20 -70 -447 305 178 20 132
3817 132 -16 4 126 -176 212 109 -61 36 251 96 65 322 -77 -119 -136 5 -52 142 252 -237 71 50
3839 50 -8 40 223 -63 232 229 -69 32 -130 146 60 -306 -58 98 152 -169 -272 -80 -7 244 108 6 -277
3862 -277 -203 147 310 -24 168 178 169 -166 -8 -203 -309 -266 239 -119 184 -86 -82 -187 -69 -15 -238 -174 56
3885 56 -132 221 2 -89 263 26 -278 119 225 -46 -114 58 -15 -113 244 -108 -163 81 93 -93 175 -77
$$ packed form
3727a76k7K65J54j87j53J47N6j78O3M4K64l82n4M21k4l20O74p67J89J7K95l18
3749CJ29j44k91K94j52K50o7q0j80J11L99l32r4K65k0J0k79L87n22L72M6k17L
3772a09R1m9L30l03j27M10k14N2j51K65k5l19N10j68r5k08M87o21L26O8j9k29
3794i8K72j09N1j11m5J0j21J46J26P7n74N20k30j09K51k8qr0l77P52j27j58J12
3817A32j48K0J22l02L88j03j70R7K15j55l1K57l99m2j7J41n7J94J10m89L08k1
3839E0n8M8J83k86K95lk98J01j62K76q6l66K48J56N4l21j03J92P3K51j36j02k83
3862b77P4L50J63l34J92J0rl35J58j95j06M3N05l58L03k70Mj05J18N4k23O4K30
3885E6j88L53k19r1L52k37l04L97J06k71o8J72p3r8L57l52n5K44J2j86K68k52
$$ plain form
3907 -77 196 -177 106 15 260 174 -176 200 145 173 22 -54 -73 32 64 87 278 141 85 70 -138 -68 -143 173
3931 173 159 272 185 131 76 220 -77 31 -24 -125 48 -151 -97 114 56 -74 365 72 247 161 211 209 -28 -79
3955 -79 -46 163 -25 -121 174 9 79 257 153 -301 23 253 44 169 -178 -7 -267 174 -87 131 -242
3976 -242 -109 -20 103 -25 -157 -176 253 93 -58 -44 -228 -73 -39 200 163 -284 202 37 -10 -17 -65 174 -9
3999 -9 -45 58 -89 174 228 -28 45 -47 32 -338 -30 49 -272 97 93 -190 56 289 15 168 -114 -167 -103 213
4023 213 252 -62 47 -101 -272 351 191 11 63 -49 38 65 55 29 174 71 -108 -194 -102 144 111 45 -223
4046 -223 -23 -132 78 -15 -113 168 -19 208 -218 67 153 -253 -143 157 13 190 186 -181 24 -182 157 -149
4068 -149 -271 245 16 198 -95 -108 113 77 -32 62 -183 -19 269 129 -162 -18 -182 118 -36 -87 151
$$ packed form
3907g7K73l73K83r1K45q6l50L76n5K8j51p6j9J05L2K3J91j37n6j5k08P0p5L16
3931A73j4J13q7n4n5J44k97J08n5j01J73j99N4K11n8j30M39k93J75q6N0kk37n1
3955g9L3K09j88r6K95j65P0J78j04m54L24K30k09J25l47J71k60M41k61K18l73
3976b42J33Q9J23j28j32j9M29j60j51J4j84J55L4K39l7m47M86j65m7pm8K39j83
3999il6J03j47K63N4k56P3r2P9l70L08P9l21L69mk83K46K33k74J53k82n3O4L16
4023B13L9l14J09j48j71O23j60j80N2j12Q7K7j0k6J45j03j79q6R2K46l3o6k68
4046b23K00j09K10r3r8K81j87K27m26K85Q6m06J10L00j44J77ml67K05k06L39l06
4068a49j22N16k29J82k93j3K21l6j09R4k45J64K88j40k91J44j64L00j54n1K38
$$ plain form
4089 151 -124 -76 -42 -218 -175 -100 -40 -57 90 29 -214 179 -58 -116 -23 -123 120 -17 -5 -112 137 -390 -54
4112 -54 213 -2 -26 83 77 -33 -414 -305 -24 -115 -304 -144 -186 221 -45 -63 -287 68 -6 -186 -224 -50 107
4135 107 -333 -14 -70 -12 -22 -41 -92 230 -57 348 19 -86 -81 41 146 43 -107 157 166 27 237 172 228 85
4159 85 17 72 -116 28 2 -222 152 2 -6 -384 -132 -20 -350 327 -9 -149 27 5 231 -32 -34 -133 -319
4182 -319 -116 108 373 40 -58 210 59 56 153 45 87 -17 -295 -275 67 -197 193 91 -13 67 11 172 -60
4205 -60 -32 44 8 17 -120 24 161 -157 295 125 351 -58 0 -131 -239 81 -135 -352 16 -41 67 129 -311
4228 -311 -198 -335 -50 85 -425 341 -96 89 272 17 68 -148 -18 492 -45 -102 179 -254 264 27 12
4249 12 -31 29 -100 220 222 -264 38 -106 -37 24 -55 391 249 11 325 153 -96 33 -38 269 116 -125 19
$$ packed form
4089A51k75M8L4j76M3P5O0j7J47o1k43L93k37n8R3j00K43j37J2j07K49n27L36
4112e4K67k15k4J09oj10l81J09K81r1j89J60m2M07k66j8k24L55p4j80l8J74J57
4135A07m40L19n6N8j0j9n1L22k87M05l29j05NJ22J05j03j50K64Rj39K10o5N6j43
4159H5o8N5j88J44k6k24L74j50ql78K52J12l30O77l36j40J76k2K26k63kr9j86
4182c19K03K24K65l33r8K68j51lR7j08M2j04k78K0L42k64L90j02j04Q0n6J61k32
4205f0K8P6l6Rj37J44J37l18M52j70K26m09N8j31j08L20k16k17L68n7J08O2m40
4228c11J13j37K85J35n10P66m37J85J83k55N1k16J30N10n37n7K81m33N18k37j5
4249A2m3O0j29L20Km86L02j44O9O1p9M46j42k38L14j72k49J29p1L07j53k41J44
$$ plain form
4272 19 128 -52 -82 29 112 68 -3 47 98 -241 -17 77 -50 -120 218 203 61 -259 160 -74 -37 -230 262 -115
4296 -115 -149 -40 38 19 -126 -7 78 176 81 -5 -209 14 318 27 241 7 -169 183 -96 37 -164 -145 -4
4319 -4 -149 69 -71 -7 153 241 -6 -111 172 81 275 -74 -17 -27 -236 49 18 100 -140 22 -40 88 52 -35
4343 -35 74 -308 -280 -194 -170 -167 -120 -459 -266 -33 -150 57 205 -160 -391 -132 -82 -50 -92 -270 -260 -64 -218 -222
4367 -222 7 187 -138 -35 -54 -131 -43 189 -58 -117 -119 -29 -324 71 214 241 47 -183 -96 66 -69 56 -16
4390 -16 -53 154 -73 300 -188 -110 -126 89 -7 26 4 204 -179 -10 -101 131 37 -5 68 102 -194 -84 142 -126
4414 -126 2 362 -282 -44 -135 -64 229 64 60 128 104 271 270 196 237 30 -260 210 310 -127 -100 -14 91 28
4438 28 -234 282 -132 43 -156 22 330 -364 306 30 129 -1 -115 49 99 40 20 -8 -49 -145 151 37 42
$$ packed form
4272A9J09j80l0J11Q3m4p1N0N1l39K24R4j27p0L38j5j42l20M19k34L7j93M92l77
4296a15l4J09P8j9j45J19Q5R8r5q6k04K23L04k91K14k34j76L52k79J33k01J9J41
4319dj45K18j40O4J60Q8k47j05K83r1J94l49N7j0k09K85l1Q2k40J62o2J28l6q7
4343c5J09l82K8Q6K4LM7l39J93K33j17K07J48l65k31K59N0L2m2j78J0J96j54m
4367b22K29J80l25J03j9p7Q8K32k47n9kR0k95L95J43K7j94k30Q7J62j35J25p2
4390a6l7K07k27L73m88P8j6K15r6L3k2K00l83J69r1K32r4m2P3L4k96J10K26k68
4414a26J28L60o44K38r1P1K93j65mO8k4J67jp4M1k07k90M70J00m37K7Q6J05o3
4438B8k62N16m14J75j99J78L08o94O70k76R9j30j14J64N0n9k0k8m1r6K96j14N
$$ plain form
4461 42 2 232 207 64 164 7 -185 137 -238 -143 32 -49 320 24 -171 -23 45 186 -222 90 170 -207
4483 -207 192 -7 159 72 130 -91 -13 173 -80 -138 -89 473 22 -220 -371 -64 -30 -286 139 -321 123 -16
4505 -16 21 90 -65 398 11 -46 22 62 -245 -80 -362 -302 -119 90 90 148 169 220 -303 -100 30 81 229 118
4529 118 -110 -6 130 74 35 186 118 -160 35 -165 60 201 101 63 -120 -91 -42 -278 -16 92 288 -70
4551 -70 13 -12 -330 13 192 -47 -23 -227 233 -205 -87 -24 146 -77 228 -316 -84 66 -176 184 -12 -122
4573 -122 -208 -124 236 205 161 68 -253 74 13 -94 -175 57 -11 -407 201 54 79 -214 -176 50 173 268 8 129
4597 129 -125 13 -276 -55 -116 -181 -79 -106 -104 -162 -239 -54 138 -144 62 -202 89 167 -154 -119 -102 146 -57
4620 -57 7 65 -3 228 46 -22 158 27 -30 -193 -96 42 -138 -17 63 222 -7 -226 57 38 -203 -171 -9
$$ packed form
4461D2m0K30k5j43J00j57j92L22l75R5J75q1L69k96j95J48O8J41m08L12Q0l77
4483b07L99j99J66q7N8k21P8J86k53n8M9N62m51k42j51L07L4k56M25m60M44j39
4505a6L7O9j55M63l87n7O8M0l07J65k82O0J83K09%N8K1N1n23K03J30N1J48j11
4529A18k28J04J36n6l9J51o8k78J95k00K25J41j00l8j83K9M9k36K62J08J96l58
4551g0Q3k5l18L43J79k39K4k04M60m38J18O3J70k23L05n44K32J50k42L60j96j10
4573a22q6Q4L60l1m4r3l21L27o1j07q1K32o8l96O08j47K5k93L8K26J23R5k60J21
4597A29k54J38k89K21o1o5J02k7Kn8p7J85J92k82K06k64K91P8l21L5J7K48k03
4620e7O4N8o8K31j82o8J80j31n7j63R7J38j80J21Q0J59k29k19K83j9k41L2J62
$$ plain form
4643 -9 -28 75 -295 -234 -138 10 223 -363 -31 -41 37 -83 68 -33 -233 82 146 -112 -35 386 -259 -239 61
4666 61 -92 177 43 -104 193 97 -119 293 -250 -68 -65 -7 103 82 -83 94 101 169 11 -62 41 -180 -199 232
4690 232 49 109 -150 -421 43 -146 280 -19 -204 13 96 -194 23 -56 33 -23 119 140 -11 -90 -131 10 118
4713 118 129 -8 146 -21 134 87 -134 -160 -202 -233 -156 -8 -45 112 94 62 159 -10 283 -51 50 -243 108
4736 108 208 -67 -157 122 -159 -112 234 191 -28 -236 24 -39 189 -216 38 224 -137 -54 -110 166 -212 -141
4758 -141 132 -108 39 -63 -367 -23 256 19 292 4 228 197 119 95 146 -113 220 131 -38 -99 -74 331
4780 331 171 -194 -276 65 -233 -87 -198 388 -108 200 -347 -198 -162 -87 188 -229 -80 262 102 202 122
4801 122 -25 71 23 125 -280 -125 -363 101 -265 -239 -142 -277 15 -175 79 -108 -73 153 88 127 -277 -284 -172
$$ packed form
4643ij9J03l70O1R6J48K13n86L32j0P8j20J51j01k00L15O4k58P7M21o45K0L00
4666F1j53K69j34j47K97r6k16M12n43J82LN8J10k1j65J77PO8j58p3J03k21j9M31
4690B32j83O0k59k71M64j89M26k99j85K17Q3k90K17p9Q9n6J42K1j51p9m1J41J08
4713A18J1j37J54j67J55m7k21k6m2l1P7J48l7J57j8l2R7j69K93l34J01k93L51
4736A08J00k75r0K79k81M7L46m3k19k08K60o3K28m05K54J86l61Q3n6K76l78P1
4758a41K73k40J47j02l04L44K79k37K73k88K24l1p8k4N1k59L33q9j69o1K5M05
4780C31j60l65q2L41k98J46j11N86m96L08n47J49L6P5K75m17J49L42j60J00q0
4801A22j47R6m8J02m05J55k38M64l66K6R7j35K92j90K54j87L5K26o5L9m04pJ12
$$ plain form
4824 -172 -272 -206 -46 -255 307 140 -53 297 -68 124 56 72 9 -113 303 246 -34 285 128 -50 259 -244
4846 -244 -255 271 4 157 -96 -168 16 -95 -148 -100 -13 -73 312 27 -69 20 -150 -85 -88 -239 325 77 11 23
4870 23 -132 -90 -96 -107 -68 -146 32 168 81 -312 -60 -50 -65 -3 156 -92 6 -71 -79 240 111 -14 10 157 26
4895 26 391 35 20 -263 -142 -365 46 15 -181 -41 -365 73 90 -323 163 76 -82 -87 227 -146 -262 -155
4917 -155 187 -11 102 -42 118 285 65 305 -290 60 11 80 43 -29 93 -147 218 -91 144 -88 -132 45
4939 45 -102 -88 -165 334 -54 153 -278 153 119 -144 -233 -27 344 157 -191 -64 -18 417 13 344 -89 -24
4961 -24 88 -205 -110 302 -180 -14 136 171 19 -163 -21 18 283 31 165 -313 -18 -136 -127 -117 -206 -4 84
4984 84 43 241 -67 -140 172 -202 -222 262 -10 -7 -115 -272 74 85 50 57 425 -51 114 110 -123 170 150 46
$$ packed form
4824a72j00O6J60k09N62j67j93L50l65J92o8J6o3j22M16n7k80L19j57j78L09n03
4846b44j1N26k67J53k53p2J84j11n3M8Q7o0L85k85r6Q9j70O5lj51N64k48o6J2
4870B3j55M2oj1L9p8J78J36q7l93K52J0j5O2J59k48R8p7qL19j29j25K4J47j31
4895B6L65l56j5k83J21k23M11l1j96J40l24M38J7m13M86q7j58nL14l73j16J07
4917a55L42j98J13j44J60J67k20K40n95L50m9O9l7p2J22k40L65l09K35k32m4J77
4939D5j47J4p7M99l88K07m31M31l4k63q9K06L71j87l48J27M6M35m04L31m33O5
4961b4J12k93R5M12m82J66J50L5j52j82J42L9K65k52J34m78K95j18RJ0q9K02Q8
4984H4m1J98l08p3L12l74k0M84k72Lj08j57L46J1l5PL68m76J65mk33K93k0j04
$$ plain form
5008 46 72 -74 109 -4 -195 -128 -184 78 79 -254 -296 -106 83 93 -39 202 -293 170 -146 -79 46 246 -48
5031 -48 226 154 -132 140 49 139 164 -197 124 205 112 58 -3 -220 231 45 -227 110 363 181 100 -60 225
5054 225 -175 -143 108 76 -256 199 -256 -19 -71 -111 -90 -102 -30 -210 -48 -147 -174 109 214 -108 61 -89 101
5077 101 66 -150 -55 -1 110 45 64 200 2 -23 224 -93 -134 -159 44 357 -89 123 45 290 273 46 50 49 -246
5102 -246 -25 -81 98 84 -94 -24 -78 21 26 -123 25 -99 -249 128 85 73 237 176 278 5 161 247 -6 191
5126 191 421 68 53 -117 246 -221 188 134 -84 159 -33 0 -99 -167 43 181 -119 109 92 29 -234 -114
5148 -114 223 -33 238 184 109 183 -210 -154 8 109 146 65 18 -114 65 -88 -79 79 27 -8 -7 -375 -84 45
5172 45 168 12 -84 -361 -270 162 -47 124 154 -61 88 -286 -98 -166 124 10 3 139 -72 -180 215 -22
$$ packed form
5008D6K6j46J83j13j91O7n6K62Jl33m2J90J89J0j32K41m95M63l16O7J25K00k94
5031d8K74p2k86K72r1R0K5l61L21Q1r3n4o1k17M51j86k72L37K53j82q1j60K85
5054B25m00L2K51l2l32M55m55K37n2m0K1j2P2j80J62r9k7K83J05l22J69j50J90
5077A01l5k16R5N4J11o5J9J36j98k5K47l17m1k5K03L13m46K12p8K45j7k27Mjk95
5102b46K21n6J79j4j78P0n4R9Nj49J48j24j50L77m3j2J64o1J02k73J56Q6k53J97
5126A91K30l53j5j70L63m67M09n4k18K43j92L3r9o8K10J38l00K28j7o3k63J20
5148a14L37k56K71n4p5P4l93N6J62J01L7q1m7j32J79j53RJ58n2l5Jl68K91J29
5172D5J23j56r6k77R1M32k09J71L0k15J49l74J88o8K90j14pJ36k11j08L95k37
$$ plain form
5194 -22 -177 -296 -102 -231 -85 -11 111 86 -22 -67 94 86 98 -28 -35 11 54 -194 181 -79 -12 -176 -109 103
5218 103 -2 191 2 -312 98 -23 -83 -77 -100 448 19 -147 -44 -266 -157 -317 -59 7 97 -131 173 -94
5240 -94 20 -46 76 -127 105 -110 -240 -97 -160 -6 188 -14 -164 -219 -311 -152 -194 -58 36 -167 -71 39 122
5263 122 28 -181 -121 -211 4 350 46 199 -62 -128 24 -166 -40 9 -224 169 17 103 -98 88 -163 6
5285 6 -259 -61 49 -30 108 -127 -123 282 -192 179 -125 51 -21 315 131 185 -29 -34 39 -165 62 31 204 -170
5309 -170 400 -180 267 -8 268 65 64 -171 -180 -21 88 -138 -214 -26 126 330 135 -123 -22 142 65 220
5331 220 44 103 -428 54 35 267 -32 14 325 27 6 -35 40 -192 -36 -60 22 -323 -84 65 -115 -128 108
5354 108 58 188 164 -51 198 105 -241 -59 -219 -85 118 20 229 -40 -20 195 -58 337 7 21 175 149
$$ packed form
5194b2j55j19J94j29J46P4J22k5j08m5J61qJ2j26pM6M3k48L75k60O7j64O7K12
5218A03j05J93j89l14M10j21o0Ok3N48m29j66J03k22J09j60K58O6R0k28L04k67
5240i4J14o6J22k03K32k15j30J43o3J54J94k02j50n5r2J59m2J36R4k03R6J10Q3
5263A22r4k09O0r0K15L46l04J53k61o6J52j90J26M9k33L93j52Q6k01J86k51J69
5285Fk65J98J10p9J38k35MM05m74L71l04J76p2L36j84N4k14nP3k04K27l1J73l74
5309a70N70n80M47k75K76k03jk35rJ59J09k26p6J88J52K04j95k58J01J64p7J55
5331B20j76N9n31M82j9K32k99M6L11k98k1m1P5k32J56k4Q2l45K39J49j80j3K36
5354A08n0J30k4k15K49r3l46J82j60J34K03r8K09k69K0K15k53L95l30J4J54k6
$$ plain form
5376 149 49 -48 381 -34 -89 -144 -16 -119 95 51 -137 -17 170 29 -171 54 296 -59 -82 -67 -89 -23 6
5399 6 -175 -249 -254 -58 149 -62 -94 96 -123 -93 200 -1 -181 87 -232 15 -1 -193 199 93 -4 -77 92
5422 92 30 4 -18 210 25 -199 -72 133 -132 1 -241 74 -26 228 221 90 82 -6 -141 -386 -85 96 -108
5445 -108 -1 94 -242 -62 109 -116 -429 -166 171 173 -115 -223 -80 -91 270 -84 -77 -279 -157 219 -165 -16
5467 -16 -360 116 -54 97 213 21 117 142 -111 89 155 80 -55 133 -87 159 33 -117 118 238 97 183
5489 183 91 -226 229 92 -99 244 -36 82 -58 -187 90 -340 -117 -247 318 208 -137 -141 -171 -109 39 98
5511 98 -169 -116 160 182 106 181 81 45 -26 -118 125 -282 -83 -9 17 158 83 -66 198 105 -81 -23 429 20
5535 20 -206 -229 -165 90 -61 42 -112 150 2 188 168 67 -39 318 -106 220 -230 233 -232 30 -198
$$ packed form
5376A49j00r7M29m15n5n5J28j03K14m4j88J20J87j41k00K25K42l55k3J5k2O6K9
5399Fj81p4nJ96K07k11l2J90k19L0K93k01j80K68l19K47j6j92L92j06r7p3J69
5422I2o2k6k2K28j85k24J27K05k65J33k42L15j00K54pj31qq8j35k45L01J81k04
5445a08J07R5l36J80J71k25l13K63L37Kk88j08J43j1L61l54Pk02J22L76l84J49
5467a6l44M76j70J51J16j92R6K5k53K00O6p5j35J88k20K46j26j50K35J20j41Q6
5489A83r2l17M55j37j91L43k80J18j40j29K77m30K23j30N65j10l45ml0O2J48N9
5511I8k67N3K76K2p6P5j00l6p1r2K43m07J99P4K6J41p5j49K64r3j86N8M52m09
5535B0k26k3O4K55j51J03j54K62j48J86k0j01j06L57m24L26m50M63m65K62k28
$$ plain form
5556 -198 -230 275 264 75 70 -45 65 -104 276 -2 -90 84 135 -31 -188 53 47 -22 -78 -98 62 -89 128 38
5580 38 248 125 -342 100 31 -315 -107 110 10 112 -71 -24 -283 148 -190 -93 -90 128 -184 158 -131 -45
5602 -45 -102 132 49 -31 -56 -150 1 159 -111 -364 103 -196 -45 95 -75 -125 151 103 149 102 81 210 48 -160
5626 -160 310 -139 -207 -150 -8 51 6 136 -124 8 190 -109 338 106 -122 43 -389 16 -7 -60 -53 9 68
5649 68 -7 141 -123 -52 -5 -126 164 5 104 -84 -72 261 119 -62 -62 76 105 67 16 -156 -93 24 202 158
5673 158 146 70 0 -159 56 123 75 -93 281 237 -64 58 -106 -309 -165 112 -198 119 411 40 78 131 -101
5696 -101 39 -195 102 90 0 -154 -109 -21 -119 -193 144 140 383 201 -96 -167 -21 152 188 8 -124 17 -98
5719 -98 276 58 -47 -250 374 -169 74 -199 110 33 -257 -33 134 86 47 48 -309 70 -302 -222 -198 116 147
$$ packed form
5556a98l2N05j1j89nj15J10j69L80k78q8J74N1j66j57K41oo9n6k0J60j51K17r0
5580C8K10j23m67M42o9l46K08K17j00J02j83M7k59M31l38R7LK18l12L42k89Q6
5602d5n7K34q3q0k5r4J51J58k70k53M67k99J51J40j70n0K76m8M6m7k1J29j62k08
5626a60M70m49o8N7J42N9m5J30k60J32J82k99M47k32k28J65m32M05k3n3PO2N9
5649F8p5J48k64P1M7j21K90j59R9j88J2L33j42j81%J38K9l8n1j72O3J17J78m4
5673A58j2p6p0j59K15O7m8j68L74m4l01J22j64k03J44K77l10L17K92l71L8N3k32
5696a01J40k34K97j2r0j54M5Q8r8p4L37mK43j82k97p1J46J73L6j80j32J41j15
5719i8L74k18j05k03O24n43K43k73L09p7k90K24J67m8l9Jl57L79l72Q0K4L14L1
$$ plain form
5742 147 -40 220 -284 -116 -106 2 -125 -48 -312 26 -20 48 -226 -329 81 75 -86 -71 -182 125 -341 -142
5764 -142 78 -87 -159 194 -8 106 23 -85 -98 -295 175 155 -19 188 -47 375 -9 -31 197 31 -164 163
5786 163 75 -80 194 -129 124 131 -44 -345 293 -158 -344 123 -209 -123 -40 86 -25 550 -103 -338 -106 24
5808 24 112 23 -23 48 4 -204 -57 217 -217 307 192 -114 255 321 -135 69 -105 -292 -143 276 -98 253
5830 253 19 22 -153 36 -171 83 208 -28 61 158 -163 195 -128 -180 -265 251 10 167 22 -118 -409 -150
5852 -150 183 -211 -92 -82 235 25 -180 177 -41 73 -43 72 -109 -192 -91 145 -125 111 -10 102 59
5873 59 -128 -57 -266 42 62 291 -14 -60 -98 -591 -67 -228 103 100 163 -62 -80 291 -484 -103 -76 -135 -173 55
5897 55 -53 32 -194 -211 -60 -4 -138 48 -308 -301 200 43 -59 46 -87 -36 79 -109 -15 -254 -80 121 -168
$$ packed form
5742A47j87K60n04J68J0J08j27P7k64L38m6O8k74j03M10oj61J5j11L07m66J99
5764a42K20j65p2L53k02J14q3j08j3j97M70k0j74K07k35M22l84k2K28j66j95L27
5786A63q8j55K74l23K53Pj75l01O38m51j86M67l32Q6Q3J26j11N75o53k35K32J30
5808B4Q8q9m6P1m4k08J47K74m34N24j15l06L69O6m56K04j74j87J49M19l74L51
5830B53k34Lj75J89k07K54J25k36Q9R7l21L58l23n2q5N16k41J57j45j40k91K59
5852a50L33l94J19J0L17k10k05L57k18J14j16J15j81q3J01K36k70K36j21J12m3
5873E9j87P1k09L08K0K29l05m6l8m93N24j61L31lO3k25j8L71p75L81K7n9l8K28
5897E5j08Q5k26j7J51N6j34J86l56PN01j57j02J05j33N1J15j88R4k39J74K01k89
$$ [...]
8191A0
##END NTUPLES=NMR FID
##END=
