##TITLE=1H_DE-79K2TFA3
 CDCl3
 8 sc, 
 2.12.2024
##JCAMPDX= 6.0         $$ Bruker NMR JCAMP-DX V2.0
##DATA TYPE= NMR FID
##DATA CLASS= NTUPLES
##ORIGIN= UXNMR, Bruker Analytische Messtechnik GmbH
##OWNER= root
$$ XWIN-NMR		Version 3.5
$$ Mon Dec  2 15:37:28 2024 Russian Standard Time (UT+4h)  she@DPX200
##.OBSERVE FREQUENCY= 200.1315
##.OBSERVE NUCLEUS= ^1H
##.DELAY= (6, 6)
##.ACQUISITION MODE= SIMULTANEOUS
##.ACQUISITION SCHEME= undefined
##.AVERAGES= 8
##.DIGITISER RES= 18
##SPECTROMETER/DATA SYSTEM= spect
##.PULSE SEQUENCE= zg30
##.SOLVENT NAME= CDCl3
##.SHIFT REFERENCE= (INTERNAL, CDCl3, 0, 15.7039)
##AUDIT TRAIL= $$ (NUMBER, WHEN, WHO, WHERE, WHAT)
$$ ##TITLE= Audit trail, XWIN-NMR		Version 3.5
$$ ##JCAMPDX= 5.01
$$ ##ORIGIN= Bruker BioSpin GmbH
$$ ##OWNER= she
$$ F:/spectra/data/she/nmr/H-F/1/audita.txt
$$ ##AUDIT TRAIL=  $$ (NUMBER, WHEN, WHO, WHERE, WHAT)
(   1,<2024-12-02 15:36:28.31 +0400>,<she>,<DPX200>,
      <created by zg, POWCHK disabled, PULCHK disabled
       configuration hash MD5:
       00 E9 B6 7A A2 85 ED C7 34 08 36 98 17 FE 4E 26
       data hash MD5: 16K
       CF 1A 53 AA 7D 5A 03 DF 83 B8 D7 AD 5B 29 DE FD>)
$$ ##END=
$$ 
$$ hash MD5
$$ 84 66 CE D0 B6 35 F9 26 78 6E FA A4 CF 20 33 8B
##$RELAX= 
##$RELAX= 
##$RELAX= 
##$RELAX= 
##$RELAX= 
##$RELAX= 
$$ Bruker specific parameters
$$ --------------------------
##$DU= <F:/spectra>
##$EXPNO= 1
##$NAME= <H-F>
##$PROCNO= 1
##$TYPE= <nmr>
##$USER= <she>
##$AMP= (0..31)
100 100 100 100 100 100 100 100 100 100 100 100 100 100 100 100 100 100 
100 100 100 100 100 100 100 100 100 100 100 100 100 100 
##$AQSEQ= 0
##$AQ_mod= 1
##$AUNM= <au_zg>
##$AUTOPOS= <>
##$BF1= 200.13
##$BF2= 200.13
##$BF3= 200.13
##$BF4= 200.13
##$BF5= 200.13
##$BF6= 200.13
##$BF7= 200.13
##$BF8= 200.13
##$BYTORDA= 1
##$CFDGTYP= 0
##$CFRGTYP= 5
##$CHEMSTR= <none>
##$CNST= (0..31)
1 1 145 1 1 1 1 1 1 1 1 1 1 1 1 1 1 1 1 1 1 1 1 1 1 1 1 1 1 1 1 1 
##$CPDPRG= <>
##$CPDPRG1= <>
##$CPDPRG2= <>
##$CPDPRG3= <>
##$CPDPRG4= <mlev>
##$CPDPRG5= <mlev>
##$CPDPRG6= <mlev>
##$CPDPRG7= <mlev>
##$CPDPRG8= <mlev>
##$CPDPRGB= <>
##$CPDPRGT= <>
##$D= (0..31)
0 1.2 0 0 0 0 0 0 0 0.06 0 0.03 0 0 0 0 0.0002 0 0 0 0 0 0 0 0 0 0 0 0 
0 0 0 
##$DATE= 1733139387
##$DBL= (0..7)
120 120 120 120 120 120 120 120 
##$DBP= (0..7)
150 150 150 150 150 150 150 150 
##$DBP07= 0
##$DBPNAM0= <>
##$DBPNAM1= <>
##$DBPNAM2= <>
##$DBPNAM3= <>
##$DBPNAM4= <>
##$DBPNAM5= <>
##$DBPNAM6= <>
##$DBPNAM7= <>
##$DBPOAL= (0..7)
0.5 0.5 0.5 0.5 0.5 0.5 0.5 0.5 
##$DBPOFFS= (0..7)
0 0 0 0 0 0 0 0 
##$DE= 6
##$DECBNUC= <off>
##$DECIM= 24
##$DECNUC= <off>
##$DECSTAT= 4
##$DIGMOD= 1
##$DIGTYP= 9
##$DL= (0..7)
0 120 120 120 120 120 120 120 
##$DP= (0..7)
150 150 150 150 150 150 150 150 
##$DP07= 0
##$DPNAME0= <>
##$DPNAME1= <>
##$DPNAME2= <>
##$DPNAME3= <>
##$DPNAME4= <>
##$DPNAME5= <>
##$DPNAME6= <>
##$DPNAME7= <>
##$DPOAL= (0..7)
0.5 0.5 0.5 0.5 0.5 0.5 0.5 0.5 
##$DPOFFS= (0..7)
0 0 0 0 0 0 0 0 
##$DQDMODE= 0
##$DR= 18
##$DS= 0
##$DSLIST= <SSSSSSSSSSSSSSS>
$$ [...]
##$SUBNAM2= <"">
##$SUBNAM3= <"">
##$SUBNAM4= <"">
##$SUBNAM5= <"">
##$SUBNAM6= <"">
##$SUBNAM7= <"">
##$SUBNAM8= <"">
##$SUBNAM9= <"">
##$SW= 24.0689530833862
##$SWIBOX= (0..15)
0 0 2 0 0 0 0 0 0 0 0 0 0 0 0 0 
##$SW_h= 4816.95568400771
##$TD= 16384
##$TD0= 1
##$TE= 0
##$TE2= 300
##$TE3= 300
##$TEG= 300
##$TL= (0..7)
0 120 120 120 120 120 120 120 
##$TP= (0..7)
150 150 150 150 150 150 150 150 
##$TP07= 0
##$TPNAME0= <>
##$TPNAME1= <>
##$TPNAME2= <>
##$TPNAME3= <>
##$TPNAME4= <>
##$TPNAME5= <>
##$TPNAME6= <>
##$TPNAME7= <>
##$TPOAL= (0..7)
0.5 0.5 0.5 0.5 0.5 0.5 0.5 0.5 
##$TPOFFS= (0..7)
0 0 0 0 0 0 0 0 
##$TUNHIN= 0
##$TUNHOUT= 0
##$TUNXOUT= 0
##$USERA1= <user>
##$USERA2= <user>
##$USERA3= <user>
##$USERA4= <user>
##$USERA5= <user>
##$V9= 5
##$VALIST= <valist>
##$VCLIST= <CCCCCCCCCCCCCCC>
##$VD= 0
##$VDLIST= <DDDDDDDDDDDDDDD>
##$VPLIST= <PPPPPPPPPPPPPPP>
##$VTLIST= <TTTTTTTTTTTTTTT>
##$WBST= 1024
##$WBSW= 4
##$XGAIN= (0..3)
0 0 0 0 
##$XL= 0
##$YL= 0
##$YMAX_a= 222549
##$YMIN_a= -138062
##$ZGOPTNS= <>
##$ZL1= 120
##$ZL2= 120
##$ZL3= 120
##$ZL4= 120
##$ABSF1= 10
##$ABSF2= 0
##$ABSG= 5
##$ABSL= 3
##$ALPHA= 0
##$AQORDER= 0
##$ASSFAC= 0
##$ASSFACI= 0
##$ASSFACX= 0
##$ASSWID= 0
##$AUNMP= <proc_1d>
##$AZFE= 0.1
##$AZFW= 0.1
##$BCFW= 1
##$BC_mod= 2
##$BYTORDP= 1
##$COROFFS= 0
##$CY= 11.3945322036743
##$DATMOD= 1
##$DC= 2
##$DFILT= <>
##$DTYPP= 0
##$F1P= 15.6554695791079
##$F2P= 12.8336369535428
##$FCOR= 0.5
##$FTSIZE= 0
##$FT_mod= 4
##$GAMMA= 1
##$GB= 0.15
##$INTBC= 1
##$INTSCL= 1
##$ISEN= 128
##$LB= 0.24
##$LEV0= 0
##$LPBIN= 0
##$MAXI= 10000
##$MC2= 0
##$MEAN= 0
##$ME_mod= 0
##$MI= 1.114404
##$NCOEF= 0
##$NC_proc= 0
##$NLEV= 6
##$NOISF1= 3.799351
##$NOISF2= 2.8
##$NSP= 1
##$NTH_PI= 0
##$NZP= 0
##$OFFSET= 15.70392
##$PC= 1
##$PHC0= -26713.07
##$PHC1= 6.98744
##$PH_mod= 1
##$PKNL= yes
##$PPARMOD= 0
##$PSCAL= 0
##$PSIGN= 0
##$REVERSE= no
##$SF= 200.130013532006
##$SI= 16384
##$SIGF1= 3
##$SIGF2= 2
##$SINO= 400
##$SIOLD= 16384
##$SREGLST= <1H.CDCl3>
##$SSB= 0
##$STSI= 0
##$STSR= 0
##$SW_p= 3612.71676300578
##$SYMM= 0
##$S_DEV= 0
##$TDeff= 0
##$TDoff= 0
##$TI= <>
##$TILT= no
##$TM1= 0
##$TM2= 0
##$TOPLEV= 0
##$USERP1= <user>
##$USERP2= <user>
##$USERP3= <user>
##$USERP4= <user>
##$USERP5= <user>
##$WDW= 1
##$XDIM= 8192
##$YMAX_p= 0
##$YMIN_p= 0
$$ End of Bruker specific parameters
$$ ---------------------------------
##NTUPLES= NMR FID
##VAR_NAME=  TIME,          FID/REAL,        FID/IMAG
##SYMBOL=    X,             R,               I
##VAR_TYPE=  INDEPENDENT,   DEPENDENT,       DEPENDENT
##VAR_FORM=  AFFN,          ASDF,            ASDF
##VAR_DIM=   8192,          8192,            8192
##UNITS=     SECONDS,       ARBITRARY UNITS, ARBITRARY UNITS
##FACTOR=    0.0002076,     1,               1
##FIRST=     0,             0,               0
##LAST=      1.7004516,     0,               0
##MIN=       0,             -138062,         0
##MAX=       1.7004516,     222549,          0
$$ Real data points
##PAGE= N=1
##DATA TABLE= (X++(R..R)), XYDATA
$$ [...]
2001h0k75K69%j01m4K98j10J97l26l5j6K12l58K93Q6j0O9R0m59J97K20k56J28
2024a1k45K01J07J55l76M1L64j57l29J6J92K93r3l27j2N48n76M26l28J33j31L7
2046g2J33J56N4l27K29m18n0M64n39K02K05J19j17Jj13J87j2k42J07j51j70O58
2068C04k36n9j58L30j77k36L64o2O6m31L49J13l03K65r4k3m15K53J69p4K61k07
2090ap3N5K62k69j91K08j84L44n5j14j9l7M21k62j66O6K13m06M87k53K51n18K98
2113E7K4l61K98J68m17K83j92J17J43N9j07k43L39m20N18k28lo2M18j46k31R1
2135A05j82m27O11j66m6j07O4J55j00J7J00K59k30q5J08j23J55m12K20R8K3j06
2157f9q1J01NM2L01l34l13J9M80Kl7n3J5r9q6K41j47N8pQ3k10MK9o0K13j77L20
$$ y = [-80, -355, -86, -86, -187, -231, 67, -43, 154, -172, -207, -223, -11, -369, -76, 10, 0, 69, 159, -300, -103, 117, -139, -11, -256, -55, 52, 207, -169, -128, 236, 79, -250, -234, -42, 251, 158, -169, -181, 367, -209, 217, -111, 22, -109, -72, 61, 217, 271, -56, 173, -245, -295, 169, -370, -168, 37, 156, 39, 40, -73, 114, 102, -140, -33, -184, -354, 304, 68, 9, -149, 181, 4, -232, 132, 70, 136, -295, 54, 167, -136, 129, 35, 12, -403, -150, 19, -55, 206, -1, -74, -19, 243, -26, -217, -9, -193, 151, 96, -18, -37, -74, 347, 85, -81, -15, 198, -208, 279, 26, 277, -241, 57, 81, -280, 18, 186, -231, 52, -140, -23, 120, 179, 72, -171, 168, -252, 266, 38, 35, -27, 391, 245, 14, 105, -77, -504, 107, -59, -105, -212, -148, 7, -93, -76, 24, 283, 53, -32, 76, -47, 108, -304, -84, 14, 37, -69, -150, -49, -44, -2, 299, -35, -348, -329, 151, 153, 116, 63, 78, -21, -107, 134, -13, 45, 38, 121, -89, -85, -56, -116, 97, -80, 240]
2184B40j73p8P6j06M6J76m7j55P7l1r9l9K16J7j48J43J14o0l27P6p9R0K52l95
2208b14L65l72J36m03L51N73n72j15L76j63P1k52L47k23J59l7K51l71k21K83J24
2229I3qk69j06K69R8P9n91O58j4j89l33k5M17n8l22K50J92o2O4J32l28p4P6J02
2253E1j39M3k00L89n3k01K07r1p0j04K65j63L46n31J44J59j82L27k98k4K67q5
2275E7j85M6K46k69M39n08M6l1M7O6k2M3K74mk2l81J82j9K26k98M7L98l91j95
2299b08Q0K36j40K4k6K1p2j34J4J18R4n1l17K47q9R0K89p4J77q9j49J35k73J05
2323Hl14K86L74m58N1NL5L27m77P9O3M5L15k31n09L00R3M2Mj9J00o8m8L69k07
2348A65j79J48k77K57j29q5K58J12m45K22l89M87l9j97J58kj53L06j80l54L02
$$ y = [240, 67, -11, 65, -41, 5, 181, 134, -21, 56, 25, -74, -113, 103, 120, -28, 115, 229, 169, -158, -82, -161, -71, 181, -214, 151, -221, -85, -488, -137, 436, -136, -251, 125, -38, 33, -219, 128, -95, 64, 27, 278, -93, -314, -31, 93, 85, -184, -290, -21, 77, 156, -435, 223, 209, 20, -313, -338, 79, 21, -301, -51, 141, 79, 143, 275, -53, -127, -51, 51, -88, -45, -245, 144, 91, -110, 97, 6, -64, -168, 97, -66, 280, -251, -107, 52, -130, 197, -101, -125, 142, 57, -128, -82, 164, -105, 334, -174, -128, -159, -112, -46, -68, -25, 249, 245, 223, -158, 24, 5, 231, -67, -20, 378, -13, -208, -128, 108, -32, -8, -34, -13, -85, -219, -205, -87, 7, -44, -361, -114, -203, -113, 176, 102, 279, 190, 41, 176, -97, 8, -306, -20, 354, -104, -53, -48, -13, 314, -163, -84, -21, 24, 339, 108, -401, -101, -8, 34, 38, 19, 119, 51, 3, 372, 165, -14, 134, -143, 114, -15, -100, 158, 270, -175, 47, -342, 145, 106, -91, 67, 65, -88, 218, 38, -316, -14]
2369a4j19L50o9j43j13L55k74k26J70P5l71K79J84j20J88j8j47o9K59m22R1L60
2391B06J59m51K69j81M92n20O5k23L54N2m92L62j78K8L19j11Qr5k13j1J26J51
2413A16n06M23P9j79n4K14l42K7k9P55q16L69J1Q1J34j98J25m68J23L38m26L99
2435A76l35L06j58kp6j46J19q6K43j06J64j18K38m33K18J93J07k41Ml76L47k0
2457A8J15k67M19k80j00l4j89N02pk56J51Q7l25J58L4L5k72M02q1k25J70N2k46
2480a39R5M9j19K0K70Q0k48K19j73L47n95l0L56p6P3M9j01K07p4l00J54J48j84
2503B8k83L86k8k96J34l34L94%J50j88k52M72N7m87K5M10j03m99N44j54L5O3J32
2526B06k44J39k28m9L40j89J3J08J61o30M11N9k5j60oO9q0K48k82M1J77l08K88
$$ y = [-14, -133, 217, 148, 5, -108, 247, -27, -253, -83, -8, -379, -100, 84, -36, 152, 134, -13, -82, 177, -245, -154, 206, 365, -86, 183, 2, 494, -26, 39, -184, 170, 222, -270, 92, -86, -58, 261, 150, 158, 63, -150, -161, -35, 116, -390, 33, 112, -67, -121, 93, -249, -222, -251, 504, -312, 57, 68, 149, 283, 85, 210, -258, -135, 203, -223, 176, -159, 147, -11, -13, -89, -235, -116, -202, 41, -65, 99, -19, 219, -214, 4, 197, 304, 63, 67, -309, 38, 18, 133, -134, 285, 5, -95, -129, -318, 184, 177, -79, 72, 159, -166, -8, 26, 61, -211, 191, 110, -115, 55, 107, -139, -44, 5, -114, -94, 176, 256, 8, 227, 54, 401, -194, -224, 132, 56, 129, 178, 77, 284, 210, -90, 64, 212, 28, -255, 131, 103, -193, -59, -393, 1, 1, 151, -37, -289, 183, 240, -247, -222, 188, 85, -414, 130, -24, 11, 74, 206, -38, 101, -127, -176, 164, -25, -12, 96, 257, -373, 38, 97, 72, -88, -94, -25, -105, 143, -139, -98, 79, -229, 59]
2549E9K46P7l78J69J9j11m01K94J91m68L11J71l94pK82k38J80j81K86k64L16j05
2571E4J04o8J70m4l76L08k22j56J18J32j49K07k43K57l25J48JJ94k64k3M04k55
2593b8J35j18J12j84o2K03m8j20L35k49M5L27l02R5n0k72j04N02l81K72M5L5m31
2616b43N07l3Qq24N75j85L00j15j65K2K07n1L59k23jn68P28l39J5P5k22L52K70
2639D49m40J69J49k65J96l92r3K21n7J65k53K65L1k62K30J77L6m57L23j99J36
2660A29j55K41l40K80l89M42j67l10K12K4Qj89L28j69K54j01P8O6k96O9j40mK99
2683A70k51K87j7m06n9P3J08J90j19J62n50M54k81M08l13j19N39j43J79l75J43
2704H0J05m50N5k2J97m7J96j74J05J88l68J26j31K71q8j48L60p9k31pK0J30O2
$$ y = [59, 305, 382, 4, 173, 192, 81, -320, -26, 165, -303, 8, 179, -215, -222, 60, -178, 2, -179, 107, -157, 159, 54, 158, 90, 260, 216, -160, 148, -74, -230, -112, 20, -129, 78, -165, 92, -233, -85, -84, 110, -154, -177, 227, -28, 107, -11, 101, -83, -145, 58, 10, -110, 225, -24, 21, 348, 46, 141, 91, -181, -285, 217, -164, 108, 153, 188, -243, 264, 231, 239, -585, -10, -195, 105, -10, -175, -153, 54, 3, 362, 139, 138, -430, 298, -41, -26, 49, -173, 179, 449, 9, 178, 327, 62, 258, -134, -227, -6, -63, 102, -151, 114, 145, -117, 113, 290, 326, -131, 192, -7, 129, -26, 215, -125, 155, -234, 208, 41, -269, -57, -33, -25, -214, 114, -55, 199, 98, 176, 242, -54, 15, -125, -129, 170, -81, 206, 189, -217, -276, -203, -95, 95, -24, 138, -412, 42, -239, 169, -144, -263, 276, 133, 312, -63, 80, 185, -265, -210, -232, -35, -82, 114, -60, 45, 233, -135, -9, -140, 131, 43, -105, 255, 176, -55, -62, -42, 88, 150]
2727A50j77K92k89k6J68j68j68K50k24K56J5j24L37O0n98K91k0Q1r7m5k1K01k32
2750h8Mj73N77l18k30P42p36K87L5J61r4n15L52J76l35L0M00k01j35J31J94J3
2772B77l63K39kJ59l13O8p5K05j68p9k89L51n9j48M99l67J27L3j88J4K03j93R1
2795B2p5k72lJ50K00J44J04j32j46R1%j3J42l1j71J56nk43o05P52k61MM37l84
2819a39J73j60K92r7m42L14P0j35J09J3Q7q4J81l32P2J10k48J34J70k06J15l4
2841c7J03o4k6M9Mo2K69j48J22k21K93j19k26R3j10Q0R3R2k23K8N07j85j7n93
2865b98L12J75k83j44J8K87k55K85j3p1J51j15k98N55l74K3M26o04L04m46L93
2886B8j86K86m12n7J59J95m7L25K6l70k02J4M01k82Jj07j46L09K45k62L32k01
$$ y = [150, -27, 265, -24, -50, 118, -50, -218, 32, -192, 64, 79, -45, 292, 352, -246, 45, 25, 106, 9, -36, -57, 144, -88, -84, -257, 320, 2, -228, 514, -222, 65, 100, 261, 167, -348, 4, 180, -155, -125, 275, 74, -61, 70, 264, 277, -86, 153, 151, 310, -3, 65, -10, 195, 27, -52, -341, 10, -49, -197, 302, -65, 62, 95, -93, -79, 124, -69, 22, -53, -325, -328, -178, 22, 166, 270, 138, -8, 83, 83, 70, 212, 181, 10, 166, 161, -82, -687, 65, -196, -192, 245, -139, 34, -126, 166, 69, -373, -59, 11, -124, -15, -2, 85, 1, 182, -150, -78, 32, -216, -82, 88, -118, -3, -37, 66, 2, -24, 25, 29, -33, 236, 88, 210, -11, 282, 163, -63, 30, -80, 0, 93, 185, -38, -10, 497, 312, 295, -298, 14, 189, -94, -238, -220, 67, -188, 97, 84, 13, 164, 49, -249, 306, -68, -45, 381, -223, 81, -365, 28, -158, 128, -284, -341, -182, 13, -34, 291, 317, -53, -255, -241, 160, -122, -121, -228, -374, -65, 180, -82, 250, 49]
2908D9K92m00M9N7k1J33r3J2r0J79qr5l99J35J34J34OL04m49l03J06L64l8R2k68
2933a18N9j72Q8K62l10J41K65p9j4Nk1j58L18l13K8L10n21O54j60l80N1K91l23
2956i7K60j96j06M63n80QL44j13K66m87J99J67M7j25P5k05j82K36J19j72m4K60
2978A37j22J71l17J95J49m54J54lJ11N3kK71k70l81K35q3l4N15m10r7O9K68n3
3001A02n93M10l56M57m2J89j3j41K3qj49J74kJ54k31JL20k61J03J19k44j9K25
3024B18r4m24L76J9q5k19L81l18J35N4l01L20k38J40K60j86J11k96j99M59j43
3045c0p6L02m3N4j95l57L46K0J16l1j64O9L29m51K04j90p8L41m83K88L4q1M09
3068C33o22J26J66L1k41K86Q1n8J9J36m37J06K32QJ42k50j3j93j08M57l82O2L28
$$ y = [49, 341, -59, -10, 47, 26, 159, 66, 78, -12, 167, 159, 64, -335, -200, -66, 68, 74, 378, -71, -374, -268, 96, 58, 150, -118, -59, -231, -143, 119, -191, -50, 215, 136, 122, 127, 106, -52, 266, -47, -19, 291, -230, 424, 264, -116, -65, 226, -97, 163, -33, -139, 324, -256, -248, 96, -17, 249, -238, -39, 128, 175, 50, 125, -80, -262, -26, 93, -79, -123, 137, 15, 186, -131, 64, 213, -241, -87, -90, 21, 74, 72, 343, 73, -308, -73, -156, -190, 325, -85, -182, -113, 155, 102, -491, -81, -437, 20, -22, 167, 154, 13, 36, 28, -121, 53, 51, 205, -26, -25, 295, 34, 137, 256, 12, -7, 218, 124, -300, 76, 95, 10, -209, 172, -146, -11, 43, -258, 62, -176, -36, 224, 38, 149, -147, -346, 113, -30, -106, 196, 153, 207, 12, -345, 1, 21, 137, 106, -58, 11, 340, -111, 93, -97, -175, 166, -317, -29, 5, -76, 333, -289, -163, 3, 34, -207, 79, 160, 102, 121, 257, -180, -74, 158, 166, 308, 58, 45, -148, -256, 201, -181, -119, 209]
3091B09k09P9m9m9k40M39l19k16K37J45j36J86K4K45n09P7k11M99k35L59m44r0
3113b08N28J12m73J62m2j49J80K4j45J50J56p10N90j44M8k48K63l24N26k98J49
3134A47j69j66R0J72M5k18J50q3L17q4j46J28j33j12O9l6l70K14Q7J24k46O8J4
3157a38L08j81K91j51j18J7O4R2k95JJ20J16k85L85l39M30j91j11M08l65M5l56
3179b53L48l07J37J17K73l56O9j87j37J79K15m04L66k29M29k27j31K20J37k13
3199D6q3Q4l13J83J08k84J93m39O59k69J15r2j20J40N3N1K31j08P1J1k38K64k88
3222b5j27J55l2K06j18O8k13K05j30k90L60M22l68j79L07k16l15J77N4L40q25
3243e44N45Q5k22J36J30j69j33k56M30j21Q9K13k74R7k48K88r3j74P45l51m06
$$ y = [209, 0, 79, 30, -19, -259, 180, -139, -355, -118, 27, -109, 77, 101, 346, -163, -86, -297, 202, -33, 326, -118, -208, 320, 432, -41, 121, 79, -70, 110, 134, -11, 139, 295, -415, 175, 31, 79, -169, 94, -230, 296, -2, 147, -22, -188, -98, 74, 119, -99, 51, -32, 285, 201, 55, 183, 50, -62, 7, -29, -399, -185, -98, 26, -220, -152, -138, 170, -11, 280, 129, 11, 28, 92, 184, -111, -110, 10, 126, -159, 226, -113, 317, 126, 15, 423, 58, 103, -253, 95, -212, -75, 42, 315, -41, 28, -159, -296, -117, 98, -306, 60, -169, 260, 33, -98, 122, 259, 46, -37, 47, -266, -83, 25, -259, -66, -505, 154, -115, 0, -92, -212, -72, -19, 32, 263, 155, 226, 237, -1, 263, -25, -152, 3, -29, 177, 59, 127, -86, 119, -11, -301, 59, 481, 113, -66, 241, 25, -290, -113, -59, 281, -544, 1, 86, -136, 0, 130, -39, -172, -428, 2, -119, -30, 183, -91, 6, -242, 46, -47, -221, 524, 173, -233]
3264b33O3K37K29m37q2K92m06J2K43O2M2K50m27K09l71N56k99j52M18j73k8rK8
3287B4J3k11NO1O5j43M21k95k2J32k50K35K84n19L25k92M0M48k43J9J10l28K22
3310A01m3J6j05p8P8j85K61Lj29QO0k08J28J40O0j02j58JM02l28J15j8J29k61
3334a13K84j66K13k35r0J01J67m1l08M05k94k7N5L95m03K62k23j54K52k17K97
3355A60j9k19k76O37j72j85J23k48K67ROk52L12m16M68l12J81l09L86p8j48J75
3377I0k69J92j30K84j38M0j03r4K4L33n84K00Q3q3N64j82l44J63P0j43J2K09l64
3400a70o9P5L22k87J74K29r4p3k60R0J08P3Oj5m2k2k26M44k53L4j20Q7o2K24p0
3425A03L8k90j86L00K1O6J55k02K21m00K61k45J44Q2j61K19l1l61J50L30N6j79
$$ y = [-233, -170, 67, 296, -141, -223, 69, -337, -325, -82, -20, 22, 272, -155, 54, -317, 239, -60, -212, 206, 33, 5, -4, 24, 37, -174, -169, -108, -43, -186, 235, -60, -82, 50, -200, 35, 319, -200, 125, -167, -127, 321, 78, 97, 207, -121, 101, 58, 74, -31, -109, -31, -216, 45, 48, -81, -73, -13, -221, -93, 47, 107, 5, -153, -152, 250, -78, 37, 19, 148, -113, 171, 5, 218, -17, -107, -6, 161, 120, -188, 217, -77, -104, -49, 346, -57, 205, -18, -172, 80, -137, 160, 141, -78, -354, 283, 111, -74, 49, -199, 68, 77, 83, -169, 143, -273, 195, -117, 64, -245, 141, 63, -85, 90, -179, 13, -117, 167, 29, 69, -34, -128, -104, 229, -355, -155, -72, -155, 409, 227, -117, 46, 116, -27, -15, 194, -170, -239, -164, 158, -129, 45, 274, 180, 107, -153, -63, 45, 118, 124, 109, 67, 45, -181, 263, 10, 44, -76, 11, -51, 173, 103, 141, -149, -335, -35, -14, 52, 207, 5, 226, -174, 87, -158, -14, 68, -93, 126, 95, -266, -116, 214, 270, 91]
3447I1j14p7K24j29j88rK75j95J23K10n9J43j18l83n7M8K29J18O4p1M4m96L88
3470F1k24L05J15l08k2k96K07K36k36M70j37l20L94p7j90j3K50m29M41Q8j59j76
3492b0K6J11L3j36r6j22J54l1k21K28J3j79N77j02j90j60L58k24Qk93N82m82M6
3515a20K33j28q4J16J58j97L07m29J56J04j87J25J44j60J14q6j96PL09j06K7k85
3537a78K48J54o1k80J62K48k56j46K65j03j31J23%K35k1l9Q8l50J31j98M1K52
3559A84k34r9J45R2k81K89m78K38K74P0l09K81j55k35K69j60J26J81n0m66K16
3580a02Q8m2J03j68J01qJ46k71M84k85k92M79l93K42R9k34K55l56J82K99m18K64
3602A73mn1l20J55O0J36j56%OJ78k79L6P9j55J76j03R0k8N6j94L35k51L9j69K73
$$ y = [91, -23, -100, 124, -5, -193, -202, 73, -122, 1, 211, 152, 295, 177, -206, -263, -215, 14, 132, 196, 125, 169, -327, 61, -163, 142, 257, -51, -73, -369, -162, 74, -162, 308, 171, -149, 245, 168, -22, -35, 215, -214, 227, 315, 156, -20, 6, 117, 150, 14, -82, -204, -50, -81, -302, -74, -61, -240, 337, 235, 45, -115, 243, 19, 27, -266, 316, -166, -120, 113, -15, -99, 17, 175, -22, 285, -144, 12, 116, -71, 54, 198, 38, 152, 66, -130, -123, 186, 80, 107, -178, 70, 224, 163, -117, 45, 293, 37, -109, 156, 53, -78, 45, 45, 280, 259, 220, 308, -42, 89, -109, -68, 184, -50, -149, -4, 88, -193, 96, -382, -144, 130, 200, -109, 172, 17, -218, 51, -109, 17, 198, 148, -318, -102, -14, -56, 47, -121, -20, -28, 118, -153, 331, 46, -246, 233, -160, 82, 181, -53, 202, -154, 28, 327, -91, 173, 169, 118, -202, -47, 13, 149, -7, -7, -1, 177, -102, -66, 13, -142, 34, -69, 21, -7, 49, -145, 190, -61, -22, -191, 82]
3627H2N7k54J36o4P1Mj14L67r0k42L14k41j68J62q7j68K97k57J30J1j01R8j83
3650b40J96J56j61p1l7L1R2K1k78K67J76k35P5K94l92l79N66J6LL62k24k1l92
3673a75%J91O2k0L41o55K28k84K2L67j36K83k19R4j85J84K5k87K60J02o0m75M13
3696G6J23m63L10k19K66r5J09J75n58M13J47l03J92j88l3j8K92j17K12m36r8M39
3718B26kJ00j44q3J32l36m1l7K22J35m43M48l87P8P8J63k64m3K50r4K81k47j60
3741a68J44k3j03J94j34K88j37j43K14J05l5l54N37m60K64k93L88j44m4j40r4
3762a38K57k06K10m7K70o2j97l01J73l7L20j67k83J06K91l06J04j13l7K24k73
3783b12J00J56k06J49K5Rm0J27j23l75O75l13J80j88K19l43J44J11l49Q9J64J10
$$ y = [82, 139, -115, 21, -43, 28, 32, -82, 285, 195, -47, 267, 26, -142, 20, -67, -235, 62, -195, -65, -54, -155, -57, -240, -44, 112, -49, -120, -157, -126, -34, -13, -291, -24, 152, -83, -8, 286, -106, -485, 81, 97, 100, 462, 238, 217, -175, -175, 16, 78, 58, 399, -256, -28, -312, -290, 77, -59, 224, 5, 99, -86, 98, 123, -164, 96, 198, 138, -337, 76, 199, -264, 46, -173, 93, -2, 107, 282, -276, 137, 284, -19, 173, -15, -48, -66, 226, 109, 321, -115, -213, 226, 224, 324, 180, 97, 229, -107, -148, -185, 37, 172, -271, 177, -210, -132, -54, 109, -155, -198, 52, -42, 239, -8, -168, -24, -47, -150, 44, -90, 198, 61, -82, 132, 237, 202, -152, 385, -75, 189, -104, 284, 140, 96, -44, -138, 119, -87, 123, 76, 346, 284, 87, -214, -41, -78, 242, 75, -208, -102, 189, -117, -13, -126, -163, 61, -212, -112, 44, -162, -13, 12, 21, -19, 108, -15, -390, 285, -28, 152, -36, 183, -160, -16, 95, -254, -165, -1, 109]
3805A09p5kJ30k00J7K51n30L52j26Q1k46L16L21m50k12K33N3j31j94Q2r3N66n15
3828b63K1K69n0j90L65J17o9Qk41J80k07L3PM8N9R7j24K4J11k7l8L2k26K91j16
3853A11Q6k68M2K60j55L52o26N69m72K54o8o7P4k46L08q4L0N4j25j39K44l84J54
3876i6j89L45J01j06p8K7k93M93j41j30K41Ok86j94K29J79j41J19k32pL72l26
3898a07n2K44k12J87J91l42k57N46j92j29j6K06k33L20p5k18J65l70J87Q5n2n7
3920a81L90j40m11M11k23j93N5O3J39NJ0K54q2r9j43L8J29O7K9k94K48j48J79
3943A03J81l13Rk7j46L00J0R2k09j38o3j9J51k90J58K62P0k06lJ84k55K00k99
3966b48J83p0j34K66J36J08j65o41N55j05p6J10L4K05k48O5l7j59J81L8J18j51
$$ y = [109, 34, 32, 162, -38, -21, 230, -300, 52, -74, 7, -239, 77, 398, -52, -264, -31, 22, -109, -303, -221, -314, 252, -263, -242, 27, -23, -213, 152, 269, 200, 208, -33, 147, -60, -27, -20, 28, 87, 184, 60, 84, 195, 168, 130, 162, -64, 227, 111, 197, -71, -29, 231, 76, 428, -198, 371, -101, 153, 85, 18, 92, -154, 154, 70, 100, 154, 29, -110, 134, -250, -96, -285, 60, 161, 55, -23, 4, -289, 204, 63, -67, 174, 180, -106, -300, -71, 108, -33, 86, -146, -153, 219, -107, -159, 85, -127, 60, 251, -91, -348, 198, 6, -123, -139, 67, -166, 154, 79, -139, 26, -344, -157, -72, -124, -181, 209, 69, -342, 69, -154, -347, -292, -229, -90, -85, -75, 179, 97, -2, -145, -107, 22, 89, 118, -176, 72, -76, 103, 284, -29, -20, -47, -193, 107, 117, 209, 0, -138, -201, -220, -69, -359, -201, 61, 131, -75, -78, 106, -149, 51, -248, -65, -135, -269, -3, 133, 241, 76, -565, -10, -115, -191, -81, -47, 158, -90, -25, -62, -221, -40, -2, 116, -35]
3988c5J60j60J85j13J30l33O6K46j21J70m26R0J12j43J22O4k24J42j13J21J1K58
4010B09N7k70L5M2pjm48O25k45n1J70N9j66J40j39M0J58l49J32k64L43L3k63J09
4034e1k21K94j89L99q2mj51K0k31k29N98P4k77J79j53J46R9k42j87K62p5Lm7l0
4058i5R0j87J17K99m0O1l37kOJ28j15M4k43J61J53j53K41l86M40j14R3K2j48O0
4082I5K05l37Kl51P22k66j08L4p7P8K8m1K92l41l1k16K81K12m12L11l15M05o6
4105A04l3j2J15k69L66l27q7M22k03k28J81k68jM7K66k03K4q3P6k9Q1r3m1N10
4129C15m78K28k77K81n8J38O6k82L3j21L28j5l52K34NN7NJ9l55K79N0J06j42j54
4153i0O1O1j22k73K32j46J55j3l0j2J35K46m61O7J30J57o1J7m5l5Q1J75j8l92
$$ y = [-35, 125, -35, 150, 37, 167, -166, -100, 146, 25, 195, -231, -141, -29, -172, -50, 14, -210, -68, -181, -60, -49, 209, 266, -4, 31, 73, 66, 65, -383, 242, -3, -54, 116, 175, 9, 149, 10, 50, 208, -141, -9, -273, 70, 103, -160, -51, -272, 22, -167, 232, 150, 146, -5, 15, -216, -445, 153, 227, -50, 129, -24, 122, 221, -21, -208, 54, -21, -18, -65, -95, -5, -192, -75, 224, 184, 245, -92, -94, -88, 40, -75, -31, -274, -113, 40, -113, 128, -258, 182, 68, 161, 183, 35, 95, 300, -37, -35, -386, 336, 70, -38, -4, -81, -3, 25, -16, 276, -65, -96, -312, -31, 181, -231, 80, -235, 170, 104, 71, 59, 174, -95, 271, -56, -143, 279, 76, -152, 29, -239, -240, -193, 73, -130, -106, -189, -113, -142, -61, -154, -195, 315, -163, 65, -212, 69, 11, 149, 215, -67, -34, -155, 173, 158, -194, 40, 45, 102, 107, 126, -229, 50, 100, 206, 64, -90, -29, 32, -90, -363, -131, -277, -122, -135, -165, -177, -42, 204, -257, -190, -60, 97, 36, 53, 8, -27, 54, 229, 211, -181]
4177a81K72j70Q6N5J62Lj94j49j56K83N5P5l17l2K85Mk18K20k6J5J80l33J55J1
4201H5p7n3ln9nj08P02n08O6k36K24R3k29j63M86o2k52Q6J24J1m7l06J77N6L45
4226C47r3j95j32o4J79k37O8K16m66N96k79J54j06r9o6M72p9k39J68j6m01L34
4248F2R6l4K18l08o3j23L11q7m0k92j06L61k87L91m5Pk57J29J92l61J87j07L34
4271A78j03j30n3K80l29K94j08j47J33m42O00q6j07j3Qm15K27M17k49O2PJ74j66
4294C2k05J25L44k59R3o7K54m06J81l21J38j67M06O5k05L02k50J29j63J54j97
4315a7L6j03k58K70K00k22K20j7k44J23J31j95j25L46k2k33q8M10j72J38l16j73
4337c11N57k73N9K30k67k2K21q5m67L58p5M07j01j15l42l2K43J21L4l39J54k49
$$ y = [-181, 91, -79, 7, 62, 224, 227, 33, -116, -272, 11, 66, 141, -176, -208, 77, 81, -137, 83, 57, 72, 252, -81, 74, 85, 8, -45, -48, -107, -112, -220, 482, -26, 40, -196, 28, 121, -108, -271, 215, 153, -99, -13, 111, 122, 75, -231, -54, 2, 347, 254, 59, -73, -137, 42, -195, -127, 89, -377, 219, -60, 94, -12, -111, -177, 295, 216, -23, 145, 129, -272, 62, 158, 124, 342, 34, -29, -152, 159, 72, 32, -260, -366, -5, -292, 99, 54, 61, -196, -67, 125, -236, -49, -156, 178, 75, -55, -108, 172, -157, 137, 29, -118, 15, -427, 173, 87, -20, -33, -25, -440, -213, 204, -45, 17, 24, 198, 32, -173, -48, 296, 37, 130, 63, 317, -89, 92, -229, -91, -258, 148, 213, 8, 310, 60, 189, 26, 180, -17, 19, -84, -342, -72, 128, -94, 126, 109, -135, -12, 119, -76, -201, 145, 123, -110, -198, 212, 40, 178, -138, -311, 246, -27, 32, 262, -5, -27, 194, 109, -358, 0, -75, 332, 231, 116, -226, -258, -15, 106, 140, -199, -45, -294]
4359b94L68L6M3o4j6j4k32L14K7q4q1Q6o2K5K82m28o9J04M6J6K46q6m16K26j48
4384a75L01l8k78j5J88R6O6k09m5L4K62j80J02k73J24J09J1J77l33p8N4L38m58
4407b20K71j11pr7l7L87k14n19O66l89M32j26N7J1j96K59l55J77K2N1k1l3J20
4430A28j93P5r1R1K13K6l09j8j04L22j79L99m78n6M54l64L33j35O5m12L92m5J75
4453B89n87J27J12J81m3N5l29L56j01k41M17j34J8J22k20J59k63R5K49j44J74
4474B92j86j01j42j31K89j03O7K5Qk00L59k7m1j43qK88j94O0Q9M1j51k25l63M78
4498a9L08j80r6J90j63k13J08R4k89K51L23n37j07N9N26r3Q6m70L14jN2k55L29
4521B17k21k87K09J08l03K83J55l44L29k27j34J55l5j61M02m2L4j13l1J78q9j9
$$ y = [-294, 74, 110, 153, 89, 73, 59, -173, 141, 168, 84, 3, 89, 27, 52, 334, -94, -163, -59, -13, 3, 249, 163, -253, -27, -175, 126, 88, -190, -205, -17, 79, 145, -64, -109, -75, 187, 7, 109, -164, -40, 69, 80, 257, -76, -154, -100, 238, -220, 51, -60, -67, -164, -201, 186, -28, -547, 119, -270, 162, 36, 93, 104, -92, 167, -188, -11, 11, 62, 41, 8, 128, -65, 10, -81, 10, 223, 249, -60, -78, -182, 140, -39, 360, -118, -174, 280, -84, 249, 114, 179, -233, 159, 114, 289, -298, -171, -59, 122, 79, 134, -195, 161, 60, -181, 236, 102, 120, 242, 22, 181, -82, 13, 262, 118, 292, 106, 5, -137, -268, 21, -82, -15, 10, 18, -182, 177, 150, 109, -34, -42, 246, 52, 112, 201, 242, 91, -134, -497, -19, 289, 109, 13, 203, 40, -173, -65, 29, -260, -9, 314, -223, -330, -271, 255, 162, 248, -222, 92, 91, 143, -112, 217, -4, -291, -82, 26, -277, 6, 161, -183, 146, -81, -215, -60, -95, -256, 146, 104, 138, 25, -6, 172, 83, 64]
4543F4k04K84k79K92m15M65j62k09K98j93K03j84k11M9M12j35J16n5m66M41m16
4564c05K43R0m9j01k41L64m7OJ19r7K6Rl82L94K5J81l36N7J8M23n55J45J54k42
4588a01J02K38l64J04J35l74M62k99R4J00k30M05j57k49o7J70m5OJ03l56J71L2
4610a20K79J9m91L18K72j25l09j64M9K94k04j8J19j06M66k92n4P5J30n8k58K45
4632F7k46O6J47N0o0J83m14J66k47J85K6k07K27K12L3k91J68k04j79M86j40k12
4654a84k25K18k2J59q6L0J66j65N1Rj05J45o3n2K32k21nK27J84l05j15J36l4O2
4678C7k23K47k10K78j82k7J43j88K45l83N74n76K67n0M33J99q17K78j29P3J38
4699A27Ol41J92J66k79K15J2k68J78j0j36J45J40k62J75k68K42q9K7L5q5K68j64
$$ y = [64, -140, 144, -135, 157, -258, 207, 45, -164, 134, -59, 144, -40, -251, -202, 210, 75, 191, 136, -330, 111, -305, -62, 28, -21, -122, -363, 1, -46, -40, 79, -18, 8, 17, -365, 29, 54, 235, -101, -44, -26, 397, -158, -13, 141, -101, 1, 239, -125, -21, 114, -260, 202, -97, -3, 97, -133, 272, 115, -134, -201, -31, -76, -70, 33, -323, -152, -120, 159, 178, -313, 5, 277, 152, -157, -321, -272, 22, -182, -200, -81, -187, 279, -13, -67, 8, 138, 80, -178, 67, -179, -113, 34, 84, 24, 207, -207, -41, -288, -103, -77, -284, -57, 155, 188, -103, 65, -139, -318, 168, 28, -184, -409, -191, -213, -54, -140, -110, 56, -109, -58, -49, -154, -9, -72, -124, 108, -113, -118, 109, 293, -12, -127, 9, -25, 37, -186, 61, -149, 129, -53, -80, 63, -125, 120, -263, 311, -265, 2, -48, 385, 584, -233, 45, -84, -11, 127, 133, -208, -16, 150, -129, 86, 98, -170, 8, -2, -138, 7, 147, -115, 60, -208, 34, -55, -28, 7, -78, 190, 26]
4722B6l74L23j72K39J93l07P2j62N1K78m2k04J58j29J86j97L14l06J99k9k99P8
4744a04m29O50k3M4J35m72j28K98K09n1m59M22k40L13nl47K01j7J86l92K94M8
4766A33j95L16k6j70nJ68j90o5O6l12L49J65o37M41j68J48j97J49Q8o4o8r6o5
4789b35L92j97j19K20l12m7k5M43o0K73o17JM89j99Kk47K86j17K04l96J3j55P68
4812C65n51K83j9p5j88N9M12m07K85J29k01k95K77j75M7J28p5J81j24m3j47j37
4834b71N82j71m32K79j87K22J32L1J74o08J53J94L1p7j74K7l9J58PL47l43l50
4856c15N26j96K37k73O0J09J05l71J13J25j76l09N14k35J97j67k86L07K01nqk15
4878f2O3J61j39j06N2l14J83M3P3r8j14N34k56j25m4K14k38K22k98N78l90j11
$$ y = [26, -348, -25, -197, 42, 235, -72, 0, -162, -111, 167, 125, -79, 79, -50, 136, -61, 253, -53, 146, 117, -182, -104, -533, 117, 94, 138, 273, -199, -327, -29, 180, 129, -330, 92, -148, 165, 160, -187, 14, -3, 183, -209, 85, 133, -62, 254, 228, 58, 53, 221, 31, -34, 32, -280, 69, 234, -403, 38, -130, 18, -179, -30, 58, -6, -74, -170, -235, 157, -40, -159, 61, -251, -298, -323, 120, 60, 333, -284, -283, 206, 7, 9, -238, 48, -69, 135, -261, -248, -403, 365, -186, 97, 78, 3, -185, -126, 286, -121, 164, 293, 92, -203, 74, -101, -54, 74, -1, 180, 56, 13, -134, -271, 311, 140, -292, -13, -200, 22, 154, 185, 359, -249, -96, 98, 129, 52, -122, -95, -134, 24, 31, 378, 35, -315, 211, 15, 252, -21, 39, 148, 253, -118, -5, 120, -56, -365, 149, -86, 111, -56, -342, -35, 166, 161, 153, -62, 1, 162, 23, -83, -31, -345, -162, -119, -46, -144, -258, 276, 20, -105, -149, 65, -173, 49, -249, 329, -61, -172]
4900a72L12l29M3p1M5m2R8J16L8P5r3J98j71J94m69K70J20k19k10L46PJj02R6
4924H1n8L4J26j73j40K37l29K97L4m07M90j55P9k20J49j54K19k81J1K36J13k28
4946c9J11o7j20K09n4j36K7r3O9j26K09j26j42N07l68n9P4j71N28n16K25L41j31
4969A52k32J75O0R3k30k27K56j07J01J73m19M6nM5m8J56J08p6j96J62J0m7L05
4992B55j32J93k44r0n5J50l63K70o1l6k52N84l44L15p9k25K56r7k20K55k3J65
5014B22l67J56j08N0K29n25J43N66p33L21j8QOm0L63k23o4N5J97m01J28J43k12
5037a04m4P0j47J87J59j67Q9L4M1j86M6j42K63K15k26J09l15K06K09j87j18M1
5059C3l0L8j06K31j00O8N5m1j91k2J88K28m47J24O0l69M44m32N96m92L50j52J82
$$ y = [-172, 140, -189, -146, -217, -172, -214, -116, 0, 38, 113, 20, 218, 47, 241, -228, 42, 162, -57, -267, 79, 86, 87, -15, 81, 23, 57, 183, 10, -130, 107, -222, 75, 109, -298, 192, 37, 116, -104, 45, -109, 110, -171, -160, 76, 189, -39, 72, 5, -115, 94, 40, -96, -69, -162, -93, -219, -10, -136, -278, 229, -139, -198, -124, -295, 233, -283, -58, 283, 152, -80, 95, 155, 248, 18, -209, 47, -60, 41, 214, -205, -159, -164, -119, -167, -11, 97, 21, -175, -13, -3, -50, 255, 123, 316, 72, -18, -73, 77, -286, -16, -77, -113, -365, 219, -125, 190, 111, -114, 142, 45, -175, 80, 57, 222, -145, 11, -97, -47, 182, -343, -200, 366, -367, -46, -64, -56, -50, -90, 273, 50, -14, 41, 238, -163, -35, 108, -104, -148, -78, -225, -38, 121, -46, 43, 77, 118, -68, -22, -164, 99, 314, 88, 197, -118, 88, 297, 110, -8, 33, 3, 41, -65, 166, 66, 134, 189, 148, -43, -65, 123, 351, -96, 28, 88, -281, 163, -269, 327, -165, 185, 33, 215]
5082B15l32Qj72L65M05l54m45R0L94l38J98K58o0n8k24J05m24M21J03j56J85r0
5104I4J21m5k34k72L83M8K06l98J84k67J5N29m65J42l9l3m5K9j75J30M69p22L
5127c42M57J18k81K64l49R8j26L29j69J37j00M5l4k46O6M4L15Nl73j43n9N02j82
5150b4k4N4k5K10k36J72N6j32j26K96M2l7l86j98M35j83J76%k92L11r5k98M96
5173A92m26j0K80j29k4M29k37k37K05r1n8p5M51m44M41l58j09K48J48p1m4l45
5195b64J12L9j13L75j53p0j45l2J37J01L93m43j2N1l7J61O2J90l11l2J55j43l22
5218c01J55J8J51O9J18j9k21J03k60J62P6j1k48J45K6P8j76j9K25o5J85j62L2
5241F1J52k52k5O4k26M49r4j74j54j30N94j22J34j89K02l89K80k38o9K19j86j30
$$ y = [215, -117, -109, -281, 84, 489, 135, -310, -220, 174, -164, 34, 292, 232, 174, -50, 55, -369, 52, 155, -1, 184, 94, 215, 170, -64, -336, 47, 95, 301, -97, 87, -180, -165, 364, -101, 41, 2, -31, -76, -47, -222, -92, 377, -345, -342, 115, 233, -48, 216, -133, -35, -161, 168, -1, 136, 36, 81, 47, -199, -133, -89, 226, 231, -142, -285, -344, 158, -24, -48, 6, -19, 191, -45, 127, 183, 51, -75, 221, 263, 226, -160, -358, 77, -106, 70, 70, -222, 89, -6, -304, 192, -234, -244, 36, -93, -117, 312, 75, -162, 43, -48, -106, -181, 270, -174, 267, -91, -200, 48, 196, 125, 81, -264, -152, -113, -226, 149, -4, -74, -219, -251, -114, -13, 380, -63, -75, -24, -61, 100, 162, 352, 41, 9, 164, 21, -301, -146, -128, 23, 92, 210, 191, -30, 73, -187, -25, 51, 40, -208, -63, -37, 41, -135, -154, 71, 6, 191, 29, 61, 213, -39, -64, 0, -226, 223, 129, -45, -199, -329, 265, 143, 277, 88, 290, -99, 181, -57, -126, 93, -93, -223]
5263b23L93j94j54P32k66o01N57l74K30j45j89L01j44k42L81j7k32R2R4p0k15
5284b86K56N7n5o2K05L6l96J31N01o58K68N6m5j70K18j27J7J06j42J36J8k49K87
5307A02J47K4m0m36M76l76L05k30K13M7k11O7m2J16l42K50k82M40k05LK64j80
5329A10l59J47k8P1P6j04J72J50l45P8r6K65rk0K9J28n41R1J24J17lK38j89j46
5353d4O7l32L70O1R3N1l40n9n7J16L5r2R8j0Ok2K3j54K41J8n3r4K18k47J65O1
5379A19P1o00N32o3j34K22o8k3L2k27r2M49m11J27K9K13j29Q4l49J60N3M32p96
5402c69N50m7l05J60J62m3O8n20M65k05j12L3r2K86m2j32J94j4Q1p3J3n5K38m8
5426A93k92J35j56L59j82p8l34J92l6K69k01J90l1r9M6nj1K88l46L20k92K70j24
$$ y = [-223, 170, -24, -178, 554, 288, -313, 244, -130, 100, -45, -234, 67, -77, -319, 62, 45, -187, -95, -1, -71, -286, -30, 27, -28, -90, 115, 151, -245, -114, 387, -271, -3, 53, 8, -162, 56, -71, -54, 52, -90, 46, 64, -185, 102, 249, 273, 233, -203, 273, -103, 202, -28, 185, 232, 21, 88, 46, 162, -180, 70, -212, 228, 23, 26, 290, 110, -249, -102, -130, -59, 17, -87, 85, 235, -110, -32, -128, 137, 128, 108, 137, 265, -276, -185, -61, 56, 53, 291, 102, -44, 23, -309, 61, 122, 215, 266, -74, -133, -190, -74, -39, -131, -33, -43, -37, -59, -36, -190, 51, 69, 16, -78, 140, -107, 58, 119, 190, -410, 122, 59, -75, 147, 79, 56, 88, -139, -231, 218, -193, -66, -37, 176, 47, 131, -218, -58, -5, 427, -369, 181, 134, -171, -11, 151, 108, 176, -344, 121, -84, -196, -163, -255, 31, -11, -143, 51, 37, 118, 45, 58, 3, 241, 193, -99, 36, -120, 239, 57, -21, -355, -163, -199, 70, -131, 59, 28, -71, -25, -30, -41, 247, -99, 221, -71, 199, 75]
5449G5M3j55J91j3LJ5j97O0n4J70k14J56k9M9J63k51l12M77L6j67J33k87J18j91
5473a81L2r0L72j82k7J94m95L38Pn7K88j23l4K19Km8k61L9O1K80n29NK77n1n8
5498b2N2P0j12k44O2L86k80q0L0J29J37k68l13K65J13J7r2p1R8K57p9k7j38J78
5522F8n4J7l7l74P6K31J44k55J16M5J77j89N9J38J99m74L44m6q7J31r8k98L23
5545A56m76K15P6J21k43M71j47k51K71N6k17L36j75k28j67j9O87k44j79k90L5
5566b12P7P7j10J22L7n6k09L75j11RL91o27K41o1M3j73K44m17J28K83l3Nj01N5
5590b3m5MK08k39L63j16K49m44K3j15J93J22q4J11j17R1k61J28j05L29l84j72
5612b84K00J21l34J90J42J97j55k6J21Q9k11j24p8J38j09K98l22K50j48R6j70
$$ y = [75, 118, -37, 154, 141, 144, 159, -38, 22, -32, 138, -76, 80, 51, 100, 263, 12, -300, 177, 213, 46, 179, -108, 10, -181, -149, -239, 133, -49, -76, 118, -377, -39, -32, -89, 199, 76, 42, 261, 263, 215, -46, -7, 54, 334, -195, -190, 87, 36, -22, 30, 100, -12, -256, -194, 192, -88, -168, -138, -9, 128, -140, -453, -188, -75, -58, -150, -221, -123, 134, 55, 28, -110, 68, 14, 31, -6, -380, -304, -73, 71, -184, -68, -23, 154, -35, 24, 162, 361, -113, 231, 185, 98, 229, 131, -167, 156, -320, -105, -29, 92, -151, 320, 173, -78, 193, 249, 32, 368, 193, -35, -202, -221, 466, 222, 43, -247, -212, -135, -58, -168, -46, -9, -65, -274, 101, -10, -1, 390, -237, 4, -57, -14, -187, 57, -360, -232, 51, 18, 23, -78, -23, -68, -64, 144, -95, 268, 152, 401, -43, -20, -135, 58, 180, 96, 207, 90, 181, -80, 48, -57, 272, -112, -284, -84, 37, -297, -107, 35, 232, 77, 51, 172, 261, 50, -74, -152, -14, -123, 175, -147, 103, -45, 51, -119]
5633a19K41k37l82L91K37k14L51j37k02K56k80K44j70R8n9k84L10m22N48j60l20
5654c10K66p0J50o8O9n3q2rN18l00O8r6j19J29m25L33J73K3N5k44J75k35j65K96
5678G9j37J91Q8k29K7k14J56r0R2J20o4l20M46j05R5k18J22j54J67L8k66K37m41
5701c80L00j39J10K52j3k86l3J56L8j15j01L04n70O92l65j39M16q3J78k87K09
5722A44M9m03N46o00K55m2J26J29j25l84K64R8K21k36J42p2r1k26K23l5K00k3
5744A60k58L27k66J07l02J42o2MJ03K73l48k9L37k49j23L14k70J36P0n6J66j12
5766F4P3k94J39J40j81J48j01JL07l21p0j86M7N26l97N7J85or5K85n09L17N3j46
5790C6m2k14l7Q7L0L25o8R6j76J81m4k52j7K5M5P4K85l74j0r1L21n8j39K2J80
$$ y = [-119, 122, -115, -497, -106, 131, -83, 268, 131, -71, 185, -95, 149, -21, 77, 18, -266, 44, -378, 170, 10, -310, -44, -114, 36, -32, 37, -16, -98, -107, 411, 111, 179, 83, -36, 93, -332, 1, 174, 197, 252, 8, 183, -52, -217, 79, -58, 133, 221, -8, 19, -195, -39, -129, -37, 83, 19, -301, 145, 40, 135, -83, 39, -115, 52, 90, -176, 61, -380, -80, -219, -109, 143, 130, -156, -189, -33, 5, -110, -211, 93, -477, 215, -150, -289, 127, 44, 222, -65, 144, 193, -210, 336, -264, -9, -51, 75, 204, 79, -305, -41, 57, 278, 42, 184, 112, 21, -205, 18, -17, 183, 160, -98, 229, -37, 70, -232, -90, -152, -148, -45, 228, -120, -149, 188, -61, -184, 130, -140, -4, 66, 10, 176, 64, 137, -157, -18, 122, -59, 89, -12, -11, 296, -25, -95, -281, -234, 292, -105, -48, 137, 131, 36, 321, -188, 129, 182, 36, -6, -220, -257, -170, -140, 185, 117, 213, 37, 218, 174, -78, -95, -70, -25, 49, 334, -40, -50, -141, 180, 122, -17, 5, 185]
5815A85J8m5l78K85L82p53M08k34L97m34L98r2j37j35J52M5j25J14J99l79L17
5836A88l1l09N25m62N4r2J60J50m94L43K99j85j88l69M14l04M69J45k97k6J08
5857I8k76L2J39j36K29p3j38Kq1M12n0j77l7k0J41j72K65n96O38l76OO1qL20p5
5882A28j45m4L8l0k9j53K37k14M46k70j02r6Q4J33N4k29Q2JlL63k12j50J88j13
5906c6p1J07o7L63k60k72J19k46L44J63j24k00J19J58j77n0k49K34MmK45j00j39
5929a39P0K87J0J11l20j50k09M62l4k75m1J31L3M12m01j72M73q9k7j22j59N61
5951D12m91J00l08JK08j84K32l7K86k88L99J9q3j35k35J64n4k92K37J7N8j11K79
5974A94k48m0K50l92O36n81J6K71r0K10o9j3l03L35k26n7J39m0k6k48K58j81K95
$$ y = [185, 203, 158, -220, 65, 447, -306, 102, -132, 265, -169, 229, 137, 0, -135, 17, 62, -63, 51, 250, -129, 188, 157, -152, 373, -89, -35, -127, 33, 183, -311, 32, 331, 146, -42, -411, 3, -301, 168, 313, 16, -10, 98, -178, -146, -7, -143, 86, 13, -125, -123, -204, 208, 158, -19, -56, -76, 65, -107, 158, -438, 200, -176, -170, -109, -117, 203, 128, -17, -61, -23, -53, -82, -235, 2, -212, 234, -36, -138, -234, -150, -17, 37, -192, -110, -109, -112, 251, 39, -111, 77, -36, -107, 0, -67, 296, 36, -236, -117, -363, -19, 144, 20, -180, -61, 97, -80, -130, -379, -145, -141, -145, 100, 0, -139, -69, 218, 228, 339, 19, -131, -340, 122, 88, -187, -228, -97, -64, 348, -53, -225, 248, 159, 132, 10, -149, 412, -79, 21, -287, -286, -78, -262, -30, -67, 219, -69, 330, 349, 266, 131, -104, 60, 6, -286, -49, -32, 26, -85, 194, -54, -94, 156, -236, 400, -181, -165, 106, 16, 226, 157, 144, -159, 176, -50, -107, 32, -8, -34, -282, -24, -205, 90]
5997I0k66J2L33k53J48L35p17L58o0Lm00K10j2J53j7J3l1j39K85J8k54L4OR8J69
6022A16j55K55j13p6O9Q8j83m99M54R8l07K35K79l50m8J9J89J34j56K15l35L13
6044B42m30K83p7J00k59J50L51m02J55J74l14o5LMJ89k80q5M4q2L09j26K11j15
6067b0m0n7K1k8mK93l58L67j49J8q3J4j86P5K92k65J66K71n47L46k53JM51j96
6091A29l40K72J4k43o9L60j23j15N3k2K81k95J52p1J57L7k83M80Ql43J09o5k6
6114E7r4N6K97l68J73J50l44q1O1J42k56k3K26J58k61J83J23m16J95j30l3L45
6136A60k23PK03k59K07j85K3J17l61J69L09P1j46K21j82k77M9J17l31M66J22m31
6158a54J78J1J41j91K45k14j69K43nl8k84j18L61j18J5J86k23K02j33J65j06n5
$$ y = [90, -176, -164, 169, -84, 64, 399, -318, 40, -20, -17, -417, -207, -219, -66, -83, -70, -101, -240, 45, 63, -191, -157, -151, -53, 116, -39, 216, 103, 27, 96, 184, 1, -498, -44, 54, -253, -18, 261, -89, -137, -118, 71, 205, 49, 264, -71, 242, -188, 95, 18, 118, -141, 9, 360, -42, 113, 287, -27, -92, -89, -85, 104, -176, -261, -217, -299, 10, -116, 95, -20, -60, -117, -96, -124, -128, 165, -193, 174, 25, 43, -40, -26, -212, -137, 155, -110, 56, 327, -220, 126, -127, -126, 325, 129, -211, 61, 75, -168, -237, 123, 0, -115, -62, -84, 197, -98, 54, -17, 140, 177, -106, 374, 382, 39, 148, 83, 57, -37, 19, 316, -52, 121, 271, -73, -154, -93, 49, -207, -230, -4, 154, -107, 76, 199, -217, -22, -152, -185, 160, -63, -56, 147, -112, 95, -90, -67, 50, -311, -142, 167, 238, 92, 313, 131, -146, -97, 20, -311, 155, 277, -154, 24, 35, 176, -15, 230, 16, -153, 90, 85, 47, -237, -355, 6, -112, -97, 89, -134, 68, -65, 100, -6, -61]
6180f1k8m6L2O3J50j21J09r4O1l50J14NL44k26K6L88m66J60j26J69pl09M59l34
6204h8q3K93k88j2M4J36j30N0j03J07j10N4K12j16L3m4M6J56k47K54j53K00j0
6227B01K92n47J51k14P0K68Q0j53k87L75K1j86k4k11J32j04K09L2j38j11n5J43
6249e6J52m6q6krmJ6j12k19M05j47J86j01N3K3j34J49r0J42q3j27K06k07J70k18
6274a39O3p8J5J35k04K93j56O9J8k57k62Q8N28j79L12m89j96M46j7p5r2J08M9
6297b0j51J20n9L54n99N33k84q8M2j75M51k13j0Q8p1R9j4J74m2k97N79k86K4q5
6321G0J35k69Q9K36q3j82j90L62j36j57QJ02n8K43j98J96j48k37j36J63L26N2
6343A88k94R0k8M9J50l13K29K8l18K05P1r1J96j33m3J18j34R7L19m9l01l56N22
$$ y = [-61, -89, -135, -103, -40, 110, -11, 98, 4, 65, -285, -171, -166, 178, -48, -22, 366, -100, 60, -66, 103, 96, -213, 246, -88, -171, 122, -166, -178, -134, 2, -128, -78, -181, -74, -184, -130, 82, -34, -1, -45, 1, 157, -90, 164, 11, 211, 201, 493, -54, 97, -117, -47, 221, 301, 148, -139, 236, 257, 71, 47, -164, -32, -136, 73, 105, -33, -144, -199, -56, 96, 50, -36, -38, -47, -51, -35, -147, -366, 39, -108, 78, -23, 30, 53, -81, 68, -22, 120, 37, -90, 116, -91, 79, -139, -76, -154, -139, -4, -208, 85, -71, -2, 16, -241, -503, -415, 113, -66, 246, -243, -439, 7, -10, -85, -177, -69, -20, -171, -51, -110, 244, -355, 178, -106, -194, -152, -327, 124, -89, -99, -11, -82, 17, 3, 177, 135, -162, 417, 131, 155, 70, 205, -64, 25, 261, 178, -4, -194, 168, 32, -125, -117, -15, -73, 170, -28, 168, 20, -217, -353, -190, 136, 188, -106, -16, -44, 5, 155, -158, 71, 99, -219, -14, 57, -34, 162, 29, -14, 104, -30, 67, 386, 337, 36, -320, 202]
6366B02m77K80M49m74K33j67J23j56K1k24R2j86L84m02J16K51j51J54L55m18k38
6387b33L96k69K17n98O34M6p5R9O7m13K34k39J6R0J45K50k91r5J77k15k04J41
6409a20O3N9Kq2L33n50J45%M56n17M49l76J39J02j85L0K60l13M8k05P9LK58M4
6433A22n1r4J75r6j35LJ94k78n0M32j64k19m4M55k91l7j18K65kJ50q5j6J6l07
6457a75J4K28j45mk0J19k93L40k03L07l46K47J51Lk92j66J64Q2K05m05M29l5k58
6480e3J63l30L31j26j25K06K39k53l02K35K96j30L7k85J54k9p0J31M2j39lL77
6502C66k23j31k60N11k18M0j6k4k7j2k04K14K29k09J54l63L11j78n9m1K64J03
6524B27k22J06j15K80m06J51p3l3P4n6J80j62M6J34l24J62m0p4N96l69p0J43j64
$$ y = [202, -275, 5, 454, -20, 213, 46, 169, 13, 34, -190, -98, -284, 100, -302, -186, 65, -86, 68, 423, 5, -233, 163, -106, 111, -487, 147, 193, 118, 217, 284, -129, 105, -134, -118, -28, 117, 367, 76, -19, 158, -57, -261, -120, -57, 2, 4, -78, 255, -295, -150, -150, 306, -211, 238, -138, 1, 103, -82, -52, 208, -105, -57, -262, -183, -180, 78, 122, 71, -23, 152, 56, -79, -76, 118, -160, -210, 222, 58, -161, -205, 250, -41, -78, -196, 69, 67, 217, 132, 116, 132, -175, -161, 67, -78, -82, -102, 17, -276, 64, -139, 168, -178, 69, 220, 223, -69, -235, -71, 11, 216, -189, 240, 205, -53, 110, -220, 111, -15, -140, 66, 305, 52, -250, -15, 281, 151, 188, -97, 57, 28, -42, 89, 131, -8, -11, 366, 143, 12, -248, 263, 45, 85, 69, 45, 18, 6, -198, 16, 245, 36, 190, -173, 138, -40, -99, -140, 124, 227, 5, 111, -4, 276, -130, 21, -52, -85, -11, -67, 113, -49, -3, 131, -193, -31, -71, -145, 451, 82, 12, 155, -9]
6547iJ97j95J45j07k41N15P3l03k32K01n7k4l6J91j76J3M7J23j43RJ93m39K78
6570B3j49J67q4K58j69m8j03K69l02K48q9L5O9j83K14k25J3k08K33j0o3k62L39
6593b7n6L32k29m17Q5L17m5k7L67l41J89N4q2j80NN4M5K61j93J75m17R5K37k03
6617am55O51j84L40n67K60Q5k41R6k20Q3K32j51m9K41l88J63J62k64K09k21K97
6639G8j75M9L17m61L28l28J14k84K24L29j19P5k85K59l32J00n4O5l6J43K91n47
6661b49j81N86j19N6l25l9M51j32j29J82N4j58L81l63j92L00j13j51L08j89j51
6682a73N24n47m3N83j18k40n0j9J26m9j11r6K19R9J39m30K05J12l02J02J75L39
6704D45p15P5nN36n8k28j95L60l20j14J00L82n62L07k22J94J08J1m4j3O4N3k09
$$ y = [-9, 188, -7, 138, 31, -210, 305, 378, 75, -157, 44, -13, -37, -73, 118, -58, -45, 2, 125, -18, -9, 184, -255, 23, -126, 41, -43, 215, 46, -2, -105, 164, -138, 110, 21, 56, 125, -58, 156, -69, -56, -264, -31, -41, -104, -366, -27, -83, 249, 20, -397, -312, 5, -40, -67, 300, -41, 148, 202, 120, -60, -55, -1, 44, 305, 112, 287, -130, -35, 202, -1, -456, 195, 11, 351, -216, 44, 129, -112, -16, -236, -153, 79, -72, -121, 120, -268, -105, 57, -207, 2, -219, 78, -97, -48, 269, -192, 136, -192, -78, -362, -138, 191, 72, 147, -138, 121, -211, -111, -165, -100, -136, 7, 298, -249, -430, 156, 37, 93, -232, -271, 180, 48, -81, 101, 155, -3, 378, 15, -177, 123, 10, -141, 167, -22, -173, 351, -196, -239, 344, 226, -14, -64, -83, 43, -6, -117, -213, 6, 105, 244, -186, 19, 131, -171, -69, 106, 445, -270, -195, -200, 336, 278, 50, -145, 215, -105, -219, -119, 263, -299, 8, -214, -20, 88, 99, 55, 42, 106, 159, -50]
6727e0pL83k59j30k43N42l04M01j16r8j95kQ5N7K8K19n08K42K0j36K04l34J6J59
6751b6p3O8j38l10K99J74P6k02Q0J43P6Q1m81r5N16J3r9k20L67P1q58M08J64j37
6775a03M1O2L18l03j02p3K16J06j96J99R7k02N6q2m0r4J42J07j26O5l02L48k5
6798A09o8jN3j31J40q6J64k34m2p9M47l84K97q4k48K28J62J31n44L8J79j37OQ6
6822BJ14j19n8J11j83J58M02l11k87L79j41N3j92O4J55k65J25K8r8K81k86K41
6844A73Jj10k03Pj4j47J02J92k05M4K52j82N1J65j90J83j33q0J09Kj42m2L32k21
6868e6r7K34N0m52P28p15L24L15k99K60k77K58k92k98M30O3k18Q1j79N06m12j16
6890a62J35r9L93l42J20K83n01K54J39j25k39l37N38J88l57J23M8l61Q4L14l15
$$ y = [-50, -57, 326, 67, -63, -306, 236, -68, 333, 217, 119, -76, -78, 7, 64, 92, 311, -197, 45, 65, -71, 133, -201, -185, -26, -99, -31, -169, -479, -180, -6, 70, -132, -52, 91, 167, 248, -233, -328, 188, 201, 102, -118, 249, 320, -538, -130, 34, -103, -62, 0, 318, 15, -87, -160, 56, 162, -34, 165, 262, 60, 116, 34, -6, -100, 42, 149, 23, 88, -214, 134, 109, 41, 40, 93, -38, 102, 16, 180, -54, -96, -175, 272, -112, 185, 101, -147, 81, 243, 374, -170, -132, 47, -90, -84, 2, 116, -3, -61, 50, -133, 25, 427, 116, -171, 208, 67, 120, -72, -8, 147, -118, 7, 35, -63, 218, -68, 173, 174, 64, -139, -132, -146, -293, -191, 1, -204, -160, 92, -90, -39, 126, -64, 119, -14, -94, 15, 17, -125, -167, 165, -56, -153, 81, 131, -321, 407, -308, 16, 331, 32, 292, 15, 273, -19, -317, 113, 176, -42, 39, -140, 366, -46, -162, -27, -126, 267, -75, 45, 328, -173, 81, 220, 95, -144, -481, 57, 245, -112, 11, 59, -302, -218, 96, -219]
6911b19J75o4L71m09n00P04kM6n8k45N7J44m6N5K53k93p8L21k56J27Pp1j45j73
6935b99N12k68q4K61k28J21j8K02r7k56K19k56J03l9nJ46J37m8j44r4O1K06M1
6958A73l92L72J06k15OK71m65L5K29J72n24K85K24k67K32j47j12j33q7K13q1K67
6980A62k33o7l3J4m2M06j8l88J61p9m6K86l38K62j12N8K3j4J49k19K43j9J00j29
7004A27M4j07K08j82m15L29j21L21o28K02k3M74k18J17k16j30L06q2p0J88l1l56
7026b63J10KoK69o15K37J45K47l00j33J96K30j89M9j29J52J45l4p3k58M01l59
7048a76m8K50l00M9M00o11N21O3m11K15j70K23n7j00K29J97j26k35N6J52O1K7
7070B09j37m5L73L3l80k15k9o9O51l32N6j67K47j94jl9j11K82Q9M8n10J81R8l06
$$ y = [-219, -44, -108, 263, -146, -646, 58, 56, 102, 44, -201, -144, 0, -46, 9, 262, -31, -109, 212, -44, 83, 90, 19, -126, -299, 213, -55, -139, 122, -106, 15, -3, 199, 102, -154, 65, -191, -88, -127, -132, 14, 151, 103, -41, -135, -74, 132, 173, -219, 153, 259, 44, 50, 321, -144, -109, 120, 292, -232, 53, 277, 10, 242, 95, -17, -150, -237, -24, -105, 162, -71, -138, -171, -157, -199, 207, 189, -199, -38, -117, -163, 123, -215, 47, -65, -7, 16, 2, 151, -68, 175, 156, 256, 127, 171, 64, 272, 90, -325, 4, -117, 204, -424, -222, -245, 229, 11, 128, -88, -218, 88, 6, -64, 124, 93, -263, -153, -151, -157, 112, -503, -266, -121, 126, -174, -307, -111, 119, -70, -21, -150, 2, 147, 113, 40, -218, 183, -176, -224, 26, -274, -225, 175, -436, 85, 148, -263, -48, -218, 5, -52, -152, 77, 274, 148, -87, -31, 121, 182, 209, 72, 27, 400, 433, 53, -162, -191, -260, 391, 59, 115, -52, 195, 1, 0, -39, -150, 132, 221, 269, -241, -60, 38, -268]
7094b68J53K24j17j83n5N79m31p8nL05m81J91J33k6j09J73N2p0L2j21N13j57l24
7117g0L3r5J79k29K50j57L44J22j29N6Q4l72J53k20J12j10j82K76J38l52K37k58
7139a90R3K06l30p1J30K3K90j68j22J83p1k38L15K02r0N3k66OJ48j9K04m18M11
7162B81k78k31K79J03k68Q2O6k34M60q7j40J16K52l69J56j65P2k36J47q5K17k67
7184a29J79P1m20K62L60j28k79j84P1K52J27k24j32L3P6K99k16p5j28K34J38j14
7206G3k40O8O5Q8j36J80j61q4K65l22K94J38m74oM25j31o3R2l50L73M3O3j63R4
7230A31M2l03J65K99n04J07l4k68N59k59O0j24o5L58J4j13J66l77k04L01K6J00
7252G7q1k41J18L36M5k96J83n19M61k36K17K68j73k98o2j51N18l76R0J82K11k35
$$ y = [-268, -115, 109, -8, -191, -246, 333, -98, -176, -181, 124, -357, -166, -33, -59, -168, 5, 57, -13, 19, -102, 411, 254, -70, -37, -132, 47, -182, 68, -89, 255, 377, 248, 304, 388, 16, 169, -51, 61, -49, -231, 45, 183, -169, 68, -190, -97, 109, -221, -292, -162, -139, 151, -17, -139, 44, -27, -265, 50, 252, 162, 215, -51, -45, 103, 84, 288, -130, 281, 3, -228, 51, 154, -114, -32, 34, -200, 260, 173, 33, 149, 401, 32, 188, 23, 95, -141, 6, -79, 138, -129, 50, 121, -299, -37, 323, 195, -84, -268, -197, 55, 182, -42, -174, -141, -65, 234, 18, -57, -185, 49, 187, 73, -167, -99, -34, 54, -82, 98, -63, -147, 118, -204, 90, 228, -246, -252, 173, 42, -21, 71, -279, 94, 137, 200, 37, 131, 173, -130, 35, 334, -170, -63, -97, -365, 194, -65, -5, -129, -194, 164, 178, 65, 231, -146, -350, -49, -23, 77, -4, -245, -127, 209, 254, -42, 141, -378, 83, -153, 64, 332, 159, -139, -201, -352, 166, -210, -120, 62, 273, 38]
7274C8k59L94M1O4l30k0K0L42n11M90l5j72j24M41m35M32j88k04k1J42Qk50K24
7297H7j58P9j86K10l6k31J28K64l06K95k9M5Nj11k1r6P2j49M16k55k8J16k37N8
7321f8R2k6J55o9jl20O28l78K48J25r7k56j3K94m47K53k91M66m29J92L7q1j01
7344h7J62k41Nj8K43j01m6m9J3N8K97m70K58j56P6j7j45J17p8M09l46K39k00M
7368g3L66j44k14n5J56J2L5J97l60M17l27n8K75j14m57M26m15K05p0P0R4j21K75
7391A20j83J55l9J98K0j26n20K96L77l74J98k81J23R0j13j58N39m82R1r7n9L87
7413A62l15L3J30J78l17J42J97l4j28J73m35L39j17K2l26L66L93n98L80l38Q4
7434ij72NQ3R9QK5k24M17j40l74L13Q8J76k56NJ63M2n6l58K74j41P5K16l03L1
$$ y = [38, -221, 173, 214, 278, -52, -72, -52, 290, -221, 269, 234, 62, -62, 379, -56, 376, 188, -16, -37, 105, 113, -137, 87, -71, 8, -178, 32, -4, -235, -107, 157, -149, 146, 117, 162, 167, 56, 35, -61, 11, -138, 278, 23, -5, 111, -126, -68, 24, -2, 153, 84, 83, -237, 391, 13, 261, 386, 289, 33, 20, 314, -133, 120, -171, 295, -134, 58, 95, 14, -87, 75, -166, -161, -179, 64, -37, -83, -132, -119, -61, 236, -234, 24, -132, -56, -73, -218, -101, -179, 230, -116, 123, -77, -73, 293, 149, -65, -120, 36, 48, 83, 280, -80, 337, 10, -48, 227, 113, -344, 82, -333, -128, -198, -128, -34, -155, 120, -63, 92, 53, 251, 271, 145, -375, -79, 298, -76, 122, -159, -36, 54, -59, -217, 322, -160, -69, -166, -225, 162, -153, -120, 10, 188, -129, 13, 210, 176, 48, 221, -214, 125, 8, 30, -296, 70, 463, -135, 245, -93, -9, -181, -176, -93, 6, 14, 39, -185, 232, 92, -282, 31, 119, 295, 39, 44, 207, 249, 193, -165, 109, -32, 43, 259, -44, -13]
7459a3k99N46m21L11J27l83Q1k16M04J61j98l32Q0k7K84J0p9J17l20L35J26l65
7481g1K28j87k0J61j68J65Ml3k48J58j44RKm2J69l42K83M4n8j05K37o2L8j03j9
7506a04K33J2l23l6K13m9l3L96l32K67l33K64j09j53M7L11j27R0k91N7j1j13K34
7529A10R4l97M07k51l8K30j46k46M83l7L5n24K5L45m10K09L62l98Q7K69k78J1
7551e8j64L94n1k03K83J01l10K9R8k8k62M10k24k39K45J19o1m00K9L43j1J14l64
7574b10J28J04j29J80l7j16K09k61k8j52L93J08Q8l66Q8R4j42J12j24J66j02m12
7596d09M11q8K32ML24m24j45M77l55j50R3R7k49P1K69l79M03n24M35L27m03K55
7618B72j75k7q4P5l03J35o1K61o7O4k95J20K19k43K00p6j16j88J98M87m23P6K3
$$ y = [-13, -312, 234, -187, 124, 251, -132, -51, -267, 137, 298, 100, -232, -152, -179, 105, 115, 36, 153, -167, 168, 294, -71, 157, -30, -50, 111, -57, 108, 112, 79, -169, -11, -155, -146, -144, -186, -17, -359, -76, -32, -90, -195, 42, -20, 18, -85, -104, 129, 141, -182, -218, -5, -54, -87, 309, -23, 244, -89, 175, 66, -87, -40, 271, 144, 234, -57, 0, -11, -124, 110, 204, -193, 214, -37, -75, 155, 9, -237, 246, 209, 244, -280, -255, 90, -320, -111, 251, -147, -60, 209, -69, -58, -222, 172, 121, -82, 201, 302, -8, 21, 119, 91, -171, 239, 15, -224, 21, 140, 79, -321, -292, 51, 40, 154, -210, -82, 22, -107, 73, 36, -80, 129, -132, -160, -312, 81, 189, 277, -89, -1, 93, -49, 63, -61, 105, 3, -409, 2, -86, 146, 150, 474, 50, -95, 382, 27, -123, -30, 67, -182, -111, 158, -221, 182, -342, 93, 420, 17, 272, 97, 70, -14, 61, -242, -107, -168, 93, 26, 90, -205, -85, 134, -109, 91, 15, -101, -289, -91, 396, -27, 49, 72]
7641G2Q9j23J38j88R0Nl47K7J44R6L65p61N50J9l14K60r5j59J84k02N7Mk56M88
7665A43oj48N0L82p11J4J18j8L17L4j60J30l04N90l17J09J32m38M11r6J5l00J66
7688A13L2k1J54j67k25j07L47np0k92J98L88k39p2P1k79K87j95l3M00k71N7k5
7711D6M21k63k15j63L98m39R8J15K36o13K86J0l1J79n4N3J00m3o4L1l0J8l8K29
7735B67j34n6j33J01J14k77J64q9J6k37K64K87l50K28q4k75J14j22J83p4j28N53
7757C32k95J66k70j16r3Qp9P17n83J04J59j4J78j66J16k39M1K68j66J90j71O8
7779A55m08L60m7Q3P8l57L59k60J70k99K84NM0k66m2j9k9L75l63K2K12K08k09
7802E2l47M5M43k05P2J25k21L0k65Q54p13L48l05Q0J46j74r1R2r0j00L47k45O5
$$ y = [72, 161, 38, 176, -12, 78, 83, -264, -237, -93, 3, 368, -393, 157, 176, -138, 122, 27, -132, 52, -150, -93, -89, -345, 143, 137, -11, 39, 421, -290, -276, -158, -176, 141, 175, 15, 145, -159, 431, 114, 223, 355, -83, 328, 232, 247, -53, 113, 145, 124, 278, 111, -114, -221, 126, 121, 51, -241, -43, 345, 106, 34, 105, -174, 113, -82, -115, 285, 14, 71, 46, 467, 204, -11, -174, 224, -215, -117, -2, 234, -379, -93, -83, -114, 65, 11, 64, 164, 121, 57, 88, 58, 76, 38, 267, 133, 77, -56, 45, 159, -118, 46, -43, -27, -264, 0, 287, -63, 165, 81, -194, -80, -202, -19, -93, -221, 332, 37, 203, -67, -183, -276, -268, -347, 370, -213, -109, 50, 36, 214, 48, 164, -75, -34, 234, 68, 258, 87, 155, -253, 107, 60, 143, 221, -136, 223, -37, 133, -166, 118, 123, 163, -103, -145, -164, -193, 182, -181, -159, 53, 261, 52, -295, -250, 193, -12, 60, 185, -36, -6, -271, 583, -130, 218, -87, -7, 139, -35, -126, -34, -124, -224, 123, -122, -57]
7825e7J37l20J35J88J43k37J74j22J2r1K48l08J51N5m22K59Pk4m9P7qr2L93n1
7849A98k18j52M1K45k03J6N7k5j6K21o7m08L73L5j25j33M18m29K88j92j43J94
7871b5k3j2o6J03p2M6j00O7Kk6m4O3K46j47q4J3kL00l00M5k02K84k65n4L31m6
7897C2k10j2m3L97l6k27J27Q6m76M03r8K77m18J52K75r5j53J47q5R9Oj54L0j56
7921a32J16o1J74j37o2L8K11j95r3J51Q2k23J9L3K41j98L04j86k9j76K61k52k
7944a16K34k41k5J08R4L37j76k22J72j71j77J45l5K8N2L34j67l54J46K01o5o9
7966C3M49k67r8K9k74J18J97p9L2p9l33N0K88l4J43o79L58K20j79J49j54J78Q5
7989A53j29m1j52ML00k18j3J20j13L04k11j60K49o9n6M1j0R5j48J00k12J49m77
$$ y = [-57, 80, -240, -105, 83, 226, -11, 163, 41, 53, -38, 210, -98, 53, 108, -314, -55, -48, -72, -121, -44, -52, -144, 249, 198, -20, -172, -131, 114, -89, -73, -16, -41, -57, 164, 97, -311, 62, 97, -28, -161, 257, -172, 116, -76, -219, -25, -48, -60, -126, -23, -95, -49, -149, -82, -80, -106, -150, -87, 159, 12, -72, -59, -61, 239, -61, -16, -218, 66, -199, -253, 78, 32, -178, -190, -233, 164, 128, -99, 28, 114, -362, 41, -57, 220, -198, -46, 229, 134, -19, 128, 43, 142, 148, -6, 24, -132, -16, -77, 97, -40, -102, -64, 147, -48, -141, 10, 92, -131, -112, -79, 162, -36, 268, 82, 53, -123, 138, -114, -116, 118, -123, -148, -40, 54, 391, 215, -7, 165, -6, -183, -38, -73, -45, 7, 341, 174, -180, -34, 167, 102, 33, 482, 215, 117, 146, -128, -10, 187, 108, 140, 61, -272, -222, 66, 32, 175, -504, -146, 74, -105, 44, -110, 68, 153, 24, -17, -169, -165, 135, -83, -96, 24, -89, 215, 4, -156, 93, 24, -32, 9, -1, 94, -54, 46, -166, -17, -494]
8012d94M77j25M5J50L5L45n14m2J39q3M4M7M6P9j2n4oK31l85j7M0j82K02J92m32
8037b74j9L92M5l06K07k79K32J64k85q5K42n00L57O6j6P0j0j33J29r0k5j49K21
8060d6r9L31L27o46R6jj1Q1j09M4K22l66J15k32J14L58m44M89p3N0m6N8o26M70
8084E6R0n79L56J1K19Kj79M6j56K47N7q0j12r4K79N8o5l07J18J99k53K96k82M9
8108b4k3J53Q8k45P9j45n1J4K76J24o0k35j91K18m2j51L23l04j46N84j11n82L76
8131g5j26J53J39J69l46j20M16j35j47J83j7l43N71k98J9k94L08R9k81M5l7K57
8153A40j9j83P7k1q2l2L67n83L11Q3K5j68p7L00l48j93K12L17k29J37L36k85k21
8176a36O6q5O8j03Q2K8q2J0L03oJ48J8mk54K14
$$ y = [-494, -17, -142, -97, 53, 88, 433, -81, -123, 16, -67, -23, 24, 70, 149, 137, 83, 77, 308, -77, -94, -54, -236, -34, 158, -274, -293, 99, 144, -162, 45, -234, -2, 162, -123, -208, 34, -466, -109, -43, -59, 11, 1, -132, -3, -93, -118, -267, -46, -145, 186, 513, -133, -37, -38, -49, 32, -77, -33, 189, -177, -62, -294, -180, 178, -266, 223, 150, 200, 154, 212, -414, 56, 146, -433, -77, -66, 153, 155, -24, 22, -134, 113, 170, 90, -22, -116, 163, 221, 156, -151, -33, 166, -87, 209, -73, -24, -47, 106, 194, -51, 28, -117, -168, -154, 122, 246, 186, -49, -240, -22, -64, -215, 108, -196, -342, 242, 131, -451, -75, -201, -48, 91, 260, -86, -206, 210, 75, -72, 111, 94, -249, 322, 24, 43, -251, 57, 156, -125, -80, -117, 140, 121, -62, 15, -6, -88, -120, 247, -336, -25, 58, 83, -85, -162, 138, -210, -403, -191, 126, -103, 34, 370, 85, -136, -70, -155, -87, -190, -108, -80, -162, -152, 151, 145, 293, 311, 307, 53, 267]
8191B67
$$ Imaginary data points
##PAGE= N=2
##DATA TABLE= (X++(I..I)), XYDATA
0@%%%%KkQj6J6j8K6l2M0n6O9p9R7j19J38j62J91k23K58k97L43l93M49n12N80o57
30c49P40q29R31j045J169j302J449j611J788j983K197k433K693k982L305l664
46a926M068m526N048n656O368p215Q248r536J1196j3427J6608k1543L0313n0597
60c2577J79959P5167l23373J8442J61682O2776r5981j4848j0339k8754K6081J04378
72A22613j0591q5273j1497L8084n9006l0262J05510P6309j11083r2653Q0575R0611
84A13337n4383o2616J7562O495k7835L7018O0068k6409n6863J6719K2090l3617
96A1566p228M7794j2072p1126O412Q0796J1138n6158m192L1128k4873l3115L3975
109A4045L5404l2107l1570K1637J6330j1334R581J4699l3165l0505L2525L1180
$$ y = [0, 0, 0, 0, 0, 2, 0, 8, -8, 8, -10, 16, -16, 24, -32, 37, -42, 55, -64, 74, -88, 103, -120, 138, -159, 184, -209, 240, -272, 308, -349, 391, -438, 493, -552, 617, -685, 764, -847, 941, -1042, 1155, -1278, 1415, -1567, 1738, -1926, 2142, -2384, 2664, -2992, 3376, -3839, 4409, -5127, 6069, -7358, 9250, -12293, 18020, -32577, 147382, 222549, -100824, -82382, 79300, 142076, 46095, 31247, 20908, -7846, 18235, 122613, 112022, 26749, 15252, 53336, -5670, -35932, 69578, 145887, 34804, -57849, 22726, 113337, 58954, -3662, 13900, 20395, -7440, 29578, 89646, 63237, 6374, 23093, 45183, 11566, 4338, 52132, 40060, -31066, -24654, 56142, 67280, 11122, 6930, 38058, 13185, -19930, 14045, 49449, 17342, -14228, 7409, 23739, 12405, 21986, 36685, 3520, -26985, 5540, 36720]
121C6720l1039k2599L5415J6967l9378j5359L5572P112l6893q840K4603L150j0240
134d809J2933P567k1870n663K4592l144l5213J006L4149j667k7224J1893K9637
147B2187j5344l1217J0187K0882j2899j4255J3613P270j3550J969J7575p646k1324
160b2552O682J5342j4019j1485K2096J4698k1708j3143K0608Q795k1584p763J6606
173g427K812j3740M068J4611n021r293O738L580j3459k019J5681o04j6568L805
187a6836J9626m008j8751M476J4836o150j2673P054J0232o294m183P893M38q700
201a3040L264P455p496q402J0447R844j0419p888J0675O677j1080n257R455K763
215c002p764l21P319j935l841L853K981p090j978Q380R94q565J412Q848j198q105
$$ y = [36720, 5681, -16918, 18497, 35464, -3914, -19273, 16299, 23411, -13482, -22322, 2281, 5431, -4809, 8124, 15691, -6179, -11842, 12750, 9606, -25607, -24601, 9548, 7881, -19343, -7450, 22187, 6843, -24374, -14187, 6695, -6204, -20459, -6846, 424, -13126, -11157, 6418, -1228, -22552, -15870, -528, -14547, -26032, -3936, 10762, -10946, -24089, -3481, 5314, -16270, -24033, -7427, -4615, -18355, -14287, 324, -4697, -13990, -7252, -3672, -17131, -19150, -3469, -4073, -20641, -16836, 2790, -1218, -19969, -15493, -657, -6807, -19480, -12426, -2194, -8488, -12671, -4778, -4340, -13040, -9776, -2321, -9817, -18219, -7772, 2072, -8347, -16235, -5560, 1117, -9963, -15220, -5765, -3002, -10766, -11087, -3768, -5703, -9544, -5691, -2710, -9800, -11778, -3398, -2404, -10969, -9557, -709, -1907, -10012]
231a0012K208O819l081o022L719N186l723k483L748J579m436O87L755j860l392
246g308L533L535l169k763M826K096n314k222M982J858m024n19M003P12k550O62
262a662R56j998m57K829j69k234J276L724r78m031R39L118p60k815J205K551k63
279A231n25P85L2r96K89L79j365q5J845J294j467n16K060N04k125j352J356M63
297A807n52M13J279K98o33L09K86j576m66R85k33m86J035J341l09q94O00K81j200
316B285j268N80J264j81k76J039M62n96n31k04p85M3J08Q56m09j18J594M39j916
335B386o92P12j86j175j39J073J194j70p51L39k51p62j66m65n40P24J176J7n29
354A795J85O77l21j739o58P25R0j40j7R18K45r3l01p64n55k91R4M8N22P04j62
$$ y = [-10012, -7804, -985, -4066, -10088, -6369, -1183, -4906, -7389, -3641, -2062, -6498, -5811, -2056, -3916, -7308, -3775, -240, -3409, -6172, -1346, 750, -4564, -6786, -1804, 54, -3970, -4489, -486, 226, -2324, -1662, -706, -2704, -3161, -332, -501, -2735, -1459, 2265, 1287, -2744, -1805, 1313, 553, -2262, -1057, 1494, 1231, 706, 1491, 1523, 527, 816, 1195, -170, -255, 1590, 2884, 1417, 901, 2961, 3465, 1340, -12, 1344, 1807, 1255, 1668, 2947, 3245, 2612, 2921, 3207, 1631, 1165, 2150, 1917, 1431, 2466, 3807, 3498, 2604, 3204, 3485, 2285, 1017, 1597, 2861, 2680, 2404, 3443, 3905, 3309, 2778, 2574, 1789, 1832, 1940, 2796, 2387, 2269, 3863, 4302, 2386, 1694, 2406, 2220, 1045, 906, 1979, 3173, 3003, 2252, 2591, 2340, 1578, 1412, 947, 407, 1131, 2307, 2324, 1795, 1980, 2657, 2336, 597, -61, 664, 754, 614, 597, 1515, 1760, 1667, 1366, 602, 47, -244, -150, -102, 420, 1124, 962]
375I62L70o07l24m03n40j51L99J74K11M23K43o7j34o14q03n7J18J79j13N64M02
396B32M45r19%m86J16l90k68O07J23N26j64j21j03m7J59m78q91O1J113Pm2K66
418b54J72j84m25o23J63K98o4j24N58P6L66j27o31n2k8r6m2j45K16P63J6m06l2
441f05J26q4l29n71O26K87N30k64j4J89j08n68q6p9J23N53R5J71J33qj57k19l42
464f01l1O0j29J42M41K84n03NK53lm27J40J53L8J49j05r5K2M25J24p74l29O74
487h7k30L61j81j18O45L4m36q6J62Q1k19k06KN7O35k02j57m80N66Rn12L92j06
510g6K12L37m10j98K21M09n13j54O9M00R8l06k02L33K81o12K58k65K41NNJ49j46
533A36J95qm2M0L1P0k93n7K96M24m60K55j86j60K0j73R0M56k61m0J73Oj58Q5j59
$$ y = [962, 1332, 725, 401, -2, -542, -693, -294, -120, 91, 514, 757, 690, 556, -58, -861, -918, -800, -621, -734, -170, 232, 677, -242, -242, -728, -612, -1002, -1270, -663, -540, -14, -178, -299, -402, -449, -290, -768, -1659, -1598, -485, -478, -520, -254, -82, -266, -691, -1314, -1151, -853, -917, -1041, -483, -407, -41, -168, -799, -851, -879, -975, -1017, -1162, -946, -183, -167, -573, -605, -479, -563, -892, -1463, -837, -550, -20, -284, -298, -109, -217, -785, -871, -950, -827, -274, -179, -8, 125, 117, -40, -259, -601, -632, -572, -701, -559, -118, 166, -337, -332, -79, -82, -509, -369, -216, -178, -29, -134, -229, -207, 218, 342, -432, -761, -87, -317, 44, -137, -255, 390, 424, -12, -98, 64, 145, -74, -280, -278, -221, 414, 212, 55, -425, 141, 150, -362, 30, -76, 136, 473, 63, -135, 86, 495, -18, -172, -103, 297, 395, 89, -113, 220, 501, -111, 147, -118, 123, 128, 133, 282, 136, 331, 323, 281, 321, 352, 422, 129, 72, 368, 792, 332, 587, 401, 241, 261, 88, 178, 634, 373, 333, 506, 512, 354, 439, 280]
558B80J45j12L1L02p56N79M8J0k55k00M78k53k34n1K68K76Ql00n7k49N01l14J8
581A63k12M80r3k70J28P3K31m44K21k86J4k0K32j4k17K15o8K24o03p1M06O9k76
604a18J42j69N02j96m7R8m55K14P2j43K77j39K40l14k78K38N9q7q7K0L46k90j32
627b47j2K1j34j33O14k23on08K66L17j61K48l76m5J57L9jk09j71L81o2k78J77
650c46Q5k9j30J25J23l3JJ15N3l03J25J78l49J23N5J16j3l36M06j94O8m64J6O20
674A2l77J03j05K27j91KN00q0m33l9R7K81j64M1m33N11J9p5J10N3l27K47j32j82
698c35o3M30J56l7l73J82J10j83J59m28N26J93L7m59J37K7q6J12j90J97J8jl40
721b11j36L38r3K60m81N00J3j41l68K59MJ14J12l45L4K80M1K73m98MJ14l88N23
$$ y = [280, 425, 313, 344, 646, -110, 469, 517, 527, 272, 72, 550, 297, 63, 12, 280, 556, 564, 264, 207, -42, 459, 145, 163, -49, 431, 338, 68, 196, 269, 500, 56, 277, -9, 5, -15, 217, 203, -14, 201, 133, 357, -246, -317, 89, 158, -118, 24, -145, 357, 161, 114, 212, -243, -29, 43, -100, 177, 38, 278, -36, -314, -76, -17, -104, -191, -171, 175, -115, -247, -259, -238, -372, -505, 109, -114, -120, -628, -362, -45, -206, 42, -334, -379, -222, -183, -184, -393, -564, -183, -245, -523, -346, -261, -290, -420, -295, -172, -205, -204, -89, -36, -339, -214, -36, -385, -262, -207, -91, -104, -440, -34, -228, -160, -624, -608, 12, -365, -262, -367, -140, -331, -329, 171, 91, -342, -381, -284, -3, -167, -126, -559, -48, -29, -104, 6, 59, -268, -21, -153, -335, -398, 32, 188, 151, -222, -40, 70, -113, 46, -382, 144, 337, 374, -85, 52, 79, -7, 105, -85, 112, 130, 129, -211, -347, -9, -102, 158, -323, 177, 190, 49, -319, -60, -56, 58, 170, -175, -141, 139, 180, 453, -45, -41, 73, -315, 208]
744B08p4r2K28k28Q4Mo6J92l17Q7j73j33K55J9k69N68m10j63J83o5m1M4J22J46
768A09Q3p1m1J47j15N3K61j63r9L1O9j48j37J37K02k10J70k73M5l55K36J06p2
791c5Q2k58L99m53M26k30K97L8l42J32J79j19l07K63l39M24O1l6k49n4K38q9J66
814A94k6k28q1J26L28j12k44j33K77O3k49J66J13l33J30r0N25o37p8Q5N8J09p5
837a12J73j40J4J73j62M04o69J96qK93J37Q6l89L31l02p9r0J09o2j31J92R6l63
860c03Q1K39j44K50k38L72l21J9K0K68l78J37RJ36l59K70j44J09K92k77j54K43
882A27L2l30P3J25J23k91K15m3l34K47K13r2L9k39K75l06qQ6nMn9M57k49p3K0
907GL1M6o5q6K5M0J02l03j37J85p3L12j47L0j32L9J84L9j99R9J49k33Q6l08K23
$$ y = [208, 134, 42, 270, 42, 126, 130, 64, 256, -61, 26, -147, -280, -25, -6, -275, 293, -117, -280, -97, -162, -203, -159, -37, 109, 192, 121, 80, 227, 112, 165, 426, 263, 164, 195, 264, 116, -21, 116, 318, 108, 278, 5, 50, -305, -69, 37, -35, 47, -211, 188, -265, 161, -69, 228, 266, -76, 56, 235, 116, -191, 72, -267, 157, 218, 182, -67, -121, 117, 28, 194, 168, -60, -141, -15, 313, 201, -43, -176, 101, 164, -85, 81, 194, -139, -9, -99, 426, -211, -289, -204, -146, -37, -112, 61, -79, -65, 108, -54, 350, -319, -123, -131, 162, 299, 385, -4, 327, 25, -54, -144, -35, -97, -228, -36, 60, -303, -222, 17, -127, 123, -115, 257, -64, -45, -25, 243, -135, 2, 11, 147, -212, 58, -86, 23, 315, 38, -116, 127, 159, -171, -98, 27, 150, -141, 74, 31, -303, -56, 157, 65, 104, -135, 140, -166, -174, -88, -93, -89, -148, 309, 60, -13, 7, 38, 84, 19, -67, -42, -2, 100, -203, -340, -155, -228, 84, -63, -33, -165, -126, 58, 97, -102, -3, 146, -87, -1, -309, -86]
932h6K1r6K15N5R9R6l08j65K28J06k60qL71j50K4j06k35L34R7j79k29j29J95K80
956A70k02M0k14K14j40N8J93j23L68l18k44N3P3K9j40L59l03j73K45L09p3l66
978a85M38m22L67m24L75k84l9j96K45j26N33l40K87j09j04j39L13n6R1r7k73M49
1000C04j91r6k45q3M00j80J56l32L31J55l68J05K22k06l2K02j99M8O9p6J32m1
1022G5l44L04J49K79m35l81K16K47j36j43m3M42j37m9QM09l98J97j48m4Jr1n8
1045h0K78j23N2m71P58n39J26J23j70j65K73m14L50O1M8m28J11j62J39J20K33
1066A20o9MJ63k92M51o16K09O0j08p3j38L74m0j46J98l76L79j33K4l42N24J08
1088B81m56J10J03J4k23J38K82l84J08k87L84P5q9O2k45M9K5j24L95m28K96l32
$$ y = [-86, -65, -161, 54, 109, 208, 304, -4, -169, 59, 165, -95, -103, 268, 118, 142, 36, -199, 135, 232, 53, -176, -305, -110, 170, -32, 8, -206, 8, -132, -74, 119, -4, 364, 46, -198, -145, -72, -43, -183, 176, -127, -300, -55, 254, 181, -185, 253, -169, 198, -226, 149, -135, -174, -370, -125, -251, 282, -58, 229, 120, 16, -123, 190, 134, 225, 128, -145, 304, 113, 17, -228, -311, 89, -91, 65, -267, 64, 219, -149, -44, 178, -28, -60, 142, -57, -9, 60, -16, 116, 75, -269, 35, 184, 463, 28, -353, -137, 110, -26, -169, -212, 230, 93, 44, 52, 461, 63, 260, 112, 68, 69, -22, -80, 198, 75, 127, -344, 414, -125, 1, 124, -46, -211, 62, -352, -2, 59, 107, -321, -210, -372, -233, -113, 120, 51, 55, 218, -74, 377, -239, -30, 30, -78, -151, -289, 85, 45, -101, 97, -279, 100, -33, -9, -351, 173, 281, -175, -65, 38, 52, -171, -33, 249, -135, -27, -314, 70, 145, 56, 118, -127, -78, -53, -177, 218, -210, 86, -246]
1110b46L08J8J1K01k74j43J43J9l81O1N1p2J36K49l43p8L18J07k59K65j08k1J39
1133A01o5J30j04o03N70k82O1K00r1K8k45M05n20M52k09L49j28m3j92J27J3j11
1155a57o8J21K10l00L41o6l15K97K1n5K27m12K41j29j16L20j23M5k77M83k59j4
1177A5m72P41m92j28O54l54O1k29n4K14K8k8j57K08K82l31J85k8j28M0j51L14
1199A90j10k89M2P2M13l35l24L27j44J66j15J75J68j18k09J31k8K75k85J60j06
1220E6l81K36j6L47o6m76K35L09j03J1j77J73Ml78R3L43k94J68j45L1J28k66K89
1243A21%j08J25K9j08r6J33k09J12p7P1L05m95R0LJ45k48L45p5Q5l0k00K82r3
1267A07O2j6l16q0M51j36l10J44J98o3m03N00j47k5L09l85o4K8K2j7K28j57Qq8
$$ y = [-246, 62, 80, 91, 292, 18, -125, 18, 37, -344, -283, -232, -304, -168, 81, -262, -340, -22, 85, -174, 91, -17, -38, 101, 36, 166, 62, -541, 29, -253, -192, 8, -83, -55, -300, 105, -415, 37, -172, 177, 49, 6, -186, -59, -46, -157, -225, -104, 106, -194, 147, 81, -234, 63, 84, 29, 256, -156, 85, -44, -160, 160, 37, 82, -195, 288, 29, 15, -457, 284, -208, -336, 318, -36, 25, -204, -258, -44, -16, -44, -201, 7, 289, -42, 143, 115, -13, 27, -124, 190, 80, -209, -167, -95, 318, -17, -341, -14, -158, 8, -107, 68, 236, 118, -91, 40, 12, 287, 2, 162, 56, -325, -89, -105, 242, 176, -300, -65, 244, 141, 152, -25, 148, 152, -226, -133, 210, -84, 84, -61, -30, 98, -168, 121, 121, 13, 138, 167, 59, -37, 96, -113, -1, -78, -7, 298, -197, -107, -104, 41, -207, 138, 63, 148, 118, -82, 200, 107, 169, 153, -163, -243, 208, 72, -238, -94, 104, 41, -362, 138, -9, -34, 275, -110, -174, -146, -124, -141, 87, -70, -62, -150]
1291a50J14j04J50J22o6O6j8k68J12j03J10o7J09OM3j97J72N9J67p6r0n0J05l85
1315b39K24j70K11J15k22K12K7l73N3O6K63k75J97o2k5p2N31l36J3q9k28R0j48
1338b37J66J78M1R8k46K17k16N8J70J7k17j20K46j84j7J98m10K92k62J08j14O17
1360C83m15j98M31l25J70j81K86j14k85M95k92J75j55o7J4k8J30k5k04J48M07
1381C50k13K10n05O09l90J9J38n13L4M52k27LM59n39L01M1n56M16j70LK27l05
1403a56J20L6j93J61j42m9J38J9j23n2K65l3j28j2K75N2o7k70J91k43J16L2M5
1426a8n9K71j40L70l64J67J13o19Q4L80j22L29l61P4m4J64j05j52j56K63j36L70
1448C09m21K7J84q6jr6J16J83m09J17j10nL67K2j39M2r7j54J11p1J37j49O7K59
$$ y = [-150, -36, -140, 10, 132, 66, 132, 114, -154, -42, -145, -35, -102, 7, 13, 56, -141, 31, 90, 257, 181, 91, 41, 146, -239, -15, -185, 26, 141, -81, 131, 158, -215, -162, -96, 167, -108, 89, 27, 2, -70, 461, 125, 138, 49, -179, -89, -237, -71, 107, 148, 246, 0, 217, 1, 59, 229, 246, 29, -91, 155, -29, -46, 152, -258, 34, -228, -120, -234, 383, -32, -230, 201, -124, 46, -135, 151, 37, -248, 247, -45, 130, -25, -92, -78, -106, 24, -1, -205, -57, 350, 137, 347, -158, 451, 61, 80, 218, -295, -261, 191, -36, -33, 426, -113, 188, 229, -327, 89, -81, -78, 149, -156, -36, 0, -193, -32, -174, -223, -85, -66, -189, -241, 24, -9, -137, -149, 126, 178, 111, -159, 32, -211, -95, -63, -18, -77, 194, 54, 424, 60, 227, 340, -279, -195, 185, 63, 392, 31, 105, 61, 225, 120, -32, -188, 75, -61, 309, -112, -85, 99, 13, 12, -84, 32, 215, -194, -77, -187, -192, 175, 197, 58, 100, 3, -151, -40, -111, 26, -123, -56, 203]
1472B03j67j92K15k07k03M81m20L72j43J48j78J8O4n16N80Q8k26J39J6j37j93
1493b58K48j05L10k81r3J58J7j9J5k03J40q0nK3rJ15J75J14j93j77K79p7j03N2
1517D3N6q2N5k36L41l72K19j57R2K52J72k78N6N7k98L6j01k9L63m9K7l03J07P6
1541D7o5j93K22J19L0J13n26M8K9k2K34N4J99k85J01J00m38K46ll08K68j27J45
1564a2K7Mj68J90n4J03P0l10N7J65N9l85L46l11L68k80L56k00j73L32l09j29N3
1587b01J24K82k74o9J23l3Q9K98o85N57l25L04l5k80J86k3j44K92q5k53K87j70
1609c5K88j29J97k41j99J02Q2K61n53O80m11o4L36l1k58l02O33k98k82L05Q3q3
1631H1j06j05J25O5R3k3k13J30R8m25L36K21k83J29J04j44N7l09J44J97m4q5L6
$$ y = [203, 36, -156, 59, -148, -351, 130, -290, 82, -61, 87, -91, -73, -9, -525, 55, 143, -83, 56, 72, -65, -258, -10, -115, 195, -86, -179, -21, -4, -23, -8, -211, -71, -151, -156, -133, -142, -27, 148, 262, 69, -108, 171, 94, -9, 43, 99, 17, 72, -164, 177, -195, 24, -133, -41, 211, 383, 105, 161, 218, -80, -44, -145, -174, 189, 140, 167, -136, -29, 47, -18, -211, 11, 130, 160, 273, -253, -205, -176, -198, 36, 90, 289, 4, 105, 205, -233, 13, 10, -298, -30, -157, -12, 15, 19, -149, 41, -13, 90, 160, -150, -93, 72, 131, -254, 92, -219, 149, -131, 225, 25, -148, 184, -125, -254, -201, -77, 205, -69, -138, -15, -48, 41, 339, -346, 211, -114, 190, 155, -125, 61, 38, -106, 186, 101, -152, 135, -35, 253, 124, 321, 80, -119, -17, 65, 326, -227, 453, 42, -22, 314, 283, 25, -277, 356, 58, -224, 81, 164, 81, -25, -130, -5, 60, 153, 130, -83, 47, 145, -280, 56, 277, -6, 123, 227, 83, 140, -169, -25, 172, 128, 43, 79]
1654G9o4j00Q3K7l25K16J0O7k8J33mq9j1J70om62J61K92k36N9j9l29M29J89l91
1679a49K17N2j05k48L45j13j85K74r9J82j88j22p7M42l47K06Q8q4q9p5k7K41k99
1702a60L24OR1l53j28L46j06l8m1K6L4J9M11n05K84k3k71J31k53j56N51j7p6K
1726I8k33P1J30no9j26J19K4R4l8L5k45N01m7k75j99L60l26K50k33j11q6K59L35
1750B83j64j08K3n2L68r0m09j81J14L47O4j46J57l50R4P9n5J98p9k86J29J14k11
1773a61N28j68p5k45J47Q2j63P2J00K1l71K8KM30n16O21l26l03M9m1L11M0J69
1796B31k42j40K11LP5q3k46p2K38P0n1k7k3L09q3j05j69p0L05J95n01J22J17l5
1820B9j85J03J29j52p1K95m9O5l16j1J17R8k23K11J18j50j2j63K37R3l71J1Q9
$$ y = [79, 15, -85, -2, 25, -300, -84, -74, -7, -35, 98, 94, 5, -6, 164, 158, -304, -143, 149, -87, -28, -47, -376, 53, 242, -149, 68, 120, 15, -233, 112, -1, -186, 88, -11, 171, -17, -139, -216, 226, -121, 85, 173, 89, 0, -75, -102, 139, -160, 164, 170, 261, -92, -220, 126, 20, -18, -59, -33, 1, 20, 431, -74, 210, 187, -84, 47, -206, -362, 189, 172, 96, 98, -135, -64, 66, 61, -8, -134, -15, 9, 103, 65, 100, -145, 356, 309, 34, -165, 195, -131, 119, -114, -225, -311, -52, 283, 119, 11, 34, -18, 350, 260, -149, -330, -216, 131, 195, 49, 206, -144, -50, 29, -26, 172, 93, -193, -64, 50, -161, 367, 199, 124, -121, 26, 108, -55, 17, 117, 138, -233, -205, -203, 227, -289, 332, 6, -297, -248, -289, 22, 62, 231, -11, -151, 60, 63, 138, 55, -191, -263, -25, 45, -6, -33, -56, 253, 170, 65, -104, -174, 131, 326, -175, -53, 64, 29, -156, -53, 76, -76, -147, 148, 99, 164, -152, -163, -46, 52, -171, 40, 158, 8, -4, -167, 70, 163, -208, -197, -108]
1843a08J64l06K48m9O7k1j13j1P8J35j93K06J67j25n47J56K31O5l88N89n52N33
1865B26k68p5k34K96L1j44OR1Q8R4r7J91l8j49K8J10j52j15J32Q7l90K91J73l75
1889a93K2JM48l07J59q5j07n8j3j17L32l02L28l7m76M05K98j84n86N01J47j55
1911B1N9r1M4J07k46J83J15k58q3J9J17j31J54j73K10L5k40J23O5m38P18l2j03
1934A75q6j53J52o0J99l10q0p9K69o5O3J44k83rN0j14J80J49k32k9l1j25J28L69
1958B22k75L6P5R8k77L95j66l13K58M6j96K66j80m8P7j87O7M41m30K6j08K5J59
1981A1R1k98K43N2k64j34L39j69L87j12j06l74M73L8pm8k65K2L09k64%L09l16
2004h3p7J71J92r3j08j76K8J33J9M7k08l9L33j00k60K53p9j08m8K52l5j55J04
$$ y = [-108, 56, -250, -2, -51, 16, -5, -118, -129, -51, 84, -109, 97, 264, 139, -408, -252, -21, 44, -344, 245, -307, 226, -42, -117, -351, -55, -24, -168, -162, -71, 17, 111, 14, 205, 167, 18, 46, 156, 4, -111, 21, 108, -282, 9, 182, -193, -171, -170, 278, -29, 130, 45, -62, -120, -133, -250, 82, -220, 108, 71, -405, 0, 298, 114, -472, 29, 176, 21, 80, -11, 33, 140, -106, 77, 192, -66, -149, -130, -13, -144, 10, -163, 47, 82, -158, -35, 30, -408, 310, 278, 175, 89, -64, 88, 28, 227, -83, -163, -242, 27, -38, 25, 169, -114, -123, -73, -187, -7, 142, -90, -119, -150, -275, -147, 222, -53, -17, 58, 156, -121, 274, 108, -205, 53, 99, -97, 169, -11, -59, 18, -169, -102, 339, -91, -65, -173, -148, 11, 102, -196, 47, 99, -165, -299, 40, -129, 258, 146, 40, -334, 139, 177, 170, 122, -143, -121, 188, -76, -76, 233, -83, -160, 11, 203, 110, 2, -174, -146, -13, 6, 53, -155, -194, 139, 39, -221, 32, -47, -155, -203, 49, 14, -141, -37]
2027c7J08k25K86k0l31M80j10K05l41K95j05k08J07j78J72j44o8K94l06l68O03
2048A09j43P4rr8k64K09l47O02J37j91l06J73q4l05N35j13m0k6n7J24j20J70J10
2071A40Ll69N41n06L79o21M43K44k87J77J2j75J88j46q7j43L90r5l86L58o27L90
2093a77J03J00k84K84m3m9P8l18M01m64K81L03m47J85J00l06L51k79K92J28p14
2114d75M61J13r9O3J03k52j41K83j35M10m39K85k1J44j33J7j8j51L4m58M97m3
2136D5k60L72k2j9M6j26p0R2j96J25K19k2P0j66j05J27N6j68p2Q5j85N01l83L07
2160B51n26J88K29l4k87M0L84l91K9O1K43l11K11o4k44L79k78j04J49p5J45k70
2182b75M10o4m89M27N6J03j07j58l9J80N8n5m1k58L67p3N2L7k14J93k43j97L74
$$ y = [-37, 71, -154, 132, 112, -219, 261, 151, 356, 15, 310, 205, -3, 104, -74, 98, -46, -114, 180, -126, -494, 109, -34, 40, 31, -67, -331, -122, -469, 133, 270, 79, -227, -54, -138, -443, 92, -21, -61, -87, -144, -20, -140, 30, 140, 143, -226, 315, -191, 188, -433, 10, 254, -33, 144, 156, -19, 169, 23, -64, -207, 183, 88, -298, 60, -567, -177, -74, 26, -258, 26, -17, -66, 12, -306, 95, -369, -88, 215, -232, -47, 53, -253, 98, -181, 111, 239, -475, -14, 99, 0, 63, 166, -86, -227, 56, -79, 331, -108, 177, 156, 300, 167, 184, 166, 15, 49, -409, 88, 45, -215, 157, 135, 116, 162, 36, -34, 58, -138, -13, 206, 184, 254, 88, -17, 110, 166, -2, -74, 11, -174, 327, -56, 251, -275, -87, 142, 108, -179, -139, 245, -146, -117, -56, 187, -124, 87, 23, -221, 158, -120, -224, -75, -150, -5, -275, 135, 71, -418, 9, 65, 168, 61, -97, -136, 44, 102, 47, 6, -252, 115, 42, 94, 131, -83, 110, -133, -330, 44]
2205D4K3J99nm00L96j40k48P0j78R4J11k7j52l2L92m3j59m2j46J03M8J41N7m5
2229F1J57p3r4o6o2j58K37K54j15k4m04J97l9nN89l09K70m88P3n8m6J41k54N65
2253C49m20j44K13j21J29J07j4k21J03j6l19O16L3k34j80K39p1R9j9l03J16j43
2275b01J64M4J3p0l43L02m6R9k69O40k04r1j01q9j49L10j20L28k40k19K64k52
2297b30M60j61l92L33k62M41m9q8J66k88R9k1K06j59j69L16N1l71R6j31K41l67
2319b79L89m9k5k1m25M32J49l58K43L22m74J60k2j67M05j15k54J79pk28J74k4
2341EL4l09L80n7N0j47k75L88j20J29l14K44J54o8j11L3l4K02j50k06m84O59k88
2364b85L9K75l7k9K07J6k41K07j71N00j94k70k2J64M4k65j20L3Q0J4J84j90j42
$$ y = [44, 67, 266, 261, -139, 257, 117, -131, -61, -239, -145, -34, -61, -213, -245, 147, 104, -55, -97, -243, -140, -92, 49, 106, 61, 218, 145, 51, -15, -77, -235, 2, 256, 141, 117, -287, -90, -129, -134, 455, 146, 416, -72, 1, -57, -103, 38, -216, 349, -71, -215, -2, -123, 6, 113, 99, -122, -19, -35, -354, 262, 295, 61, -119, 120, 49, 148, 129, -174, -58, -201, -37, 7, 20, -50, -393, -91, -137, -38, -307, 333, 129, 38, -63, -152, -301, 9, -111, 217, -23, -242, 22, -230, 230, 69, -323, 10, -252, 189, 140, 52, 218, -70, 29, 8, 214, 55, -114, 202, 253, -118, -22, -153, 88, -279, 110, 61, 36, 15, -410, 22, 171, -187, 56, 378, -96, 64, 42, -125, 280, 165, -89, 90, 83, -145, 29, 5, 39, -270, 110, 53, 103, -44, -319, 69, -51, 78, -236, 8, 162, 94, -17, 16, -18, 184, 34, -172, -656, 3, -285, -246, 29, -8, -37, 170, 186, -55, 152, -19, 481, 287, 17, -5, 159, 203, -62, -182, -149, -69, -55, 129, -61, -203]
2387b03J62J58n9K01k91Q0M9k73K91j73K25j78k8K61j90j96K43j71j22M34m4k69
2409i3o1N2J16k42p0L14L2j9J96l01j55J96J18O9l82N6M17j58K31l35j70J08J
2432h0R4j03J05K87l98L58j79l99K2J70J65R2m57N01l68m4P55o22o6q8K24n3R6
2455A2j86K79k34O7j19J20k9K80j91r0J58k11k81M69K5J16j08J48k12j64O8K15
2477A32J29n30M62l8k32Q9Q3n5j46K87j70O8j75M16n17M1K93N6k67j9l70M03K42
2500A82j68Q3L2J16n94K00j7M21l71K71j35M6j93L01l5k16J24J77o59P09l14j08
2522a48Q0P9k20L63j49K17j40L99n96oL02j13J30l55K04o6K37j29l0N5m5k83K69
2545E5K0j91J27j38J87j02j51M0K81l39L88n13K97ro6k24K77L1j88K52k79N08
$$ y = [-203, -41, 117, 58, 259, -32, 48, 97, -176, 115, -58, 167, -11, -39, 222, 32, -164, 79, -92, -214, 220, 176, -93, -154, -102, 14, -228, -298, 16, 48, 29, 225, -76, -231, -35, 83, 152, -230, -174, 243, 85, 316, -19, -189, -81, -80, 14, -89, 16, 303, -95, 263, 84, -315, -293, -123, 42, 134, -323, 178, -190, -234, 521, -101, -167, -255, -31, -84, 12, -174, 105, -129, -62, -181, -61, -90, 190, -1, -91, 67, -144, -425, 44, 69, 185, 77, 225, 13, -151, -83, 132, 261, -269, 193, 155, -77, 12, 95, 40, -106, 181, 11, 79, -96, 320, -197, -156, 137, 193, -74, -93, -463, -60, 182, 14, 97, 129, 245, -349, -149, -166, 255, -116, 155, 20, 66, -127, 174, 139, -77, 47, 224, -435, 274, -40, -148, -68, 11, -209, 154, 5, 222, 82, 481, -115, -121, 181, 68, 198, -157, 47, -19, 218, 89, 59, 114, 69, -214, 55, 75, -116, 11, -127, 60, -42, -193, -153, 128, -211, 177, -336, -39, -48, -114, -338, -61, -30, -218, 34, -245, 263]
2567B63m06L36l56J29J11k35M03l87n1M08j49j91L9k27M78k47k59O01k81p0j33
2588b24N60n34L02k83%K01J82j59ll2o8q2L57k60M2k18L82k96k8J91J47j10j76
2611a09M00k55j33l0j17M01j80K4j81K70k33K22j84K67j21R7Kj3K7M5r1m20K70
2634d2k65L08k0j3Q0K37l75o6L91L6k94j42L69j95P3J18MN1m18L05j3m3k54p4
2658b42L0JL44J31n2J49n87L71J65l22j63K77k17M24j67m99N72j63k36K30q9J45
2680A02J29k28M4k04J16L03k66j50l1L5L1J68r3M0K85n62K86l21P36J1o42O4K08
2703F1n3q6j1J61L08j70j26j74J74o7L70j61j45k8p1Q4k0jP5m0k17K46mk55L68
2728B18l1o3j41Q4J00J64k67j30J02M7l59r2M65k00P5k7K7R2j37k59O59l85J99
$$ y = [263, -143, 193, -163, -34, 77, -158, 245, -142, -193, 215, 66, -125, -86, -313, 165, -82, -341, 260, -21, -91, -224, 336, -198, 104, -179, -179, 22, 204, 45, 42, 10, -58, -140, 217, -43, -1, -219, 163, -133, -161, 30, 177, 67, -109, 291, 36, -97, -127, -244, 157, -23, 1, -180, 90, -143, 79, -105, 162, 41, 138, 140, 127, 154, 199, 108, -312, -42, -307, 1, -19, -32, 48, 285, -90, -156, 235, 271, -23, -165, 204, 9, 82, 200, 204, 255, -163, 142, 129, 86, -168, -242, -212, -211, 133, 264, 212, 361, -226, 145, 310, -12, -175, 102, -115, 309, 142, -357, 215, 52, -184, 46, -43, 102, 231, 3, 47, -157, -41, 262, -4, -154, -185, -150, -119, 49, -44, -4, 281, -281, 5, -316, 420, 431, -211, -147, 61, 8, -78, -89, 72, 380, 210, 84, -90, 84, 17, 387, 226, 81, 53, -18, 66, 46, 45, 120, 80, -137, 109, 105, -150, 218, 187, 124, -17, 67, 167, 331, 64, -66, 36, 83, -276, -368, 97, -103, -28, -55, -28, 64, -73, -332, 327, -58, 141]
2751A41l20M3m66O08m8J31j05K01j89L2l1o2j19K07Rk36K56k19K98J42m39Q6K05
2774A25l13J69J6O0j55J2J21J69o1o0j6o2l19J52M27j90R6k58J65k69NK39o5K69
2798B57l44K40j43k80K17N3J14P4j68r3R1K14m81K74j43J57r1K06K0l43J85m61
2820d45N46K5J06l22J84j35L3J75k40R5n5Nl60L29L6N1J20k08L1N57m83k99L17
2843F3j76j63K87j43J67J7j52M56k57j40K86l70K95M5k94l3pJ2J27o6pJ61j2k41
2867a45j66m5L54m01M36p0k0j42J46K34lr8N3O2k82K03l46M98l45J19p3K2j76
2890a85L12m7K19m18K1J9J22n5m1nL7O8m00J01k6L70l05N91k00l40J37j44K43
2913G4jQ1k93m3L02L43p32J13O16m49j67k23L05J96R7l0l26k4j50K70J05M0j70
$$ y = [141, -179, -136, -602, 6, -42, 89, -16, 185, -4, 28, -3, -65, -184, 23, 32, -204, 52, -167, 131, 273, -166, -80, 125, -188, -19, -3, 57, -98, -86, 35, 204, 143, 83, 67, 5, -314, -162, 265, 75, 171, -87, 78, -191, -186, 53, -12, 257, -87, 153, 10, -270, -53, 0, 114, 188, 20, -73, 18, 232, -249, 25, -118, 39, -52, 154, 174, -169, 16, -445, 101, 126, 232, -90, 94, -41, -8, 167, -73, 22, -33, -28, -388, -59, -23, 28, 148, -60, -29, 528, 45, -254, 63, -113, -276, 11, -132, 35, 52, -100, 356, 99, -41, 245, -125, 170, 215, -79, -112, -119, -107, 20, -46, -53, 108, 96, -145, -311, -356, -2, -403, 33, -37, -57, -199, -53, 181, 178, 80, 133, 195, -87, 116, -230, 268, -77, 42, -31, -9, -185, 127, 80, 299, -119, -98, -79, 43, -12, -53, -58, -21, 47, -353, -252, -278, 92, -213, 378, 178, -162, -25, -169, 74, 73, 154, -139, -182, 120, 463, -269, -156, 460, 11, -156, -379, -74, 122, 219, 189, -137, -161, -311, -41, 64, 104, -66]
2936f6K60k19R7j86J38L4K02J8l3o6k3j66j16K92r5K11k49j24J41J01o4k88L18
2959A17l32L3K28J64j22l46J55J30O5p2j75j97L19P5k83L08k20N9m6K79n4l80
2981b95M06j23o3j4O45q11J65Q2j55L13k46m1K85l63J85J60o22K24L96j79L24
3002B73k00r7j77K9K01PJ07j24Q0m8OJ78m12J2K86l66K42K23R5n31M41j70mj96
3026a45J21m5j63KN4J66Q1K22q54P22k78M8j89O01l34M8K96m8j82k45Q0L9K60
3049B57J80q4j78j60n6R%j07K40j8n8k56L34j39j45J84MM07m79L07m99R3K30k14
3073a48J82j39K33k29J44j94L00k33L06j65j00j81Q3J75n6N6q6J12J81j69J40
3094B12j09k88M29l46o5r6J35M23k68K8j26k70P4K08L48m55K10J7j34K15j60l64
$$ y = [-66, 194, -25, 72, -114, 24, 58, 260, 278, 245, 179, 156, -10, -126, 166, 71, 282, 33, -91, 50, 151, 87, -201, 117, -215, -182, 46, 210, 88, -258, -103, 27, 92, 20, -155, -352, -33, 42, -241, 67, -153, -94, -140, 139, 85, -295, 111, -12, -75, -89, 556, -255, -90, -8, -163, 150, -96, -137, 148, -215, -30, 130, -492, -268, 128, -51, 273, 73, -24, -201, -172, 29, 36, 143, 19, 99, 51, 57, 235, -177, -165, 121, -245, -3, 220, 315, -216, 225, 55, 51, -145, -24, -69, -232, -230, -176, -10, 71, 293, -561, 161, -117, -69, -258, 343, 9, 57, 353, 305, 123, -122, -42, -3, 257, 437, 353, 175, 15, -41, -32, -32, -139, 101, 83, 25, -231, 103, -36, -181, 3, 7, 414, -65, 242, -257, -164, 66, -148, 34, -105, 128, -101, 43, -151, 149, -84, 222, 57, -43, -224, -141, 34, -22, 34, -52, 60, 241, 72, 212, 103, -185, 244, -102, -167, -263, -128, 295, 27, 55, -71, -341, -267, -59, 289, -166, 44, 61, -73, 142, -18, -382]
3116c82M95p2J4pl43K84M0k28K0J49rJ78k22M9k1L12l9j0k33l06m6Q2L44j9l0
3141@J84k05J96k52n0J53j77R1j78K06P6k45J33L05k79j25L97l02K58L7m73K92
3163D2J42k19J9L13k05m74M01k03J54J28j01k69M15j61K49n09J1N62l44N5k3J12
3185I5l85L82j40k43O91l01j35K1K83m17q7K05J71k95K3j37J59J13k23O2K07j95
3207a46O76l61l65K91N8K35l37r9j48K14j10J96j42OK58l97K26L72j54k45j98
3228a70J94k6J61n20M05p7ML13l10j27K3J56j24K48o2l65L80m47L71J45l13L36
3250A95J81n52K29j90K21j82J45J72j21K1J67l81L9l6J90N9Q1k91L0J80j64N1
3272D4l7J8Ll9M1M1k06j3j00P2J17P9j71q6J9R8j55L57p7M6r5n0Pk63N58j64J59
$$ y = [-382, 113, 41, 55, 48, -295, -11, 29, -199, -179, -30, -39, 139, -83, -34, -55, 257, 218, 208, -25, -331, -377, -295, 49, 30, 0, 184, -21, 175, -77, -127, 26, -151, -60, -238, -32, 44, -201, -68, 237, -42, -167, 230, -72, 186, 223, -250, 42, 184, -35, -16, 297, 92, -382, 19, -184, -30, 98, -3, -272, 143, -18, 231, -278, -267, 295, -49, 6, -17, 95, -290, 92, -48, -291, 400, 99, -36, -15, 268, -149, -236, -31, 140, -155, -132, -269, -110, 3, -220, -158, 49, -146, 530, 169, -196, 95, 153, 388, 51, -48, -196, 18, -92, 104, -38, -32, 226, -171, 55, 427, 273, 28, -170, 24, -2, 159, -361, 44, -33, -29, 284, -26, -153, -130, 26, -98, 150, 88, -277, 103, -344, 27, 172, -141, 195, 376, -176, 53, -137, 84, -98, 47, 219, 98, 119, 286, -95, -56, -92, 98, 157, 238, -53, -23, 157, -7, 44, 7, 25, 28, -11, 30, 71, -135, -148, -248, -176, -59, 20, -151, -237, -218, -120, -275, 82, 5, 51, -44, -94, -87, -350, 208, 44, 203]
3299B03j25j54L39n23LK54m4k25M4N73o90N23ml12M01m79K25j46K9J49J41k4l62
3322b04j8M40l48J64J2j13j39M96k42J2j91jK33k19j74L37k5NJ32K78n02K51l77
3345a93K2L40J1j27r3k24L67j13j41J39J04j49k0J09p0j96L4K19K56km73M56m32
3368a76R9K55l05J96q8Q9p3J65j41l4k19J67Mq9K32J38l00L49j75P4R0r6j55J52
3392A59k08m4K04j71L58m07JJ27J81l00k6j82L65J72k44k37J00L88j75k38K05
3413B8J33l11M0J57L18m62J49J61l56J01R2K1p7O8P6m6J58Q7m49K59m21K80J78
3436A84j31J44k37R1j76j06J22K58n7R9l22j1J62J15r7l36L74k09J87l22L95k88
3458a61K08j29J73r2l00K98J62j75p8K16l47JJ27pj07K73m05K92K22k08j1K69
$$ y = [203, 78, -76, 263, -260, -257, -3, -47, -272, -228, 345, -345, 178, 174, -138, 263, -216, 9, -137, -108, 41, 182, 158, -204, -222, 218, -130, 34, 46, -67, -206, 290, 48, 60, -131, -132, 101, -118, -292, 45, 20, 25, 157, 435, -67, 184, -193, -171, 169, 180, 53, -40, -264, 103, -10, -151, -12, 92, -57, -77, 32, -38, -234, -200, 19, 275, 273, -200, 256, -176, -77, 178, -127, 69, -19, 70, -3, 162, 21, -13, -232, -65, -61, -150, 82, 220, -80, 269, 94, 168, 258, 162, 7, 159, -49, -93, 111, -60, 298, -109, -108, 19, 200, -100, -126, -308, 57, 229, -15, -252, -152, 236, 61, -177, 28, 161, -150, -110, 47, 365, -97, 52, 213, -143, -42, 50, 71, -6, 62, 138, 92, 250, 337, -112, 147, -274, 6, 184, 53, 197, -40, 51, -125, -231, -109, 149, 92, 191, -131, -142, 20, 135, 38, -298, 76, -133, 54, -268, 127, -161, 47, -82, 91, -1, -301, -3, 159, -16, -94, 122, -225, -224, -97, -104, -211, 62, -343, -51, 171, -37, -48, 221]
3480B21q1Rj55j80J60L7N6p1K60k29kJ24j01j58Q8R3J49k72K65l60M49l38J13
3503G7k63j20M14n9Q4j99J31P9j71o0L08l35Q3O8k22K95q7k25K99P9l31j6k22
3526c93N59m49Q1J5K67J47l90M67l59J99j76j92l8l9N03k59K28o31L79J83l7n4
3548A1J88N2k74K57k04p2Q2j45J45J12m34L73P7j78j46M5Q7J93m24K47M0m4n5
3571f7J33K79j74k02J72j11O5j01k61L54m61M33k36o1K02j10l7P29m94q9Km39
3593d74L75k85L55j37M42j97J17n44L82m00J27L11m40J13L60l57K52J36l12N15
3613C39k04k95K21pJ80n29L07L93j30j51j78M13p37N06q2j82m3J57J1k60K42R2
3635F3J39Kl55L15j52kl1k1K64j64K49p46M51J39k5l4j14J39l11m0n4L62m0j31
$$ y = [221, 140, 149, -6, -186, -26, 11, 67, -4, 256, 27, 25, 149, 48, -110, -22, 71, 220, -52, 213, -147, 302, -36, 77, -186, -306, 108, 49, 133, -66, 65, 144, -27, -87, 221, -114, -31, 37, -185, 110, 23, -202, 97, 176, -155, -171, -393, 166, -283, -202, -187, 80, 227, -163, 304, -55, 144, -32, -224, -262, -301, 202, -57, 171, -460, -81, 102, 65, 11, 199, 251, -23, 234, 30, -42, 40, -105, 40, 152, -282, 91, 168, -10, -156, -111, -24, 169, -255, -8, 32, -12, -67, 66, 345, 171, -31, 141, 30, 95, -6, -267, 87, -374, 59, -177, -238, -36, -146, -183, 546, 52, -37, -35, -474, -99, -384, -29, -166, 276, 79, 196, -348, 34, -366, -239, 72, -368, -255, 105, -252, 0, 136, -176, 339, 135, -160, 61, 54, 234, -295, 12, 405, 275, 124, -54, 359, -378, 128, 46, -136, -179, -22, -11, -271, -29, 63, 202, 204, -151, 164, 12, 10, -21, -42, 222, 58, 307, -439, 12, 151, 126, 92, -22, 117, -194, -234, -288, 74, 34, -97]
3659i7K05j11L33m35M02j43J19m82J20J44pj2rk90M62l93K70k09M63m78L1m5j77
3682c39K69j2J09k10M68m37L46j57j59K64j34K38n05J82L01k56n6R9j02N3J03
3703F5k40k78M30K77k45M0j07L21k83k51M31m7j00k0J44k00K87J15k24j02PJ13
3725A33rj31Q9j08o1M06o1k36K11k45L26k60J1j67K8l6Q1L69l51j91M10j82L6
3748F2K0k2J53O7l11P0N1N4k0j3J44j01j16k2j13J94O6j21k62L31k82l1j97K94
3772a05K83R8l25K45k47K41j61n0J60o7p8L9kJ62m2k54j02L00Q2K19m70J51k53
3795a76J24Q4j77J85L1O2k22Q4J68k78L07o8j19l6o5K02P1j88J18J97k64m97M97
3818D0L38n27J41J79j27j45R4j9J85j43L0L9N7J4O8l21pN8J36l25J86K97j75r1
$$ y = [-97, 108, -3, 330, -105, 297, 154, 273, -209, -89, 55, 48, 36, 27, -263, 199, -194, 76, -133, 330, -148, -117, -162, -339, -70, -82, 27, -183, 285, -152, 194, 37, -122, 142, 8, 246, -259, -77, 224, -32, -88, 11, -91, -38, 65, -175, -453, -23, 254, 9, 49, -58, 263, -20, -271, 160, 113, 13, -7, 137, -63, 224, 339, 115, 13, 20, 133, 124, -7, 82, -26, -87, 319, 258, 22, 233, -12, 314, 54, 65, -102, -74, -110, -29, 340, -11, -202, 208, 26, 62, 82, 60, 213, 280, -31, 39, 90, 144, 124, 111, 255, 154, 38, 16, -97, 97, 163, 42, -220, 111, -171, -202, -399, -105, 178, 276, -49, 196, -51, 190, 29, -21, 139, 72, -6, 33, 31, 193, 151, -103, -205, 95, 177, 396, -74, 77, -176, -52, 32, -145, 40, 71, 133, -89, -5, 163, -115, 192, 124, 5, -31, -96, 106, 177, -11, 107, 304, 40, -457, 40, 378, -149, -8, 171, 44, -101, -7, -26, 159, 16, 46, 85, 142, 156, 224, -97, -104, -46, 90, -235, -49, 248, 73, -18]
3842a8P9K6j2L9J01k15J26J09k96J89P6l8m2k16K09k39j13L93l12L68k85J36j20
3865e5qL58k64K79k26K17k1j74J26j65M5k0l20J35j12K23N2r5j13L19k82L1L22
3888B52m03oJ76J64l15L70k03k79K90J0n17N79j2j63J0J93l02L22o1l04J00oK77
3911A72m55L21j68p3j80L34L3K10l03j1j62L22r7M36k29J24J7n51K97l28j43N11
3933G7K6k09J85o3Pk70K72L0J01j41j67K93L2j17j41J88O8j05M0m94L44J44K84
3956C84k24j49o8j70L5M8K24L7j69l30P08l52M8r3K58j37J21l69K63L52k81MM1
3979A81M3j40j08j99L66j16k51l8M90k06r1j38K29M41k93m79L41j7R9m9J46j68
4001D3q5K48l9k05J88k58O3l8m1K32J80n41L55k07Q1J9K15q8j58j70J83L8k30
$$ y = [-18, 61, 87, 75, 114, 215, 0, 126, 235, -61, 128, 204, 166, 124, -92, 117, -122, -235, 158, -154, 214, -71, 65, -55, -63, 295, 31, 310, 84, 301, 280, 106, 232, 67, 112, 92, -228, -93, -205, 18, 70, -25, -138, 181, -101, -70, 252, -151, -157, 19, 183, -132, 238, 35, -244, 46, 56, -461, 118, 106, -57, -47, 146, -156, 166, 105, -199, -99, -105, 172, -283, 38, -130, -203, -383, -49, -16, 194, -109, -120, -282, 40, -57, 379, 150, 274, 291, -260, 37, -291, -434, 77, 103, -106, 79, 16, 23, -247, 25, 55, 156, 15, -152, 141, 173, 56, -85, 103, 171, 66, 106, -388, -44, 100, 384, 160, 11, -57, -227, -192, -144, 80, 117, -52, -382, 326, -26, 22, -71, 187, 50, 171, -198, 65, 417, 136, 140, 181, 224, 84, -24, -223, 143, 27, -224, -262, 228, 22, -69, -207, 22, 463, 170, -309, 32, 15, 114, 65, 211, 43, -42, 206, 167, -38, 150, -108, -45, -83, -124, 108, 288, -253, 102, -105, -24, -5, 210, 122, -36, -206, -23, 15, -215]
4024b15L65j96J30j26J27r9j58K5p2K73j18LJ74l8o1L53m86K36k65J37j34J25
4046b0L3k1Oj94L32K0n0J1J44j53m8k1k44L30J74j0k77m0J07q6j68K61k08K67
4070A45j78n04N22L69j80k43J09O1L5k31j1K66q0l78J36K48Q6J58l18l82K20L15
4092A65m97J31l7L35j53l17K85Mr3O1R6j4L6K27k32J76P7k81L8j95J55J79J37
4115B83k03k94n6R0k22M14J85l27J44ok80L19Q3n47K23Q1o8M7J65q0j45L76n9
4138A23j4k41J59m1KO5l4l31J72K14l4m6l05L22O5k5l05M95j08k12L7K76p5l36
4162a77K30J10J37n77L98j40j42R1n2j02M98l81K8J5k18L99k15J8J55l8k43O10
4184D04k49j88k01J00J59ok13K22P8j57K19k6k78k94J76K36P2J77j15K17l31P
$$ y = [-215, 150, -46, 84, -42, 85, -14, -172, -147, -219, 54, -64, -61, 113, 75, 14, 367, -119, 117, -148, -11, -145, -20, 13, -8, -2, -196, 136, 156, 106, 117, 261, 108, 60, 39, -205, 125, 299, 289, 12, -28, 79, -7, -175, 86, -122, 145, -33, -537, -15, 354, 174, -69, 40, 101, 136, -95, -106, 160, 80, -298, -162, 86, 172, 330, 12, -370, -150, 165, -332, -201, -238, 97, -56, -373, -88, -84, -177, -116, -20, -34, 2, 229, -3, 173, 250, -31, 7, -188, -33, 146, 283, 80, -214, -270, -180, -402, 12, 197, -130, 14, 8, -272, 47, 130, -417, -194, -113, -181, -134, 31, -49, -194, 182, 123, 109, -132, 27, -14, -12, 53, 19, -312, -140, 74, 40, -6, -311, 11, 76, 51, -254, 241, 133, -79, -42, 234, 159, -177, 53, 163, 300, -277, 121, -19, -161, -70, -122, -224, 274, -107, -79, -64, -282, 117, -98, -80, 75, 37, -206, 404, 155, -33, -234, -134, 25, 19, -194, 28, 106, -51, 168, 142, -136, -430, -254, -18, 54, 231, 116, 333, 2, 9]
4206Ij57j4K2K24R1j69k48L25J9j99L72m10n8K50J49m10J76J6r4m4K4j99K60J02
4230C7j26j07J37K15j23j80K37k03M60j92j47j83J16J10R1k29n8L01m25j00M85
4251A16k13j19M00m2j74K05n7Kr3J16p6r4R6j36p7K92k3n55O83l63L26n73J66
4274a93L39j02R6k81n9K87j85J1J28r8L65k13k1k70L72j65M87n69L43l41k8Q6
4296a1J76q0n2M0q0K56k21m8K1J67j78J48o27L87K32l80K88J70l55P4j09J55j3
4319d0K29l14J21O3J09j33j82J33J56J61j77l91K65r5J52j02L93m92O6J62M0j03
4341B1L3R0N9J20l02q4N9O6k00j60K01J70j84k9J65j79J36J40r6M4m0k49K28j42
4365a33K98j21Q0k02J37jQ0k73j42K64j41K82M1l17K69j75P6j31L31k95J7pL0
$$ y = [9, -148, -162, -140, 84, 175, 6, -242, 83, 102, -97, 275, -135, -193, 57, 206, -204, -28, -12, -106, -150, -126, -325, -65, 37, -89, -196, -59, 156, 33, -147, 90, -113, 347, 155, 8, -175, -59, 51, 142, -87, -145, 156, -269, -369, 116, -97, -216, 184, 142, -32, 173, 116, 118, 25, 141, 65, -29, 67, -69, -146, 146, 123, -432, 251, -112, 214, -359, -193, 146, 44, 140, -141, -200, 87, -98, -87, 41, -57, 308, 95, 74, -196, 176, 11, 498, -71, 272, -69, -97, -11, 165, 85, 33, 73, -7, 249, 28, -20, 1, 168, -10, 138, -489, -102, 130, -250, 38, 208, -147, -73, -182, -27, -40, 189, -125, -4, 59, 168, 35, -147, -14, 142, 303, 126, -265, 0, -95, 57, -45, 348, -144, -78, 84, 124, 21, 54, 144, 203, 323, 21, -63, -4, 62, -138, -298, -97, 73, -111, -140, 25, -154, -18, 122, 26, 70, 30, -219, 9, -133, 165, 44, 124, -78, 59, 58, 138, -135, -277, -13, -154, 128, 169, -148, 121, -54, 22, -109, 222, -73, -56, -63, -33]
4388c3L43l26k70J24J01j22q5K66r9J95J14j30J02N2k34K16l60p1K31j54K81m6
4410I5k12Q4J36M7l32J89j99o0L41J6jj11J46L6j2p0K01k20j12K6n8J08J47k04
4434a9j25K55m0j47q5L16jl80L72q1K1j40J29qJ45l49K43p4k54L41j28J71k54
4457i2k36M72j56n8l1l78M44l8rNr2M8n0K78j19j1l5j79L54l10K31O3O1l00K05
4482F7j58M5j21L26%Q7l84QJ39M8KJ8P7j40J94k84J33k41L3j5L95l09k46K87N5
4507A6J54j28q2NK67l04R7l52L81K06k30r7J11l2m3k26J76J60l06K15K66n24L98
4530A28J82m73J88m59M30j47m4L8K40j87L73j93j72o%k26N25J35j78L6l41L58
4552B07k63J25p0J61j53J9m1J37q8j08K63j70m2MJ26rk17R2K56k08J09k58J34
$$ y = [-33, 310, -16, -286, -162, -61, -183, -268, -2, -101, 94, 208, 78, 180, 232, -2, 214, -146, -217, 14, -140, 141, 95, -117, -33, 103, 150, -182, 7, -192, -252, 89, 105, 104, -7, 139, 175, 163, 93, 294, 74, -38, -12, -70, 38, 185, -19, -144, 111, 71, -76, -161, 155, 154, -226, 146, 65, 86, -54, 75, 67, 212, -137, 106, 32, -222, 119, -9, 162, -92, -328, 144, -12, -70, -101, -479, -35, -73, -82, -77, -169, -121, -171, 107, -12, -23, -58, -237, 117, -193, 38, 101, 162, -138, 67, -91, -46, -167, 159, 159, 246, -138, -130, 9, 57, 59, 77, 154, 14, 208, -76, 57, -184, -151, -166, 229, -80, -326, -39, 16, 170, 42, -40, -35, 232, -72, 25, -327, 54, 260, 30, -67, 44, 12, -31, -257, -81, 79, -227, -12, 254, -270, 128, 310, -163, 25, -434, -4, -151, -195, -157, 83, -104, 269, 76, -96, -102, -102, -328, 197, 332, 154, 190, -151, 207, -56, 69, -1, 160, 7, 26, -15, 122, 34, -74, 189, 19, -23, -19, 107, 98, -119, -27, 229, 21, 130, -128, 6]
4575FR2j12K14K14m69J49k71J32J23l03K77J31j47l00L66k7O4r9N8j45L32l60
4597g5N06l44k16J91q4l7J1o4J4pJ3J92L0J02k25j32J12J50m34N29k56R2k54K23
4621C7r0O9J23j22L32k94j77L46j67P0qp8j81K03Pj42J64m39J22l12O58r4M2l31
4645b62O12l69K06l50J01L0J51k63J60L35l43J29q7Q0r4j67J19N1j13p4o6K04
4667a0L0K37l75L75j94K14m78L35j94N0Q5K5K69m47J5J29k2j3j16K43j84J2l9
4690e3K12M8j59J69k30J10j06Mp3K37L2K86l78j64J72Qj14L6q0j68L44J06l37
4713i8J03L3K68l67j7J68r1jj32N1L9M0Qj55K64J69R9j67n44J88p7N58l15J50
4737A74j63p5j92K08N4j9M6L5J47k10L5k13j27M68k72R4q5J54mN8om33J61K07
$$ y = [6, 98, -14, 200, 414, -55, 94, -177, -45, 78, -225, 52, 183, 36, -264, 102, 75, 139, 40, 98, -47, 285, -75, 431, 87, -129, 62, -22, -59, -48, -112, -98, -105, -92, 100, 130, 232, 7, -125, -13, 137, -297, 232, -24, 68, -186, 37, -53, 16, 139, 17, 349, 55, -122, 224, 57, 127, 119, 41, -140, 63, 70, -72, 92, -347, -225, -537, 121, 27, 69, -262, 350, -19, 187, -163, -62, -32, 119, -144, 16, 351, 8, 137, 50, 130, 36, -131, -12, 39, -74, -148, -214, -10, 20, 257, -118, 257, 63, 277, -201, 134, -60, -10, 75, 100, 369, -78, -63, 66, 44, 31, -85, 158, -26, -14, -53, 159, 207, 48, 217, -13, 97, -9, -5, -78, 159, 191, 477, 99, -65, 107, 115, 1, 37, -43, -211, 133, 239, -98, 5, 38, 306, -61, -78, 90, -1, -2, -134, -83, -44, -4, 4, -151, 113, 282, 381, 214, -330, -142, -219, 339, 24, 174, 11, -64, -256, -48, 6, -13, 33, 68, 215, 5, 40, -173, -300, 168, -104, -10, -95, 59, 55, 113, 107, -326, -165, 42]
4761D2M1l5j06q6O0J66Q8r1j63J67k28L20l23N5k53J32M65q33M72J05o5j80L63
4784A13l39o1N89m31k23J91L35j05j5K6K4j31q7J37j77j68K65k02J60K68p5k46
4806a52L3N6o2N02m2o7l11J0k37J16J56j20K01k50K58K83k75j43l9L9J92j18k1
4829IL10m59L15j86oj88K77l73J65Q0r5K53Q6n09J4L18l5j10M7K56k89j76K85
4852a1J60m7j24MJ06j45K0j84L87j32j4J61J06k94M60p8l65J7m57L40m7n4M02
4875B11k97O0M1l7k06K05k08L98m31Kk3k14M36p6L14j10k5l67N05M5k84KK22k37
4899g4L96n58L53p7m0j79K77N8m91K99N8o4J48k82R9M3k6n9K34J6j44O7j26k05
4923b77K24q8J9J14K46j89L8K78m90J41NJ60R3l96J79p5L9j5m0j89J12J8K28j2
$$ y = [42, 83, 48, -58, -144, -84, 82, 170, 79, -84, 83, -145, 175, -148, -93, -346, -214, 251, -582, -110, -5, -70, -250, 113, -226, -287, 302, -129, -352, -161, 174, 69, 54, 80, 104, -27, -114, 23, -154, -322, -57, -259, -99, 169, 94, -152, -119, -63, -125, 377, 335, 268, -43, -33, -270, -154, 2, -118, 83, -167, 91, 374, 99, -44, -83, -44, 148, 30, 9, 319, -140, 175, -11, -17, -205, 72, -301, -136, -56, -151, 102, 188, -321, -307, 11, -24, -134, -87, 169, -120, -296, -11, 149, 102, -22, -18, 88, -57, -37, -221, 166, 34, 20, 181, 287, -7, 453, 375, 10, 27, -430, -90, -137, -191, 211, -86, -26, 15, -22, -228, -23, -231, 167, -264, -262, -285, -499, -63, -139, 175, 65, 40, -327, 178, 223, -61, -59, 163, -74, 322, -236, 117, 40, 0, -179, 98, 156, -335, -36, 22, -42, 106, -176, -77, -34, -60, -119, 115, 131, -13, 54, -72, -277, -53, -141, -122, -8, 238, 49, 87, 365, -125, 16, 21, 181, 274, -122, 57, -18, 21, 6, -34, -223, -111, -93, 135, 123]
4947A23k33M87j98k22L50m83J23j97R3K85j5k12J67K41l01j24j0K90j98J8K46
4968B30k12K80k66k95K81O0n3J39k21J79n3j27J48j23j73M89Ok48j2k95M28K1
4990A83j28l38M44m04N8J9O4j09M74j17k32L47k84o3K15j41L98r4l88K2L40J63
5012D29m27o4o5P1K13k18J53j46Q6j22J08J31L8j26q2K7q5J71j22l4Q4m56M61
5035B5r3J88m7k60M42j6k56Q2K6J1k4P1K30m05J63j59m57K2M71l31J60K93QO4
5059B08k14L72k28Q4l85J59J73k47K63k54k9K43k51k0R3l1J18j46J82k48L4K64
5081A40L5j01P4n0l59J7M1L49k01r1L98N4l32k00K46n8M20l74K6j37Q4j29o2J32
5105g8K2K8qK1j30K04l09J87J29k95Oj5L74m66L08K9J08j82J55l41L21j97K67
$$ y = [123, -110, 377, 179, -43, 307, -176, -53, -250, -157, 128, 113, -99, 68, 309, 8, -116, -126, 164, -34, -16, 230, 18, 298, 32, -263, 18, 78, 25, 164, -57, 122, 69, -58, 90, -33, -206, 283, 289, 41, 29, -266, 162, 183, 55, -283, 161, -243, -185, -166, -102, -211, 263, 146, -86, 261, -23, -86, 129, -12, 386, 292, -96, -74, 266, 429, 2, -62, -127, -56, 157, -61, 92, -54, 32, -90, 18, 149, 187, 61, -21, 6, -79, 92, -30, -64, 20, -436, 25, -68, 120, 73, -187, 255, 239, -17, 65, 91, 102, 78, 149, 379, -26, 137, -22, -479, -457, 14, -317, -157, 136, 144, 208, -6, 366, 138, 222, -163, -4, 169, -78, 185, -69, -98, 145, -106, -126, -33, -64, 54, -92, 90, -158, -124, 140, 175, 74, 148, 98, -261, -244, -203, 146, -55, -146, 252, 306, -26, -226, 20, -38, 382, 8, 34, -103, -19, -148, -210, -78, -56, -28, -36, -15, -145, 59, -250, -63, 66, -229, -223, -238, 136, -330, -22, 7, 115, -67, 88, -253, 68, -129, 138]
5128A38j42N0L7j56N2Q6J02j69r6j04O9J97R2O3k81J0J72j86j68M05l76M18l20
5151a07j26K95k29J0n4K23J31j55K76m79K97K5k33m9J58J70J20k70j50M5K26n42
5173d18K56J59j76N49o7j17l26j2J47K66l83L05m5k92J66k9J65k61M04k76J8l25
5195b92K1K93l7J90m43K49K9q5J18K08k22K6j37J89k98K55k70K36L03p32J78J4
5217b07K19k47M02j24k13q1L82j89k96K31l30K48K14n3p4Q3m8Q6j5r2R9lr4Q1
5241b1l8R5k27J20k74L25j55K40J7j79J96p4J03l31M92j07l49J37p5J06L0K02
5263B33j74j76J96P3j81K24r7R2J14j43j69p9j39L36j20k75l2L69k43K11l12K94
5285Bj67J99lk08L15k87K06q0r1n4k8O8L1O3k95M09r7r7K14k71K54l0K09l78J56
$$ y = [138, -4, 46, 83, -73, -21, 65, 167, -2, -98, -202, -133, 64, 156, 219, -62, -52, 120, -66, -234, 171, -205, 213, -107, -233, 62, -167, -157, -211, 12, 143, -12, 264, -215, 82, 107, -126, -175, -17, 153, 273, 3, -147, -102, 124, -418, -162, -3, -179, 370, 303, 186, -140, -152, -5, 261, -122, 183, 138, -154, 12, -17, 148, -113, 291, 15, 33, -292, -271, 22, -15, 175, -268, -19, 10, -75, 43, 251, 29, 55, -82, 107, -191, 64, -206, 30, 333, -399, -221, -207, 12, -235, 167, 43, -170, -251, 131, -58, -354, -123, -453, -205, 9, -44, -118, -35, -83, 3, -12, -104, -5, -8, -102, -21, -59, 36, -191, -71, -345, -20, -175, 65, 82, -97, 99, 25, 128, -203, 289, 182, -167, -30, -105, 1, 31, 233, 59, -117, 79, 152, -29, 195, 98, 190, 304, 161, -8, -87, -226, 110, -10, -285, -317, 52, -191, 20, -292, 2, -165, 34, 31, -177, 138, -149, 57, -23, -114, -168, -196, -128, -97, -34, -329, 80, -17, -114, 100, -171, 83, 53, 262, -116, 40]
5310D0J51r1k41L36k67J10J84Rq5j93k9j80J59K2R1K58l8k77L32n18K26j09k05
5333c15K16j88K50j63P4K30o8k96L84K26l00J28q3q1J32j87k36K61L00m73J2J29
5355d8K9m3R4p2K10j34j02K72m68M63l77j6J96J30m07J39P1l8q3L30j28k5K63
5378B56l94k80L13j1q4K11J75l51j79N44j41k16K11k72K66r9p6M65j17j17j27
5399b3r6k05L95l45M63j10n26K48J18P2R9N3m64M24j52M5M72p22L65j9k59K3J86
5422D2P2Q5j96L85m16J73l52J47Q4k20k0P2k65L55K81j23n7M60l71l94N45l50
5444f3K9N8J53P8j68J4j32j76J37o5Rj87M69j23J36k37J55M7j78M4j33K72k12
5467g3J49l51R1J91J70Q2j93j08J48Q3q3k29k05M63j59R5M2k10J64k79K89j45
$$ y = [40, 191, 100, -141, 195, -72, 38, 222, 231, 146, -47, -76, -256, -97, -75, 16, 274, 236, -41, 291, -227, -1, -110, -315, -99, -287, -37, -200, -126, 104, 36, -260, 124, 350, 50, 178, 95, 14, 146, -41, -277, -16, 284, -189, -177, -48, -19, -62, 32, -40, 170, 36, -66, 206, -262, 201, -176, -192, 4, 134, -273, -134, -63, -101, -184, 146, 18, -7, 256, -138, -418, -105, -116, -200, 11, 186, -165, -344, 200, 59, -157, 54, -218, 48, -51, -127, 338, 221, 104, -23, -119, -324, 71, -274, 189, 79, -447, -199, -81, -9, 90, 143, -321, 103, -49, -4, 468, -254, 111, 92, -167, -144, 42, 114, 199, 3, 388, -28, 145, -207, -60, 24, -196, -216, -144, -409, -54, 227, 104, 47, 507, 136, -258, 287, -63, -34, 24, 177, 255, 87, 101, -31, -207, -70, -135, -126, -313, 156, 33, 169, -68, 87, 134, -44, 0, -133, 139, -73, 76, -275, -184, 7, 177, 259, 66, -42, 106, 189, 106, -123, -328, 135, -24, 71, 113, -97, 67, -212, 77, -68]
5489f8R7j15O2pl14K70p6R6j24K83m1K3j72J27P6m1k13lM33l79KL40l0k55J48
5514A19m23M72j28O2j68L45n43n4O63m38k89N54q9j18J73m3o3r9K34j05l0k11
5536a79L98k77K10j06K62j73l35l5J71j30K68k88L6L42l0j33k54J32K17P4J42
5557C12k97j81J79K26m5m09L97j03N4nk92L15k41K9L2M2p3m7J41j94K62k37r4
5580b29L62k45L2M4J13j64K7oj42L42j25M2r1J57q7K7j00q5J12k11K90l55K90
5603bK31l94k2K51k48K36j64K12p7l3J08j43K28k52M96n45R3q7O7O2Q5j43j67
5626b08R5J03J7L69k38k0j31m4j72J69P2j04K06K07r0m3l71K77R5k79R4L53l04
5649E3n6N0j89o7K67m39M23J59k62r9J15K77rm51N23k56K8jk41P0OL41l16J59
$$ y = [-68, 29, -86, -24, -31, -345, -75, -151, -55, -179, 104, 63, 86, -86, 41, 117, 76, -137, -140, 293, -86, -84, 256, 226, -29, 119, -304, 168, 40, 102, -66, 279, -264, -318, 345, -93, -382, 172, 83, -35, 138, 95, 32, -67, 167, 62, 32, -179, 219, -58, 152, 46, 308, 135, -200, -235, -64, -194, 74, -214, -178, 164, 134, 1, -253, -121, 96, 170, 312, 15, -166, 13, 239, 194, -215, 182, 79, 133, 128, -164, 151, -90, -61, -29, 13, -60, -107, 34, -160, 102, -135, -229, 133, -112, -80, -36, 77, -87, -60, -66, -208, 134, 9, 51, -40, 117, 30, 57, -43, -128, -16, -227, 63, -292, -2, 229, -165, -187, 64, -184, 52, -112, 100, 23, -10, 98, -45, 183, -69, 427, -118, -25, -112, -45, 17, 102, -41, -208, -113, -10, 7, 376, 138, 118, -13, -57, -229, -60, 12, -92, 114, 321, 231, 188, -183, 94, 189, -90, 4, 357, 53, -3, 47, -142, -209, 58, -381, 42, 201, -61, -160, -45, 232, 223, -228, 295, 39, 67, 66, -175, -105, -99, 242, -74, 85]
5673H5k41L72l28L8J26J56k32M31m07p5J2k04J79p2K84n21L43o1j20N17L6k94
5695B4j31J90n9n9N4J3O0j2L86n29R8M7j03k46K75p4J85j52j11k8j19M11J64n13
5719b29O51l65k12P3K97k74j28J95k44K41p9R3N1J16m25M1L75m08L58K2k43l0
5741a24L58l0l42K47m38M29m4Q2k13j99K6P29q09L01k7L91m24L01j32k96L02l06
5763b18K17K39j62l34LM79j93N4j67K28K6l40K03j08j05j42J04j43M47k65R6M1
5785d0K43mk48%J15M8p2j14J30o7K89l57N14m49J08j96K4K34j10l92K94j61J1
5808b00l9K21K69k29L4j50J34k1j5L13m57L25m7k53mR5L18Mj60n2j4k84R0k7j9
5833a68J12ln8L23j97j76K3R6j15K66j3l46K30o2K03j67k69K65J26j30L9J51j73
$$ y = [85, -156, 216, -112, -74, 52, 208, -24, 407, 0, -75, -63, -267, -88, -160, 124, -397, -54, -115, -235, 282, 318, 24, -107, 83, 24, -35, 19, 32, 92, 80, 466, -63, 35, 82, -21, -267, 8, -66, 119, -33, -144, -172, -291, 120, 284, -229, 422, 57, -155, -82, 215, -59, -187, 8, -236, 5, -74, 19, 70, 186, -239, -198, 177, -231, 127, 149, -94, -124, 234, 204, -138, 109, -329, 100, 56, 138, -75, -274, -248, 481, -328, -27, -54, 337, -87, 214, 82, -214, 88, -218, -1, 238, 76, -258, -255, 224, 31, 85, -82, 146, 172, -168, 35, -73, -178, -320, -216, -359, 88, -177, -81, -40, 203, 199, -49, -49, 66, 114, 42, -72, 58, -9, 280, -77, 437, -12, 96, -100, -76, 158, 48, -344, -50, -211, -200, -239, -18, 251, 22, 56, -94, 40, 19, 4, 317, -140, 185, 138, -115, -119, -24, 294, 298, 138, 86, 72, -212, -122, -149, -168, -56, -59, -117, 206, 9, -167, -144, -48, -163, 103, 90, -256, -26, -88, 115, -52, -321, -56, 70, -60, -21, 130, -43]
5856d3R5j70K72q8M1n2j75K85k04Q4k89K83K2p8P1K54j71j47K37Kl8j45q6q5K11
5881H6l86K47l8L24m83N69k77l22M18k90K20K18k52K6k39N22j3m80l7L16k76M43
5903B96k65K43m40%J14j25L38l74J80l56L72O1K15n36J83k42M05j96J3j91K49
5924e6l55O53m30L27r5j04j16P4R4j54J43m1N1j19l49K22q2J07K06K88n37M07
5946A34J75q9j52R3L00n07K98k0m67O04k15q0M1L3j10n1L23j77r0O7k96K13l4
5969gJ06r9P3l7Q5j49q5J34j34lJ2K42m1J3l64L59j18j06J24j59P4L66m80j96
5993c90L77J1R2J62l58K61k73R8j66K51k8K19k24q7R4O2O2l32R6j41J74J00l98
6016c38M20m91L74P2J03j64j32mn9K67P2m1j00M87m13kk6J81m13l7j4J76R8k88
$$ y = [-43, 52, -118, 154, 66, 107, 55, -120, 165, -39, 45, -244, 39, 61, -17, 54, 308, 137, -10, 227, 229, 191, 46, -40, -125, 86, -300, -53, -91, 233, -250, 319, 42, -280, 138, -152, 68, 286, 34, 60, -179, 343, 330, -150, -187, 129, -147, 296, 31, 274, -166, -166, -52, -177, 161, -213, -33, -389, -17, 44, 259, -277, -94, -336, 69, -127, -114, -305, -56, -411, 242, -188, 139, 44, -60, -176, -102, -8, -162, -19, -60, -9, -128, -477, -255, -337, -230, -24, 264, -273, 134, 309, 220, 68, 161, 461, -46, 252, 232, -235, 369, 154, 74, 115, 148, 38, -13, 310, 133, 43, 110, -186, 27, -7, 99, 0, 73, 36, 121, -28, -113, 21, -113, -116, -104, 138, 97, 110, -254, 105, -13, -119, 5, -154, -80, 286, -194, -390, -13, -2, 90, 252, -106, 155, -118, -20, -186, 65, 37, 256, 32, -55, 39, 101, 163, -169, -73, -214, -40, 60, -338, 82, -409, -35, 37, 140, -24, -156, -160, -219, 48, 120, 79, -21, 466, 53, 51, 25, 206, -207, -244, -258, -82, 16, -272]
6040b72L32O6M1j23J70r7k90J38r4J74J08J01k12K5j37m1J07j69M01k16j80M23
6062B55O6k58J36k41o4j57K33j81K77l96K82J40J44l8k20M09k23q5L9k02N65o89
6084b08K0M13l07m8K44J08n8K0K4j45r0K0M5K2l35N22l39J07J65j07q4j69J48
6107c2J8K49k43K24o0l39M08m36N63m79K48p5m3J30j9l31j07P88l29l68o1M3M46
6130A95o4j10J76M9k85q6P0K68j57k1j26K77j88K24l51J59J8J15p5m7Rj5K0k63
6154b08K7K78j75k29L89oj17j12J00O4j10J82j05l8j01L77q7k94L95o18P34k69
6176G7J14l41J49Ll65M15j09K58j23j02k8j85J45k28L69m24K43J92l38J39K09
6197G0O2j89L72k11k62N90m78l19L00k30L33K07j25j07j79O9R5r5j25K02k37L1
$$ y = [-272, 60, 126, 167, 44, 214, 117, -173, -35, -129, 45, 153, 254, 42, 67, -70, -111, -4, -173, 228, 12, -168, 255, 321, 63, 199, -42, -106, -263, -30, -211, 66, -330, -48, 92, 236, 198, -22, 387, 164, 79, 118, -84, 481, -208, -188, 225, -82, -130, 114, 222, 164, 184, 208, 63, -27, -7, 38, 60, -275, 247, -92, 15, 180, 73, -11, -180, -32, -14, 235, -8, 216, 156, -183, 225, -211, 352, -127, 121, 46, 3, 133, 114, -217, -324, 464, 135, -233, -294, -251, 195, 131, 21, 197, 246, -39, -125, -55, 213, 56, 35, -91, 186, -2, 222, -129, 30, 48, 163, 88, 41, 50, 35, 55, -208, -181, 97, -78, -307, 82, 76, -41, -153, -53, 11, -99, 83, -22, -60, -161, 216, 129, -165, 230, -388, 346, 77, 191, -150, -1, 2, -363, 52, -57, 201, 78, -24, -52, -237, -92, -320, 49, -375, -132, 60, -278, -139, 70, 132, -57, 315, 104, -158, 432, -46, -365, -65, -295, 38, 245, 120, 13, -166, -97, -2, -97, -222, -20, -257, -226]
6219b26M9K50j93J21J66q9k03J02M2j45K26l01K31l94M73j77K6J4K1K20j42k39
6241a68J67O7q4J82j84m0J40m2l3p2K41k24J13j69j9L43Om83K97q3JJ27o8j81
6265a66j08J16QK4J07r2P9k22J45J47P7p1R9k37J14k4J34j92j79R5J28k94J64
6288a48J44j28r5M86q7L8K94n27r2K42j56j65J94j38K62k33p6K85K5j24K2k05
6310a82L32K2N9j94p9K87l60j03J41k65O19j38k50J76l31J18r5N12m02j97Q63
6331E33n41K88n52K18K52l80M86r0K53n63P2K85j40j19j92J75l05N40k50Qj95
$$ y = [-226, -177, 73, -120, 1, 167, 78, -125, -23, 19, -126, 100, -201, 30, -364, 109, -68, -42, -28, -7, 213, 71, -168, -1, 66, -18, 164, -20, -60, 80, 38, 5, -67, 174, -50, 63, -106, -125, 218, 224, -259, 38, -45, -44, 83, 15, -166, -274, -158, -150, -126, -19, -111, -32, -254, -109, 38, 115, 44, 143, -94, 20, -4, 130, -62, -241, -146, -18, -312, -148, -4, -132, -227, 259, 172, 210, 504, -23, -115, 127, -29, -194, 0, -138, 124, -109, -185, 100, 125, 1, 23, -182, 150, 172, 231, 37, -42, 245, -115, -218, -77, -342, 277, 139, -111, 65, -266, -148, -243, 269, -133, -330, 533, -8, 280, -272, -54, 198, -182, 304, 214, 467, -96, -24, 261, 121, 2, -190, -15, -320, 220, -30, -22, -217]
$$ [...]
8191B5
##END NTUPLES=NMR FID
##END=
