##TITLE=1H_DE-79K2TFA2
 CDCl3
 8 sc, 
 29.11.2024
##JCAMPDX= 6.0         $$ Bruker NMR JCAMP-DX V2.0
##DATA TYPE= NMR FID
##DATA CLASS= NTUPLES
##ORIGIN= UXNMR, Bruker Analytische Messtechnik GmbH
##OWNER= root
$$ XWIN-NMR		Version 3.5
$$ Fri Nov 29 15:39:30 2024 Russian Standard Time (UT+4h)  she@DPX200
##.OBSERVE FREQUENCY= 200.1315
##.OBSERVE NUCLEUS= ^1H
##.DELAY= (6, 6)
##.ACQUISITION MODE= SIMULTANEOUS
##.ACQUISITION SCHEME= undefined
##.AVERAGES= 8
##.DIGITISER RES= 18
##SPECTROMETER/DATA SYSTEM= spect
##.PULSE SEQUENCE= zg30
##.SOLVENT NAME= CD3CN
##.SHIFT REFERENCE= (INTERNAL, CD3CN, 0, 15.7039)
##AUDIT TRAIL= $$ (NUMBER, WHEN, WHO, WHERE, WHAT)
$$ ##TITLE= Audit trail, XWIN-NMR		Version 3.5
$$ ##JCAMPDX= 5.01
$$ ##ORIGIN= Bruker BioSpin GmbH
$$ ##OWNER= she
$$ F:/spectra/data/she/nmr/H-F/1/audita.txt
$$ ##AUDIT TRAIL=  $$ (NUMBER, WHEN, WHO, WHERE, WHAT)
(   1,<2024-11-29 15:38:18.18 +0400>,<she>,<DPX200>,
      <created by zg, POWCHK disabled, PULCHK disabled
       configuration hash MD5:
       00 E9 B6 7A A2 85 ED C7 34 08 36 98 17 FE 4E 26
       data hash MD5: 16K
       7E 86 BE B7 DB CD 25 4D 33 BD 90 B0 B6 38 C6 4D>)
$$ ##END=
$$ 
$$ hash MD5
$$ 61 C3 0D 84 3A 6F 74 79 44 78 E9 6E 25 79 EA 75
##$RELAX= 
##$RELAX= 
##$RELAX= 
##$RELAX= 
##$RELAX= 
##$RELAX= 
$$ Bruker specific parameters
$$ --------------------------
##$DU= <F:/spectra>
##$EXPNO= 1
##$NAME= <H-F>
##$PROCNO= 1
##$TYPE= <nmr>
##$USER= <she>
##$AMP= (0..31)
100 100 100 100 100 100 100 100 100 100 100 100 100 100 100 100 100 100 
100 100 100 100 100 100 100 100 100 100 100 100 100 100 
##$AQSEQ= 0
##$AQ_mod= 1
##$AUNM= <au_zg>
##$AUTOPOS= <>
##$BF1= 200.13
##$BF2= 200.13
##$BF3= 200.13
##$BF4= 200.13
##$BF5= 200.13
##$BF6= 200.13
##$BF7= 200.13
##$BF8= 200.13
##$BYTORDA= 1
##$CFDGTYP= 0
##$CFRGTYP= 5
##$CHEMSTR= <none>
##$CNST= (0..31)
1 1 145 1 1 1 1 1 1 1 1 1 1 1 1 1 1 1 1 1 1 1 1 1 1 1 1 1 1 1 1 1 
##$CPDPRG= <>
##$CPDPRG1= <>
##$CPDPRG2= <>
##$CPDPRG3= <>
##$CPDPRG4= <mlev>
##$CPDPRG5= <mlev>
##$CPDPRG6= <mlev>
##$CPDPRG7= <mlev>
##$CPDPRG8= <mlev>
##$CPDPRGB= <>
##$CPDPRGT= <>
##$D= (0..31)
0 1.2 0 0 0 0 0 0 0 0.06 0 0.03 0 0 0 0 0.0002 0 0 0 0 0 0 0 0 0 0 0 0 
0 0 0 
##$DATE= 1732880297
##$DBL= (0..7)
120 120 120 120 120 120 120 120 
##$DBP= (0..7)
150 150 150 150 150 150 150 150 
##$DBP07= 0
##$DBPNAM0= <>
##$DBPNAM1= <>
##$DBPNAM2= <>
##$DBPNAM3= <>
##$DBPNAM4= <>
##$DBPNAM5= <>
##$DBPNAM6= <>
##$DBPNAM7= <>
##$DBPOAL= (0..7)
0.5 0.5 0.5 0.5 0.5 0.5 0.5 0.5 
##$DBPOFFS= (0..7)
0 0 0 0 0 0 0 0 
##$DE= 6
##$DECBNUC= <off>
##$DECIM= 24
##$DECNUC= <off>
##$DECSTAT= 4
##$DIGMOD= 1
##$DIGTYP= 9
##$DL= (0..7)
0 120 120 120 120 120 120 120 
##$DP= (0..7)
150 150 150 150 150 150 150 150 
##$DP07= 0
##$DPNAME0= <>
##$DPNAME1= <>
##$DPNAME2= <>
##$DPNAME3= <>
##$DPNAME4= <>
##$DPNAME5= <>
##$DPNAME6= <>
##$DPNAME7= <>
##$DPOAL= (0..7)
0.5 0.5 0.5 0.5 0.5 0.5 0.5 0.5 
##$DPOFFS= (0..7)
0 0 0 0 0 0 0 0 
##$DQDMODE= 0
##$DR= 18
##$DS= 0
##$DSLIST= <SSSSSSSSSSSSSSS>
$$ [...]
##$SUBNAM2= <"">
##$SUBNAM3= <"">
##$SUBNAM4= <"">
##$SUBNAM5= <"">
##$SUBNAM6= <"">
##$SUBNAM7= <"">
##$SUBNAM8= <"">
##$SUBNAM9= <"">
##$SW= 24.0689530833862
##$SWIBOX= (0..15)
0 0 2 0 0 0 0 0 0 0 0 0 0 0 0 0 
##$SW_h= 4816.95568400771
##$TD= 16384
##$TD0= 1
##$TE= 0
##$TE2= 300
##$TE3= 300
##$TEG= 300
##$TL= (0..7)
0 120 120 120 120 120 120 120 
##$TP= (0..7)
150 150 150 150 150 150 150 150 
##$TP07= 0
##$TPNAME0= <>
##$TPNAME1= <>
##$TPNAME2= <>
##$TPNAME3= <>
##$TPNAME4= <>
##$TPNAME5= <>
##$TPNAME6= <>
##$TPNAME7= <>
##$TPOAL= (0..7)
0.5 0.5 0.5 0.5 0.5 0.5 0.5 0.5 
##$TPOFFS= (0..7)
0 0 0 0 0 0 0 0 
##$TUNHIN= 0
##$TUNHOUT= 0
##$TUNXOUT= 0
##$USERA1= <user>
##$USERA2= <user>
##$USERA3= <user>
##$USERA4= <user>
##$USERA5= <user>
##$V9= 5
##$VALIST= <valist>
##$VCLIST= <CCCCCCCCCCCCCCC>
##$VD= 0
##$VDLIST= <DDDDDDDDDDDDDDD>
##$VPLIST= <PPPPPPPPPPPPPPP>
##$VTLIST= <TTTTTTTTTTTTTTT>
##$WBST= 1024
##$WBSW= 4
##$XGAIN= (0..3)
0 0 0 0 
##$XL= 0
##$YL= 0
##$YMAX_a= 444554
##$YMIN_a= -400564
##$ZGOPTNS= <>
##$ZL1= 120
##$ZL2= 120
##$ZL3= 120
##$ZL4= 120
##$ABSF1= 10
##$ABSF2= 0
##$ABSG= 5
##$ABSL= 3
##$ALPHA= 0
##$AQORDER= 0
##$ASSFAC= 0
##$ASSFACI= 0
##$ASSFACX= 0
##$ASSWID= 0
##$AUNMP= <proc_1d>
##$AZFE= 0.1
##$AZFW= 0.1
##$BCFW= 1
##$BC_mod= 2
##$BYTORDP= 1
##$COROFFS= 0
##$CY= 11.3945322036743
##$DATMOD= 1
##$DC= 2
##$DFILT= <>
##$DTYPP= 0
##$F1P= 15.6554695791079
##$F2P= 12.8336369535428
##$FCOR= 0.5
##$FTSIZE= 0
##$FT_mod= 4
##$GAMMA= 1
##$GB= 0.15
##$INTBC= 1
##$INTSCL= 1
##$ISEN= 128
##$LB= 0.24
##$LEV0= 0
##$LPBIN= 0
##$MAXI= 10000
##$MC2= 0
##$MEAN= 0
##$ME_mod= 0
##$MI= 1.114404
##$NCOEF= 0
##$NC_proc= 0
##$NLEV= 6
##$NOISF1= 3.799351
##$NOISF2= 2.8
##$NSP= 1
##$NTH_PI= 0
##$NZP= 0
##$OFFSET= 15.70392
##$PC= 1
##$PHC0= -26717.44
##$PHC1= 15.58744
##$PH_mod= 1
##$PKNL= yes
##$PPARMOD= 0
##$PSCAL= 0
##$PSIGN= 0
##$REVERSE= no
##$SF= 200.130013532006
##$SI= 16384
##$SIGF1= 3
##$SIGF2= 2
##$SINO= 400
##$SIOLD= 16384
##$SREGLST= <1H.CDCl3>
##$SSB= 0
##$STSI= 0
##$STSR= 0
##$SW_p= 3612.71676300578
##$SYMM= 0
##$S_DEV= 0
##$TDeff= 0
##$TDoff= 0
##$TI= <>
##$TILT= no
##$TM1= 0
##$TM2= 0
##$TOPLEV= 0
##$USERP1= <user>
##$USERP2= <user>
##$USERP3= <user>
##$USERP4= <user>
##$USERP5= <user>
##$WDW= 1
##$XDIM= 8192
##$YMAX_p= 0
##$YMIN_p= 0
$$ End of Bruker specific parameters
$$ ---------------------------------
##NTUPLES= NMR FID
##VAR_NAME=  TIME,          FID/REAL,        FID/IMAG
##SYMBOL=    X,             R,               I
##VAR_TYPE=  INDEPENDENT,   DEPENDENT,       DEPENDENT
##VAR_FORM=  AFFN,          ASDF,            ASDF
##VAR_DIM=   8192,          8192,            8192
##UNITS=     SECONDS,       ARBITRARY UNITS, ARBITRARY UNITS
##FACTOR=    0.0002076,     1,               1
##FIRST=     0,             0,               0
##LAST=      1.7004516,     0,               0
##MIN=       0,             -400564,         0
##MAX=       1.7004516,     444554,          0
$$ Real data points
##PAGE= N=1
##DATA TABLE= (X++(R..R)), XYDATA
$$ [...]
1956c48O34k30j93J12O4j2J35k33L04l39p7K26l17M41j98O0K85k31k30K20j20
1977d7N2q4j50J90l7j45K96M2k59LK86N9k06J35r1j28K58j25j35L69o2m23j38
2000c40N24p4l66K19l9J4J76J04m22J81k91M38J29n91L72Pj79O0L7J89l75K2L27
2023A22j30J55k51K90k74K71mn07J45J34J58m3j09J5n9k04K49l49K49M8L23k03
2045B6J95l39k09J64p2N12k52l47M77m3l18J81m90L56L05K0ol8J46l93O6J85j50
2068b4K6P5k17K16Jn13N09pj43k7J18j10J3J94n16M03r9P5m26O92l02L22j74P
2092I3k46q0J21M79m19l3K01k33K38m43l1L73j21J1J2O4K05l10j45N34m9j38j6
2115F7K95l48Q3k07l7J23R8j63O8M9J35j51m4K60n21J43O3q2o5N25k83R2m03P3
$$ y = [-348, 286, 56, -137, -25, 39, 27, 162, -71, 233, -106, -183, 43, -274, 167, -31, 29, 314, 83, -147, 73, -47, 5, -79, -229, -39, -76, -221, 75, 117, -142, -139, 147, 206, 0, 135, 44, -84, 174, 49, -86, 283, 221, -202, -340, 184, 110, -256, -37, -76, -62, 114, 218, -204, -23, -314, 124, 253, -338, 34, 41, -138, -78, -41, 148, -227, -205, 122, -8, 147, -104, 186, -88, 183, 179, -328, -183, -49, 109, 66, -43, -28, -87, -291, -42, -391, -142, -94, 229, 26, 221, -118, -327, -163, -235, 277, 25, -322, 155, 112, -206, -25, -515, -159, 146, 166, 160, 122, 268, -125, -59, 126, -24, 2, 77, -140, 76, 77, -436, 73, 66, -77, -104, 14, -96, -83, 111, -405, -2, -101, -26, -452, 240, -62, 260, 86, 93, -153, -233, -112, 367, -52, -85, 116, -117, 121, -322, -353, 20, -101, -90, -78, -14, 191, -119, -264, 270, 221, 83, 67, 362, 14, 97, -110, -147, -24, 74, -89, -21, 28, 163, 12, -32, 228, -293, -150, -87, -169, -234, 291, 8, 100, -303, -230]
2139b30K12p1O2j19M33k54k90M20r9J54n0q6M2L2j39k03K13j38K89l82K32m3k26
2162b41L25k33K76Jp3J2J83o47J70M13k4p6j23j42L43r7M5M3k79PJ97J40j83J8
2186E5k02J87P5j54J08j66J35l2L9k5K06l16j63J06J40k11j85O09l48O0K43k33
2208g2N91n18j18j92K77k19K10L07j97K6Q1k28k03J85L68k70Q5p6n5J35j70l0
2230h3R9K57j27k24n0K87j97L70j68l30K83l42L57J28k30J11k69M78j95j26NJ09
2252A43Nl5n3j65q6R8NK19J57m43k5K97J0j88K64q2M9l46J26k63O31m05M2L15
2276B70o9l81K2L9M24m82J84P8k59M24k16p5QK84o1l48L16k20M7n9L03k01K8k79
2300b23j0L18j39j03J73J00Qr1J36j62O2m7l4K4n6Q0k12J87P4j23j12L73k97Q5
$$ y = [-230, -18, -89, -27, -146, 287, 33, -257, 163, 64, 218, 168, 82, 124, 156, 17, -186, 27, -111, 178, -204, 28, -15, -241, 84, -149, 127, 128, 55, 67, 250, -397, -227, 186, 162, 86, -37, -179, 164, 67, 112, 155, -124, -117, 80, 220, 37, 55, -147, 40, 115, -39, 69, -97, 38, 6, 45, 20, 226, -90, -253, -147, -7, -218, -403, 206, -142, -82, 161, -72, 519, 1, -117, -309, -32, -251, -41, 266, 69, 95, 176, -52, -255, -70, 298, 28, 113, 37, -18, 117, -53, -83, 16, 273, 146, -78, -128, 159, -38, 332, 164, -166, 117, -225, 132, 260, 30, 141, -128, 350, 155, 29, 34, 143, 148, 113, 60, -105, -191, -93, -88, 131, 288, -155, -180, 117, 127, -61, 203, 121, 170, -176, -50, -313, 318, -87, -45, 270, 201, -180, -158, -119, 305, -177, 7, 85, -174, 250, 34, -41, -33, 251, 190, -158, 158, -62, -15, -74, 229, 28, 56, -223, -233, 85, -54, -157, 16, 116, 124, 33, 169, 7, 69, 22, -12, 12, -44, 36, -176, 11, 85, -38, -150, 223, -74, 11]
2324A1L3j99J20R1m36N06J04n15K36Q3J41l74M10k93l7J92P2m99L75J58q2n4m00
2347c57N06n5N70m40P4l89J7K59l08L57j00L7k40J55j32k43L29m7k78L95K1K74
2369D05j70j35L3j97N0J17l60J69K8K58j18j09L65n03K61j29N0q3R6m4K95k85
2391fK12l34q5K49m76M54L2m5m1L1qk39J40j34M00l6j84K89j59J02j86O0J13j26
2415B3j45O2j36L19l97L81j88J32m01K88j30l8M6J67N7J02j90M09m88M73m31J5
2437g0J62k23J64m09M40j7k38K40O0p6J7j39J68R8j41J44J34j21k37LK32j87k00
2460a96K06J39l34K45q4K88j63k89M01k36J7M1l3j8j29Q7K23j61j33J65j80M02
2482B58N7m56J09J31l7o5Jn0J30j17k73K52J54J08l59L05k72K11j01L76k97l11
$$ y = [11, 44, -155, -35, 56, -380, 126, 230, -285, -49, 34, 175, -199, 211, -82, -119, 73, 145, -354, 21, 179, 97, 43, -357, 149, 94, 664, 224, 298, -91, -74, 185, -123, 234, 134, 171, -69, 86, -46, -289, 40, -7, -285, 110, 131, 405, 235, 100, 133, -64, -14, 103, -257, -88, -60, 198, 80, -29, 336, -167, 94, -35, 15, -68, 28, -16, 279, -6, 206, -128, -213, 36, -440, 14, 46, 1, -40, -9, -17, -256, -116, -250, 150, 114, -70, 219, 60, 162, -24, 36, 149, 23, -122, -60, -196, 123, -274, 107, -81, 51, -350, -62, -192, -230, -184, -17, 40, 142, -48, 361, -127, 346, -85, -70, 92, -131, 33, -376, 64, 47, -191, 49, 109, 33, 50, -89, 79, 177, 36, 180, 314, 193, -44, -41, 191, 4, -196, 10, 149, -185, 60, -24, 264, 101, -188, 213, -23, -6, 35, 2, -16, -145, -58, 165, 4, -129, 36, -144, 258, 315, -141, -32, 99, 62, -3, -2, -52, 78, -39, -312, -60, 94, 202, -157, 148, -124, 87, -14, 362, 65, -246]
2504b46J74N6L14m25K02l7j66K59J13n95N69j11P5M8j9J6j90l24QM39j12j62O9
2527d5j84N01k96j23K42k97J87J20j37J13N8j21k62Q5P5L17l24j3j57J68k2L7
2549g8K63m71K58q7O6K1l30K78j29J34L83l08M50l53j43J47k00K34j94J25J40
2570B06j74k58M43j93K4j08j95K56q7J25J06m52M10J53k59O9J65l74J67k22m9
2591b47K57j51J52o5J51j71J16j72J33M0r1J84j30J71l23J70J77j98j08k31M59
2612A23j19Qk64p3K30M7L7L26m63j51J97J57J3P1l68j31N06oj53K19n8m25K22
2635e5l2J95l89L92J47l24j7j03K8Q1j00L94k38l51K62J71j5j8J23k17k29K76
2657a9j45J03j9K34j07J1j83K04l48L94O1l03L65k77k16L4L52o6L4j31K69k97
$$ y = [-246, -72, -16, 298, -127, 75, 38, -128, 131, 244, -351, 218, 107, 182, 230, 211, 227, 37, -287, -279, 160, 48, -114, -45, -229, 272, -24, -147, 95, -202, -15, 105, -32, 81, 139, 18, -244, -159, -84, 233, -91, -104, -261, -93, -115, -78, 185, -286, -28, -115, -49, -28, -358, -80, -209, -75, 308, 0, 450, 97, -46, 101, -99, 135, -59, 66, 206, 32, -226, 217, 24, 48, -60, -255, 1, -86, 39, 145, -307, 103, 256, -3, 66, 231, -143, 24, -198, -247, 10, -141, 11, -54, 97, -74, 42, -130, 3, 43, -48, 136, 6, 177, -146, 24, 201, 3, -105, -336, 123, 4, 12, -252, -325, -95, -48, -11, 315, -148, -299, -102, 55, 68, 139, -229, -360, 146, 140, -13, 206, 148, -277, -55, -87, 108, -281, 111, 258, -66, -83, -186, -158, -77, -177, 217, -21, -372, -110, 61, 46, 28, 151, -66, -295, -19, -164, -61, -80, 154, 47, 58, -125, 79, -269, 125, 186, -117, 248, -29, -245, -211, 141, 75, 109, -22, 247, -50]
2679e0K40j38kJ18n13L77q2L90l2j44P3k65om9K18l8j50N6n7M4N1L10j72k40J39
2704G8J64l0k29n3k3J3P5K57k64l3j5O0R5m9J3j2j20J66pK63l05j29J72o2o7j43
2730a85L30J4m0j03r3J79N5j13o7r6J24J18%O6l99K02O7k35J04J37J3p9R8l26
2754b29J18M2l26K81l2L7M20m9k0j5o1j75J63J01k80N6j02j25J48M44r67N49l9
2777f1p9J27k9J35k29J00K7JJ15k35M56m65j26K90j57M8K15j54j74L73n21L22
2799b1oJ5N07n61K74k65k77M25N4l90K53K0o7J30j64j48K48j24K61q7J6J62l4
2822B21p9k38J07k7L49m26J81N5k97N2M6j43k72M86J9J9K9L8J64n89L24j29K16
2845A06j67n4L66r1K92l83j2L78o01j43J57M79j21m8j99L6K4j34N0Q9j4l10J41
$$ y = [-50, 190, 52, 50, 168, -345, 32, -50, 340, 308, 164, 237, -28, -34, -83, 135, 97, -53, 3, -54, -10, 41, 351, 179, -61, 78, 242, 212, -17, -70, -93, -80, -5, 252, -12, -45, -60, 0, 95, 46, 59, 47, -73, 93, 86, 349, 44, -85, 87, 25, -42, -185, 145, 159, 119, 16, -77, 102, 157, 44, -23, -119, 5, 123, 123, 189, -210, -8, 59, -176, -72, 65, 78, -1, 97, -229, -111, -69, -395, -114, -146, -109, 311, 262, 242, 227, 166, -9, 154, 255, -25, 31, -71, -196, -48, 396, -571, -22, -61, -140, -13, -42, 93, -136, -36, -9, -8, 107, -128, 328, -137, -263, 27, -130, -82, 133, -21, -195, 178, -343, -21, -27, -12, 495, -66, 208, -57, -334, 91, 145, -245, 8, 28, -39, 91, -73, -221, 27, -97, 164, 77, 93, 255, 221, 142, -96, 11, -16, 333, -93, 88, 143, -154, -102, -56, -199, -471, 15, 34, 53, 82, 120, 284, -305, 19, -110, 106, -61, -115, 251, 160, 452, 69, 57, 435, -166, -309, -152, 327, 206, 158, -41, -5, 19, -115, -65, 24, 10, -300, -159]
2868a59L89j03k17J14O0m78K12L06k00M61j65p9p5j02k16K39j37j56L01n3K55
2889A97j02j37L00j98j3nlk59J71K51r7k36L65j20l1Ml9N7k16Q8M52m98J84k05
2913i0m1J06J78k08j24N9M4j31K9K44k21P4o7J87r0K36n08K30O3k2j98K45K17
2936B12l58K42k3P7j81K36j61K9j98P5K27k17l3J78k0l39N07n48L04n1k01P10
2958D67l89p4L2j14qM02m81K76j29j27L36m45K32r0J38J37N5k70j80J28J97O5
2980A58K13o04M2K90m1M8J36l41J28k02J83j72R2K12J5q4K3k69N2L75j40j17j4
3003a7q7l8L92k99j03M14j93l90M78l91N40l82R4Llm40L22L69n40L33K3j3j9L14
3027C67n6k30J14o4k12J45r3j29K38K10l78j55K49K12k89m0R4l05K42rr5K9k4
$$ y = [-159, 230, 127, -90, 24, 84, -394, -182, 124, -76, 385, 220, 141, 66, -36, -252, -13, -150, -306, -5, -58, 197, 95, -42, 258, 60, 47, 42, 39, -220, -49, 202, 105, -131, 234, 114, 83, 87, 48, 105, -111, -23, 429, -69, 115, -90, -131, -25, 153, -55, -179, -120, -76, -207, -178, 66, -155, -81, -148, 39, -51, 185, -323, -93, -30, -52, -250, -5, 212, -146, 96, 73, 150, -31, 205, 44, 73, -125, -50, 177, -40, -73, 105, 85, -254, 253, -295, 9, -42, -243, 467, 78, 4, 36, -78, -86, 316, -165, 111, -18, -145, 191, -254, -22, -112, 26, 163, 218, -52, -232, -104, 93, 158, 371, -233, -191, 99, 58, 106, 242, -99, 29, -173, 10, -162, -70, 142, 157, 73, 96, -173, -121, 254, 114, -3, -17, -104, -142, 250, -49, -152, 262, 69, -321, 157, -234, 306, -76, 18, 21, 18, -422, -100, 269, -271, 62, 85, 72, 53, 367, 311, 81, 195, 131, -81, 64, -29, -158, 80, 290, -88, -243, 6, 218, -71, -111, -17, -322, -80, -89, -184, -155, -179]
3050a79J37J01k0n8J07m9N0p9j50k20J58J20K08J01m27K11K45k98R6J41k44k32
3072b81K57j13J29M11l06j83J1r4K08j46L77r2O3p5l39L25r5l7j26Q5n1p7O8L49
3096B68p6k3L2l73J04L31j86j63K21o5j72M21m33K84m49L17o8m05N47j84M5R5
3118F8K42l50J88l90P7P6PK40k05l6jK08k13J25k5M3k25O0q9q6j54M80J46k82
3142i6L56k82M7j0m1m4J62j39J46r8l42K49K68k24j59M6O5J82m94N20m32K43J5
3165f2q1J62L2K35o14L11j06J66l8M5l25j7L29N3q8l95K83J28K00R3k28J86On6
3189B19m22L43j05l3J34Q4k86L18n7m37L25Q5k64k4Kk49L12N9J72J38k57j82j21
3212b46L19j06J33k41n1K55N3N1r0J31j6k87M11J10p77K52J80K3j18M69n84Q6
$$ y = [-179, -42, 59, 39, -19, 88, 39, 89, 10, -140, -360, -202, -82, 126, 227, -200, 11, 256, -42, 54, 195, -49, -281, -24, -137, -8, 403, 97, -86, -75, -169, 39, -107, 270, 178, 241, 166, -173, 152, 57, 20, -106, -21, -72, -149, -81, 268, 192, 169, 201, -172, -68, 263, 77, -86, 135, 70, -102, 319, -114, 170, -279, 38, -30, -435, 112, -72, -27, 68, 310, -40, 148, -242, -165, -89, -82, 158, -47, -83, -84, 124, -89, 36, 11, 54, -171, -111, -200, -286, -440, 40, 186, -96, 260, -22, 25, 15, -26, -70, 92, -47, 99, 1, -341, -92, 176, -48, -207, -161, -96, 86, -408, 112, -320, -77, -62, -143, 19, 51, 286, -328, -17, -123, 43, 5, 50, -275, -292, 37, 90, 2, -393, -110, 18, 218, 311, 83, 269, 275, 219, -203, 140, 35, 2, 136, 220, -66, 252, 195, -242, 83, 168, -96, -120, -118, -367, -55, 4, 176, 314, 57, -125, -246, 73, -33, 100, -141, -192, 63, 116, 167, 77, 208, 192, -95, 316, 426, -351, -99, 81, 104, -14, 455, -129, -43]
3234d3r2L5J46oJ75j11l05LJ09M6m4L02j8j63J73j37rq1L33o57K76KL96m90J8
3259a42L14m21K76N9q1n56L46p8J59J03J33j16J06q9J03k08O2k01J51j55M29k51
3281e7k42M52K7k9q8P9k26J64k35L88m44J27N6k46J28qK38J67j95K74m93K02p5
3304c6K5l34L89o2K83o16J57K44j66M2J4K1P6j02K7l3J16l43K80Q8p6N1K2k4O5
3329A08J45j31p1R9j0k97L3L1J77l00L17j71K95p1o6J91K34m69R2J39j09j37j44
3352a15J36m9NL75j25k40J7j96K76k62JL28k35J96l48Q5K32j37R0p0Jr2J8J49
3376D0L26o92N90k44l4j15J43J83l39L44J8l01N8j33MN73l60J4m7Q9k09o2J89
3399C5j48o9N8j57m7N94l69M12k04j22j11j57K97P4l27N12r9j80J3K19l82L68
$$ y = [-43, -135, -100, 46, 40, 215, 104, -201, -198, -89, -43, -87, 215, 197, 34, 207, 70, 61, -20, 313, -344, -68, -66, 330, -160, -142, 172, -249, 27, 86, 5, -551, -205, -283, -124, -21, 112, -4, 102, 13, 116, -92, -30, -231, -80, -235, 194, -57, -299, 153, 180, 151, 63, 142, -84, 80, -155, 233, -211, -84, -28, -274, -146, -154, 84, 251, 56, 330, -163, 39, -36, -11, -345, 44, -18, 265, -351, -194, 50, -116, -74, -60, -39, 37, -65, -38, -71, 45, -298, -18, 70, -6, 45, 67, 43, 108, 253, 122, 51, 150, 140, -157, -124, -93, 84, -216, 101, -70, 225, 154, 88, 279, 513, 44, 136, 275, 166, 29, -115, 21, -28, -23, 352, 227, -13, 4, -192, 84, -178, -177, 151, -84, 112, -236, -151, 81, -56, 34, -36, -35, -127, -109, 40, 366, -326, 264, 20, -14, -129, 14, 197, -142, 202, 220, -81, -23, -156, -152, 421, 61, 75, 28, 117, -92, -154, 35, -113, -182, -124, -281, -328, 266, -103, 309, 105, -17, -128, -285, 12, 86, -241, 271, 172, -8, 5, 224, -158, 210]
3421B10jl10j14K75J27j6K3k80j1l16K14R5K2k21L80k72l2N45l31J49r7P9l94
3444b76J79O1O7Pl07J66J72J00p0m27L69J6J10j31J46l78K32m3k75L42j37L66
3466B89k65J58%L55j07n66P8K09M9j45L3J51k2j2K1l88J34O2K3J31l26r8L88k15
3490f3J72l3k28J91J47l33J94j34K39n79P37m11j89J95J15O8j64j56L7p2M00K63
3512C96l43J8q2r8M82p3j41q6J16j60J59j47J37n4k2J51k41l2j95L57n9j71J10
3535B2K8j08M0J46k86J91j37J92n2j7L0J42k85k46J01J92L31n87K13L9K3J77j35
3558A4j40J79j44L31l97J95M7j80Q6M0K06j56k57Q2L07r4p2r1J08j26O4j36K69
3581A35k85K45q2K4k29N00n08P7J70j51j24L87j10n0K43r2j82l17N12k27L90m47
$$ y = [210, 209, -101, -215, 60, 187, 171, 194, -86, -97, -413, -199, -104, -82, -303, 77, -195, -227, 318, -13, 136, 39, 118, -276, -97, -36, 31, 38, -269, -103, 69, 169, 99, -328, 41, 57, 167, 36, 182, -196, 36, -7, -282, 60, -77, 289, 24, 182, 182, 537, 430, -136, -58, 151, 200, 55, 88, 239, 217, 205, 226, -162, -28, 34, 57, 188, -138, -236, 152, -63, 109, 76, -152, 39, 186, -147, 47, -87, 152, -427, 310, -101, -290, -95, 20, 88, -76, -232, -195, -267, 133, 396, 53, 71, -11, -109, 373, 300, 159, 73, 189, 29, 188, 41, 178, 124, 102, 253, 12, -20, -215, 142, 83, -88, 22, 50, -58, -18, 128, -158, 33, -104, 88, 36, 19, 49, 191, -94, -340, -239, -47, 284, -303, -90, -51, -28, 149, 14, -126, 53, -91, 240, -157, 38, 85, -95, -9, 31, 237, 81, -176, -94, 213, 119, 47, -44, 64, -62, 2, -134, 135, -150, 95, 13, 37, -192, 308, -200, -123, 47, -104, -228, 159, 49, -1, 242, 150, -32, -349, 163, -64, 326, -121]
3603a21k99N02J91k62r4nJ56k4O2j61j32L07j44K19o9k58J95k61M74k26N4k87
3625a83R9J80m08M87n10M97j2j85k86J23K32L03k1l60p7J12J49k09R8K6j24j13
3647a82K46j53K6J31m1J1r2j86L15j07J11j2j0j39L2L79l51M4o8n8k15L26l5K7
3671aJ77k46J40L23J4m42R8J34j43j08q8JK48p1j98j8r9L65j57r8K40j65J62J15
3695A83J38k10j30J39l20L38k26N6R4j01o5K81l73J51k15L62J26l41k16M73k12
3716f8j57M18k36k20L62j90j45M34q9J3N9o42N67l04K29l9j49K61k15J15j84J48
3738c2j9PP8O2m84J46N76m58O00o13K08j94N02n31K28j16p8J80j89J91j7J28l06
3761a31K86j0m22M00m21Q9J02J58J3jj85Q8M40k21k22J36l20o3O25l07K11j80
$$ y = [-121, -420, 82, 273, 11, -83, -88, 68, 44, 106, -55, -187, 120, -24, 195, 126, -132, 63, -198, 276, 50, 104, -183, -84, 96, -312, 175, -335, 162, 150, -35, -321, -198, 34, 337, 316, -44, -121, -9, 140, -69, 29, 55, -69, -182, 64, -89, -63, 68, 27, 38, -54, -240, 75, -32, 79, 67, 57, -82, -50, 329, -22, 22, -46, -104, -319, 7, -28, -1, 176, -70, 70, 393, 407, -35, 63, 197, 54, -54, -142, -141, 107, 36, -162, -180, -279, 86, -71, -169, 71, -94, 68, 183, 321, 111, -19, 120, -200, 138, -88, -32, 62, -39, -104, 177, -196, -45, -260, 102, 228, -113, -329, 144, -68, -225, 193, -43, -263, 99, -91, -236, 198, 109, 122, 181, -461, 106, -198, 31, -8, -157, 104, -111, 4, -180, -32, -51, -44, 34, 96, -388, -242, 334, -124, 476, -137, 71, -123, 379, -152, 76, -40, -118, 62, -127, 64, 47, 175, -131, 155, 145, -277, 123, -298, -209, -107, 51, 64, 63, -122, -34, 406, 185, -37, 99, -221, -284, 341, 34, 245, 65]
3783F5k45K96L7o5J30j84lJ72n37P3M24j1l58l2K47k94o8M54l11L66j50j9P7j20
3807e6P0K68k06J30m63L50K95k03l93J09j77M17j53J15J85k16K06q8m49K75q6
3828g0R9N5q1N76p81K98M7j48j49m8l2J83O9l48M93J86k21j31k9J36k26M8P3J17
3852A16j4R4m11J62j11L40l60%O6J34O7j15K74l20O4K11p2M2l31J14M17k20p9
3875F8j77K0p7L44J44m07k4Q6j81K20j86K13j84L04m22qN72M6m75r4J14l6N7j77
3899b60J87j3J90k17J48K31l04o3L18l64L42j98J53m7j76J86M9L01m26J45l90
3920b08M08q4nk65k1L72j26k20N5j49K63j79K52j00j99N67j93M4j22p6k65M38
3942A87k63l22M80j06j00J01m8J45K41m44J15M3j7J63k55J23J87m46J88n5j22
$$ y = [65, -180, 116, 153, 88, 218, 34, 31, 203, -334, -261, 163, 152, -206, -238, 9, -285, -353, 101, -210, 156, 6, -13, 64, -56, 14, 282, 76, 206, -257, 93, 388, 185, -208, -99, -276, 141, -12, 103, 288, 72, 278, 190, -259, 16, -70, 29, 84, 3, 579, -202, 96, 143, -5, -154, -202, -234, -51, 18, -330, 163, 349, 128, -3, -32, 104, -122, -74, -1, 116, 102, 196, -215, -53, -164, 176, -184, -184, -118, 16, 83, -32, 242, -78, -14, 197, 125, 167, -164, -50, 367, 147, 68, -109, -89, -166, 178, 322, -85, -109, -23, -204, 16, -170, 43, -141, 163, -259, -267, 305, 351, -124, -218, -104, -140, -83, -260, -73, -86, 104, -113, 35, 266, -38, -101, 217, -147, 195, -3, 150, 103, -73, 113, 162, 463, 37, 182, -208, 200, 116, 111, -154, -175, 197, 71, -149, -94, -243, 20, -159, 93, -7, -206, 361, 168, 212, 90, 14, -251, 187, -76, -398, 82, -24, -124, -23, -71, 74, 315, -129, -14, 29, 12, 175, -80, 43, 230, -216, -28, -83, -205]
3963b05K55O3k73J96O0j3k00N0L56l30J36j30k6j35K45m01K19J82m3j01O5J50
3985A20m58J27P6M16n23K26K5L15n00K88J50k48j01K71q3k90J56J3P7k82J07j6
4007a34M71l64K43l97K26j77K08l23K89J04k44J77Q6J18m72J46k7KL2J76n12N39
4029A67k0M3l99K43K5o6m7j88L9K34j93J45j3j0k56J25L62j53K11m12K62j41M7
4052EJ04l0k45K51k15K26O6j08J48l5j70P3mj77M91l17R0o7M8o0k71k7L29K15
4076C20m96L22j3j04J50j97J33J8r8k20K4L31k71K59p1k18K93J2j56l8K39k05
4098A4l33K24J25K11l20j33K03j86J77P3L7l47J64K26K26j50M3l45M7Q3o6NJ32
4121A10j04l25L26j27M19l43J78K4k18m9R7j29j30K71N0j32M04l03k8J72j3J41
$$ y = [-205, 50, 113, -160, 36, 96, 83, -117, -67, 289, -41, 95, -35, -61, -196, 49, -352, -133, 49, 6, -95, -30, 120, -338, -211, -135, 281, -242, -16, 9, 324, -176, 112, 262, 14, -87, 184, 101, -189, -33, -20, 57, -225, -118, -134, 337, -27, 216, -181, 45, -132, 76, -247, 42, 146, -98, 79, 165, 283, -189, -43, -70, -68, -36, 140, -372, 167, 147, 190, -209, 34, 59, -7, -54, -242, -203, 31, -162, -17, -30, -40, -296, -171, 191, 38, 249, -163, 99, -42, 5, 109, 79, -166, 85, -130, 96, 162, 54, 202, 167, -3, 70, 66, -111, 380, 63, 153, 86, 134, 74, -197, -224, 105, 320, -176, 146, 133, 29, 179, -18, 115, 133, 35, -185, -161, 170, -101, 158, 87, -131, 162, 174, 18, -20, 219, 14, -319, -95, 30, 241, -79, -212, -9, -195, -18, 55, 92, -255, -91, 135, 361, 211, 254, -91, -44, 39, -27, -22, 110, 6, -319, 7, -120, 299, -44, 134, 158, -60, -109, -12, -141, -271, 0, 50, -82, 322, 19, -9, 163, 150, 291]
4143B91l53J22r7P0j80m3K57k75K69k63J20k75O42m10O4M84m30M16n87O17q15
4164c76N33O3j31k15JK31j80J13j98M08k10k21L98k49N3J26j97L29j50k07L30
4185B51k85j44M61k13j50L8Q8L4j89Q0R9j91N0l0K55m9m16K77J93l45J35k21P20
4208D48m66k09M14q7k98L75l4k79p4L34k60Q4j6L14j84M3j61r9J33j59K10J57
4230A86k52N1k38L44O7j66l2j6j96K16J05M50n81j31L85k64J21j60M8r3j33M16
4252A27j65j15J33M6k09J57R2k73K7L15k08k38J28M63m9j91m47M18l41R2K32j04
4274a10K08L2l14Q7j1K43J11k99J26j27m58M58j7j9J8n4K69l08k05M85J97l08
4296DJ56m33M83j49J77j48k33J65J68j11l29K96j80j10N5L73j41l02L50m4j35
$$ y = [291, -62, 60, -37, 33, -147, -190, 67, -208, 61, -202, -82, -357, 285, -125, -61, 423, -7, 409, -178, 439, -376, 157, 220, 89, -126, -125, 106, -74, 39, -159, 249, 39, -182, 216, -33, 20, 146, -51, 278, 128, -79, 251, -34, -178, 283, 70, -80, -42, 46, 80, -109, -29, 70, -121, -71, -101, 154, 105, -311, -34, 159, -186, -51, -272, 448, -18, -227, 187, 100, -198, 177, 143, -136, -210, 124, -136, -52, -68, 246, 62, 105, -56, -155, -22, -181, 29, 186, -66, -15, -253, 91, 158, -8, -40, -56, -252, -36, 69, 519, -62, -193, 192, -72, 49, -111, -63, -156, -289, 127, -38, -153, -20, 26, -183, -26, 66, -207, -180, 135, -73, -311, -183, 280, 231, 40, -407, 11, -330, -238, -6, -110, 98, 130, -184, -97, -108, 135, 246, -53, 73, -54, -512, -54, -71, -90, -72, -126, 143, -165, -370, 115, 312, 4, 160, -273, 210, 61, 238, 90, -143, 22, 190, 79, -250, 46, -134, -244, -189, 184, 43, -259, 91, 47, -88]
4317h8O8P7k53J07k31L71l29J60K33q5L5j64j5J79j08J47l19J62J46j32J29k54
4339a64N9j17K59j8J79n2m26N5P5P3K3J86k50J97M3%j26J00J01n00L22j29J30
4362B0k45J83k5o7J04k33L2M24J72n12M33j06m61J20K13r1j72K56j45K24l32K20
4384A2o6M9n1p2R3o8J99l62M77Rk87L61k39r5l21L33j35M19j21k21j02L32mK23
4408C63l04j01k92O38n79K29k10J30R8m1L64n86k4P11m88PK34j13L5N9nL20l87
4431E8l07j9M94k00L6k02K13J19j05k55O5K69p9l77L01j4j09k0%L66k84J67j63
4454d6j61K32k7K90l23k34N47k99j07j44L62M5l24K07K33q5l94K22L19l82o3o
4476a38k0Q4j16L3j30K30k20R8M36l92L26j23j41J79l27K77l12K1L19k87N8j83
$$ y = [-88, -20, 57, -196, -89, -320, 51, -278, -118, 115, 30, 65, -99, -114, 65, -43, 104, -215, -53, 93, -39, 90, -164, -105, -222, 37, 19, 198, 146, -280, -225, -150, -77, -54, 132, -118, 79, 122, 122, -4, 96, 197, -303, 19, -110, 20, -225, -42, -67, -134, -30, -263, -231, 193, 365, -147, 286, 180, -281, -161, 52, -39, -211, 45, -100, 124, -208, 12, -54, -5, -56, -128, -35, -103, 96, -266, 211, 220, -67, 294, 55, -40, -361, -28, -163, 256, 135, -86, -188, 144, 140, 363, 59, -42, -334, 304, -275, -46, -256, -126, -28, -69, 295, -291, -315, 396, -92, -85, 149, 36, 71, 130, 125, 445, 58, -249, -268, 226, 26, 62, -140, 73, 192, 87, -168, -103, 166, 87, -290, 11, -3, -112, -132, -132, 234, -50, 117, -46, -207, 25, -2, 288, -35, -269, 278, -21, -128, -272, 90, 135, -189, 18, 251, 166, -228, -6, 313, -69, -132, -138, -158, -74, -190, -157, -287, -57, -277, -179, 257, -135, 191, 68, -73, 106, -221, 56, -256, -235, 84, -203, -145, -328]
4498c28O38l95j76M14l22j11K58M7k24N34m69M6J04l62L87l71M22M3l44R9J84
4519G4L32m73N4L07k59P2J58l82L10k21K32j60K72m49J74j36J19j91J79K52n89
4540c25M8J02R0J37m07N97k71l5O8j02o2M0N1J63j91P4J37l3K6K6l20j91K18j0
4564a70M08j52k05K67k57Q9K95j84r1l1K75j44N3m3j75J65l18J57K70m61J88K31
4586A67j70K1J60j30j35L4J77P5q4l2j51j10J65J62j12N7k20J61kk4k4o1J18J9
4610F1j8K31K27l59r1p1M1k8k6K55k06j7O9m7m3j42j66M72l37L08k43M2k5J86
4634G3N9l2j2O4J35o7j42j65j77J82J95l7j8L9J35l45K10OL38o47K00k22j05N36
4658B03k48N2l4j31q5J96N93m70j79K11Q2n55K47k12L77k0J37k28N1J51j80J5
$$ y = [-328, 310, -85, -261, 153, -169, -280, -22, 25, -199, 335, -134, -88, 16, -346, 41, -330, 92, 135, -209, -110, 74, 406, -67, -13, 294, 35, 107, 265, -117, 193, -28, 204, 44, 316, -133, 41, -95, 24, -167, 12, 264, -325, -277, -175, -85, 52, -355, 242, -29, -64, 4, -98, -160, -120, -69, 94, -97, -23, 114, 81, 107, 133, -187, -378, -160, -170, 238, 86, -119, 148, -109, -20, 275, 91, 0, -31, 244, 100, 153, 110, -65, 100, -218, -61, 209, -252, -64, 167, -3, 18, 178, 48, -87, -53, 124, 199, 115, 83, -68, -178, -13, 149, 37, 94, -126, 35, 33, 9, -15, -76, 42, 61, 43, 274, 501, 142, 51, -20, 21, -7, -33, 222, 16, -1, 68, 21, -22, -164, -330, 142, -195, 113, -130, -88, -113, 73, 132, 100, 88, 152, 287, 220, 78, -87, -264, -82, 113, 76, 58, 97, 232, -113, 97, 103, 441, -206, -6, -228, -333, 203, -45, 7, -27, -158, -243, -47, 546, 76, -103, 108, 190, -365, -118, -330, 47, 27, 164, -64, -13, 138, -42, -27]
4680b7Q8J7j88j11N5J02j07R9J48M0k73r6J68K38J7j2k09L63j54m18L57j05m9
4703e7L8R6Jj72j57J06%n9L13R9k71J14mmj61L19m65M23j09k78J63M6j32K21j43
4728g3L9o4K00J9r5k17J79j19K75J01n92L03L7O7J79j35j07k3ml68M44J36l22
4751a40L44j98k15N84j61n6k61K9r2K45m07K65O3J45j91L97m22K48k93Q14o11
4772H7m27J73RJ81K0j44j0j63K75M0r7K44p5p4j75Qj81K20K52j59r8J11k75K24
4796c4K16j52j20Q2j94P0j31K70J36j70o8K34k32M07l81j00J76J79k03j05K19
4817I9n5J3j30O43n23K7k56L55N9j79q1j37O6J35N7n6K39l78K03J11m25K14j95
4840a94R5J82j46M21l77K18l70L91j88l65L65j34k6L4K24N0j72j3L15l01J15m10
$$ y = [-27, 61, 78, -110, -221, -166, -64, -171, -72, 76, 116, -157, -253, -85, 153, 170, 158, -51, 312, 158, -260, 97, -8, -57, -19, 77, 78, -94, -251, -145, -145, -204, 109, 208, -63, 51, 47, 43, -118, 201, -264, 159, 50, -228, -65, -19, -151, 70, -73, -34, -98, 102, 121, 26, -191, -12, -131, 144, 245, -347, -44, -7, 60, 239, 104, -3, -26, -30, -398, 46, 182, -140, 204, 6, -209, 375, 214, 158, -103, -74, -166, 79, -328, -63, 0, 145, -46, 351, -71, 177, -116, 698, 87, -340, -167, -158, 23, 43, -101, -111, -274, 1, 41, -56, 188, 113, 39, -136, -128, -309, -89, 163, 4, -94, 17, -258, -34, 182, 30, -90, -8, -202, -132, -263, 7, 143, -27, -95, 139, -93, 314, -67, -167, 9, 188, -15, -120, 99, 44, 57, -73, 570, 47, 74, -182, 173, 232, 53, -28, -165, -99, 36, 93, 37, 276, -102, 101, 212, -213, 1, -194, -99, 83, -63, 358, -19, 199, -171, 220, 32, -333, 32, -102, -128, -94, 130, 180, 8, -5, 310, 9, 124, -286]
4862b86M88k37O7J76k23K20j00J1J5L1k01k81N83j54j76K45M5k38j37K14o4R9
4884I7k7j83J22K42l3l35j06L90m52K84JK00l91N66j59k25j2O7k41K37Q6k81K91
4907A38o0L5k09j11R4K11O5k86J17K53j19k32J55k65J18K3k7J00K02j47J05K80
4929D40n99P8J76j53J5l4q6J49l05N26j08o3p3j69N4K34j44j76L62k33lK9L32
4952B49j26l6J99l46k8R0j15J16J00J6K32l68m1k9j67L33j90J40L6P9o4l98L71
4975E3M00o02K14k30J86pj23lP3J89l76K14J70JJp0j56K2k3J00jM2j09m2L4l4
5001g7O0P3j05r6n7M09k85J22N6Kl99J88N7j37K62J34l89m1L6L9m6L80l75J05
5025h4J06j62J78m0K19l18j15L50l89L97j98J34n2n3n4j21MK54P2L33m36k00J57
$$ y = [-286, 202, -35, 32, 208, -15, 205, 105, 116, 131, 162, -39, -320, 263, 109, -67, 178, 223, -15, -152, 62, -2, 97, 70, -113, 9, 251, 218, -117, -223, 167, -285, -1, 0, 200, -191, 375, 216, -9, -21, 46, -195, 42, 128, -153, 138, 78, 113, -96, -207, -113, 98, 163, -123, -6, 247, 128, -104, 51, -214, -96, -73, -100, 0, 202, 55, 160, 440, -159, -81, 95, -58, -43, -77, -163, -14, -319, 207, 99, 36, -37, -206, -152, 82, -62, -238, 124, -109, -112, -83, 249, 123, 87, 286, -60, -88, 2, -113, 3, 103, 119, 351, -17, -58, -87, -254, 79, -111, 29, 65, 144, 80, -318, 53, 453, -149, 65, -165, 21, 14, -109, -112, -39, 150, -226, -12, 158, 159, 160, 90, -66, -44, -67, 33, 32, 74, -35, -77, -43, -77, -17, 56, -49, -145, -202, 207, -78, 44, 100, 102, -297, -109, -52, -189, 73, 207, -182, -223, -187, -148, -194, 186, -189, -84, 22, -140, 38, -2, 217, -101, -216, 134, -255, 142, -56, 78, 26, -27, -81, -202, -198, 56, 128, 461, 25, -175, -18]
5048a8l0K3L7n2k03P2p3J49L11k82J6pL74l40k52P8J64j06Q3K21j13k43k1J11
5072a01P1q2m8N3J04J22J06m0n7J2k18K05k35K00k05Q7K08j77l14K73k16K38L3
5095A9K56J11k55j10j12j03M3K67r7L4K64k72MO4q5j00Mj72j1o3J88O2K18l54
5119b00K64K3k24o9L23k75j62L22K01lO6l83R8k27O9P21p08K77J19l8k58M06l01
5142D1k3j03K5K73j31k78K86k33M72l45P9r2l6J98k06l4K19k71j41M14m37L34
5164A1m18L44J31k71O3O2j30L24k82J30p4L73j71j06p8K51l07J18N3q7L9M2j13
5187i6L64j06k35L30k43j69K83j06j79j7J51J19j81P7J77m99M46k36J06J4l0o1
5209i1J05K82m11J99j84J76j18j4j9K46k04pK18k04R3k43L11l87K50O5J58l43
$$ y = [-18, -48, -25, 12, -40, -243, -171, -244, -95, 216, -66, -50, -57, 317, -23, -275, -197, -33, -139, -56, 165, 52, -191, -212, -101, -30, -112, -160, -107, -3, 119, 225, 185, 128, 140, -78, 127, -108, 92, -113, -26, 182, 5, -309, -36, -252, -14, 19, 275, 386, 131, 21, -91, -194, -151, 116, 19, 53, 317, 45, 49, 113, 28, -72, -68, -240, -251, -314, -126, -64, 154, -200, 64, 87, -137, -206, 117, -158, -320, 2, 203, 200, 266, -117, -19, -246, -177, 544, -164, 113, 232, 194, -64, 342, 41, 18, -85, -60, 213, 82, -196, 90, -143, 329, -16, 63, -29, -65, 133, -73, -107, 112, -159, -300, 114, -323, 11, -407, -63, 68, -203, -140, -78, -208, 116, -166, -36, -110, 263, 92, -14, -92, 159, -148, -30, 23, -64, -25, 17, -96, 268, 162, -73, 257, 14, -155, 128, 22, -157, -174, -23, 96, -85, -8, 169, -330, 116, -120, -14, 0, -30, -91, 14, 296, -115, 84, -100, 76, -42, -56, -75, 171, -33, -40, 178, -26, 67, -176, 135, -252, -2, 63, 221, -122]
5231a22J92j07K60l60K2j2R6K43m6p6K1r5J81n4p1j10J13K56m27k53L79L44k92
5254H2L0l66L11l36M28k09N5M1n1J92o9%k50L29l05ml5J51J59K70l32j53o0N5
5278f7k2K02k77j9L06P9l25j06K24l4l1J49j65J62r1J39m89N98m05J34J16l8Q1
5301A21OR9k25R3k1L27m81J32O6j42l46M99k42L09l59j89J30K63M7k16Q6k97N04
5324A64j75O5l13L21L0n1J85J61o21M63k88R5r4J41k56J11K36l39K21L06L6l33
5346F5J86l14j85m7K32J62J59q0p2m9K7k55L34j11m4p9J99n8j29O3J60k17lO8
5370A2m2J57j72J2Q5q6l85J74J82k1j74L0L33J06m68N16k6k71L0Qm44J04J50L45
5394A55k49K55k84K21j43o3J49J94j49J11k68P8M74q54N60k01Q7j8j7J53n12M32
$$ y = [-122, 70, -37, 223, -137, -115, -127, -31, 212, 166, 90, 111, 16, 197, 143, 72, -38, 75, 331, -96, -349, 30, 374, 82, 112, -254, 57, -279, 149, -60, -5, 36, -15, 177, 108, 108, -142, 187, -118, -122, -157, -6, 153, 423, 91, -62, -122, -67, -89, 113, -164, -183, 123, 202, -123, -229, -5, -39, -70, 79, -86, 76, -15, 124, -365, 233, -172, -38, 78, 40, 121, 127, 226, 1, 94, 73, 400, -81, 51, 117, -25, -371, 128, -114, 195, -164, -353, -223, 40, 87, -129, -43, -340, 164, -11, 54, -259, 62, 92, 41, 226, 387, -234, 229, -59, 36, -58, 83, -173, -62, 174, -165, 56, 362, 398, 65, 251, -63, -248, -295, -63, 99, 258, 178, 106, 57, 84, -171, 163, 52, 8, -71, 128, 70, -59, 4, 164, -53, -56, 12, -30, 127, -45, -33, 52, -34, -419, -245, -63, -84, -258, -228, 105, 211, -257, 259, 233, -38, -8, 0, -444, -340, -190, 155, -94, 161, -123, 98, -45, -108, 41, 235, 86, 197, -71, 7, 481, -373, 187, -14, 73, 55, 38, 191, -321, 111]
5416A11l95M3J59M38n67L10J00k04lq7j06j4K44l32L35r9L7k9J20k02J28K78k26
5439C9j73J70k6O3j13j17m6O7L20q5q4p0o7m8K22j26L20j40l42K68mK32m05L96
5463B51k26j91m0O0K22k05K68j63Q2K21n92L19P4m5M3J75k65K6J17j11j00K95
5485B15k77p4q3J74K89k91R1m36M42j5Kk36M60j45j7k93L12k82K1K67j90K00k69
5508a35K74j74j6nO3j18LO2K28m73L19Q1j64N57l15k22r0Q7O8j25Q8o0r4j06Q2
5533a85M45j25l70K75J92o8j35r9J65K73m67N6J10j49n7pJ41p0j28M11l48n3j82
5556c75M05l6k06J99J80j70j07j48M84J7k53Q5L1j17K02j86L52k82l57J39J65
5577B2k31lK9K35p4j93J65J32J06l27L98k56q7nM3J77r8l65K3M06k39K72k69N06
$$ y = [111, -284, -241, -82, 356, -211, 99, 199, -5, -8, -95, -201, -215, 29, -303, 32, -67, -30, -59, 61, -141, -13, 265, 39, -134, 36, 10, 73, -40, -157, -203, -136, 184, 99, 15, -55, -122, -170, 52, -74, 246, 106, -236, 32, 28, 260, -145, 251, 25, -166, -206, -146, 76, -129, 139, -24, 58, 279, -313, 6, 80, 35, 78, 253, -12, 14, 131, 20, -80, 215, -62, -136, -219, -45, 244, -47, 44, -392, 50, 35, 37, -199, 261, 116, 99, -194, 118, -164, -143, 124, -66, 134, -135, 139, -35, -51, -56, 7, -111, -108, -46, 182, -291, 28, 109, -55, 502, 187, -35, -125, -38, 30, -95, -7, -67, -161, -267, -185, 260, 135, -235, 40, 232, 164, 29, -70, 95, 368, -99, -43, 67, -82, -139, -146, -5, -75, -203, 208, -140, -193, -375, 30, -6, -212, -13, 167, -3, -110, -258, 226, 243, -10, 75, 106, -11, 191, 5, 357, 75, -282, -143, 22, -209, -212, -183, 52, -22, -215, -50, 82, 188, -139, 259, 3, -84, -89, -46, 131, 33, -332, -309, 97, -142, 130, -139, 367]
5601C67k68k35L01j08m16K96J90r4R7j09J37p9J0m33M72k31M3r6K14j07L1RK23
5624B14j67p3j58J85j56K70P3j72kj65M41m79J16L69k23k53PO00m90q9M31j83
5646I6j02l09L19m52L72l2K72m38M15j71J4K11k40k09K05J45M5J62k33l60J1J71
5668a08k65L68J66m04L42O8j86k21Q5L66l96k5L33k96j16M64k39K08K36l35j89
5689a44q7J56J31J84M3n43K15q8j28M11l84L38r2k15J16j4K55p1k4k55o1M15J9
5712A77k15p0k3J63m26L3L15K19K53l96l7R4O4qk02K45j46l06J04k55M47M07k37
5735B00l35l4K18j89K97j65n5l6Q6J38k57J40J5J91k82l12L90j30K23k61j0Q3
5757h5q8J85On8j9J77j99N6m36M60J03J5p4j40K82k33r3N67n64J84j44k42L62
$$ y = [367, 99, -136, 165, 57, -359, -63, 127, 33, 130, 21, 158, 79, 89, -344, 128, -103, -60, -156, 58, -49, -18, -9, 214, 47, -26, -184, 1, -155, 115, 188, 16, 14, -151, 290, -189, -73, 296, 73, -180, -173, 427, -63, -152, 279, 96, -6, -315, 4, -448, -76, -108, 164, -274, 141, -30, -16, 195, -45, -254, -49, 96, 141, 303, 70, -290, -279, -108, -373, -5, 161, -243, 99, 167, -19, -240, -155, 211, -185, -210, 123, -173, -289, 175, -64, 144, 380, 45, -144, -231, -75, 56, 240, 283, -260, -45, -133, -261, 150, -234, 104, 12, -203, -87, -101, 154, 83, 59, -196, -257, 158, 177, -38, -108, -131, 32, -394, -361, -46, 173, 426, 30, -7, 87, 151, 143, -59, 186, 40, -266, -162, -417, 30, 437, 200, -135, -169, 49, -140, 157, -8, -63, -99, -13, 125, -132, 8, 23, 214, -68, -380, 10, -120, 103, -158, -168, -85, -173, 12, 18, -40, -59, 118, -81, -25, -461, -1, 102, 117, 43, -97, 185, -48, -141, 426, -138, 46, -98, -340, 22]
5780B2NJ13k53J54L30k38j76N7K50j28j11Kl6J75N2k54J14j26m0K02k48rL84k51
5804a0o53M03P6L59k27q7mK78j6j86M4p3j02M08k82M5L68N0l05j97K63j38J56
5827A70l21K94m8k54j4L67j93k69J98K75j62O1k18J84J24l07J20K2j62M57o30
5848c06L86l1m7J31k88L91k77Q7M4j01Oj23J62K02l48m15M16J48m0j50k33M86
5870A00k49J94l11K90m8j06l2L29j72N1k70J96J68n1M4l39j40K70K94j63o10P86
5892B31l49J13J15j64p0L56O0l00j9J27n9P4O3k41j23J95j71L49k8k07LK4K25
5915B04n46M60k70p0K16J74l78M4M05k66o7J12p6J09M2m2Q8l05N7K42l03L25l20
5938a65P9J42k23O4j4n7L70j69K5j66R9j84K05K06p5k83n7J28j19L12m6K05n06
$$ y = [22, 27, 140, -113, 41, 371, 133, -43, 14, 264, 136, 25, 27, -9, 166, 218, -36, 78, -48, -88, 114, -134, -143, 241, -10, -663, -260, -184, 175, -52, -139, -143, 135, 119, -67, -23, -96, -198, 210, -72, -27, 341, 391, 86, -111, 152, 14, 170, -151, 143, 95, -159, -173, 194, 1, -268, -70, 205, 43, 104, -114, 70, 194, -113, 7, 29, -133, 324, -306, 80, 49, 2, 133, -155, 236, -41, 46, 90, -11, -5, -128, 34, 236, -112, -527, -111, 37, -3, -153, -386, 100, -149, 45, -266, 24, -24, -130, -162, 167, -5, 46, -224, -28, 140, 89, 133, -206, -346, -76, 218, 55, -555, 231, -118, -5, 110, -54, -124, 232, 292, -8, -27, 100, 41, 115, 178, -63, -186, 9, -162, 187, 159, -48, -45, -21, 204, -342, 118, -152, -222, -6, 168, -210, -166, 239, -27, -94, 18, -58, 51, 93, 51, 139, -166, -109, 133, -170, 155, -165, -86, 56, -167, -103, -117, -174, 196, 27, 52, -114, -15, -199, 6, 212, 137, -146, -203, -75, -194, 118, 72, 277, -229]
5961b29J52K06j45Q2K37k66k3j57K69j22J8J6j76K62k3m3L4j51j61O2L02j50l76
5984c82O85m21l04K21K13l2j33M11m26J63k98J83j2MK50j5K98k19J0l11J23M7
6006E5l88K25J41Pk19J79K7k25J79K92k59n4M6j00k08R1J46J95j0n0J79k44j5
6029a0k89N05Q1k99k0L7j00K15l77L19J61k90J49J00m27M06j59q0R3J14K33k47
6051A15j80J2R4K03k82K38l62N7m5M85k79p5o6Mj92L15Q8O9k21J8j37j75N78m94
6075b32j20M66J09l24J86j0k06J37k42K0N59l22j68qO7Q9R7r9j63M0j89L41K40
6098B68l19o3J04r6Q0p0J18O4k68N72l91K51j95k45M60p7j72j43K12m3j51K00
6120I6k8q4n0L47k28J76n9Q2l42j73K78J44j5j38m66O46j56L5J22j59j10j6K9
$$ y = [-229, -77, 129, -16, 66, 303, 37, 14, -143, 126, 4, 22, 38, -138, 124, 101, 58, 92, -59, -220, -158, 144, -6, -382, 303, -118, -422, -201, 12, -20, -153, 258, -168, -5, -303, -120, -132, -128, 122, 107, 405, 186, 196, -115, 8, 55, -333, -108, 33, 40, -179, 0, 27, -198, -19, 273, 14, -40, 6, -94, -302, -211, -65, 130, 120, 70, 249, 5, -10, -299, 206, 287, -12, -32, 5, -95, 120, -257, 62, 223, -67, 82, 182, -245, 161, 2, -78, 15, 129, 362, 115, -65, -53, 41, 244, -38, 200, -162, -105, -150, 335, 56, -19, -85, -81, -273, 42, 130, 199, -22, -4, -141, -316, 262, -232, -352, 114, 223, -101, 85, 75, -131, 6, -236, -216, 343, 21, -147, -155, -88, 1, 98, -1, -164, -124, -313, 28, 268, -51, -114, -10, -106, -26, -96, 22, 86, -182, 390, -1, 250, 55, -190, 270, 193, 21, -122, 90, 47, -104, 96, 68, -16, -66, 281, 53, 229, 170, 252, -90, -263, 15, 159, 144, 6, -460, 186, 30, 65, 187, 28, -82, -98, -69]
6143f9L6J93k93R7L00l25J94k24J69k5Q4k99N3Q8r5k06L61J49j21r7j6L32k90
6166dQ9j56J3M1j85K79q1jj09K36m0k69K64j22M9m7K13j65j6l1J47k53j15M87
6190B24l51m3J77K90k99r1M7J30P1j68Qk26J40J82l98M67k15j95J14m9J78J4p1
6213f4J71j31l5o5J73O9j6l72M85k16J90k3j06k55M34k90J18j56K60j6m82O09
6235B82l36mJ49J01l17K51O6K64l28Q3k80k56N73k61PL06j35l92K02J81m8m15
6257c07K53Q3k32M62k23J83j54k61J77l4K24k02o7N3N6J4r6K87l61K53k29l8K57
6280I8k27K57j12lj75K92J05j37j98j56M47r7p5J78o0K27n50L15q2P5l29o7M15
6303A41l75L60j03j89K33r3J71J60n42L54j65K32j97K6J61J89p63L83j00jj2j20
$$ y = [-69, -33, 160, -133, -36, 264, -61, 133, -91, 78, 53, 137, -162, -109, -21, -116, -322, 39, 188, 67, -30, -46, 286, -4, 85, -71, -58, -17, -202, 77, -4, -5, -114, 122, 82, -187, 77, -45, 4, -43, 170, 5, -11, -42, 105, -148, -263, 224, -127, -170, 7, 297, -2, -93, -46, 84, 155, -13, -5, -231, -91, 91, -307, 160, -55, -250, -136, -185, -7, 7, -64, 107, -24, -59, -124, 49, 118, 102, -270, 215, -1, 189, 166, 60, -195, 239, -51, 67, -89, 171, 155, -327, 282, -54, -58, 91, 192, -125, 126, 192, 456, 128, 211, -69, -325, 248, -13, -6, 300, 165, -227, -25, 156, 108, -307, -54, 29, -203, 259, 36, 219, 65, -196, -19, -53, 171, -31, -98, -45, 11, 25, -71, 216, -145, 108, -121, -159, 98, -129, 128, 16, 13, -162, 130, 235, 98, -100, -256, 191, 94, 19, 197, 137, 364, -186, 129, 47, 122, -207, -274, 141, -234, 126, 23, -166, 67, -26, 145, 305, -237, 117, -48, 184, -13, 13, 174, 363, -400, -17, -117, -118, -130, -250]
6325b50K68j84K66n2l05J56J71M4k82r5P4n0L23j20L28j21k13n3L6M05j84m99
6347c37L19J51K27l45R0j26Q8n3k25J51NP9q1n7J33n7k59L84j87J7K37J25l06
6370b7L2J70j08l13K46N4n06L01j74lK36K23k85K61P3k92Q1n5mJ40Q8j36K2kk5
6395cj29J91k3Lk75N2K27n3Q6k21L40j80P8P1k53P2Q7j20J01J25m01J37j82J51
6419a19N01l6m31j86M29J41j82o2K93l52J19L61o36K69j61j83L21q3q0L11p1m49
6441b86J84K82o01P56m82M26m68J89j04QK59k60QJ91j9j16K27j33j41K43k20L5
6463b2J35j77J80J39j92l2j11N9M2J64m36N76n77K53P3m33L05j6L84l33j15L31
6485A97J8p4%j27J37l22J77L6J51J89k11j12j54J16p2J94r0m8%N5j19L04l12j59
$$ y = [-250, 18, -166, 100, 48, -257, -101, 70, 114, -168, -263, -189, -239, 84, -36, 292, 171, -42, -95, -59, 346, 162, -337, -18, 133, 360, 15, 105, -21, 67, 14, -211, -60, -55, 24, -57, -114, 19, -38, -297, 87, -100, -83, 154, 279, -27, 5, 175, 67, -246, 0, 54, -452, -151, -325, -328, -92, 131, -154, 107, 180, -112, -31, -86, -90, 50, 138, 2, 24, 22, -3, -132, 59, 36, 39, -236, -184, 43, -10, 76, -145, 195, 15, 93, 164, -89, -17, 70, -50, 51, 176, -225, -88, -270, -119, 382, 346, -85, -271, 158, 299, 117, 55, 348, -4, 115, 476, -160, 109, -52, -235, 86, 3, -77, 234, 163, -286, -102, 180, -421, 335, -147, 279, -189, 0, -104, -96, 163, -97, -89, 102, 83, -33, 194, 61, -80, 163, -57, -22, 113, -64, 116, 255, 63, 31, -80, -21, 21, 185, -251, 325, -252, 1, 74, -359, -54, -70, 314, -19, -134, 197, 215, 141, 141, 14, 151, -171, 6, 42, 193, 382, 171, 59, -95, 21, -51, 143, 53, 5, 5, 60, -59, 245, -67, -226]
6509b26k4J83K08j41N5j47M23k34N2m4j71j41L01j67j71K94l46K57J50j71J97
6530A37J39j80k88Q8K07j82J08J59J34l46L7J41K6J16o8l59J88j54J52K30Q3l90
6552b2L16m85l42O40j3p9K17l42L69k85j05M43p2n1j77j32M9j27n8L09J2m39J23
6575b51M30l97J52L9K23r4j85K64Rk34J90J09l35L00j95p7J07j89J2L90Pk75l41
6598c41j70M31N4M0k24K33L97m66L1m1o2K14J6l0j51M1J35k99K50j04K78k74P5
6621C3j59L46j62j36Q3N3k20K32j01K83J34o44M01l35L9Q7K16l75N43o8l36j76
6643b62L02J0j13L04j55l92M23k07j13J57j01J68J51k26K24k61J86N5l49L73j36
6664C8j49O2k49M19o2q7k52j50M04J02l31M96n27J48M98m74P5KJ34j79k20N74
$$ y = [-226, -250, -67, 141, 0, 55, -92, 331, 97, 149, 105, -66, -207, 94, -73, -244, 50, -296, -39, 111, -60, 137, 276, 96, -192, -104, 103, -79, 29, 188, 322, -24, 13, 154, 180, 296, 228, -131, 57, -97, 55, 285, 368, -22, 294, -191, -533, 107, 94, 15, 232, -110, 259, -26, -131, 312, 240, 189, 12, -120, -71, -198, -256, 53, 65, -374, -251, 179, -218, -66, -27, 196, 102, -83, 181, 190, -44, 146, 255, -80, 220, 25, -52, 55, -134, -122, 268, 275, 0, -341, -511, -80, -26, 14, -210, 23, 420, -46, -15, -56, -118, 96, 112, 82, -69, -28, 107, -192, 58, -46, 232, -42, 33, -126, 220, 58, -78, 5, 58, -162, 70, -31, 252, 386, -258, 143, -192, -153, -66, 150, -225, 318, 250, -86, -262, 40, 50, -63, 241, 86, -306, 117, -90, -203, -46, -147, 21, 172, -54, 170, -91, 95, 150, -199, 174, 38, -111, -49, -298, 121, 59, -28, -280, -430, -26, 76, -255, 241, -286, -138, 360, -114, -39, -37, 97, -82, -302, 272]
6686B72k36J95k26K14M1k91j80K22j75L00j96J22r4j4j36J52j49q9L03k3l9M8
6708B1j99O1P9K31l2P2l66K9J26K04J60m84L45l77K57k66K5J6L70n86L50mLJ20
6732A55l43K84k70K19L5j24j6L14j58j76R3r4k6J10j25k43M04q5o5lK14k22K79
6755A57p2r2K5P0r2p5M0k41K44j51K25J41J43k80j7j73K7L36l35L11q9j92J37
6778D7K1J61O8k95m08K33M20k60k19J4k30M61K12n6j83J63k19J2j7K9L37n95L22
6801A8K22j99m5L5l5l0N0M6J26k04r8L38j53k2J21j56l50L98M1J8l4Qj5j69K03
6826A14J79n4k75j7o1j2K30j59l04K53M13k77m19M83k26K11k60L55k03K02k02
6847b9J86j15K3l15M18k20P8K68n50K52K1K07n95L66j13O5q2L01j59l65M56j34
$$ y = [272, 36, 231, 5, 219, 260, -31, -211, 11, -164, 136, -60, 62, -32, -46, -182, -30, -179, -268, 35, 12, -27, 21, -178, -117, -38, 193, 161, 233, -133, -104, 22, 226, 386, -98, 247, -130, 127, -139, -114, -98, 272, -314, 36, 32, 35, 155, -188, 96, -174, 45, 80, -44, -60, 254, 96, -80, 13, -81, -107, 3, -122, -365, 39, -46, -111, -114, 100, -122, 157, 85, -7, 18, 88, -4, -79, -39, -280, -36, -187, 38, 179, 322, 42, 25, -148, -121, 215, -120, 191, 102, -90, 47, 68, 229, 297, 2, -406, -173, 247, -13, -232, -218, -448, 13, 225, 169, -14, 149, -70, -58, -75, -46, 291, -304, 18, 240, 41, -4, 31, -4, -34, 16, 62, 188, -16, -114, 224, 71, 49, 170, 14, -336, 62, 103, 121, 87, 95, 80, -89, 114, 293, 239, -36, -53, -114, -126, 104, -55, -359, -106, 307, 30, -389, 94, -132, 79, -181, 174, -29, 173, -29, 157, 42, 65, -250, 168, -52, 26, 294, -256, -4, 17, 224, -371, -5, -118, -53, -135, 166, 7, -358, 98, -36]
6869c6%RK65l6p5j88J47K00l63o6K54j59J20j20j04K62j81J5J87j97j08J92n7
6892c9k0Q0L93n99M10j6m19L90j21j54L04k58K29Oj88L02m86J43K69l45L45l12
6914h6O2R2m72N25j86R1q8J80R6k62K50l1r0k15M38n88L71L0p2J7K9k18L50l97
6938a74J41j76M81k61j82r8K20m6N1J04K8k6j45K53k40M9j5J15k51K49j37J72
6960A12q6k04K55k52J48M5k21j52L46nj32M23o0m65N73l62L44m79m0L61K27n21
6982a45K42R2m17j32M73j68J38L5j58L2R1k46M7l9M7P4l3J90L7j7K1ol10K95l00
7007a57O4oJ36J2L3j1Q0k86M02m04L98j48k99M38j79j59K65j50K21k52L9K81l52
7030c4K8k70L10l9J52j20j42L66r9k64j22K17j74L39m70L65k38L32j56M81m38
$$ y = [-36, -36, -27, 238, 202, 127, -61, 86, 286, -77, -143, 111, -48, 72, -48, -152, 110, -71, -56, 131, -66, -174, 18, -39, -59, 21, 414, -185, 225, 209, -210, 180, 59, -95, 209, -49, 180, 186, -2, 300, -186, -43, 226, -119, 226, -86, -24, 68, -404, 121, -65, 26, -62, 118, 214, -48, 202, 171, 81, -134, 304, -284, 87, 117, 45, 62, 91, -127, 223, -174, -33, -209, 272, 11, -171, -269, -49, -95, -44, 60, 88, 62, -83, 170, -70, -21, -36, 79, -172, 77, -60, 112, 26, -178, 77, -175, -27, 18, -203, -355, -9, -14, -146, 277, 217, -248, 325, -37, 307, -172, -212, 149, 376, -145, 97, 189, -228, -360, 113, -55, 83, 118, -40, -8, 83, -163, -116, -155, -108, -34, -67, 123, 160, 143, 164, 158, -152, 143, -157, -93, -99, 37, 49, 82, 71, 151, -135, 267, -137, 261, 113, -186, 252, 73, -86, 179, 29, 250, -2, 37, 318, -34, -6, -276, 34, -5, 147, 27, -115, 251, 152, -112, -234, -17, -191, 148, -322, 43, -195, 137, -19, 462, 24]
7051B4k97L92j16j49Q6J98p9k47j0K89r5J33J24l01R5k85K99k8J4J84j93k02J97
7074C3j35j37N05m8n8j89J71j18M3J61K8j69p8k41K64p3J82j36l20K29L5l30M93
7097A12n15N65n7L4o6K6K04m28j7J14lK4N9O6m8K17j04r0m36M13Q2j01M15n27
7121f1K24n48L82L8q2N5j36J82l53K83J1K02r7j66m27M41K44j71Ql3j82K88Q2
7144A84L1k75n3J51J22n12Q0K47O2o1n30M65R0J54l6Q3k8k7k32J61j51k3L90k93
7168aJ47l6j91k60N47r9o2J91n0j88QJ76k25j13J30M6nj94K95m09L37K33l48M01
7192C30k34j37k2K28m54L84k51o0J32Q5l7R6k9l0m2j94J97J34j19j9l0J33M0j60
7216e9L56k16n2k48L44m4k4k25R6O8o7J97k32M9J28k69k45M38p18N63p1M77k08
$$ y = [24, -273, 119, 3, -146, -60, 138, 59, -188, -198, 91, -4, 129, 253, -48, 47, -238, 61, 33, 47, 231, 38, -164, 33, -102, -239, 266, 218, 160, -29, 142, 24, 67, 228, 256, 87, 9, -232, 32, -41, 141, 5, -315, -86, -51, -381, 112, -403, 162, 105, 139, 73, 99, 303, -125, -142, -28, -31, -7, 52, 118, 70, 287, 183, 93, -343, 70, 152, 51, 466, -61, 163, -385, -3, 35, -47, 8, -128, 54, -299, -16, -5, 197, 100, -66, -493, -52, 192, 21, 29, -4, -186, 102, 184, 215, -60, -113, 38, 160, -352, -272, -25, 37, -24, -554, -89, 1, 155, 119, 202, 174, 147, -85, 76, -75, -98, 292, -1, 146, 110, -81, -341, 206, 107, 45, 236, 186, -2, 6, 182, -43, -156, -26, 20, 15, -179, 116, -293, 44, 277, -71, 330, 96, -41, -63, 165, -289, 95, -156, -216, -84, 1, -36, 60, 31, 1, -41, -235, -38, 96, -23, -42, -72, 61, 101, -59, 297, 81, 29, -219, 125, 81, 57, -168, -72, -4, -71, 126, -106, -57, 71, -198, -443, -5, -723, -160, -231, 246, 38]
7239C8m0j95K48j93R1L44j29L07k67k15M7R2k28k7j23J95j19L19k1l10K85K08
7261C07j47k90L01l12M02k88q2Q6k67L02j96L06J7r9p6l68M39n1K43l09J87M0
7283A45l83j39K36Lj02N8L72m39LL74R9J99k62j89J65j11OJ09n14L99j66J33j7
7306b1K64k30j79Q3j59J6O01l36L2M9J31m88K64n6o9N6o6n0L63o8l73L78l7jl07
7331b03L47k9l15N22j64k08k22K71P5k43J99k9J20l91K30K0M9m2J27K43l62J49
7353A44Q4j94l2j90J88O2j54q2J2N26n92M18l64J14L22k10J95p6J22j04j35j20
7375f6L37n66L50j55J06N0J20l90K36k29Q0J44l61L42Q9j72O7J31k93R3J02J30
7397A45J04r9k22J39j61j22l5N43Q6m46j6L02j26r3r4P1MJ90l21J56j78J49J18
$$ y = [38, -2, -197, 51, -142, -51, 293, 164, 471, 204, -11, 36, 128, -100, -127, -250, -55, -174, 145, 124, -186, 99, 307, 160, -130, 171, -141, 261, -27, -109, -23, -290, 12, -184, 122, 139, 40, -36, -404, 35, -16, 227, -82, 105, 145, -238, -377, -141, -138, -240, -182, 190, -249, -246, 128, 227, 426, 164, -25, 140, 29, 35, 144, -370, 29, -137, -4, -21, 243, 13, -166, -83, -242, -226, 375, 39, 71, 120, 251, -237, 27, -29, -98, -42, -108, -158, 205, 137, -236, 142, 105, 104, -203, 144, 115, -200, 322, 158, -50, -272, -1, 74, -169, 30, 1, 121, -270, -40, -20, 29, -13, 114, 357, -5, 144, 228, 34, 2, -188, 0, 62, -92, -174, -162, 364, -228, 190, -174, -60, 262, 52, 247, 171, 293, 189, 54, -66, 271, -295, 55, -100, 6, 56, 176, -214, 22, -207, -127, 17, -344, -2, 87, -85, -18, 113, -180, -87, 15, 145, 249, 150, -72, 67, -94, -216, -251, 292, 378, -68, -84, 218, 92, -1, -95, -24, -20, 170, -151, 5, -173, -24, 94]
7420I4J26m6j0k65k09J35K27J78j22j19j76q2J40L73k35J11l7k8k57j0K98j9n3
7443A4J04k09j65K50j35JK06k22Q6r0J94r5n2jO0j34j25K22K39j2j57k0J53j47
7467c5K07l04M2J22J71j23k93K88j70r2J84L8j64K81j08m5o8j6ML07l86J02j96
7490b54K2J14M54p0l61p0J71l69M27N3l69L36n8rk0M07n00K17o4j91J5N9r9L18
7514A59j47j2J74k05N4N4j72L86j93r6q7j74L25j93J84n9K11j79k52L0k77J58
7536c11O09j19m38M09R1k23M8p0L3J2j9R2J25J40m46L15m76L13j22J45J31k73
7558c4M6K24k56J63m7l0j62J56J11k74K95l20L20M1l02J87k2j8M3m1O8j93K92
7581B47m99L50p6O9k6l51Q3K86l70M72l51k5J66k96L11K1R2L6j2J3j09q3q6n9
$$ y = [94, 220, 174, 164, -101, -310, -175, 52, 230, 108, -11, -187, -269, -129, 244, 9, 120, 83, 55, -202, -212, 86, 67, 14, 118, -91, -256, -6, -141, -140, 66, -156, -70, -160, 34, -61, -113, -114, -54, -188, -313, -91, 148, 136, -21, -41, 112, -35, 172, -132, -90, 32, 203, 80, -213, 75, -95, -187, -3, 35, -129, 152, 44, -1, -69, -85, -81, 226, -160, -58, -254, -232, -118, 336, 266, -95, -165, 6, -363, 64, 117, -252, 84, 26, 17, -3, 404, -96, 121, 57, -134, -119, -60, -159, 159, 12, 0, 174, -31, 23, 77, -95, 291, 98, 2, -85, -259, 66, -127, 57, -2, 209, 30, -222, -192, -469, -311, 298, 179, -259, 150, 241, 18, 66, -4, 29, 41, 22, 114, 239, 379, -67, 248, -228, 85, -37, 108, 239, -34, 12, 236, -20, 143, 96, 66, -96, 60, 171, -103, 192, -128, 192, 233, -69, 118, 96, 78, 121, 80, 148, -45, 247, -252, 98, 22, 91, 65, -286, -203, 83, -287, 185, -166, -191, -25, -321, -10, 11, 103, 139, 127, 140, 31, -52, -138, -197]
7605a97J4J52J22j32N4r0o6K54j62J74l99K1J25K70J20k13J21j47K77m05K59k87
7627a35M02n51K84Q4qk19pJ59k61L35K9J31k00n6J97l19r4L88R1j48l12M29m25
7650b06J63J14j82L12j3j49k08K1J09Kj85L90J32n69M19j94N0P8oj81N3L10k57
7673CP2k49K23m5j87P9P5J03k09J86j90J29M3L04m86J62Q5j12k4k39L20m0k55
7696b52M79k91r2K19Qk05J84j40K40n9J69r0m54L1L30j49J46p2j66J97J22k34
7718g9j5J25K18m41K99l6k05M86m90M4p9q3N19j61j62J1J85jm27J87r5J05K52
7741A57k46J56l7P7K01l42k1J33nj74K49j31j07k8K00J04J93n57K43j87pN4j4
7764h9m2j79J64L36l26J05M1p3K78m46J83pN6O2J71k29NK96k03K7m1j84N9K3M39
$$ y = [-197, -183, -31, 91, -41, 13, -77, -143, 111, -51, 123, -276, -255, -130, 140, 260, 47, 168, 21, 298, -107, 152, -135, 267, -284, 0, 84, 76, -143, -150, 9, -252, 83, 112, 243, 43, -13, 184, -135, -229, 159, 250, 102, -210, 219, -206, -43, 71, -111, 201, 188, 39, -169, -148, -39, -37, -222, 168, 300, -269, 150, -44, 6, 84, 78, -103, -50, 260, 3, 75, -174, 49, 4, -183, -104, -29, 74, -135, 51, -139, -10, 33, 337, -149, 13, 98, -14, -38, -277, 43, 3, -252, 227, -64, -156, 63, 71, -134, 50, -90, 150, 91, 260, 170, -284, -253, 77, -72, 74, 2, -164, 33, 155, -79, -94, 31, 249, -192, 107, 71, -134, 352, -138, -94, -173, -256, 263, 102, -60, -49, 136, 135, -292, -105, -200, -95, 157, -89, 67, 30, 107, 308, -34, -55, 78, 73, -101, 148, 17, -90, -118, 82, 186, 379, -178, 65, -122, -129, -75, -89, -131, -310, -146, 190, -136, -31, 10, -63, 215, -231, -48, -55, 1, 63, 234, 5, 10, 306, 103, 130, 89, -95, -36, -13, 426]
7789D26k14j17j14J20o9k23M5K58j20J36k21k4L26j13O6m22qJ54K76j06j64J77
7811F9j1k28J83q3J70k1j99P8L7R9l1j8l46K66J19j98N0j67P5M37m7m61K61k00
7835a66L25n8l74K02L54k27j0M4L1j88J36r7P2j36K25m19M73k72j44K66K72l50
7857d1m89O38l5k42nL01k90M44l45J99l42M27k96J91m1j87K55J22k03k5J32k22
7879e4r0nK47J8l1k28J96N0k39L88m34K72m2j95N41m32M6L7k96J15oN47l03K01
7903C03m00M28j23m51M27l19J51M7j54L4r3m0J81K39l76L23l28K12OJ06L2j07
7925I8k12L64j34j81p7K62l52P4P8K17k45J73n9N01o06m7k38O85m1l40O9m0K78
7948B27n6k94K93J00m57O1J05p7M0J94j38K15j68j01m7K18k60L37M4J65l77j04
$$ y = [426, 212, 95, -19, 101, 32, -191, -146, 112, -8, 128, -93, -117, 209, 96, 162, -260, -268, -114, 162, 56, -108, 69, 58, -170, 13, -70, 100, 79, -120, -42, -5, 94, 63, 45, -301, -35, 84, -114, -64, -231, -156, 281, 234, -227, 34, -166, 159, 101, -273, -71, 283, 56, 46, 90, 121, -67, 69, -28, 44, -92, 133, -286, 187, -85, -229, 37, 309, -41, -530, 108, 73, -169, -174, 127, -163, 281, -64, 135, -207, 220, -76, 115, 74, -113, 142, 264, 61, 36, 168, -54, -144, -149, 98, 116, 85, -143, 53, 103, -136, 252, -182, 90, 48, -147, 394, -38, 8, 45, -251, -136, -142, 405, 102, 303, -97, 331, 208, -243, 184, -135, 16, 63, -91, -57, -150, -190, -9, 230, -146, 177, -151, 61, 67, 173, 205, 98, -114, 250, 116, -65, -142, 120, -232, -158, -80, 137, -108, 65, 6, 507, -99, -146, -384, 301, 260, -80, -11, -51, 227, 171, -123, 170, 270, -187, -126, -21, -98, -58, 136, -2, 213, 45, -56, -103, 115, -145, 192, 236, 401, 24, -80]
7970h0j40J81J27j45J55k81K78j28k70K04K65l84K39q5J62l05J01N3K06J16p25
7991d56J82K73K23m28L93j06O9k64qk29K6M75q2o1L04j28p0j4j52M29m41N4J93
8014A82m02J12j90K76P2m3j18K27J32L20l92j66R7l59K11j49N8L83l95O6J81j98
8036i5m4k8j03J72J99k81O08k84o2j62j7m6K44l61K01J37m0K67o67J74J62q8J47
8059C3k03M07k63q2J18K1J54K5J08l01J37l80O3J59M6O6l57N90q0j53o4k93J57
8082i2r2J70j21L58jk34J79r1K7k76K08J1%k85L46O2K09j18m62P4K26j17Q6k39
8106a72K62L6L0q0p4N8mM9j89j98J40L70l00K72p6j14J63k32L2M49p02J97J65
8129H2P0N3k86M29n06O4K4kJ95r3q9J89Qj49K78m89M10j93N5j28k40K18J75n5
$$ y = [-80, -220, -39, 88, -57, 98, -183, 95, -33, -303, -99, 166, -218, 21, -64, 98, -207, -106, -53, 153, 269, -456, -274, -1, 222, -206, 187, 81, 150, -114, -122, -351, -325, 150, 68, 7, 311, 183, 113, 99, -53, 376, -65, -11, 182, -220, -108, -298, -22, 50, 7, -111, 116, 248, 568, 176, 10, 107, -252, -41, -190, -132, 251, -144, -78, 103, -95, -139, -167, -270, -98, 101, -180, 428, 144, 82, -80, -97, -143, 101, -260, -59, 78, 38, 305, -362, -188, -26, -114, 33, -170, 237, -26, -108, 10, 31, 185, 210, 318, 17, 154, -226, -163, -4, 42, 108, -249, 341, 261, 108, 44, -249, -92, -184, -14, -135, 223, 222, -12, 167, 76, 103, -173, 35, 46, 46, -239, 107, 169, 378, 260, -202, -128, 98, -19, 67, -172, 90, 126, 156, 76, 2, 60, 56, 105, -84, -282, -142, 228, -72, 200, 124, 10, 173, -59, -27, 422, -280, -83, 82, 152, 205, -81, 348, -158, -94, -70, -72, 123, 30, -59, 130, 138, -11, 267, -222, 188, -5, 50, -78, -318, -100, 75, 20]
8153B0j29K76j99K66L2m22Q2J67l47K64j01J63k31K67J3k15p8K94o6l90N47l45
8175a32j08M52l71N6K2q7L81qk17j67j23N1J12K52k70O4
$$ y = [20, -109, 167, -32, 234, 266, -156, -74, 93, -254, 10, -91, 72, -159, 108, 121, -94, -172, 122, 56, -334, 213, -132, -240, 212, -159, -103, -81, -168, 213, 205, -12, -179, -302, -251, -139, 113, -157, -93]
8191i3
$$ Imaginary data points
##PAGE= N=2
##DATA TABLE= (X++(I..I)), XYDATA
0@%%%qJ6j6J6k4L2m0M8n6Q0r7J13j44J69k01K44k84L35l92M50n22O02o90P92r02
28d79J023j160J307j470J650j845K065k302K559k847L160l505L885m299M761n273
44b770N839o474P189q000Q928r997J1250j2747J4563j6829J9745k3659K9233l7857
58b1586N3147q8395L13117J07445o08972j55320J32232K86575J96927J87245o4605
69C37810k99206l12711k8756J51477K48652K40053Q1607k55031l57808j35017
79c28930J40812J92539J86923J47635k9124k78784k79608m5517J67776K18667
89I2389J76594L4959j59969k39691j22572M0689J45728J87862J25320p2254k29890
100b0835j75166J811J10937J48077J45278M0203j43399k12636j01085N0931J34925
$$ y = [0, 0, 0, 0, -8, 8, -8, 8, -16, 16, -24, 24, -32, 48, -49, 64, -80, 89, -112, 132, -152, 183, -209, 241, -281, 321, -369, 423, -479, 544, -616, 691, -779, 871, -974, 1091, -1211, 1348, -1499, 1661, -1844, 2041, -2258, 2503, -2770, 3069, -3405, 3784, -4216, 4712, -5285, 5965, -6782, 7781, -9048, 10697, -12962, 16271, -21586, 31561, -56834, 256283, 363728, -245244, -400564, -268332, 18243, 215170, 402415, 337810, 38604, -274107, -302863, -151386, 97266, 337319, 418926, 163895, -193913, -328930, -188118, 4421, 191344, 338979, 309855, 31071, -248537, -294054, -126278, 92389, 268983, 303942, 143973, -95718, -218290, -177601, -31873, 155989, 281309, 209055, -20835, -196001, -194190, -83253, 64824, 210102, 250305, 106906, -105730, -206815, -155884, -20959]
111b0959J58336R4091o6498j79803j28650q583O2545J13366J42490M4813j35004
122G6144j83443n6025O4596R0299R6705Q0042l0480j49653j31448r652P8703J08215
134C4003J02673K3444j01777j39388n3627L5376O9247R1135P9649k3477j30610
145a3352j10337R14O9778P8569O9502K1616o8629j12089o0324K1491P3030R3103
157F3272N7740l7907j06171p5727k448L6450O0172P9277L4129o6557j04554m2818
169a05142K7574N2643O2714M7244k0955q2135o3026m675K8968N2483P0172K3402
181H9267o5179q7689k3766K6918L1813M4516N2316l828p4956o6543j172L5031
193d3272L9909M4201K0179l8409o4846k8505J4689L0943M2305L8185j1314n9695
$$ y = [-20959, 137377, 231468, 164970, -14833, -143483, -152066, -89521, 23845, 166335, 211148, 76144, -107299, -163324, -98728, -8429, 88276, 168318, 137838, -11815, -143263, -152915, -74212, 34003, 136676, 160120, 58343, -81045, -134672, -99296, -30049, 61086, 140735, 117258, -13352, -123689, -122775, -52997, 25572, 95074, 116690, 48061, -64028, -124352, -102861, -29831, 63272, 121012, 83105, -23066, -98793, -101241, -64791, -4619, 74658, 108787, 42230, -62324, -105142, -77568, -24925, 37789, 85033, 64078, -18057, -81083, -85758, -56790, -4307, 65865, 89267, 24088, -63601, -87367, -60449, -28636, 15880, 68196, 64368, -10588, -77131, -78303, -43272, -3363, 40838, 61017, 22608, -42238, -70743, -56054, -25111, 17194, 55379, 44065, -15630]
205a5630m7782J594K6930L1583L5260J6849l0317n4491k8365J1663L3990L8957
217B0241K2846j5169m0637l0331o467J1238L1165M0240R667l5408m1150j1834
229d5599R505J8614K8794K3703r773l6473k7425m446J3027K8576L2280M170l1634
242C319l2106p547N136J1211K7237K7908o731l7816k6634K554J4692J6897K0420
255A8540P854j7620k7603j2693M862J6022K3894J6294r640k8420j9957R75J0890
268a6602J5890J9778R353j4272k7148j5738N365J6648J8328R756m470j5900j5164
281a4176n980O299J7055J7533K369j5922j8510p591M273J1403J6086J1496m302
294B0033j6969j6259n495P078J5390J5098K813j0694j2515p704j268O410J3957
$$ y = [-15630, -63412, -61818, -34888, -3305, 31955, 48804, 18487, -36004, -64369, -52706, -18716, 20241, 43087, 27918, -12719, -43050, -49517, -38279, -7114, 33126, 42793, 7385, -33765, -45599, -36094, -17480, 11314, 35017, 25244, -11229, -38654, -43100, -30073, -1497, 30783, 34953, 3319, -28787, -36334, -31198, -19987, 7250, 35158, 28427, -9389, -36023, -33469, -18777, -1880, 18540, 26394, 8774, -18829, -31522, -26660, -10638, 13256, 29550, 19910, -8510, -28467, -27492, -16602, -712, 19066, 28419, 14147, -13001, -28739, -23374, -6726, 11602, 21358, 16888, 988, -14176, -20156, -13857, 3198, 20731, 23100, 7178, -11332, -18923, -14650, -3247, 12839, 24335, 20033, 3064, -13195, -18690, -11612, 3778, 18876, 21689, 10995, -1520, -9224, -10492, -4082, 9875]
307I875J0556m717j5028r796J94N435R657J1265L137r927j3808q522P60R969J3335
322A2385Q111l775j0958q548m036O30P860J1313M541q076j0539m601K196O151
336B654P775M684l790q243q078l846L126J0825J1466N44q587r281m001o32J942
351c442Q143Q260L14p921q176k279L353N928N029N7n308n377l238j8L986Q545
367G856O311k989r949p568o37K890M758N363L894j675o453o093j419M037N601
382C927K651k116m246l232q30J385L946M549K101m129p318m428J603N197M892
397C952K794k34k760n794m135O37M666M513J077k272l219k098m18K361L166J980
413D216n41m228m381j912L085M718L400K13j667l507l835k019K708N246K742j202
$$ y = [9875, 20431, 15714, 686, -9110, -8916, -3481, 6176, 17441, 20578, 10651, -3157, -11679, -10919, -950, 12385, 20496, 16721, 5763, -2785, -6821, -6191, 1669, 12982, 17523, 9447, -1092, -5693, -3497, 2654, 10429, 15113, 11323, 3080, -4998, -8844, -5718, 5107, 16573, 17117, 8530, -751, -4752, -5384, -3442, 4701, 12961, 13275, 5354, -2822, -5101, -1748, 4180, 9209, 9266, 3958, -1419, -4657, -4675, -689, 7856, 14167, 11178, 1229, -6339, -6976, -4086, 672, 6035, 9929, 8254, 1801, -4292, -5711, -1674, 3927, 6578, 4462, 216, -3016, -3846, -2461, 1485, 6034, 8135, 4006, -3312, -7740, -6137, -940, 3952, 6746, 6512, 3752, -2042, -6177, -5540, -874, 3639, 4716, 2444, -775, -2873, -3291, -930, 2236, 4216, 3675, -553, -4934, -6846, -3761, 957, 4357, 4570, 2903, -604, -4439, -6458, -3750, 1496, 4238, 3036]
429C036k563k188q96J19J335K091J804j583l697k192Q24L576L558M17j823k516
445f98j987j845q72L385M249K197k807l813j220O92J142M22J835J293j640l193
461b860j436J145L099K298o08k511j652q30m53O43K348L057L69k852l259j106
477d608J966J324K86P73N79q31k527j023J664K585R32j298j819j063p1K63P94
494b074J668J600q45k523j469L34J140J131J072K17q91j409o22j68J067J681J085
511I94j289j777l35O15P55o6J045J179j413k541n2J650J118Q4j07O59p67j769
529b017k11J003K097L92n86q98n94m23K35P97P97K94N5n60j480j18J139K250k11
548A961k146k52R23p27j235J392L257L85l222j294J057L47j224J426J916j44j521
$$ y = [3036, 473, -1715, -2611, -2492, -1157, 934, 2738, 1155, -2542, -4734, -3910, -334, 3224, 3641, 1818, -698, -2685, -4530, -5402, -2017, 2232, 4429, 1622, -2191, -3411, -2719, -1577, -1155, 680, 1973, 333, -2860, -4296, -3151, -52, 2246, 1638, -873, -2525, -3355, -3808, -3165, -817, 2240, 2609, -243, -3502, -4608, -2642, -1318, -1032, -259, 320, -511, -3038, -4061, -2397, 188, 1120, -178, -1997, -3060, -3131, -2868, -2074, -406, 1194, 349, -2174, -3643, -3309, -2169, -1038, 34, 251, -640, -2049, -2671, -2839, -1772, -91, 994, -295, -2072, -2407, -1792, -1037, -1103, -58, 1121, -292, -2833, -2885, -1235, -117, -33, -140, 519, -248, -2017, -2228, -1225, 872, 1264, 678, -220, -814, -1237, -1002, -205, 592, 886, 941, 381, -1099, -1217, -78, 2172, 1961, -185, -437, 486, -241, -1476, -84, 3173, 3558, 336, -958, 99, 446, -778, 648, 2564, 2420, 899]
565H99n26Qj62n7K127R40k650j550J429J087j172k76K934O23l032k206R73J925
583A314r14l8K267N69k081j701J97R92o21Q60J065m62j153p58O99Q49m22L99M51
602A512m42j980m10J499R63p65M88J387o03k627j052J783J655j195o20J727J030
619B350k378j661J412J337j046j429J881P23j426n90J632m8j401L88J302j100
635e4k064Q35K442m38j924Q40K349j059k625Q5K064p7j949L53K405J24j208k97
653a98q6j45r68P43O61K3L14m3j35n55o15R40Q51m83q51k22P66J23m46r3K336
674A917j6k061j516J105P16q97k12K247J225j761j658L73M45j017K16K064N86
691A756j405r57R11q8j354J249J783o83k519R9J519k22j142J516K265j368k342
$$ y = [899, 373, 381, 219, 162, 2289, 3229, 579, -971, 458, 1545, 373, 97, 3031, 3654, 622, -1584, -611, 1314, 400, 362, 2629, 3198, 1117, -584, -387, 605, -16, 844, 1909, 1447, 294, -464, 235, 1084, 662, 1061, 1512, 1070, -910, -1320, 179, 1142, 377, 865, 2252, 1649, -978, -2030, -247, 1408, 213, -407, 1320, 2350, -28, -1689, -277, 1060, 14, -1415, 466, 1189, -237, -827, 805, 757, -644, -256, 1046, -54, -2118, -1283, 1159, 721, -1203, -363, 1986, 927, -1698, -1613, 451, 374, -1575, -1222, 1183, 1307, 99, -198, -284, -429, -1397, -654, 7, 30, 344, 301, 166, -389, -1004, -64, 787, 304, -547, -769, -3, 120, -326, -419, 1917, 1901, -160, -1676, -571, 145, -752, -964, 1283, 2508, 747, -911, -538, -93, -1110, -894, 1170, 1756, 351, -606, 305, 217, -1137, 112, 1895, 1212, -1307, -1208, 311, 89, -1053, 463, 2728, 1360, -982]
708i82m27J127l43q89J099K026L94k197p42N98j17p00O31J420j57r89p24M59L12
727b01q42J217O04Lk164k94J469mo41K19K262m85k792o52K179J44j906L09K904
746A329p8k472n04K036m29j970Q20K195l74k161O75J706j676r87J837J654j450
763A51k245J365R73j173j158K654J357j693j868Q11R72j039n84J481J682j454
779B32j125R25L01j111p90J851P66r01l78M27K63q92n97J670N78r74k52J91n5
798A29m47n61J549R47q67j516Q17O16q58j137J783J492j219j428J058Q20j229
815e1o86J549P35o51j344R02K63n08n58J452M71j329j71O51o1j247j32K152J54
834A591j267m25Q83l65r03n7J338L19p48K18J73o20k77J65O36l7m37J17n1m79
$$ y = [-982, -1409, -282, -625, -1514, -415, 1611, 2005, -192, -934, -336, -453, -1153, -522, 898, 741, -248, -972, -513, -201, -1043, 174, 778, 781, -1383, -1677, -208, -212, -853, -634, 1628, 1143, -1649, -2301, -122, 22, -1884, -1575, 1329, 1251, -1221, -1725, 311, -118, -2088, -1268, 927, 553, -1608, -933, 773, -903, -1890, -53, 1601, 151, -2094, -729, 244, -929, -2087, 567, 1924, 231, -1637, -826, 146, -893, -1477, 4, 1686, 232, -893, 32, 333, -778, -1568, 283, 1049, 148, -230, 197, 460, -432, -1029, 641, 1219, 245, -7, 184, 129, -318, -879, 670, 1617, 750, -766, 51, 667, -191, -1328, 455, 1947, 728, -700, 358, 1178, -51, -737, 812, 1547, 896, -448, 454, 717, 209, -349, 1103, 1574, 245, 74, 725, 664, -583, -715, 1437, 1591, 324, -101, 782, 417, -486, -543, 795, 1114, 366, 584, 757, 137, -140, 25, 661, 624, 187, 304, 253, -226]
854b26J80N2K82L05j83o76O5K96k76j95N75O91n00r69K23P66o28l85P54O79m80
875C50j071J59J060q92o23J029Q07j098m27J013j22j065J21Q91N02j173l1Q53
893B83l85n56M02R17m96p60K00Q01l34q50L94P27J86j109J43M47j28l69M51O9
913C3K88r5ol87p1k09J86K94K28n67N35J39n24j77M2L65M4l54K67R8N08o41m56
936d60Q26L8l40m52M61k05l6j31O76L44p70L55n8m30l68M87K32j68K6L22R2p12
958b71r0P0O45l86n70N49O46q47k27R24j70j01o53J73J54j63OJ93Lk63R00m36
980H6m68Q0L99j49o31K57K99J43m84K17j81J57L04l0k27j23L61j22rn16L33K81
1002b3l38l48N83m8j94k17L54l8K33k75K37l21J43M91k90m30K39K17O6o96O3N41
$$ y = [-226, -46, 6, 288, 593, 410, -266, -201, 95, -181, -376, 199, 890, 390, -579, -356, 410, -218, -603, 151, 830, 350, -721, -562, 498, -394, -1017, 12, 819, -279, -706, 307, 185, -880, -759, 132, 634, -539, -570, 283, -102, -658, -256, 661, 165, -595, -395, 406, 72, -778, -384, 343, 529, -580, -437, 10, -118, -487, -36, 33, 321, 226, 220, -167, -238, -447, -261, 33, 261, -306, 229, 368, -156, -333, -291, 74, 118, -236, 31, 129, 637, -4, -460, 366, 404, 64, -388, 73, -132, -168, -299, 377, 721, -49, 306, 248, -182, -550, -63, 169, 1, 27, 349, 441, -271, -361, -291, 354, -32, -602, -53, 593, -254, -481, 443, 273, 172, -481, -308, -154, -317, -311, -118, -115, -378, 522, 86, -382, -302, 97, -52, -683, -426, -127, 16, -468, -251, -432, -275, 29, -1, -228, -351, 10, -112, -121, -637, -304, -23, -361, -709, -126, -174, -368, -585, -231, -269, -36, -311, -74, -395, -252, 239, -51, -481, -242, -25, 41, -655, -592, -51]
1024e1K80o74k0J70n6L96n47L55l38N24O1m26J57J3K59k15P9L96j45j03m90J89
1046a86K63mq9n3k09M22k04K22l33K69N9r5j70N2M18P8o24K88K10L0j48r8PM50
1070E55l37j4M0%r7M10j08j80o01O62Q9k96j11L14K50o78Q0L40j67k18K78l05
1092i4N01k69M2j99J18Q6L4J09j91K11r9l10j64K22K78Q9n53r1L54J30k18m68
1114d82K28N18j88k02l29K60K76P8n36L20J27j33j90J45m08N01N9j65n1L68k3
1135A73n02K46o9L59kk23p6Q5L11l81j95M13q5K23l25K31n41L92j78K8l9M22j04
1158A63j84l08L04R9Q1m3J5o0mL51l12j74J45K3k42K1M3M30k10k6J68L86m84k75
1182i3J96o3L30m37k24O35k65n4J46j29m4M1J96J11m87J2N59j9m06J01O2j0j84
$$ y = [-51, 229, -445, -465, -295, -351, 45, -502, -147, -485, 39, 100, -326, -169, -156, 103, -112, -33, 363, 218, 115, -375, -186, 77, 73, -16, -69, -278, 144, -60, 162, -171, 98, 157, 62, -108, -56, 362, 440, -184, 104, 314, 344, 196, 98, 105, 555, 218, 204, 244, 244, 147, 557, 449, 269, -332, 330, 419, 123, 12, 326, 576, -102, -22, 318, 151, -67, 211, -94, 407, 138, 180, -19, 99, 185, 219, 328, 137, 348, 249, -61, -225, -3, 275, 364, -189, -280, 74, 204, -14, -482, -254, 264, 76, -126, -455, -195, 81, 159, -377, -57, 70, -63, -253, -108, -516, -15, 44, -121, -172, 196, 173, -329, -83, -152, 207, 205, -18, -94, -9, 302, -79, -274, 139, 54, 277, -48, 183, -358, 34, -144, -116, -155, 267, 163, -21, -329, -25, 74, 155, 112, 127, 67, 63, 414, 102, -72, 73, 96, -146, -125, -82, 348, 138, 112, 280, 666, 182, -93, 103, 40, 370, -67, -291, 344, 79, 25, 171, 42, -2, 39, 235, 346, -141, -129, 430, 411, 5, 106, 168, 158, -26]
1205b6k46K38L68k30m33l93P29K15k80n1K06k10j28M11k59L22J6l41L25n02r0
1226c59M30K60n60J7L92J75n21o18M94N34l82n02R22n6m96q3M1M60k52j72J42
1247a34rm97J11K72m3k3J63N37n96k53Q8L09P0m09L9O21j25l65l76L7N28j84j70
1270d09L01N84j026J43lM78p3k85K19K29o34K9N56k48r4jN23k99m25p0P32k21
1292Fk76J46R93k33r68m7M48R3j94l20O23J82o95j89M98K13k99J90M3j63l55J63
1314a41K75J12l13L73L01j89k98j91K03j58k86L28O62m45l89J27K78k5l27L52
1334B49L39o1n49k32K45L55m79J96M86k08n99N18Oj53m15O55L16o86k11j6N52
1355C08m74k10M31O01Oo43j28N89o66q7N5P83n87j95l9J24J55k01L50R9l45n04
$$ y = [-26, -272, -34, 334, 104, -329, -722, 7, 222, -58, -109, 97, -113, -241, 170, -89, 233, 249, -92, 233, -269, -359, 71, 331, -229, -212, 180, 355, -166, -784, -290, 244, -138, -640, 282, 226, -270, -353, -312, 148, -104, -276, -134, -143, -640, -529, -257, -300, -323, -160, 377, -219, -472, -384, -75, -5, -414, -375, 246, 121, -244, -620, -583, -55, -239, -409, -108, 476, -550, -407, -410, 68, -5, -290, -71, 158, -476, -447, 109, -139, -233, -234, 289, -10, -435, -505, 227, 6, -270, -124, 869, 636, -332, -379, 69, 162, -32, -352, 271, 453, -242, -431, 67, 280, -19, 171, 214, 51, -304, -141, 134, 246, -67, 306, 607, 418, 120, -71, 132, -26, -312, 16, 678, 233, -156, -29, 249, 224, -103, 249, 588, 527, -22, -254, -9, 346, -133, 63, 549, 341, -258, 260, 266, 113, -302, 353, 669, -17, -228, -244, 308, -166, -376, 55, 656, 662, 19, -109, 480, -186, -273, -218, 565, -22, -217, -256, -132, 23, -178, 172, 271, -74, -578]
1377e78M70NK9j74P06J89o87m45L75K66j8l76M41N3k17m72M22J66l77L20k07J55
1399D6L64o16K15m2k06K17j3J87m33K98p7M4j88k71L13M11j85l86L34M20m71k85
1421c24L92L44j10n99J6M72j04k19Q0L88j05l24Q9%l31K83L78j42l70L34Q8l47
1443a11k83J69N10L64n05m29M05P7K27l93K04K84m46j90k7M18q8k86L17M07o93
1464f9k32L75L1r4m25O52j9k09n80P27O9n61J51M62j32m35j91M96K37n50k41Q91
1486C53l16o3j68J46j44L5J83j81Pp0j99M68l66j29K22L68K23o36j30M58Q5q11
1508f65L24M40J09l89k45L65M2l82PM14L30m78M3k4o5J12j16J31J78j82n5M39
1530C33n69j94L60N02o8o10J19L00l5m5m29L30N03n57k63M81k31l2j14J60J37
$$ y = [-578, -108, -103, -74, -248, 458, 647, -40, -485, -110, 156, 138, -238, 203, 256, 39, -433, -11, 155, -222, 98, -109, 46, 410, -206, 9, -33, -239, -22, -35, 152, -281, 17, -60, -16, -204, -475, -162, 249, 64, -322, 12, 432, -39, -324, 68, 412, 302, -297, -281, 191, 87, -132, -52, 336, 231, -93, -4, -4, -335, -52, 326, 184, -186, 148, 236, -111, -394, -225, 285, 649, 144, -285, 120, 197, 424, 31, 235, 519, 73, -117, -144, 274, 186, -100, 217, 624, -69, -301, 74, 105, 11, -414, 238, 219, 10, -570, 157, 226, -335, -184, 278, 146, -289, -480, 16, 253, -297, -538, 353, 37, -26, -194, -48, -192, -157, 26, -155, -148, -218, -417, 51, -315, -444, -222, 146, 369, -267, -397, 61, 146, -665, -341, 99, 208, -181, -426, -61, -19, -401, -394, 20, 350, -128, -85, -109, -174, -62, -178, -47, 131, -51, -106, 333, -236, -430, -70, 432, 364, -246, -127, 173, 138, 93, -336, -6, 497, -60, -323, 158, -73, -105, -219, -59, 78]
1551G8k70J64Mj53N7J54K38J99k60O9l19j36l76K99O58l08R6j15j6J90k66J62
1573A49o8K25l66j93M52J18l37L29l31N5J13j18J20O7k56L06J00k94L50l16K17
1594C22k02Pj03J84l03J38m0j1j2OQ2J90m0m58L05Q1K05j86l79L49r7j34o0J39
1618a7J45l39J57k57L50n9m5RJ7l54K34J81j3P0n5O9J46l79J51J88n16L41j31
1641a07J63k40N8j8J34o7l7K96k95k40N03L3k54M88k76m27O87p78M33j7K0l53
1663b94L36J16k40k1J67m08J87O6K75k89KJ42J00l65L82l7J2j67J48k05K90m65
1685b68K29J92k10r1K62l70J26L71k58L23k44O1K00n01K44R3j94N96l42l17O0
1706c8J58j23J25j45l7J32p5K3l10K35J45n7J93j67q3O5r9R4k34L62m77L18P6
$$ y = [78, -192, -28, -24, -177, -120, 34, 272, 471, 211, 280, -39, -175, -551, -252, 406, 98, 194, 79, 63, 253, -13, 149, 81, 306, -60, -253, 199, 317, -20, 309, -22, 33, 146, 28, 148, 215, -41, 265, 365, 71, 421, 105, 322, 120, 127, 24, 208, -95, 43, 3, -8, -20, -14, 68, 258, 218, -240, 65, 146, 351, 165, -214, 135, 38, -96, -156, -17, 128, -211, -54, -311, 39, -20, -65, -56, -39, -393, -159, 22, 9, 79, 24, 93, 239, -140, 11, 199, -317, 24, -107, 56, -184, -126, -144, -10, -77, -114, 182, -113, -353, 150, 183, -71, 417, 141, -286, 401, -377, 56, 39, 59, -294, 42, 158, -82, -103, 64, -344, -157, -91, 184, -105, -103, 39, 139, -226, 156, 119, 131, -36, 112, -93, 197, -268, -39, 153, -57, -148, 114, -256, -130, 241, -17, 306, 62, 123, 323, -178, 66, 159, -35, 561, 219, -98, -38, 120, -3, 122, -23, -60, 72, -3, 20, -290, -55, 90, 33, 226, 59, -24, 41, -58, 36, -198, 164, -313, 5, 81]
1729H1l4L7k98K43k81K65k37K81l42M27L8j90k41K3L67j59K17k45j38J59M5m6
1751b8k43J22l4L26m77K05M0J25l8j97J58mk02r8K94j20K14j58J23j09K6j4j15
1774b04J21j00L54j30n3Ko7J04R7k92J93J8j69P6j21K01j10J42j17j25N7K13j61
1797g1J74j31Jj11L17j18L69m91M6J48j46J01k36j28M90k30j69K46m3L6J10j65
1819al3L1j07K9l3L33j73j3r2j24PL15j25L16k00k26K93j8j82J57n7j01M1Pq1
1844c7O9Pk82K55R0R3k11oK62m38J33J24K09k89J4N0K41j58k9O5N8j37K17j79
1868A21l19K32j41j10J71R2j92M31n35K72l31K78K28m43R1N51n96P8K17P2l82
1889b15K16k1K39k65j01m8K35Oj77j01Q2L7n0R3Q5n0j40K79J5m4r4m4j75O44m39
$$ y = [81, 47, 84, -214, 29, -252, 13, -224, 57, -285, 142, 180, -10, -251, -228, 139, -20, 197, -48, -186, -27, 18, -28, -271, -149, -183, 143, -334, -129, -89, 36, -2, -199, -41, -45, -247, -345, -51, -171, 43, -115, 8, -101, -75, -89, -204, -83, -183, 171, 41, -12, -10, -77, 27, 124, -168, 25, 43, -126, -50, -171, 30, -80, 62, -55, -180, -123, 90, -71, 103, -28, -27, -138, 179, 61, 430, -61, -15, 133, -13, 88, -148, -276, 214, -16, -185, 61, 18, 54, 164, -1, -34, -3, -110, -81, -114, 219, 46, 33, -59, -183, -176, 139, 14, 330, 130, -96, 197, 179, -3, 154, 97, -4, 37, 44, -37, 32, 39, -243, 12, 102, 195, -16, -22, 240, -198, -65, 59, 268, -21, -7, 43, 284, 126, 97, 162, 220, 83, 300, 121, -198, 34, -107, -217, -46, 46, -146, 285, -250, 22, -309, -31, 197, -246, -155, 396, -200, -122, 95, 167, -215, 1, -20, 219, -46, -147, -195, 40, 46, -131, -232, -150, -113, -163, -70, 15, -35, -175, 104, 119, 75, -19, -63, -238, 406, -33]
1914c3O4l0kP6k64K28J37l27L09j49OM4j96J81k47K10j59N2L10k29J6j50L52k96
1938i7k4K74p4k6j14J35J70k94M31l32O8q3l38K75J00P0ol22K69Q8k85J69j17
1961f3M8J14q3%l60L43k83Q0J9R3K94n8k70m8j46L99q6k3K9k39L06r1M5L8k5l7
1987dM69m15l16K15K08j90p1J5J30pj4k26J87j80j2K71j3j91m1j45J95M7mk45
2011c37L02k01N0K70r9J38k89J97K1k21J32k31M10K6m02M61j21p2k13k22L52j67
2033b16K68q6J09J36q5Q8l17K63m3M0k7j2l64M46j54q4l55L03L24l31J89k05M17
2056C04k49j47K50Q4j13j49NK79l38j42K29J85m6m0k80L83j20k57K56J27Lr3j99
2079f8J70l8k05J42Oj68j48K47J76l71J67J52L6l00%J84o0l10M24l4j5Q6q7N3
$$ y = [-33, 31, 1, -1, 75, -189, 39, 176, -151, 158, 9, 15, 59, -137, 44, -203, 7, -152, -100, 210, -19, -3, -153, 199, -97, -121, 153, 79, 53, -61, 74, 244, -50, 381, 49, 117, 34, -304, -29, 71, 141, 135, -187, 82, 170, -115, 54, -63, -15, 99, 16, 16, -344, -1, -284, -204, -185, -92, 202, 144, -126, -174, -320, 79, -7, -30, -1, -240, 66, -25, 20, 58, 33, -4, 465, 50, -266, -51, 157, -33, -104, -89, 41, 34, 20, -206, -19, -199, -211, 60, 47, -144, -185, -330, -135, -88, -92, -337, -35, -236, -186, 84, -15, 123, -166, 31, 52, -169, -37, -268, 142, 168, -234, 227, 106, 34, -179, -401, -49, -216, 52, -34, 75, 211, 126, 214, -103, 160, 117, 157, 130, 118, -246, 200, 46, -38, -393, -90, 234, -97, 92, -113, 304, 55, -92, 158, 242, 129, -20, -15, 264, -74, -216, 13, 198, 152, 112, -168, 215, 95, -162, 94, 221, 224, 131, -68, 102, 64, -141, 1, 7, -161, -309, -62, 114, -257, -90, 62, 98, -202, -202, -18, -78, -388, 36, 2, -13, 73, -14, 39]
2103C9K20l14k08l0J05Q8J9j5j4j05M41K20l55p1j68K45j12O2j50J97J01k99j11
2126b15J63L6J76k62L53r1j62K89j76n47N38M9j50Mr8J75k04L41j75L4j18K21
2148A81j63m3L6M7k28j08M01J04k34j04q7J07j50J78L73m92L68K9J90k62j00N43
2170E86o16M10m71N2K06M5j17l91O85l83j51J30R4J40k45J7L20k17R9j84qR4k32
2193a37K58J99m00J17M7J23m92K77K27J72m96J20L1j22K23l34L8J64k56J42l5
2214a34K3n1K15j23j60L48K66l41j4M4m65M50j49j56M14k89K11L8L1J67l04q4
2236f3O2J66q1j9rj31J41j2j7L5n2m1K92n53K05j34Rj0K55k88J99K6M7o7K7n3
2262f6O0J39k18K97m74K32j97J60K57j92k1k78Q3L39N7k69J33j78k2M35m9l44
$$ y = [39, 259, -55, -263, -293, -188, -100, -81, -96, -110, -215, 226, 446, 91, 20, -148, 97, -15, 47, -103, 94, 195, -104, -215, -52, -16, 160, -102, 251, 160, -2, 287, 111, -436, 102, 151, 1, 5, -93, 82, -122, 219, 44, 78, -40, 181, 18, -25, 11, 58, -170, -278, 123, 227, -7, -111, -198, -91, -241, -63, 310, -182, 186, 215, 405, 143, 43, 586, -30, 380, -91, -39, 167, 212, 95, -296, 389, 6, -145, -15, 79, 219, -26, -9, 311, 94, 193, 9, 1, 95, -137, 121, 320, -80, 37, 84, 207, -285, -8, 219, 391, -105, 15, 46, -76, 147, -187, -149, 15, -241, -99, -134, -111, -162, 53, -70, -230, 118, 384, 43, 29, 73, -392, 58, -91, -247, 167, -122, 89, 127, 158, 325, 21, -63, -1, 165, 84, 65, 56, -75, 66, 54, 37, 72, 20, -21, 271, -282, -77, -211, -202, -212, 43, -245, -46, -20, 27, -40, -13, -66, -6, 133, -85, 212, -262, -30, -227, -67, 190, -2, -23, -301, -218, 121, 178, -91, 42, -136, -158, 277, 228, -116]
2284a16J4Q5K90j68j43k4K56n2o9l69L1J41j41L40r8J55j51K56k24j56J68K77
2306C02m97K12J9J45l15J5%j18K43m3J8L14j37l49p1L84n9j54J98j00K62k99K82
2329B52l53m32P69k34K40r0j48n4K07o5Q5j4n9l09J33J55Lp3p6K21k00J93m00
2352b49K18k27O08l25j47N6J39k96o0L93k31j46L50Q2j53j04L14k16l64O08k51
2373ak92K30J37k36pJ98k40j32M00k56M03l88o4J31O1K29j70N7J8N5K8l49n4j8
2397b60M73l08j6K39O4n23M91K7k75K59o65Q10j75q2O7j76j70K79K26n18O6J45
2419b2J41J7j76K01j28J89o6l38K67n0K3j24j07J23N7j30J59j18K25k55K72l96
2441b36J23j19K00l30K78J46j19O2J64J04k63N0k5p3J13j26J11J89M3l85j60M1
$$ y = [-116, -102, -17, 273, 105, -38, -62, 194, 142, 73, -296, -265, -124, -265, 75, -23, 132, -19, 237, 13, -143, 25, 302, -195, 17, 36, 181, -134, -119, -119, -237, 6, -37, -19, 295, 158, -191, -262, 122, 63, -91, 107, 7, 269, -30, 252, -101, -533, 236, 2, 242, 152, 4, -50, 157, 92, 177, 163, 104, -205, -72, 83, 86, 13, -63, 158, -42, 151, -249, -31, -258, 350, 25, -122, -66, 73, -223, -283, 110, -121, -267, 83, 165, 12, -92, 222, 6, -358, 250, -1, -293, -63, 74, -162, -169, 29, -211, -343, 57, -199, 204, -184, -248, -117, -56, 173, 3, 60, 78, 133, 161, -188, -242, -260, 213, -95, -111, 128, 192, -331, 160, 187, -88, 171, -494, 316, 141, 59, 126, -50, -220, 59, 285, -233, -167, -22, 119, 136, -40, 161, 33, 222, 156, -182, 85, 35, 58, -66, -173, -50, 7, -123, 36, -82, 143, -112, 160, -236, -113, -232, -32, -362, -84, 62, -57, 5, 169, 273, 10, 60, 35, -38, 75, -51, 60, 249, 292, -93, -253, -212]
2463b12K10Ok54L15P2k85K6K54L6j82j10J06J49k15r6j00N9L51l48j81L35j91
2485b55J6K90K44l09J10j5j6l03J34qL41j61j37l94L68L5k95M1L37j73OK91K39
2508C86k98l28J38j30L63k32J4L98m84M6J0J12K1L3p0O7%j50M2j19L53n34N47
2531A85k21k2J67o4k82L59k47j51J13M39l3j4l54j82N64J73n27j05M25N1j90n3
2553C1J07l36k0O5N25j15m20J59o9lJ49N2r9l60l4M77J42R7k32j94o0n4J04J50
2577F2J75k99J82k43K44p9k97J92J06l7J2k52J66K05q2Q1j34K7q2p7R4k0j52N23
2601C15k83J5p5J86l99L17j29j10N5J36j80k5n3l4J70J31L96m97J44r1j93K9K67
2624I2J78J9l20j31M69m19K18l79J30L09l05K26m07L95j80K24l79K74J72m05K29
$$ y = [-212, -2, 4, -250, 65, 137, -148, -122, 132, 168, -14, -124, -18, 131, -84, -180, -280, -221, 130, -218, -399, -64, -255, -239, 51, 295, -14, 96, 81, 65, -238, -104, -112, 229, 68, -69, -463, -95, -60, -355, -314, 23, -150, -144, 147, 386, 88, -240, -102, -232, 131, -101, -87, 311, -173, -127, -117, -5, 16, 49, -21, 46, 46, -104, -62, -181, 172, -362, 185, -36, -58, 109, 45, -237, 122, -125, -276, -163, 276, 243, 229, -125, -307, 257, 430, -97, -202, 223, 274, 84, 31, 138, -198, -218, -153, 372, 257, -163, -4, -73, -76, 73, 125, 26, -334, -368, 109, 251, 348, 116, -78, -138, -192, -88, 62, 237, -62, 120, -123, 121, 42, -255, -63, 43, 6, 18, -234, -68, 137, 55, 136, 2, 29, -53, -130, -36, -56, -208, 315, 32, 47, -28, 158, -241, 76, -53, -163, -108, 28, -152, -177, -230, -264, -94, 37, 433, -64, 80, -11, -204, -175, 92, 270, 289, -31, -162, 307, -112, 106, -273, -143, 166, -139, 87, -320, 75, -105, 119, -260, 14, 186, -219, 10]
2645A0l10K72o1J93l3J03k88J50M3k9oK29k15l8Q9o0o5k6J49m4K1Q3l65nJ33l2
2671a02J61k54j07M09K69j77k46k61K64K21m9j22o0N0J21j33K21p9k95O4rL36
2693B22k0ql9j69L07l68K9J01k54J93q1J91p4j38M18M8m16Om1K10j85K6J61j75
2717e6K28j91L04m62o2l5J12J34L31n35n5L37M9j35o8P8K19l00J87j92P2k3p0
2740a33K90l78J92O6m1k2m9Q3K30J35j2l21K6j0M3l4J9Q9p2O3m04L96k8j96K93
2765B25n6m81L37J75n31L09K31m83O0J84J5O1k53K35N9l32M96K66l74j01k45J95
2787hj94P6Q5K11j45j15J09P6j77J44j71L81m00n1O7o5L71j24k7K30l10k47K84
2810@M2k0m3N7Q8m19L97j69K18M4k0k93N4K96j68J9j77P8j20j76k12L95N51o1
$$ y = [10, -300, -28, -89, 104, 71, 174, -114, 36, 79, 50, 44, 273, 58, 20, 109, 49, -16, -42, 107, 63, 84, 167, -198, -203, -70, -102, 59, -195, -302, 107, 376, 199, -47, -308, -44, 177, 128, 6, -54, -4, 117, -16, 205, 126, -169, -105, -114, 222, 202, 194, 155, -14, 293, -75, -46, 55, -199, -6, -87, 104, 30, -108, 310, 358, -58, -52, -93, 117, -68, -42, 119, -56, 172, -19, 285, -177, -239, -274, -162, -28, 303, -232, -287, 50, 99, -36, -104, -26, 193, -107, 80, -112, -40, -63, -133, 157, -221, -29, 37, -4, -26, -75, 8, 238, 373, 361, 40, 66, 56, 99, 65, 84, 173, 101, 164, -240, 156, 128, -68, 225, 169, -312, 25, 200, -331, -22, 209, -274, -214, -30, -15, 46, -207, 28, 87, -245, 251, 517, 143, 42, -203, -8, -202, -126, -41, 170, 25, -90, 19, 95, -82, 62, -109, 272, -128, -179, -112, -177, 194, 70, 43, 273, -37, -284, 0, 42, 22, -21, 36, 124, -295, 102, -67, 151, 195, 175, -118, -64, 232, 64, 83, -94, -16, -136, -312, -524, -129, 422, 361]
2834C61l01k97J91n6J23L3K11l05N8j8k49k1M22o8k94M59m07lJ72J82J12O0k31
2857A34r3j53J06l3K5K87%k20q5j33K92J77j37J98m73l8j61L48n1M9q9n40P66
2880A76k82K00O9o9k50K27J33p9k23J1N4o0L32k77K81l43j37L13r0k2J43q4P3
2903I6k92N34l20j97M35m23M07l8j1j63J88k87j75PK63q9K83l26j1l1L80n22L3
2926b59M68K3k66k1j04K28l26L0K73L5J97m97M57k45j96K58R9O8k32L30k78J70
2948B12l59L32J03l11j27L09K71l04l98K37j69M28l03m8M11o5m04L31k10k6K0
2969g0n5K32r8M8p2K8j76L32k03K11j15k75O7L08o7p7j45j90M57j50k6K60j07
2992A17l2K8l13J39j25N4J00JJ08pQ0Q6k86L25l67J93J11j40R3k74p9J68J4j16
$$ y = [361, 60, -237, -46, -102, 21, 54, 265, -40, 18, 0, -249, -270, 152, 84, -210, 249, -158, -161, 11, 193, 305, 365, 134, 41, -112, -6, -39, -14, 273, 273, 53, -32, -165, 127, 304, 167, 365, -108, -146, -307, 41, -10, 39, -50, -590, 176, -106, 94, 163, 94, -156, 71, 204, 125, -98, -87, -33, -93, 239, -38, 243, -100, -237, 76, -14, -36, 107, 23, 96, -196, 338, 18, -179, 256, -167, 240, 202, 191, 28, 216, -71, -246, -239, 24, -65, 218, -108, -119, -150, 230, -292, -259, 209, 232, -34, -55, -159, 69, -257, -227, 46, 81, 278, -219, 238, -7, -203, 55, 154, 222, -10, 320, 42, 212, -147, 185, 288, -23, -150, 159, 430, 126, -272, -35, -204, 224, -79, -127, 284, 219, -185, 146, -64, -90, -70, -125, 107, 9, 57, -15, 13, -163, 169, -34, 177, 62, -213, -146, 162, 95, 18, -127, -317, 140, -10, -36, 224, 117, 85, 113, -200, -61, -186, -132, -32, -31, 77, 70, 150, 236, -50, 275, -92, 101, 212, 72, 165, -109, -188, -20, -6, -122]
3016a22l3J57M9J19l19J35j41J84K8P7j07L4j1r0l9J55J24r9J09J68m69j08K96
3039I7k21j80K98Kj00r0L66k20J13K10j57k93L73j62K3K5m6k83K58Lm3N50o06
3062h3j5j65L04j31p4L15%j6l4j76J80K21l29j02j48J85k10J03O9L46j50k58p8
3085b46J99Q8l5o0N1J68p4k92N6k9J46J60k36J45j11L7j12K89j50k22JL31O2j65
3109AR8j81J11M4j05j28j24L1J49J34P5j74K48J17k88O5n3K2P0J9j12J2J14j93
3133d8L04j83k98K79K03k73j16L17j72k24R7J48J52j87NOo1J86l82M63j09j35
3155b8k61L40P0k36J08L01j64J51j86j17O3O5j28l2r4PK11j99K94j98QJ71l77
3178b31K13J36j0k30l1R8L39n46K26K74j35n70L24j54K30O3o0K99p1L4j70q4J70
$$ y = [-122, -155, 2, 51, 170, -149, -14, -155, 29, 57, 134, 27, 61, 50, -40, -79, 76, 200, 101, 210, 378, -91, -199, 97, -124, -304, -6, -4, -104, -194, 172, -48, 65, 275, 118, -175, 198, 36, 59, 84, 38, -245, 13, 16, -27, 523, -83, -98, -263, 41, -90, -164, 151, 151, 135, 101, -75, 105, 326, -3, -105, -253, -68, -278, -175, -106, 240, 90, -168, -246, -47, 41, 6, -54, -3, 165, 91, -201, -145, -174, -28, 132, -104, 41, -70, -33, -145, 144, -6, -228, -227, 104, 166, 1, 99, -82, 29, 73, -32, -160, -284, -253, -104, 30, 105, -69, 179, 296, 8, 73, 20, 42, 112, 131, 19, 31, 145, -48, 256, 73, -225, 54, 257, -16, -132, 185, 13, -211, -114, 34, 186, -1, 4, 10, -51, 135, -247, 216, 107, -28, -289, 51, 121, -115, -7, 294, 130, 281, 95, -22, 41, 106, -22, -54, -148, -141, 70, -129, 165, -33, -25, 146, -231, -18, 118, 108, -122, -153, -55, 284, -262, -36, 238, 103, -467, -143, -297, -67, -4, -64, 235, 164, 198, 28, -56, 114]
3201A14k9J74k84j91M78m6o0j73k47K41M75p47O47m79N0K01j80J99k53K30j25
3222eL02k61k74M6K49l37K40M7J2J62j73N0j24N1j84J31J66o6J30l03J63J23n32
3245c87O47l63K02j85J89J65k05o9j4j22J37L96m98k58L97j75J60L62j12l38K17
3266A46L4Q8k5k90m4O8p6J20m2M25m68j12L76l72K99o1j63J8l9j87J35O8J25j86
3290a63N9J60k23Q7j4q7K1K68n4J34q2J31l56P3k71K46K20l83L03J17k20J01r7
3313c0j81K81j01L15n99M98p1k75m2K01J67p7K01o9k43j46K14M7l38L09L1j58
3335f6q7K24K8j71j25R1k4J02J86k69J23K03m51MK25m5o3K1J60j10j59M55m09
3358a57K42j47m55P04n8p7j46J87j13K63o7J33l40r0kJ02j66K65l13L46L1N1k75
$$ y = [114, 85, 259, -25, -216, 262, 216, 156, -17, -264, -23, 452, -295, 352, -127, -77, 124, -56, 143, -110, 120, -5, 297, 36, -238, -192, 57, -280, -40, 7, 19, 181, 8, 58, -66, -15, -199, -68, 98, 32, 162, -141, 22, 145, -387, 260, -103, 99, -86, 103, 268, 63, -6, -20, -142, -5, 391, -107, -365, 32, -143, 17, 379, 267, -71, 146, 180, 268, 243, -47, -91, -23, -99, 21, -21, 404, -64, -176, 200, -172, 127, 66, -97, -79, -118, -305, -170, -102, 23, -163, -104, 56, -167, -80, -94, -181, -160, 108, 54, 188, 106, 237, -119, -46, -317, -71, 149, -234, 69, 186, -34, 67, -30, -211, 70, -31, 284, -315, 183, 112, -163, -205, -4, 163, 86, 287, 218, -25, -171, 43, 90, -248, 61, 92, -66, -153, 71, 99, -72, -197, -106, -130, -28, 158, -111, 12, 215, -236, -232, -7, -52, -115, -94, 66, -44, -203, 252, -157, 85, -62, -517, 187, 129, 52, -94, 93, -20, 243, 176, 309, -31, -121, -123, -21, -187, 78, -235, 111, 142, 193, -82]
3381h2M3N4n8J65l4O5j14J2k0n3o7R7K67n21M70k25k86K24J70k27J89P4j05k37
3405a99K83j53m2L34k31n6J05L22l02m5m7M6J10k56r1M9J83N3K01O4l47r3J25
3428A3J58l27k18J94L39m52M43m27O4K29j58J95k1q8k00R5K68r2J36l46L29L2
3450A66k47k21L78j25K15j68l25K24K40P2p0j63j1M6m8mK71j79j95J57L8k48j30
3473c27L05j20J10j30P5k47J99K06k95J69J46q1M0qJ5k19Ok75O48l99K15K37l29
3496e9j6J82n04Q2K43Q6M7k83K04r3j03L15k31L34k31q0pL11j45k42J78L20l35
3519b7K21j83l46J67J78J09j66nn57P23k84j24J87P0K16J09o04K72r1q5K90k35
3541a65K14j04jn7K28o52O10N6m8O1q8R0m60L29j48K75M0j08k8L5r0l7j78K33
$$ y = [-82, -39, 15, -43, 122, 88, 153, 39, 51, 31, -22, -89, 8, 275, -246, 224, -1, -287, -63, 107, -120, 69, 143, 38, -199, 84, -69, -111, 223, -8, -64, 41, 363, 61, 16, -31, 15, 125, -131, -222, -173, 10, 63, 264, 328, -19, -112, 13, 171, -156, -374, -180, 159, -293, 150, -277, -213, 16, -142, 53, 32, -56, -256, -161, 107, 15, 151, -195, 134, 166, -81, -302, 76, -49, 166, -2, -327, -103, 137, 209, 139, -24, -35, 11, -37, -41, 230, 51, -144, 13, 51, -197, -327, -22, -142, -32, -162, -87, -334, -135, 71, -224, -55, 91, 10, 50, 42, 57, -162, -156, -431, 217, -182, 33, 270, -59, -75, 107, -397, -315, -72, 14, 61, -222, -18, -111, -214, 101, -130, 204, -27, -107, -114, 197, 52, -190, -12, 308, -27, 194, 11, -335, -168, 10, 119, -47, -52, -609, 114, -170, -294, -107, -37, 179, 288, -316, -44, -135, -220, 70, -165, 49, -55, -56, -113, 115, -537, 73, 129, 81, 142, 54, 144, -316, 13, -135, 140, 180, 72, 44, 79, -11, -48, -226, 7]
3565Gj02P6m8P0J51k03k9j55J48p0L44k86K95n09L57jk43K21J2J20k51J16K38
3588B58k34j50r9L09n4L1J50l21M19m92K03M7N9k63L71l59j36L39pj5j51J12K
3611A9k03L29m18J90J20l56N26m65L62j62j34K80J46n38L97j8j4P2k92L58j76
3632B3K03k25L51l82J71j68j88J63k9O1M66m65O3m62O13l00L62l59M42l41j59
3653a60J48J62J9j72K77k54K17j10j31j2O2p9J37J9m07K39J00j10K09j39l7L4
3675A2k46L55j35L7l7j21K68J86n83J57J1K47l17M55j95m60K52J72%k65j36L56
3697A3l21P7J39j7j78K12J6K1q5l9K68Nl69L59p9j55J84j64Q8l05M04j02K83m29
3721a74M76qk50l17N74k51j28J46l3J57r4R9k99L65k17n2P6k68K79k48L46k93
$$ y = [7, -95, -19, -67, 3, 154, -49, -78, -233, -85, -155, 189, -97, 198, -311, 46, 45, -198, 23, 35, 155, -96, 20, 258, 24, -126, -225, 84, 30, 61, 211, -110, 309, -183, 20, 67, 126, -137, 234, -125, -261, 78, 71, 56, -95, 17, 19, -184, 145, -273, -83, 37, -319, 207, -258, 104, -58, -192, 88, 234, -304, 93, 75, 61, 133, -159, 199, 23, 226, 1, 352, -30, 141, -27, -215, -52, -81, -20, 446, -19, 44, -418, 195, -105, 257, -102, 340, -1, -160, -12, 150, 169, -3, 274, 20, 237, 127, -4, -16, 46, -33, 104, 123, -284, -45, 55, -55, 154, 15, -22, 12, -234, 121, -14, 23, -14, -135, 133, 319, -264, -107, -96, 151, -166, 289, 94, -366, -114, 58, 58, -207, -343, 13, -308, -231, -92, -109, -287, -75, -59, -38, -123, -162, 106, 111, -258, 101, 22, -133, 51, -113, -25, -330, 74, -28, 255, -174, 302, 294, 44, -273, 301, 50, -78, 68, 35, 192, 98, 197, -102, 263, 46, -6, 70, -198, 81, -167, 179, -114]
3743a14p4j83M26L0n4J09O1l5k51l9J86Q6L4j11O0l12P5J27l8j99k02J62J04L3
3767a19O6P7K18n29N24l9m12L18j76P2J49l66K40j47N4J35J39qj65n7j22J99k65
3790b14L55O4O0l20K22k75J26j56Q9K71J9l31r4K64q1K64n54L67k70L5N00j49
3812A92j71J48K1k43j4j60K09O6j61L73m0j72j6j28K24j95K68j89j80K25k98J56
3834h5j65M03k38K76j49O5j23j62K20n8J13l6J64m87J99j88M41j80J40j78L03
3855B75l82L88k93O8n9k86N03l10J91kk88J36k83M53l57R8R8K06q3RK60k24o5
3878E3J61r5K25n2m68J2K11j05K3O7k85K53k62N25M1j65J4l4o4k0j65J09k65P7
3902b09O41q00M65L03k72o01J04K86K77m71L73Pj0K94k57j63J58k27j9M80p05
$$ y = [-114, -188, -371, 55, 85, 31, 140, 201, 166, -85, -124, 62, 148, 182, 71, 131, -181, -106, 21, -17, -216, -418, -256, -152, -119, -53, 24, 242, -287, 237, 198, -214, 104, -72, 0, 149, -217, 23, -124, -70, 65, 204, 196, 31, -26, -148, 51, -214, 141, 205, 265, -55, 167, -108, 18, -138, -49, 222, 241, -90, -184, 80, -1, 263, -291, 76, -194, -159, 341, 192, 21, 169, 190, -53, -67, -227, -18, 48, -113, 260, 220, 48, 32, -96, 128, -67, 201, 12, -168, 57, -241, -85, -250, 153, -85, 191, 42, 107, -16, -178, 42, -16, 97, 61, 225, -262, -63, -251, 190, 10, 150, -28, 275, -107, 281, -12, 56, -3, -289, 214, -96, 95, 93, -195, -59, -342, 111, -246, -148, -50, 156, 73, 82, 342, 118, 53, 214, 119, 344, 292, -176, -164, 47, -58, -35, 32, -253, 0, -262, 263, 304, 139, 153, 119, 55, 35, -130, -21, -286, -209, 432, -368, 97, 400, 128, -473, -369, -83, 194, -277, 96, 103, 93, 387, 130, -33, 125, -102, -121, 359, -346]
3923c46J65M05l20J92j11r7K62r2k71L25j82O2P4l71k3P6L08J65m40K93j50K8
3945d8Q3M0k38p1J97M2J0k7K0K72r2m1K4J00l14p8N14o36M58J82n00J2k64N39
3969A84k95J52J49j33L8m84M35k49J95J41J76m36M2R3q9J76k65K9J24M4q6j02
3991a61j19M32l9k54K48k31J14j88N7J22j63K05l5q5J16q5o0r1m2j54N60k12J37
4014G2k41j1P5K62k31K72n35L59k77K38J89l05N9J1l25L71M1m9R1j80N15o19K07
4037a1j86q1M09j70R8q9Q6p6j23J98m73M74J07l08K4J38n2M0l3p7j18N24k81l89
4061c69O07l41N1J46j07K57m09K21j07oJ57m37M31j45J71J08k65l2Oq5K04j20
4083f4K4n5O8O9j13L27k97L06j69n9p2l33O54r4M0j84n7j29K59m1m2m0r8M04j87
$$ y = [-346, -181, 224, -96, 96, -15, -112, 150, 58, -213, 112, -70, -8, 66, -305, -328, -252, 56, 221, -219, 74, -76, -48, 35, 75, -163, -234, -37, 5, 15, -12, 8, 280, 188, 147, 171, 271, -43, -121, 393, -243, 215, 397, -103, -91, -355, 184, -111, 41, 190, 57, 95, -389, 46, -203, -8, 133, 309, -127, -85, 8, -81, 95, -170, -141, -17, 27, -59, -161, -280, 152, 113, -141, 107, -124, -10, -198, -141, -19, -182, 23, -12, -97, 19, -66, -126, -217, -259, -413, 147, -65, 72, -169, -180, -105, 157, -74, 198, -337, 22, -255, -17, 172, -133, -74, -63, -388, -17, 24, -25, 66, -114, 401, -218, -11, -197, -278, 131, -39, 59, -30, 56, -20, -143, 55, -418, 56, 163, -145, -121, 17, -35, 5, -28, -105, -223, 301, 20, -369, 238, -103, -52, 94, -13, 244, -165, 56, -51, -57, 100, -337, 94, -51, 120, 228, -37, -69, -63, -148, 56, -64, -40, -95, -27, 42, -71, 256, -41, 265, 96, 37, -35, -368, 286, 192, 232, 48, -9, -138, 121, 80, 38, -2, -100, 304, 117]
4108A17qO4j62m20O82m99q3M56j60J34P6j82j52rK05j7k60J53j6j65K33J17j56
4131e2L4j26K80n04P70l35j39QN0R9J78m43K88J80q39K34O12k24Jr0n5L82k18
4154I1K11m81L08l0k55R3j40Q2j9J43L1O4k66J47J40k02J7K35k37k3J24j43J63
4177E3j38J07L6J77n0q5k38j28M54j30J57l2K8Ll72K60j46K21l49K35k50J19k10
4200b78J45rK75j51j36J05J34l78K03K02l08q8L93l70K13n3O5j6q1j41k25N56
4222E7j77l3Q0Mn7m2P0K81l64M54K4m08q3J11j79O36l97K38l42L49k0K13n29q
4246a22J29J9j25Q8p0j75N53N1p2k40L9k45J24k37J29L5M79l42m0o9J05J94k27
4269a9O3L92p45K03K8j16J36R6k8J55j24K9j36K21m80RL66k99J04J51J23k26K94
$$ y = [117, 109, 173, 11, -409, 273, -226, -309, 147, -13, 121, 197, 15, -137, -146, 59, 42, -218, -65, -81, -246, -13, 104, -52, -18, -144, 136, -368, 402, 67, -72, -64, -14, 85, 263, -180, 108, 288, -551, -317, 295, 71, 72, -18, -73, 309, 91, 302, -179, 129, 99, -156, -63, -203, -121, -140, 3, 34, 98, -168, -21, 119, -83, -66, 169, -68, -91, 33, -110, 53, -85, 22, 58, 235, 185, 100, -138, -266, 188, 58, 215, 183, 211, 214, -158, 102, -44, 177, -172, 63, -187, -68, -278, -133, -142, 133, -18, -154, -49, 85, -293, -90, 112, -196, -284, 109, -261, -48, -101, -36, -52, -133, -274, -499, 57, -120, -153, -73, -69, -126, -168, -98, 183, -181, 273, 297, -111, -194, -83, -262, 374, -23, 215, -127, 222, 202, 415, -114, -122, 7, 26, -99, -11, -81, -256, 297, 348, 276, 36, 75, -170, -46, -283, -154, -119, 360, 18, -22, -91, 14, 208, -19, 44, 436, -309, -106, -78, -194, -58, 38, 10, 165, 41, 70, -66, 155, -325, -316, 50, -249, -145, 6, 129, -97, 197]
4292A97k4J96j39l44R4N9K2j16j89K85J04J55k31p2J46j45K07k34Q0j90P4rK3
4315e1K3K29l86M6M84m56K85p4l52J61J73j16k21n1L35l39L09j06J35j25J32P2
4337A07L14n60Q2L7L2J49l35K72q4Q4j96J88Q0j12j55R2L23l61K70j07l2r8J0
4360@j31j95O48l96j0M9oK93k55j5j14L5K28j63P4r1l58M43j58J64J98l80n6K78
4384H2k54L51o3%j78Q1k78J77J5mJ64j54M99n15K15l3J63p5j79J13n78L87J85
4407A21k80pJ49j71K65J13j32k38J60P4k18J45p9k2J28r0K0k44M60l71j22L70
4429C1j18K8J80l10J57k47L07K5L0j03O8j39l5O6J09P5m99N08k99K41m33M79j27
4452fJ10j20J94j33J42m51K75pK20K5k08J1O0k14K25p6K1j95J21J40q3L64j72
$$ y = [197, 173, 369, 230, -114, -20, 39, 61, -55, -244, 41, 145, 300, 69, -3, 143, -2, 205, -29, 51, -139, -65, -74, -51, -28, 201, -185, -139, 345, -111, 174, 100, -252, -91, 82, -34, -255, -306, 29, -310, -1, -107, 28, -97, 35, 107, 421, -139, -57, -20, 12, 161, -174, 98, 14, 98, -98, 90, 170, 58, -97, -5, 318, -43, 227, 120, 88, -10, 0, -131, -326, 322, -74, -84, -35, -41, 252, -3, -18, -132, -97, 131, -32, 42, -49, -407, 36, -122, 42, 240, -140, -196, 82, -172, 179, 116, 116, -62, 19, -259, -82, -67, -71, 93, -61, 438, -77, 138, 105, 268, 193, 14, 127, -451, -64, 121, -159, -166, -17, -188, 77, 190, 58, -180, -20, 54, -164, -19, -98, -120, 8, -82, -62, -306, 154, -217, -339, 31, -87, -59, 121, -189, -32, -279, 28, 53, 83, -20, 48, -91, -126, -60, 49, 124, -375, 133, -166, 75, -358, 121, -6, 104, -16, 178, 45, 187, -264, 11, 4, 224, 249, 41, 52, 112, -102, 123, 47, 68, -127, -6, 134, 51, 415, 243]
4475B43k9k85K34j87j37K18k44J11O2k5j49L99n31K13j66L97m4j03O7J53j26j24
4497e3J42j42M4q7o3J26J14j07k61N88o6l31p0J72J0J3j89r6Q8O3K34j33J47n9
4521H4j91Qj02L2p7L44k07L05j81j97q3N10p2o6k18J13q0l48N58j23j00K79l4
4544A54k69J79j81P6qj23K63lp6j27K68m25M52l16nK73j32R7N4l36K14K89l38
4567b0Mk37M48m59N48n97K28q5J55k32L12j54L00k01J73o8j64o3J52o1J53k80
4589a48MK51q5J88l10J98l82j71Q60o28K06R5L1J43p1L7r1J33m17p9l1J93K53
4612A79j41j17r9L69R8l75J69o5J91M8k7j93J17k44k03M28j67O8J48J4j61j09
4634g2J4l08N68j49J18j60l0M1M8k81L41k87K1K28l5kq1m5k76K28K6j8Q3j9K67
$$ y = [243, 214, -71, 163, -24, -161, 57, -187, -76, -14, -39, -188, 211, -320, -107, -273, 124, 80, -23, 44, 197, 71, -53, 89, -53, -9, -96, -159, -33, 81, -26, -287, 301, 235, -96, -166, 6, 16, 29, -160, -256, -168, -105, 129, -4, 143, 84, -107, -99, -201, -169, -246, 98, -109, 196, 15, -182, -265, 245, 173, 107, -111, 2, -78, -426, 132, 9, -91, 188, 154, -115, 64, -117, -41, -49, -172, 91, 88, 12, -115, 153, -272, 180, -136, -141, 132, 0, 97, 151, -185, 29, 318, -20, -16, -253, 195, -264, 284, -313, -85, -170, -15, -247, 65, -89, 211, 10, 183, 115, -49, -112, 40, -21, 132, -148, -144, 107, 22, 210, -100, 98, -284, -455, 405, -223, -17, 78, 109, 252, 181, 218, 127, 260, -157, -236, -267, -74, 179, 38, -79, -178, 191, 289, -86, 83, 18, 209, 257, 230, 37, 154, -90, -293, 135, -32, 36, 184, 198, 37, -72, -58, -366, 202, 53, 171, 11, -19, 22, 70, -211, 130, -157, -136, 92, 57, 55, -26, -71, -347, -119, -93, -111, -28, -47, 220]
4659B20j65P4j52J75o4J33m19N58l77j62K45J5J0j6r6L4r8L26j18j08O1j04J07
4682G9l05K22k10J21p7R2K55k43l61K75M75k58R1K9j36Q0l37N07k47j99N9J07
4704A9K87r8m8j64o0L17m05K49j62j4n7M6M4NK24k79J09j7J25r8Q0j71M53m32
4728d7K2J54k34lJ14P8P1j6j25k7Q9j52l31N70l32k34L62N17o62Q8J23r8k2K37
4752A42k52k7R7K49m41L51j78J92k24o2K71K60n08M3n8K23k06L32o7K18m00j4
4774e9j60J60K62l93M33m72L46J13Jn18O76k50l50k9K70j09M65m17K72k04L3j47
4796g7K77M6l03J12l06L66m44M21j87r9N44j73p1l38N66k50l42M55k54k1J78k36
4818a36J32J66l95L61n5l04J95r8L12J2j31l46K87k24J31K56n03L01K04J01l27
$$ y = [220, 55, 129, -23, 152, 88, 221, -198, 360, -17, -179, 66, 81, 91, 75, -21, 13, -85, 241, 123, 15, 76, -28, 79, -226, -4, -214, -93, -170, -78, 177, -66, -427, -152, 323, 65, 156, 185, 49, 129, -208, 299, 52, -147, -88, 19, 306, 208, 160, -4, -64, 253, -152, 97, -65, -79, -136, -90, -46, -41, 183, -96, 13, -4, 121, 23, 103, -68, 385, -47, -25, 129, -105, -108, 6, 84, 155, 139, 14, -13, 76, -76, -407, 163, -169, -403, -41, 476, -186, -98, 25, -73, -95, 142, -110, -137, -40, 209, -232, 119, -59, 133, -91, -153, 118, 378, -130, -87, -145, 78, -128, 204, 137, 355, -45, -59, -219, -59, 203, -190, 243, -229, 117, 230, 231, -287, 389, 139, -211, -240, 30, -79, 386, -31, 241, 37, 70, -77, 200, 246, -57, 55, -251, 115, -329, 92, -95, -194, 350, 177, 106, -232, 334, 84, -258, 197, -57, -78, 100, -136, -4, 162, -233, 128, 73, -231, -36, -134, 178, 190, 59, -287, 0, -224, -93, 163, -340, -39, 165, 266, -61]
4839f1K76j78m22L83N8q5N8J55k5m74J60L90m35J10J84J08p4n12K90J40J26m38
4861b66L05J43j95rK39K8l7k44Rj05N51k75m30j49N71r4K9J19m39j8K15L06O4
4884C18m07O9J81o0j22J00J4l09m9K72J7k34L0J90k13J41l9%L58l16K28Q2k24
4907B7k94J17J03n4J19j17pK25K3j69n2J68l06J79q8R8K08r7J39k41L65q11P29
4930B64p2n21P10n37k66N55j23k29L20j01j9j73K6q1L07o6N4q3K46J30l16l73
4952c48L37j06n2L03m11K83K40j45j00J99l49K13l56L31J6j50L37n16J74M92m90
4973i8K28n4n2r3M07n48j27M92k20k19K85M94l32k26J60m7l9j1n09K97K71K6K69
4996C54n79J19N3J52k09J22J77p1k67L41r5k43R4J42j04K04l76K77j35k77K02
$$ y = [-61, 215, 37, -385, -2, 56, -29, 29, 184, 159, -315, -155, 235, -200, -90, 94, 202, 128, -384, -94, 46, 172, -266, 39, 182, -13, -22, 217, 245, 208, -36, -27, -132, 419, 144, -286, -435, 136, 42, 71, 190, -249, -267, -52, 254, 318, -89, -20, 161, 101, -21, 79, 93, -216, -265, 7, 24, -210, -180, 10, -203, -62, -101, -101, 257, -59, 169, 251, 27, -267, -150, -47, -101, 18, -99, -106, 119, 142, -27, -79, 89, -217, -38, -126, -28, 180, 83, 222, -19, 346, -465, 264, 192, -329, 381, -156, -422, 133, 10, -219, 101, 0, -19, -192, -166, -247, 60, -6, 48, -35, 211, 341, 25, -348, -11, -117, -169, 134, -277, 6, 246, 101, 1, 200, -149, 64, -292, 39, 55, -95, 242, -274, -100, 392, -98, 130, 76, 24, -69, 338, -210, -337, 155, -65, -284, 1, 495, 163, -63, 97, 50, 11, 0, -509, -212, 59, 85, 354, -225, -106, -53, 99, -110, 12, 189, 118, -149, 192, 97, -146, -52, 90, -14, 190, -186, 91, -44, -321, -119]
5017a19L16M9l15q1J83k14Q1K46l76K60j30K82k26K27l02N4K1J00O9k37J96K8
5039A12j12k33L25j85Q4M1k69N78l28k43K30j37K34q9J42J64l12L3q8n0J83k68
5061a88L68k40pJ84O2l34K91j70J01j32J04J3m0k70K99j64O2L29m42K15k81J79
5083f1J17j97l8L77l64J45K46l10K0m6L54k80j46M76n09L57N5Mk19P0m54K78J62
5106C7j24J27J9J08p6O1j34m1N8k95m2O02o2j73j49J80j18k7J97j92K7J90m7j43
5130a7Q1J54l04K49k13%K02k16J40n0j51J94j62L30m12k43N22l00K19O9j06J56
5152A42r5J3k51K70Q4j79o0J46j44K14k5j75M7k98M83k43J65L7o9n5l07N53r3
5175A60Q9l23J00j84K62j01j57j5J04L39k04m47O19l33R9R7J0o9J79q9n4l33L02
$$ y = [-119, 197, 246, -69, -150, 33, -181, -100, 146, -230, 30, -100, 182, -44, 183, -119, -65, -44, 56, 125, -112, 84, 112, 0, -233, 92, -93, -9, 32, -237, 341, 13, -230, 0, -137, 97, 8, 150, 314, 2, 35, -53, -103, 80, -188, 180, -60, -67, 117, 179, -155, 136, -34, 67, -65, 39, 52, 12, -258, 41, -123, -61, 268, -174, 41, -240, -61, 56, -141, -179, 198, -166, -21, 225, -85, -65, -111, 243, -37, -183, 293, -216, 141, 196, 200, -19, 51, -403, -125, 37, -87, 40, 59, 167, 91, 152, 18, -23, 35, -260, -302, 300, 238, 65, -84, 96, -22, -49, 148, -44, -17, 173, 126, -17, 64, 218, -86, 163, -50, -50, 152, -64, 76, 26, -125, 69, -93, 237, -175, -418, 104, -196, 23, 92, -14, 142, 47, 60, -191, 79, 163, -16, -76, 70, -74, 140, 115, -60, -13, -311, 172, -71, 94, 131, 62, 7, -300, 253, 160, 249, -74, 26, -158, 104, 3, -154, -169, -65, 274, 70, -377, 242, -91, 8, 105, 115, 46, 225, 136, 82, -251, 51]
5198E1m14J52J37K67j77j36JK34o3J57l10j22K90j63m7M02m69L86j48k67J72l8
5220a05K3k09J95J71j06J9Q3J05J68m50M05n07L2J71j74Q7M06m08P3j5K28l98
5242b06J43L47k92k39K38K28k87L12l77j09q7L19J67l71K11L1j72J98n9N8q4j23
5264a54J17J72kl90P57k96r0J57l40J76j89QP8r3K04j31l2J58J56l23P6j64J48
5287Cj44L21j22n10K79M61k63j22j29L16n5l5L4j32J27j3j93J93Q2j94J7l06J19
5310b66K56k26J90o4j14K82K0K72j22k03q0j30j43J81K04k05J45J01k20J17p6
5331h1K70l79k9K01J14R4p2j17K47j38l12J77J42j70P7K59l13j85L87K44l46R5
5353A65l07Q7J80r4m7j83K27p2o7j74O2pJ87J82j00j61J74l59L01l33M00k32K11
$$ y = [51, -363, -211, -74, 193, 16, -120, -119, 115, 52, 209, -101, -223, 67, -96, -143, 259, -210, 176, 28, -239, -67, -105, -82, -291, -96, 75, -31, -12, 71, 176, 344, -106, 299, -208, -176, -5, -179, -92, 314, -94, -21, -36, 192, -206, -63, 284, -8, -247, -9, 219, -68, 244, -133, -242, -329, -10, 157, -214, -3, 28, -144, 54, -5, 53, -31, -154, -37, 135, 133, -257, 500, 204, 114, 271, -69, 107, -82, -74, 4, -89, 115, -16, -48, 110, 266, -57, 19, -145, 3, -141, 180, 58, -452, -173, 288, 25, -97, -226, 90, 35, 0, 34, -98, 29, 16, -177, 16, 98, -96, -79, -385, -266, -10, -236, -46, -110, -224, 58, 78, 350, 228, 25, -55, -185, -328, -147, 57, -148, -3, 98, -122, -5, -81, 189, -190, -219, -18, 96, 190, 118, 1, 248, 110, -202, -25, 117, -53, 24, 283, -30, -215, 172, 416, 70, 165, -142, -55, 125, 31, -16, -199, 28, -44, -111, -285, -223, -230, -43, 139, 39, -122, 52, -307, -6, -339, 61, -171, 40]
5376D0Q9n55N76J44n49J47N8L0J60k1l35K21Ql8j75P04o65J45K35j07k88K9K31
5399H4j09J6J80k22M11m13M2J06k66L60l56N32m55K98l20M5K37l51N2M97m03K94
5421B59j87j80K45j75r1N12n65n5M13k35J41j64l8K05m26M91N0j94k82N36k37
5442B3j52O8j45L21j36O3j83j2l30M95J61k48j61M13J19r6j73k58P6K31J06k95
5464a13o0J97J32L5k56l6J00l13M03J00l83K76l91K69J17o9m6J53Mk74n4K36l76
5487c49L81j61K70q2L6o55O41k01K62j53j30L54m09K72k23N21j84m63J66lqo2
5509a80L72r9k51J1o6K03j70J73Q1n7l1J02L18o40J12N1J24k37J84q3J16k01L84
5532B16j20l10L81k12k3p9l5K57k64K1L21j31o0L36n09K58k32Q1J34m43K14J83
$$ y = [40, 129, -426, 150, 294, -255, -108, -50, -20, 140, 119, -216, 5, 13, -25, -200, 504, -161, -16, 219, 112, -176, -147, 84, -25, -9, 171, -51, 360, -53, -11, 95, -171, 189, -167, 365, -90, 208, -112, -67, 170, -181, -129, 368, -35, 259, 72, -108, 137, -38, -129, 383, -182, -237, 176, -59, 82, -82, -120, 85, -341, 150, 200, 6, -276, 260, 23, -129, -61, -206, 115, -21, 42, -141, -153, -483, 12, 173, -75, -236, 177, 296, 200, 27, -231, -155, 76, 182, -113, -173, 24, 156, 191, -65, -101, -1, -314, 89, 189, -194, 82, -309, -40, 77, 8, -38, 115, 119, -155, -209, 27, -349, 32, -129, 141, 59, 95, -560, 81, -120, 142, -11, -141, 213, -196, 76, -147, 374, 190, -273, -107, -110, -118, -180, 192, 93, -158, -147, -213, -10, -180, -7, 74, 17, -14, 88, 406, -234, -122, -71, 53, -184, 0, -83, 33, -168, 216, 96, -214, 167, -45, -68, -147, -182, 75, -189, -168, 153, 22, -38, 298, -211, 47, -185, -104, 30, -413, -199, -16]
5554a6o9q7J26K05r8m2K6l16O5j0L2L40k86q4L65j83O8O9l27K09k18J31J70j91
5578a21J94O5k46o4K75k14K75k90J37R2n3k49K25j01MJ53j00K8jJ82l82L54P5
5601B38l32K0k1N6J37j30j04j47M20p7J27k15L18l67M00j76k80j42K29j25j18
5622b89N28m50L41l27N81m97L18l18N7J11n8kr7K49j75J78J01m46M09m71M02l33
5644a88L21j65K18l17J7k46K45L13k5%J4j59J0j30J26p2j66m4J56q2P1O4r8K10
5668G3j08j00K22k42M34n23P7J85K6m7J5j93K6L3l6J16N17n48k61J91N86l49r7
5691cQ7O6K3l33L66m39L70J60p11N13k50Q5K13l57M00J37l93K19q9j75R0K54j12
5714A21J59k27m07O82m97J30j02J73K57m65J03Q1j72m74N30J78n97O62k92K66
$$ y = [-16, -85, -172, -46, 159, 61, 19, 45, -271, -206, -216, -184, 156, -130, -214, 151, -32, 36, 105, -222, -13, -231, -100, 70, -121, 73, 138, -108, -172, 103, -111, 164, -126, 11, 103, 50, -199, 26, -75, -71, 82, -18, 10, 9, 191, -191, 163, 238, -94, -74, -95, -39, 98, -32, -136, -283, 137, 60, 187, -28, 290, -77, 323, 147, -133, -275, -46, -171, -289, 239, -211, 130, -197, 384, -113, 205, -113, -56, 55, -3, -5, -102, 147, -28, 150, 251, -195, 214, -257, 145, -188, 133, -32, 186, -131, -114, -360, -115, 198, 173, 173, 187, 28, 38, -92, 34, -38, -204, -248, -92, -174, -103, -39, -137, 73, -35, -135, 87, -155, 279, -244, -167, 18, 44, -3, 12, -181, -155, -122, -158, -42, 475, -73, -334, -143, 443, 94, -3, 84, 150, 173, -160, 206, -233, 137, 297, -414, 99, -151, -66, 147, -210, 190, 327, -66, 153, 64, -111, -21, 233, 121, 280, 53, -354, 328, -169, -39, -141, 32, 289, -176, -73, 8, -164, -638, -108, 70, -527, 135, -157, 109]
5734A09k00k6M8K19k31K80JK59o28K85J10l97j7j21K09L14lk79K38m4k25K5QM
5758f2j14Q9M83k44n3j25J28k48k5N95l39K68l96m0L4K16k2j28k51J94lL22j48
5781A31l09J78l54K51o6L00k9P8R0l21j93M91k71J24j27p1K80j7l93K41K57l34
5803f4J62J67m78K78r0r7j13K85j35k0L73k16qQ7k33K05J13k56L15m38J39j83
5825b07J70kj07K34m3J74R2l71j6J92k05J72j0q6j23K78j28P7p2j27K94l84M63
5848B65n5N6j47r9K25M7m10K08k23J12j36K46j16K20J12p88N61L5m90K26L36m5
5870A40j59N0m1MK08J1j86o4k17L25R3l50J40k4L3J0K45l24j03M31l80J51p3L73
5894B93m88L29R1m07pL66q6J16l06J31O0l80m9M92K39o10j2L66l7J90l98r1K66
$$ y = [109, -91, -117, -69, 150, -81, 199, 200, 459, -169, 116, 226, -171, -188, -309, -100, 214, 211, -68, 170, 126, -99, -74, -66, -62, -176, -87, 396, 152, 99, -26, 102, -146, -171, 424, 85, 353, -43, -83, -49, 167, 145, 17, -234, -40, -43, 279, 131, -178, 0, -354, -103, -169, 131, 102, 180, 270, -51, -244, 247, -24, 100, -27, -98, 182, 165, -228, 13, 270, -64, 98, 265, -213, 65, -25, -122, -235, 50, -85, -105, 268, 52, 44, 131, -102, 103, 216, -40, 275, -163, -24, -207, -37, -39, -146, 88, 45, 219, 311, -60, -76, 116, -89, 83, 73, -13, -136, 142, 14, 91, 19, -108, 186, -198, 265, 210, 266, 119, 20, 245, 292, -118, 90, -133, -21, -157, 89, -27, 193, 305, -483, 78, 113, -377, -151, 185, 140, -19, 31, -10, -6, 202, 213, 27, -37, -254, 71, 164, -186, -46, -70, -37, -27, 218, -106, -209, 222, -158, -7, -80, 293, -195, 134, 225, -182, -189, 177, 91, 207, -99, 32, 92, -288, -337, 155, 394, -216, -228, 138, 101, 291, -107, -198, 68]
5917F8M13l85J61l16O4m09M91j91L68l79R9l56O78r9j94K31k20j10K07l10QN5
5939a26K0k0K34j2J10n4l16j58K28K76j74n7l0j72K91L00n52K67p6j5L9k16K14
5962Aj03N50n62o6K27J23k65K13j12j64K44q0j86L39k51J25k70p9K83J51nq8N2
5985G7n8J77l02K61l20J63j20R2Q8m01M29n7J00j59J09J43k21o3o5J72J61j45
6007F1J83k91J54j02j78J2J40l9K29j52J7K2P5j48j81J43K72l9j49l3J38j47q3
6030i6j49J60R7K18k13L70n72K00L6j0j70J56j04k61M76J67l83O1j19J34L6n5
6052b1K02j56L7R1k39K50j64l66M13j47R4L21l42J55oJ74l71K82k40j85J17J84
$$ y = [68, 481, 96, 257, -59, 5, -404, 87, -104, 264, -115, -16, -372, 306, 207, 13, 244, 24, -86, 121, -189, -181, -126, -106, -126, 108, 96, 206, 152, -164, -322, -94, 182, 8, -49, -79, -251, 40, 340, -212, 55, -21, -36, 3, -213, 1, -102, 448, -114, -180, 47, 170, -95, 118, 6, -158, 86, 6, -180, 159, -92, 33, -237, -316, -33, 118, 113, 25, 77, 19, 196, -106, 155, -165, -2, -122, -30, 58, -343, 86, 29, 129, -30, 79, 222, 1, -62, -127, 45, 206, 61, 244, -47, 107, 5, -173, -161, -21, -60, 169, 17, 34, 56, 131, -17, -198, -55, 217, 178, 29, -4, 134, -13, -96, -245, -85, 12, 230, 17, 387, -185, 15, 51, 41, -129, 27, -77, -338, 138, 305, -78, -17, -136, -2, 34, -21, 181, 25, 62, 153, -86, 164, 0, -366, 47, -100, -6, 315, -27, 128, 122, 296, -75, 207, -33, -218, -101, 83]
$$ [...]
8191C2
##END NTUPLES=NMR FID
##END=
