##TITLE=1H_DE-79K2TFA
 CDCl3
 8 sc, 
 29.11.2024
##JCAMPDX= 6.0         $$ Bruker NMR JCAMP-DX V2.0
##DATA TYPE= NMR FID
##DATA CLASS= NTUPLES
##ORIGIN= UXNMR, Bruker Analytische Messtechnik GmbH
##OWNER= root
$$ XWIN-NMR		Version 3.5
$$ Fri Nov 29 14:32:50 2024 Russian Standard Time (UT+4h)  she@DPX200
##.OBSERVE FREQUENCY= 200.1315
##.OBSERVE NUCLEUS= ^1H
##.DELAY= (6, 6)
##.ACQUISITION MODE= SIMULTANEOUS
##.ACQUISITION SCHEME= undefined
##.AVERAGES= 8
##.DIGITISER RES= 18
##SPECTROMETER/DATA SYSTEM= spect
##.PULSE SEQUENCE= zg30
##.SOLVENT NAME= CD3CN
##.SHIFT REFERENCE= (INTERNAL, CD3CN, 0, 15.7039)
##AUDIT TRAIL= $$ (NUMBER, WHEN, WHO, WHERE, WHAT)
$$ ##TITLE= Audit trail, XWIN-NMR		Version 3.5
$$ ##JCAMPDX= 5.01
$$ ##ORIGIN= Bruker BioSpin GmbH
$$ ##OWNER= she
$$ F:/spectra/data/she/nmr/H-F/1/audita.txt
$$ ##AUDIT TRAIL=  $$ (NUMBER, WHEN, WHO, WHERE, WHAT)
(   1,<2024-11-29 14:31:48.82 +0400>,<she>,<DPX200>,
      <created by zg, POWCHK disabled, PULCHK disabled
       configuration hash MD5:
       00 E9 B6 7A A2 85 ED C7 34 08 36 98 17 FE 4E 26
       data hash MD5: 16K
       51 7D AE 71 F7 09 01 42 7E 4C 22 C5 CE F6 5D 66>)
$$ ##END=
$$ 
$$ hash MD5
$$ B1 1A DD 51 28 07 B8 46 98 CA F2 A3 B4 E9 4D AD
##$RELAX= 
##$RELAX= 
##$RELAX= 
##$RELAX= 
##$RELAX= 
##$RELAX= 
$$ Bruker specific parameters
$$ --------------------------
##$DU= <F:/spectra>
##$EXPNO= 1
##$NAME= <H-F>
##$PROCNO= 1
##$TYPE= <nmr>
##$USER= <she>
##$AMP= (0..31)
100 100 100 100 100 100 100 100 100 100 100 100 100 100 100 100 100 100 
100 100 100 100 100 100 100 100 100 100 100 100 100 100 
##$AQSEQ= 0
##$AQ_mod= 1
##$AUNM= <au_zg>
##$AUTOPOS= <>
##$BF1= 200.13
##$BF2= 200.13
##$BF3= 200.13
##$BF4= 200.13
##$BF5= 200.13
##$BF6= 200.13
##$BF7= 200.13
##$BF8= 200.13
##$BYTORDA= 1
##$CFDGTYP= 0
##$CFRGTYP= 5
##$CHEMSTR= <none>
##$CNST= (0..31)
1 1 145 1 1 1 1 1 1 1 1 1 1 1 1 1 1 1 1 1 1 1 1 1 1 1 1 1 1 1 1 1 
##$CPDPRG= <>
##$CPDPRG1= <>
##$CPDPRG2= <>
##$CPDPRG3= <>
##$CPDPRG4= <mlev>
##$CPDPRG5= <mlev>
##$CPDPRG6= <mlev>
##$CPDPRG7= <mlev>
##$CPDPRG8= <mlev>
##$CPDPRGB= <>
##$CPDPRGT= <>
##$D= (0..31)
0 1.2 0 0 0 0 0 0 0 0.06 0 0.03 0 0 0 0 0.0002 0 0 0 0 0 0 0 0 0 0 0 0 
0 0 0 
##$DATE= 1732876308
##$DBL= (0..7)
120 120 120 120 120 120 120 120 
##$DBP= (0..7)
150 150 150 150 150 150 150 150 
##$DBP07= 0
##$DBPNAM0= <>
##$DBPNAM1= <>
##$DBPNAM2= <>
##$DBPNAM3= <>
##$DBPNAM4= <>
##$DBPNAM5= <>
##$DBPNAM6= <>
##$DBPNAM7= <>
##$DBPOAL= (0..7)
0.5 0.5 0.5 0.5 0.5 0.5 0.5 0.5 
##$DBPOFFS= (0..7)
0 0 0 0 0 0 0 0 
##$DE= 6
##$DECBNUC= <off>
##$DECIM= 24
##$DECNUC= <off>
##$DECSTAT= 4
##$DIGMOD= 1
##$DIGTYP= 9
##$DL= (0..7)
0 120 120 120 120 120 120 120 
##$DP= (0..7)
150 150 150 150 150 150 150 150 
##$DP07= 0
##$DPNAME0= <>
##$DPNAME1= <>
##$DPNAME2= <>
##$DPNAME3= <>
##$DPNAME4= <>
##$DPNAME5= <>
##$DPNAME6= <>
##$DPNAME7= <>
##$DPOAL= (0..7)
0.5 0.5 0.5 0.5 0.5 0.5 0.5 0.5 
##$DPOFFS= (0..7)
0 0 0 0 0 0 0 0 
##$DQDMODE= 0
##$DR= 18
##$DS= 0
##$DSLIST= <SSSSSSSSSSSSSSS>
$$ [...]
##$SUBNAM2= <"">
##$SUBNAM3= <"">
##$SUBNAM4= <"">
##$SUBNAM5= <"">
##$SUBNAM6= <"">
##$SUBNAM7= <"">
##$SUBNAM8= <"">
##$SUBNAM9= <"">
##$SW= 24.0689530833862
##$SWIBOX= (0..15)
0 0 2 0 0 0 0 0 0 0 0 0 0 0 0 0 
##$SW_h= 4816.95568400771
##$TD= 16384
##$TD0= 1
##$TE= 0
##$TE2= 300
##$TE3= 300
##$TEG= 300
##$TL= (0..7)
0 120 120 120 120 120 120 120 
##$TP= (0..7)
150 150 150 150 150 150 150 150 
##$TP07= 0
##$TPNAME0= <>
##$TPNAME1= <>
##$TPNAME2= <>
##$TPNAME3= <>
##$TPNAME4= <>
##$TPNAME5= <>
##$TPNAME6= <>
##$TPNAME7= <>
##$TPOAL= (0..7)
0.5 0.5 0.5 0.5 0.5 0.5 0.5 0.5 
##$TPOFFS= (0..7)
0 0 0 0 0 0 0 0 
##$TUNHIN= 0
##$TUNHOUT= 0
##$TUNXOUT= 0
##$USERA1= <user>
##$USERA2= <user>
##$USERA3= <user>
##$USERA4= <user>
##$USERA5= <user>
##$V9= 5
##$VALIST= <valist>
##$VCLIST= <CCCCCCCCCCCCCCC>
##$VD= 0
##$VDLIST= <DDDDDDDDDDDDDDD>
##$VPLIST= <PPPPPPPPPPPPPPP>
##$VTLIST= <TTTTTTTTTTTTTTT>
##$WBST= 1024
##$WBSW= 4
##$XGAIN= (0..3)
0 0 0 0 
##$XL= 0
##$YL= 0
##$YMAX_a= 292447
##$YMIN_a= -160882
##$ZGOPTNS= <>
##$ZL1= 120
##$ZL2= 120
##$ZL3= 120
##$ZL4= 120
##$ABSF1= 10
##$ABSF2= 0
##$ABSG= 5
##$ABSL= 3
##$ALPHA= 0
##$AQORDER= 0
##$ASSFAC= 0
##$ASSFACI= 0
##$ASSFACX= 0
##$ASSWID= 0
##$AUNMP= <proc_1d>
##$AZFE= 0.1
##$AZFW= 0.1
##$BCFW= 1
##$BC_mod= 2
##$BYTORDP= 1
##$COROFFS= 0
##$CY= 11.3945322036743
##$DATMOD= 1
##$DC= 2
##$DFILT= <>
##$DTYPP= 0
##$F1P= 15.6554695791079
##$F2P= 12.8336369535428
##$FCOR= 0.5
##$FTSIZE= 0
##$FT_mod= 4
##$GAMMA= 1
##$GB= 0.15
##$INTBC= 1
##$INTSCL= 1
##$ISEN= 128
##$LB= 0.24
##$LEV0= 0
##$LPBIN= 0
##$MAXI= 10000
##$MC2= 0
##$MEAN= 0
##$ME_mod= 0
##$MI= 1.114404
##$NCOEF= 0
##$NC_proc= 0
##$NLEV= 6
##$NOISF1= 3.799351
##$NOISF2= 2.8
##$NSP= 1
##$NTH_PI= 0
##$NZP= 0
##$OFFSET= 15.70392
##$PC= 1
##$PHC0= -26716.91
##$PHC1= 15.58744
##$PH_mod= 1
##$PKNL= yes
##$PPARMOD= 0
##$PSCAL= 0
##$PSIGN= 0
##$REVERSE= no
##$SF= 200.130013532006
##$SI= 16384
##$SIGF1= 3
##$SIGF2= 2
##$SINO= 400
##$SIOLD= 16384
##$SREGLST= <1H.CDCl3>
##$SSB= 0
##$STSI= 0
##$STSR= 0
##$SW_p= 3612.71676300578
##$SYMM= 0
##$S_DEV= 0
##$TDeff= 0
##$TDoff= 0
##$TI= <>
##$TILT= no
##$TM1= 0
##$TM2= 0
##$TOPLEV= 0
##$USERP1= <user>
##$USERP2= <user>
##$USERP3= <user>
##$USERP4= <user>
##$USERP5= <user>
##$WDW= 1
##$XDIM= 8192
##$YMAX_p= 0
##$YMIN_p= 0
$$ End of Bruker specific parameters
$$ ---------------------------------
##NTUPLES= NMR FID
##VAR_NAME=  TIME,          FID/REAL,        FID/IMAG
##SYMBOL=    X,             R,               I
##VAR_TYPE=  INDEPENDENT,   DEPENDENT,       DEPENDENT
##VAR_FORM=  AFFN,          ASDF,            ASDF
##VAR_DIM=   8192,          8192,            8192
##UNITS=     SECONDS,       ARBITRARY UNITS, ARBITRARY UNITS
##FACTOR=    0.0002076,     1,               1
##FIRST=     0,             0,               0
##LAST=      1.7004516,     0,               0
##MIN=       0,             -160882,         0
##MAX=       1.7004516,     292447,          0
$$ Real data points
##PAGE= N=1
##DATA TABLE= (X++(R..R)), XYDATA
0@%%%%%%%%qJ6j6J6j6K4l2L4m2N2o0P2q8J04j20J36j56J81k07K36k68L03l42L85
32B04m33M85n41O03o75P52q33R24j026J137j257J391j542J710j896K108k351K630
50A390k954L337l798M366n088O040p362R343j2682J9783o3286O6184J850j78005
64a60882K4734J00242k9131r4064M5293O7374o388L182N8251j0269l7430N3719
76A4631P0314o0325o7318O5581P4688n6477n6546N3594M6462n2163l9579K3534
88A6396Q313k7214J441J2043j2871N169L5374o106m1510N440L2054k5309l4439
101c1219L7399M5074k6536k7776L4084K0093l5657r720L9435K967l5111L930K4551
114D1514j6826j6230L3531J5395m0861j5105L8064L52m8393L149N5089K438m5481
$$ plain form
0 0 0 0 0 0 0 0 0 0 -8 8 -8 8 -8 16 -16 18 -24 28 -32 40 -48 56 -64 72 -84 97 -110 126 -142 161 -181 204
32 204 -229 256 -285 318 -357 395 -438 486 -540 597 -660 731 -811 899 -997 1111 -1240 1390
50 1390 -1564 1773 -2025 2341 -2747 3293 -4069 5274 -7408 12375 -50911 15273 17123 -160882
64 -160882 -136148 -35906 -65037 -159101 -113808 -46434 -52822 -49640 8611 -1658 -39088 14631
76 14631 84945 24620 -42698 22883 97571 41094 -15452 38142 84604 32441 -7138 16396
88 16396 24709 -2505 -1064 10979 -1892 3277 38651 32545 -8965 -3525 28529 3220 -31219
101 -31219 6180 51254 24718 -3058 31026 51119 15462 5742 45177 48144 13033 16963 41514
114 41514 24688 8458 41989 57384 16523 1418 39482 39834 -8559 -5410 49679 52117 6636
127F636K94L3802j1191l4877O984K3152n377m932J6345Q73j7622M215J4155j5934
141A6523j9289J8529J8920j9467j6527J7766J1347j6069m833J3496k137j5499
153B760K256P384p743l13J8208p82k2814k805J7552o031j9058J1585K3332j0392
167A3139k1518J0855J5729j6402j5948J5875J0914j5036o649J4810J861j4993
179g363K162J3547n395j1582P633P720j3551q441J4812R886j2515p122J0322K169
193B282j1126l658R139L538k566J87p67m713J521M131m569n170P273P286q790
208f002o921P847M437p548j995P519r37p502L403N640o692m766J0496N811j1870
223i080n545J1092L188j2236j340J3849J184j2311j90R962l191r308N330R052
$$ plain form
127 6636 6930 40732 29541 -5336 1648 24800 19423 14491 30836 31709 14087 18302 32457 16523
141 16523 -2766 15763 34683 15216 -1311 16455 27802 11733 6900 20396 18259 2760
153 2760 5016 12400 4657 4344 22552 21770 -1044 -3849 13703 7672 -11386 199 23531 13139
167 13139 -8379 2476 18205 1803 -14145 1730 12644 -2392 -9041 5769 7630 -7363
179 -7363 -5201 8346 2951 -8631 -998 6722 -6829 -15270 -458 9428 -3087 -10209 113 2282
193 2282 -8844 -12502 -3363 175 -2391 -2204 -2971 -7684 -6163 -2032 -6601 -11771 -4498 2788 -6002
208 -6002 -12923 -5076 -639 -8187 -10182 -2663 -3600 -11102 -7699 -2059 -8751 -13517 -3021 2790 -9080
223 -9080 -14625 -3533 -345 -12581 -13921 -72 1112 -11199 -11389 -1427 -4618 -13926 -8596 456
237D56n292o606O873M458p989l358P478K787o857m39O232p13n322J395M572j697
253d022l200J681K316k120j023J931J487q21N17l04j545L28K009j384j463K802
269b811K829k476k217J891R74k531j4L327m78j865K024K259l118k043L242L221
285B214m260k755M768K172k858j580L610M43k517m06J387l69o32K142J058j707
301G10m88L085l84l324q20L382N79j523M4J863L06p67L09p55j229R83J320r52
319B339j101J554K569j101k252J033P69j125j089J198J169n52J78J172n10j159
335C092j04K14n67n89P78J357k08n30K32M01j414l98O89j06m28n09J821P97j344
354C184q72M98N25j060j163k03J103P16k30o85K32L02N8j379j092O50O41J38r43
$$ plain form
237 456 -4836 -11442 -4569 -111 -8100 -11458 -3980 -1193 -8050 -8489 -2257 -2970 -8292 -6897 -2325 -4022
253 -4022 -7222 -5541 -3225 -5345 -6368 -4437 -2950 -3771 -3254 -3558 -5103 -4775 -2766 -4150 -5613 -2811
269 -2811 18 -2458 -4675 -2784 -1810 -4341 -4355 -1028 -1506 -3371 -1347 912 -2206 -4249 -1007 2214
285 2214 -2046 -4801 -33 2139 -719 -2299 1311 1754 -763 -1169 218 -151 -783 1359 2417 710
301 710 222 3307 2923 -401 -1221 2161 2740 1217 1261 3124 3430 2663 2972 2217 988 1971 3291 2339
319 2339 1238 2792 5361 4260 2008 3041 3810 2685 1596 2794 3963 3411 3589 4761 4251 3092
335 3092 2988 3202 2635 2046 2824 4181 3973 3443 3675 4076 2662 2264 2953 2847 2419 1910 3731 4528 3184
354 3184 2312 2810 3335 2275 1112 909 2012 2728 2498 1813 2045 2347 2405 1026 -66 584 1225 1363 420
373D20K7J022L62j089j349l91J419j00j055l95J614R65j039j389q7P64Rj208n30
392b030M14N01M41m13n81K90O11n72j125l93J140N18m95r53R92P32o54q22l72
411b771K08J6k74K36M14j25K0L69k75l10M0n25R1K65J84J59N04O2J76M2r11o9
433b474M36M72o68l34J311O20l70j065p4J151Lj131j45P54R73L7m70k95Q06J23
453c40l18j150j91J601R79l21q82O16Q07j28j090o54N95Q78l40n20O38J192L47
472A719q62p09P1N84l94m59J89J253N78q61p4L10k29R0q09N20M74j80M07N3o0
493A611k67K81l64n84J1M54K59k83J73J142k44q50o76P47j04r37k03J414J080
512B660j203q23J005Q71j555j018Q98Q31n00p17M05O72l24l6K06o78l64K95P10
$$ plain form
373 420 447 1469 1831 742 -607 -998 421 321 -734 -1129 485 1450 411 -978 -1065 -301 -292 -1500 -2030
392 -2030 -1616 -1115 -674 -1087 -1668 -1378 -767 -1339 -2464 -2857 -1717 -1199 -1694 -2647 -1655 -923 -1577 -2399 -2771
411 -2771 -2563 -2547 -2821 -2585 -2171 -2296 -2276 -1907 -2182 -2492 -2452 -2977 -2886 -2621 -2437 -2278 -1774 -1712 -1536 -1494 -2405 -2474
433 -2474 -2038 -1566 -2234 -2568 -1257 -637 -1007 -2072 -2146 -995 -992 -2123 -2268 -1514 -541 -504 -974 -1269 -463 -340
453 -340 -658 -1808 -1999 -398 581 260 -622 -6 801 673 -417 -1071 -476 402 62 -458 180 1372 1719
472 1719 857 148 219 803 409 -50 139 1392 1970 1109 1035 1345 1116 1206 397 917 1391 1211 1618 1671 1611
493 1611 1344 1625 1261 677 688 1142 1401 1118 1291 2433 2189 1339 663 1410 1306 369 166 1580 2660
512 2660 1457 634 1639 2510 955 -63 835 1666 1166 449 854 1526 1202 1166 1372 694 330 625 1335
531A335q00m74R05J565p14k025l61J582N5j873M37J737J070j598p61P51J78o16
549C93q73J099K56r39M56O86n03j020Q13J558j443j371P54J503j024j495J299
566A49J991r32k168K53J726j030j204J473J822j211j821R66J391j689j016J421
582A21J465j118j275P52R27j060n55J279M96j029p39O61J1j394M88J509R09j659
600b11j002J017M53j346r00J969J854j347k209L49J377l92r54O12J542j087r73
617a248J60L59n82p7J319M04j493n57R46K34j816m02K646J171k205j101J142L15
635g85j081m83J905J025j366j654O77P55p54M15J070O58j398r38M97K96p12M4
653a829J543R10j674j168P28M69q76k89K137P52j580j086J086L47j862L18K710
$$ plain form
531 1335 535 61 966 2531 1817 -208 -569 1013 1068 -805 -368 1369 2439 841 80 831 1009 393
549 393 -480 619 875 -64 392 1078 575 -445 368 1926 483 -888 -134 1369 345 -1150 149
566 149 2140 1208 -960 -707 1019 -11 -1215 258 2080 869 -952 14 1405 -284 -1300 121
582 121 1586 468 -807 -55 872 -188 -743 536 1032 3 -736 -75 -64 -1458 -970 539 1448 -211
600 -211 -1213 -196 257 -1089 -1989 -20 1834 487 -1722 -1373 4 -388 -1342 -730 812 -275 -1248
617 -1248 -1088 -729 -1311 -1388 -69 335 -1158 -1715 -769 -535 -2351 -2753 -107 1064 -1141 -2242 -1100 -785
635 -785 -1866 -2349 -444 581 -785 -2439 -1762 -1007 -1761 -1346 -276 382 -1016 -1954 -1457 -1161 -1873 -1829
653 -1829 -286 624 -1050 -2218 -1490 -1021 -1897 -2186 -49 703 -877 -1963 -877 -530 -2392 -2074 636
670F36R20k665j477J491J163j358o45K722O66k339j148J100N38q48K42K080K09
687A287k002m67J597n94j622Q81L080l30l072j28K198j70j958L63L007j03k630
704f63n14J524N68j126P91J585k2k485l18J433o9j853J425K702n47k783O40J212
722A500j091j404J474K787j167k592O23J407q89j572J943K131j535k215L57J666
738A423q25j294J891J761j237k619N66J710j120j040J986J450j308j664P12Q07
754A199j720o26K337J518k415j039Q15Q33j635l69J978J405k150j373R75P02p42
771c07K9R29J009j226j224M94K41o86L1J814J75j423p86J094j17j261L81J492
789F59O29j376j436J055Q14q89o88J603P91j530q62K74J037m11L4O06O84j580
$$ plain form
670 636 1556 -1109 -2586 -1095 68 -1290 -1935 787 1453 -886 -2034 -934 -396 -1244 -1002 1078 1287
687 1287 -715 -1182 415 -179 -1801 -920 2160 1830 -1242 -1370 828 658 -1300 -937 2070 1967 -663
704 -663 -1177 347 915 -211 580 2165 2143 -342 -660 773 704 -1149 276 2978 2431 -352 288 1500
722 1500 409 -995 479 3266 2099 -493 130 1537 648 -924 1019 3150 1615 -600 -243 1423
738 1423 598 -696 1195 2956 1719 -900 -334 1376 256 -784 1202 2652 1344 -320 392 1199
754 1199 -521 -1147 1190 2708 293 -746 69 902 -733 -1102 876 2281 131 -1242 -267 435 -307
771 -307 -278 651 1660 434 -790 -296 -55 -741 -710 1104 1279 -144 -930 164 47 -1214 -833 659
789 659 1288 -88 -1524 -469 345 -544 -1232 371 1162 -368 -1230 -956 81 -330 -296 310 994 -586
807e86m22O95L58n88n8J110P48j492L3k66M61p76L29J111J23p25q48R23r3m05
827c68j68J325k65q33r82J024R22o12l40J044O95j154j139O38O35p78O0Q72M51
846A027q25m94M55Q7o96OJ604k09j457j46J283j47q12K80R74J55j514l25Q84M38
866E68l70j60N71j32q49k45R12l15j96J2R92l12j319L83P35o8j022O28J159m47
886E25r35m7P26k98l91L29P58q49n79K94P61k25q38P01Q92p99j164P09O83m15
906a62o93P35M67n66j64J20J00k34l26M51M56o25r0K61M91m62k58M13Q35o50q41
927g42J99Q29l50p9J55J52m96j3p0L34j80j62O72J5l52j72N92m1o14k33P10%k52
950i8l29J19O25k72kj54N29j63k84J57K31j33k37N18n30Q5J2k72O00m19J66r0
$$ plain form
807 -586 -1008 -313 45 -543 -601 509 1257 -235 -202 -468 -7 -783 -454 657 780 55 -793 130 37 -368
827 -368 -536 789 524 -309 -1291 -267 655 43 -297 747 1442 288 -851 -213 422 -356 -296 576 1027
846 1027 202 -292 163 250 -446 -440 1164 955 -502 -648 635 488 -324 -44 930 1085 -429 -754 130 568
866 568 198 38 609 477 -372 -617 295 -20 -216 -204 788 476 -843 -460 275 207 -815 -187 972 525
886 525 -410 -457 269 -29 -420 -91 667 -182 -761 -467 294 69 -769 -68 824 25 -1139 -430 253 -162
906 -162 -855 -120 347 -219 -383 -263 -163 -397 -723 -272 184 -441 -531 -270 221 -241 -499 -86 749 99 -742
927 -742 -543 286 -64 -143 12 164 -332 -345 -415 -81 -261 -423 249 264 -88 -260 332 291 -323 -556 154 154 -98
950 -98 -427 -308 317 45 43 -111 418 255 -29 128 359 226 -11 507 -23 62 74 -198 402 -17 149 59
972E9K24l32P6N18k90j7j23J01j18l23N54j04r5j32p8L57j98ql08J46J58k14L18
995A71j44K24j36l8m59K54K18J77l92k24K94Q9k51L87o55K79P1k8Ql39L83J85
1017G4l96m30R97k08j15n16M24K21l06j73J78J39l00J16J04l5L19n4mj17l60J91
1039b51Q0l13J11K65j99M3j55K19Pj54n2Q4M1N8O0j56L01k29q7K99j92M30j29
1062H1j13K2L5K14m19L09q4J05J8j91K36j47J56j16j81m52P07o3j12J86j3N8J31
1085C67k70l9K20m5J90k68J24K69R5l17m30L70J57l54K58l69M61L53p13J82j96
1106D5M17j15l34p8M37k93K81k51K41Q4j5l7j52j90q9K48k95L26j24K68k73K17
1128C18l83r7J4N7R1j12K43l27J69R8Q2M0m20k7M57J0m56K36m5J61l17j20J72
$$ plain form
972 59 283 -49 27 545 255 238 115 216 98 -225 329 225 130 -2 -80 277 79 71 -237 -91 67 -147 171
995 171 27 251 115 77 -382 -128 90 267 -125 -349 -55 34 -217 170 -485 -206 -135 -163 -155 -494 -111 74
1017 74 -322 -752 245 37 -78 -594 -170 51 -255 -428 -250 -111 -411 -295 -191 -226 93 39 35 -82 -442 -251
1039 -251 -171 -484 -373 -108 -307 -264 -419 -200 -193 -347 -399 -315 -274 -216 -156 -312 -11 -240 -327 -28 -220 210 81
1062 81 -32 -10 25 239 -180 129 45 150 168 -23 213 66 222 106 -75 -527 180 117 5 191 178 236 367
1085 367 97 58 278 233 423 155 279 548 643 326 -104 266 423 69 327 -42 419 772 59 241 45
1106 45 462 347 13 -65 372 79 360 109 350 434 419 382 230 40 -49 199 -96 230 106 374 101 318
1128 318 -65 -162 -148 -91 0 -112 131 -196 -27 71 153 193 -227 -254 203 213 -243 -7 -52 109 -208 -328 -156
1151a56o3K11k97K50O2M8l89M66l87J02L22l87l20M10L39q3k52j18L39Oj07k94
1173b98k23L98j8j0kK31Pk51o8J82J65j38l8j06L79Ok11j19K17k57j18K20k5k04
1197b81J78L40l51J4l7M28m93j26L94J98q7j58j76M00j41j9J61Qj32l78L72J35
1219B49j09j50P0M79k83k78K11J58j98l64N53L0l74j56J97L9l0k22J85K33k27
1240A3k95M1N52j6m31n8N75l78o94L97K70P0j8O5K53n10j91J93L53m52l2O32j89
1263A50k21l15J69M11k59m79M48L63m26n2j57L21K74m17L46j84j37k32j06L78
1283a25Rj13N84m45l20j59N14K02l68L34o5K14l30o02P66j20n29M29J96L29q11
1304d10j60P21k10k24L09L51k0r69k57J029j48K05l31M21J18q16M3M16J80l62
$$ plain form
1151 -156 -219 -8 -305 -55 7 55 -334 132 -255 -153 169 -218 -538 -128 211 128 -124 -242 97 103 -4 -298
1173 -298 -521 -123 -141 -151 -153 78 85 -166 -234 -52 113 -25 -63 -169 210 216 5 -114 103 -154 -272 -52 -77 -281
1197 -281 -103 237 -114 -100 -137 291 -202 -328 66 264 177 19 -157 243 102 83 244 252 120 -258 114 249
1219 249 140 -10 60 539 256 -22 189 347 149 -215 338 368 -6 -162 35 74 44 -178 7 240 13
1240 13 -282 -241 311 295 -136 -194 381 3 -691 -294 -24 46 28 93 346 -164 -355 -162 191 -261 -293 339 150
1263 150 -71 -386 -217 194 -65 -544 -96 267 -159 -211 -368 -47 227 -190 156 -28 -165 -397 -503 -125
1283 -125 -116 -229 355 -90 -410 -569 -55 147 -221 113 48 262 -68 -670 96 -24 -553 -124 72 401 -410
1304 -410 -570 151 -59 -283 26 377 357 -612 -869 160 12 217 -114 307 425 -391 -348 68 248 -114
1324a14K54K62k07r14L19P32l1k99RQ81k89j144P0N00O07n59L75k00Km58q6N73
1346B83j26j32L57J13O6j330O02N78l96k30L00L02j03q05K6R26n29k5N67q7j16
1367B41p56J02P03n4k98j1O90m97m97J72R4O8l98M37M62j86m70n1M05j53o2K29
1389A70N42n71j008L92N32k87J7N57J93m43o65Q0Q44p8p30L86L66m97q07P46L53
1410I2K1o0l18O13l58p02N07L03l13k65P65J10q50l88O20M0J05l33L74M18o86
1431c05k47K35P74k63p6m9J68m24k12j58R41m07k83P91o2o46j15L64P8k49mL17
1453A68L4k11k59L00J37j43p6M78k5l88k61L39L88p34L37p4K55k02m66O84N2k52
1475H1J8J46J40n69Q9N2ORj88N20j00j7l08P00l22l98J99M09j71o27j87P10k7
$$ plain form
1324 -114 140 402 195 -719 -400 332 301 2 11 892 603 -541 -471 29 636 77 452 252 254 -204 -290 283
1346 283 157 25 382 495 561 -769 -167 411 15 -215 85 387 284 -521 -495 431 -98 -123 444 357 241
1367 241 -515 -413 290 236 -62 -73 617 120 -377 -205 -111 -43 -441 -4 458 272 -198 -249 156 3 -59 170
1389 170 712 141 -867 -475 57 -230 -213 344 537 94 -571 -491 353 275 -455 -69 297 -200 -1007 -261 92
1410 92 113 53 -265 348 -10 -712 -205 98 -215 -480 285 395 -455 -843 -223 -183 -78 -411 -37 381 -305
1431 -305 -552 -317 457 194 118 69 237 -187 -399 -557 384 -23 -306 485 423 -223 -338 26 104 -145 -149 168
1453 168 202 -9 -268 32 169 26 -50 428 403 15 -246 93 481 -253 84 10 265 63 -403 281 333 81
1475 81 99 245 385 -184 -95 -43 -37 -28 -216 304 204 187 -121 579 257 -141 58 467 296 -331 -518 192 165
1498A65l66M42O3R8q31M96k15L09j2n12N73j03m32p8M61M39n52kL8J24j81k61
1520c37M80j6N6m31L87n2k49l15J24M25l42M70J12m75k6j84M82Q7l51j14J79M80
1542C90o75l9M26p3J24o7o7m1k45L51j11K4m08J57J95k33K5N9J86o0J70k63K24
1565D9k72L28n69O63m59J73j65M92j88l03L72L97o03j64K71L13m03j76O0N14j74
1586A56l86M38L8m48N6r0K2J22k6J47J52k23M3O5O3l56K91j43O1J24l10R1L03
1609A90q8j05L23m3m88J05M02m5o02K34k5j76L44j14pQ4o7l6J52N6q2j78M65k37
1633F2K4j64K09m07J52m5J5nJ8K34j99j29J0J14n7K83J7l01J96p6j01KL34J3l70
1658a71L12l42k5J51J17j23l5q2jJ96J03l65L65k94n1k5l9M1L28k50J00J26j0
$$ plain form
1498 165 -201 241 304 402 -429 67 -148 161 149 -363 210 107 -325 -403 58 497 -55 -57 -19 105 -76 -337
1520 -337 143 127 183 -248 139 87 -162 -477 -353 72 -270 200 312 -163 -189 -373 109 196 -155 -269 -90 390
1542 390 -285 -324 102 29 153 86 19 -22 -267 84 -27 -3 -411 -254 -59 -292 -267 -208 -22 -82 88 -175 49
1565 49 -223 105 -464 199 -260 -87 -252 240 52 -251 121 518 -85 -249 22 335 -68 -244 -184 330 156
1586 156 -230 208 246 -202 -146 -236 -214 -92 -118 29 181 -42 1 66 129 -227 64 -79 -18 106 -204 -113 190
1609 190 102 -3 320 277 -211 -106 296 251 -351 -117 -142 -318 26 -88 -95 -11 -78 -114 38 94 12 -166 299 62
1633 62 86 -78 131 -276 -124 -169 -154 -159 -141 93 -106 -235 -225 -111 -168 115 132 -169 27 -49 -150 -148 186 199 -171
1658 -171 141 -201 -226 -75 42 -81 -116 -198 -199 -3 100 -265 100 -194 -245 -270 -309 -268 60 -190 -90 36 26
1681B6k60K2J54N2l26M86j15J87j48m0j75L30j07j49J35p9k02L94m38J11N1J33
1703D2J90j78j02K90k75Mj38N35k20m8N6kM1L8j47L29l40k45K18J09k39M89m31
1726b4o1K85l19K97j51j68K34L60j75k07J93m08K3K64q9l63M62M0l57L08MM4p4
1749A18k35L39q2k5o1K15l23J2l7J38O4k11m2m3L4L65j85Qj91K52j29k72O11k98
1773B2J65J12j72l96M12k0l77L4K78j12m8q7p7J40j72P5J68R3k40J37j45J5L87
1796A92m97J57q0K24p5L48L2l38Q7m12K36K03k05n2L04K0n9N9l93M09j30jnR0
1820A14m48L55j89J98J23j3P5k12O5J59l74K40J04l36M27j83j93K7O3Qj84M51
1842B77j31j54k49K96J74j72m9R6P7k97KJ63J63m9K18l51l08L89J62l85J73K08
$$ plain form
1681 26 -234 -212 -58 -6 -332 154 39 226 78 38 -137 193 86 -63 72 -7 -209 185 -253 -142 -91 42
1703 42 232 54 -48 242 -33 -29 -167 368 148 100 156 154 195 233 86 415 75 -170 48 157 -82 407 -24
1726 -24 -85 200 -119 178 27 -141 93 453 278 71 264 -144 -121 143 54 -309 153 193 -164 144 148 192 118
1749 118 -117 222 140 115 54 269 -54 -42 -79 59 123 -88 -130 -173 -139 226 41 49 -142 110 -19 -291 320 22
1773 22 187 299 127 -269 143 123 -254 -220 58 -54 -102 -189 -266 -126 -298 -223 -55 38 -202 -65 -210 -195 192
1796 192 -305 -148 -228 -4 -79 269 301 -37 50 -362 -126 77 -128 -180 124 144 85 144 -249 160 30 29 24 114
1820 114 -334 21 -168 30 153 140 215 3 68 227 -147 93 197 -139 288 105 -88 -61 2 10 -174 277
1842 277 146 -8 -257 39 213 41 -8 88 165 -132 -130 33 196 147 365 14 -294 95 257 -128 45 253
1864B53m03L7J35J23l44M54j62k59M8K7K75Pm92N09m1O3k66J18r8K61m31J06K35
1887A55k48l84M35lj20J11K6K59m62J06J81N57q24m0M4nj83J40K75L6Q4k75J7
1910a18K34m16K00K74o8L7j24p7O1j01p3L04Km41K84J40j80j61J66J25J91p6q4
1933I9L2l86M2r5N53J13l15q7j07L22q3k05K74J72k94j36j02K21m46M56k39N70
1955C59m34J06l82K62J1r0K15M2Ok07K25J91j51m22N09J41m47k18L04p9R4k8J60
1978A67j58j2L50j74j97Q2J5o6q1J92j03K48j47M1k67J42m1o6R5r3O9m6l16P60
2002C94m02J83m07L04j09r9P8K34o2l59K43l85L57l65O28j05j89r2qj2j4k2K84
2025G5P8q7l21L46K52l61j90J30K19j09j33RJ08k97Q6R0N9P1j37M48l75j33J30
$$ plain form
1864 253 -150 -113 22 145 -199 255 93 -166 -118 -91 184 191 -301 208 167 230 -36 82 -16 245 -186 -80 155
1887 155 -93 -477 -42 -45 -165 -54 -28 231 -231 -125 56 613 -211 -251 -207 -212 -395 -255 20 56 140 -135 -118
1910 -118 116 -300 -100 174 106 143 19 -58 3 -98 -171 133 135 -306 -22 118 -62 -223 -57 68 259 183 99
1933 99 131 -255 -213 -308 245 358 43 -44 -151 171 88 -117 157 329 35 -101 -203 18 -428 28 -211 359
1955 359 -75 31 -351 -89 -78 -168 47 89 95 -112 113 304 153 -269 240 381 -66 -284 20 -59 35 7 167
1978 167 9 -3 347 173 -24 58 73 7 -74 118 15 263 116 157 -110 32 -9 -75 20 -73 -4 -50 -366 394
2002 394 -8 175 -232 72 -37 -136 -58 176 114 -245 -2 -387 -30 -395 233 128 -61 -153 -161 -173 -187 -209 75
2025 75 153 66 -255 91 343 -18 -208 -78 141 32 -101 -92 16 -281 -195 -105 -46 25 -112 336 -39 -172 -42
2048d2J44J93j11j98j8k5J06M4K13j95O5k69N9J05m5l54N53l8k55K5j03N10q01
2071d37K49M13L43l58j44j45L78n87M55J39j68l58K60J11o2j55o5N45n1l15j10
2092f2L33k29k62L56k39J22J64k41k3K00l70J5M65J6m37O6K55qK6p8J73k41j9
2115a8o1P1J13k65L6n6K82O3j67K1j65J25K9K06k97m9O6J71j83J14N0K14m06L8
2139f8J62k31R4k92L39L4O0j29o3L13m77K91K6M3r1K2O3N9m6o18O9O27J24n85
2163b74J08M35K1m49K24j14J31k58J22l31J91J35K2J08k21j34L81O8k51K1q1q
2185a54R2J1j44L44j31J79J6j98j22J56P5q1k23N1M31k51k30K72k70M85j75k00
2207f7M1k15J99J68K99k05p43L93J4p0J27j04J59m9o2j13L95k16R2j2M6r2K1j74
$$ plain form
2048 -42 102 295 184 -14 -32 -57 49 93 306 111 176 -93 -34 71 26 -328 225 187 -68 -43 -146 364 -437
2071 -437 -188 225 568 210 66 -79 299 -288 167 306 138 -220 40 151 89 -66 -131 414 363 48 -62
2092 -62 271 42 -220 136 -103 19 183 -58 -81 119 -251 -236 229 245 -192 -126 129 121 147 69 242 1 -18
2115 -18 -79 -8 105 -160 -124 -180 102 165 -2 19 -146 -21 8 214 -83 -132 -66 105 -78 36 86 300 -106 -68
2139 -68 94 -137 -43 -335 4 38 98 -31 -94 219 -258 33 59 102 11 33 96 155 109 -509 -440 187 311 -274
2163 -274 -166 269 290 -159 65 -49 82 -176 -54 -385 -194 -59 -37 71 -150 -284 97 165 -86 -65 -146 -154
2185 -154 -62 -51 -195 149 18 197 213 15 -107 49 124 43 -180 -129 302 51 -179 93 -177 308 133 -67
2207 -67 -26 -241 -42 126 425 220 -523 -130 -116 -186 -59 -163 -4 -53 -115 -228 167 -49 43 31 77 -15 6 -168
2231a68j32L71k14j74J64O8j3O7kK52k69J58n8K11m50J04Q0p3m3k30N29m66p0
2254c58L76J07k4j58n7L31k39J09l32L99j99n36P11J6L1n47N05j22J60j53nJ29
2276A44k79J71k78P0L76k93J27m8J72k51P6j67K17J22l40N66k47o7lP0l84K00
2298d6k12K77k06K70k03p1L09o4m33L28j33M06l24l5J61J35j56K16k61J2Lj0N4
2321A7j06K70j34J00j83k9P0l3J6Q0n9j78K47Oj8j71L25Q2l25n2j06J90Q1J22
2345B12l50j91M11o1o0J6J12M1n7j28k31K34M1q2q6L27mJ09k60P9M2N2J9j56K0
2370D9p1J76J15l22K8J21l5J12j44l88L58k57L51q5l78L50J80M3l28k1N23n95
2392b18O6n6K65k7k76J0J5L97j65j75k37L31J94j24j3l9j9J16l23L26k04P7K1
$$ plain form
2231 -168 -300 71 -143 -317 -153 -85 -98 -31 -33 219 -50 108 50 261 -189 -85 -5 -78 -121 -351 178 -288 -358
2254 -358 18 125 101 -57 -114 217 -22 87 -245 154 -45 -581 130 146 177 -370 135 13 173 20 15 144
2276 144 -135 36 -242 -172 204 -89 38 -10 162 -89 -13 -180 37 159 -181 385 138 71 68 138 -246 -46
2298 -46 -258 19 -187 83 -120 -191 118 54 -379 -51 -184 222 -102 -137 24 159 3 219 -42 -30 -27 -37 17
2321 17 -89 181 47 147 -36 -65 5 -28 -12 68 9 -169 78 84 66 -105 220 302 -23 -75 -181 9 90 212
2345 212 -138 -329 82 21 -39 -23 89 130 73 -55 -286 -52 -11 -93 -179 148 144 253 -7 72 114 166 185 29 49
2370 49 -22 154 269 -53 -25 96 61 173 29 -359 -1 -258 93 8 -370 -20 160 203 -125 -146 377 -218
2392 -218 -152 -208 57 30 -246 -236 -221 176 11 -164 -401 -70 124 0 -13 -52 -71 45 -278 48 -156 -79 -58
2415e8J53k04L46n56L88l3p0J37l15K64O8j93j1L25j36p4J15L4l7k37L11j14j16
2438a3M8ol00J57p7M70l76K24j7n0k11J53J53k64nR7l12M20J69j66k66NM52l96
2462a11J26Q3J85k45k4l40M11j43o7L4J61o8K06k00k9j03O2P9p0j17L13P2k95
2485h0L0L91j22m08M82j14R9m28M5mN03n12K83l1k3l0l86J90j49J72k47J39J77
2508b3J21j76k66N14k40J69j84K62j84%LM5M1p4m8r3L07j14K59n72L64o0J71j52
2532G0k11J68J18k06K27j60Q4k09j4L39j92k04J24K3J7l2J81j48J45k49L65k04
2554C2L1j44j46L68m10L41j67k31J74l3M22j65O9j09J74l58R0K66j74Q0J61k55
2576A6r0K35n47N44l83J43N45m44m1J56K09m86L83k94j79L60J17k51k16M92k73
$$ plain form
2415 -58 95 -109 237 -319 69 36 -34 103 -212 52 120 -73 -84 241 105 31 146 180 143 -94 217 103 -13
2438 -13 35 29 -271 -114 -191 279 -97 127 110 60 -151 2 155 -109 -114 -17 -329 91 260 94 -172 -167 285 -111
2462 -111 15 98 283 38 14 -326 85 -58 -125 -91 70 2 208 8 -21 -124 -62 17 -53 -170 143 215 -80
2485 -80 -50 341 219 -189 293 179 278 -150 -105 -109 394 -118 165 134 111 81 -305 -115 -264 -92 -339 -200 -23
2508 -23 98 -78 -344 170 -70 99 -85 177 -7 -7 -4 41 82 8 -40 -133 174 60 319 -253 111 51 222 70
2532 70 -141 27 145 -61 166 6 90 -119 -133 206 14 -190 -66 -43 -26 -58 123 -25 120 -129 236 32
2554 32 63 -81 -227 141 -269 72 -95 -326 -152 -185 237 72 141 32 206 -152 -62 204 30 110 271 16
2576 16 -74 161 -386 158 -225 -82 463 19 -22 134 343 -143 240 -54 -233 127 244 -7 -223 269 -4
2597dR9Q4n78P98k05l08j83M19K4O3k09J07k90o3J61L01k94R0K54l05M35j52k35
2620Ij00K80m43K74p9L48l76L72l97J24P7l94K72K48j28m77L69p9J72j50J65j34
2642d7j0O7J81K10o90J16j62N83j96K4p3j77K28j55q3L60k89J93N6m50K99j8J62
2665A29N0k48j8J23R1O3k14%j83N57n07R1K40k83P0K0L7n2P5M9k9M7L62m49k04
2690a83K97k0N9j95P7l1J42o4J3R7l51J36rJ44k46R5N2K05j04L8O2l34L35P2k52
2715C5p8l5K11j65O8J78L5k1R8j51l05K31q9L6j02Q7j9r2J24J19k19N90m74L07
2739C69n29O2K15o2Q5k85J79j59j86L27j7j17L42k4K38o46K86m5n1J86k09J20
2761G9pl05K35J83L7k47J83r7j73J57k2P4k22Q9k5K0J3Q0n00O91l63J28nk38K90
$$ plain form
2597 -4 95 179 -399 399 194 -114 -297 122 146 209 0 107 -183 -246 -85 216 -78 12 266 -39 396 244 9
2620 9 -91 189 -254 20 -59 289 -87 285 -112 12 89 -305 -33 215 87 -390 -21 -100 72 -78 87 -47
2642 -47 -57 10 191 401 -289 -173 -335 248 52 76 3 -174 54 -101 -184 176 -113 80 136 -314 -15 -33 129
2665 129 179 -69 -87 36 127 190 -24 -24 -207 350 -157 -66 174 -109 -39 -19 18 -34 41 90 61 108 470 21 -183
2690 -183 114 94 153 -42 35 4 146 82 95 192 -159 -23 -32 112 -134 -39 13 218 114 152 214 -120 215 287 35
2715 35 -43 -78 133 -32 36 214 249 228 326 175 -130 101 12 48 -54 33 14 -78 46 165 -54 536 62 369
2739 369 -160 -98 117 55 140 -145 34 -125 -311 16 -1 -118 224 200 438 -208 78 33 -18 168 -41 79
2761 79 72 -233 2 185 222 -25 158 61 -112 45 23 97 -125 -36 -61 -41 -28 52 -448 243 -120 8 3 -235 55
2786E5K1Rk05k0R2k23N4J98j14N4j07L02P3K4p2j23k74M2M84l28K04L9j32j46
2810i3Q4l4j28Q2J67J84n8l42J37R1l33qj09P02m14K21j84O5J61j94k48L17L15
2833C81j77k14p4L26l64M34l78j27L86j63L7J15j70r9J17j83J50L87n20K37p9
2854B2L8j85J07j64J79l28L05K0J67j11o6j11L09Q8m43J02J13j57j81N20k57K3
2876a0k37M37l93O5L86k05K55J03m88o4K8j89K63j13lL64j55o9P1j96L39k77P3
2899a5M6j41M1K58l84L80l69N6Q2K62k46j81J82n0m1J13L8j88J6kj42L47P0k02
2923g0K19J86m26j12J00K42r2J2n6j01J58k20L57j75k52L37q3J0q0J44j81O4j81
2946b00n8O78m42J72n61O77k95O4J21J8Q2l79K60k4J85l37o6J42l85N73J9l64
$$ plain form
2786 55 76 85 -120 -140 -48 -271 -217 -19 -133 -79 -186 116 189 213 141 18 -256 -214 270 -58 146 185 53 -93
2810 -93 -9 -43 -171 -89 78 262 204 -138 -1 90 -243 -251 -360 342 -72 149 -35 30 191 -3 -251 66 381
2833 381 204 -10 -84 242 -122 312 -66 -193 193 30 67 182 12 -87 30 -153 -3 384 -136 101 22
2854 22 60 -125 -18 -182 -3 -331 -26 -6 161 50 -16 -127 182 270 -173 -71 42 -115 -296 224 -33 -10
2876 -10 -247 190 -203 -138 248 43 298 401 -87 -151 -123 -312 -49 -162 -165 199 44 -25 46 -150 189 -88 -15
2899 -15 31 -110 -69 189 -195 185 -184 -128 -46 216 -30 -211 -29 -79 -120 -7 31 -157 -141 -143 -285 62 132 -70
2923 -70 149 335 -91 -203 -103 139 47 59 3 -98 60 -160 197 22 -230 107 24 34 -46 98 -83 -19 -200
2946 -200 -258 420 -22 150 -411 266 -29 35 156 174 256 -123 137 113 298 -39 -105 37 -348 225 244 -120
2968a20K31l01K64j5K22j52m99J77L16j40p1m3K43oK41o77L12j54K39J05n17L22
2990b3O5J31j07K3l00M2k9J19l5l2j6L98k53M7J37J15l94J30j21n8L68r4k08Q3
3014a2J10k31J41K92k20k05J40k78N75k68O6K2k56L12j68M5J31k13j47N6M1j07
3036a74j34L37J13J4l81M03m59M53J04j57l47N3L38j39k85K50J47Mk34J80j80
3057i4n1K17J31k50L8K9L0pR7j66K76j98q6J83k43j74N50m89J53K13J75m74L12
3080A72n63O90M9l50k90K71j07P9K96l72J86P3k0k31J55k57O4J49q4L14j00N7
3102A81o2r1m39M42J00k02K81j61J49o6l5N0l10j89N19k10J18j12L73q17M25j76
3124b32j9K91q3o2r2J97j63K0J59K60m45L7P4j69nJ82M0K22k56J12j18K80k22
$$ plain form
2968 -120 111 -190 74 59 281 129 -370 -193 123 -17 -88 -131 112 106 347 -330 -18 -172 67 172 -345 -23
2990 -23 42 173 66 89 -211 -169 -198 -79 -114 -146 -162 236 -17 30 167 282 -112 18 -103 -161 207 113 -95 -12
3014 -12 98 -133 8 300 80 -125 15 -263 312 44 110 132 -124 188 20 65 196 -17 -164 -108 -67 -174
3036 -174 -308 29 142 156 -225 178 -281 172 276 119 -228 -175 163 24 -261 -11 136 140 -94 86 -94
3057 -94 -145 72 203 -47 -9 20 50 43 140 -26 250 52 -34 149 -94 -268 282 -207 -54 159 334 -140 172
3080 172 -391 299 348 -2 -292 -21 -128 -49 247 -125 61 134 114 -117 38 -219 -155 -6 -90 224 124 181
3102 181 119 28 -411 31 131 -71 210 49 198 132 97 147 -163 -352 167 -43 75 -37 336 -481 -56 -232
3124 -232 -251 40 -43 -105 -197 0 -163 -143 16 276 -169 -132 -58 -227 -232 -50 -10 212 -44 68 -50 230 8
3147Hn0p7K59j71J83J27Ol18m8J14J89j41p6q3j90K7K49J20j23p8L90n97L56o
3171G0m20M61k22N7j11q0J19l78N09l07R8M8K6J10J06k57L17k04j33O76o29j36
3193b80L88l13J81j10J55K57m73oK63mP7k13N3K9j52J09l41M51j80j00L61k00
3215d8J70K4k25j75L77k40K34L01l54l92O56k57q7L05m18n6J7J74K59n9m31J14
3237a11K37K8l51Q1j6J18J6m4O2O5J3l0j14j1N1K4M7m73O42l33J57J14j9j14r9
3262f0j80j58K84L14j29m49N13l25J50n29N34N11m91k69J78R3K08j31j70N8K15
3283A67j00j31j16P3j4o3K04J78m6P4m58J12K31j29n5j22L61k49K13k38J78K42
3305C12L2m98J20M59m89j82LM66j3j88J05j39K25m90L15J01k61J7j84J32N6J09
$$ plain form
3147 8 -42 -119 140 -31 152 279 285 -33 -81 33 222 81 5 -78 -268 -241 8 128 5 -73 317 -280 76 70
3171 70 -350 111 -111 -54 -165 -245 -126 -504 5 -302 -204 -156 -130 -20 86 -171 146 -58 -191 485 -144 -280
3193 -280 108 -205 -24 -134 21 278 -195 -201 62 58 135 -78 -25 4 -148 -39 -380 71 -109 -209 152 -48
3215 -48 122 146 -79 -254 123 -117 117 418 64 -328 328 71 -16 289 -129 -185 -168 6 265 206 -225 -111
3237 -111 126 154 -197 -116 -132 -14 2 -42 20 85 98 68 -46 -57 -6 18 65 -408 234 -99 58 172 153 39 -60
3262 -60 -240 -398 -114 200 71 -378 135 -190 -40 -569 -35 476 -15 -284 -106 -13 195 64 -106 -48 167
3283 167 67 -64 -180 -107 -121 -184 20 198 152 226 -232 -120 111 -18 -73 -195 166 -83 130 -108 70 312
3305 312 344 -154 -34 425 -64 -246 -243 223 210 22 127 -12 213 -277 38 139 -122 -105 -289 -157 -101 8
3327Hj76J75O3k20j05K89O3l49K90l23K62k28K44K52J2k79r1J42o8J89k46K41
3349A45k61K24j88J32R0l35N7P5J98q3Pj47J81j47j6j01L5Q1K04j73R5O7j29O0
3373G1n2M46o28L43k09m6J26k31K42j93J88J24k84P8J67j03J22j87J06J77n54
3394b97M30k85m6J20L05m97M94%k19n6K8P0J62k25K77j89n4K74k08j23j15K00
3416D6j38J77k41K67l07L58k22mJ79k28mR8J48Q3j16l71L96j84o8N2K58O1M2K
3440B84k53o8J57l0k86L49l10K77M9k72M1J19N6N6j37J32Kj93J83L4j1o3K2M8
3464A86m79M77l34K3J71l33L94m01L42N3K66l60Q5k61j69J98k05L09j47j43N41
3485B13l46k09N37l17N00k22K0j30J0j56K20k76K03n0L18j22l18M32l65n3rK49
$$ plain form
3327 8 -168 7 70 -150 -255 34 97 -252 38 -285 -23 -251 -7 245 257 -22 -113 29 -39 150 -96 145
3349 145 -116 108 -80 52 142 -193 -136 -61 137 54 61 -86 95 -52 -68 -169 -134 -53 151 -22 73 140 11 71
3373 71 19 465 -163 180 -29 -75 51 -180 62 -131 57 181 -103 -25 142 39 161 -26 80 257 -297
3394 -297 133 -152 -198 -78 227 -270 224 224 5 -51 -23 47 209 -16 261 72 18 292 84 -39 -154 46
3416 46 -92 85 -156 111 -196 162 -60 -64 115 -113 -117 -19 129 212 96 -275 121 -63 -131 -79 179 240 282 284
3440 284 31 -37 120 90 -196 153 -157 120 169 -103 -62 57 113 169 32 164 166 -27 156 190 179 116 138 186
3464 186 -293 184 -150 -127 44 -289 105 -296 46 99 365 5 90 -171 -340 -142 -347 -38 -185 -328 213
3485 213 -133 -342 195 -122 378 156 176 46 56 -100 120 -156 47 -3 315 193 -125 307 -58 -111 -120 129
3507A29r4J99j71m46L84J92m17J63J65J10j46j66lp3L73L57o00K45n19L7K60P1
3529E0n3j87K41J06L7o6j28O6j08l7oq9j37K73K95l70n0K79k93M01l43N0j8k70
3553c57L28R5K9r0j6PN6j78r5J20K96j71L23k93J73n79M11K78n11m8K34l9K03
3576A76j57k59K91l60L52J76k23k16K85j14j28N27m03K28j69n40N32l5N5j77k26
3597c85L36K38m72K36L63l87M36j63k29j90n6K62KK77J09o29K74k11J99j43j06
3618b39K91L41p07N33J67k27n6l05O1J35k5j06O9p8L7k83N41J17K5l01K49k68
3640b9q0r3j01L38K65l51j9P4l1N4j28q4K80j16R5j45PJ40Oj30K06j94l5P2J85
3665A86l40k3K15m2K18l05J93j41j42K26J32l30K81l82L50l72L62L6l5k63K16
$$ plain form
3507 129 35 234 63 -383 1 193 -224 -61 104 214 68 -98 -101 -174 199 556 -44 201 -318 -281 -21 50
3529 50 -3 -190 51 157 194 128 0 66 -42 -79 -85 -174 -311 -38 257 -113 -163 116 -177 224 -119 -69 -87 -357
3553 -357 -29 66 95 5 -11 -4 52 -126 -221 -101 195 24 347 54 227 -352 59 337 -174 -222 12 -27 176
3576 176 19 -240 51 -309 43 219 -4 -220 65 -49 -177 350 -53 175 6 -534 -2 -37 18 -159 -385
3597 -385 -49 189 -283 -47 316 -71 365 202 -27 -217 -273 -11 -9 268 377 -252 22 -189 10 -133 -239
3618 -239 52 393 -314 219 386 159 103 -202 -141 -6 -31 -137 -68 -146 -109 -392 149 266 291 -10 239 -29
3640 -29 -109 -202 -303 35 300 -51 -70 4 -27 27 -101 -185 95 -21 74 -71 -64 76 82 -48 158 -36 -71 1 186
3665 186 -154 -177 38 -4 214 -91 102 -39 -181 45 177 -153 128 -254 96 -276 86 122 87 -176 40
3686D0k8r5M58ro68J45J09j69M6P9J33k8p1M29k97n8Q4J66k09M4j36On8L08n4
3711A67m32J38J36q9p4q4R1j7J03R7j07K30m09L31M0j4R8k58J4j46J26j53l3K00
3735d5L0J28M2l74K30j60K49K67o76P73k36l38K20n21P00l21q4j6L2m4M5L0N53
3758D84l23k7k63j73K15J45k7J03m9k24j24L41q6l4j6J61r1R2j74J66j03K43J62
3781C98o40K63k9p6k39P13l81K63k64j87J12J04K71m68K09j44K82k20l1K4K4j56
3803a72K57j85K76n9m0j3p5j4J49j90L16l91j57r3P29j51j37o9P7k19L87k11k66
3826b51P4K55n6J85P0k06l68J04K45N0k71j85K25L1J7J40K6l75M85j59Q4l31M5
3849a66K05J86k11O7o8o2O2j71k9L04kl8M9K8k09m6O1L8J81k10n04M05J82j04
$$ plain form
3686 40 12 -83 375 366 -302 -157 -48 -217 -171 -92 41 13 -58 371 74 16 100 266 57 101 -35 -29 -87 221 167
3711 167 -265 -127 9 -80 -154 -238 -147 -164 -61 36 -71 159 -250 81 121 107 205 -53 -39 -185 -59 -212 -245 -45
3735 -45 -15 113 155 -219 11 -149 100 367 -309 464 228 -110 110 -411 289 -32 -116 -132 -100 -144 -99 -69 484
3758 484 161 134 -129 -302 -87 58 31 134 85 -139 -263 78 -8 -42 -58 103 12 104 -70 96 -7 236 398
3781 398 -242 21 -8 -84 -323 390 9 272 8 -179 -67 37 308 -160 49 -95 187 -33 -64 -40 -16 -172
3803 -172 85 -100 176 117 77 64 -11 -25 124 -66 250 -141 -298 -391 338 187 50 -19 58 -161 226 15 -251
3826 -251 -177 78 22 207 277 71 -297 -193 52 102 -169 -354 -129 -98 -81 59 85 -290 195 36 120 -211 -166
3849 -166 39 225 14 81 13 -49 13 -158 -187 117 115 77 126 154 -55 -101 -40 -2 179 -31 -535 -130 52 -52
3873e2l0J63K4k86K64k37Q3j40M39p8j47r1J91l0p9j11K88j49qP9l5L3R7J3m06
3898b05L65j61J1j86L76m65K76J42J27k94l71M06j27K63j82J44l78K44N4n65M44
3919h2K97j20J09l67M44k90r8L34k14J29N7j46LJ2P7L9k33k04P2K96l06J60p4
3942a05k16M51M8o6k6k83J40L59j92rj9P4J0k22K74pj98J2j3K09k99K41k82j12
3966b31K31qP0r1L23j78j12j02K28j15O1J20k59k0J47K71n27K78J72k87R4N1j52
3989c6K88m41r3N47m16j8J19k18J42L38k7l49J35R2J4k57N30l45j75L11O5l03
4011i7RQ8J30J72m46J61M4Pk42K31j1j30r8J52k50K87L62o75L47K34l14k12J81
4034g0N7O2q5K61o5l19R5n0L85l90K30j90J18j41J41j51J69m06K98J64M3n4P2
$$ plain form
3873 -52 -82 81 105 -181 83 -154 -71 -211 228 150 3 -88 103 73 -6 -117 171 22 14 93 58 91 188 201 -205
3898 -205 160 -1 10 -176 200 -265 11 153 280 -14 -385 21 -106 157 -25 119 -259 -15 39 -526 -82
3919 -82 215 95 204 -163 281 -9 -107 227 13 142 199 53 56 68 145 184 -49 -253 -181 115 -191 -31 -105
3942 -105 -321 130 178 112 86 -197 -57 302 110 101 82 156 166 -56 218 211 13 25 12 221 -78 163 -119 -231
3966 -231 0 -8 62 -29 294 116 4 -98 130 15 76 196 -63 -83 64 335 -192 86 258 -29 65 116 -36
3989 -36 252 -189 -282 265 -151 -169 -50 -268 -126 212 185 -164 -29 63 77 -180 350 5 -170 141 206 -97
4011 -97 -88 0 130 302 -144 17 61 68 -174 57 46 -84 -182 -30 -280 7 369 -306 41 275 -39 -251 -70
4034 -70 -13 49 -36 225 160 -159 -64 -114 271 -119 111 -79 39 -102 39 -112 57 -349 -51 113 156 102 174
4057A74r8l55K56J03l43N34l20O3J30j98N65m29k38r6R5M9n3K49l09Jo5L21J51
4080A87j15J66j78J32Q9l56l49K80K06p6R9k23k87m8O22r5l8Ql3Nk37pN24m07
4104a31k7M26n71M21l89L58K2l63L79J98j23J0l64J08N0l10L80l31J09J09j21
4125a60J07j54J70L5p7J21q5j00J26K97j06o6r1j74L24o5k53J0Q0K53m88M24r4
4148C4O5rP0m24R8K78m70K33l2J66n6KJ3j02K62k8l5o3p1J1j76L35q0q1LK35l38
4175a60O0K14k02N1j33J76J7M5m6q9k39M86J13l81L7K30j50m9j58L4L03l4j20
4198Ek02K12r3J79m37J60n0K00K55K71l87l46K15j5J29j63K1K05l58N4l4J40q5
4221a24K47l52j17J81J42NK97j79l26K94j9j1j93P8J22j19jJ9J36N5j41J8j40
$$ plain form
4057 174 76 -279 -23 80 -263 271 -49 14 144 -54 511 82 -156 -252 -157 -108 -161 88 -221 -220 -285 36 187
4080 187 72 238 60 192 281 -75 -424 -144 62 -14 85 -138 -425 -473 149 54 16 24 -9 -4 -241 -248 276 -131
4104 -131 -158 268 -303 118 -271 87 109 -254 125 323 200 210 -154 -46 4 -306 74 -257 -148 -39 -160
4125 -160 -53 -207 -37 -2 -79 42 -43 -143 -17 280 174 108 17 -157 167 102 -151 -141 -61 192 -296 128 34
4148 34 99 90 160 -264 -166 112 -358 -125 -157 9 -47 -45 -32 -134 128 100 65 2 -69 -58 -234 101 21 -60 -57 178 -160
4175 -160 -100 114 -88 -37 -170 6 23 68 22 -67 -306 180 293 -88 -51 179 29 -20 -178 -144 159 125 5
4198 5 -197 15 -78 101 -336 -176 -226 -26 229 500 113 -233 -18 -33 96 -67 -46 159 -199 -145 -179 -39 -124
4221 -124 123 -229 -346 -165 -23 -18 279 100 -226 68 49 38 -155 -77 45 -74 -75 -56 80 135 -6 12 -128
4244a28j46j7M39k07j20K6R4j0J93M0j72N1k03J78J89l84L8K65m76K92N2j16K80
4267A58l49p9K05Qo7K20l43Q4K78l32n2L47K10j93j05m2L56k97M2N5J23j85l48
4290c06L00L9J02k62M35j07j52k17J95p0k80K68N9J35j34j78J69J62J2k02M56
4311D24k12Rj41J78l26l2Nk43M75n20O73r3j22n5p9m9Q1o8j12M92k66k09L44J4
4335A68j22n24O74o25M83l1L5Pk5k02L23l1k18PJ28k43J48K01j21R3j47k4L15
4358B69k51j22M5j1J9j15M86ol33J49j98k6J80q4K87k40l5R1p5K33Jl47K67o0
4382A24p2j66K8l6O1o9K68l76K98L59o89N86l36L1j04K0R0j73R0J44o9n0J37k67
4406a71k8O5m0J90j09J52N9o4j7K12j42o51N07K14j88M60j80k76k66N42m57J98
$$ plain form
4244 -128 -274 -291 148 -59 -179 -153 -59 -69 124 164 -8 43 -160 18 207 -177 -139 126 -350 -58 -6 -122 158
4267 158 -191 -270 -65 -57 -124 96 -247 -163 115 -217 -269 78 288 95 -10 -52 304 7 49 104 227 42 -306
4290 -306 -6 33 135 -127 308 201 49 -168 27 -43 -323 -55 4 139 5 -173 -4 158 170 -32 424
4311 424 212 221 80 258 -68 -100 -95 -338 137 -383 290 197 75 20 -59 -108 -27 -95 -207 285 19 -190 154 168
4335 168 46 -478 196 -429 54 23 58 65 40 -162 161 130 -88 -81 47 -196 -48 153 32 125 -22 -46 269
4358 269 18 -104 -59 -70 -51 -166 320 314 -19 130 -68 -94 86 2 289 49 14 105 30 263 264 -83 184 124
4382 124 52 -114 -86 -122 -61 -130 138 -238 60 419 -270 316 -20 11 -93 -73 17 -156 -66 78 9 -41 96 -171
4406 -171 -199 -134 -174 16 -93 59 118 54 37 249 107 -544 -37 177 -11 449 269 -7 -273 269 -188 10
4428A0L4M1J63n03L17J03l57R9J83Q8j87n3J47l13J94l06N20k71l1J65J70k05
4450Ho1L21l61mJ31m1j55O4k21K86NP2j19O6J85J50m98M27p1k91M11l31R9n1J78
4475A99m10K31QL3p8j21M38m91K29j21J70o3Mm1o4R5k1N4k68K23N2Q1O9j95N4
4500F7j2Q7J20m29K07L9k37L19m69L06p9j1oj92R8M68k85J5q0o2J94K08j56k36
4524a26J00K58j87j07Q0k13J54J17K39p9j13n24M12O5L43o25L10j10K30n02J89
4545h9o8N0L47j51j04k91K39j48K74K90l28r2r7L23Ol04L42k97L48k45N9JJ47
4568B12j00k28k73J97q9K23K44j22q7j38n3K81j59L18l32P0j13J67j93L64j56
4589C3j87L49j82j22J73J25j77J39N5J50l72k50L56q6l4j38J83j85L0J50J04k7
$$ plain form
4428 10 44 85 248 -255 62 165 -192 -93 90 178 -9 -62 85 -228 -34 -340 180 -91 -122 43 213 8
4450 8 -53 268 -93 -97 34 -7 -162 -98 -319 -33 -28 44 -75 -9 176 326 -172 255 184 -107 304 -27 72 21 199
4475 199 -211 20 28 61 -17 -138 300 -191 38 -83 87 24 28 -13 -77 18 -3 51 -217 6 58 139 208 13 67
4500 67 55 142 262 -167 40 79 -158 161 -308 -2 -81 -92 -98 -290 -192 276 -9 6 -74 -136 58 266 110 -126
4524 -126 -26 232 45 -62 18 -195 -41 76 315 236 123 -401 11 76 419 -206 104 -6 224 -278 -89
4545 -89 -157 -107 240 89 -15 -306 -67 -215 59 349 21 -71 -168 155 161 -143 199 -98 250 5 64 65 212
4568 212 112 -116 -389 -192 -281 -58 186 64 -23 -161 -214 67 -92 226 -106 -36 -149 18 -175 189 33
4589 33 -154 195 13 -109 64 189 12 151 206 356 -16 -266 90 4 -30 -168 15 -170 -140 10 114 87
4611H7j91J24J57J07m89J59p7M29m98K78j6k09K9j07r9N33m93Q0J67o4M8J62k21
4634a04j73J71K22N8k12j34J0R7K92l94L06j08k54Q6J33R3m72J40L18n0Q9k55
4656a41R1M72o47L43j22j93J3J30j0K87m8k89NK14PJ4l09K72k27k68K80J85m2
4679A7J43Q2l27l1J50PL09m75m1K42K28l43K18p6P6J2R2m16J35o6P8J91j23J06
4703A88l48M55j80O6j93J1j4J00O7Po7l69N13n12L54%j71J96K1p5k51K54N1K23
4727C26k41j83j03L10K81k35l46P4m5L27k17Q1j88J74l1k50L61L25l45l42L84
4748A17l3j87J66l9l25J73J65J76q8p7m02M87j65j61M30l55J73k53L34l20L47
4769A63n34O60k64j52j44q5L60P2j77O5K94r7m24M4L00j31j95K13p0K37j84j92
$$ plain form
4611 87 -104 20 177 284 -205 -46 -123 306 -192 86 70 -139 -110 -217 -316 217 -276 -196 -29 -93 -45 117 -104
4634 -104 -277 -106 116 174 -38 -172 -162 -65 227 -167 139 31 -223 -137 -4 89 -383 -243 75 25 114 -141
4656 -141 -50 422 -225 118 -4 -197 -184 -54 -64 223 175 -114 -109 105 112 126 -183 89 -138 -406 -126 59 17
4679 17 160 242 -85 -116 34 41 350 -125 -166 76 304 -39 179 103 179 191 283 -133 2 -64 14 205 82 188
4703 188 -160 295 115 181 -12 -1 -15 85 152 159 92 -277 236 -276 78 78 -93 103 124 49 -202 52 103 326
4727 326 85 -98 -201 109 390 155 -191 -117 -162 165 -52 29 -159 15 -16 -266 95 420 75 -267 117
4748 117 84 -103 63 24 -301 -128 37 213 125 48 -354 133 -32 -193 237 -118 55 -198 136 -184 163
4769 163 -371 289 25 -127 -271 -356 4 76 -101 -36 258 161 -263 -219 81 -50 -245 -32 -102 135 -49 -241
4791b41K5R6J11j28j43K45K29k06p9n7l57J44L41m3j04M17k26l6j77K57l0J28
4813A66m7o29L99J41P8l84J84j07l81M44J29k46K29P2l5J30k51K29nJ25n95M37
4835H3m2j26J54R8j80j80K93k57J30j20K68j38J63l59M00j71K93l43k28J59J58
4856E5K71l78l24M46l74L25L2j45J68j72J58r9o7Q1L2Q8k64K08M1L0M54o83N0
4879f7K83k50r1M40o51L47j73L38k68K48L0l85K88j55R6k06Q7P4Q7j65J85p5j5
4902BJ57j8k16n2k9J81q8J06j66j31oN02l47o5l4J15J16p2K06l30L81K39p27J83
4926i3J13j0N51m63j1l70L71p1j84K49m1P5j15j31J61Qj2K95p6lm04J76K13n12
4950b84J23J98l48K16l1l7K00J44l10K12l5j84K16o8j99L24n0N8j44N8j78m9r5
$$ plain form
4791 -241 -216 -120 -9 -137 -280 -35 194 -12 -91 -148 -505 -361 -20 -63 -167 250 24 -12 -189 68 38 166
4813 166 119 -510 -111 30 108 -276 -92 -199 -580 -136 -7 -253 -24 48 13 143 -108 121 116 241 -354 83
4835 83 41 -85 69 167 -13 -193 100 -157 -27 -147 121 -17 146 -213 187 16 309 -34 -262 -103 55
4856 55 326 -52 -376 70 -304 21 53 -92 76 -96 62 -37 -104 -23 9 97 -167 41 82 112 566 -117 -67
4879 -67 216 -34 -125 315 -336 11 -162 176 -92 156 186 -199 89 -66 30 -176 -89 -15 72 -93 92 17 2
4902 2 159 141 -75 -127 -156 25 -63 43 -123 -254 -260 242 -105 -170 -204 -89 27 -45 161 -169 212 451 -276 -93
4926 -93 20 10 561 98 87 -283 88 17 -167 82 41 116 1 -130 31 39 27 322 246 243 -161 15 228 -284
4950 -284 -161 37 -311 -95 -126 -163 37 181 -129 83 48 -136 80 12 -187 137 87 145 1 59 -119 -168 -263
4973b63L81p7o9m4J38j85P7k53J42J25PJ3J15O2k04Q3j28r3o7N8K61j9l73L67
4997E4o7K50j75l6j65L5R2j82L93k9l3O3l58K5O3P7K4j50J7p0m3J72J27j41j42
5022a99K69p9j53K20k08J47J2k21J04J76L1J26k22j79J66Q0J95l17R7p3L9j81
5044a70OK29j04J11j62Rj13P7K43l72L70K47l18k07j08R2L91j16k21K15j48J14
5066F5j46J41M5j18J34l75M30j25K09K7n00N24k62l6o8n6j14J41K55l90N18m82
5088a83R8K44k13M1l38J44J1J65P1j06R0J06q8R2l55K91J31j54m23K20R5j19K68
5111H8j01J92j62j34O4RJ06j28K74R4l53N0N4k11L19k31j47Q2j60L59J00j02j14
5134e2J94j66k6K53j88O1J45l58O4J81N3l79L23J79l64K26j08K1j18J30k21J61
$$ plain form
4973 -263 118 41 -28 -72 66 -119 -42 -295 -153 -28 -21 -8 107 169 -35 48 -80 -173 -240 -182 79 60 -313 54
4997 54 -13 237 62 26 -139 -104 -12 -194 199 170 137 200 -158 -133 -70 7 31 -119 -102 -172 -215 -43 84 -57 -199
5022 -199 70 -9 -162 58 -150 -3 9 -212 -108 68 99 225 3 -176 -10 70 265 -52 45 -28 11 -170
5044 -170 -164 65 -39 72 -90 -81 -194 -117 126 -246 124 371 53 -154 -262 -170 221 105 -116 99 -49 65
5066 65 -81 60 105 -13 121 -254 176 51 260 287 -213 311 49 13 -55 -111 -225 -84 171 -219 299 -183
5088 -183 -85 159 -54 -13 -351 -207 -196 -31 40 -66 24 130 42 134 -221 70 201 47 -376 -156 -61 -180 88
5111 88 -13 179 17 -117 -53 -44 62 -66 208 302 -51 -1 53 -158 161 -70 -217 -135 -295 64 164 62 -52
5134 -52 142 -24 -50 203 15 76 221 -137 -73 108 161 -218 105 284 -80 146 38 59 -59 71 -150 11
5156A1N5j19J59l25J41j22L73K23l67j80J83lJ24j90K9n2p2J8J93j00M8j91L57
5179A93j65k28L42k85q7K32K4K28m39J79J13n7m3j07q5K97P8k46K2K14l0K1Ko1
5203A12l95K98P9O4J50m22L72l2O2j03j87q4K80j70k63J8J90k9J52O5j44j63r6
5226b46K76k08K11k9K24k58L06o74L84Lj67L14n90O02k60K79m97L71J17K2N4l15
5248h1J80r6K34m2j47J14j22ll29K62l2n6O3R0J04P1l9k16J97k80L71l95J94M6
5272H8j27m1O2L92l27q3r3M9N6j75J03J36N2k5k10k5J0N9M1j47J16K11l31L0L20
5297A41k12J11r7%L7J45J50Q9j23k36k22M85m0k40m6J77j26j72%L10j59j20J2
5320a36j48M26m95M58q9J4J70j84n4J08l4O5m24O87k48j34J98o2kk64L96j05n27
$$ plain form
5156 11 66 -53 106 -219 -78 -200 173 396 29 -151 32 29 153 -37 -8 -60 -132 -114 79 -21 27 -164 193
5179 193 28 -200 142 -143 -230 2 26 254 -185 -6 107 50 7 -100 -185 112 190 -56 -34 180 150 171 173 112
5203 112 -283 15 94 158 308 -114 258 226 288 185 -2 -86 194 24 -239 -221 -31 -60 92 157 13 -150 -246
5226 -246 30 -178 33 4 228 -30 276 -398 -14 -11 -178 136 -454 148 -112 167 -330 41 158 180 234 -81
5248 -81 99 3 237 195 48 162 40 37 -292 -30 -62 -118 -55 35 139 210 171 -45 152 -128 243 -152 42 88
5272 88 -39 -80 -18 374 47 -36 -129 -80 -24 -199 -96 40 92 67 -143 -168 -158 -99 -58 -205 -89 122 -209 -179 141
5297 141 -71 40 -57 -57 -20 125 275 364 241 5 -217 268 228 -12 -58 119 -7 -179 -179 131 -28 -148 -136
5320 -136 -284 142 -353 105 16 30 200 16 -38 70 36 101 -323 364 116 -18 180 118 116 -148 248 143 -384
5343c84L19K65m13O1K49N6l01L4L08k22L19n70L39j26M4j56J84j48J00P0j30L03
5365B01k51M43m85k56K94k48L02r9Q7%J69J12m11j46J51J04j55N8k09L32M4k58
5387b21k3K63J69l27K95l98J77K04r7k75M1P4P0K30r7N8j74q5K75j46J81k80K44
5410A58m9M2j38J90k20j9J7j96J38j47L10J26j0n3j47p0R2k50K93k12J79j89K35
5433H0k63K45KK64m38j10J38p0L27l31M7K42o8J00m73Q3M91k81m3k6L43j54k94
5456a89N35l20jJ58m25L4M80j35l82J66Q6K42l68J03l50M16j0q4m0M4P3n2J80
5479A61J12l63Q8J56j62k34M35J02k15J49j73j23P5k23r5M34R7j42K0l83J11J90
5501A7k60K90K22n26L80k11J55r0M4L37k85j13j6K3n4R1o6m3N9M9R0l3j54J36
$$ plain form
5343 -384 -65 200 -213 -152 97 153 -148 -114 194 -28 291 -279 60 -66 -22 -178 6 -142 -42 28 -102 201
5365 201 -50 393 -92 -348 -54 -302 0 -99 -12 -12 157 269 -142 -288 -137 -33 -188 -130 -339 -7 37 -221
5387 -221 -244 19 188 -139 156 -242 -65 139 42 -233 -192 -118 -48 182 85 143 -31 -116 159 13 194 -86 158
5410 158 109 151 13 203 -17 -36 -19 -215 -77 -224 86 212 202 149 2 -68 24 -226 67 -145 34 -155 80
5433 80 -183 62 64 328 -110 -220 -82 -152 175 -156 -109 133 65 165 -308 -225 266 -15 -58 -84 259 105 -189
5456 -189 346 26 25 183 -242 -208 272 137 -245 -79 7 249 -119 -16 -366 50 40 -44 -84 -40 33 -19 161
5479 161 273 -90 -2 154 -8 -242 193 295 80 229 56 -67 8 -215 -310 124 221 79 99 -284 -173 17
5501 17 -243 47 269 -257 123 -88 67 -23 21 358 73 -40 -56 -33 -87 4 -62 -105 -46 3 93 60 -94 42
5525D2J05J18m10J46P2l38J34q1K79j35J31j87K59k07j81K91j58O3K19k22J61
5546A01q2oK42j64k68K16lJ37j35o5M64m37k04N5K38k72K30j38K77J58j55j51
5568C8K21j19q8k38L33m48L68j20r4j0K35k5M6k44K65j40o0JM0L1L8M4o54K93
5592b87L81k56J70L90l45JJ08j80J67J32l75K1K92j51j92R9L39j72k59P7o1M9
5614e2K9nk07N71m63O1j74L59p4k50M38l63L8L32l20L67k60M7J10l81J50J56m51
5637c42L41M02n03k15L44j21J31j02K2J20mk33L06j9j47j77N30k94j77K72j94
5658f0l4j72L51L4jj96L17m39J24m5j27R3K73l33J52k28j74N09j53J83k91r5K8
5681b84J34j77L60l6K23j49nM5j90k44j8L69n3J57Nl28M43j75r5NR9qk83K11p5
$$ plain form
5525 42 147 265 -145 1 73 -265 -131 -212 67 -68 63 -124 135 -72 -253 38 -120 -57 162 -60 101
5546 101 19 13 255 91 -177 39 36 173 38 -27 437 0 -204 -149 89 -183 47 -91 186 344 189 38
5568 38 259 140 52 -186 147 -301 67 -53 -147 -157 78 53 99 -145 120 -20 -80 -79 -39 -8 30 74 -580 -287
5592 -287 94 -162 8 398 53 54 162 -18 149 281 -94 -73 219 68 -124 -25 314 142 -117 -40 -101 -52
5614 -52 -23 -28 -235 336 -127 -66 -240 119 45 -205 233 -130 -92 240 -80 287 27 74 184 -197 -47 109 -342
5637 -342 -1 401 -102 -317 27 -94 37 -65 -43 77 73 -160 146 127 -20 -197 333 39 -138 134 -60
5658 -60 -94 -266 85 119 118 -78 239 -200 -76 -121 -248 -155 118 -215 -63 -291 -465 44 -109 74 -217 -312 -284
5681 -284 -150 -327 33 -3 220 71 66 111 -79 -323 -341 28 -25 132 137 -191 252 77 -18 -13 86 78 -205 6 -69
5706f9K47Mj56K30m08J71P0J41m6m0l15J23L03r0k99m6J36O2l14K98J84q5k09
5729a08J94K03l01k9J42r2M7J22L3l26J52j48J72J37j70o7O6r1Q2j50K5K07m5
5752E5K96k16k42M71q18K40J19J1J15K42j53N1n03L72j05J32l0j26M1q5J22K47
5774B36j50k71J25K35j76q4J10J41l37J95ql09P3j26J92K10J78k31J44j90R5j45
5796i3L5j87K18M34p51L36j46J70K09l89M41j94n0l67L41Q6K1l0l7N4k71K4P1
5819g5M6J9l21M60k06J22O0l44L42k56J43J36j97q2J23j67j49L32L11k81n3j0
5841d7K35l27P9j69K64L2j53R2J4nO3j51R3J89l13K14j21J93O3k85J08J52j77
5864D3J36j04q1J23k15J69m2q2M4J04k70j7K11J43k89j73M7K17J34k00j21M85
$$ plain form
5706 -69 178 182 26 256 -152 19 89 230 184 144 -171 -48 255 165 -134 -180 -44 18 -296 2 186 101 -108
5729 -108 86 289 -12 -41 101 9 56 178 211 -115 37 -111 61 198 28 -39 27 -64 18 -132 -107 100 55
5752 55 351 135 -107 364 -454 -214 -95 -84 31 273 120 171 -332 40 -65 67 37 -89 -48 -133 -11 236
5774 236 86 -185 -60 175 -1 -85 25 166 -171 24 16 -293 -220 -346 -154 56 234 3 147 -43 52 -93
5796 -93 -58 -245 -27 407 -344 -8 -154 16 225 -164 277 83 33 -334 7 93 114 84 47 101 -170 -146 -75
5819 -75 -29 -10 -331 129 -77 45 105 -239 103 -153 -10 126 -71 -153 -30 -197 -346 -14 297 16 -37 -47
5841 -47 188 -139 -60 -229 35 67 -86 6 20 15 78 -73 20 209 -104 110 -11 182 245 -40 68 220 43
5864 43 179 75 -6 117 -98 71 29 -53 -9 95 -175 -192 19 162 -127 -300 -253 -36 98 -102 -223 262
5886B62l07p7J76k98L13l05K37m2Q6l1N1o7J7k53N21k79l9j10KJ46j54K99J92
5909C40Om53K94j39k5j41M57p1k2j92n13N28j38M1j50J62Qr2j60j2M33j01mJ40
5933A96j84j84J99k2L69l61j78L8K46k38o5J07m6j04L32k67o7M55r3j97J34n40
5955d70M53K6K67k53R9k49J8L88m45J05K5J27l52L34K44j1l46P1J9J07J50M6l82
5978b9J91l66N0L50l82R0K63J38p6m45K34Pk47M58m33L22l00Q5K94j85j54r3O2
6001a66L40j25j88j6J91j59K33k25K1j76N30m8m11m2N2N0K72k51j33K51J31j58
6023b7J48j72K88k85K50O1o0k40P7J26k02M32m01rL9J6p5L40l04k55L94J69j38
6046A72j28K4Q3n3K90n73J13j02K70j62J54r1k50J68L58l61P1J45j0r3k27J87
$$ plain form
5886 262 -45 -122 54 -244 69 -236 1 -41 45 14 65 -2 15 -238 283 4 -35 -145 -143 3 -151 148 340
5909 340 346 -107 187 48 23 -118 339 268 246 54 -459 69 -69 -28 -178 -16 -8 -100 -260 -272 161 60 56 196
5933 196 12 -172 27 5 374 13 -165 -127 119 -119 -184 -77 -123 -227 105 -162 -229 226 133 -64 70 -470
5955 -470 -17 9 276 23 122 -127 -109 279 -166 -61 -36 91 -261 73 317 306 -40 31 50 157 307 353 -29
5978 -29 162 -204 -154 196 -186 -96 167 305 229 -216 18 25 -222 236 -197 125 -175 -90 204 19 -135 -228 -166
6001 -166 174 49 -139 -155 36 -123 110 -115 -94 -270 260 212 -199 -241 -189 -139 133 -118 -251 0 131 -27
6023 -27 121 -51 237 -48 202 263 203 -37 40 166 -36 396 -5 -14 25 41 -34 306 2 -253 141 310 172
6046 172 44 68 151 98 388 -185 -72 -174 96 -66 88 -3 -253 -85 273 -88 -17 128 118 25 -202 -15
6068a5nn1J09m89M28J34m09N16Q0j52R5j81n3k83M94l07j63L66J72j79Q0j80p9
6091g2J29k4P3J45qn87L80l95J95J71K76l32K15m47K53K38J09l42M9j48J49J64
6113A91j11Nm7k18L6K47m27M60J91n02K97l86J58J59j67K36k0k9j09K41l40L25
6135A90Qm41O35l05J00j61O7j94K35k26o4L72pm60L73jj93J01N4k04q3N3Q4J79
6159A12j40p2k00L66q0N3m6ok74K54R9m15Q34q22J86l1J64K20l95J73J87J19j86
6182A00o0j31J84R3k39k27L17o8LJ76j31K19k63j76K54j81n1N73q39M39k19K76
6204D9j22M32j81k17J73k58K17k29J27k6m5J33m9K70n85L57j13O9l47M07Q4J74
6226C20l00QJ54q4O2m09P20o99L68m98L45k3K61l75K74l3p7k4m03N21j16k51M26
$$ plain form
6068 -15 -20 -71 38 -451 -23 111 -298 218 298 146 241 60 7 -276 218 -89 -252 114 286 107 187 7 -72
6091 -72 57 33 106 251 243 -344 36 -359 -164 7 283 -49 166 -281 -28 210 319 -23 26 -122 27 191
6113 191 80 85 38 -180 -144 103 -324 136 327 -175 122 -264 -106 53 -114 122 102 73 -36 205 -135 190
6135 190 198 -243 392 87 187 26 93 -101 134 -92 -156 216 209 -251 122 121 -72 29 83 -121 -204 -151 -67 112
6159 112 -28 -100 -300 66 -14 39 -7 -13 -287 -33 66 -349 485 -337 -151 -182 -18 202 -193 -20 167 286 100
6182 100 40 -91 93 186 -53 -280 37 -31 -28 148 17 236 -27 -203 51 -130 -181 392 -447 -8 -227 49
6204 49 -73 359 178 -39 134 -124 93 -136 -9 -35 -80 53 4 274 -311 46 -67 2 -345 62 146 320
6226 320 20 28 182 98 160 -249 471 -228 140 -358 -13 -36 225 -150 124 91 14 -10 -413 108 -8 -259 167
6249A67m30K95J44k98K33r7O7k50O04l70J03j68k39L38j96R2Q9lj85q7l05L11
6271a85L25j71j84L54L6k45j57L38q5Pq8K21k34J2J76P7q0m8L03o52L07j91J0
6294a54J07j44K19o14R37k14r1J45M6l50J31J46k65K68j63j37L64k32n4MJ7M5
6316A1j25K59l80J91L94p9m93N14l64M04l44j07K47pk39M7L9l3J8J43k10j66M60
6339A80R0l10R7J10k41J51o2j05K14j80R8j92N0J76j20j09K05l50K02K25M9j30
6361D8o5K44M0P6k92j79k1J96m4M0J60k07q4j4J16K50j39l20M5p4O40j60j21j57
6385b2j10K18k45L65k82j1o5J67j6L40k44j66m4K13l9J7M3j76OJ49j91K26q1k48
6409a96K3L66L7k55j18N6QR5O9l55J79O0k8J85j29j92L41k80K61J31l06K87J19
$$ plain form
6249 167 -263 32 176 -122 111 14 81 -169 435 65 168 0 -239 99 -97 -5 84 81 -104 -191 -496 -185
6271 -185 140 -31 -215 139 175 -70 -227 111 26 33 -55 166 -68 -56 120 197 117 69 372 -280 27 -164 -154
6294 -154 -47 -191 28 -586 351 137 46 191 237 -113 18 164 -101 167 4 -133 231 -1 -55 -51 -34 11
6316 11 -114 145 -235 -44 350 271 -222 292 -72 332 -12 -119 128 121 -118 -71 -32 -65 -47 96 -114 -280 180
6339 180 270 -40 57 167 -74 77 15 -90 124 -56 42 -150 -100 76 -44 -153 52 -298 -96 129 178 48
6361 48 -17 227 267 343 51 -128 -149 47 3 43 203 -4 -88 -102 14 264 125 -195 -150 -224 416 256 135 -22
6385 -22 -132 86 -159 206 -76 -87 -152 15 -1 339 95 -71 -115 98 59 76 119 -57 -51 98 -93 133 52 -196
6409 -196 -173 193 230 -25 -143 -87 -79 16 85 -270 -91 -31 -59 126 -3 -195 146 -134 127 258 -48 239 358
6432C58m20J18k0q6lj57q7L47j98K76j97j19K59J54j47pq6j24K95n35K59j34J6
6455b38M28j40m3K32n2k59j85N3L30l33J40R7q9J05j09PN1J13j52J43J00l57L2
6478a26N5O5J29nJ29k96K20n7O0k86j16J44Q9K04k9M9j44j69rj77J41J00J81k25
6502g3l2K30K43k66k73M73k0l78n1K16J63k2k32J02j77K57k55J83j92m1J41j18
6524a22L90k95jL23j47o4J48k71K18n89J64J98J86j27l9j29J19l38K29P2M5P8
6546D8j55M0kKj85K47P6M0j81J20n1J7k8L9J07l83M7K94pl5j32k1n9L97k91j9
6572g5K34j03J22j89K8O3Q5k07P8k51P5o8K88M7o8j78K96k47k48J92R7L52l09
6595A4j33L10r9j46k90L70p2p5K24K17n16q6L76j71O8K0j86K85K2j17n2L12r7
$$ plain form
6432 358 -62 56 36 -50 -53 -210 -297 50 -148 128 -69 -188 71 225 78 71 -15 -139 156 -379 -120 -254 -238
6455 -238 190 50 7 239 187 -72 -257 -204 126 -207 -67 30 -59 46 -63 -56 -5 108 -44 99 199 -158 -126
6478 -126 -71 -6 123 118 247 -49 171 114 174 -112 -228 -84 5 209 180 229 85 -84 -93 -270 -129 -29 152 -73
6502 -73 -105 125 368 102 -171 302 282 -96 -147 69 232 210 -22 80 -97 160 -95 88 -104 -145 -4 -122
6524 -122 268 -27 -28 295 148 84 232 -39 179 -410 -246 -48 138 11 -28 -157 -38 -376 -147 -75 -30 48
6546 48 -107 -67 -69 -67 -252 -5 71 111 -70 50 -1 16 -12 27 134 -249 -202 92 85 50 -82 -103 -162 235 -56 -75
6572 -75 159 56 178 -11 17 80 165 -42 36 -215 -140 -208 80 127 59 -119 177 -70 -318 -126 -29 323 14
6595 14 -119 191 92 -54 -344 26 -46 -121 103 320 -196 -282 94 -77 -9 11 -175 110 132 15 -37 275 178
6618A78j71J47J27k20k11j3J6K27j99J55J1j14K20k40K38j19mJ08j07Q6m1k29
6640a55J46j89n5N15j90k49L36pLp8L31n10J71j23Q2pk69M74j92l25L11J96l70
6663a54O8R3J02j42M5l65J83J7q6M51k50J47J21k42r4K29k43L06l54L23mk93J44
6686Bj86M57K1J37n13L44m63L22j10rN1n0j66k1K39K93l70R3l38m1J82o6K63J0
6710H1k49N1M8K83l88j49L99j24J03Q4o6K62l68j0l4m7K46q8l37J39K98p2M8k13
6734a03O4K00Q9O6j73j07m84R12l73l08L15j73K90o30Q64k77k29J6k17k9J13O2
6756a12J30n5J50J3M9k61l40L34K98j62R3j11n6l7j23J21j28Q5m6O3J91q1N3j13
6780d5K0J09m13L31j38K53m07J65K25k45O4L94l42p2R2k8o7Q9J84k31K39l45K08
$$ plain form
6618 178 7 154 281 61 -150 -163 -147 80 -119 36 47 -67 153 -87 151 32 28 136 29 115 74 -155
6640 -155 -9 -198 -253 262 72 -177 159 152 155 77 408 -102 69 -54 28 21 -248 226 34 -291 20 216 -154
6663 -154 -86 7 109 -33 12 -353 -170 -153 -239 212 -38 109 230 -12 -106 123 -120 186 -168 155 151 -142 2
6686 2 -184 273 294 431 -82 262 -201 121 11 2 53 3 -163 -184 55 348 -22 71 -267 -308 -126 -192 71 81
6710 81 -168 -117 -69 214 -174 -323 76 -48 55 139 73 335 -33 -43 -77 -124 122 34 -303 -164 134 62 110 -103
6734 -103 -39 161 250 316 143 36 -448 464 91 -217 98 -75 215 -415 449 172 -57 -41 -258 -287 -174 -112
6756 -112 18 -37 113 126 175 -86 -426 -92 206 44 137 26 -30 -67 -190 -69 -197 -112 -158 -95 96 15 68 -45
6780 -45 -25 84 -329 2 -136 117 -290 -125 100 -145 -81 313 -29 -101 -9 -37 -104 -15 169 -62 177 -168 40
6803D0j02k03K26J3J67k95K95q6j29J44n2L9r3PK46k13p5p2J16L25j45j93J23
6826H3l73L15r0J52k48K10J35Q7k58k42J17L86k11q4K45k26L5LJ12m01K17J12
6848G6j77L14k27K58k77J28O9O0l33K43q0k00K75l34K0k1j46L36n5M73m43n1M5
6871d7k19o6j31L89N7J61J97m68L33l81K21k37J48j14J24r3PK48k77J81J99l53
6893a21j95M48j57j76M30k97J57j11j34J40j09J79Lr8n8N2P1J49jm06K69J37R7
6916B69j21k13J84j18j48n1K83j81J32m9r4L64Q5l44J03J85m40L24R7l60K66j12
6938F1J04k47J80k7j88O8k07j8K44K65m47N4%L64l98J90N6J24k52J99q4k66L12
6961H7j58J66Q0J01p2r3p3Nj76R6n7L0MJ19J47q6P6k11L06l57M55m45K87l88J99
$$ plain form
6803 40 -62 -265 -39 -26 141 -154 141 55 -74 70 18 57 -36 -29 217 4 -71 -143 -27 298 153 -40 83
6826 83 -290 25 -65 87 -161 49 184 271 13 -229 -112 274 63 -21 224 -2 33 36 148 -253 -36 76
6848 76 -101 213 -14 244 -33 95 164 224 -109 134 54 -146 129 -205 -185 -206 -352 -16 -71 402 -41 -92 -47
6871 -47 -266 -332 -463 -74 -17 144 341 -127 206 -175 46 -191 -43 -157 -33 -126 -119 129 -148 33 232 -121
6893 -121 -316 132 -25 -201 229 -68 89 -22 -156 -16 -125 54 57 -41 -99 -47 24 173 172 -234 35 172 269
6916 269 148 -65 119 1 -147 -198 85 -96 36 -13 -107 257 342 -2 101 286 -154 170 267 -93 173 61
6938 61 165 -82 98 71 -117 -49 -256 -274 -30 235 -212 -158 -158 206 -192 -2 54 178 -74 125 41 -225 87
6961 87 -71 95 175 276 204 111 38 43 -133 -37 -94 -64 -60 59 206 120 196 -15 291 -66 389 -56 231 -157 42
6986D2q3K09r7m02K10q2jJ72J46k82N38n44L1j32L40j68n8J55m6M56j89l37m8
7009a70K51j35J1j80O05k74l14L59l62J97M8j3r2K88k36J7j19M9K18j30Q5j25
7031b2Pr1J73l47L47k44M19l7m16J75M7k12K39m2J01Mj07K88o11K75L2l98K12
7054b08N15k89r6J28j71L91l96J55j66j8j97J87K0P2J14k22O5J71R0j95J1j07
7076a46M2Qm5K4L87k01j0O1j71j59J50K07k23k93L23K13q4k9N1kj03j23N9M7k07
7101b24K19p4J37J00l99M99k49K09o3k09k37J39R9R5J10m01L3q5J48R5J25j08
7123d1N9J13j82O9m0j1J07J20j94J52m53J23q0N19k70k18J75J68O8o2j06K3k29
7146a90J86K8M4k05j8j12K5N40l28K69m41J84N3q4L71j75k30jM4m9o5J01n4j22
$$ plain form
6986 42 -41 168 71 -331 -121 -203 -204 -32 114 -168 370 -174 -143 -275 65 -103 -161 -6 -52 404 215 -122 -170
7009 -170 81 -54 -43 -223 382 108 -206 153 -209 -12 36 23 -69 219 -17 0 -119 -70 148 18 103 -22
7031 -22 -15 -106 67 -280 67 -177 242 205 -211 -36 11 -201 38 -4 97 101 -6 282 -329 -54 -22 -420 -208
7054 -208 307 18 -78 50 -121 270 -126 29 -137 -155 -352 -165 -145 -73 41 -181 -116 55 145 -50 -39 -146
7076 -146 -104 -96 -141 -117 270 69 59 120 -51 -210 -60 147 -76 -369 -46 167 83 54 105 103 0 -123 -64 -17 -224
7101 -224 -5 -79 58 158 -241 258 9 218 155 -54 -291 -152 -53 42 152 -249 -216 -301 -153 -58 67 -41
7123 -41 18 131 -51 18 -22 -33 74 194 0 152 -301 -178 -258 261 -9 -227 -52 116 184 122 16 39 -190
7146 -190 -4 24 68 -137 -155 -267 -242 298 -30 239 -202 -18 35 -49 322 147 -83 -84 -40 -89 -154 -53 -107 -229
7170b29M68k5O7j61l16L71j50K96l86j04L7o0Q1j06N2O0K15O1q3l92M55k34j14
7193a97M43k49k25K56N0Q6J08j64K00l35L71o56N54j01j28L04l2l24O0k72N6K12
7215A7j52J33J83j08M9k42K4L02l89O9K57k61p7J01K41J34l56NL44l83K63j36
7237A8j9n4K31m24K36L65k22P9l85l53P87m56o1N56m27O9J74q0j27L02l53k15
7259c59M81m37J53J00o7R5j49K48K83n17K84k43J97L15m68j52P8P0o4J55l21K86
7281c2N7k57J53J65k25k42K01M06l68L67k47J81K65n53qP8j13q6L77J91r3l6k76
7304i5k45M07j06j20j06J08K47l09L03j99NK7J31l9J36N7k26J48O0M0k42m3K09
7327A48l47J19M94n98K32K1m11K28K25l93M65mK7J3J32k59m81P9M21j8%j12J49
$$ plain form
7170 -229 239 214 281 120 -196 175 25 321 -65 -169 -132 -192 -111 -217 -165 -105 110 171 88 -304 151 -83 -197
7193 -197 246 -3 -228 28 78 164 272 108 308 -27 344 -312 242 141 13 317 285 -39 21 -251 -195 17
7215 17 -135 -2 181 73 122 -120 -96 206 -183 -114 143 -118 -195 -94 147 281 -75 -70 274 -109 154 18
7237 18 -1 -55 176 -248 -12 353 131 210 -175 -528 259 -197 -258 298 -129 -60 114 34 -93 209 -144 -359
7259 -359 122 -315 -162 -62 -129 -34 -183 65 348 -169 115 -128 69 384 -84 -236 -158 -88 -152 3 -318 -32
7281 -32 25 -232 -79 86 -139 -381 -180 226 -142 225 -22 159 424 -129 -137 -59 -172 -258 119 310 217 181 -95
7304 -95 -340 67 -39 -159 -265 -157 90 -219 84 -115 -110 -83 48 9 145 202 -24 124 184 224 -18 -61 148
7327 148 -199 -80 414 -184 48 69 -342 -114 111 -282 183 179 206 219 351 92 -389 -310 111 93 93 -19 130
7350A30l3k6j15M32l35m5j22J15l9L8k14J52J7Mj33K36j11J24k75j3J89K24Q0
7373B80k82Q2P2j92m4J3O5j50J40J83j69j04j18L50j46j0L02k96m8J76j46o4K63
7396A57j70L82n78K10K9J86o3Q9k81P2J92k88K80j43N5L4m69Q27o29n1L18j68
7418iK51n8k23J19k1q6R3l6J82J23l09l0K10P6j35k54K39p6j4j60K01J48k28k44
7442b41L70m05L82Oj18j29K40J20j51J82l81JR1J25j17j65J68J00j97J81n9k8
7464b5j36J56p4k74O77k75k23J86k7j70M13o9l38j24kp3O34m46K36k91J9K8m7
7487b45o0J69J08k13K47L8k54O8K26l57l9K10J64j89L6J02Q6j42J04L1O8m7r0
7510B1L8L6P6R0l87k82L60K52k2n5kn2m0K88p3j40l1K5j17j76O14o85K43r7J93
$$ plain form
7350 130 97 71 -44 388 53 8 -114 1 -38 0 -214 -62 -45 -41 -174 62 -49 75 -200 -213 -24 200 280
7373 280 -2 80 152 -40 -84 -71 -6 -156 -16 167 -2 -106 -224 126 -20 -30 272 -24 -72 104 -42 -106 157
7396 157 -13 369 -209 1 30 216 153 242 -39 33 225 -63 217 74 129 163 -306 521 -108 -159 159 -9
7418 -9 242 184 -39 80 59 -27 66 30 212 335 26 -4 206 282 147 -107 132 56 42 -118 83 231 3 -241
7442 -241 129 -276 106 112 -6 -135 105 225 74 256 -125 -124 -33 92 -25 -190 -22 78 -119 62 3 -25
7464 -25 -161 -5 -79 -353 324 49 -174 12 -15 -185 228 159 -179 -303 -305 -378 256 -190 46 -245 -226 -198 -245
7487 -245 -305 -136 -28 -241 6 44 -210 -142 84 -273 -312 -102 62 -127 -91 11 97 -45 59 90 158 111 21
7510 21 59 95 171 261 -126 -408 -48 204 182 127 125 73 33 321 248 108 77 102 -15 -191 423 -262 -19 -116 77
7535G7j95K3q0L7K33k32J3p1j67L65J52l46k0R7l3J31k21J27K80l89L14j05J21
7558A11n0l3j67K26j18K1n2K1K62j91o7J25K86m39R8k09K75rl65L21j55L12m10
7581b07K25j0J95k38Q4k11K49l20K86J25k56l7o8K91K06q3l17R1J06k13j60L73
7603A11O6j29j32o4J52K47l25j02J03M8j95J05R7J8n7j03l6L4J78j83k1J04j56
7626b40N20k46l9Q8J1j0O8l2J28pn81M22j10J23j26k92J35k49K48K75m17K53L
7649g5j33L3L27l3p7Qk85K41l5j35L48K11j46m78J51L47l11K02l93L66k1j6j32
7672c6m2j65R3J41J81j52M4O2l99J96K58j85P0k69N8K31q5k43M7J48M81q11N31
7695A54l62O17m93j26K35L9q1m75O63j86l6Q9Q6J48l66K52l18O6n0j95M16r0J35
$$ plain form
7535 77 -118 -95 -175 -138 95 -137 -124 -195 -362 3 155 -191 -211 -114 -147 -16 -237 -110 170 -219 95 -10 111
7558 111 61 28 -139 87 -31 -10 -62 -41 221 30 -37 88 374 -65 33 -176 99 90 -275 46 -109 203 -207
7581 -207 18 8 203 -35 49 -162 87 -233 53 178 -78 -115 -183 108 314 231 -86 5 111 -102 -262 111
7603 111 177 48 -84 -148 4 251 -74 -176 -73 -25 -220 -115 -18 0 -57 -160 -196 -162 16 -167 -188 -84 -240
7626 -240 280 34 -5 83 94 84 152 120 248 241 -340 82 -28 95 -31 -323 -188 -437 -189 86 -331 -78 -75
7649 -75 -208 -175 152 119 42 50 -235 6 -29 -164 184 395 249 -229 -78 269 -42 160 -233 133 112 96 -36
7672 -36 -78 -243 -150 -9 172 20 64 126 -273 -77 181 -4 66 -203 -145 86 1 -242 -195 -47 434 -377 154
7695 154 -208 409 -84 -210 25 64 -17 -492 171 -15 -51 38 124 272 -94 158 -160 -94 -144 -339 77 -13 122
7718A22p4r3K3q6R1M47n18R5Nk75N35l92K4K61j51J93K03n34J74j82J31J09l46
7741b38K72j50l9J26j85J22L34j64l0J2q9J68J24m62J99j96M67l74K14k65J90
7762C6k18J66R6J32k51j54K69l7m9j18p1O5J03O4N4k60k6M3K44l3L0M5l07L2Q0
7787f5O4J93m56K25k29M09L0k12m56M76%J04k21O3N5K13j16rQ5k8j01q2Nj05N5
7812a03Q7r6Q8l4J06J40n62L21M75l29k35J3K19q1K62k08k09m9K65j15j2K1J55
7835A19l21Q8j20J27k19M50l67J53l47K03M80l60M67j83n38L20O3p8J85J58j03
7856A77m12K50J36j1j94J34l35m8L27K20l28J92j89oK73k1l18P9k0K85j10l91
7878c10K74M63j50l05j1J11J37k10K1L2j52K94m17M36J79l46j82J35J3M1m08L09
$$ plain form
7718 122 48 -45 -22 -108 -17 430 -88 7 12 -263 272 -120 -96 165 14 207 410 -124 50 -132 -1 108 -238
7741 -238 34 -116 -155 -29 -214 -92 242 78 48 60 -29 139 263 -199 0 -196 271 -103 111 -154 36
7762 36 -182 -16 80 212 -39 -193 76 39 -10 -128 -199 -134 -31 33 87 -173 -199 -156 88 55 85 130 -177 -145 -65
7787 -65 -1 192 -264 -39 -268 141 171 -41 -497 -21 -21 83 -138 -75 -20 193 77 68 153 125 24 -58 -53 -158 -103
7812 -103 -16 -112 -24 -58 48 188 -374 -53 422 93 -142 -129 90 9 271 63 -146 -195 70 -45 -57 -36 119
7835 119 -202 -114 -234 -107 -326 124 -243 -90 -437 -234 246 -114 353 170 -368 -48 15 -63 122 280 177
7856 177 -235 15 151 140 -54 80 -255 -303 24 244 -84 108 -81 -87 186 165 -153 -74 -94 191 81 -310
7878 -310 -36 427 277 -28 -39 72 209 -1 20 52 -100 194 -223 213 392 46 -136 -1 12 53 -355 -46
7900d6J05q0j44j34N33l25J92J67l33J39j47K40K00l77L91p22M08P4m32L06Pj22
7922a00j26L62l07J57j51j54L42oJ34o4k92q2J31J40m9M5m3m8j26L61k22J98j83
7945h3r8K10K68j87k02k79N10o5k5k9J29n3J5m3k09q8M31l03R1O7K7k2j77N4k10
7970b71J49J85j23k06L80m01M17m46J95K81l08K23QN0k5n73K58O83k42k08q0P1
7992A7O6J35k83L34m07R6Q5K1Kk70L79K1m94J01M50m19J1J77j67K97k61LJ12k62
8016b56L03J22q9R3k41m4L47l79K85j42P4j95K62O1Jr2r3J89j94K85m38J10l06
8039c37K84R0R5J58l02J95j64J50j07k49L02j6k18K45n2r0J16j87L8Q7k66L65
8061A37j28nj03J32J63Rk52O5j38R4K78l25L99k20j08j90k04L13J72J34k33M12
$$ plain form
7900 -46 59 -21 -165 -299 234 -91 101 268 -65 74 -73 167 367 -10 381 -341 67 141 -291 15 22 -100
7922 -100 -226 136 -171 -14 -165 -319 23 17 151 87 -205 -287 -156 -16 -65 -20 -63 -111 -237 124 -98 100 -83
7945 -83 -181 29 297 110 -92 -371 139 74 49 20 149 96 111 68 -141 -229 202 -101 -10 57 84 62 -115 -61 -271
7970 -271 -122 63 -60 -266 114 -287 130 -316 -121 160 -148 75 83 133 108 -465 -207 476 234 26 -54 17
7992 17 83 218 -65 269 -138 -42 43 64 66 -204 175 196 -298 -197 253 -166 -155 22 -145 152 -109 -106 6 -256
8016 -256 47 169 80 173 -68 -112 235 -144 141 -1 73 -122 140 201 202 110 17 206 12 297 -141 -31 -337
8039 -337 -53 37 132 290 -12 183 19 169 62 -187 115 99 -119 126 74 -16 100 -87 -49 38 -228 137
8061 137 9 4 -99 33 196 205 -47 18 -120 -26 252 -73 326 106 -2 -192 -396 -83 89 223 -10 402
8083D02o43K88j19M3L67k58k09K39j15k27K04j02M01m84L45P5o0j12l54K85J3
8104b1J51l5R9m43J97J81l05K66%j56K2P7m3Q7k83M37k91L41o0j57k62K92j11
8127a7q4j25K1M72j55l38Q5L95r7l78r2M11j72j02o6M44j16q1RQ2j12k04L03k34
8151a51N8l8ko5Q1P9P5j19N8m0J91j30k7O4J18m3N3k53K33k76K79J01j31j79l1
8176i5K96n40M90m61J61L79r2j94K24m55o6N10j10L88k25
$$ plain form
8083 402 -241 47 -72 -29 338 80 -129 110 -5 -232 -28 -130 271 -213 132 207 147 35 -319 -34 -21
8104 -21 130 95 194 -249 -52 129 -176 90 90 -66 -44 33 -10 77 -206 231 -60 281 221 64 -198 94 -17
8127 -17 -101 -226 -205 267 112 -226 -141 254 157 -221 -313 98 -74 -176 -242 202 86 5 14 96 -16 -220 83 -151
8151 -151 -93 -131 -133 -198 -117 -38 37 -82 -24 -64 127 -3 -30 34 152 109 162 -91 142 -134 145 246 115 -64 -95
8176 -95 201 -339 151 -310 -149 230 138 -56 168 -287 -353 157 47 435 210
8191B10
$$ Imaginary data points
##PAGE= N=2
##DATA TABLE= (X++(I..I)), XYDATA
0@%%%%%%Qj6J6j9K7l4M2n6P2q3R9j20J38j62J92k24K59l01L48l97M53n17N87o64
30c52P49q42R45j056J178j316J467j630J809k006K221k456K717l011L339l702
46a946M109m572N102n716O437p296Q341r646J1330j3600J6841k1886L0904n1982
60c3580J90242J35785k62562J2518Q1145l5955j34648L3567O0062k5477m6512
71b5415L3586j6983m2292L0613O2864n5028n6849P1440Q5982n3710n5192N9627
83C8643N7952n2834m0856L7024K6203k5728j945J8503q031q205J9906j4013m7202
96e83j277L2469j7556l3418L2516M0932l3206l8729K8784K2795l5322j4631L8146
109B0920O752l6780K23L1377p882j9124K5757J4716l9574j7802L9296P123m2818
$$ plain form
0 0 0 0 0 0 0 0 8 -8 8 -11 16 -18 24 -32 40 -43 56 -64 74 -88 104 -120 139 -162 186 -211 242 -275 312 -352
30 -352 397 -445 500 -556 622 -694 773 -857 952 -1054 1167 -1289 1428 -1583 1756 -1946
46 -1946 2163 -2409 2693 -3023 3414 -3882 4459 -5187 6143 -7457 9384 -12502 18402 -33580
60 -33580 156662 292447 29885 42403 123548 87593 -47055 -13488 46574 21097 -25415
71 -25415 8171 -8812 -51104 -20491 42373 -12655 -69504 1936 87918 34208 -20984 38643
83 38643 96595 43761 2905 39929 66132 40404 38459 56962 48931 40726 60632 46619 -583
96 -583 -1860 30609 13053 -20365 12151 53083 19877 -18852 9932 32727 -2595 -17226 20920
109 20920 27672 -9108 -8885 22492 14610 -4514 21243 35959 -3615 -21417 17879 25002 -17816
122a7816K445N2208j858n3476m742L6644p694l5596R330L1100m485j4010J0536
135B586J060j9308K18J4932j0408j6667J8256J9941j8916j7629J8645J3769j7006
148a0527q852J4017K50j5110K187J2608m381l382J2770j645k2557j697K0311o03
162f611j7675R937K1869j1864k3811R533J8537j4430j5420J6396J4386j5318r066
175b3537J5102M202j4281K18J4699l875j3232O502R996j0774p383J5129R741j3389
189a0882r083J0845M525j1127k076J1626M060n628j488N02l271K019N260k875
203g593l982O479O577q075o226P749N618p159k740P351O67p246J715P075m377
218d167n279Q965O020j1580n798J1747N055j1650j846J3459J481j3363j037J1150
$$ plain form
122 -17816 -15371 36837 34979 -18497 -23239 13405 5711 -29885 -20555 10545 6060 -7950 2586
135 2586 3646 -15662 -15444 -512 -10920 -27587 -9331 10610 -8306 -25935 -7290 6479 -10527
148 -10527 -19379 -5362 -5112 -20222 -18035 -5427 -9808 -13190 -420 -2065 -24622 -26319 -6008 -6611
162 -6611 -24286 -14349 7520 -4344 -28155 -18622 -85 -14515 -29935 -13539 847 -14471 -23537
175 -23537 -8435 -4233 -18514 -18296 -3597 -7472 -20704 -14202 -4206 -14980 -22363 -7234 2507 -10882
189 -10882 -19965 -9120 -4595 -15722 -17798 -6172 -2112 -7740 -9228 -8726 -11997 -9978 -4718 -7593
203 -7593 -11575 -5096 1481 -6594 -12820 -5071 547 -6612 -9352 -2001 -1334 -8580 -6865 210 -4167
218 -4167 -9446 -481 5539 -6041 -11839 -92 4963 -6687 -8533 4926 6407 -6956 -7993 3157
232C157j163r112M888R164n219p722O163N202p280l427P682L564o609j501O612
247D399j76n778J206N745j776m333K295K470j991j319K495J695j481o56j74q53
263A768N88K050p02j067K033K078k615l172K480J345j666l97K754K77k527P74
279D001K012k628k538L398K805l783k762M715K811l864k088K946J013k856j217
294A965K295k03o16J692J246k746j088K302m9l200m81L294R97j682q51J751p0
311D556j717p2l96o13O77J128n38j251R15J582j985j875Q39J114j149j087J254
328A382J486p86o43M82o96j204l27P91o9r87J009P36p02o27J70k88j038n71N93
347a289N11j109O73J154Kj467p37L78M90n26j264Q93J024N65j061n20l2M37j82
$$ plain form
232 3157 1994 -7118 -2230 6934 1715 -6007 156 5358 -1922 -5349 2333 5897 -712 -2213 4399
247 4399 4223 -1555 -349 5396 3620 -713 1582 4052 2061 742 3237 4932 3451 2795 2621 1768
263 1768 2356 4406 3704 2637 4670 6748 4133 961 3441 4786 3120 2723 5477 5754 3227 4001
279 4001 6013 3385 847 4245 7050 3267 505 5220 8031 4167 2079 5025 6038 3182 1965
294 1965 4260 4057 3441 5133 6379 3633 2545 4847 4798 1598 1117 4411 5408 3726 2875 4626 4556
311 4556 2839 2767 2371 1758 2435 3563 3025 1774 2689 4271 2286 411 1250 2364 1215 128 1382
328 1382 2868 2082 1439 1921 1225 21 -306 485 416 -571 438 1174 472 -155 15 -273 -1311 -1882 -1289
347 -1289 -778 -1887 -1214 -60 -58 -1525 -2262 -1884 -1394 -1920 -3184 -2291 -1267 -702 -1763 -2283 -2315 -1878 -2060
366b060j752K65J146O81m94k65k04Q05k26p05j246l8J462M64q74k06J124J195
384i28j360j581J09J326K40q78m89J516P40k57o65k77K39M62m60o77N4J343Q08
403g35m76n19J66J033p81q59M51J041l13k62O19Q17k94m89K21k37k06J56K26N69
423A28K20L91R3P1j41Jj37q46j17J316Q00p01o75J038J095p26j163K16O51N64
443B078j262L8J187Q52j86j276O8K97N05n46p67N69N97R90o45q43L31M46k69j323
463H41k32J329O60j28p92p7J330j93j208q21K73J100j92p73K73R91q0p52p97M25
483A177J11n59o8M02M34j98q3M9k51q2o14o9j67K74N58J52m03K02J51k42j075
504c01n41Q50J76p36q3J579P14j716j454J457N13r84q24J140J053n77q54R9N21
$$ plain form
366 -2060 -3812 -3547 -2401 -1720 -2214 -2479 -2683 -1878 -2104 -2809 -4055 -4093 -2631 -2167 -3041 -3247 -2123 -928
384 -928 -2288 -3869 -3760 -2434 -2194 -3072 -3561 -2045 -1305 -1562 -2227 -2504 -2265 -1803 -2263 -2940 -2886 -1543 -735
403 -735 -1211 -1730 -1564 -531 -1312 -2171 -1720 -679 -992 -1254 -635 182 -112 -601 -380 -617 -823 -667 -441 128
423 128 348 739 832 903 762 763 626 -220 -337 979 1779 1078 403 1441 2536 1810 647 863 1514 2078
443 2078 816 854 2041 2893 2707 1431 1499 1796 2301 1755 988 1557 2154 3144 2499 1656 1987 2433 2164 841
463 841 609 1938 2598 2470 1678 1601 2931 2738 1530 709 982 2082 1890 1117 1390 2381 2301 1549 752 1177
483 1177 1288 729 661 1063 1497 1299 1216 1265 1014 932 318 249 82 356 914 1066 663 865 1016 774 -301
504 -301 -842 8 184 -552 -635 944 1658 -58 -1512 -55 458 -526 -1350 -210 843 266 -588 -489 32
523C2j14l19P3n81l3P57L91q77l73Q23J145j259j969L02J901K9j540R6K155O77
543A316k703n69J068P19r93l67J114O83j306J06P38k43q74M76J228j428j237J088
561a184J446p21j019Q49J624j222k531P09J732p28p25J448J715j658j723O41P96
578e51m22j064J358J275j023j547Q84R71p22o47J107N58j306p01Q64L65j050k0
596a671K232j10j862r06J330O21j210l96K220O78j413k068O05J913p06p86Q49
613f80J035q67j254K17P59k46J17J395J06k176m61J328M94j372L99J964M25j835
631f52j416J218R15r79j40J400R20j356j842J016J115o2m66J116J69j415n93R18
649a34M76j03k56J054M28j552j155J413O04p78J19J204M54j545j224J548Q50j198
$$ plain form
523 32 -82 -401 -328 -909 -942 -185 206 -671 -1044 -221 924 -335 -2304 -2002 -101 -72 -1612 -1516 639 1316
543 1316 -1387 -1956 -888 -169 -1162 -1529 -415 268 -1038 -932 -194 -437 -1311 -835 393 -1035 -2272 -1184
561 -1184 262 -459 -1478 -629 995 -227 -2758 -2049 -317 -1045 -1770 -322 1393 -265 -1988 -1347 -551
578 -551 -973 -2037 -679 596 -427 -1974 -1090 -119 -841 -1488 -381 177 -1129 -1830 -966 -601 -1651 -1671
596 -1671 561 451 -1411 -2317 -987 -366 -1576 -1972 248 926 -487 -2555 -1950 -37 -743 -1529 -680
613 -680 355 -512 -1766 -1549 -790 -1036 -919 476 582 -1594 -2055 -727 -233 -1605 -1206 758 1183 -652
631 -652 -2068 -850 65 -914 -1054 346 1266 -90 -1932 -916 199 137 -329 787 956 -459 -1052 -134
649 -134 342 239 -17 1037 1465 -87 -1242 171 775 -3 116 1320 1774 229 -995 553 1403 205
667B05k84K364M31k779j328K301J481j619m84J719Q45k692j069J598J132q71j33
684H17J861m50k080m61J449M07j645N14K769p15l180k46K750P7k121P43K244l99
702B334k689j156K977O72j307l03J991r56k175p3J791p8p49N68K204j507k603
719a059L38J772m56j201J238K353j719k700M44K242n35j880J448J900j682k512
735b009J395J747n04j331Q80J363j182k368P85K090r29r16J436J414j616k096
751a841R13R78j064l47K130P74k253j555J641R09j220p59K195J029k452j581J698
768h05J344m07q32J112K94j407j194P64R46m6J3J185j10j790m66Q69L18q31L74
787f69J722K26k116o15R80P18p64j64J264M84j559q46J175P51n16m02J221J59
$$ plain form
667 205 -79 2285 2716 -63 -1391 910 2391 772 288 2007 2852 160 -909 689 1821 950 817
684 817 2678 2228 148 -313 1136 1543 -102 412 3181 2466 -714 -960 1790 1867 -254 489 2733 2334
702 2334 -355 -1511 1466 2138 831 528 2519 1563 -612 -685 1106 1028 279 847 3051 1544 -1059
719 -1059 -721 1051 595 -606 632 2985 1266 -1434 -990 1252 717 -1163 285 2185 503 -2009
735 -2009 -614 1133 629 -702 178 1541 359 -2009 -1224 866 -63 -979 457 1871 255 -1841
751 -1841 -928 50 -1014 -1361 769 1543 -710 -2265 -624 285 -935 -1694 501 1530 -922 -2503 -805
768 -805 539 132 -700 412 706 -701 -1895 -1131 -185 -231 -218 967 857 -933 -1399 -530 -212 -1043 -669
787 -669 1053 1279 -837 -1452 -472 246 -518 -682 582 1066 -493 -1339 -164 587 71 -331 890 1049
805A049j558p55J251L48m47J94R02k17j261l12N09O72n54K42J001k41j054o58
823h89P26M42l62M4P09K9j205r71J482J007p41m59O31O41j430n48O89J029j94
842F30r44Q59R9p71n56Q03j27n67J21J580o79j373J38J461j66p93k90J052l7j496
862a056m16J679L20n77o53Q35J92j161j38J181j89l27Q1M46j4j233M74O93k17
881h0o53K52Q95l91j002J64Q98j52n52N43M50k65j068L51P82ll37oN05o46p73
902a088M58R30L9o54L51L89o65n34M90L09k67J52M01J4m66k67O95L70q33l62P45
923B07K96p21m39O25M35j88n40O32J51l93r0l8M56o35L33K89Q2n45j5M55q4k98
945b5Q7K73j22l57j1Q15l30k00M8K48Q8k54l18J45M59k75K6l56J36P0k74j12N80
$$ plain form
805 1049 -509 -1264 -13 335 -112 82 984 767 -494 -806 -297 375 -179 63 1064 823 -231 -889
823 -889 -163 279 -83 -39 670 699 -506 -1477 5 1012 271 -188 443 1084 -346 -894 -205 824 630
842 630 -314 545 644 -127 -683 120 -7 -574 -453 1127 448 -925 -787 674 508 -285 -575 477 440 -1056
862 -1056 -1472 207 527 -50 -703 132 324 -837 -975 206 17 -310 -229 217 203 -1030 -556 137 -80
881 -80 -733 -481 414 23 -979 -815 83 -69 -621 -78 372 107 -961 -610 172 169 -168 -174 331 -315 -1088
902 -1088 -630 300 339 -315 36 425 -240 -774 -284 25 -242 -90 311 325 -141 -408 287 657 -176 -538 207
923 207 503 -218 -657 -32 403 215 -325 307 458 65 -25 -63 393 -242 91 380 462 -83 -98 357 273 -25
945 -25 62 335 213 -144 -155 660 330 130 178 426 514 260 -58 87 546 271 297 -59 77 147 -127 -239 341
968C41m96M04j33K7k31m79M63K1j76m1N1K31j89L8M82m91m9j59R03m85m43OM2
991c63N41m56J08j65J63K39m12K60q9J76J71m54J53J52j65K73l68k10L15J65P1
1012A05j74q9K13L6k83OL39K48p15K81o2K61k35N2L42k45j61J92R9j93j23J3L98
1035C05j30l18J99J86l46L66j01K53n22K79K69l54J93J72j50j46m1j30O4L9K93
1056C80n25L30K17J45o9k17j0N00m22j6K45n74M0N28k72j49K7M02l49j98K82n1
1078B44L71k10q9q5K30J3l19k19M95o0n4k6k55J17L07k87l15J14Mj5j19J08L65
1101C15l9k78J72k40k99K09O1j23P22p74J87M8L4J10r6n01L40k12K35k10K55o9
1123a53K19l2k43j25J83k06K50k0k69K37J35l26N06l60j06j75J35k0L02j00o8
$$ plain form
968 341 -155 249 116 143 -88 -567 -104 -83 -259 -300 -249 -18 -207 -169 313 -178 -227 -386 517 32 -411 -405 -363
991 -363 178 -278 -170 -335 -172 67 -345 -85 -174 2 173 -281 -128 24 -141 132 -236 -446 -131 34 105
1012 105 -69 -158 55 91 -192 -186 153 401 -314 -33 -95 166 -69 -17 325 80 -81 111 210 17 -106 -93 305
1035 305 175 -143 56 242 -104 262 161 414 -108 171 440 86 279 451 301 155 114 -16 48 87 380
1056 380 -145 185 402 547 478 261 251 751 329 313 558 -16 24 552 280 131 158 560 211 13 295 244
1078 244 615 405 316 231 461 474 155 -64 431 371 317 291 36 153 460 173 -142 -28 -24 -39 -158 -50 315
1101 315 276 -2 170 -70 -369 -160 -99 -222 500 -274 -87 -39 -5 105 9 -492 -152 -364 -129 -339 -84 -153
1123 -153 66 34 -209 -334 -151 -357 -107 -127 -396 -159 -24 -350 156 -204 -310 -485 -350 -370 -68 -168 -236
1144b36K39k48J12l71J93K23n7J10l05O0M51l79R0K37n33M72o34N00m21M42K14
1165A59q8k78L2L1K40n5m64L17M60j36m90q6L01M57l55l88K25M72o83K90K51K10
1187D22k75k97K33k60o7j04N22J12n29J00P24n74j4r2K60j4p4k01K88k2o26M36
1209e2J63K5l43K3K83o3o17M04N44j43k57oj46M71p87K19O43l49p3J5K01k98m38
1232e81O82L16o19k73M74K53k09n29M67N01p37J91j60M16n02Q5j86Q10l74q5j14
1253a74J93k99l45K28M63N5m61N94R5o54j04M74K31l11k77M84O9m40j09L2P60
1274E04l20m04L90K1n92j21N65J75m64K16J80J52n32k56P90k8l33L68Q9Q2o90
1295b08k33O22k3l45R4L73k85k67j05N20N86n68k17L63n4o06L93K55M82m47m85
$$ plain form
1144 -236 3 -245 -133 -504 -311 -88 -145 -35 -340 -280 171 -208 -118 119 -414 58 -576 -76 -497 -55 159
1165 159 71 -207 -175 -144 96 41 -423 -106 354 218 -272 -358 -57 400 45 -343 -118 354 -329 -39 212 422
1187 422 147 -150 83 -177 -244 -348 174 286 -243 -143 581 7 -7 -99 161 147 73 -128 160 138 -488 -52
1209 -52 111 136 -207 -184 99 36 -581 -177 367 224 -33 -39 -185 286 -501 -282 361 12 -61 -46 155 -143 -581
1232 -581 101 417 -202 -475 -1 252 43 -486 -19 482 -255 -64 -224 192 -310 -225 -411 399 25 -60 -174
1253 -174 19 -280 -625 -397 66 121 -340 254 349 -305 -409 65 296 -15 -292 192 261 -179 -288 -256 504
1274 504 184 -220 170 191 -401 -522 43 218 -246 -30 150 302 -230 -486 304 276 -57 311 400 482 -208
1295 -208 -441 181 158 -187 -93 280 -5 -272 -377 143 729 161 -56 307 253 -353 40 295 777 330 -155
1316a55M58J33q59j83P48J53j33j0O16p27m51M11M83K08o88l45Q23k36o16j50
1336e20R58K30o54k0K21l0m08j68N67K32l19P2j13J35n86J76L25K25l76l08N79
1357B18k86m93M05N36k62k44o0N26n21o35M75Q48j73m82K86p1j32n50K85P85k32
1378B23o54K26K48J62r63K19N77p4l11K41M00m88l69J92P26k14o28N97M32n81
1398c9q88R15M94k49n53J15O28p11n54Q36K49K54o00J52j08k63L4L45M58l17m64
1419b66P20j0p73r4M96P60n31l74K23O34r83n42Q32P50o22l27L79K90p31m64J245
1440F12K00o07k53L39k99J12n72O99O5r0m21J89L15n08k50O53q7J40j56J95K7
1461C03o04K18L92J10j56j58j58M49p24j3L87M48o34L22j37O5n09j02M77L11j37
$$ plain form
1316 -155 303 436 -423 -606 142 295 162 152 768 41 -410 1 484 692 4 -341 482 246 -370 -520
1336 -520 438 668 14 -6 215 185 -223 -391 176 408 89 161 48 183 -403 -227 98 323 -53 -361 218
1357 218 -68 -561 -156 380 118 -126 -186 340 -181 -816 -341 507 334 -148 138 67 -65 -615 -330 455 223
1378 223 -431 -205 43 205 -758 -539 38 -36 -347 -106 294 -194 -563 -371 355 141 -487 110 542 -39
1398 -39 -927 -12 482 233 -320 -205 423 -288 -842 -6 243 497 -103 49 -59 -322 -288 57 515 198 -266
1419 -266 454 444 -329 -423 73 833 302 -72 151 785 -198 -740 92 842 220 -107 272 562 -169 -633 612
1440 612 812 205 -48 291 -8 104 -468 231 296 206 -215 -26 289 -219 -469 184 97 237 81 276 303
1461 303 -301 -83 309 419 263 105 -53 396 -328 -341 46 494 -140 182 45 110 -399 -501 -24 287 150
1482A50m26K35k4n78J19N20K33o46K74K16J30o02j55P96K63p09m7L45j96l21m
1503d27O94j53n30N5L52q6pl37M34J43l38Q1K35m10J89l14O43k6j84m2O9Rk46
1526a96k69L26L58l19p9M43l44j8l81P21J6m69K13k78J03k83L12Q09p68J08M0
1547D5J68l34P0j70N15j0l03J3J55j25j34L79L72n54J2l36L60k56k08M93J62n3
1569B61k68o6K49j25M8%J63J04m69K07J1k92j26N72J61l40j71J28k30K35L6k60
1591a72K38n7j26K92J19m55j28M64j55m7j7j24J82j25J8p3M6J63k09k5o7M32m50
1614b76N54j97J13J0n16L01l06L2M09K47k74l24J87l95Q9K52o2L22k14k9M5r0
1636a22l3j2L26j12k53L7L5j13L38l5ol14K30K38l57L11k16O8P6j02K9j54L07
$$ plain form
1482 150 -276 -41 -65 -643 -524 -4 229 -417 -143 73 203 -399 -554 242 505 -204 -251 94 -102 -423 -427
1503 -427 267 114 -416 -361 -9 -95 -102 -439 -5 138 -200 -119 116 -294 -105 -419 224 198 14 -28 41 50 -196
1526 -196 -465 -139 219 -100 -179 264 -80 -98 -479 242 258 -211 2 -276 -173 -456 -144 665 -103 5 45
1547 45 213 -121 -51 -221 294 284 -19 -6 149 24 -110 269 641 87 99 -237 123 -133 -341 152 314 261
1569 261 -7 -73 176 51 99 99 262 366 -103 104 115 -177 -303 269 430 90 -81 47 -183 52 88 -172
1591 -172 66 9 -117 175 294 -161 -289 175 20 -27 -44 -168 14 -111 -93 -166 -120 43 -166 -191 -258 174 -276
1614 -276 278 81 194 204 -312 -11 -317 -285 124 371 97 -227 -40 -435 -346 -94 -156 166 -48 -77 -32 -122
1636 -122 -155 -167 159 47 -206 -169 -134 -247 91 56 50 -264 -34 204 -153 158 -58 10 86 -16 13 -141 166
1659A66l6l50K76l1J51j76K5K13r8j27K91j46n8O9nj21m4Q3LNJ47L82n55K6P9
1684A69k84Qr3N28k35l17M24j15J14l0p8K02j40o8o2J57k9l19K75j31K42j23L02
1707C97l78q4k5P2j08N9O4K31k37o03M13L00J59l32L16m1l04Q9P7K4k44J41k91
1730c05J71K40r2K15m51K97o8O1l0k60K47J40m60M65j23n35K95J72j43N4l7k74
1752d21R8q5O0K14j72M02M2m5o7j28M5j96K38j5l8j07J80k4N2k12M9k23K62J4
1776g7K12l20K33l4k73J28J83n7j46L03j27j73K93k32R4J3M2O3J6k09J89J8J17
1799B56m5o4k00P5Q6l40m3L57J6P1l7k29J09j19J56M7k46j54L51k33K36k3m0l6
1823d9LJ40j66K60l07k8J39K68j28J27j41j01k6k07K79j23j43p2M29m00K36K04
$$ plain form
1659 166 130 -220 56 25 176 0 25 238 140 13 304 158 100 169 164 43 -1 82 85 90 237 619 64 90 169
1684 169 -115 -107 -200 328 93 -224 200 85 199 169 91 293 153 85 23 180 151 -168 107 -24 218 95 397
1707 397 19 -65 -90 -18 -126 -67 -3 228 -9 -612 -199 101 260 -72 244 203 -101 -12 65 89 -155 -14 -305
1730 -305 -134 106 14 229 -222 75 7 68 38 -222 25 165 -295 170 47 -488 -193 -21 -164 -110 -147 -421
1752 -421 -323 -408 -348 -134 -306 96 138 93 26 -102 -57 -253 -15 -30 -68 -175 5 -19 33 -179 -130 -353 -91 -77
1776 -77 135 -185 48 14 -259 -131 52 -5 -151 152 25 -148 145 -87 7 20 62 125 141 -68 121 139 256
1799 256 211 147 -53 22 108 -232 -275 82 98 169 132 -97 12 -107 49 96 -150 -304 47 -186 50 27 -13 -49
1823 -49 -46 94 -72 188 -119 -147 -8 260 132 259 118 17 -9 -216 63 -60 -203 -275 154 -246 -10 194
1845A94k68K2q3O6k36M39l10K53j41K35l98j11L60j31J79k30%N9j2J09J64k86
1867a26r4N4L15o09M43K06m2n25J31L0K88r1k09J88J57n9j95P1k60K32R8p6N1
1890b2M4j28r3J22k29Q7K2M81k79j68L34n5m53K65P2j96o5K94N7n3q3r2k3L05
1914A44L5k05J66j66k89K15J77k45K03r0J32K17k66j91K58j14k58N19m35K39m23
1935c77J55N37J34l63o0l2Ol6k78N68k05m0J61k34K63k9n39O11L8o37L07L12l66
1958a04J53j59M34p1m29L83qJ44m31j28L33J03k28j66K71m6o1J41Q6j39j13j59
1980a94M8K23j97J80j56L33m63J25L00l33O7m8M61k58k4k89L42m17r3N49j57j06
2002a07k2K53k86J07j5J82K26N4k86k98L68l02L21k20k4K55k70K39k61K42m75
$$ plain form
1845 194 -74 -52 -135 -69 -305 134 -176 77 -64 171 -227 -338 22 -109 70 -160 -160 -101 -113 -4 160 -126
1867 -126 -220 -166 149 -460 -17 189 147 -378 -247 -217 71 -20 -229 -41 116 57 -138 -67 -327 -95 3 -73 -22
1890 -22 22 -106 -199 -77 -306 -219 -197 284 5 -163 171 116 -337 -72 0 -196 -261 33 90 37 -46 -138 -161 144
1914 144 179 -26 140 -26 -315 -100 77 -168 35 -55 77 294 28 -163 95 -19 -277 242 -193 46 -377
1935 -377 -222 315 449 86 26 -6 0 -36 -314 254 49 9 170 -64 199 170 -369 242 280 -357 -50 262 -104
1958 -104 49 -110 324 253 -176 207 199 343 -88 -216 117 220 -8 -174 97 51 -10 131 217 78 -35 -194
1980 -194 -146 77 -120 60 -96 237 -226 -101 199 -134 -67 -115 346 88 64 -225 117 -300 -393 156 -1 -107
2002 -107 -129 124 -162 -55 -70 112 338 392 106 -192 176 -126 195 -25 -49 206 -64 175 -86 156 -319
2023c19L20Lm52L99K38O0k07o0k66L56J54k42j43L56m75M9L81R5j17l6j47J94
2045A41j8n47M69J67R0o25J63L18K31k06J47k64r4R1K97j73m05K59O0L29n12K77
2067A95k57r8M9J5j4N90k76m66J12L96k49n4O3M58n81l05M88j09L5j78L67j89
2089hJ6l3J86k93Q9m85P25J34m89l8K72k2l97L61N0K6j84J5Rq8M08j67K04k71
2113B0j14p1M6j80M80m56J73J10J42o32m8M17n5L22L95k10l85O9m81L09K7L15
2135A93j53J13k71L17j52j54k6L06k4l2k44L95k69j02J49j24K52l27k15j15O38
2156A55q2k27K56j73L00k86K74j28j88m3J67J1n2N6j65L25O4j94j5J53j81K3k65
2179b15J09j05L53o1o2k15r5L60j53p6M19l76j7L6O7M9J78m37q4K98J46K2J61
$$ plain form
2023 -319 1 4 -448 -49 189 249 42 -18 -284 72 226 -16 -159 197 -278 -229 152 247 130 94 -53 141
2045 141 123 -424 45 212 302 -323 -160 158 389 183 330 66 -28 63 360 187 -218 41 101 430 -82 195
2067 195 -62 -160 -111 -96 -110 480 204 -262 -150 246 -3 -57 6 464 -117 -422 66 -43 -8 -186 181 -8
2089 -8 8 -25 161 -132 -43 -528 197 331 -158 -196 76 54 -343 18 68 94 -90 -75 -66 -154 254 87 291 20
2113 20 -94 -165 -119 -299 181 -275 -102 8 150 -482 -530 -113 -168 154 549 339 -46 23 -458 -149 -122 193
2135 193 40 153 -118 199 47 -107 -133 173 149 117 -127 268 -1 -103 46 -78 174 -153 -368 -483 155
2156 155 73 -154 102 -71 229 -57 217 89 -99 -142 25 36 -16 40 -125 200 264 70 55 208 27 50 -215
2179 -215 -106 -211 142 81 19 -196 -291 69 -84 -160 259 -117 -134 -98 -31 18 196 -241 -325 -27 119 141 302
2202C02n94M37j90k23K27p8M6L99j53j27K6j30J77j60K48n52J64M60j3n8p1q2
2224E5k09j29O88o53L53k84M27j38j56r7J39Q3r1k17L04J5K79o41J17N22m86J29
2246A0L56k52p2j10N7J67m1ll89M36k92M4J81p7P4J12j72Q4j70j31K05nl9K75
2270B48l07P3OjK45k36k73K90R1j47p4j09L02l2r2j1l9j4L82k52M6k2K0lk85P24
2296E30n98K04l74J76j7J0J96Np7K18l55k19L59n5q9N87n14k7O47p33N0M3p1J88
2320H4j30J0J13j83L50l78J69j80K14M7o9j94K6K72k09k2K41J89l41j76J38j58
2342a87M11j35k98J89o8K74k98J96p8j28r5J40l7R5K68k52n1K52k87o0J74j70
2364a45k0L91j41J72m46P5m5N0m7J42J8k44K0k7Q0J57N8J06j41L1J11j83N3R1
$$ plain form
2202 302 -292 145 -45 -268 -41 -119 -73 326 173 46 72 -58 119 -41 207 -345 -181 279 266 208 137 55
2224 55 -154 -283 405 -248 105 -179 248 110 -46 -143 -4 79 -12 -229 75 90 369 -272 -155 367 -119 10
2246 10 366 114 42 -68 -11 156 115 112 -277 159 -133 -89 92 15 89 201 29 113 -57 -188 17 12 -27 248
2270 248 -59 14 20 19 264 28 -245 45 136 -11 -85 -194 108 76 -16 -27 -66 -80 302 50 96 74 94 91 -194 530
2296 530 -68 136 -238 -62 -79 -69 127 132 55 273 -82 -301 58 3 -86 501 -13 -40 607 -126 -76 -33 -104 84
2320 84 -46 -36 77 -106 244 -134 35 -145 69 116 47 -147 -121 151 -58 -80 161 350 9 -167 -29 -187
2342 -187 224 89 -209 -20 -88 186 -112 84 6 -122 -217 -77 -114 -19 249 -3 -54 198 -89 -149 25 -145
2364 -145 -165 226 85 257 -189 -114 -159 -109 -156 -14 4 -240 -220 -247 -167 -10 48 154 13 44 155 -28 25 116
2388A16l33J27P5Q3o4K1K70l09O2l79L00K38K9k22J2J1o2j57J15j14K83J5j60
2411d3n3J00L19r5n21L84k46J64N5J74k14K1k13L8J16L14o60N28j13q7K61l71
2433a42K74j42J22k15j95K90j42L4p3K62k12J40J09o1J56l89K12J60j36j9j81
2454a48J17k41M08R4L8n9j80J53j9m8j35J01j99K48j05J80l80L65k20l0J94k14
2476h0N3j65L26j62j7J3J08l52J28J10j62L24o3l33K05L43l48M1Q7k13J87k1L47
2499C56o35L27q5m8jJ17j24L20J09l63J05j14j59J13L70q6K2l83J77N9k46J73
2521DK11k06J33k65N2N1M0K9jj10L08l7J42J7k61k84L79m19O04j08k37N6k71K35
2545F2L1m50K85Q6J26j16j99M29k9m9k7R7l13K25j22j21L61k42ljp9J41m2o9K79
$$ plain form
2388 116 -217 -90 -15 68 4 25 295 -14 48 -331 -31 207 236 14 26 37 -25 -182 -67 -181 102 117 -43
2411 -43 -96 4 323 228 -293 91 -155 9 64 238 24 45 -168 -130 -14 300 -360 168 55 -32 229 -142
2433 -142 132 -10 112 -103 -298 -8 -150 -116 -189 73 -139 1 110 49 205 -184 28 188 52 33 -148
2454 -148 -31 -272 136 230 268 209 29 182 163 115 -20 81 -118 130 25 205 -175 190 -30 -60 134 -80
2476 -80 -27 -192 134 -28 -45 -32 76 -276 -148 -38 -200 124 61 -272 -67 276 -72 -31 56 -157 30 9 356
2499 356 -279 48 -37 -85 -86 31 -93 227 336 -27 78 -36 -195 -82 288 202 224 -159 18 77 -169 4
2521 4 215 9 142 -123 -71 -20 20 49 48 -62 246 209 351 368 107 -177 202 -217 387 279 42 98 -173 62
2545 62 93 -357 -72 14 140 24 -175 254 225 176 149 246 -67 158 36 -85 276 34 31 30 -49 92 50 -19 260
2570B60m63L53m23M10J6m21K76l1J20J40l77N0JL33L7l14L72m38J82N3Q4m98J21
2593a57R3q0K18J7Q8J65m44K27j54n7L35l99R2j27J04K00m47R0M62k70K2r7j77
2616b96K59k81K85Q2J75M4k85k31L25K61j28l11R8J0j44K74l31J64l69J81L80
2637A62j70k55N07q9k19N8o0J84l05R6k5L36k70k4q8M16l93K32L4N3n6M7J0J7
2661A98j38N5j97K27k49j35K99o0k37J43r1L32k62j5n5N21k35o09N22l8J54l63
2683b33J86k23J2K85L0K46j91K8j35JJ30R0j82j94J7J81R5oM5j40l03J59K67l28
2707a63M14l58K42k11K24Q0j76k79J94J86k0j5Ok46j37J53K77j65M3k94L44j2
2729H7j92j0J18R4m5qK46l11j63l2L53k11k75L68k90M71n89L30r5m2K92R9j73
$$ plain form
2570 260 -203 150 -273 137 153 -268 8 -23 97 237 -140 -90 -89 244 281 -33 339 -99 83 136 220 -278 -157
2593 -157 -64 -144 74 91 179 344 -100 127 -27 -84 251 -148 -56 -183 -79 121 -326 -236 226 -44 -22 -119 -296
2616 -296 -37 -318 -33 49 224 268 -17 -248 77 338 210 -101 -3 7 -137 137 -194 -30 -399 -218 162
2637 162 -8 -263 244 155 -64 -6 -66 118 -187 -91 -116 220 -50 -74 -162 254 -139 93 127 180 124 171 181 198
2661 198 60 115 -82 145 -104 -239 60 0 -237 -94 -185 147 -115 -130 -185 336 101 -508 14 -24 130 -233
2683 -233 -47 -270 -258 27 57 303 112 140 5 6 136 226 44 -150 -133 48 143 137 182 42 -261 -102 165 -163
2707 -163 251 -107 135 -76 148 228 52 -227 -33 153 133 118 124 -122 -259 -106 171 6 49 -245 99 87
2729 87 -105 -115 3 97 52 44 290 -21 -184 -216 137 -74 -349 19 -271 200 -389 -59 -154 -196 96 195 22
2752B2K60j99k54K50j58K23j54J7O1j11R6l23M91j90j46J56J31l51J3J95j99P9
2774i1L04k35K45o48R6K01J7NQ1J2j06M57l89o1k38L99K85m13j69L36l36L04Q0
2797A36j6M5j71J95j76l7L14o98J07N31j82k50pM12k28J31j74L66l70J87k40L60
2819B35j77j86K0J20J08k76p8J17M8J20j02J70Q4l39N7k02M05j90MK14l4j40J66
2842A44j83P04n58j8J62j35k57J0J68j52K12p0mK5J25j61K29l13k4K09L1j68M0
2865A6l58M61N8j07k70K16N2o7l1L16l15kl7K08q6r3NJ33K11m89N39n38L71m9
2889A44K30n12M68l62PJ44oj65j15j44L6J20L32J81m56k50qK18M1J17j70J64K96
2912C10P4j36M3l22J16m27K64L94m08p6K10O9k97M49m46N45l46O5M5k1k12J6J31
$$ plain form
2752 22 282 83 -171 79 -79 144 -10 7 68 -43 53 -270 221 31 -115 41 172 -179 -166 29 -170 -91
2774 -91 213 -22 223 -425 -329 -128 -111 -106 -25 -13 -119 338 -51 -112 -350 49 334 -79 -248 88 -248 56 136
2797 136 120 165 -6 189 13 -24 290 -408 -301 230 48 -202 -209 203 -25 106 -68 298 -72 115 -125 235
2819 235 58 -128 -108 12 120 -156 -234 -117 -69 51 -51 119 203 -136 -79 -281 124 -66 -62 152 118 -22 144
2842 144 -39 665 107 89 251 116 -141 -131 37 -115 97 27 23 48 173 12 241 -72 -96 113 144 -24 16
2865 16 -342 119 177 70 -200 16 68 1 -30 286 -29 -31 -68 140 54 -39 -34 99 310 -179 360 -178 193 144
2889 144 374 -138 330 -32 -25 119 113 -52 -167 -311 -275 -155 177 358 -98 -348 -356 -138 -97 20 -150 14 310
2912 310 384 248 291 -31 85 -342 -78 316 -92 -168 42 111 -186 263 -183 362 16 81 126 105 -107 -91 40
2935D0j2K72j31j20k30K59o2R4j32j44L24k16k8K13j29j85j13Q2N44j38j40o9
2957b1j48K63R2j6p2m54N77l35K16J62j16j41p2K9q4n1n8J33J27Jj22N6r8L95
2981B63l56K44l35J16J8J9J12L2j30J64K2r3j58L5j82M54k16l14K31r3J39M6J7
3004C5j43J6p6R8p6J01R0J92j85l22M55l73K88k66J72k1j32Q7J45k88Q9L74k01
3027E9p3LmN1k5J74l65j92N44k24Mk00J65j39M81j55J25k60j9K2P6L8k40l7K54
3052F3J42j16l77O30m93J8K21k00N59n76M44k10q7k63L22l4J08k18j23L04r0j01
3074g7L84n64J66K26j37m00L07k5J21K76j69k2n1k88M18k06L91m09j8J0m8M11
3096B96n82L31p9L28j62j80J88j6k27j65M46k01j37J99K9o6J45R6k63K5K8o5J86
$$ plain form
2935 40 28 300 169 49 -181 78 16 110 -22 -166 158 -58 -86 127 -2 -187 -300 -218 326 188 48 -21
2957 -21 -169 94 186 170 98 -356 221 -114 102 264 148 7 -65 -36 -120 -171 -229 -96 31 32 -90 -34 -132 263
2981 263 -93 151 -184 -68 -50 -31 81 113 -17 147 169 76 -82 -47 -229 225 9 -305 -74 -167 -28 18 35
3004 35 -108 -92 -168 -70 -146 -45 45 237 52 -270 185 -188 100 -166 6 -15 -147 -60 85 -203 -114 260 59
3027 59 -14 -11 -15 36 11 185 -180 -372 172 -52 -48 -248 -83 -222 259 104 229 -31 -50 -28 48 86 -154 -191 63
3052 63 205 89 -288 342 -151 -133 88 -112 447 -129 315 105 18 -245 77 43 151 -67 -190 114 24 -77
3074 -77 307 -257 -91 135 -2 -402 -95 -120 1 277 108 86 35 -253 165 -41 350 -59 -77 -67 -115 296
3096 296 -286 45 -34 294 132 -48 140 124 -103 -268 178 -23 -160 39 68 2 147 243 -20 5 33 -32 154
3119A54J02k26j05j05L60j18j48K43L5k21j53K67j56k00N09j59J19q1m2k8J0l05
3141b48L25k16m7K22j68L34j32J19o4j81K68m8k47N7J14k40J34j65K80j88j43
3162b34N37l44l6R0J52j69P7l94L36K14p0K56m98K02l36K27J9K63n67L00q9J06
3184D2j28P2j17K40l49J50j87K00nL5M9j07M72l87N7l98L85L10m16P8Qj99N34
3207C39k18l4J06k30K02j28k24K80m40L88r1O8n9N2Q7k38n9L35j69j4K09K59l63
3230E8k0j04J50k03k4K01J29o9l47M03j94K08m55K46J75r1j09l0J83l3N6jl45
3253b16R2R3L25k56J01oj06Rk75J8J36K34l53L82k07J47rk37J00P7J24j29p8L26
3277B92k0k09L4J21o12R6L14j95K15j94J86P0j13k61J33L21k47L40j58M0j95n6
$$ plain form
3119 154 256 30 -75 -180 180 62 -86 157 192 -29 -182 85 -71 -271 238 79 198 117 75 47 57 -248
3141 -248 77 -139 -186 36 -132 202 70 189 125 -56 212 164 -83 -26 88 -152 -18 -183 97 -91 -234
3162 -234 303 -41 -77 13 165 -4 73 -321 15 229 159 415 -83 119 -217 10 29 292 -275 25 -64 42
3184 42 -86 -14 -131 109 -240 -90 -277 -77 -82 -47 2 -105 367 -20 37 -361 24 334 -82 -4 4 -195 339
3207 339 121 87 193 -37 165 37 -187 93 -347 41 -50 18 -41 11 98 -140 -199 136 -33 -47 162 421 58
3230 58 38 -66 84 -119 -143 58 187 118 -229 174 -20 188 -267 -21 154 63 -46 -76 107 74 130 129 -216
3253 -216 -124 -31 294 38 139 133 27 36 -239 -221 -85 149 -204 178 -29 118 109 -128 -28 49 173 44 -34 292
3277 292 272 63 97 218 -394 -298 16 -179 36 -158 28 98 -15 -276 -143 178 -69 271 113 153 -42 -98
3299i8O7k2k3K9K01k29M0p1L12l7k02l4j48O69m93l00Q7M69o5k03P9k40M13J74
3323C75l19L1OJ28k00j82j21L43J36j13j46J22j77K29k88M47k22J43l39N4J89
3344I6P2m7o8j3P7p5k01L89m70J39j55L07J3j73q7K40N30o83L55m62J09J08k28
3367b27J44K14k78K75k68K17j3l95O26k26J20p1n09N89m19J85J50j36L19l61J29
3388F5J18r0p6p6p6PM37q8j82k38J11J43j19J53j61O6p7m3K50j32J64k8J8o3P3
3413A56k8k28L9P9j24N53m88K08j58J4l8j10L18k32J56o7n7o7Mn5MP8k6J81l02
3438a90L47J40l08o9J36O3j95r5L26k7j92R7j40L46p3j93j54K47k37j89L87l0
3460cJ3j74L42p5j55J25j52J06L12k35J05P1m54K87J44l44K12n35K60j55L76o1
$$ plain form
3299 -98 -31 -53 -76 -47 154 -75 -35 -106 206 169 -33 -67 -215 454 -39 -339 -252 217 152 -51 28 -212 201 375
3323 375 56 87 93 221 21 -161 -282 61 197 84 -62 60 -117 112 -176 271 49 192 -147 -93 96
3344 96 168 121 53 40 117 42 -159 230 -240 -101 -256 51 64 -109 -196 44 574 -109 246 -216 -107 1 -227
3367 -227 -83 131 -147 128 -140 77 64 -331 295 69 189 118 -391 198 -221 -36 114 -22 297 -64 65
3388 65 183 93 17 -59 -135 -128 309 221 39 -199 -88 55 -64 89 -72 -6 -83 -126 124 -8 156 128 146 83 156
3413 156 128 -100 -61 18 -106 447 -41 167 9 23 -15 -125 193 -39 117 50 -7 -74 -70 -125 -121 -43 -69 112 -190
3438 -190 157 297 -11 -80 56 119 -76 -171 155 128 -64 33 -107 239 166 -27 -181 66 -171 -360 27 -3
3460 -3 10 -164 178 103 -52 73 -79 27 339 104 209 280 -174 113 257 -87 125 -410 -150 -305 71 10
3482A0L9l0q7Qj26J80J08j08j13J79r8j52O3L95k61L3K00m19L22p1k65K13J53
3505A73l01J74l12K08L92l29L22k0k44R5j65r5k42M31n6L8J9P9l70L30m00M07
3527A34j19K36j46p3M2k31m8K35j39j1L51k26j41l9O6L37l72L29nJ7l5k94L74
3550B42l81J81Q1M3j65P4M2k83L42n36P34m04q4J38j31K54j38m5K58k45L8o3Q6
3573C8k77N02l17k28K52lL9l99K44K82k14J54P3k17K51o0J3j7mk90K79N3j24o9
3597c9L06j78J33m72M33J2k88Q7J28m29m5L64J48k28j32K64n34M07K95m62k03
3618d33J01M1K04m6o8j0L35n6j02K04l80M28k76L39k68J16lj14J2K1j91K56j90
3641h0K96r2l66N41m87L59m32J06J76K24m33R7J71q6J7m43O30L3l47O08k37n32
$$ plain form
3482 10 49 19 -68 -60 -186 -6 102 -6 -119 60 -38 -190 -127 268 7 40 240 -179 143 72 -193 20 173
3505 173 -128 46 -266 -58 334 5 327 307 63 158 -7 -102 -344 87 31 69 88 167 -203 127 -273 134
3527 134 15 251 105 32 74 -157 -205 30 -109 -120 231 5 -136 -175 -109 228 -144 185 180 197 162 -132 242
3550 242 -139 42 123 166 1 75 117 -166 176 -360 374 -30 -114 24 -107 147 9 -36 222 -23 15 -48 38
3573 38 -239 263 -54 -282 -30 -33 6 -393 -149 133 -81 73 146 -71 180 120 133 116 112 -178 101 154 30 -39
3597 -39 267 89 222 -250 183 195 -93 -6 122 -307 -352 12 160 -68 -200 64 -470 -63 232 -230 -433
3618 -433 -332 -291 -87 -133 -201 -211 124 68 -34 170 -210 218 -58 281 13 129 126 12 24 45 -146 110 -80
3641 -80 216 124 -242 299 -188 171 -261 -155 21 245 -188 -91 80 -6 11 -432 198 231 -116 492 255 -277
3663b77M40j0l19m9J10L50p1P4m26P7k36K44k56L65L0k40J6K08J22J29l14K56
3685B23k10J60n6j22K46r7P8k00K01l28K82J7k09q2J30j00M07l71j18J96K3j5
3707E5Rj85L3O4Q8K29l37k13K22N8K14k17L4J9J45k11l37M01k18K04k73J0J07
3730i9M9M13l52o9L0k15J17J6L28m5j4m39L31K40j44j39j8j09M3J13L0j23J05
3753D9k28K62p7j21k32M14k72O8J25M91m88r5L6M31j43j87J33k19j77O7N64m01
3775@j03J08j10r7L6L12j9j81J20J18j87O6j12mo5K86k82L14J5o9O0j44k90K72
3799D4j32Q1j58M83n79M41j81n9K8k11L42k86K15J22o2k58K19M0L25l90K71m45
3821a50N44q63M19K26n94J01N11l24J87k71J74N5R4k81K51k16J55P0k5j88L62
$$ plain form
3663 -277 163 153 -166 -215 -105 245 174 248 -178 -101 -337 -93 -349 16 46 -194 -178 30 152 281 -33 223
3685 223 13 173 117 -5 241 144 222 22 223 -105 177 194 -15 -97 33 -67 340 -31 -149 47 70 55
3707 55 64 -121 -88 -24 64 293 -44 -257 -35 23 237 20 54 73 218 7 -330 71 -147 57 -216 -206 -99
3730 -99 -50 363 11 -58 -28 -243 -126 -110 218 173 159 -280 51 291 147 8 -10 -119 -76 37 67 -56 49
3753 49 -179 83 6 -115 -347 67 -205 -137 -12 479 -9 -104 -68 363 220 33 166 -53 -230 -163 401 0
3775 0 -103 5 -105 -202 -166 146 127 -54 66 184 -3 63 -49 -53 -118 168 -114 200 215 146 206 62 -228 44
3799 44 -88 -7 -165 318 -261 180 -1 -60 -32 -243 99 -187 28 150 88 -170 49 89 414 24 295 -150
3821 -150 394 -469 -50 176 -418 -317 194 -130 57 -214 -40 15 109 -172 79 -137 18 88 63 -125 237
3842B37j36K3j68L69k13j67K5J81n2o3J39k40J45k50J46r3J63J22l5j29J69k11
3864c8K79l46J48Rj56K5J06J22J00j42rP3j20j06j57L87m0k22K09j43l52K58n8
3887a73K48m2J88j57k18J45nL59l76K04m26K68q9J93j05j25p3K50k39K75n7p0
$$ plain form
3842 237 101 124 -44 325 112 -55 -30 151 99 36 175 -65 80 -170 -24 -117 46 168 133 4 173 -38
3864 -38 241 -105 43 52 -104 -79 27 149 249 107 98 171 51 -55 -212 175 135 -87 122 -21 -373 -115 -173
3887 -173 75 33 221 64 -154 -9 -14 345 -31 173 -253 15 -74 119 14 -111 -184 66 -173 102 45 -25
$$ [...]
8191c
##END NTUPLES=NMR FID
##END=
