##TITLE=1H_DE-79H_F2
 200.13MHz, D2O,
 8 sc
 
 30.1.2025
##JCAMPDX= 6.0         $$ Bruker NMR JCAMP-DX V2.0
##DATA TYPE= NMR FID
##DATA CLASS= NTUPLES
##ORIGIN= UXNMR, Bruker Analytische Messtechnik GmbH
##OWNER= pz
$$ XWIN-NMR		Version 3.5
$$ Thu Jan 30 16:53:32 2025 Russian Standard Time (UT+4h)  she@DPX200
##.OBSERVE FREQUENCY= 200.1313
##.OBSERVE NUCLEUS= ^1H
##.DELAY= (6, 6)
##.ACQUISITION MODE= SIMULTANEOUS
##.ACQUISITION SCHEME= undefined
##.AVERAGES= 8
##.DIGITISER RES= 18
##SPECTROMETER/DATA SYSTEM= spect
##.PULSE SEQUENCE= zg30
##.SOLVENT NAME= D2O
##.SHIFT REFERENCE= (INTERNAL, D2O, 0, 14.3821)
##AUDIT TRAIL= $$ (NUMBER, WHEN, WHO, WHERE, WHAT)
$$ ##TITLE= Audit trail, XWIN-NMR		Version 3.5
$$ ##JCAMPDX= 5.01
$$ ##ORIGIN= Bruker BioSpin GmbH
$$ ##OWNER= she
$$ F:/spectra/data/she/nmr/H-C/1/audita.txt
$$ ##AUDIT TRAIL=  $$ (NUMBER, WHEN, WHO, WHERE, WHAT)
(   1,<2025-01-30 16:52:13.93 +0400>,<she>,<DPX200>,
      <created by zg, POWCHK disabled, PULCHK disabled
       configuration hash MD5:
       00 E9 B6 7A A2 85 ED C7 34 08 36 98 17 FE 4E 26
       data hash MD5: 16K
       D0 DB 1F 8D 35 E3 E5 CF 17 4B 2F 94 1F F3 DF C4>)
$$ ##END=
$$ 
$$ hash MD5
$$ 38 72 DA 77 3B 11 96 83 60 C2 10 B4 78 30 F8 4E
##$RELAX= 
##$RELAX= 
##$RELAX= 
##$RELAX= 
##$RELAX= 
##$RELAX= 
$$ Bruker specific parameters
$$ --------------------------
##$DU= <F:/spectra>
##$EXPNO= 1
##$NAME= <H-C>
##$PROCNO= 1
##$TYPE= <nmr>
##$USER= <she>
##$AMP= (0..31)
100 100 100 100 100 100 100 100 100 100 100 100 100 100 100 100 100 100 
100 100 100 100 100 100 100 100 100 100 100 100 100 100 
##$AQSEQ= 0
##$AQ_mod= 1
##$AUNM= <au_zg>
##$AUTOPOS= <>
##$BF1= 200.13
##$BF2= 200.13
##$BF3= 200.13
##$BF4= 200.13
##$BF5= 200.13
##$BF6= 200.13
##$BF7= 200.13
##$BF8= 200.13
##$BYTORDA= 1
##$CFDGTYP= 0
##$CFRGTYP= 5
##$CHEMSTR= <none>
##$CNST= (0..31)
1 1 145 1 1 1 1 1 1 1 1 1 1 1 1 1 1 1 1 1 1 1 1 1 1 1 1 1 1 1 1 1 
##$CPDPRG= <>
##$CPDPRG1= <>
##$CPDPRG2= <>
##$CPDPRG3= <>
##$CPDPRG4= <mlev>
##$CPDPRG5= <mlev>
##$CPDPRG6= <mlev>
##$CPDPRG7= <mlev>
##$CPDPRG8= <mlev>
##$CPDPRGB= <>
##$CPDPRGT= <>
##$D= (0..31)
0 0.7 0 0 0 0 0 0 0 0 0 0.03 0 0 0 0 0 0 0 0 0 0 0 0 0 0 0 0 0 0 0 0 
##$DATE= 1738241533
##$DBL= (0..7)
120 120 120 120 120 120 120 120 
##$DBP= (0..7)
150 150 150 150 150 150 150 150 
##$DBP07= 0
##$DBPNAM0= <>
##$DBPNAM1= <>
##$DBPNAM2= <>
##$DBPNAM3= <>
##$DBPNAM4= <>
##$DBPNAM5= <>
##$DBPNAM6= <>
##$DBPNAM7= <>
##$DBPOAL= (0..7)
0.5 0.5 0.5 0.5 0.5 0.5 0.5 0.5 
##$DBPOFFS= (0..7)
0 0 0 0 0 0 0 0 
##$DE= 6
##$DECBNUC= <off>
##$DECIM= 32
##$DECNUC= <off>
##$DECSTAT= 4
##$DIGMOD= 1
##$DIGTYP= 9
##$DL= (0..7)
0 120 120 120 120 120 120 120 
##$DP= (0..7)
150 150 150 150 150 150 150 150 
##$DP07= 0
##$DPNAME0= <>
##$DPNAME1= <>
##$DPNAME2= <>
##$DPNAME3= <>
##$DPNAME4= <>
##$DPNAME5= <>
##$DPNAME6= <>
##$DPNAME7= <>
##$DPOAL= (0..7)
0.5 0.5 0.5 0.5 0.5 0.5 0.5 0.5 
##$DPOFFS= (0..7)
0 0 0 0 0 0 0 0 
##$DQDMODE= 0
##$DR= 18
##$DS= 0
##$DSLIST= <SSSSSSSSSSSSSSS>
##$DSPFIRM= 0
$$ [...]
##$SUBNAM0= <"">
##$SUBNAM1= <"">
##$SUBNAM2= <"">
##$SUBNAM3= <"">
##$SUBNAM4= <"">
##$SUBNAM5= <"">
##$SUBNAM6= <"">
##$SUBNAM7= <"">
##$SUBNAM8= <"">
##$SUBNAM9= <"">
##$SW= 18.0517328524113
##$SWIBOX= (0..15)
0 0 2 0 0 0 0 0 0 0 0 0 0 0 0 0 
##$SW_h= 3612.71676300578
##$TD= 16384
##$TD0= 1
##$TE= 0
##$TE2= 300
##$TE3= 300
##$TEG= 300
##$TL= (0..7)
0 120 120 120 120 120 120 120 
##$TP= (0..7)
150 150 150 150 150 150 150 150 
##$TP07= 0
##$TPNAME0= <>
##$TPNAME1= <>
##$TPNAME2= <>
##$TPNAME3= <>
##$TPNAME4= <>
##$TPNAME5= <>
##$TPNAME6= <>
##$TPNAME7= <>
##$TPOAL= (0..7)
0.5 0.5 0.5 0.5 0.5 0.5 0.5 0.5 
##$TPOFFS= (0..7)
0 0 0 0 0 0 0 0 
##$TUNHIN= 0
##$TUNHOUT= 0
##$TUNXOUT= 0
##$USERA1= <user>
##$USERA2= <user>
##$USERA3= <user>
##$USERA4= <user>
##$USERA5= <user>
##$V9= 5
##$VALIST= <valist>
##$VCLIST= <CCCCCCCCCCCCCCC>
##$VD= 0
##$VDLIST= <DDDDDDDDDDDDDDD>
##$VPLIST= <PPPPPPPPPPPPPPP>
##$VTLIST= <TTTTTTTTTTTTTTT>
##$WBST= 1024
##$WBSW= 4
##$XGAIN= (0..3)
0 0 0 0 
##$XL= 0
##$YL= 0
##$YMAX_a= 660206
##$YMIN_a= -668105
##$ZGOPTNS= <>
##$ZL1= 120
##$ZL2= 120
##$ZL3= 120
##$ZL4= 120
##$ABSF1= 10
##$ABSF2= 0
##$ABSG= 5
##$ABSL= 3
##$ALPHA= 0
##$AQORDER= 0
##$ASSFAC= 0
##$ASSFACI= 0
##$ASSFACX= 0
##$ASSWID= 0
##$AUNMP= <proc_1d>
##$AZFE= 0.1
##$AZFW= 0.1
##$BCFW= 1
##$BC_mod= 2
##$BYTORDP= 1
##$COROFFS= 0
##$CY= -3
##$DATMOD= 1
##$DC= 2
##$DFILT= <>
##$DTYPP= 0
##$F1P= 0
##$F2P= 0
##$FCOR= 0.5
##$FTSIZE= 0
##$FT_mod= 4
##$GAMMA= 1
##$GB= 0.15
##$INTBC= 1
##$INTSCL= 1
##$ISEN= 128
##$LB= 0.25
##$LEV0= 0
##$LPBIN= 0
##$MAXI= 10000
##$MC2= 0
##$MEAN= 0
##$ME_mod= 0
##$MI= 1.114404
##$NCOEF= 0
##$NC_proc= 0
##$NLEV= 6
##$NOISF1= 3.799351
##$NOISF2= 2.8
##$NSP= 1
##$NTH_PI= 0
##$NZP= 0
##$OFFSET= 14.38212
##$PC= 1
##$PHC0= 236.9813
##$PHC1= 28.19222
##$PH_mod= 1
##$PKNL= yes
##$PPARMOD= 0
##$PSCAL= 0
##$PSIGN= 0
##$REVERSE= no
##$SF= 200.129724274929
##$SI= 16384
##$SIGF1= 3
##$SIGF2= 2
##$SINO= 400
##$SIOLD= 16384
##$SREGLST= <1H.CDCl3>
##$SSB= 0
##$STSI= 0
##$STSR= 0
##$SW_p= 3205.1282051282
##$SYMM= 0
##$S_DEV= 0
##$TDeff= 0
##$TDoff= 0
##$TI= <>
##$TILT= no
##$TM1= 0
##$TM2= 0
##$TOPLEV= 0
##$USERP1= <user>
##$USERP2= <user>
##$USERP3= <user>
##$USERP4= <user>
##$USERP5= <user>
##$WDW= 1
##$XDIM= 8192
##$YMAX_p= 0
##$YMIN_p= 0
$$ End of Bruker specific parameters
$$ ---------------------------------
##NTUPLES= NMR FID
##VAR_NAME=  TIME,          FID/REAL,        FID/IMAG
##SYMBOL=    X,             R,               I
##VAR_TYPE=  INDEPENDENT,   DEPENDENT,       DEPENDENT
##VAR_FORM=  AFFN,          ASDF,            ASDF
##VAR_DIM=   8192,          8192,            8192
##UNITS=     SECONDS,       ARBITRARY UNITS, ARBITRARY UNITS
##FACTOR=    0.0002768,     1,               1
##FIRST=     0,             0,               0
##LAST=      2.2672688,     0,               0
##MIN=       0,             -668105,         0
##MAX=       2.2672688,     660206,          0
$$ Real data points
##PAGE= N=1
##DATA TABLE= (X++(R..R)), XYDATA
0@%%%%%%%%%%%%%qJ4j4J6j6K4l2L2m0M8n6O4p2Q8r7J11j29J45j68J89k14K42k72
36a45L07l41L82m27M74n29N83o47P18p90Q74r64J062j168J287j419J561j724J905
55I99k109K344k613K931l301L743m295M993n912P177r039J2071j7840L2746j49117
70a27222m34846j06037R0339K86859M10986L80489J52880p0398k79510m00044
80i6504l57041j72565L4541K66987M05211L45256J66572j2143k31713l94007l59157
91d04563j81858J1035K25593L76424L52649J92458p304k18970l53616l34783k02695
102e45630j2992K05694L41258L24644K07649L0266j87224l29157l21498k13033
112e00023m4107J67502L19241L27483K19076M3867j57143l01674l22343k26383
$$ plain form
0 0 0 0 0 0 0 0 0 0 0 0 0 0 0 -8 6 -8 8 -8 16 -16 16 -24 24 -32 32 -40 48 -49 62 -67 78 -90 99 -115 127 -145
36 -145 162 -179 203 -224 250 -279 304 -343 375 -415 459 -505 557 -611 676 -743 818 -906 999
55 999 -1110 1234 -1379 1552 -1749 1994 -2301 2692 -3220 3957 -5082 6989 -10851 21895 -127222
70 -127222 -562068 -668105 -577766 -290907 120079 500568 653448 583050 303540 -96504
80 -96504 -453545 -626110 -591569 -324582 80629 425885 592457 580314 348601 -45406 -404563
91 -404563 -586421 -575386 -349793 26631 379280 571738 564434 345464 -8152 -342935 -545630
102 -545630 -558622 -352928 -11670 312974 520623 550889 363665 34508 -286990 -500023
112 -500023 -544130 -376628 -57387 270096 489172 533039 375896 74222 -248121 -474504
122d74504m7063J49602K81195L08444K32755O3278j35846k71426k99845k30923
132d24333p6791J14516K61020L01017K29975Q1446r6408k45002l02114k37069
142c93743q3211Q9585K30892K92634K38035R0575p9516k17488k79758k36633j04409
153d53037O3428K09943K74823K32101J10335m6948j97072k71424k31033j15039
163d23923L3312J84336K67203K33871J18053k8388j72148k54205k31330j26781
173d00000J8095J62428K43469K26949J36274n494j56128k36751k20399j38802
183c70359p812J43160K32015K20355J40844J3689j31295k22835k20412j43822
193c46472j6988J20681K08423K16294J52458K6126j15370j99704k09518j55346
$$ plain form
122 -474504 -521567 -371965 -90770 217674 450429 513707 377861 106435 -193410 -424333
132 -424333 -501124 -386608 -125588 175429 405404 486850 390442 145440 -156674 -393743
142 -393743 -476954 -387369 -156477 136157 374192 464767 385251 167763 -111995 -348628 -453037
153 -453037 -389609 -179666 95157 327258 437593 390645 193573 -77851 -308884 -423923
163 -423923 -390611 -206275 60928 294799 412852 384464 212316 -41889 -273219 -400000
173 -400000 -381905 -219477 23992 250941 387215 381721 225593 -11158 -231557 -370359
183 -370359 -378171 -235011 -2996 217359 358203 371892 240597 17762 -202650 -346472
193 -346472 -363460 -242779 -34356 181938 334396 360522 245152 45448 -164070 -319416
203c19416l5474J06033J93642K05066J54606M2774r3671j87537k05391j53815
213b93183m4678Q3503J75922K03111J57772M7880p6724j64781j96835j61345n5241
224c24599P0333J58048J90575J59450O3381o0152j53056j88022j57419o6352M9322
235b58491J44554J86874J57179O8048m0998j34125j81955j59727p2306L6135J26083
246a28729J74222J59334P9002k9418j21434j68317j55690q3950K0600J15716J65842
257B7178J52613Q4731j1900j06758j63000j53086q6132P791R8212J55959J53595
268A59203R0669m484r3335j48003j50344r5164k671Q9466J44139J46036R6582
279B32094R413q2472j41664j44575r5597j4268P4229J35921J45262R7410J6319
$$ plain form
203 -319416 -354890 -248857 -55215 149851 304457 347231 253560 66023 -139368 -293183
213 -293183 -337861 -254358 -78436 124675 282447 330327 253603 88822 -108013 -269358 -324599
224 -324599 -254266 -96218 94357 253807 317188 257036 103980 -84042 -241461 -307813 -258491
235 -258491 -113937 72937 230116 298164 257166 123041 -58914 -218641 -290947 -254812 -128729
246 -128729 45493 204827 283829 254411 132977 -35340 -191030 -274980 -254380 -138664 27178
257 27178 179791 264522 252622 145864 -17136 -170222 -256354 -248563 -150351 5608 159203
268 159203 249872 245388 152053 4050 -146294 -241458 -244129 -154663 -10524 135512 232094
279 232094 241507 159035 17371 -127204 -222801 -237069 -162840 -26919 118343 215753 232072
290B32072o7647j28540j43058j00889k0603O3611J23277J38109J03158K6618n9246
301A66862j20233j34433j02364l2005N2206J16342J34057J01439L4439m5083j10193
312F1034j33067j03273l6399M1153J03654J29301J05307M0408l7953r9732j24339
323e3906j04854m5618L3129R6989J21920J02896M7909k6319r2056j21043j02748
334a43701m8960K1513Q5479J18651J04306N0753j8946q0380j13618j04719n4624
345a84246J5553P7392J09833J02977N7788j0456p4362j07951j01173n8815N166
356a68294O9186J06697J00970N9370j967o3909j03075j01548o1244L07O0086R8066
368e355J00573O4277L292n7654r5422r7909o6048q173N4366R3630R6628O5688
$$ plain form
290 232072 164425 35885 -107173 -208062 -228665 -165054 -41777 96332 199490 226108 166862
301 166862 46629 -87804 -190168 -222173 -169967 -53625 80432 181871 216310 171227 61034
312 61034 -72033 -175306 -211705 -170552 -66898 62403 167710 208118 170165 70433 -53906
323 -53906 -158760 -204378 -171249 -74260 47660 150556 198465 172146 80090 -40953 -143701
334 -143701 -192661 -171148 -85669 32982 137288 188041 169095 88715 -24903 -129622 -184246
345 -184246 -168693 -91301 18532 121509 179297 168841 94479 -13472 -114645 -173460 -168294
356 -168294 -99108 7589 108559 167929 165962 102053 -1022 -102570 -163814 -163507 -103421 -5355
368 -5355 95218 159495 162787 105133 9711 -88198 -154246 -162419 -108053 -14423 82205 147893
380A47893J2425m9159r0803r6596o7083j3565M3985Q6878R6133O9137J5694m1907
392A13032q2640r3613p1286j9539L9792Q0314R1298P1258K3196l5146p8588r0582
404e2504p0758k5297L0534P4550R0528P1893K5957k6837p0127q8963p3367k8638
416a43029K5300O6936Q5980P4113L1824k1952o5086q4377p2770l4623J7446O2428
428e7810Q3847P2691L4901j3601n8251q3134p3225l6021J1462N4765Q0213P3912
440H9749L8799r322n2940p7285p3061m1542N606N1226P5840P1529M2978j506m8153
453G1918p4884p1244m3798p08M4557P2642P1680M5002K305m1775o9369p1665m7191
466a12530m503L9959O6826O9826M9345Q116l8081o5110o8322n0401j0833L4570
$$ plain form
380 147893 160318 111159 20356 -76240 -143323 -156888 -112903 -26025 70108 139245 154939 113032
392 113032 30392 -63221 -134507 -154046 -114254 -33940 57358 128616 151812 116666 38078 -52504
404 -52504 -123262 -148559 -118025 -43475 47053 118946 144903 118066 47939 -41024 -114391 -143029
416 -143029 -117729 -50793 35187 109300 141124 119172 54086 -30291 -103061 -137684 -120238 -57810
428 -57810 26037 98728 133629 120028 61777 -21357 -94582 -130603 -119141 -64376 15837 89749
440 89749 128548 119226 66286 -10999 -84060 -125602 -119996 -68770 7070 78599 121577 120071 71918
453 71918 -2966 -74210 -118008 -118716 -74159 -1517 70163 115165 117470 75695 6326 -65339 -112530
466 -112530 -117033 -77074 -10248 59578 108923 117039 78958 13848 -54474 -104875 -115708 -81138
478h1138O3354O8780N0856J1611l1162o0637o8537n2230j2564K9382N6654O7581
490D1950N3784J4757k6708n4919o6076n4368j7651K4132N3079O5933N3820J9322
502A07055k0577n1062o5742n4395j9602J7612M7767O5275N5305K0679j5397m5286
514D1632o3342n5784k3015J2699M3583O2075N5272K5422r890m1858o1878n4388
526f9472k6065O385M0064O1220N3965K6694m364l6949o0089n4302k8461L258L5793
539e2323N7131N3295L1144o95l4559n5755n2446l2085k292L2694N4975N1882L2939
552H3905L966l0631n3323n1990l3890m692K8370N0563N1921L5353O709k7129m8222
565A0910n0477l7310q784K5230M6507N0299L7628J0356k2603m5565n0011l7864
$$ plain form
478 -81138 -17784 50996 101852 113463 82301 21664 -46873 -99103 -111667 -82285 -25631 41950
490 41950 95734 110491 83783 28864 -37212 -91580 -109231 -85099 -32020 33913 87733 107055
502 107055 86478 35416 -30326 -84721 -104323 -86711 -38944 26331 81636 102315 86918 41632
514 41632 -21710 -77494 -100509 -87810 -44227 17848 73120 98542 88652 46794 -15084 -69472
526 -69472 -95537 -89152 -49088 12132 66097 92791 88427 51478 -8611 -62913 -91374 -88116 -52323
539 -52323 4808 58103 89247 88552 53993 -1762 -54208 -86293 -88585 -55891 -916 50966 83905
552 83905 87871 57240 3917 -48073 -81963 -86655 -58285 -7722 44199 79552 86261 59132 10910
565 10910 -39567 -76877 -85661 -60431 -13924 36375 74003 84359 61756 16191 -33820 -71684
577g1684j1241K0329M3664M9663L8622J1820j8305m0681m9416l9651j3337J6965
589f3252L8611M8182M0109J5339j4603l7595m7709l9757j6394J1781L6481M7613
601A8806L9362J7192r967l3969m7581m0001j7273Q187L2123M5884L9810J9447
613G2020o829l0727m4333l9185k0829L918L0263M3525L8797K1649k118k8683m2931
626e463l9006k1942Q91K6481M1691L8666K3622ok4854m0272l7878k5179j568K4048
640d0769L8579L7543K5788L554k3236l7621l6663k6136n056K1318L6450L7290
652C1041K6244N362j8854l5116l6753k7410o380J8109L3195L6232K8094P412j7005
665D4171l1942l5297k8816q460J5383L1092L4894K8321R626j3129k9389l5609
$$ plain form
577 -71684 -82925 -62596 -18932 30731 69353 81173 62868 22187 -27229 -66880 -80217 -63252
589 -63252 -24641 23541 63650 78989 64386 26791 -20918 -60675 -77069 -65288 -28807 18806
601 18806 58168 75360 65393 31424 -16157 -56158 -73431 -65244 -33121 12763 52573 72020
613 72020 65191 34464 -9869 -49054 -69883 -65965 -35702 7823 46620 68269 66151 37468 -5463
626 -5463 -44469 -66411 -65520 -39039 2652 41318 64940 64934 40080 -192 -38070 -63249 -64817 -40769
640 -40769 -2190 35353 61141 64695 41459 3838 -32825 -58961 -64017 -42699 -6249 31041
652 31041 57285 62647 43793 8677 -28076 -55486 -61866 -43757 -10562 25670 53764 61176 44171
665 44171 12229 -23068 -51884 -60344 -44961 -13869 21025 49346 58972 45843 16454 -19155
677a9155k8430j0281J2047K7775L4733K9100J0972j0860k6522l3898k9018j2128
689e5665Q995K5890L3319K8944J3140p590k5123l2742k8873j3362O473K2839L2450
702H695K8979J4206n450k1143l1646k9378j5028M275K0906L0225K8774J6092k511
715D6996k0355k9741k8420j6537J334J9030K9343K8210J6604J07j7821k8409k8666
728b8325j6756n32J6277K7282K8106J7843J420j5774k6364k7254j9014j710J4466
741c0335K5786K7019J8855L143j3356k5149k6936j8774m166J2442K3922K7010
753A9461J9026M577j1282k2847k6503j9637n261J0591K2045K5762J9853O362r383
766C2764k1940k5243j9942o828Q401K0472K5047K0312P468p348j9879k4479k0716
$$ plain form
677 -19155 -47585 -57866 -45819 -18044 16689 45789 56761 45901 19379 -14519 -43537 -55665
689 -55665 -46670 -20780 12539 41483 54623 47033 21910 -10832 -39705 -53067 -46594 -23755 8695
702 8695 37674 51880 46430 25287 -6359 -35737 -50765 -46490 -25584 4641 33415 49507 46996
715 46996 26641 -3100 -31520 -48057 -46723 -27693 1650 29860 46464 46571 28750 341 -28325
728 -28325 -45081 -45613 -29336 -2054 26052 43895 45315 29541 3177 -24077 -43091 -44801 -30335
741 -30335 -4549 22470 41325 44468 31112 5963 -20973 -39747 -43913 -31471 -7549 19461
753 19461 38487 43064 31782 8935 -17568 -37205 -42466 -31875 -9830 15932 35785 42147 32764
766 32764 10824 -14419 -34361 -41189 -32788 -12316 12731 33043 40511 33163 13284 -11195 -31911
779c1911q090O958J8617K4158K0721Q784o144j8217k3294k0621r653M838J8085
792a5769K3147K0052J0034l993j6339k3267k0328j0196L584J5270K2354K0433
804B4982J0750k364j5138k1464k0549j1422J885J4554K1102K0096J2104j093j3841
817A9602k0430k0641j1851L22J2522K0252K0033J2587J63j1817j9535k0133j2770
830c1696m83J0766J9517J9197J3542J492j0715j8650j9163j3678k054R561J8065
843d299J9379J3310L203q672j7430j9263j4092l198Q217J6442J9274J4417L862
856C1150p897j5912j9008j4827m595P182J5960J8259J4642N257n973j5322j8606
869i690j4261n642N635J4372J7926J4669O068m740j3919j7814j5043o785M828
$$ plain form
779 -31911 -40001 -33043 -14426 9732 30453 39237 33093 14876 -8418 -29039 -38692 -33854 -15769
792 -15769 7378 27430 37464 33471 17132 -6135 -26463 -36659 -33075 -17805 4549 24982
804 24982 35732 33368 18230 -3234 -23783 -35205 -33320 -18766 2336 22432 34536 33443 19602
817 19602 -828 -21469 -33320 -32998 -20476 -224 19809 32396 32559 20742 1207 -18926 -31696
830 -31696 -32179 -21413 -1896 17301 30843 32335 21620 2970 -16193 -29871 -31925 -22364 -4299
843 -4299 15080 28390 31593 22921 5491 -13772 -27864 -31062 -22845 -6403 12871 27288 31150
856 31150 23253 7341 -11667 -26494 -31089 -23907 -7947 10312 24954 30211 24238 8916 -9690
869 -9690 -23951 -29593 -23958 -9586 8340 23009 29077 24337 10418 -7396 -22439 -29224 -24396
882b4396J3317J7349J4987O991l624j2668j7236j4706p508K673J1900J7145J5143
895A9367P896k543j1414j6777j4701q569K063J1156J5689J5212Q466j128j0629
908A4088j5469j5026q970L49R901J5572J4798R391L27r640j5188j4863r211l49
922b4290Q394J4359J5163R864R57q424j3695j4715j0529j516P650J3894J4340
935A1452J0492K294p316j3047j4482j0867k250O408J2688J4774J0717K368n881
948A7350j1897j4288j1327l067N341J1755J4052J1259L596m679j1294j3933j1163
961a8295m355M183J1127J3661J1486M150l399j0410j3852j1548m502L000J0171
974h583J3245J1320N531k534r436j3282j1420n755J920Q969J2989J1321O246j191
$$ plain form
882 -24396 -11079 6270 21257 28248 24624 11956 -5280 -19986 -27494 -24821 -12921 4224 19367
895 19367 27263 24720 13306 -3471 -18172 -26741 -24678 -13522 2167 17379 25845 24717 14088
908 14088 -1381 -16407 -25377 -25028 -15127 445 15243 24634 24961 15321 133 -14730 -23941 -24290
922 -24290 -15896 -1537 13626 23490 24447 16023 2328 -12387 -22916 -24432 -16782 -2888 11452
935 11452 21944 24238 16922 3875 -10607 -21474 -23724 -17316 -4628 10146 20863 23231 17350
948 17350 5453 -8835 -20162 -23229 -17888 -6133 7919 19178 22774 18095 6801 -7132 -18295
961 -18295 -22650 -18467 -7340 6321 17807 21957 18558 8148 -5704 -17252 -21754 -18754 -8583
974 -8583 4662 15982 21513 18979 9543 -3739 -15159 -20914 -18994 -10025 2964 14285 20531 19340
988A9340q954j2988j1206o394J001Q225J2696J1472O222k10q178j1726j1405p197
1002a9302Q4P481J1558J1204P594N36p119j1401j1053p830p83O361J1160J1259
1016I749Q032J077o140j0657j0930q127j456N453R887J1361Q308K068n367r778
1030C480j0742q862j966M344R623J0736Q522K816m187q866j1277q393k599L453
1044a3918Q515J0929Q660L069l369p966j0719q542l846K902P873J0484Q672M024
1058A6768k297p724j0263q956l810J831P088J0280Q648M362j425o892r761q990
1072a1141m665J261O540R559Q794M925p49o317r238q706n189Q4N932R522Q485
1087I097N289K68n779q826q394n706j68M876Q380Q807N895O76m955q252q241o088
$$ plain form
988 19340 10386 -2602 -13808 -20202 -19201 -10976 1720 13192 19414 19204 11026 -700 -12105 -19302
1002 -19302 -19218 -11737 -179 11025 18619 19155 12036 635 -10418 -18248 -19031 -12670 -1510 9749
1016 9749 17781 18858 12718 2061 -8869 -16996 -18452 -12999 -3112 8249 16557 18625 13258 3480
1030 3480 -7262 -16124 -18090 -13746 -4123 6613 15135 17951 13764 4898 -6379 -14772 -17371 -13918
1044 -13918 -5403 5526 14186 17255 13886 5920 -4799 -13341 -17187 -14285 -6412 4072 12744 16768
1058 16768 14471 6747 -3516 -12472 -16282 -14451 -7363 2917 11565 15927 14502 7610 -2151 -11141
1072 -11141 -15806 -14545 -8005 1554 10348 15273 14524 8207 -1031 -9737 -14926 -14842 -8910 612 9097
1087 9097 14386 14654 8875 49 -8345 -14051 -14219 -9343 -963 7844 13739 14415 9460 1208 -7033 -13121
1103a3121j285M802Q022Q207N960J536m298p902q217o219j467M053P149Q243O531
1118A1994J397l192o860q105o555j951K985O683Q034O603K211k558o708p945o421
1133a0388k793K794O075P979O108K830k158n908p452o619k784J561N432P576O608
1148H861L316j599n305p239o359l550J059N130P413O312L510n03n157o967o639
1163g717l422M12M648O644O592L703M6m372o696o512l711k37M087O572O128M364
1179A0529j4l817o103o358m228m61L641N957O425M148O25l393n706n933m495j114
1195a0297L136N552O092M787P62k898n105o280m506j367K552N430N831M751J380
1210I820k148m994n990m677j525J761M863N860M947J780k037m618n593m656j700
$$ plain form
1103 -13121 -14406 -9604 -1582 6625 12585 14121 9823 1921 -6296 -12515 -13982 -9929 -2780 5463 11994
1118 11994 13391 10199 3339 -4766 -11321 -13272 -10287 -3604 4430 11033 13244 10686 3978 -3967 -10388
1133 -10388 -13181 -10387 -4312 3667 9775 12605 10447 4539 -2913 -9532 -12316 -10755 -5323 2253 8861
1148 8861 12177 10578 5273 -1966 -8325 -11875 -10816 -5686 1727 8039 11549 11046 5889 -1078 -7717
1163 -7717 -11139 -10727 -6079 565 7157 10860 10906 6534 -162 -6674 -10385 -10622 -6535 37 6165 10529
1179 10529 10515 6698 595 -5763 -9991 -10452 -6811 -854 5571 9719 10344 6951 1245 -4688 -9183 -10297
1195 -10297 -7161 -1609 4483 9270 10032 7134 2029 -4251 -8757 -10124 -7572 -2142 3689 8440 9820
1210 9820 7672 2678 -3312 -7989 -9514 -7753 -2890 2970 7917 9697 7660 3042 -2551 -7207 -8907
1225h907R51M469N661M749K333j389m369n334m769j941Q97L859N275N077K307
1240H869j195l709n231m785k642R58L520M987M935K699n75l457m991m774k745
1255h136K80L428M845M901K330k06k913m277n059k689k47K769M639M800K855K17
1271G537k385m688m263l269m35K507M027M633L113P64k323m064m545l128q81K033
1287e367M220M628K938P50j973l614m377l426p05J507L613M288L811R41j717l925
1303A592m065l213j172J638K843M440L386J375j082l233m255l516j248Q10L240
1318b460M086L258J803j160k843m018l489j585O44K853M068L206K057o55k961
1333B804l839l178k028L47K744L857L325J902k33k780l294l449k250L78K143L842
$$ plain form
1225 -8907 -7956 -3487 2174 6923 9256 7867 3498 -1836 -6605 -8546 -7649 -3790 1485 6562 8869
1240 8869 7674 3965 -1266 -6051 -8693 -7735 -4215 772 5707 8406 7831 4374 -617 -5391 -8136
1255 -8136 -7856 -4428 417 5318 7648 7442 4529 252 -4807 -7496 -7743 -4974 -335 4465 7320 7537
1271 7537 5152 464 -3799 -7068 -7503 -4996 -969 3664 6777 7541 5218 1154 -3391 -6519 -7400 -5367
1287 -5367 -1147 3481 6419 7169 5196 1582 -2795 -6221 -6926 -5419 -1806 2482 6293 7234 5517 1592
1303 1592 -2473 -5686 -6858 -5220 -2377 2063 5449 6824 5742 2509 -1746 -5262 -6510 -5700 -2460
1318 -2460 1626 4884 6687 5527 2684 -1334 -4823 -6408 -5764 -2911 1157 4363 6420 5765 2804
1333 2804 -1035 -4213 -6241 -5894 -3150 707 4032 5934 5701 2921 -373 -3822 -6072 -5694 -3551 291
1349B91L084K298J06k070l710l552j927mJ902L244L546K128L83k180l142l373
1365b976k497k54J618L235L484K454N16j757l222l224k391m66J531L022L143K515
1381D731O58j513k620l342k417q98J238K833L343K448P95j257k521l116k635q61
1397e134P71K943K965K569J124q92k674k824k835r31R11K109K986K438J450n20
1413D456k384l031k672j379J019J771L046K760J236n05k105k820k898j012L41
1428d177J900K747K708J538k03k010k413k901j672K05J773K731K441J613kj305
1444B973k769k753j703o4J662K507K446J899J47j522k527k787j661j73R62K755
1460f08K731J883N41j693k299k302k330K5P81K493K642J918K25r83k056k507j822
$$ plain form
1349 291 3375 5673 5779 3709 -1 -3553 -5480 -5484 -3582 -338 3208 5336 5719 3539 397 -2976
1365 -2976 -5473 -5727 -4109 -874 2610 5064 5580 3823 601 -2623 -5014 -5480 -3949 -927 2216 4731
1381 4731 5389 3876 1256 -2086 -4503 -5401 -4163 -1330 2013 4461 5256 3999 1478 -1638 -4273 -5134
1397 -5134 -4363 -1420 1545 4114 5238 4346 1672 -1152 -3987 -4918 -4007 -1898 1088 3526 4976 4456
1413 4456 2072 -959 -3631 -5010 -3991 -2220 826 3586 4822 4317 2212 -608 -3506 -4518 -4177
1428 -4177 -2277 470 3178 4716 4513 2503 90 -2811 -4483 -4278 -2505 226 2667 4280 4278 2973
1444 2973 204 -2549 -4252 -4316 -2654 -147 2299 4198 4345 2823 296 -2491 -4152 -4325 -3363 -608
1460 -608 2123 4006 4547 2854 555 -1747 -4077 -4052 -3271 -778 1864 3782 4007 3024 968 -1539 -3361
1477c361o69P33K184K726J765J085j021k099k656k051q04R21J936K337K118Q83
1493D027p13k015k184j949j039M17J798K374K230J003m32j738k603j958p79j00
1509c661J884K247K002J124j41j680k290j731j181p3J565K045K311R17M3r77k474
1526g0j891j293j07J024K178K107J124J92r43k106k113j045n87J094K044K071
1542A679J388N06j050j809k049j590k41P19J749K111J688L55p93j694j974j761
1558b766n62R03J431J814J925M63l90k127j534j769n56O04J192K086J586P35k31
1575B804j466j907j887n61J04J642J669J698Q66n9j360j682k102n00N8J026J827
1592A70J871P49j34j168j870j585o26j94J151J417J638J523k71p22j700j781j113
$$ plain form
1477 -3361 -4030 -3297 -1113 1613 3378 4463 3442 1343 -1313 -3364 -4168 -3247 -1311 1026 3144 4027
1493 4027 3314 1299 -885 -2834 -3873 -3456 -1658 716 2946 3949 3517 1779 -824 -2782 -3561 -3661
1509 -3661 -1777 470 2472 3596 3455 1775 -515 -2246 -3427 -3500 -1935 110 2421 3338 3381 2404 -70
1526 -70 -1961 -3254 -3361 -2337 -159 1948 3072 3264 2321 215 -1898 -2943 -3530 -2436 -392 1679
1542 1679 3067 3573 2523 714 -1335 -2925 -3166 -2447 -698 1413 3101 3456 2663 969 -1005 -2766
1558 -2766 -3328 -2425 -994 820 2745 3208 2818 691 -843 -2612 -3168 -2564 -1372 714 2300 3035 2804
1575 2804 1338 -569 -2456 -3017 -2913 -1271 398 2096 2962 2903 1543 -139 -2241 -2741 -2683 -1657 170
1592 170 2041 2790 2656 1488 -382 -1967 -2593 -2787 -1636 -219 1419 2942 2671 1949 249 -1532 -2645
1609b645J63M86J606J957J370q8j316r12k044r55o07J388J251J498R75M20n61
1626A986j557j590j131l68O60J503J676R39O39p53j449j109j606l12O13J154J115
1643D10J424P46m59j443j381j057n55N4J040J814J196N81l44q86j588j457l85
1660b290K50J078J299J207P10k83q47j451j050r36J63Q34J292J439R25m13l08
1677A619j539j471n86k44J013J165J117Q73j19m56j196j576m34l45N13J532J458
1694A324M17N09j030j079j102q38k7K70J308J096R36J79o27r74j263p41m48O80
1712a410Q38J097Q93M84l40q35j500m75m17L8Q02J297P26M66k45r18p65r44o68
1731a876N43M91J045J192M56k62q70q43j217m36M23P03P44J035N29nr11r05q29
$$ plain form
1609 -2645 -2482 -1996 -390 1567 2937 2849 1533 621 -1423 -2378 -2985 -1597 -346 1152 2127 2547 1986
1626 1986 429 -1161 -2292 -2660 -2000 -497 1179 2118 2757 2004 555 -554 -2160 -2472 -1859 -705 410
1643 410 1834 2580 2121 678 -703 -1760 -2315 -2261 -1221 593 1789 2370 2026 1140 -448 -1905 -2290
1660 -2290 -2040 -962 337 1544 2254 1971 1124 -327 -1377 -2313 -2150 -1316 -24 1415 2340 1927 1619
1677 1619 80 -1391 -1977 -2221 -1208 -43 1074 1947 1828 1372 176 -1400 -1834 -2179 -1666 -134 1324
1694 1324 1741 2250 1220 141 -961 -1799 -1826 -1556 -248 848 1784 1963 1336 362 -901 -1642 -2090 -1410
1712 -1410 -572 525 1418 1902 1562 727 -773 -1248 -1665 -1627 -825 472 1198 1664 1419 501 -264 -1208 -1876
1731 -1876 -1333 -842 203 1395 1851 1589 719 -124 -1341 -1777 -1354 -651 93 1128 1657 1652 741 -164 -993
1750i93p09J35P42P61J335L19n8q06o79r40n52k35O29J232N57P53j56l54q25j025
1770h69q33L60L51P68J063Q39m38k92m66j265q04Q3N13P78R40N75J69n94n38p36
1790c96q21k86L80Q03J064O38L13m07j068o60o00l59J23P62R53O70N41j78r70
1809E02r60n48k20K39J00J363O23K75k90m24j113j66n44rN41R59P95K85l07j78
1829I23r82r16k25n7N74P14N92N69K12p68o10n30p33K16J70P46P02O56l59k80
1849F14o40p97q4m72N54O69O99J73L27k68n73n57m96k38N38L56P02L86N13o66
1869G40o07n77m79j94K91O07N64R89l23k21o50n77o67l7M19M65N15L78J84k90
1889E30j80p94l62k80J62P75P7J120K05q7q16m37n78l67K26J74Q93Q03l4J32q37
$$ plain form
1750 -993 -1702 -1567 -825 -64 1271 1590 1532 726 47 -893 -1445 -1680 -1051 181 738 1491 1335 981 156 -869
1770 -869 -1702 -1342 -991 -223 840 1679 1241 949 483 -782 -1586 -1503 -990 -212 728 1303 1472 878 340 -396
1790 -396 -1217 -1503 -1123 -320 744 1382 1695 1288 220 -440 -1040 -1399 -1276 -514 439 1109 1650 1472 502
1809 502 -458 -1006 -1226 -987 -887 476 1099 1374 1084 660 -453 -619 -1163 -1172 -631 328 1123 1408 1101 923
1829 923 -59 -975 -1200 -1257 -683 31 623 1192 1404 636 26 -504 -1237 -1021 -851 -105 597 1253 894 614
1849 614 -26 -823 -907 -1379 -825 -156 543 716 1043 775 202 -355 -851 -1089 -551 -195 507 893 1406 740
1869 740 133 -444 -923 -1117 -826 -219 345 1334 1011 790 140 -437 -1104 -1141 -722 -257 258 636 820 530
1889 530 350 -444 -806 -1086 -924 -149 -72 1048 1253 1166 350 -87 -665 -1032 -806 -632 261 1064 1030 1162 325
1910C25m79m58n87L68K77O97L14N33J51m67o75m10m91N8K79N75O67J35M9l2r79
1931a50k97j78n45N71O77L28K21K70l12n06p24p0j25Q0Q19K43L81N1k21o2o93
1952b42m02l59L91L67L60O57K23l65o66k89m26j52J65P90K92K40M15k10p25m92
1972d28Q0m15o3M50O65K61L12R1p86m23m93k1r2M15O78M38K28l47k34m43m16k46
1994g89r5P54K42J37P59k20k93m75o87k7l1K93N23L48K97N3m03l70j86n56k5J30
2016f21O77M38M71l09J54p46k33l35j27qO69K90K32J48j33l35n61l38k86J63L70
2037d20P32L45M4Q5p46k83m05k44OP83L66M03J32j76n28kp18N5q0L50M97N56r4
2060F58k08p1m94m1m74j68K68P58P3P91n41k16l58m35k08P4L62L36M25M3K96l51
$$ plain form
1910 325 -154 -612 -1199 -831 -554 143 457 990 1141 674 -1 -411 -902 -844 -565 10 677 812 861 829 -150
1931 -150 -447 -625 -1170 -599 78 406 627 897 585 79 -645 -715 -840 -760 59 302 683 734 513 451 -242
1952 -242 -644 -1003 -612 -245 115 772 995 630 -36 -325 -751 -903 -738 52 344 584 999 789 64 -428
1972 -428 -348 -763 -826 -376 289 550 862 953 167 -256 -749 -770 -862 -447 231 669 897 550 316 -127 -543 -789
1994 -789 -884 -130 112 249 1008 788 495 20 -667 -694 -725 -432 91 439 736 789 386 16 -170 -726 -751 -621
2016 -621 56 494 965 656 810 64 -169 -504 -631 -639 30 320 552 700 567 232 -329 -667 -953 -790 -420
2037 -420 312 657 701 786 40 -243 -648 -892 -886 -103 263 666 798 622 94 92 -626 -571 -651 -301 196 752 658
2060 658 450 379 -115 -156 -630 -798 -530 228 301 1092 551 335 -23 -458 -666 -592 -230 106 531 574 870 519
2082E19m17n36j91K4J6N08M32L80k84J33k51n28l18rO2M11N12j18L69n87Ml46
2104b15m33J25M6L38N47J53R0j60l40m48k20R5k20M00Q15j51M76l86k50m24l59
2125e21J11qr3M90O41j98K10m75k12m29J38j05J71N22j05L94L2l79j56l95k45
2146f12J4K32M41L88PJ49k23m15pl12m8L65J26M9O64l12l33m04k46j14J33K75
2168a83j8L72M08L09n48l99P6l01j66K78J22q0N84K30n76L57m73j69l4k64L59
2189a16L50K01k64K14n4l20l10j84J03L30L9M48n4L4l88j53j21l40L11L07K31
2210B64L50k43K70m66k58l06J11J4NK93K53OO0L2n33k9k87K70K5m1L48K35k17
2233A56Kj70l06j30L3K36K13K89J09j66K72n58J8k92L4l03L80J81M07r8J7k73
$$ plain form
2082 519 102 -434 -625 -601 -585 -77 355 735 451 584 333 -195 -513 -522 -460 -49 463 345 714 127 131 -215
2104 -215 -648 -523 -477 -139 408 561 651 491 151 -297 -517 -422 -642 -242 573 422 898 512 262 -162 -521
2125 -521 -410 -418 -511 -21 620 422 632 157 -55 -484 -346 -451 -280 242 137 531 563 184 28 -367 -612
2146 -612 -598 -366 75 463 470 619 396 -19 -26 -338 -386 -21 105 154 818 506 173 -231 -477 -591 -458 -183
2168 -183 -201 171 579 888 340 -59 17 -284 -450 -172 -50 -130 454 684 108 465 -8 -177 -211 -475 -116
2189 -116 234 435 171 385 331 11 -299 -483 -380 -50 -11 437 383 417 29 -124 -245 -585 -274 33 264
2210 264 614 371 641 175 -83 -389 -278 -264 -259 34 287 293 353 385 -148 -177 -464 -194 -169 -210 138 373 156
2233 156 158 -12 -318 -448 -415 -179 34 323 432 266 538 -20 -2 -294 -260 -563 -183 -2 405 307 324 51
2255E1j03l61J18J25j39M15J02j77J39l1l20M6m17L30J18L83N0K3k54K87l41j88
2277a44j76L82j32R2J44K70j72j83j03j68k15J28J58J59J59J40k9l34j56j0l07
2298d97J60K83M0Q6J65M3j91k29l5j80j12M08m6M57K32q8j80k93k35k60n8L88
2320a42rM50Mj76k7l33K25j0k47K70J48j27L00k09M71m78k51k22P5J0J92J95L3
2343A42q1J91q9n28Q4N6j28M67n8O5j47J41J57m56k22k39L16L37K55j77J56l3
2365B09J80n06k23n6K27J30L23j87m0L22k69j93J38k70j80Q6K86N11l69q0j44
2386a05M69j74j55l62l7O06j82k16K77P4l2l48J18j58J37K28J06j08n1p2R5q7
2408B3k63p5L74k03L48K7Mj99J22J20o45K38j42M48L06j16l72K13j36r2j81o6
$$ plain form
2255 51 -52 -413 -295 -170 -309 106 208 31 170 139 -181 -135 -552 -222 -104 279 329 352 98 385 44 -144
2277 -144 -320 62 -70 22 166 436 264 81 -22 -190 -405 -277 -119 40 199 339 310 -24 -180 -190 -497
2298 -497 -337 -54 -14 72 237 280 89 -140 -175 -355 -467 -59 -105 352 584 496 316 23 -212 -472 -530 -142
2320 -142 -151 299 303 127 100 -233 -8 -18 -265 5 153 26 326 117 588 110 -141 -363 -288 -278 -86 109 142
2343 142 61 252 163 -365 -281 -225 -353 114 56 121 -26 115 272 -184 -406 -645 -329 8 263 86 242 209
2365 209 389 -117 -340 -396 -169 -39 284 97 57 379 110 -83 55 -215 -395 -309 -23 488 119 39 -105
2386 -105 364 190 35 -327 -364 242 60 -156 121 195 163 -185 -67 -225 -88 140 246 138 87 15 110 23
2408 23 -240 -315 59 -144 204 231 235 36 158 278 -367 -129 -271 177 483 367 -5 208 72 -20 -201 -267
2430b67J30j28N02p7l1k3K38l46j46l01J13K77J54J48j99K3K40k31o6j37j81P9
2452b29J18K45J45M1k04r5j35J1j43J28J0K42L43l46r4O2k01j10K02m0k5J99J62
2475B86j62j19P5M1n00L5L36k8J65M2K2p3k23J53k90Q1J82J79l48J22M3J10r2
2498C7q3k26K06oJ0J56K4K4J09p3k00m04K73k14K39J11J06j07M09j44n15K55L4
2521B1J3k8K03l18K27K7k55K35j38M1k43L36r6K95O0k66p3k5j03j40L86r5P8j6
2545A26n7R1J67k56j73J13k51K47l1O4J95j81n3p5J01m8j09PK21K00k49L69m33
2568a5j0m5n3j44J51J89j14L33j38j77J06l23R0J2j35L01J06Q2k21K83j94p5k47
2591b38P0Q6k8L48m08L26J53n30J32j62P7r4k6M20J06k20K90o5n5J04n25L45k09
$$ plain form
2430 -267 -137 -265 237 160 129 106 344 -2 -148 -449 -336 -59 95 243 44 67 307 76 10 -127 -308 -229
2452 -229 -111 134 279 320 116 21 -114 -103 -246 -118 -108 134 477 131 37 99 -102 -212 -10 -50 -75 124 286
2475 286 124 5 80 121 -379 -344 -8 -36 129 171 193 120 -103 50 -240 -159 23 202 -146 -24 19 129 37
2498 37 -46 -272 -66 -72 -62 94 118 142 251 178 -22 -426 -153 -367 -128 -17 89 -18 391 247 -268 -13 21
2521 21 34 6 209 -109 118 145 -110 125 -13 28 -215 121 25 320 380 114 41 16 -87 -227 159 64 142 126
2545 126 69 160 327 71 -102 11 -240 7 -24 40 235 54 1 -74 27 -21 -130 -123 98 298 49 418 -15
2568 -15 -25 -70 -123 -267 -116 73 -41 292 154 -23 83 -240 -150 -138 -273 28 134 216 -5 278 84 9 -238
2591 -238 -168 -82 -110 238 -170 156 309 -221 -89 -251 -174 -268 -294 126 232 12 302 237 182 286 -239 106 -103
2614a03k5M89q8r2k09l0L4L2o6r4Q1J51K33j74n4j1n5j57j92L91r2o8J10O2Q0
2639A53m33M55m78K39o1o5K39j69J8J68J0q2m6m14N00j62r9N50r0k30j93K01J07
2662A18r2l91K05J16J51j78J21o6j65jM1J85j19J79M6p7j03L21j74k50j6K4K51
2685A26j10J76k24j5l6K09ll96K75o0n2P8K51l40N20m80J2K07j14j87K32l9j40
2708a10L91k64P7m12J41j03K37j8k36L31q5j0J14n0k36Q5j20k7K31P6j78K87m9
2731G2l67L25j80L01r2j61l6J94J91k0k22k77L18J9q5r8J57J11j41J62k0k91k4
2754a64O7K81l36K60K73n3m47K55j68Qj0L6j16l0R3J62j96P0M15n53O4J14Ln8
2778c0J3J47j95K43j88M2o46O77J12l77L96m04L51j51J82k80L41k54l0k56M57
$$ plain form
2614 -103 -128 361 273 181 -28 -58 -24 8 -58 -152 -71 80 313 139 85 74 19 -138 -330 61 -31 -99 11 73 153
2639 153 -280 175 -303 -64 -125 -190 49 -120 -102 66 76 -6 -52 -466 34 -128 -227 323 233 3 -190 11 118
2662 118 26 -365 -160 -44 107 -71 50 -16 -181 -182 -141 44 -75 104 150 73 -30 291 117 -133 -149 -125 126
2685 126 16 192 -32 -47 -83 126 123 -273 2 -58 -110 -32 219 -121 399 -81 -69 138 24 -163 69 30 -110
2708 -110 281 17 94 -318 -177 -280 -43 -61 -297 34 -51 -61 53 3 -233 -148 -268 -295 -64 12 -166 121 72
2731 72 -295 30 -150 151 59 -102 -138 56 247 227 5 -272 46 65 -20 -118 39 150 9 171 151 -140 -164
2754 -164 -97 184 -152 108 381 328 -119 136 -32 -24 -34 2 -114 -144 -51 111 -85 -15 400 -153 -89 25 28 -30
2778 -30 -17 130 -65 178 -10 32 -614 63 175 -202 194 -210 141 -10 172 -108 233 -21 -51 -307 150
2799A50l49J14m7L9j9O4N8L9j67J24lp2N0J48J3l42m3L07k42J58J27j68n3K5J45
2824E6j13j39K48J04j94Kj31k5%J42j90L23j14J97l03J65P6O3l40K37k03J19j50
2847a70L26j06L5k43J09R5j41o3J06J94o9j28J33J37k8j99j49J2o1J67j34M38
2869B61k28L04l05l1J28k33J4J72l22J18J96q4J14k46J27L3j69J89p9M5M8J04
2891A56m6M0j96L07k86J34j00J85k67K87J42m44O7O5l21L11J1j57k8J73JJ0K7
2914G1j30R6k14L66k12Q4J08k08Q5j45Q2mK37k95l5J53k4P6K4k07J01J28pm5l93
2939c08K82j43M07k15J80l27L19m72L79l75N0K93k40N66l02Q0o25L70P7q6k08
2960b98N24k45O0J29k01pJ6K7J94m70J77k9K34j72j96L05J1j56J93n4K63k58l11
$$ plain form
2799 150 -199 -85 -132 -93 -112 -48 10 49 -118 6 3 -69 -19 129 142 -200 -243 64 -178 -20 107 -61 -114 -89 56
2824 56 -57 -196 52 156 -38 -36 -167 -192 -192 -50 -240 83 -31 166 -137 28 104 167 -173 64 -139 -20 -170
2847 -170 156 50 85 -158 -49 46 -95 -158 -52 142 73 -55 78 215 187 -12 -161 -149 -210 -43 -177 261
2869 261 33 337 32 1 129 -104 -90 82 -240 -122 74 -10 104 -142 -15 18 -151 38 -41 4 52 156
2891 156 110 150 -46 261 -25 109 9 194 -73 214 356 -88 -21 44 -277 34 45 -112 -140 33 34 44 71
2914 71 -59 37 -177 189 -23 61 169 -39 46 -99 -17 -21 216 -79 -114 39 15 91 115 -92 9 137 130 85 -308
2939 -308 -26 -169 238 23 203 -124 195 -277 102 -273 -223 70 -170 396 94 174 -451 -81 -4 -90 -298
2960 -298 226 -19 41 170 -31 -38 -22 5 199 -271 -94 -123 111 -61 -257 48 59 -97 96 42 305 47 -264
2983b64J83J4R1K27m60R6j55L04j01r9L15n5J01l94J91k07L19j38N7N7J63j35
3005A10l5r3q5Q5j62K18j28kP3m0l3j55R1J43p2j3P3J80j31J17j38j38K08k5l8
3030A0q2J84k52R8m%L0P0j85M17n82K41K3R4J7k73r6L17p0oR2J84j58q8J26J3
3056A20k49L42j82J50Jk58p5J13O2J49l18o3L61j10j09K66o00M95j73l8j8P9R8
3079D3j54K41r6L4J09j21l34M39l46J00J20K08l68J40K1j07K04n9M0q2n9k0k6
3102g3Q7l4K08k24j21L12l20J01NK67k47L3k7J52k67p3J70j11j9Q6J63k28L17
3125A57K6k88kk6j5J55m17O88k54rJ89L4m14K95k22q8L72j53J95k46J3K7R2k09
3149a00J61o4N9j5O8k62R9j42R5j28K19o0j34kK56N6J4L6n6K45k17l66K26Q1j99
$$ plain form
2983 -264 -81 -67 24 251 -209 -113 -268 36 -65 -164 151 96 197 -197 -6 -213 106 -32 25 82 245 110
3005 110 75 -18 -103 -18 -180 38 -90 -92 -19 -59 -92 -247 -156 -13 -85 -98 -25 155 24 141 3 -135 73 48 10
3030 10 -72 112 -140 -42 -46 -46 -16 54 -131 286 -296 -55 -32 62 79 -194 -290 27 -43 -49 43 227 69 -19 107 120
3056 120 -129 213 31 181 182 -76 -151 -38 24 173 -145 -208 153 43 -66 200 -400 95 -78 -116 -134 -55 43
3079 43 -111 130 34 68 177 56 -278 161 -185 -85 35 243 -125 15 36 -71 133 74 114 32 -27 -47 -73
3102 -73 14 -20 188 -36 -157 155 -165 -64 -59 208 -39 -6 -33 119 -148 -221 -51 -162 -181 -95 68 -160 157
3125 157 183 -105 -107 -133 -148 7 -410 278 24 15 204 238 -176 119 -103 -191 181 28 223 -23 -10 17 109 -100
3149 -100 61 -3 56 41 109 -153 -54 -196 -101 -229 -10 -70 -204 -206 50 106 120 156 100 345 128 -238 -12 69 -130
3174a30L30k82p0k3q0L29J87j29P9n9r5j13L4J43n3j71j2J14J41o9N8l64L24j05
3198a6K5n0M0M2J2J32j86N3j5J8k22Q1r8J68K71k05J01m38K56O2l36K49K2Nq5
3223a14K7m8N26m42J97j01p2j10R3Q0m7P1%o3n2j9J2R1P8J25q3j72M01k83Mj05
3249fO6j48J35q9j6j05K62j76J2r0J50j43rJ58p7O2M6j05J7J17m2r4J15r7J56
3274I9oq2k3p2j3K32n4J21j44j79J29J74j8j53J8m7r0K53k77J83J97j64J55K3
3298B62j20k59K12j0j04J33k63O8P6k4J54j16Pj05K41k06O1N2j84k88K57J02L9
3321a5K03k74J39K10k26J51k73J11%K0J23j37k0p8NK51j46J15j54k42L79j31j00
3344h9J45N7O8l48L36j84k59k4N62n90L70m67N63P5j72m7p5j42q4K25K16q4k5
$$ plain form
3174 -130 200 -82 -152 -175 -255 74 261 132 211 152 57 -56 -22 121 68 -103 -115 -1 140 71 129 -235 89 -16
3198 -16 9 -41 -1 41 53 185 -1 52 37 55 -167 -86 -184 -16 255 50 151 -287 -31 31 -305 -56 -34 -29 -114
3223 -114 -87 -135 391 -51 146 45 -27 -137 -44 36 -11 60 60 -3 -55 -74 -62 29 107 232 149 -23 378 95 99 -6
3249 -6 60 -88 47 -42 -58 -163 99 -77 -65 -155 -5 -148 -157 1 -76 -14 32 -73 -56 61 19 -75 40 -57 99
3274 99 93 11 -12 -84 -97 135 81 202 58 -121 8 182 164 11 29 -18 -108 145 -132 51 248 84 239 262
3298 262 142 -117 95 85 -19 114 -149 -81 -5 -29 125 9 16 -89 152 -54 7 59 -125 -413 -156 -54 -15
3321 -15 188 -86 53 263 37 188 -85 26 26 46 169 32 12 -66 -61 190 44 159 5 -237 142 11 -89
3344 -89 56 113 181 -167 169 -15 -274 -298 264 -326 44 -423 140 215 43 -4 -79 -221 -305 -80 136 52 27
3367B7K34j82J74l15N5l05M15r2R4P0j31J46j26R8o5R0j02k27L1n5K26O9k03N1
3391b3p3K49k40J75j44q4N9L47l06J38l8k12K65j84J32k38J69P8o2J4J0k12J54
3414b6M1o8L65l03N5k67J63r8M48l36l52K18J45J59p5J7j04j57k17L90n9K3R9
3437F1k21K51N2j79L10m75J94J58k74j15J89J73J80m96J31J53J33j96k37L49N8
3458A99KK4L9m54k4j8L93l46J6J82p5j97J84J05j4o8J23r1K59k41j9J23j23O6
3482D5k21P5j32J13RJ70p3j3J18k67J71j2qK3k9p9Q9m5L68k39j02J51q2j52j22
3507b44M87k25k28L67l44K42k39R9k9j05J53K6M13l73M2K52j90j60j42JM08j74
3529C7L09m92J57r2p7M77m79L51j58j02o2p5J45R2l0K31j85MM8p9J79q1j21L29
$$ plain form
3367 27 261 79 253 -62 -7 -312 103 11 105 175 44 190 64 162 97 187 85 -142 -111 -166 60 129 -74 -23
3391 -23 -96 153 -87 88 -56 -140 -81 266 -40 98 60 -152 113 -71 61 -177 -8 70 8 22 32 -180 -26
3414 -26 15 -53 312 9 64 -203 -40 -138 310 -26 -378 -160 -15 144 69 86 -18 -175 -392 -2 -61 -38 61
3437 61 -160 91 143 -36 274 -201 -7 151 -123 -238 -49 124 304 -192 -61 92 225 29 -208 141 199
3458 199 201 225 264 -190 -214 -232 161 -185 -169 13 -62 -259 -75 30 16 -52 71 -20 239 -2 -21 102 -21 45
3482 45 -176 -101 -233 -120 -111 59 -14 -27 91 -176 -5 -17 -25 -2 -31 -110 -21 -66 302 63 -39 112 30 -122 -244
3507 -244 243 18 -210 157 -187 55 -184 -85 -114 -219 -66 -40 373 0 42 294 104 -56 -198 -197 211 37
3529 37 346 -146 11 -81 -158 319 -160 191 33 -69 -131 -206 -61 31 1 232 47 51 99 20 199 118 -3 326
3553C26k96r5O2N5OJ56j24j72O8J48k41R2k0J12K49l66n5J57N9l11K44o4j68J31
3577d7m3J17K16k63J90j37j3r6J24J6j61J47mk97N53k19N0j31N7k0n7M6jO3j13
3602b3QM4j49J11q0J35k25n5J17K39m44K81J69k51J3K69k84J40j7L9J52j90m5
3625d6J23l14K34Mk11k1K64o8J32q1j35J62j3J97k79L18l68j70M12mj01j28K40
3648A47J23j90l2J42m36j55K79M2K01p3J49k63j5o3L27k68K96r4o4L07j01j05
3670A54j64m2K4M8L57k17j64J0k74M59k33J75K1j98J5K20l05J78j9j80M02m27
3692a60K26Q9K56m32P3n3j66J69P7oK8P0k79J77j57k8N3K49j22m6J19l43K23K3
3716D0j09r0r0J84L53j86j83J00N6j11Q3p1j82K66J51j6j25l97K62j68J6K51J38
$$ plain form
3553 326 30 -65 -3 52 58 214 90 -82 -14 134 -107 -15 -35 77 326 -40 -95 62 121 -190 54 -10 -178 -47
3577 -47 -90 27 243 -20 170 33 20 -76 48 64 -97 50 46 -251 302 83 133 2 59 39 -18 28 27 90 -23
3602 -23 -15 29 -120 -9 -89 46 -179 -234 -117 122 -322 -41 128 -123 -110 159 -125 15 -2 37 189 -1 -46
3625 -46 77 -237 -3 1 -210 -231 33 -35 97 16 -119 43 30 227 -52 266 -102 -272 140 136 35 -93 147
3648 147 270 80 48 190 -246 -401 -122 -80 121 48 197 -66 -81 -144 183 -85 211 117 53 360 259 154
3670 154 -10 -52 -28 20 377 160 -4 6 -268 191 -42 133 154 -44 -29 191 -114 64 45 -135 267 -160
3692 -160 66 155 411 -21 52 -1 -167 2 79 73 101 171 -108 69 -88 -116 -63 186 64 18 137 -206 17 40
3716 40 -69 -159 -249 -65 288 102 -81 19 75 -36 47 -24 -206 60 211 195 70 -327 -65 -233 -217 34 172
3739A72j11p5q8R6K34n97J58J83K82l06Q8K5k39Q6k00N69l51K68m37J06J96J29
3761A88j82k28J22r3J59J55j57Qj8j79K86k31K06l9j21J37K0J23j90qj6k3L4L4
3785a3j52J2J67Q4Q8j06J27k07K28l19L31n57J73j2J61Q1q8r9K02j1k23L14q0
3808A01j75L32Q2l09l9J2L17k79j53J40J8j13m1J60k09K56l87lJ00j45M13P5j08
3831D5j5j71RN9K5L4k8K7j50j6N8J58Q1J7j40j74J82o2L37m22R0J95j74j83M71
3856B53j57O1P8j05k49r3K67J25r3J69k71k99L99k05K38L7l08P3j00J08J97k02
3878g7K54j62k17K23L3m4o9nLj59M45n1k23J05J9j77J9j90L49k23j5N8J06j14
3902a12k2j43M9P3K69k19J86J23m57K44N4j47K34k40LK37j56k76K89L17k29j85
$$ plain form
3739 172 61 -14 -102 -6 228 -369 -211 -28 254 -52 36 61 -178 -92 -292 277 -74 194 -243 -137 59 188
3761 188 6 -222 -100 -193 -34 121 -36 -28 -46 -225 61 -170 36 -3 -124 13 33 156 -34 -42 -58 -81 -47 -13
3785 -13 -165 -153 14 98 186 80 207 0 228 -91 240 -317 -144 -156 5 86 -2 -101 101 90 -133 181 101
3808 101 -74 258 340 31 -8 4 321 42 -111 29 47 -66 -107 53 -156 100 -287 -290 -190 -335 78 153 45
3831 45 30 -141 -132 -73 -48 -14 -42 -15 -165 -181 -123 35 116 133 -7 -181 1 -61 276 -146 -56 139 -35 -218 253
3856 253 96 157 235 130 -119 -212 55 180 87 256 -15 -314 85 -120 118 155 -153 -80 -180 -72 125 -77
3878 -77 177 15 -202 21 54 10 -59 -64 -61 -220 225 174 -49 56 75 -102 -83 -273 76 -147 -162 -104 2 -112
3902 -112 -134 -277 -228 -155 114 -105 81 204 -253 -9 45 -102 132 -108 -105 132 -24 -300 -11 306 77 -108
3924a08K53l87L11k33K41ol52M89o4n6k5l58R2K71l01L0K60j64K27Q1j74J25j13
3947C9Q9j5j05j10L68j79k74J45L59n1n41O87p96M10J05l24J91K3k94M24j33j36
3969a18p4J1L87j27m31P0M09k61R7k5M6J21K82l01J18l91J74r5k2j63J27J42j93
3992b17K04j64k6K99k99M68m96J33L06m90J76j9K09j68O0L0J5k72N6K70j31LL4
4015a9O2j77jK10J80m82k1K45m0R7j35K89l12j30J97j26L03j91J81o3k8J12j25
4038B6J22l18k65N29j26j8q3K41n3n7k53Q3L46m1Kk26N6J21J02j99j70R8K73J8
4062B08k25K15j35J33j8r1k04o3q4N88l41K15l58K73m2j43l7J78j3q1r1K75J8
4085A77j49n9n3L0J3lK30k2j11J49j28l96L01j30j99j9M32J0P6l70K22K22J22
$$ plain form
3924 -108 145 -242 69 -164 77 71 -281 208 144 88 63 -295 -203 68 -233 -203 57 -107 120 201 27 152 39
3947 39 128 113 8 -102 266 87 -187 -42 317 266 -275 412 -384 26 131 -193 -2 21 -273 151 18 -118
3969 -118 -192 -181 206 79 -352 -282 127 -134 -37 -62 -16 105 387 86 204 -187 -13 -108 -130 -293 -166 -24 -217
3992 -217 -13 -177 -203 96 -203 265 -231 -98 208 -282 -106 -125 84 -84 -24 6 21 -251 -195 75 -56 -53 -19
4015 -19 43 -134 -135 75 255 -227 -248 -3 -43 54 -81 208 -104 -234 -37 -163 140 -51 130 67 39 151 26
4038 26 148 -170 -435 94 -32 -50 -133 108 55 -2 -255 -172 174 133 135 -91 -35 86 188 -11 -181 -83 190 208
4062 208 -17 198 63 196 178 87 -117 -180 -264 324 -17 198 -160 113 71 -72 -109 69 56 -25 -116 159 177
4085 177 28 -31 -84 -54 -41 -44 186 164 53 202 74 -322 -21 -151 -350 -369 63 73 149 -221 1 223 345
4108C45j46j59J67l48MO7K30j53Q8k00J6k07K37j01L70m5l41L61M2k86J5J58j55
4131d1J40k86K54N1k26n2L64n1j03k91K02L4n7J05J0j0M5l6j95N7l24O03k66Q0
4155GNj4K3P6k68K20K38l20J82k58K73j28J10k21n2K5J8K23l00L4m7K03l0J21
4179A20j26J44l25l2J03J38K46r1l42j96L64K04m51J58J7N6Q4l4M1j75j40J00
4201a37K70k17j3L71q5l33n4K24M4k89R4L97L9l59J24k37k06O63l82K38q6J72
4223B38m44J86J5J19j42o4K52j9M6k16L6K05k58P4M0l66N76p8o3j76J12j82K3
4246h6L7J14p9J79m78K40J68q5j92K05MJ70l33L43l8j63j1J17j28J02p5j64J83
4269C0J32k90K54j03R2j26K89m07J57p8j43J50J46o7r0j42L84k22NJ12k6j09K1
$$ plain form
4108 345 199 40 207 -141 -137 -70 160 7 95 -105 -89 -296 -59 -160 210 165 -176 185 227 -59 -44 114 -41
4131 -41 99 -187 67 118 -108 -160 204 153 50 -241 -39 -5 -62 43 53 43 88 52 -143 -86 -410 193 -73 7
4155 7 12 -2 21 97 -171 49 287 -33 149 -109 164 36 146 -75 -127 -102 -84 139 -161 -127 -174 29 -1 120
4179 120 -6 138 -187 -219 -116 22 268 177 -165 -361 3 207 -244 -86 -69 -13 71 37 78 -97 -237 -137
4201 -137 133 -84 -97 274 189 -144 -198 26 70 -219 -125 272 311 -48 76 -161 -367 296 -86 152 66 238
4223 238 -206 -20 -5 114 -28 -92 160 141 187 -29 7 212 -46 28 68 -298 278 200 137 -39 73 -109 -86
4246 -86 -49 65 -14 165 -313 -73 95 10 -182 23 27 197 -136 207 169 6 -5 112 -16 86 11 -153 30
4269 30 162 -128 126 23 115 -11 278 -129 28 -50 -193 -43 103 36 -54 -196 188 -34 -29 83 57 -52 -31
4292c1K27l41lR8k8J34k05J63o1JL06k93J61j39P7l5j00J21J42k91j02J82K0M0
4316D3k06L82j98n5J95l90m7N79m57P4m7K56R3N2j58k13J11j47J80MO7l23k8L17
4340H4j59j91L09k4k45M77Rl86J95l22J52J40L07k95j08K43j55j04n5J74q6J78
4362A38k39K05m0j39J57j33r4N5L03j64j80l2L15k80K49j05j23J56j61J89J31
4383B08k92J32n6j58n6L2p6L34rM8k18J85j4j16Ln0O5K67j47l0N5k00K58l63J01
4408i7J94l02K56o4p2k58K37P0k0K5j54l9k59M98j17O6R0L0q4q7q1L21m25J69
4432a03N8J04J58k65K02K60k91m11J95QJ4J43J28k78K71k50J13j6J04J0j24O8
4454I8jr6k11K78jJ36q7p0j67K93k03J5j02M4L02k43o9O9r1K34J96n20L8K52n4
$$ plain form
4292 -31 196 -145 -148 -50 -78 56 -149 14 -47 -46 260 -33 128 -11 66 31 -69 52 194 -97 -199 -17 3 43
4316 43 -163 219 21 -34 161 -229 -276 303 -154 -80 -127 129 222 274 116 -97 14 -133 47 51 118 -205 -233 84
4340 84 -75 -266 43 19 -226 251 260 -126 69 -253 -101 39 346 51 -57 186 31 -73 -128 46 -40 138
4362 138 -101 104 64 -75 82 -51 -145 -90 213 49 -131 -163 152 -128 121 16 -107 49 -112 77 208
4383 208 -84 48 -8 -166 -222 -190 -266 68 59 107 -111 74 60 -56 -53 -103 -38 229 82 52 107 -93 165 -198 -97
4408 -97 97 -205 51 -13 -85 -343 -106 -36 -56 -31 -185 -224 -483 15 -102 -36 54 84 0 -87 -168 153 -272 -103
4432 -103 -45 59 217 -48 154 414 123 -288 -93 -85 -71 72 200 -78 193 -57 56 40 144 154 30 98
4454 98 97 1 -210 68 67 203 116 46 -121 172 -31 -16 -118 -74 228 -15 -84 -15 -106 128 324 -196 -158 94 40
4479D0j50J20jl82K86J54o0m2N6k5J86j65p4R3Mn3n8k5n5L30k01P5k48n1K87k5
4505A6P5p8j82k1M1k6L81m09J31K86k07J28N7n54M07j1j5R4j18LP4k59K15L5j60
4530i7J87P8PJ00j76j08l1r2QJ52r1p3L12o5k9p9j42K72j07M13m44o1J24q0R8
4555G6L4P6k79J26q1L3O5oj52M8o6L2J02J8Q7l66N70k42J49l04R4j57K25j05k0
4580d3%N27l69j50l4L8J39j44q8J76j95J61P8j98J37oq2K2M0K7m8J98L4r9o4m3
4606A4j99J59K5kp7L50k07j07P0j26L14j70q8l9O9J92k28J8k3j47K54J36j00m14
4630c26K84O1k90O4L98k79l9J61J3J6Q3J32k67q0K8J98j21j82K43l07M43k71J43
4653A05M0j21J20O3j64l1k2k30L61j80L7k77L39j90J01R1j52R9l88M54j33L8K62
$$ plain form
4479 40 -110 10 9 -373 -87 67 7 -35 21 -4 182 17 -57 36 40 -13 -71 -96 -151 179 -22 53 -195 -246 41 16
4505 16 91 13 -169 -190 -149 -175 206 -203 -72 214 7 135 192 -362 45 34 19 113 -5 -2 72 -187 28 63 -97
4530 -97 90 168 175 275 99 -9 -40 -132 -124 28 -63 -136 176 111 82 3 -139 133 26 439 -5 -66 58 -22 76
4555 76 110 186 -93 33 -48 -15 50 44 -108 -60 -126 -94 8 26 113 -253 317 75 224 -80 14 -143 82 -23 -43
4580 -43 -43 484 115 -35 -69 -31 108 -36 -124 52 -143 18 96 -102 35 29 -53 -31 9 36 -12 186 220 121 57 14
4606 14 -185 -26 -1 -3 -80 270 63 -44 26 -100 214 44 -44 -83 -14 178 -50 -32 -55 -202 52 188 88 -326
4630 -326 -42 19 -271 -207 191 -88 -127 34 47 63 146 278 11 -69 -41 157 36 -146 97 -210 233 -38 105
4653 105 145 24 144 207 43 12 -10 -240 121 -59 -22 -299 40 -150 -49 42 -110 -11 -399 55 -78 -40 222
4676B22k53J95P3k88j10J29KJ28j9L4J3k27J45J6J22k5j73Q0j59K27L70m91j16
4699a05n5L98j60m04J96p2N59o13N20j27q1k8R3j17R8j01J78l10RP1J42l8K3J
4723G7R6K33n15P0J42J4k6k23K9J84j62M6j29J11J70k72J15l6O9L52m05L48k94
4746fk78L29R7j65J51R7n39L52J60m25J2M31m48K7J24J27L6J07k45M5J11mq6l9
4770b9mJ00k2N5j12o1J96j02K1p7k2j42J48K55j28j52P4J15k88M93l55K11k55
4793h1Q4M0k80Q0M12k84j44J42O6k41L06m3j76J68k18J24k11L39L19n53o5J40
4815g6k41K82L9k00K82l16J50j32K79J97k97j55M68l65K84m16M0j0K48k01J00
4836d0J48m8n9N5r8j41J25Q8N3j56J17j24j0m5N02p4l34Q7k8J52j51L0k91J48
$$ plain form
4676 222 -31 164 237 -51 -161 -32 -30 98 79 113 126 -101 44 60 182 157 -16 64 -95 132 502 11 -105
4699 -105 -160 238 78 -326 -130 -202 357 -256 264 137 56 28 121 4 102 1 179 -131 -122 -51 91 53 76 77
4723 77 173 406 -109 -39 103 117 91 -132 -103 81 -81 -35 -164 -53 117 -155 -40 -76 -7 345 -60 288 -6
4746 -6 -284 45 142 -23 128 225 -314 38 198 -227 -215 216 -232 -205 -81 46 82 189 -56 -11 100 96 10 -29
4770 -29 -33 67 45 100 -12 -73 123 21 42 -35 -57 -199 -51 204 76 -76 -2 113 -175 318 -37 174 -81
4793 -81 3 43 -237 -157 255 -29 -173 -31 35 -206 100 57 -119 49 -169 -45 -256 83 402 -151 -216 -76
4815 -76 -317 -35 4 -196 86 -230 -80 -212 67 264 -33 -188 280 -85 199 -217 -177 -187 61 -140 -40
4836 -40 108 60 1 56 -42 -183 -58 30 83 -73 44 -80 -90 -135 367 293 -41 46 18 170 19 49 -242 -94
4860i4K16k99Q7L40k30O4j69Q4P2nj40K61P3k75J27N8m84J09K80k12lJ73k01k08
4884c76L27L0K22k53j40K02K5j74R8J87nm0j39o1J19j59J80J47j65j46K00J62
4906B41l56J29j40J14r0n0K91j6l9j14m7Q3K20l68K97j16j83L7J42Rm4N3K4p4
4930CK17k02o5K4j28L72j78j77J67l12J99L9J2j81J8M98j97ql62N19p2j63q7J37
4954G3l9K04k27k68L87R8k98Mj57K07o7Jn1K45k43L22r5l51J14J19p6nM5N7J38
4979A37m8M7o4O3Km4j27n2L28j91k68L62lm1j1j04j70K91j34K0o7J67l67J42J54
5004B2K28M7j55k35L55k18j7K2M0k66K93k18K52l97r0M91p9j59M7n7J17n6K1K2
5028A0r8R0m5J50j54J45j43J3k25J13L29j51j72j44L77l74J37K76k40M01o8k68
$$ plain form
4860 -94 122 -177 -90 250 20 84 -85 -1 71 66 -74 187 260 -15 112 170 -314 -205 75 -137 -140 33 -168 -376
4884 -376 -49 -19 203 -50 -190 12 37 -137 -39 148 143 103 -36 -97 22 -137 43 190 25 -121 79 241
4906 241 -115 14 -126 -12 -102 -152 139 123 84 -30 -77 6 226 -142 155 39 -144 -107 35 44 0 53 77 3
4930 3 220 18 -47 -23 -151 221 43 -134 33 -279 -80 -41 -29 -210 -192 306 109 101 -261 258 186 23 -64 73
4954 73 34 238 11 -257 130 228 -70 -66 -223 -16 -83 -82 -133 112 -131 191 96 -255 -141 -22 -98 -103 -58 -1 137
4979 137 89 136 72 135 137 93 -34 -86 242 51 -217 145 142 101 90 -14 -184 107 -27 -7 -74 93 -274 -132 22
5004 22 250 297 142 -93 262 44 27 49 89 -177 116 -102 150 -247 -337 154 75 -84 -37 -94 23 -33 -12 10
5028 10 -88 2 -43 107 -47 98 -45 -32 -257 -144 185 34 -138 -282 95 -279 -142 134 -106 295 227 -41
5050d1k2J64J35l53L07j95J53n9J65j94j23m9k7L9L9L5J08l33K81k1K7J71k93
5073h6P4pk5K36j10j93J89J38j36j12J09j43N1J60k86N4o1j4J40k10L38R5J23
5096C24l34k27M11l58K30N8k26J42J3r9K24J09k79j54J20j26K07k71J80l25J73
5117b08K95K59j29j97l8L18m47K79O5O0m36K55j52j4p0K39K2j12L9j10j0N2j53
5140a93j8J91j06K65J03j08l06K11r3L05k26j79Q7K61o40M61P8n4j45L62j13j42
5162AL51k74M6j29j28O5M1q7J21j90k8J47m3K36p7J04k25q0o9N12j16j59j48K40
5186A11Q5j39j07K9M08l52r1K32L9j65N0J38n8j05N9n6J5k33l5K95k47L36k23
5209a4J35K41k47NM3j56j18m2K04m7q8O7r6J78P3j19q5K13l6k90Q4LK5K22k57
$$ plain form
5050 -41 -63 101 236 -117 190 -5 148 89 254 60 -63 -112 -139 -100 -61 -26 82 -251 30 9 36 207 -86
5073 -86 -12 -19 -44 192 82 -111 78 216 80 -32 77 -66 -15 145 -141 -87 -148 -162 -22 -232 106 201 324
5096 324 -10 -237 174 -184 46 104 -122 20 33 -66 158 267 -12 -166 -46 -172 35 -236 -56 -381 -208
5117 -208 87 346 217 20 -18 300 -147 132 197 257 -179 76 -76 -90 -160 79 101 -11 28 -82 -92 -40 -193
5140 -193 -211 -20 -126 139 242 134 -172 39 -54 251 25 -154 -67 194 -446 15 93 39 -106 256 143 1
5162 1 352 78 124 -5 -133 -68 -27 -114 7 -183 -211 -64 -107 129 52 156 -69 -149 -218 294 178 19 -129 111
5186 111 196 57 -50 -21 387 35 -56 176 215 50 100 238 180 75 134 78 93 -140 -175 120 -127 209 -14
5209 -14 121 362 115 120 163 7 -111 -153 51 4 -84 -17 -113 65 138 19 -66 147 111 -179 -95 -92 -67 155 -102
5234a02j17J91J56K8j42n4KR3k21n9J55J32K69l96J8R3k5L7R9l7k91K68NL28k44
5259A86l11n4K21K25j95j36K27k40m0k36M87m6m00J72J35k60L97k31K26k41J6
5280i8m5L01k13k6o1K96j69J03O8j17p2j10j3J92K48j72J68m71K88l9l3j25r1
5303a91J87j81k8L34j60k07J88J29J12l87J72j43r0j1K18q7J34J31k63J22k61
5324b82K93K69k30L1j13j17K57j3q1j38K02j38p1R0J8r6K33r4j4p0K04J62l71
5347f9L47l93L44j55n3J58j95J17j82K32l0J6q5k98K74j11r3J44m6Pq8J57j50
5370a52l2J47q2M86l59P5j24OO9k21K18rl10J00Q4p5L53k6j12O2J69l90J68m10
5394c65L56p6N6N4j79L34q8p1n5M33m24K34l56J85K92k61k18L96m74L43J01j38
$$ plain form
5234 -102 -219 -28 128 156 14 -40 -38 55 -166 -225 -70 62 331 -65 -47 46 21 58 157 120 -171 97 102 430 186
5259 186 -125 -179 42 267 72 -64 163 -77 -117 -353 134 88 -312 -140 -5 -265 132 -99 127 -114 -98
5280 -98 -143 158 -55 -81 -142 154 -15 88 156 39 -33 -143 -156 36 284 112 280 -191 97 58 25 -100 -191
5303 -191 -4 -185 -213 121 -39 -246 -58 71 183 -204 -32 -175 -265 -276 -58 -145 -11 120 -143 -21 -282
5324 -282 11 280 50 81 -32 -149 108 95 14 -124 78 -60 -131 -41 -23 -119 114 20 6 -64 140 302 -69
5347 -69 278 -115 229 74 21 179 -16 101 -81 151 121 137 52 -246 28 -83 -176 -32 -78 -71 -159 -2 -152
5370 -152 -184 -37 -119 367 8 83 -41 -35 34 -187 31 22 -288 -188 -104 -179 174 148 36 98 267 -123 45 -365
5394 -365 -9 -85 -29 25 -154 180 92 21 -34 399 -25 209 -147 38 330 69 -149 247 -227 116 217 79
5416G9j09Q9oj14K43l17j28J82m1n8J07q6Q1M7r2K97j01l48L87m01K36j68m1J86
5440g6rp4j64Q6K63J50k33K0J89l83J62P4j18L51l36K21j16L51j77P1j52n8K24
5463B66n49M26K08l50q9K08J69j25r4l56K82k06K94j00p9j10L58J24j22k20j48
5484b13J30J97q1o4j05L67K1j48r8l0P8K30l50J90p5q8L37j20k60j05L3J6K42
5507A04j46Kj64J97j9q1K04jk62M25k67J1J97k36K45l74K47k61j4K65p3j5m0K37
5531A81q4r4J3J2L4N3J2j79J2J10j35j54K30k10M41l99J1L94k07M3j8j97J14l1
5555d8K01k40j20J76R5j42k79K86j05K14m9J10j33J10K68k95j35N0j85N52o2m36
5577a67K51k6J06j34n7p2K08j27j59l4K71l59K82k26J53k1L99m7o6k57J65n7k7
$$ plain form
5416 79 -30 59 53 -61 182 -135 -263 -81 -122 -180 -73 -159 -78 -31 -123 174 73 -275 112 -289 -53 -221 -262 -76
5440 -76 -85 -159 -323 -237 26 176 -57 -37 152 -231 -69 5 -113 238 -98 123 7 358 181 252 100 42 266
5463 266 -283 143 351 1 -88 120 289 164 70 -286 -4 -210 84 -16 -95 -205 153 277 155 -65 -213
5484 -213 -83 114 33 -31 -136 231 252 104 6 -24 54 284 -66 124 49 -39 298 178 -82 -187 -154 -138 104
5507 104 -42 -40 -204 -7 -26 -107 97 96 -166 259 -8 3 200 -36 209 -165 82 -179 -193 72 -1 -16 -56 181
5531 181 97 3 16 28 62 115 127 -52 -40 70 -65 -219 11 -199 242 -157 -146 248 41 84 66 -131 -17 -48
5555 -48 153 -87 -207 -31 64 -78 -357 -71 -176 38 -11 99 -34 76 344 49 -86 -36 -221 331 269 -167
5577 -167 84 58 164 30 -27 -99 109 -18 -177 -211 60 -299 -17 -243 -90 -111 288 241 175 -82 83 26 -1
5600aj73M02n6j64j65n1N40j35j13p8J38k99L75m38J48K5Q4L6l86L65q7R6J35
5623A98q8o7j01O3j03%K59j27rL7j88JK26j78N1p6Q2j45j65L42R8k59K85j39k6
5648b9k93L39j1j19K57k9j5K66n05Q0K52j03l35L04k54Q3J56pp4n6J83j09L53
5671C34k78L9j80j17O9j09K38p0J88j44Q3o0r1J45P6p5J29j08l41N80m66O7L5
5694e6j55nL96k23K23k08K57j65m3J81m33J96K06l84K74K0R7l26R3O1Kk9L6k22
5718b07J20J22j75M25o25N53k00K18k37K07j01k2%J34n07J39O4K38j39p7q7J34
5740b3r5J77J64k13r3k8K02K16l41j98K08R3Qk35J39R8K3j00or7J01k21K16j02
5764a07P9n6Q1J56k78j6J50J45k36J89j09J28L1k23q8J15K56j3l3m51N70n07Q5
$$ plain form
5600 -1 -174 228 172 8 -157 -208 332 197 84 6 144 -155 220 -218 -70 -45 39 75 -311 54 -33 63 198
5623 198 110 43 -58 5 -98 -98 161 34 25 62 -126 -125 101 -77 -26 -102 -20 -165 -330 12 110 -149 136 -3 -29
5648 -29 -322 17 6 -113 144 115 100 366 -139 -59 193 90 -245 59 -195 -112 44 37 -37 -93 90 -19 334
5671 334 56 95 -85 -202 -133 -242 -4 -74 114 -30 53 -7 -98 47 123 48 177 69 -272 308 -158 -91 -56
5694 -56 -211 -216 180 -43 180 -28 229 64 21 202 -231 -35 171 -213 61 81 178 -148 -55 6 8 -21 15 -207
5718 -207 -87 35 -140 285 -340 213 13 231 -6 201 100 78 78 212 -295 -156 -92 146 7 -70 -157 -23
5740 -23 -118 59 223 10 -83 -111 91 307 -34 -232 -24 69 77 -158 -19 79 102 2 -4 -101 0 -221 -5 -107
5764 -107 -28 -84 -3 153 -125 -141 9 154 -82 107 -2 126 157 -66 -154 -39 217 204 171 -280 290 -217 -132
5787a32L14j4k20J24j02L45n24L71k14j37N26l40L38m10Q6n5M20l55Q9r9p8J81
5809A14M0k41J8K4P3n6J78j60n4J53j26J5J34k02K88k8j54m1J15k42j28M38L1
5832A89j82k16M33k93J81j32J87k46J86l42J7L14k1n7J10k59J16nJ40j1j33J22
5854I8Q9r9k83J37J57p6j31J30J65j35j39J52j81o3K79k55OM0P5p7R8R2k62K59
5878G6k16o5K22k31N5M12l40P0K41j0r3q3M5k6PR8r8N1J9j07k57L71Mm16M13k64
5904a22J59L4p5l01M46m55N26m37J28J62o0O9l82M82k27J29l9M4j96L87m44j0
5926a82Q3M5J40q1j07P2K5q4P7M6N4k62J77K42m8l85nO8j39K02m1n1J69J77k56
5951f4j55J91j25J43M2m3k18N13n45L75m50K05o5K26o9j1n0J80k29K31l2m2J2
$$ plain form
5787 -132 182 168 -52 72 -30 315 -209 162 -52 -189 337 -3 335 -75 11 -44 376 21 110 11 -67 114
5809 114 154 -87 -69 -45 28 -28 150 -10 -64 89 -37 -22 112 -90 198 170 16 -25 90 -152 -280 158 189
5832 189 7 -209 224 -69 112 -20 167 -79 107 -235 -218 96 75 18 128 -131 -15 -20 120 109 -24 98
5854 98 187 88 -195 -58 99 23 -108 22 187 52 -87 65 -116 -179 100 -155 -149 -109 -34 -111 -13 79 -183 76
5878 76 -140 -205 17 -214 -159 253 -87 -17 224 214 121 38 83 57 64 162 64 115 134 27 -230 141 145 -271 142 -122
5904 -122 37 71 -4 -305 141 -314 212 -225 -97 65 5 74 -308 174 -53 76 37 81 -115 272 -172 -182
5926 -182 -99 -54 86 5 -102 -30 -5 -89 -12 34 88 -174 3 245 197 -188 -193 -125 -264 -62 -103 -154 15 192 -64
5951 -64 -219 -28 -153 -10 32 -11 -229 284 -261 114 -336 -131 -196 30 -39 -50 -100 80 -149 82 50 8 20
5974B0k53K36n6K9J30k24J08j30P8k1J27J13n69M09K6k28J85J4L9j5j12j8J49
5997C7J37j37j30l6M79n29J46J88k23K70k70P2j11J17p7J13Qn5j7k7O0M3k40K87
6021A05l0k71K86k40K28j62L33m09J6K53nR4m3l00r6L96k74L20j00j35Q0J69j62
6044E3k2L8j32J15j91J8L29k50OL7K5O6o8o5j65M2L23N0j86j6p9Q4k40K42J72
6069A86r9k02L9N5k05M24k10j65K19k05K4n7J14K27l37J6J77Q0j41k1j86K63K7
6092B3M0J24k82J80k53K46k67K49J9K7l22O2J83r1K00j90O1K4j90L14m9j49Q2
6115D1l85K37k4j11L96L6j25J98l76j83N70l99R7P5J13j31j44K25k1j46J04n3
6137fJ64l35K56M6j88n6j03L41p0L09k94O3j45j16J3M1j10K1J43J13j71r7L73
$$ plain form
5974 20 -233 3 -53 -24 106 -118 -10 -140 -62 -83 44 157 -412 -3 23 -205 -20 -6 33 18 -94 -112 37
5997 37 174 37 -93 -129 350 -179 -33 155 -68 202 -68 4 -107 10 -67 46 54 -1 -18 -45 15 58 -182 105
6021 105 75 -196 90 -150 78 -84 249 -160 -144 109 104 198 155 -145 -241 155 -119 201 101 -34 46 215 53
6044 53 31 69 -63 52 -139 -121 208 -42 -36 1 26 92 24 -41 -206 -164 159 209 23 7 -72 12 -228 14 186
6069 186 87 -115 -76 -21 -226 198 -12 -177 42 -163 -139 -196 -82 145 -192 -176 1 81 -60 -81 -267 -4 23
6092 23 63 187 -95 85 -168 78 -189 60 79 106 -216 -154 29 -62 138 -52 9 33 -157 157 108 -41 41
6115 41 -344 -107 -131 -242 154 190 65 263 -113 -296 274 -125 -28 47 160 29 -115 110 89 -57 47 -6
6137 -6 158 -177 79 125 -63 -119 -222 119 49 358 64 127 -18 -134 -121 -80 -190 -169 -26 87 -84 -181 192
6160A92n7l09Q8L47l43K37l30K32L01l51l2jk05J57J75j65Qn2J67R8K6k65pO7
6184b2l18J66L17l68J85J10l06J29J92n6k40j2P9K03j92O7o7Q9J02m6J16j03k64
6207b39N12k96m26M31Jk19j3m7M56k29J53J15r5p1R6r2k50J12l6L93k90L2Kk69
6231b69K51J53k24K8K14j37K3k38M20j92q1K07m76M85J20m36J26n9M6L35j58k71
6253a33J53j54J83K99j72l18p7M13L8k68r9J46J84j75P8j35O8kk57N8K64K0k03
6276h9M7k4j05K21k77J59j5K17m00L55k45Q2J82p1NJ95j72RJ39l02J29n0K57k99
6300e2l13P70j36m42J57R1k05L25k07p4m2L9J77n4M5q0K17k48j07K95n42O42q0
6323A76k52K79k04n5MM4j05K05k08j70L39j22j20K26l30K06J96k65K58J7k16L43
$$ plain form
6160 192 135 -174 -86 261 -82 155 -175 57 358 7 -25 -26 -231 -74 101 -64 -56 -108 59 157 183 -82 -89 -22
6184 -22 -340 -174 143 -225 -40 70 -236 -107 85 29 -211 -223 -144 59 -133 -66 -133 -44 58 12 128 25 -239
6207 -239 273 -23 -449 -18 -17 -236 -249 -296 160 -69 84 199 104 33 129 37 -213 -101 -137 256 -34 -2 0 -269
6231 -269 -18 135 -89 -61 153 16 39 -199 221 29 -52 155 -321 164 284 -152 -26 -85 -39 296 138 -133
6253 -133 20 -134 49 348 176 -142 -219 194 232 -36 -135 11 195 20 98 -37 31 29 -228 -170 94 114 -89
6276 -89 -42 -66 -171 50 -227 -68 -83 134 -266 89 -156 -74 108 37 42 237 65 74 213 -89 40 -10 247 -52
6300 -52 -365 405 269 -173 -16 75 -130 195 -12 -86 -128 -89 88 34 79 -1 216 -32 -139 156 -386 256 176
6323 176 -76 203 -1 -56 -52 -8 -113 92 -116 -286 53 -69 -189 37 -293 -87 109 -156 102 119 -97 246
6345B46o7m13O2L81j83M3q7o9J68Kp6j51K17k47K00Nj14O0l5J94l7n0J19o1j86
6370g9J38j14Q2Qk63M22l53K00j11R6L0J19qk86J27J1o9L65r7l20L8k65K02n2
6394a79K04k83L51R6k30r2J37J01O8j63J82k05J4K97k02P9j02q7J83j67k48M44
6416A98qj65R2j60q9K16o2J26j32M8p8k77K65J31K41m17P2J20j01L0J06k08M0
6439a2p7M9O9J37Q0k31o9K4J16J6k45o7K75k1M9k82Q8K07k79Q3j08J96K13j44
6463F7m03L52j4o9L99m62M3O7r0O5J15J44k71j04J87J53k57Q5j12K71K7O5j61
6486I7n5j56K37m2o5Mp8k8K79k43J34k31K78p1K13m23J15p1M5R8r9K30k16r7J30
6511a5N3j58j84M10R7k56k29K81J91j42k31J65n0P2l0j71K71J1N6k22r3L69p8
$$ plain form
6345 246 179 -234 -172 209 26 69 -18 -87 81 83 7 -144 73 -174 26 31 -83 -23 -58 136 99 49 168 107 -79
6370 -79 59 -55 27 35 -228 194 -159 41 -70 26 56 175 167 -119 8 19 -50 315 218 -102 -64 -329 -127 -179
6394 -179 25 -258 93 189 -41 -133 4 105 173 10 192 -13 1 298 96 175 73 -14 169 2 -246 198
6416 198 190 25 117 -43 -132 84 22 148 16 64 -14 -291 -26 105 346 -71 1 121 20 50 156 -52 -12
6439 -12 -89 -40 29 166 246 15 -54 -30 86 102 -143 -210 65 44 93 -189 -101 106 -173 -90 -198 -2 211 67
6463 67 -336 16 2 -67 332 -130 -87 -20 -110 -45 70 214 -57 -161 26 179 -78 7 -105 166 193 258 97
6486 97 42 -114 123 81 16 20 -58 -86 193 -50 84 -147 131 60 273 -150 -35 -106 -61 37 -62 168 -48 -145 -15
6511 -15 38 -120 -304 106 203 -53 -282 -1 190 48 -183 -18 -68 4 -26 -197 74 85 141 -81 -174 195 117
6534A17j78j40O2Q7j39M6K41j40l8J03J37j22L32l16l4K3P0o5p3q4k87L97L07
6557C06k64j95K85n6L11p10K33J53J89l95m6K25Q9L4k23n6K20j63j68M2j04K13
6579h0k46L84k43L67n65J10M29o5j13P5j93L14j71K0j42K39q8O4K6j39j42r9L43
6602H5J73l42K30p0m7k29L37l42M33j66m8K74l95K67m4k29j16R2j05K79J2M4j67
6625g4J25j37l6j81L32P1N8j52j33J00j46K98l69K55j31O1O4P2q5K58j23j70l07
6648c50J64M26l12j18J44M33m67O2J17j27o7K6J72j36M7j53O7j38K70j06Ok6j07
6671a73J90p7j69J82J21L0n12M61J56m55K13J9P6n9n1L41j71J9m9j09j76j06J17
6694a82R1J02q4n3O0j21K66k5j58K2K63j17j60J33mlO0k48j58J89J96L05k88P1
$$ plain form
6534 117 -61 -201 -139 -52 -191 -145 96 -44 -82 21 158 36 368 52 18 41 111 46 -27 -111 -398 -1 306
6557 306 42 -153 132 76 387 -323 -90 63 252 -143 -189 36 125 159 -64 -120 100 -63 -231 -189 -293 -80
6579 -80 -326 58 -185 182 -383 -273 156 91 -22 53 -140 174 3 23 -119 120 32 96 122 -17 -159 -258 85
6602 85 258 -84 146 76 29 -200 137 -205 228 62 14 288 -107 160 116 -113 -229 -137 -242 37 49 93 -74
6625 -74 51 -86 -122 -303 29 100 158 6 -127 -27 -173 125 -244 11 -120 -59 5 77 -8 250 127 -43 -350
6648 -350 -186 240 -72 -190 -46 387 -80 -18 99 -28 -95 -69 103 -33 14 -139 -72 -210 60 -46 -40 -66 -173
6671 -173 17 -60 -229 -47 74 104 -408 53 209 -246 -33 -14 62 3 -48 293 122 141 92 -17 -193 -299 -182
6694 -182 -91 11 -73 -126 -66 -187 79 54 -104 -82 181 64 -96 37 33 30 90 -158 -316 -127 69 374 86 157
6718A57j42P4M1p9m12M06o9j19J53J60N2O7J26n44J62J08k06J03r8P4k33J5L11
6741A07k2mj26k49J49L94l72J40jq3r5K92J07k10j61J65K45m80K40q9M0j60K59
6764H6o2J91k72J67O5M0j85j21J39k17K86k01K48j45n8O2K24l41J93mQ8k05j49
6787a71K93p1k6k39K66l5o2j25J58J25j7o1J46j59l4K90l48K75Ml07J36k99K54
6810gk2J91l05o5M18l85O8q1K27k97J01K04j66K40L9j15m7L0M5k2J37r4l02QK67
6835F7k5K52k59L2j63k67M08n5J19o4j63k5J76J9J3n1N6K41k01j12Kj20Q0J2J12
6860H4r4k23L0L01k57M08k98p8K3J03k09J73mJ12j58J77j66R2j8M0k11K94j10
6883A1J93k46K9j04k0K68j59j34K03k87J66K23Lj78J16J65j05l29M6k0L65k43
$$ plain form
6718 157 15 89 130 51 -361 45 -24 -143 10 170 222 289 415 -129 33 141 -65 38 -60 14 -219 -204 107
6741 107 85 81 -45 -294 -145 249 -123 17 16 -67 -162 130 237 27 -134 31 276 -204 36 -53 -13 -173 86
6764 86 24 215 -57 110 175 215 30 -91 48 -169 117 -84 164 19 -39 23 247 -94 99 95 183 -22 -171
6787 -171 122 51 25 -214 52 17 -45 -170 -12 113 96 35 181 22 -12 278 -70 205 209 -98 38 -261 -7
6810 -7 -29 162 -143 -208 210 -175 -107 -188 39 -258 -157 47 -119 121 160 45 -2 28 73 51 188 94 -208 -200 67
6835 67 42 294 35 67 -96 -363 45 -10 109 45 -118 -143 33 52 65 14 70 311 110 -2 0 -120 -40 -28 84
6860 84 -10 -233 -203 98 -159 249 -49 -127 -104 -1 -210 -37 -41 71 -87 90 -76 16 -2 38 -173 121 11
6883 11 204 -42 -13 -117 -137 131 -28 -162 41 -246 -80 143 146 -32 84 249 144 -185 -139 -159 206 -37
6905c7MO6Qk45J24J09l01K58n9J21j14J01r1K23k04J12j00k38J80Or9J97r6j32
6929b07J44K13L0l66L71j58L6j74M42k98j50o4J00K14j54L4j15M8r3K27j05Pj78
6952a96K11L5n0j07K25k15oN4k9O3n9K29m2N1k84Q1r8q6J80r2Q7O7K95l86K65
6977A93k02p1N3K53l73K59k06J99l0j35R3k28N6L1nj2R2K07k12J08L80n04K4J12
7001H2j63J70j03O6k2N0J08L2l07L96j28n54J46M55j83O6O4j51m1n5J17J81k49
7024b3J84j59K1n1j12K63k3K2l88K7K64o6M8rK7M2j62J23P3k97qK72n8K01Jl90
7050a78K63p2J25lj91J97k2m6J65k44L8p1l5j1N9L1k07M5O5l2N8L09j87m2J4J0
7076C8j3r0j06J09J54k43P5K7j9j00K22k05J1K53k80K01k16M89l61M22m06J5J64
$$ plain form
6905 -37 -33 33 41 -204 -80 29 -272 -14 -73 48 -66 35 -56 167 -37 75 -25 -263 -83 -77 -176 21 -75 -207
6929 -207 -63 150 180 -186 185 27 63 -111 331 33 -117 -181 -81 133 -21 13 -102 -54 -147 80 -25 -18 -196
6952 -196 15 50 0 -107 118 -97 -103 -49 -78 -15 -74 155 113 164 -120 -39 -137 -223 -43 -135 -48 19 314 -72 193
6977 193 -9 -80 -27 226 -147 112 -94 105 75 -60 33 -195 -139 -108 -113 -125 -33 174 -38 70 450 -54 -30 82
7001 82 -81 89 -14 52 30 80 188 220 -87 309 181 -373 -227 228 45 111 175 24 -17 -72 45 226 -23
7024 -23 161 2 23 -28 -140 123 100 122 -266 -239 25 -41 7 -2 25 67 -95 28 101 -196 -204 68 10 211 212 -178
7050 -178 85 13 138 135 -56 141 119 73 238 -6 32 -39 -74 -85 -26 5 -202 -157 -92 -124 -66 243 56 14 28 38
7076 38 25 -65 -171 -62 92 -151 -76 -49 -68 -168 54 -151 -140 113 -167 34 -182 307 -54 368 -38 -23 141
7099A41k31J18j67kN0K83j79j2M4J0ok09K16pr5K43l76M10k71j48K68k51K50k95
7123b16o7J84K31p9j74J4m6Q0nn7k35N57k64J44j25P9Q8K37k29k40L79k36j29
7146a09M00l19J89k72J00K3k23K80j17K01j97O1Jj84L40j76k06K45J12j08j42
7167a01L65l32K8k50L54k07M13l24m43L07J33j51Q9P7k02M47l14R4K8KO8KJ55
7190B38j12J9l04M26l53M49k6m25K31m30K34R9R1r9L0l42L53l1K1o3j06J82p3
7213IO9o2n0l0k24K61k16J02J83j60K66Jl7n8j16K78k02J76r0j3o7r5J31K11j61
7238A06l64K16P8n4N3j52K21k0l14M4J38K01k78j43rM92j85j44KJ10l6L52j96
7261A18J88l41J12o7L5j53mm6K47j75J62J93l12N0P5o9J80m90K48J56k5L09l93
$$ plain form
7099 141 -90 28 -139 -141 -91 192 13 1 45 55 49 -160 56 49 -46 197 -179 231 -40 -188 80 -171 79 -216
7123 -216 -283 -99 132 53 -121 -107 -153 -73 -78 -135 -370 187 -77 67 -58 21 109 346 117 -123 256 20 -109
7146 -109 291 -28 161 -111 -11 12 -211 69 -48 153 -44 17 18 -166 174 -2 -208 37 149 41 -101
7167 -101 264 -68 -40 -290 64 -143 270 -54 -497 -190 -57 -208 -119 -42 -244 203 -111 -17 11 13 81 83 238
7190 238 126 145 -159 267 -86 363 337 -88 143 -287 -53 46 137 38 68 -274 79 48 69 6 -100 82 9
7213 9 78 16 -34 -64 -288 -27 -243 -141 42 -118 148 149 112 54 -62 216 14 190 100 87 20 -75 56 267 106
7238 106 -258 -42 36 -18 35 -117 104 84 -230 -186 -48 153 -125 -268 -277 215 30 -114 -112 -2 -38 314 118
7261 118 306 -35 77 10 45 -108 -112 -158 89 -86 76 269 -43 7 82 13 193 -297 -49 107 82 391 -2
7284bN8j69P5J95m65K24m00O00kl33N78l89J45k31L4j63L59L6j50j99L52j62q4
7307i3q4J67n2O8K32k77j65M51q5k32j16n2K74m0M5j2J87k31J74l74P5J04Q2k64
7331b18N47l08N0J03K23m39L1J94j86K27j77m3N9r1m9J46M0r6K17k91J51j53p9
7354a42Q1k11L95j25P6m7j12r1K87N9j01j76J99j01k0P4j23K25j68M7j4n0M0l10
7378c08L38J48j86j78j62L20l55L93j04j2R0j99J46J13k16K79j66J15j82P4K46
7399A94l76J27j05K40k45K14j47j24J46j18J54k63M03j34j17R8J71j67j03M01
7419B49l16P5k2r4P8j00J42K0j26J38j56N2j56L97m11M40m8k45J07j0pJ07k91
7442a77L21j94j0J90l48J86p2K48k85L14l5o4l22M87j2m91N70l01j70J71j27J34
$$ plain form
7284 -2 56 -113 -38 157 -308 -84 -484 116 114 -219 359 -30 115 -116 -82 -245 114 150 0 -199 153 -9 -93
7307 -93 -177 -10 -62 6 238 -39 -204 247 162 -70 -186 -238 36 -4 41 29 216 -15 159 -215 -140 -36 46 -218
7331 -218 329 21 71 174 397 -42 -11 183 -3 224 47 4 63 -28 -77 69 109 13 230 -61 90 -63 -142
7354 -142 -61 -272 123 -2 74 27 -85 -176 111 170 69 -107 92 -9 -29 45 -78 147 -21 26 12 -38 2 -308
7378 -308 30 178 -8 -186 -348 -28 -383 10 -94 -106 -16 -215 -69 44 -172 107 -59 56 -126 -52 194
7399 194 -182 -55 -160 80 -165 49 -98 -222 -76 -194 -40 -303 100 -34 -151 -53 118 -49 -152 249
7419 249 -67 8 -14 -108 -30 -130 12 32 -94 44 -112 -60 -216 181 -230 210 162 -83 24 14 7 114 -177
7442 -177 144 -50 -60 130 -218 -32 -104 144 -141 173 138 74 -248 239 227 -264 306 5 -165 6 -121 13
7464A3J6j26n4L38j24J4L2k40L74r9q1l69N89k79J56l2j31J6m5P7l26K53k65P20
7488D27m81J59j6J26j9n03M08N8j22r9L43k01J1lL46n40J08m33L32Q5j80oM13
7511B13n2j82J89j23k83L32J06n4P2j15k38K12MP6P7j56j83O2k31j06K74O0N9
7534A3N6L4K2j55o0L23m42J85p5L44k30L0K3o0J80k84J64k32L12j93K50k31J71
7557A45j72Q5J66k98K56j77p2K9J64k44Q4m5J44M6j03K0Kj11L5J75j82L0k36L86
7581A27n9p0p8K47j38k95K36P5n8j60JM6K42k68J56P8J89k62k18J26j44L97j80
7604a0j56L69mJ41p1j8k70J12j94J09k94L86j01J09k55K10q4j80K29M7j92k8l07
7627d52MK68J45J97l46l1L07O7k90M50k60q4%r5RJJ99r8J8K60l09K6J76K7m86
$$ plain form
7464 13 29 -97 -151 187 63 77 109 -131 243 144 63 -306 283 4 160 128 -3 13 -32 45 -281 -28 -293 427
7488 427 -54 105 89 215 196 -307 101 159 37 -62 281 80 91 88 434 -106 2 -431 -99 -14 -194 -200 213
7511 213 161 -21 168 45 -238 94 200 146 218 103 -135 77 81 157 234 78 -105 -43 -274 -380 -106 -46 13
7534 13 69 103 125 -30 -90 233 -209 -24 -99 245 15 45 68 8 188 -96 68 -164 148 -45 205 -26 145
7557 145 -27 58 224 -74 182 5 -67 -38 126 -118 -34 -79 65 111 8 28 30 -81 -46 129 -53 -23 -259 127
7581 127 68 -2 -80 167 29 -266 -30 45 -13 -173 -172 -126 116 -152 4 82 271 9 -209 -83 -227 170 -10
7604 -10 -166 203 199 340 269 251 -19 93 -101 8 -286 100 -1 108 -147 63 -21 -201 28 75 -117 -145 -452
7627 -452 -448 -180 -35 162 -184 -215 92 159 -131 319 59 -25 -25 -120 -111 -110 89 -9 9 269 -40 -14 162 189 -297
7652b97M42j20P8k81J77j35j35M15j52J11q0O0o1j99k8J01M4lR0%J68J07n92N00
7676B10P7k07k09J67n9J6Q1k33J00J67j96J08k49K57k03K28%k26M57j00m16L42
7698A12r9J45j79J01j54J01O8k55L04j13j95J98M4k49Q8L50k24J05j34R3M1j53
7720eK74j16pm22L19J76l73K32k38k7J59JQ2k9L7l10K77k0J73rk29K63j41l68
7744c01K19Q5p7m6L12k54j24J52k3q7Q5j04J83j88M07k62K05j93R4j03o5l6P2
7767d9Q8l18M12k30n0J0L92l56L9j04J46j20J61M5o2j3N7j68N0No9j0J79j05R8
7792B8k94J04J69j19Q2j13K84p8j22N1j57J56J56kk35J40J7J6M8P9k20P0K55k53
7816F2q5J12k46J69J2j15J25R7j66K03O1m66J94O9m4J69k54Q5K4R4k11k73M19
$$ plain form
7652 -297 145 25 103 -178 -1 -136 -271 144 -8 103 23 83 22 -177 -205 -104 -60 -63 27 27 195 302 -290 210
7676 210 287 80 -129 38 -21 -5 76 -157 -57 110 -86 22 -227 30 -173 55 55 -171 286 186 -230 112
7698 112 13 158 -21 80 -74 27 95 -160 144 31 -164 34 78 -171 -83 267 43 148 14 107 148 -5
7720 -5 269 153 146 -276 43 219 -154 78 -160 -187 -28 -27 55 26 63 -247 30 10 183 174 -55 208 67 -301
7744 -301 -82 3 -74 -120 192 -62 -186 -34 -57 -144 -59 -163 20 -168 239 -23 182 -11 83 -20 -85 -121 -49
7767 -49 39 -279 133 -97 -147 -137 255 -101 -62 -166 -20 -140 21 66 4 -9 48 -120 -70 -65 -134 -144 35 -70 28
7792 28 -266 -162 7 -112 -30 -143 141 63 -59 -8 -165 -9 147 145 -90 50 67 83 131 210 -10 60 315 62
7816 62 -23 89 -157 12 24 -91 34 131 -35 168 229 -237 -43 26 -18 151 -103 -18 6 100 -111 -384 35
7839C5o8l43N44J4J9j52K27l55p6P5n7pN2j66M96k64p0q4L59k04L03k00N2k27
7863i7K13R3k70p5J73K18m54M61j85J69k48J09j53k4p2J12k38K37K24k43n8K02
7885I4q1j40M29j59o1k89M44l19J78j4k40J18k27K25N7J89j20J77k50j25N9N0
7907en0K19j60k54K04J27j37J43J91m86K95j58K5L8j43K36l20L82nl2j46L7J31
7930A32r2N9j43K19k71J3L51o9L3l84J11J76k24J78j14J80k77J5l9K34k8k59R2
7953a07K02l29K32k07K46K9mn9j79JJ81j75L06K08m10NN0J08j03j29p3M6K33k37
7977a65J04J24j32O2J2J26j75Q0Q7q3j98J32l6J56k5k88K56j03P4J10k51J68n1
8000a6l6jMK27j8j8O6J69l52L0r7J36k72L86k03J01J02k42n7K60j87k45l2K64
$$ plain form
7839 35 -33 -376 168 182 201 49 276 -79 -155 -80 -137 -144 -92 -258 238 -26 -96 -180 179 -25 278 78 130 -97
7863 -97 116 209 -61 -136 37 255 -199 262 77 246 -2 107 -46 -70 -142 -30 -268 -31 193 -50 -108 94
7885 94 13 -127 302 143 82 -207 237 -82 96 82 -158 -40 -267 -42 15 204 84 261 11 -114 -55 -5
7907 -5 -55 164 4 -250 -46 81 -56 87 278 -208 87 -71 -46 -8 -151 85 -235 147 142 110 -36 1 132
7930 132 40 99 -44 175 -96 -83 268 199 232 -152 -41 135 -89 89 -25 155 -122 -107 -146 88 60 -199 -107
7953 -107 95 -234 -2 -209 37 66 62 3 -176 -175 6 -169 137 345 -65 -60 -10 98 -5 -134 -207 -161 72 -165
7977 -165 -61 63 -69 -7 5 131 -44 36 123 40 -158 -26 -62 94 69 -219 37 -66 8 118 -133 35 -16
8000 -16 -52 -53 -49 178 160 142 208 377 25 55 -42 94 -178 208 5 106 208 -34 -91 169 -18 -263 -295 -31
8024c1j25P76n65J21J27l50p1J57k07K38l7P1J26m7k72q5J75J71k03J58l80K18
8046c5K21R9j45j68q4K01l48Q6L5J50K37l24K2M1J94k92K14j19L3k22L14k87J45
8069c2K17k36n9K30j42n5J49N7n0l2K20l37Q5p5j12j21L56L0Q0j96pk86K57J34
8093G5j20K99n56J16K58J83k6m11J41J86L9o9j85kN9n9j48J17J41j04L00j64k67
8116a97K84j68R5K06j36j47J68k07OJ90r1o8N6rJ47j71J90k15o2K81O0j54K55
8139C13k51Pm3M5J67j65j99J14j0j00K31l13M8mROpJ63K98k25J20l19J9j2j5q6
8165b09K05N7k0K2j23n4O9K46P7l74J03P6k47L39j3j50N8j25m1J96j58J05M2k41
8189a60J2J05
$$ plain form
8024 -31 -156 620 55 176 303 -47 -118 39 -168 70 33 104 230 183 -89 -174 1 172 -31 127 -253 -35
8046 -35 186 285 140 -28 -112 89 -259 -173 -138 12 249 -75 -53 -12 182 -110 104 -15 18 -204 110 -177 -32
8069 -32 185 -51 -110 120 -22 -77 72 129 79 47 267 -70 15 -60 -172 -293 63 93 173 -23 -30 -316 -59 75
8093 75 -45 254 -302 -186 72 255 229 -182 -41 145 184 115 -70 -72 -13 -72 -220 -103 38 -66 234 70 -197
8116 -197 87 -81 14 220 84 -63 105 -102 -96 94 3 -65 -9 -18 129 -42 148 -67 -129 152 212 58 313
8139 313 62 69 26 71 238 73 -126 -12 -22 -122 109 -204 -156 -160 -151 -145 -152 11 309 84 204 -115 -96 -108 -123 -209
8165 -209 -4 53 33 55 -68 -122 -53 193 270 -104 -1 75 -172 167 154 4 62 -63 -104 92 -66 39 81 -160
8189 -160 -148 -43
8191d3
$$ Imaginary data points
##PAGE= N=2
##DATA TABLE= (X++(I..I)), XYDATA
0@%%%%%%%%%qJ6j6J6k4M0m8N6p0Q4j02J20j44J68j96K36k72L20l76M30m94N64
31C00o44P34q34R44j061J195j340J498j674J861k071K302k550K823l119L446l801
48a991M188m617N084n601O174o811P522q319R226j0262J1460j2868J4542j6578
62h851J9118k2391K6796l3069M2804o0130J00439l75948k09903N13912L09290
73C02067L20966L7173j86013m00218l63324l01070n2949J74973L52893L71980
83B56478L15893O5170j78119l24195l52752l19610r8065J60453L21728L57272
93B04253L09620J04138j42596l09447l55575k97742j02306J20486K81623L50681
103A63135L00298J08218j05609k61008l40657l02025j20787R0706K45579L31473
$$ plain form
0 0 0 0 0 0 0 0 0 0 0 -8 8 -8 8 -16 24 -24 32 -38 46 -56 64 -80 88 -108 128 -144 176 -200 230 -264 300
31 300 -344 390 -444 500 -561 634 -706 792 -882 979 -1092 1210 -1340 1483 -1636 1810 -1991
48 -1991 2197 -2420 2664 -2937 3237 -3574 3948 -4371 4855 -5407 6053 -6815 7727 -8851
62 -8851 10267 -12124 14672 -18397 24407 -35723 64716 -311232 -521135 -7223 302067
73 302067 623033 660206 474193 73975 -289349 -590419 -643368 -468395 -115502 256478
83 256478 572371 637541 459422 135227 -217525 -537135 -635200 -474747 -153019 204253
93 204253 513873 618011 475415 165968 -189607 -487349 -589655 -469169 -187546 163135
103 163135 463433 571651 466042 205034 -135623 -437648 -558435 -467729 -222150 109323
113A09323L04772J37335p7449k43017l26711k94441j43079N9674K34022L21495
123H1924K84287J42272m1367k12450l12674k86846j47456L1642J95332K97552
133C2216K87673J61406k1193j88213k84218k80658j74445M646J82422K80506K73378
144B73520J74241P101j68820k70925k67945j74767j6760J50100K57270K69421
154B32436J82260K3153j39752k42566k65091j90154l2871J29581K31179K59261
164A87436J96602M4352j21438k25521k52253j93116n2227J05419K14768K49427
174A53449J93345N8159r0549k02201k48767j96984o1295Q0989J88152K41744K01679
185C17721P1265p3412j80988k34574k00228p9124O3398J75114K27671J93854Q4798
$$ plain form
113 109323 414095 551430 473981 230964 -95747 -390188 -533267 -473593 -239571 81924
123 81924 366211 508483 467116 254666 -58008 -344854 -492310 -460668 -265336 32216
133 32216 319889 481295 460102 271889 -12329 -292987 -467432 -462786 -280364 142 273520
144 273520 447761 454862 286042 15117 -252828 -427595 -444355 -294255 -36985 232436
154 232436 414696 437849 298097 55531 -209560 -399714 -432585 -303004 -71825 187436
164 187436 384038 428390 306952 81431 -170822 -363938 -416165 -310746 -95978 153449
174 153449 346794 404953 314404 112203 -136564 -333548 -394843 -313854 -125702 116042 317721
185 317721 388986 315574 134586 -99988 -300216 -379340 -315942 -140828 86843 280697 365495
196C65495m7565j64616k26687j94122q6293L8398J52626K20913J95562R1042l2282
207C12471j43306k11668j95165r8990K5693J38321K03955J89154J04327j5043
217C09749j31665j99047j85247j05848M789J21640J95007J84549J07463N80j10521
228A91449j86563j85260j12848m737J04465J76834J81501J18467J1997r9453j69943
239B5909j75467j21205k1391R1827J66257J72436J20478K7133q1173j59805j72468
250a27469j21834l0158P2885J50553J70875J25492L4045o7959j42160j65005j28948
261b29683m0568O3026J37613J60016J27351M6497n4596j33632j57939j25714m9564
272b57193M5803J26166J57697J27122N0385m0394j17428j53294j29229n5157L7506
$$ plain form
196 365495 317930 153314 -73373 -267495 -353788 -315390 -162764 58149 253711 344753 312471
207 312471 169165 -42503 -237668 -336658 -310965 -172644 31311 220465 324792 309749
217 309749 178084 -20963 -206210 -312058 -307269 -185629 9378 193927 301390 301970 191449
228 191449 4886 -180374 -293222 -297959 -193494 -16660 164841 283308 295305 195852 25909
239 25909 -149558 -270763 -292154 -200327 -34070 138366 258844 285977 204804 44999 -127469
250 -127469 -249303 -279461 -206576 -56023 114852 240344 274389 206430 64270 -100735 -229683
261 -229683 -270251 -207225 -69612 90404 217755 264252 209656 76024 -81915 -207629 -257193
272 -257193 -211390 -85224 72473 199595 249980 209586 92158 -61136 -190365 -245522 -208016
283b08016J11877J46698J28847O0668l1268j09056j42902j25635o3809K3521J02950
294a06125J41799J24544O5060j7588r5896j38007j26043o6787J4315Q8599J32565
305A6436J26412P0851j0366q4989j26975j24216p4700N119Q1238J24238J21326
316A24374P5259J506p5369j22224j20608p5644n013O8087J17589J21197P8011
327A87165O867o3505j11331j19403q0923j0954O0560J07557J15679Q2737J6254
338A90703n6586j05439j13914q1821k0681N0074J02284J13912Q2288K2691m5033
349A38478r6974j12915q4286k4509M1786R1934J09785Q6176K8498l9212q8965
360D9796j06290q6619l2243L4674Q6859J05209Q4874L4593k8943q2839j04145
$$ plain form
283 -208016 -96139 50559 179406 240074 208806 99750 -43152 -168787 -232596 -209075 -106125
294 -106125 35674 160218 225278 207690 111794 -26213 -152256 -219043 -204728 -116129 16436
305 16436 142848 213699 203333 118344 -8631 -132847 -207547 -202428 -121190 3048 124374
316 124374 199633 201139 125770 3546 -117062 -192706 -197719 -129632 -12043 109154 187165
327 187165 194032 130527 19196 -100207 -181130 -192084 -131524 -23967 91712 174449 190703
338 190703 134117 28678 -85236 -167057 -187738 -137664 -35380 78532 160820 183511 138478
349 138478 41504 -71411 -155697 -180206 -138420 -46486 63299 149475 177973 138761 49796
360 49796 -56494 -143113 -175356 -140682 -53823 51386 136260 170853 141910 59071 -45074
371d5074q5599l5680K5096P6966J02698Q7156L7535k2785p2806r8814q7874m1500
383a60681J9684P0594R6496Q6321M4236j4440o8160r5353q5279m5162R962O3518
395g8264R3991Q6088M5994p521n9215r0821q6462m8353N327N6211Q7366Q5569
407H9910N1295j650n4254q5455q3238n2748l330N1040Q3891Q2765N3327N807m6283
420I1077q1469q3248n4368p462M3040P7569Q2634N7080R430m1360p4013q1089
432f2179n8833j2888L9139P2586P9075N9577J5368l4712p0787p8883n9222j7443
444a29202L0711O7122P9233O0282J8646k7941o3698p7533o2573k0703K6231O1058
456c8367P5915O2589K3878k2934n9816p4383o1872k5977J8813N6992P4522O1868
$$ plain form
371 -45074 -130673 -166353 -141257 -64291 38407 125563 163098 140313 67507 -31307 -119181 -160681
383 -160681 -140997 -70403 26093 112414 156650 142210 74050 -21303 -106582 -151744 -141782 -78264
395 -78264 15727 101815 147809 140288 81073 -9748 -96210 -144563 -139236 -83025 4341 89910
407 89910 141205 139555 85301 -154 -83392 -136140 -139470 -88430 -4539 78226 131553 137360 91077
420 91077 9608 -73640 -128008 -135470 -92430 -14861 67773 124853 134283 92923 18910 -62179
432 -62179 -121012 -133900 -94761 -22175 56900 116477 131845 97133 26346 -52537 -111759 -129202
444 -129202 -98491 -31369 47864 108146 126792 98851 35153 -42380 -104953 -125656 -99425 -38367
456 -38367 37548 100137 124015 101081 41265 -33118 -94990 -120967 -102154 -45162 29360 91228
468I1228K6355j5094n3590p3510o2915k7792J2927N0658P1661O3567L0566j1267
480A02794m8906o9928o2288l3074P638M7254O8938O1371L4018m017m4281o8466
492h947o1224l4401J198M1958O5855O1437L6706L73l9858o3467o1443l8552k401
505a02766L8225O1355N9758M0767N627l6835n9947n8908m0910p550L3515N7824
517i845N8390M2382R229l0638n5468n8720m4487j0092K9006N2650N7689M6506
529H6602J1883k7568n0745n6688m6209j4007K4805M9022N6284M5850J5242k1478
541G2993m6725n6548m6576j6203J9371M3981N6192M7913J7327j7548m2641n4244
553b2708m8228j9563J5701M0989N3438M7598K0562j2414l9021n3430m6921k1290
$$ plain form
468 91228 117583 102489 48899 -24611 -87526 -115318 -102391 -51733 19928 83495 114061 102794
480 102794 53888 -16040 -78328 -111402 -103764 -56510 12428 73799 107817 103800 59519 -8947
492 -8947 -70171 -104572 -103374 -61416 4439 65876 102582 102955 63097 -370 -61813 -100365 -102766
505 -102766 -64541 -3186 56572 97339 102966 66131 6184 -52724 -93634 -101184 -67669 -9845
517 -9845 48545 90927 100156 69518 14050 -44670 -89157 -99249 -70243 -17593 40096 86602
529 86602 98485 70917 20172 -36516 -82725 -96732 -71927 -22905 33379 79229 94471 72993
541 72993 26268 -30280 -76856 -93059 -73688 -29707 26485 74398 91725 74177 31536 -22708
553 -22708 -70936 -90499 -74798 -33809 19629 67227 87789 75375 36354 -17076 -63997 -85287
565h5287R825L6491N2785M7254K2294p638l4458n1643m7751k4006O069L3572M9910
578G417M6765K5972m177l2127m8703m5700k6807J323L0431M7719M5534K7258J005
591G5910k8658m6242m5659k8771j900K6600M4814M5244L0495K959k5562m2527
603F703m4330l1636m776K4092M1436M3329L1849O730k2255m0120m3135l2435p512
616g2060J9902L8190M3712L3122Q488j8585l6003m3261l4138r556J7081L4746
628a8362M2059L4050J1116j5269l3415m1348l4272j1811J2701L2098M1670L3958
640E3175J2789j1057k9983m1228l5060j3319R541K8915M0129L4539J5060q490
652E5011k7756l8819l4083j6208O409K7032L8166L3581J6746m320k5623l7568
$$ plain form
565 -85287 -75462 -38971 13814 61068 83362 75724 41266 -10377 -58128 -82134 -76065 -42493 7417
578 7417 54182 80154 75977 43850 -4853 -50553 -77360 -76037 -45606 2113 47647 74905 75910
591 75910 47252 1010 -44649 -73420 -75320 -48720 -3906 41338 71833 74792 49230 6703
603 6703 -37627 -69263 -74039 -49947 -8511 34818 66667 73397 51142 11022 -32113 -64548 -72060
616 -72060 -52158 -13968 29744 62866 71354 52769 16766 -26495 -60633 -70189 -53108 -18362
628 -18362 23697 57747 68863 53594 20179 -21169 -55441 -67252 -54551 -22453 19217 53175
640 53175 65964 54907 24924 -16304 -51364 -64683 -55142 -26227 13902 48441 63501 55011
652 55011 27255 -11564 -45647 -61855 -55446 -28414 9752 43333 60079 55759 30136 -7432
664g432l4074j6885L118K3563L6848L3971J8086k176k2747l5083l3671j9107O18
677e4971K1762L4354L2448K0317J035k0610l3536l2289k0742k124J8550L2884
689b922L2687K0995L129j7813l1148l2236k2137l663J6450K9849L1581K2802M744
702E2318j5333k8789l1124k3094n945J4000K7855L1062K3147O744j2113k6910
714A1818l1011k3246p464J1384K5479L0414K3925P622j0198k4511k9382k4107
726c9277r358R490K3722K9168K3539J0340p990k2856k8913k3809j0467O678K1685
739a8048K8432K4215J0585n884k0218k7534k4329j1769N088J9939K6634K4028
751C1139J2344l853j9140k6333k3427j3163K712J7886K6304K3503J3274k101j6308
$$ plain form
664 -7432 -41506 -58391 -55273 -31710 5138 39109 57195 55019 32272 -2811 -36482 -55589 -54971
677 -54971 -33209 1145 33593 53910 54945 34335 799 -31490 -52232 -54356 -35806 -2922
689 -2922 29765 50760 53889 36076 4928 -27308 -49445 -53108 -36658 -6809 24772 47574 52318
702 52318 36985 8196 -22928 -46022 -51967 -37967 -10112 20950 44097 50841 38728 11818
714 11818 -19193 -42439 -49903 -38519 -13040 17374 41299 48921 38723 14212 -15170 -39277
726 -39277 -48635 -39145 -15423 13745 37284 47624 39634 16778 -12135 -35944 -46411 -39733 -18048
739 -18048 10384 34599 45184 39300 19082 -8452 -32781 -44550 -39462 -19523 7111 31139
751 31139 43483 39630 20490 -5843 -29270 -42433 -39721 -21835 4469 27972 41246 39145 22837
764B2837k5416k3863j3710J195J5903K3897K4164J4430n41j5152k3742k3296j5022
777c8316o98J4494K3200K3074J5043J582j3145k2473k3386j5244j931J2107K1324
790d369K3294J6235K132j1291k0616k2957j6016l717J0670K0725K2091J6405M140
803C6726r503j9872k2382j6512m514Q759J8728K2191J6581N253p983j8280k1652
816a2460j6917n537P165J7635K1197J7277O202o537j6907k1019j6853p509N721
829b8542J6650K0347J7380P408m869j5720k0228j7157p985M554J4498J9768J7859
842B3963Q005l582j4183j9131j7525r364L323J3608J8702J7524R538j969j3128
855A5781j8584j7400r667J468J2156J8268J7384R744j013j1406j7612j7385j0572
$$ plain form
764 22837 -2579 -26442 -40152 -38957 -23054 843 25007 39437 38896 23744 2 -23294 -38316
777 -38316 -39014 -24520 -1320 21754 36797 38379 25234 2761 -20625 -35869 -37800 -25693 -4369
790 -4369 18925 35160 37292 26001 5385 -17572 -33588 -37305 -26635 -5910 16181 32586 36726
803 36726 27223 7351 -15031 -31543 -36057 -27298 -8570 13621 30202 35455 27472 9192 -12460
816 -12460 -29377 -34914 -27749 -10114 11083 28360 34562 28025 11118 -9901 -26754 -34263 -28542
829 -28542 -11892 8455 25835 33243 28374 12654 -7574 -24731 -32716 -28162 -13664 6104 23963
842 23963 31968 28386 14203 -4928 -22453 -31817 -28494 -14886 3816 21340 30878 28909 15781
855 15781 -2803 -20203 -29870 -28402 -16246 2022 19406 29150 28137 16731 -881 -18266 -28838
868b8838N53J0956J7254J7280J0777K60j0230j6962j6786j1261j070R588J6481
881a998J6834J1573J440q902j6046j6960j1652j463P758J5382J6918J1991K611
894B7486p863j4725j6611j2292l372P224J4737J6269J2130L810o554j3705j6485
907i951j2515l900N618J3485J6281J2620M166n216j2329j6011j3160n044M669
920b1287J2777J5470J3050N244l763j1842j5780j2729n735L449J1026J5085J3348
933A8313N948k657j0591j5242j3140o698K339J0465J4561J3451O950j863j0210
946A1626j3927j3155p435J180R183J4116J2984P875r27q794j3340j3260p658l58
960b1890Q435J3583J2653Q632K68p631j3157j2798q747r30P712J2195J2469R196
$$ plain form
868 -28838 -28285 -17329 -75 17205 27982 28242 18012 1050 -15736 -26997 -28067 -18479 -1998
881 -1998 14836 26409 27849 18947 2901 -14059 -25711 -27174 -19416 -4034 12884 24875 27486
894 27486 19623 4898 -11713 -24005 -27377 -20153 -5416 10853 22983 26793 20239 6534 -9951
907 -9951 -22466 -26366 -20748 -7263 9018 21638 25804 20588 8259 -7752 -20912 -25956 -21287
920 -21287 -8510 6960 20010 25254 21491 9649 -6131 -18860 -24595 -21146 -10120 4965 18313
933 18313 24261 21604 11013 -4229 -17369 -24067 -21728 -11263 3298 16749 23699 21836 11626
946 11626 -2301 -15456 -22891 -21711 -12528 1588 14572 22447 21520 12726 -614 -13874 -21532 -21890
960 -21890 -13455 128 12781 21413 21681 14050 893 -11905 -20652 -21582 -13870 -1675 10794 19990
974A9990J424o935j2161j2760q794k154O561J1719J2508R864J738n990j0949j2736
988h675r817k429N646J0654J2410R914K649m928j0064j2246j0015l389M511R540
1002f239J2672R962L502l961r266j2277j0230l564L115Q930J2092J0432L988k795
1016A6361q425j1931r916m765K223Q583J1317R774N032j385q332j1249j0429m696
1030a7838J014P749J1298R916N508r32o943j0873j0146n904R5P214J0567R679
1044A0404O087K23o616r926j0066o378l27N965R990J0031O447O85n569r616r689
1059h355p046j265N572R237R554P209J599n444q619r375p303k076N177Q102R405
1074F372P570J785l825q095r869p369j841L356P602R554Q027J807k875p593r469
$$ plain form
974 19990 21414 14479 2318 -10442 -19236 -21390 -14829 -3110 9398 19262 21000 15010 4061 -8675
988 -8675 -18492 -20921 -15275 -4621 7789 17703 20352 15424 5360 -6886 -16901 -20290 -15779 -6239
1002 -6239 6433 16395 19897 15936 6670 -5607 -15837 -19401 -16286 -7356 4736 15168 19156 16361
1016 16361 7936 -3995 -13911 -18676 -16453 -7870 3447 13221 18253 16868 8536 -2713 -13142 -17838
1030 -17838 -16824 -9075 2223 12139 17647 16715 9772 -1101 -11247 -17151 -17056 -9842 725 10404
1044 10404 16491 16714 10098 172 -9894 -16272 -16599 -10634 -644 9387 15834 16519 10950 1334 -8355
1059 -8355 -15401 -16666 -11094 -1857 7697 14906 16505 11061 2442 -6933 -14236 -16312 -11135 -3033 6372
1074 6372 13942 15727 11902 3807 -6062 -13431 -15272 -11916 -4314 5240 13267 15074 12199 4606 -4863
1089d863p483k270K595P095R125P686K971k546o978q994p761k968J578O744R262
1104C193P388L461j520n779r073p467l761Q42O077R001O990M198q90n738q282
1119a360p272m340M66N195Q186P771L920nm877q061p629m422L1M534P957P099
1135G193M423Q39m328p535p346m771n42L882P444O970N373P40m237o601o964n432
1151a0892j013L480O266P807M911J231l186o349o983n398j655L281N958O872N281
1166I611J902k828n714o814n510k047K275N686O414O005J988j890n190o591n880
1181h583k211J719N001O403N633K796j604m952o398n760k410J112M601O547N380
1196G274K726r51m073o350n249l154O12L989O177N794K940q36l655n619n680l566
$$ plain form
1089 -4863 -12346 -14616 -12021 -4926 4199 11885 14856 12310 5332 -3662 -11423 -14391 -12813 -6069 3193
1104 3193 10581 14042 12522 6743 -2330 -9797 -13558 -12716 -6639 2362 9352 13550 12660 6922 -1360
1119 -1360 -8632 -12972 -12506 -7311 875 8646 12566 12561 7684 -377 -8006 -12428 -12397 -7863 94 7193
1135 7193 11616 12455 8127 592 -6754 -11525 -12067 -8185 -741 6229 11602 12342 8105 1504 -5460 -10892
1151 -10892 -11905 -8425 -2159 5648 10559 11790 8604 2255 -4728 -10126 -11781 -8500 -2542 4330 9611
1166 9611 11513 8685 2971 -3843 -9353 -11400 -9125 -3439 2975 8980 10968 9078 3888 -2703 -8583
1181 -8583 -10794 -9075 -4074 2329 7962 10758 9154 4202 -2196 -7956 -10366 -9254 -4653 1894 7274
1196 7274 10000 9049 4976 -1374 -6623 -9777 -9165 -5176 1001 6795 9735 8899 5244 -375 -6055 -9621
1212i621M99L828N596N334L471j69l467n228n592l199j79K755N703N201L696J82
1228H810l295m717n515l504o42K695M985N650L492O96k316n029n209l514j088
1243h501K180M719N406L755Q89j948m658n063l891j198J975M158N193L831J332
1258H179j831l989n130l783j382J391M047M860L975J635j486l847m771l942j689
1273g763J063L825M462M066J832j003l365m561l957k012O93L385M471L979K311
1288G426q68l038m390m044k279M64K929M396M020K140k31k845l861m084k578L43
1304f500K665L663M459K394j05k320m226l689k610r0K269M021L693K396K38j998
1320D260l557l971k965j50K095L753L661K569N99j943l506l551l083p62J881L494
$$ plain form
1212 -9621 -9122 -5294 302 5636 9107 8938 5471 243 -5349 -8548 -8727 -5972 -269 4932 8628 8810
1228 8810 5515 798 -4717 -8221 -8863 -6168 -1183 4467 7959 8655 6339 1310 -3899 -7413 -8501
1243 -8501 -6321 -1602 3804 7559 8448 6500 1842 -3221 -7112 -8310 -6335 -2177 3016 6847 8179
1258 8179 6348 2359 -2771 -6554 -7936 -6545 -2498 2362 6337 7972 6486 2639 -2132 -6074 -7763
1273 -7763 -6700 -2875 1587 5653 7485 6482 3117 -1444 -5401 -7413 -6720 -3335 1136 5115 7426
1288 7426 6558 3520 -870 -4914 -7193 -6729 -3800 596 4616 6756 6525 3680 -181 -4265 -6843 -6500
1304 -6500 -3835 -172 4287 6681 6576 4256 30 -3659 -6269 -6359 -4090 -69 3624 6020 6258 4260
1320 4260 703 -3268 -6233 -6383 -4288 -535 3126 5695 6294 4351 845 -2706 -5789 -6551 -4670 -1176
1336a176L765K966J059j779l688l430l279n40J428L189L784K752J083j503k980
1351A651l723l095p87J214L084L351K662J651r17l002l592k941j024P89K132L835
1367A288K969J288n66k757l370k991j332P56K140L585K869J693l29k573l151l163
1383c644j240KK143L514K691K048n09k415k526l144j869K50J698L110L263J554
1399D926n3j670k848l166k021p3J711K849L029K118P8j919k501k849k038m86J664
1416c249K674L102J980K75j430k568k757k549k85J354K500K607K457L54r60k499
1432A006k700k445p18J376K065L008K402O17j032k399k684k463p10J095J934L194
1448A546K104Q46o43k247k791k179j266Q10J987K687K232J392n82k181k407k567
$$ plain form
1336 -1176 2589 5555 6614 4835 1147 -2283 -5562 -6102 -4674 -1485 2299 5051 6134 4631 1651
1351 1651 -2072 -5167 -5954 -4740 -1656 1695 4357 6008 5091 2089 -1503 -4444 -5468 -4679 -2547 1288
1367 1288 4257 5545 4979 2222 -1148 -4139 -5471 -4715 -2575 1010 3879 5572 5243 2670 -481 -3644
1383 -3644 -4884 -4882 -2739 775 3466 5514 5005 2590 64 -3080 -4949 -4699 -3001 109 3372 4926
1399 4926 4873 3203 355 -2811 -4832 -4905 -3194 -345 2684 4802 4880 2961 460 -2389 -4427 -4913 -3249
1416 -3249 -575 2527 4507 4782 3352 784 -1973 -4522 -4807 -3453 -953 1654 4111 4465 3505 1006
1432 1006 -1694 -4139 -4857 -3481 -1416 1592 3994 4611 3579 1180 -1504 -3967 -4677 -3582 -1648 1546
1448 1546 3650 4496 3853 1606 -1185 -3364 -4630 -3820 -1833 854 3086 4478 3896 1715 -692 -3259
1464c259j098N72J660K732K401J191m24j369k824k266j614L97J724K202K465J440
1480C930M7j668k436k579j011M0J369K445K201J377K94j498k367k087j778J64
1496c557Q39K037K472J805M34j443k203j837k152k04J165J816K725J427M13q75
1512B862k019k164j898o05J043J889K230J833N25p35j812k329j978n45Q67J539
1528a297K179K125M45l20k061j952j742j150O86J475K554J472J117o56j362k266
1544g53j834n39k5J699K027J803R33l49j219k158j766j171L56J218K090J785Q83
1561B980K11j021k062j831j430K71Q13J892J950J026L35j290j446j948j165l5
1577b750N22J664K064J224N49j000k036j742j118m94N04J886K025J166M77o93
$$ plain form
1464 -3259 -4357 -3785 -2125 607 3008 4199 3775 2406 -418 -2684 -4298 -3901 -2177 25 2490 3930
1480 3930 3977 2309 -127 -2706 -3717 -3677 -2308 137 2338 3715 4009 2511 144 -1943 -3721 -3557
1496 -3557 -2718 -681 1791 3596 4030 2587 384 -1453 -3605 -3809 -2644 -828 1897 3324 3737 2862
1512 2862 843 -1321 -3219 -3824 -2781 -892 1338 3171 3696 2961 1149 -1180 -3158 -3703 -2836 -1297
1528 -1297 882 3007 3452 3132 1071 -881 -2623 -3773 -3087 -1612 942 2414 3531 2875 1513 -753
1544 -753 -2587 -3126 -3151 -1452 575 2378 3311 2962 1743 -415 -2181 -3352 -2996 -1778 312 2097 2980
1561 2980 3191 2170 108 -1723 -3153 -2882 -2069 -177 1773 2799 3134 1844 398 -1550 -2715 -2750
1577 -2750 -2228 -564 1500 2724 3273 2273 237 -1505 -2623 -3117 -2613 -727 1298 2464 2941 2248
1593B248j664j565j418q12R64J590J446J383O95n69j229k052j473j14K85J197
1609a088J643J555O70m82r66j925j374n32J38R46J748J904K11Q4j150j494j644
1626a756r32O09P38J691J385Q04n3j125j441j310r77q3J062J387J530J045N7q99
1644A732j756j332o90k31P36J480J270J249j65p43j361j415j129j57Q69J139J377
1661H73P59M13m75j233j183j248j42M86J180J785N44P29o86j389j375q99l40L61
1679a840J027J119J306N04k65j000j365j139m55M80Q51J362R93N69l08j018j224
1696d03j240l53J29Q33J309Q20R96k39r83j074j307n49J57J054J043J070N83J70
1714B016j039q99j185o16J61O49J078P69P84K96r19r88j078q94J00Q02P91J085
$$ plain form
1593 2248 584 -981 -2399 -3211 -2247 -657 789 2172 2867 2298 1069 -983 -2456 -2570 -2285 -1088
1609 -1088 555 2110 2780 2298 1332 -593 -1967 -2499 -2361 -1415 333 2237 2448 2532 1382 -112 -1756
1626 -1756 -2688 -2079 -1341 350 1735 2539 2486 1361 -80 -1390 -2367 -2450 -1388 -1 1529 2574 2631 1732
1644 1732 -24 -1356 -2046 -2277 -1541 -61 1209 2458 2293 1550 189 -1226 -2355 -2512 -1643 -504 873
1661 873 1632 2045 1570 337 -846 -2094 -2236 -1750 -570 1215 1759 2488 1802 413 -962 -1861 -2201 -1840
1679 -1840 -813 306 1612 2116 1851 851 -514 -1653 -2108 -1628 -777 585 1578 2147 1839 821 -403
1696 -403 -1643 -1996 -1867 -1034 275 1095 2091 1852 869 -205 -1512 -2061 -1904 -850 193 1263 1846 2016
1714 2016 977 78 -1107 -1723 -1562 -913 165 934 1718 2014 1095 107 -971 -1865 -1765 -963 -172 913
1732I13R75L8l83j441j030p34j32O31R72J085O97K19n98n73j364q48k04O60Q14
1751c03P81O82O38k76j419n60r90l66M81O55J351L79N53k64o99j061r15l65K76
1770a422Q41O86J290K66m22q23q43q45m95M79P90J006M68L92j7o03j088o70o47
1789a657K93O53R76O25N74Pp91o46q45l99P9M55O45J069J16J38m77p82q46o67
1809a480K80O29O80L12P35M26r70m91p93o66J26J64Q30Q66M87K01j97o87j050
1828e98n29r8M10N11R10K58M87l58p08j025o27P6M23O54P28P84l27k25l71p82
1848d07n55j85J51M94P78N29P51n02n05o08r19k57L53K60P56N88M09k60n74j54
1868A43q11l47J46L19O24O51M84m4l93p94p71l80N74N7O69P35M5Q4n93n34n24
$$ plain form
1732 913 1888 1926 1543 102 -928 -1662 -1794 -1163 -191 894 1591 1810 1212 639 -725 -1573 -1777 -1117 -303
1751 -303 478 1160 1798 1522 103 -457 -1447 -1813 -1332 -677 674 1053 1606 1342 643 -418 -1333 -1698 -1422
1770 -1422 -581 105 1395 1661 1239 416 -427 -1272 -1767 -1288 -498 508 976 1368 1351 748 -340 -1010 -1657
1789 -1657 -1364 -711 265 890 1464 1471 680 34 -811 -1210 -1131 -676 -31 1038 1154 1292 815 33 -813 -1480
1809 -1480 -1200 -571 109 421 1156 1582 612 121 -672 -1338 -1212 -1048 -218 648 1135 1336 1139 452 -598
1828 -598 -1127 -1225 -815 -304 606 864 1351 993 285 -740 -1367 -1291 -868 -214 514 1298 971 746 375 -407
1848 -407 -962 -1147 -996 -502 276 805 1556 1054 549 -59 -978 -1235 -882 -622 134 722 1131 871 297 143
1868 143 -668 -1015 -869 -550 74 725 1209 1165 772 -22 -793 -1173 -599 -542 127 862 907 991 398 -136 -660
1889f60m05mM37Q40O32K92m9m36m03r95n55K67L6J044N12J96N52p16m79p76k08
1910h78p6J7P30O88J96J23J36o82p33m32k52M05N29N50K93O86n83l47o70m51j88
1931i39M31K98O10L49J18P6n78o40m43j91N7M56O21M17K49l28k30n94m95j56P4
1952h38L28K68R49L78k71k63n66o54l73J07L40L73Q68J08J50m05l35j006J58k67
1972i51K97O82N00L59O4n36m86k71o88L3K36Q06L79L58N2k74l53l30m38k48J86
1993f23L82P82M1M35k46p47m33j51l88J49M27M78O46o0k43j08o90l92J47j12L19
2014c87N61N79n9P6n77j91n24j81L8L75P63K04N0q5m52m17k51k83R6L80M99M72
2036F86M62j62m92n66m83j98K45J65N16L95N8o1j13n87k60k24j76K49N49L89J33
$$ plain form
1889 -660 -1065 -1069 -632 208 840 1132 1083 647 244 -751 -1306 -1039 -1003 41 553 749 1301 585 106 -670 -878
1910 -878 -954 -937 -207 481 677 800 936 254 -479 -911 -1163 -758 -229 321 614 1300 717 370 -300 -751 -939
1931 -939 -508 -210 400 749 867 943 365 -275 -718 -909 -852 -396 225 642 891 563 333 -261 -756 -912 -838
1952 -838 -510 -242 707 1085 814 551 -15 -669 -1042 -935 -595 -222 646 754 904 499 164 -842 -684 -951
1972 -951 -654 28 528 887 951 415 -71 -342 -1030 -997 -761 45 424 782 834 560 207 -123 -561 -809 -623
1993 -623 -241 541 582 1017 771 24 -409 -560 -948 -799 -372 106 752 692 449 341 -349 -741 -594 -706 -387
2014 -387 174 753 694 770 193 2 -522 -703 -665 -290 473 677 727 642 190 -227 -478 -761 -665 -285 214 686
2036 686 1148 986 494 -72 -555 -753 -508 -343 173 568 626 565 452 -135 -395 -619 -795 -546 3 392 525
2057E25L5k13l94m41j90L5J13L40O80J5J35q7l02m69l83r6O8K99M46M08L43l39
2079E28k53n55m44o9J25N64J34L06J56J38m84n37j18rk82O35M83J7j69K86l47
2100A05m11L2m48J12K37O30L91J9l62O1o39j10l39L53K34R0K67M88j28j50k85
2121A47m46l37M3K68L73K27J09J28o2l78m31j81k17K78N22J62M36j37q6k11m01
2142a94l08l5K39J87J9O15J07j16m62j06k51j21j35M75K55M28k2j72l32j18l12
2163c59O5l54O26K84J34L40j53k88n72k41J98j26J21M57j00N98j94k30n09j04
2183d07j9j74J67M25L22K28j77k55m76J96k87J13O4oL61J90J69l91k60n8k22j51
2205f48M62Q6N37L61l55O9n71p2m8j92K35j71L18N06k85J45m02k05j80k06N30
$$ plain form
2057 525 560 347 -47 -488 -678 -643 -530 -190 490 505 640 553 251 -218 -601 -697 -629 -330 116 524 867 528
2079 528 275 -280 -724 -793 -668 -104 30 336 492 630 146 -391 -509 -518 -800 -165 318 335 166 452 105
2100 105 -306 -274 -722 -610 -373 257 648 667 305 366 -273 -383 -722 -369 -135 -45 222 710 582 432 147
2121 147 -299 -636 -593 -325 48 275 384 512 450 72 -359 -540 -757 -479 43 205 641 504 418 207 -194
2142 -194 -502 -537 -298 -111 -92 523 630 514 52 -54 -305 -426 -561 -86 169 597 575 403 71 -47 -359
2163 -359 -294 -648 -22 262 396 736 583 295 -277 -518 -320 -446 -325 132 32 630 436 206 -303 -407
2183 -407 -426 -600 -433 -8 314 542 365 110 -366 -170 -457 -344 -280 -286 75 265 434 43 -217 -275 -497 -648
2205 -648 -186 -100 437 798 443 512 -59 -131 -179 -371 -136 -307 11 517 232 377 -25 -230 -410 -616 -86
2226h6j7J98N16m17J17m40j59P1j47R9J62R5M21J32j47k37l23M9l07K72j34L16
2248C4L78N1j12J45o28J25p6q1o3K95K59n9k6L3l15l03M9p9M01j8L34K01k25j76
2272A44m49N0L9m5P5J03N87l88K79j18j95m79K36k4J84j70M95j7k23J64j6k89
2294e7m64K09J87L46l20K82R4K74k69o07J7J31m1J18O1K01J45j54j44j70J5l15
2316d61J09L03R0J25M0Q7l89L0j62j15LQ5J22K76M17k92j24k23k15K67m94N46
2338B5M0J21J45k50k1J52k07k00l4q9L24K01QK2K38o21J22m5j62J22j25J45M92
$$ plain form
2226 -86 -103 95 611 194 311 -129 -288 -217 -364 -265 -103 -8 413 545 398 161 -162 -113 -420 -148 -282 34
2248 34 412 463 351 496 -132 -7 -83 -164 -227 68 327 268 242 275 -40 -343 -294 -373 28 10 344 545 320 144
2272 144 -305 -255 -216 -261 -186 -83 504 116 395 277 82 -397 -161 -185 -1 -171 324 307 84 248 232 -57
2294 -57 -521 -312 -125 221 -99 183 277 551 282 -325 -308 -177 -218 -100 -39 162 307 153 9 -161 -146 -461
2316 -461 -352 -49 41 166 206 293 -96 -66 -228 -343 -340 -255 -133 143 560 268 144 -79 -294 -27 -521 25
2338 25 65 186 331 81 60 212 5 -195 -229 -318 6 207 215 237 475 -146 -24 -69 -231 -109 -234 -89 403
$$ [...]
8191B66
##END NTUPLES=NMR FID
##END=
