##TITLE=1H_DE-79H_F
 200.13MHz, D2O,
 8 sc
 
 29.1.2025
##JCAMPDX= 6.0         $$ Bruker NMR JCAMP-DX V2.0
##DATA TYPE= NMR FID
##DATA CLASS= NTUPLES
##ORIGIN= UXNMR, Bruker Analytische Messtechnik GmbH
##OWNER= pz
$$ XWIN-NMR		Version 3.5
$$ Wed Jan 29 13:45:01 2025 Russian Standard Time (UT+4h)  she@DPX200
##.OBSERVE FREQUENCY= 200.1313
##.OBSERVE NUCLEUS= ^1H
##.DELAY= (6, 6)
##.ACQUISITION MODE= SIMULTANEOUS
##.ACQUISITION SCHEME= undefined
##.AVERAGES= 8
##.DIGITISER RES= 18
##SPECTROMETER/DATA SYSTEM= spect
##.PULSE SEQUENCE= zg30
##.SOLVENT NAME= DMSO
##.SHIFT REFERENCE= (INTERNAL, DMSO, 0, 14.3821)
##AUDIT TRAIL= $$ (NUMBER, WHEN, WHO, WHERE, WHAT)
$$ ##TITLE= Audit trail, XWIN-NMR		Version 3.5
$$ ##JCAMPDX= 5.01
$$ ##ORIGIN= Bruker BioSpin GmbH
$$ ##OWNER= she
$$ F:/spectra/data/she/nmr/H-C/1/audita.txt
$$ ##AUDIT TRAIL=  $$ (NUMBER, WHEN, WHO, WHERE, WHAT)
(   1,<2025-01-29 13:44:05.53 +0400>,<she>,<DPX200>,
      <created by zg, POWCHK disabled, PULCHK disabled
       configuration hash MD5:
       00 E9 B6 7A A2 85 ED C7 34 08 36 98 17 FE 4E 26
       data hash MD5: 16K
       02 5E 39 38 30 8F C7 A9 6A 3E C4 98 6C 47 CB 6F>)
$$ ##END=
$$ 
$$ hash MD5
$$ A1 91 B3 C9 02 EC 54 A3 CA 66 60 45 10 F8 9F 31
##$RELAX= 
##$RELAX= 
##$RELAX= 
##$RELAX= 
##$RELAX= 
##$RELAX= 
$$ Bruker specific parameters
$$ --------------------------
##$DU= <F:/spectra>
##$EXPNO= 1
##$NAME= <H-C>
##$PROCNO= 1
##$TYPE= <nmr>
##$USER= <she>
##$AMP= (0..31)
100 100 100 100 100 100 100 100 100 100 100 100 100 100 100 100 100 100 
100 100 100 100 100 100 100 100 100 100 100 100 100 100 
##$AQSEQ= 0
##$AQ_mod= 1
##$AUNM= <au_zg>
##$AUTOPOS= <>
##$BF1= 200.13
##$BF2= 200.13
##$BF3= 200.13
##$BF4= 200.13
##$BF5= 200.13
##$BF6= 200.13
##$BF7= 200.13
##$BF8= 200.13
##$BYTORDA= 1
##$CFDGTYP= 0
##$CFRGTYP= 5
##$CHEMSTR= <none>
##$CNST= (0..31)
1 1 145 1 1 1 1 1 1 1 1 1 1 1 1 1 1 1 1 1 1 1 1 1 1 1 1 1 1 1 1 1 
##$CPDPRG= <>
##$CPDPRG1= <>
##$CPDPRG2= <>
##$CPDPRG3= <>
##$CPDPRG4= <mlev>
##$CPDPRG5= <mlev>
##$CPDPRG6= <mlev>
##$CPDPRG7= <mlev>
##$CPDPRG8= <mlev>
##$CPDPRGB= <>
##$CPDPRGT= <>
##$D= (0..31)
0 0.7 0 0 0 0 0 0 0 0 0 0.03 0 0 0 0 0 0 0 0 0 0 0 0 0 0 0 0 0 0 0 0 
##$DATE= 1738143844
##$DBL= (0..7)
120 120 120 120 120 120 120 120 
##$DBP= (0..7)
150 150 150 150 150 150 150 150 
##$DBP07= 0
##$DBPNAM0= <>
##$DBPNAM1= <>
##$DBPNAM2= <>
##$DBPNAM3= <>
##$DBPNAM4= <>
##$DBPNAM5= <>
##$DBPNAM6= <>
##$DBPNAM7= <>
##$DBPOAL= (0..7)
0.5 0.5 0.5 0.5 0.5 0.5 0.5 0.5 
##$DBPOFFS= (0..7)
0 0 0 0 0 0 0 0 
##$DE= 6
##$DECBNUC= <off>
##$DECIM= 32
##$DECNUC= <off>
##$DECSTAT= 4
##$DIGMOD= 1
##$DIGTYP= 9
##$DL= (0..7)
0 120 120 120 120 120 120 120 
##$DP= (0..7)
150 150 150 150 150 150 150 150 
##$DP07= 0
##$DPNAME0= <>
##$DPNAME1= <>
##$DPNAME2= <>
##$DPNAME3= <>
##$DPNAME4= <>
##$DPNAME5= <>
##$DPNAME6= <>
##$DPNAME7= <>
##$DPOAL= (0..7)
0.5 0.5 0.5 0.5 0.5 0.5 0.5 0.5 
##$DPOFFS= (0..7)
0 0 0 0 0 0 0 0 
##$DQDMODE= 0
##$DR= 18
##$DS= 0
##$DSLIST= <SSSSSSSSSSSSSSS>
$$ [...]
##$SUBNAM0= <"">
##$SUBNAM1= <"">
##$SUBNAM2= <"">
##$SUBNAM3= <"">
##$SUBNAM4= <"">
##$SUBNAM5= <"">
##$SUBNAM6= <"">
##$SUBNAM7= <"">
##$SUBNAM8= <"">
##$SUBNAM9= <"">
##$SW= 18.0517328524113
##$SWIBOX= (0..15)
0 0 2 0 0 0 0 0 0 0 0 0 0 0 0 0 
##$SW_h= 3612.71676300578
##$TD= 16384
##$TD0= 1
##$TE= 0
##$TE2= 300
##$TE3= 300
##$TEG= 300
##$TL= (0..7)
0 120 120 120 120 120 120 120 
##$TP= (0..7)
150 150 150 150 150 150 150 150 
##$TP07= 0
##$TPNAME0= <>
##$TPNAME1= <>
##$TPNAME2= <>
##$TPNAME3= <>
##$TPNAME4= <>
##$TPNAME5= <>
##$TPNAME6= <>
##$TPNAME7= <>
##$TPOAL= (0..7)
0.5 0.5 0.5 0.5 0.5 0.5 0.5 0.5 
##$TPOFFS= (0..7)
0 0 0 0 0 0 0 0 
##$TUNHIN= 0
##$TUNHOUT= 0
##$TUNXOUT= 0
##$USERA1= <user>
##$USERA2= <user>
##$USERA3= <user>
##$USERA4= <user>
##$USERA5= <user>
##$V9= 5
##$VALIST= <valist>
##$VCLIST= <CCCCCCCCCCCCCCC>
##$VD= 0
##$VDLIST= <DDDDDDDDDDDDDDD>
##$VPLIST= <PPPPPPPPPPPPPPP>
##$VTLIST= <TTTTTTTTTTTTTTT>
##$WBST= 1024
##$WBSW= 4
##$XGAIN= (0..3)
0 0 0 0 
##$XL= 0
##$YL= 0
##$YMAX_a= 800511
##$YMIN_a= -760869
##$ZGOPTNS= <>
##$ZL1= 120
##$ZL2= 120
##$ZL3= 120
##$ZL4= 120
##$ABSF1= 10
##$ABSF2= 0
##$ABSG= 5
##$ABSL= 3
##$ALPHA= 0
##$AQORDER= 0
##$ASSFAC= 0
##$ASSFACI= 0
##$ASSFACX= 0
##$ASSWID= 0
##$AUNMP= <proc_1d>
##$AZFE= 0.1
##$AZFW= 0.1
##$BCFW= 1
##$BC_mod= 2
##$BYTORDP= 1
##$COROFFS= 0
##$CY= -3
##$DATMOD= 1
##$DC= 2
##$DFILT= <>
##$DTYPP= 0
##$F1P= 0
##$F2P= 0
##$FCOR= 0.5
##$FTSIZE= 0
##$FT_mod= 4
##$GAMMA= 1
##$GB= 0.15
##$INTBC= 1
##$INTSCL= 1
##$ISEN= 128
##$LB= 0.25
##$LEV0= 0
##$LPBIN= 0
##$MAXI= 10000
##$MC2= 0
##$MEAN= 0
##$ME_mod= 0
##$MI= 1.114404
##$NCOEF= 0
##$NC_proc= 0
##$NLEV= 6
##$NOISF1= 3.799351
##$NOISF2= 2.8
##$NSP= 1
##$NTH_PI= 0
##$NZP= 0
##$OFFSET= 14.38212
##$PC= 1
##$PHC0= 246.0574
##$PHC1= 13.79223
##$PH_mod= 1
##$PKNL= yes
##$PPARMOD= 0
##$PSCAL= 0
##$PSIGN= 0
##$REVERSE= no
##$SF= 200.129724274929
##$SI= 16384
##$SIGF1= 3
##$SIGF2= 2
##$SINO= 400
##$SIOLD= 16384
##$SREGLST= <1H.CDCl3>
##$SSB= 0
##$STSI= 0
##$STSR= 0
##$SW_p= 3205.1282051282
##$SYMM= 0
##$S_DEV= 0
##$TDeff= 0
##$TDoff= 0
##$TI= <>
##$TILT= no
##$TM1= 0
##$TM2= 0
##$TOPLEV= 0
##$USERP1= <user>
##$USERP2= <user>
##$USERP3= <user>
##$USERP4= <user>
##$USERP5= <user>
##$WDW= 1
##$XDIM= 8192
##$YMAX_p= 0
##$YMIN_p= 0
$$ End of Bruker specific parameters
$$ ---------------------------------
##NTUPLES= NMR FID
##VAR_NAME=  TIME,          FID/REAL,        FID/IMAG
##SYMBOL=    X,             R,               I
##VAR_TYPE=  INDEPENDENT,   DEPENDENT,       DEPENDENT
##VAR_FORM=  AFFN,          ASDF,            ASDF
##VAR_DIM=   8192,          8192,            8192
##UNITS=     SECONDS,       ARBITRARY UNITS, ARBITRARY UNITS
##FACTOR=    0.0002768,     1,               1
##FIRST=     0,             0,               0
##LAST=      2.2672688,     0,               0
##MIN=       0,             -760869,         0
##MAX=       2.2672688,     800511,          0
$$ Real data points
##PAGE= N=1
##DATA TABLE= (X++(R..R)), XYDATA
0@%%%%%%%%%%%qQqJ6j6K1k4K7l2M0n4O2p2Q4r6J13j29J51j74J94k21K50k84L21
35A69l60M05m52N06n63O26o98P71q52R43j042J151j267J397j537J689j864K057
53A079k273K511k782L093l448L868m364M965n711O656p911R654j2240J6480k4616
68a5039M5717k04817n74347L4353J13264K13485N35021M64560Q1612l3651k76376
79C83782n49419l64283j04158o7997K81764N95221L30880P7721R7365k29149n66724
90a14997l74124j41429m4096L03033M93188K76281J78022J01889k98213m71606
100i2052k60808k06518j13247K93559M38956K61999K35211R7373k91071l80191
110a6789k58843k92025r8850L21785L72088K34311K62561Q3538k61736l05347
$$ y = [0, 0, 0, 0, 0, 0, 0, 0, 0, 0, 0, 0, -8, 0, -8, 8, -8, 13, -11, 16, -16, 24, -30, 32, -40, 44, -52, 61, -68, 83, -91, 103, -118, 132, -152, 169, -191, 214, -238, 268, -295, 331, -367, 404, -448, 495, -547, 604, -663, 734, -803, 886, -978, 1079, -1194, 1317, -1465, 1628, -1820, 2048, -2316, 2649, -3062, 3594, -4317, 5337, -6903, 9577, -15039, 30678, -174139, -748486, -714133, -600869, -387384, 147637, 612197, 693809, 660158, 383782, -165637, -529920, -634078, -702075, -420311, 174910, 505790, 583511, 680876, 451727, -114997, -489121, -630550, -674646, -371613, 121575, 397856, 575878, 677767, 379554, -92052, -352860, -559378, -672625, -379066, 59890, 321889, 557100, 654473, 363402, -16789, -275632, -567657, -666507, -344722, 27366, 261677, 524238, 607776, 346040, 40693]
120D0693k65760l07427o2451K59533K62490K70374L29118N2276k52894k34260
130I1692k60501l28088o8244K15355K41253K95967K95292K1645j71592j81776
140A51003l02339l13537k7823J50980J71946L09424L07002L0004j30547j72172
150A73941l05327k76231m0039Q2108J69593L29351K63735K3961o6972j52995l12202
161a11077k48763m4673L6899J54682L13747K37653N5790k3266j62313l03057k10528
172c04906o5485n217J54606K99347K09050P8316O465j61283k77911j87815r2520
183c47353k4472J55042K64901J85171J10663K7938j61191k50370j72556j15313
193c27540l3586J48036K28942J74967J34848L3332j50943k14243j67645j38068
$$ y = [40693, -225067, -532494, -594945, -335412, -72922, 197452, 526570, 578846, 325952, 91692, -168809, -496897, -565141, -349786, -108533, 187434, 482726, 504371, 332779, 151003, -151336, -464873, -492696, -341716, -169770, 139654, 446656, 476660, 346113, 173941, -131386, -407617, -447656, -365548, -195955, 133396, 397131, 421092, 354120, 201125, -111077, -359840, -404513, -367614, -212932, 100815, 338468, 394258, 370992, 208679, -94378, -304906, -370391, -375608, -221002, 78345, 287395, 365711, 372176, 210893, -67018, -254833, -347353, -371825, -216783, 48118, 233289, 343952, 371890, 210699, -39671, -212227, -327540, -361126, -213090, 15852, 190819, 325667, 358999, 208056, -6187, -173832, -311900]
203c11900l4116J38354J94164J68741J49154L5772j32253j83395j68351j48538
213b92368l2130J17683J63477J68928J58115L5133j09379j55686j70985j54952
223b72164l1329R6014J41081J69498J55616L5769q3752j34758j71933j50624l3606
234b80188P0475J24038J69790J49067L8634n8691j19307j70512j45629l9200N0540
245b10983J13486J64057J38841M5978l7594j09668j62594j35150m8056K9606J03834
256a08243J57005J30937N3363k1441r9370j51420j28649n8744J6137R7149J44591
267C1315J23339O2793r724r0547j39162j21439o6674N809Q5476J31781J19357
278A32324P0482j458q1069j24860j17056p3630k600P5003J20110J15405P4428
$$ y = [-311900, -346016, -207662, -13498, 155243, 304397, 340169, 207916, 24521, -143830, -292368, -324498, -206815, -43338, 125590, 283705, 318838, 209459, 53773, -117212, -272164, -303493, -207479, -66398, 103100, 258716, 294485, 210733, 75975, -95958, -246582, -280188, -209713, -85675, 84115, 233182, 271816, 213125, 93818, -76694, -222323, -261523, -210983, -97497, 66560, 205401, 251379, 213785, 104117, -58477, -193627, -241683, -212077, -108243, 48762, 179699, 233062, 211621, 112251, -39169, -167818, -226562, -210425, -113276, 31315, 154654, 217447, 207723, 117176, -21986, -143425, -210099, -204290, -118814, 12967, 132324, 202806, 201348, 120279, -4581, -121637, -195267, -197867, -122864, -2754, 112651, 187079]
289A87079N880o8292j13462j14538p6439q943O3626J07464J12140P7251J2466
300A84232n7998j02418j09922p7740j5275N0713R8351J08567P7798J8297m6268
311A28337r3089j05760p7847k1706M1182Q9215J03249P6949K4686l6302q4673
322D4241j00674p7129k6785L2336Q0213R6674P7562L0248k8794p6828r3938p5992
334a18866l2414K3949P2821R1156P5731L3545k0136o7455q8512p6051l5312J7759
346a23785O3532Q5031P4906L7381j4293n9906q2691p3081l9141J0537N6612Q0018
358A5120P1972L9452o840n2429p7226p1155m0646L780M9301P4193O9891M1804
370A17217j039m6260p1365o7696m3730j890M4254O8510O5539M4493M637m1230
$$ y = [187079, 192959, 124667, 11205, -103333, -179772, -188715, -125089, -17625, 94515, 171766, 184232, 126234, 23816, -86106, -163846, -179121, -128408, -30057, 78510, 156308, 174605, 128337, 35248, -70512, -148359, -170065, -128883, -39668, 63581, 140530, 165216, 128914, 44241, -56433, -133562, -160347, -128011, -47798, 48876, 126438, 156686, 127892, 51064, -42874, -118866, -151280, -127331, -54510, 36646, 112377, 145922, 125786, 58331, -30181, -106232, -141544, -123785, -60253, 24778, 99684, 137065, 122772, 62866, -19825, -92906, -132047, -121510, -64898, 15120, 87092, 126544, 119704, 67275, -9951, -81106, -121752, -117972, -68671, 5522, 75413, 117217, 116178, 69918, -1447, -69143, -112873, -114763, -70509, -1999, 63540, 108033, 112670, 71440]
382G1440o5262o4164m5920o438L8487O2401O2396M7022Q051l6754n8051o0979
394d7771m8598q907L4497N4290N9939M9256R945l1517n0925n9204n0049j0276
406i9320K8245M7155N8972N0337J0293k4829m3678n8774n0389j0314K1864M0357
418c0081N8527M9854J0224j7658l7723n9101m8520j0819J4457L5461N8905M6515
430G0041J1122r828l3881n9037m4442j2091O399L3127N7874M1968J3540k430l2550
443C9812n7130l9774j5046m25L2571N5254L6869J7147L653l2266n3679l4327k0189
456f7530n709L3454N0863L1874K2283P681l3310m7414l0435k5984q265L4076M3679
469E263K9153K8490Q462l3520l9834k8396l1694q039L3323L5689K8522L3972O094
$$ y = [71440, 6178, -57986, -103906, -110344, -71857, -9456, 52940, 99962, 108013, 71259, 13208, -47771, -96369, -105276, -70779, -16489, 43450, 92706, 102651, 71134, 20209, -38995, -89044, -99320, -71075, -23920, 35052, 85389, 95682, 70853, 27175, -31599, -81988, -92302, -70438, -30081, 28446, 78300, 88524, 70866, 33143, -25958, -74478, -85297, -70840, -35379, 23526, 70041, 81163, 71335, 37454, -21583, -66025, -78116, -71717, -38590, 19284, 61252, 74792, 72362, 39812, -17318, -57092, -72138, -72563, -39992, 15262, 52131, 69278, 72931, 40665, -13014, -47341, -67530, -73239, -39785, 11078, 42952, 65235, 72916, 39606, -7808, -38243, -64227, -72492, -38416, 5263, 34416, 62906, 71368, 37848, -1986, -30382, -62076, -70115, -36792, -1103, 27419, 61391, 67485]
482F7485l1547l0952k9212l6656n009L0382K7558L0971L6556K506k7168k3385
494A1529l2061l8056j426K4544K0817L4379L7252r20k0649j8021l5825l6129J247
507e3319J6395J6847L8575L4204k716j2696j5131l9997l2368L262P590J5420M1881
520A7947K9351k572m390j6018m1865k5932J421m83J6929M2941K2867K98K616j8509
534B4601m0894j9831k880n813K0110L9988J7604N988O964k2457l7598j4488r105
547c7811q123K3055L4685J4059J2338Q057k5425l1200j2104j4966q203K5155K7878
560G395J2203J9231O965k6823k4441j2111k0854n024K4954K0325J3707K3715L431
573D2673k5162j7000j5272k4118r99K2531J3948J6783K5448o23k0118j2393j9085
$$ y = [67485, 35938, 4986, -24226, -60882, -65891, -35509, -7951, 23020, 59576, 62082, 34914, 11529, -20532, -58588, -60014, -35470, -14653, 19726, 56978, 56058, 35409, 17388, -18437, -54566, -53319, -36924, -20077, 18498, 52702, 49986, 37290, 22159, -17838, -50206, -46944, -39354, -23934, 17947, 47298, 44726, 40336, 24318, -17547, -43479, -42058, -42541, -25612, 17329, 40196, 40494, 43110, 24601, -16293, -36124, -39004, -44817, -24707, 15281, 32885, 38873, 45837, 23380, -14218, -28706, -37811, -45934, -22879, 11806, 25865, 38203, 46260, 20835, -10365, -22469, -37435, -45638, -20483, 7395, 19598, 38829, 45794, 18971, -5470, -17581, -38435, -43459, -18505, 1820, 15527, 39242, 42673, 17511, 511, -14761, -38879, -39878, -17347, -3399, 13384, 38832, 38209, 18091, 5698, -13387]
586a3387k4877K698J7381R762K1139K4595l412j4548r357k2825k2896M536J0978
599b0213Q642K4317K1162m514p275r274k5541j9620M527N009R305K6075J7020
612B9620k679k586j0436k6656j4970K147L01J1298K6370J2606k56J462j2149k5706
626a1634j1464j378k972J3960K4234R417L865L583j4261k2996q773n512m199J5945
640a2185K0736P816P713L564j5867j8503q125r531l039J5996J6728Q149J0886
653B4338K181j5344j4781q851j2329j256J5315J2620R920J2190Q65j3828j1323
666b83j0521j3185J99J2668J0172J1305J3419j110j1284r094j2243j2961R65R712
680a2241Q554J3193J3037k070p691q257j3977j1739J145O483Q230J4227J1351
$$ y = [-13387, -38264, -35566, -18185, -8423, 12716, 37311, 33899, 19351, 9994, -12831, -35727, -31191, -20213, -11571, 12746, 33908, 29394, 22119, 12845, -12696, -32316, -27789, -22780, -13475, 12600, 29620, 26941, 24355, 13919, -12737, -27707, -25560, -25259, -13961, 12409, 25015, 24759, 26221, 14072, -11634, -23098, -24476, -27448, -13488, 10746, 20163, 24028, 27611, 13350, -9646, -18419, -23931, -28130, -12185, 8551, 16367, 24080, 27644, 11777, -6726, -14851, -24382, -27421, -11425, 5303, 13452, 24338, 26519, 11175, -3606, -12457, -24786, -26042, -10727, 1893, 11813, 24003, 24868, 11040, -283, -10804, -23989, -23790, -11122, -950, 10355, 23774, 22664, 11380, 2286, -9957, -22918, -21953, -12241, -3687, 9506, 22543, 20473, 12782, 4525, -9452, -21191, -20046, -13563, -5333, 8894, 20245]
693B0245j067n339q093j4080j0671L32M226Q332J4478R588M9l389p763j4580q876
708a6608r63K547Q263J3834Q681J202j607q496j3085q484k508J586Q619J2897
722E878P779L081j157q564j1854p754l719R20Q315J1185P602M763r33q289j0581
737c328p604n064P97P834R903Q072N036m96p524r444p995n511M49O924R017Q190
753I256N381k86o072q708q113n485K12N305Q339Q395N366J99n263p759q208n871
769a3312m00N096P711P779N768P32m283p509p924n626j223M188O851P980N493
784A1321J360l399p068p583n701j521L138O791P500N532K035k844o519p396n531
799i885k051K599O138O941N503K475k382n861o735n728k628K436N314O664N713
$$ y = [20245, 19178, 13839, 5746, -8334, -19005, -18673, -14447, -6115, 8363, 17951, 18000, 14611, 6848, -7732, -16608, -17571, -15024, -6761, 7073, 15754, 16956, 15349, 6853, -6232, -14716, -17224, -15638, -7019, 5878, 13657, 16738, 15581, 7017, -4837, -12591, -16310, -15390, -7075, 4110, 11712, 16475, 15542, 7253, -3328, -10932, -15996, -15199, -7365, 2538, 10610, 15646, 15150, 7626, -1818, -9813, -15324, -14875, -7951, 1066, 9256, 14637, 14351, 8279, -429, -8542, -14027, -13815, -8510, -171, 8224, 13590, 13789, 8526, 767, -7441, -13312, -13712, -8616, -905, 6874, 12642, 13374, 9091, 1582, -6342, -11968, -13191, -9003, -2152, 5828, 11321, 12681, 9282, 2214, -5369, -11070, -12591, -9453, -2662, 4838, 10370, 12405, 9561, 3042, -4354, -9885, -11936, -9337, -3199, 3742, 9245, 11720, 9338, 3477, -3258, -8986, -11614, -9178, -3864, 2800, 8513]
814H513K782k122m847o888n923k331J666M721O234O088K561j408m294o209n847
829g304k750J317M110N965N552L150j041l878o019n585k745K72L716N704N768
844F232K950l93l357n482n759k977J29L256N177N430L446l91k662n075n429l136
860h041l46K662N115N176L283L59k182m723n133l512o80K263M195N204L129J145
876G914j921m460m895l528o97J636M032N097L243J229j482m100m638l548j130
891g248J253M181M337L302J077q43l587m522l376j485P84L577M488K976J683o18
907E979l348m423k891j769L61L436M317K901J778k71k969l945l029k408J70L360
923b751L445L062K017p7k722l625k904k485L17K989K785L183K724l85k554k941
$$ y = [8513, 11295, 9173, 4326, -2562, -8485, -10816, -9150, -4429, 1805, 7893, 10454, 9046, 4752, -1457, -7304, -10054, -8737, -4627, 1338, 6890, 10040, 8999, 5121, -898, -6483, -9228, -8956, -5240, 464, 6232, 9182, 8789, 5432, -50, -5809, -8786, -8657, -5401, -224, 5206, 8652, 8261, 5599, 524, -4905, -8041, -8387, -5725, -610, 4566, 7849, 8208, 6026, 1303, -3830, -7342, -8022, -5759, -1564, 3640, 6769, 7914, 5993, 1533, -3362, -6890, -7587, -5951, -1919, 3178, 6421, 7650, 6168, 2068, -2570, -6118, -7248, -5995, -1814, 2523, 5825, 6902, 6059, 2472, -2050, -5426, -6911, -6127, -2550, 1938, 4914, 6597, 5979, 2631, -1792, -4683, -6452, -6091, -2655, 1662, 4563, 6341, 6070, 3101, -844, -3873, -6281, -6111, -2751, 694, 3756, 5773, 5696, 2974, -651, -3555, -6040, -5723, -2734, 51, 3234, 5958, 5573, 3019, 78]
939G8k982k724N1K818K264L452K516k77k155k204l600k807O08J903K094L554K710
956E299l04j957j456l830k684K57J244J927L832K560m47j099j644l821k485N67
972d041L08J858M025J898J05m06j677m155j695l13j10K318M024J425K00L50k162
989A952l738j356n53m58K387L612J073R17M60k698k886r48j295j064L121K610
1005A136J212J305N01k474k526j139j932k73K584K361R95J979L00k527k008p13
1021a219k658o0K816J401J207K325K8k707r88j526k521M98K081Q23J701K598n77
1038C222j800n28k085k688R30J209Q32K089K345r15q77l57k296k635O51R29O73
1055a301K747J674p67o22j66k765k003Q41k8O61L032J292l55J54q05k999j043
$$ y = [78, -2904, -5628, -5577, -2759, -495, 2957, 5473, 5196, 3041, 837, -2763, -5570, -4962, -3059, -965, 2589, 5299, 4995, 3038, 1582, -2248, -4932, -4675, -3431, -1504, 2328, 4888, 4441, 3342, 1698, -2123, -4608, -4041, -3733, -1875, 2150, 4048, 4153, 3747, 2070, -2085, -3780, -4093, -4203, -1885, 2139, 3564, 3764, 4114, 1952, -1786, -3142, -3695, -4153, -1766, 1846, 2919, 3836, 4296, 1598, -1288, -2236, -3531, -4595, -1474, 1136, 2348, 3653, 4154, 1680, -846, -1985, -3917, -4190, -1606, 755, 1750, 3729, 4029, 1502, -506, -1219, -3877, -3937, -1121, 280, 1487, 3812, 3840, 1133, 145, -1381, -3902, -3404, -1323, -500, 1201, 3799, 3222, 1422, 894, -1191, -3879, -2949, -1740, -908, 1181, 3526, 2611, 1734, 1377, -919, -3554, -2903, -1974, -1301, 1446, 3120, 2353, 1731, 1565, -1200, -3203, -2362, -2390, -1729, 1303, 2595, 2240, 2394, 1589, -1410, -2453]
1072b453L11l04Q64K977Q52m96J015j382k548o41n0r09J455K290M66N39J143j514
1090A615k483k94j081n33J673J895J72J005R94j925j799j92j412k93J705J230
1106B77O90J220N99k081j005n74j098o79J865N94Q66J597j24j318n30r31j869
1123b501L06J380K78J052J581j24j093l70j055j600J78R34M54J164J514k55o51
1140A192l77j607j143K83L11P30J234J352j99l61o99j462q17J73l10Q34J354J265
1158A753j80j74m79j632n54O4n29P85J484P19q0K72l24j539o19k50l18N04J421
1177C24N22L07O10q20j225m80n84m20J000R57P28L30O3o82n70q15p14l7Q26P73
1197I3N46L01K46l31r36m64p74k1O35M40R62M61J60m76p07o11o49l71P23K54Q25
$$ y = [-2453, -2142, -2446, -1582, 1395, 2247, 1751, 2766, 1384, -1164, -1805, -1855, -2764, -1309, 981, 1447, 1986, 3129, 1615, -868, -1162, -2243, -2776, -1103, 792, 964, 1969, 2963, 1038, -761, -953, -2365, -2658, -953, 277, 967, 2187, 2786, 705, -300, -874, -1972, -2651, -786, -192, 674, 2271, 2147, 829, 299, -632, -2501, -2195, -815, -537, 515, 2096, 1972, 879, 509, -546, -2146, -1968, -1034, -580, 584, 2098, 1843, 1192, 815, -792, -1935, -1652, -1341, -611, 623, 1975, 1776, 1415, 716, -746, -1563, -1390, -1700, -866, 488, 1753, 1573, 1399, 920, -712, -1266, -1202, -1731, -946, 538, 1257, 1177, 1449, 1125, -414, -1033, -1283, -1601, -1097, 324, 846, 1153, 1763, 943, -282, -762, -1346, -1766, -766, 191, 919, 1249, 1312, 630, 60, -755, -1469, -1506, -680, 93, 639, 940, 1186, 855, -81, -545, -1319, -1340, -705, -265, 697, 1158, 1318, 842, 135, -476, -1125, -1496, -773, -519, 306]
1218C06Q98j26j67l29r85p91L8K13M41R35P21M4m36m90o42n78r4Q3L78R03O56
1239I78M16n03m64m38p80l91L96J98P08O59J26j80l73l08q09n31P66m8N62Q14
1259G98K32k27r4n34n70m82q4J61P58K72O27o8l60m98l19l41j47L78L08Q58K3
1280F91K33l20l67p10k52j29M44J29R37J22K53l96m04r35O3j97K98K58N83M30
1300G31n1p5m85k63o42J89o9L63L10J060j11k61n14m24m93jJ31J43L93O34J83
1321G48j11n24k20j26m55M9L83L51M41K42q5m11o03L8k99J4K72K31K04L73R8l67
1343B43k06l32k67J90J76M03J17L60k68Ql07n13m2k73L14L23J04L83J18l14k09
1364Hl06k51L57l50N54J96L05k13M37m66o52k68K34J70k3N85L37N5l32k18l3n00
$$ y = [306, 1204, 1078, 911, 582, -403, -1194, -1156, -943, -502, 433, 1154, 1198, 762, 272, -370, -948, -1042, -959, -581, 322, 978, 1394, 891, 427, -11, -791, -1182, -786, -588, 120, 779, 905, 725, 352, 44, -765, -1296, -530, -578, -16, 798, 1030, 803, 709, 175, -395, -877, -961, -800, -42, 230, 857, 789, 429, -69, -388, -729, -876, -498, -190, 668, 691, 924, 604, 237, -473, -725, -854, -410, -281, 656, 778, 1031, 635, 231, -704, -641, -838, -540, -282, 301, 731, 680, 605, 120, -143, -785, -596, -665, -302, 8, 1068, 957, 696, 182, -242, -735, -736, -605, -462, -69, 565, 748, 637, 113, -107, -233, -688, -639, -256, 95, 536, 778, 693, 282, -321, -283, -582, -568, -296, -65, 139, 512, 610, 243, 37, -295, -562, -372, -196, 207, 324, 684, 416, 424, 117, -396, -438, -711, -397, -74, 30, 413, 531, 217, 8, -298, -549, -192, -542, 12, 208, 513, 300, 737, 271, -381, -649, -415, -245, -268, 317, 654, 709, 377, 159, 126, -374]
1386c74p6k20N27M33M7j5N1l94k24M3m36M91qM17j18L25j05j04k43m14j5R4J40
1409a78K46L00J46k07J42l75m83k2o2J17N13K46j40M55n42k79j67j07q0K12K42
1430b3J37P1m0Q8l49N6k93r6J27K65L77Q9J81m76j20M1l97n8p4K30K96J16j37
1453A1J38L9l48Qm31K14L15M70q1j94P2j26q1k37j1J85j41N13p1N3k84n6q0N9
1477f4k79J4J16M84Q9j21m4K57l82m08r4K49Q0J10K37Q8q3K46o01K27m67r6M87
1500D5R6mP7k29K12k21j91p6%r1M43R9P4k45K16J15p37N8K02O6K53p7Q7P4o5l70
1526a89L03l07j33J12L06o1L35J54l15j62j45K8m92L06M10j31L05j07n0j04p0
1547gm72J87J74J81j85K94K7k17J9L8k86r3L36q7j36M43K79l97K17k82pn17P22
$$ y = [-374, -450, -670, -143, 290, 337, 322, 373, -21, -245, -202, -638, -147, -155, 262, 144, 469, 364, 260, 17, -397, -412, -318, -178, 68, 368, 514, 307, 449, 74, -409, -431, -493, -376, 137, 383, 243, 698, 156, -123, -290, -397, -477, -265, -23, 114, 185, 145, 233, -116, -60, -353, -449, -322, -57, 320, 409, 590, 114, -6, 35, -362, -420, -494, -264, 32, 148, 11, 149, 188, -160, -152, -583, -369, -54, 416, 335, 141, 213, 87, 6, -231, -242, -57, -198, 315, 244, 297, 13, -43, -123, -64, -343, -329, -213, 271, 360, 239, 195, 452, 70, -338, -432, -183, -103, 7, 244, 332, 249, 495, -106, 121, -346, -442, 45, 141, 137, 214, -15, 197, -24, -215, -291, -291, -382, 61, 160, 234, -11, 205, 320, -417, -359, -157, -91, 162, 85, 172, 246, 181, -189, 114, -193, -326, -214, 92, 31, 366, 520, 205, 43, -102, -74, -566, -260, 150, 19, 324, 217, 167, 63, -7, -479, -292, -118, 63, -122, 172, 199, -18, 1, 39, -247, -340, -4, -91, -227, 216, 495, 98, 315, 33, 26, -491, 231]
1570B31n17L67K38j84m0M5j73k01%K05k00J88j34N01j90j35k06M8Qk56J02J97
1592a06M44j18M6J68l14p55L41j41L64K5K50q3K55j99j49n2l37j42M07K83j32
1613E5P9r3J80j16k08j43K04j61J28J91n1K36l11Q2l3l61n6K56J0J44l2J97j86
1636A1j8o9n1j1n0l0J95J90J2J43J8l63L7k43J09O9N7j39L12k8j69K48k06l49
1660c25R8j2K38k4K61k44J51R9k65j02K09p7j81L75K9k96J86R5l26k91K62N7J18
1683C5o0K02L6J2l23k23J39O3l8j33M63k37NK05j80j92Q0n7K00P0J95K7p9l12
1707a02L4J90k43q5M4R0L72j78j95j95K97K5o4Jl81M90k15M15j16j95K44k72j43
1730a82K71m03J39L07j68K05l7l72Q1NJ97l72K55J34n5J51J62K3n48k1J78k48
$$ y = [231, -286, 81, 319, 135, 95, 140, -33, -234, -234, -29, -229, -41, -175, 326, 136, 1, -205, -157, -149, -405, -303, -106, 338, 220, 266, 434, 120, -635, -294, -435, -71, -46, 204, 121, 376, 177, 28, -24, -361, -503, -96, 187, 55, 134, 41, 221, 105, -103, -246, -42, -203, -75, 116, 65, 301, -10, 72, 39, -322, -378, -122, -112, 32, 0, 197, 11, -7, -76, -127, -138, -188, -218, -23, 167, 179, 322, 340, -23, 14, -229, -120, -51, 6, -133, 179, 151, -18, 230, 24, -325, -227, -239, -1, -25, 236, -8, 143, 242, -23, -125, 84, 7, -174, 201, 230, -66, 120, 215, -111, -402, -140, -83, 35, -25, 177, 213, 225, -98, -321, -182, -119, -157, -290, 173, -64, -59, 146, -34, -226, -146, -203, -3, 67, 262, 289, 210, -102, -68, 122, -121, -206, -162, -72, 300, 122, -73, -268, 29, 54, -10, -9, -390, 100, -115, 300, 184, -11, 233, -39, -182, 89, -314, -175, 132, -36, 169, 132, -240, -159, -154, 43, -329, -74, 60, 5, 156, 318, 341, -207, -228, -50, -298]
1752b98P6M04k84K50J07k71n4r7J45M2J34k7J24p3k57J59m0k70J37L0J79j00o1
1775d5K2J31l23K43l96K95k36J75J16K13j09O9kr5j74J03J97j05m5J74j50j58
1797a00R2l2j03P7j9%k9J09K15J0k64L2j35K10k43n9K03J44m21L55J6k07J29o7
1821h7l08Q6M31J59l42K59j15j26J62j47l46K92n8j9J21L1J57m8j56L8J08r5M4
1844D1Ln1j61Q9k44L48k67M18k1m87L39n4J54P9j15j27l06M59j06j8p3K88L0p3
1868A45l2k39l7K46l31L17q8R4k3O2J00l35m2J95n32N72k28J01J90j85L2J46P9
1891B07n13M47j70J14p3K57Q0l89J01m9l48J65L88j59J62m0j56kK55l43j83n5
1913c04K55L1K83K6k64K15l9l36Q0J6o6j16J31N7j71J13k2M01l22J70k23J76j67
$$ y = [-298, -222, 182, -102, 148, 255, -16, -70, -167, -22, 20, 154, 127, 251, 178, -79, 80, 40, -230, -93, -63, 116, 16, -45, -23, 108, -215, 28, -368, -73, -309, -134, -18, 195, 86, 155, 153, 58, -116, -13, 184, 79, 34, 208, 58, -100, -8, -40, -143, -66, -85, -85, -114, -5, 210, 220, -44, -12, -147, 63, -180, -239, -36, 108, -313, 42, 58, -149, -20, -87, -395, -309, 122, 281, -61, 198, 83, -43, 119, -28, -374, -82, -140, -159, -38, -7, 150, 102, -54, -16, 92, -3, 41, 44, -7, -168, -79, -323, 25, -242, 176, 155, -332, 7, -47, 107, 186, 71, -56, -362, 97, -9, -27, -100, 188, 218, 145, 113, -126, -163, 83, -248, 69, -19, 75, 52, 114, 214, -121, -163, 32, -500, 72, -156, -55, 135, -50, -18, 128, 207, -306, 141, -29, 85, 12, 269, 349, -40, 61, 12, -336, -171, 217, 58, 220, 180, 24, 22, 277, -66, -249, -304, -49, -18, 265, 291, 27, 242, 203, -133, -53, -37, -103, -219, -88, -31, -202, -89, -111, 290, -32, 138, -85, 91, -76]
1936g6M35k33l67K22RO3M9j29J29J7n52O63k32K29k83J8J56k38L68k38M4J5o1
1959HL6K83k91j9M2l7L67l46j18K62j05j97J85k02J15q5Q1j11K49j4J02k10mR5
1983H6k57RK61O3j34j42J88L9l20m3J79j90jL88k48P6j18K31Q5J80o80M7L81k1
2007E9j18N8o9K81k70o8K1p8Q3k7J10P7j21M94m53k56K61n8J28j95J50K11k90
2030g0r3J43j21rL88j82j01K26j02O9j41j75M2J0J9K34O7k14k14J48j9o0M4N7
2054e4M1k16J27P5Q2J05j06j82J56j90q8K48J79q0j2j30J78R3j81L5k26J58k8
2077a6J46k85L69k06N9pO2k54n9M03J01m31J67j9M9k07J32J9R9j50J6K8l6N3j36
2102a03m2J30k10L50j32m4L8j48L83k73j48J50j6P3q9N7J29J63n53K61J69k11
$$ y = [-76, 359, 126, -241, -19, -10, 53, 102, -27, 102, 119, -433, 230, -2, 227, -56, -38, 118, -120, 248, 10, 54, 69, 8, 44, 327, 36, 17, 59, 22, 389, 43, -75, 187, 82, -115, 70, -132, -17, -102, -21, -132, 117, 103, 205, -5, -9, 86, -171, -162, 99, 162, 28, -114, 74, 113, -207, -250, -71, -261, -262, 126, -122, -46, -164, 67, 152, 332, -348, -301, 80, 59, -59, -1, -70, 211, -59, -127, -106, -184, -101, -128, -18, 59, -62, 432, -21, -277, -16, -74, 54, -141, 9, 220, -70, -163, -20, -141, -150, 238, 56, -45, 181, 79, 148, 7, -168, -126, -116, -97, 137, 204, -10, -224, -76, -95, -155, -111, -54, -13, -229, -102, -27, 55, 160, 54, -128, 28, -162, -250, -2, 177, 97, 85, -45, 133, 226, 45, 80, -146, 12, -16, 130, -155, 214, 8, 67, 60, 122, -132, -191, 212, 313, -118, 49, 30, 79, -128, 4, 23, 122, -28, -12, 16, -20, 33, -103, -145, -15, -225, 125, -7, -51, -13, -161, 222, -51, -199, -49, -65, 8, -81, -24, 105, 268, -285, -24, 145, -66]
2124f6k56L92j84q5J61N10m74J6j6pOj53J17M8R4n4R2Mn9q6p7J44k48L9L47K1
2150B26N7j07j83J46k49j17J58Lk61N15J95k88n3J69m7k19J03m71M40p3J10q7
2172c3J09j40N8o4J49j16N0K80k58RK05l89R5K60l30K04k6J8r6k81M80j54j93
2195a63K35L5k23k3N9k6K25k64J55N7k00K33k95J47p9K86k20L23j65Q3j55j42
2217a17J11K9J35J42j86j2j80J42p2k30Q2J24M9J88l00K17l7L18k2m72L6J72q0
2240C7J33k62L00n83K82J98l98N45l16P2J33j25n11N51R1k78J91j9r4K59l90J64
2262b0J90j9k00o5K09p9j32Q8J68r7j04P1k3J83p9j62K31j53k06J50j7J28J50
2285B12p8k46L38j55k48K9Q5jJ92j94j67K06n4M8L01k88n9K69k27k3q7n9J67M9
$$ y = [-66, -322, 70, -114, -199, -38, 472, -2, 14, -2, -9, -3, -156, -39, 9, 103, 49, 141, 145, 86, 0, -77, 67, -181, -142, 205, 226, 283, 176, -7, 139, -110, -227, -69, -66, -327, 188, 383, 95, 42, 211, 164, -55, 48, -423, 17, -56, 54, -33, 76, -64, -6, -70, 79, -37, 13, 293, 35, 44, 249, -140, -45, 215, -115, 89, 63, 81, -15, -296, 184, 30, -163, 72, 107, -116, -139, -80, -106, 119, -145, 10, 67, -133, 100, -195, -48, -127, 159, -61, 262, 97, 180, 25, -117, -6, 23, 158, 300, 114, 102, -78, 64, -8, -238, -156, -32, 17, 205, -95, 122, 85, 403, 381, -91, -55, 117, 37, 170, -92, 208, -375, -93, 105, -293, 252, -64, 8, 141, 16, -495, 56, 147, -131, 60, 41, -53, 206, -184, -20, 170, 151, -49, -114, 95, 16, -116, -28, 140, 43, -61, 10, -13, 170, 91, -71, 160, 7, -199, -49, -66, 62, 212, 134, -112, 226, 71, -177, -148, -63, -64, 128, -66, -233, -27, -81, -33, 268, -20, -79, 190, -37, -60, -147, -206, -39, 10]
2309A0o1J78o6K60l72j58K14J09j42k14K26J77j37j32L56l41Q2j38K27j49J24
2330E3j41R3J21k24k6l8O8j84L14j15K47q0j4j02J20l7j45J02l03K3J44Q4J7J40
2354A17j06J78l9k39J66N5j95j28J20K23j80l8J41j31M5L45j73j04J71r1l08J81
2376A0K0K4k13N33m03Q0j26R3RL09k52P0j98k5N1n0j49K1K03j59kL18j63R8L8
2401A37l63L72j47%J26j63J56j6J90l87r4o3K72p0j5q6R2Q9j7j4J1j87k0%J98
2426AR0l36L02k4R5n0j04Pj55K88j94N4q1J32j15N7j88L66l29L30j24m8Q1l5N0
2451G0k22K18j63O6p6L96k61K15k0l05J89O5Nj71L9Q8k95o0J76L20l02k59N65
2474B78o65L32Q2j10K81m81M00j85k02L24J15j06j83k18J30K96l68n9M49j38l7
$$ y = [10, -51, 127, 61, 321, -51, -209, 5, 114, -28, -242, -16, 161, 24, -108, 248, -93, -11, -149, 78, -71, 53, -88, 5, 126, -98, -124, -162, -94, -278, 36, -79, 168, 88, 74, -28, 92, 55, -90, 12, -291, -268, -124, -40, -23, 117, 11, 189, 150, -89, 77, 132, -63, -191, -71, 152, -28, -66, 75, -56, -11, 334, 161, 57, 228, 137, -171, 10, 30, 54, -159, 374, -29, 51, -75, 18, 27, 336, 84, 154, -44, -69, -18, -68, -217, -196, 7, -152, -154, 164, 1, 99, 137, -226, 146, -1, -1, 125, -38, 118, 102, 292, -95, -189, -252, 20, -50, -65, -151, -59, 30, 13, -1, 10, -177, -197, -197, 1, 91, -245, 57, 33, 128, 78, -26, -19, -174, 114, -80, -26, -107, 25, -90, -33, -221, 145, -184, 146, 22, -26, 55, 20, 70, -152, 66, -97, -31, -107, 289, 28, 243, 223, -82, 107, 172, 177, 6, 45, 133, -162, -222, -46, 274, -28, -287, 278, -387, -55, 27, -83, 198, -283, 117, -68, -270, 54, 169, 63, -120, -338, -208, 88, -280, -339, 110, -28, -65]
2495f5K15j0j92M0K12M4l36K55l04J14R7k01J59j48l4J09K59q3l30O6J53j76R8
2518e8qJ45O1r8k04K64J33m01J66j53M5L67l09N5r0J14R4j75P2p0J38l40J87K3
2542d2k5K6q6j37Q8J41N9J74k26J60k64r0K30J09j12k03N5J6K52j85J09j12K0
2565d3p0Q2K97k32l4J90k55Q7j31J6J29M4QO8k14J64K4j75J62m6o9J54j14k20
2589a78L42nj29j27J00l7R6j52K81J05l55N4O3r1k1N7r3J33k26L68q5J40m23N1
2613a32K53J5n1p5J56J43o75N45j09P5j49l23M14J48k85j04l0j01NK72Q4m4k73
2636b41K54pL3l1N6L2r5J5J07l56K61L2M5q8k4jm6J77n5q5L53k69o4k6Q7l43Q7
2663a92J78j12K25j02k49L75j2Kj12k65M76l21J59j82L33m52J34J56j4k5j58k7
$$ y = [-65, 150, 140, -52, -12, 200, 244, -92, 163, -141, -27, 70, -131, 28, -120, -154, -45, 214, 131, -199, -133, 20, -156, -58, -66, 79, 140, 42, -162, 102, 235, -166, 0, -153, -108, 259, -50, 5, -85, 29, 123, -52, 20, -50, 88, -252, -65, -42, -67, -41, -127, -264, -176, -35, 24, 198, -28, 132, -132, -222, 8, 117, 5, -198, -143, -127, 125, -60, 49, -63, -43, -113, -31, 266, 34, 0, 190, -65, 22, -109, -93, 36, 80, 88, 156, -58, 106, 130, -45, 117, 71, 2, 156, 42, -178, 164, 159, 30, -97, 3, -34, 62, -90, 191, 296, -59, -5, 58, -33, -54, 3, -90, 43, -183, 185, 100, 240, -183, -132, 121, 136, 85, 10, 166, 309, -366, 179, 70, 145, -4, -327, 87, 235, -50, -154, -184, -285, -280, -8, 76, 32, -241, 13, 6, 39, 8, 64, 96, 1, 16, 123, -233, 28, 60, 105, 17, -7, -8, -54, 123, 68, -17, 336, 67, 3, -23, 64, -279, -192, -14, -126, 99, -3, -252, 123, 111, 113, 1, -264, 212, -109, 50, -132, 201, -251, -117, 39, 25, 0, -158, -185]
2685a85L03o4P8j27k02J3J4pKJ49J66m6O2j86j12J03j49J02j24L03k7k16J15J19
2709H4k9J6j88L01l84K87q9j81j25N45p1m32L39J09j3r9J01l3K3l03J69k11J62
2732b2K6k48R2K40j4j38J64j18J29j0J70l22K98R9l22l5K59m02J65q3J00k2K77
2755B83k69K27m56M34L1l63J7J84j84m3K24o0J79k83J42j17K47k8j64j04pj35
2777b45J12K27J11j16j25K03r1J59k41Q5%N9k62P5J94k46K38j22J34j98Rj57M41
2800B44l05p7L40j62j08j62J32r9L22j96m4M22n00K47m7N2k14L35j45q7R8l4L04
2823C16k53m1j25K49j55J08k66L26j71J98l20J30M8k98K60r5o5K98l5j05j63j36
2845b95K36j59J95K5R2j46m1K18O0k30J31j72l60M35J78k06M3Q4l32M80k14k01
$$ y = [-185, 118, 54, 132, 5, -197, -184, -170, -177, -175, -26, 140, 94, 156, -30, -142, -39, -188, -86, -210, 93, 66, -150, -35, 84, 55, 71, -117, 184, -200, 87, -2, -183, -308, 237, 166, -266, 73, 182, 169, 70, 171, 138, 161, -142, 27, -184, -22, 4, -244, -152, 88, 74, -64, 100, -18, 111, 101, 271, -51, 247, 346, 24, -11, 248, -154, 11, -72, 28, 6, 283, 14, 241, -215, 219, 250, -113, -96, 88, -96, -139, 85, 25, 204, -79, 63, -54, 193, 165, 1, -103, -110, -245, -133, 94, 205, 89, -36, 167, 76, 235, -6, 79, 79, 138, -124, -49, 145, -101, 137, 15, 149, -49, -40, -197, 244, -61, -138, 202, 40, -68, -230, -98, -197, 125, -71, -115, 307, -193, 54, 7, 59, -155, 180, 35, -52, 46, 12, 316, 63, 22, -103, 146, -9, 99, -167, 159, -12, 186, -134, -4, 44, -254, 6, -89, -154, 144, 109, 4, -159, -295, -59, -218, -23, 2, 94, -52, -93, 125, 185, -45, 86, -86, -446, -11, 167, -39, 4, 88, -244, 236, 22, -179]
2867a79OR6K21k41J92L2j22P7K1l42PJ62J07J63Kr3r1j52Q2J16q2N1l3M8L48m88
2893i2l5J55J00k43L01l46j15M83k17P4o9M2j19o5J8J37K2j59n5m6K13o3k0J15
2917A6K63j31j43o9K22j27J77m46m4K05M8j01K39l18L38q5J23k29q6L28j98k4
2939d2j52l5M11k00K51l32L24j12k27K49l08P9j2K58k63K35j29j82Q3K28j90p2
2961a38K03P5j78J38j91l26L92kk34L6K52j53K0J0j0J21J11k39N0K96k47k2n5
2984i1L39k51J7J91l5L5k61j95K89j20KJ90K01k85Q1j29q2J00J53kj13o5J35j09
3008ej21K76k28J53j04Kj25k07L67k3j6k07J98J39L5l69K84j25P6N9J52j99J26
3031A38j34j97L79r9j13r3LJ40K31l35M24l09k29q9K56j80L69k50R1m9j42J47
$$ y = [-179, -173, -77, 144, -97, 95, 127, 5, 82, 103, -239, -232, -70, 37, 200, 202, 109, 18, -134, -52, 64, -18, 33, 0, 48, 396, -92, -127, 28, 128, -115, 186, -160, -275, 208, -9, 65, -4, 38, -81, -146, -128, 9, 31, -128, -183, -229, -16, -79, -99, 16, 279, 148, 5, -64, 158, 31, 208, -238, -282, -77, -29, -130, 109, -209, 129, 44, 167, -62, -148, 180, -18, -42, -194, -229, 182, -18, 233, -99, 225, 113, -114, 135, -173, -94, -106, 152, -111, 124, -5, -187, -104, 124, -66, -138, 65, 140, -38, 100, -91, -417, -25, -27, -261, -225, 27, -126, -106, -96, -106, 15, 126, -113, -63, 233, -14, -36, -91, 248, -3, 14, 205, 170, 205, -56, -251, 38, -82, -80, 110, 311, 26, 107, -22, -104, -4, 149, 147, 34, -31, 104, -5, -126, 150, -78, 75, -29, -27, -152, -359, 8, -15, -31, -238, -40, 99, 134, -235, 49, -76, 0, 59, 211, 12, 138, 4, -193, 186, 87, -26, -119, -116, 24, 255, -80, 344, 35, -194, -283, -27, -207, 162, -88, 3, -46, -188, -41]
3053d1N6kJ34r4k78J32J09j42K24k06J82j03K09k34J03j03nJ32l03K83J5m6j79
3076a57K23J17k66J00j00L15j19k54Qj6p7J35K16j44j56K11Q8Kj39q3K21l61K37
3099AJ5P9n7K3K60l11ko4K0J13m4j29K78l8j84R3K5L3m04L38J22o1j11j70K02
3124B7K7O6j94Q3K24j79J2P0k47K7Lk34K08l3O2Q2J41k0m22J35o1L65k83q8N61
3149C32m4j60n4K78k36Nr8j3L0r8J88K8M1l63L02m47K60K28k29R1J2N1p3N7k15
3174a27J59Rj40L6K51o07L07K27j4j89J45p1J7K19k81J10NJ19n27L5K11J32o4
3197c8j35K61M5q6k29J66R5j52K44mj61J06j60K93J67o59K89j60NN8m9j55J12
3220a47R3M8K19m33L10j6R1j84q4K5J3k5q8L41k84K84k9k40O8j24J33L4r7n0m
$$ y = [-41, 15, 13, 147, 53, -225, -93, 16, -126, 98, -108, 74, -29, 180, -54, 49, -54, -59, 73, -230, 53, 68, 22, -157, 66, 183, -83, 17, -83, 232, 113, -141, -133, -149, -226, -91, 125, -19, -175, 36, 124, 126, -13, -96, 125, -236, 1, 16, 95, 38, 61, 321, 10, 8, -56, -36, 77, 33, -96, 182, 144, -40, 53, 78, 111, -293, 45, 167, 106, -5, -175, 27, 54, 120, -74, 9, 233, 54, 66, 136, -111, -84, -81, -315, -107, -140, -78, 4, 145, 125, -297, -162, -223, 142, -141, -229, 332, 288, 128, 74, 352, 116, 121, 23, 10, 40, -58, 130, 158, 199, -164, 138, -309, -49, 179, -50, 41, 53, 104, 31, 88, -127, 32, 41, -99, -63, 188, -419, -112, 115, 101, -88, 57, -14, 3, 222, -59, 51, 56, 175, -352, -317, -106, 26, -38, -173, 88, 133, 47, -182, -16, 79, -73, 171, 167, 6, 112, -48, 245, 412, -247, 42, -118, -113, -55, -104, -259, -147, -54, -6, 213, -220, 90, 74, 165, -19, -103, -78, -65, -90, -178, 163, -121, 163, 134, -106, -38, -162, -29, 5, -92, -142, -146]
3245a46k5m0L63k53O6j04j74L71r2M4J12o9k65L08j56O8J68j8o5P7l13J51j77
3268a69k04K39K04M6N9l3l13M09n00mL78j14P9j66J0J01O4jr1qQ4p8J44Mn1q5
3294Dk15P9J96M8k76k56O47l18K27k75L23k29J04j46j6K61r5K4j02n6j41K29o9
3317e2j92K06J93n7j40l7M2j31K77j45K9l9j48M10k47j3j5n7pJ13l0m1J21j68
3341a28L88k22J63m3l25R2o0m3l9K44r4J0J12k42K86j81J57k96J45O5p2P6J03
3364I6k48p4J72k3K8P0O9j47J9p0J54j22J67k71J78k6j88K79j2K2j11j24K20K32
3388B90k97NP1l5RL3J08l13L1m1J57k03Q0J02Np0J51n6J27m04K53K37k15J27l67
3413b15K53l6k60K39ol7o5L7J02L3O0N9k96L92l09j28M30m58L14l36L09j50J12
$$ y = [-146, -171, -211, 152, -101, -35, -139, -313, 58, -34, 10, 122, 53, -212, 96, -60, 8, 176, 158, 93, 170, -143, 8, -169, -373, -134, 70, 116, 175, 142, -171, 238, -262, -266, 112, -2, 77, -89, -79, 22, 86, 85, -6, -14, 70, -8, 136, 140, 89, 4, -211, -132, 64, 112, -164, -420, 227, -91, 136, -139, 184, -45, 59, -87, -103, 158, 63, 87, -15, -71, -212, 17, -52, -244, -38, 155, 98, -42, -79, -37, -168, 109, -36, -7, -46, -194, 216, -31, -44, -59, -116, -123, -10, -40, -81, 40, -128, 260, 38, 201, 158, -167, -75, -135, -178, -217, 27, -67, -57, 55, -187, 99, -82, 75, -221, -76, -11, -83, -7, 96, -152, -226, -54, -77, -49, 21, 90, -57, -38, -108, 46, -76, 91, -180, -2, -28, -216, 63, 51, 73, -38, -162, 58, 290, -7, -2, 69, 34, 43, 76, 184, -129, -98, -139, 18, -185, -105, -3, 2, -68, 83, 27, 154, -250, 3, 240, 25, 152, -215, 38, 2, -258, -19, -25, -62, -127, -90, 12, 45, 105, 164, -132, 260, -49, -177, 253, -205, 109, -227, 82, -68, 44]
3436D4P7k32K73j21M34m27j64M00m57J61M3M6q6l7k52P6K04%K24l05M5p9L1j11
3460b13K87r9l6P7J49k10j19J12L5J49l97J08K95k69l12O38k43J40k66J04J80
3481A10J50k15j51M9N9J75k50M2n6J71k31LJ30j5K4K59j20l86K26R2r5j41L30
3504A60j74k1J20j30K24m8j7j68J78j10J73j26L6o7K6j50k76K64j0K20k21J73
3526E6j00J92j42q2J08j13j03L83j93n9k15J69M9m3j06K43j82K23Nj52J20J0J6
3549H4Q7j85L32k29j90Rj7j6J97L7j96J45l6M2L7k10j5J76m03M8L02Q3j75K64
3573A71p4j79J35R8J7j27M4j23J26L9m94K11P1j71L32q3k4K22r5j41n0P8r7L2
3597h2JJ17r3J10J14j7n2J26k69J10l30K51OO4r0K85j72R2m02M13k04R1k0p7K20
$$ y = [44, 121, -111, 162, 41, 475, 48, -116, 284, -173, -12, 31, 77, -9, -46, -298, -222, -18, -18, 206, -99, -54, -133, -102, -213, 74, -25, -61, 16, 165, -45, -164, -52, -17, 132, -265, -157, 138, -131, -443, 195, -48, 92, -174, -70, 110, 260, 45, -106, -57, 2, 177, -73, -31, -87, 84, -147, -144, -14, -29, -5, 254, 134, -252, -26, 66, -29, -170, 160, -14, -35, 85, -45, 179, 131, 114, -54, 124, 14, 187, 61, 97, 30, 56, -94, -370, -106, -116, 104, -117, 56, -44, 148, 6, -76, 32, -81, -184, 199, 6, -53, -268, -99, -50, -93, -199, 44, -138, 85, 90, -62, 58, 68, 84, 171, -14, 318, 89, -101, -92, -109, -125, 72, 109, -87, 58, 22, 64, 101, -109, -124, 52, -351, -303, -1, 82, -93, 171, 97, -82, 53, 151, 168, 41, 85, -38, 88, 127, -367, -156, -85, -256, 76, -7, -31, 191, 96, -45, -95, -17, -114, -82, -81, 36, -57, 53, 167, 150, 98, 224, -45, 65, -265, -14, -8, 56, -34, 251, 79, 171, -231, 182, -22, 69, 49, -28, 192]
3622A92j53R1k47L09o4j25j72L17l5j76K13k71K43J42k23N3L43m46l7J49k33K05
3644G5p9L36n56L67P7k84J20k33K29j08J68l2k9k47J55K02j74k93L23l11K42J6
3666c6k30J99K02J60l55N3K2j04J73k35m8O5K02o1q5J57j97R0Q3j02n0J14j78
3689a61K35L4j30J1l8P0R6m8j75K70q8j19k87N33j24j0j81m3P1Q7K03k31K4p1
3713g2j39P7J9L7J01L7J93m46J09L2J78J0k09J59J55j70l23L91K55n57k7K31j58
3736a17P3J2j92L67j81K1J41l47L80j0k91L33r9j36J09j91J17K7M9j72K92k78
3758i3R9j93K67K0j34O8J24l2j85k0J21O6q2m4K26j11l09J61k0K03K87n76K27
3781G0J35J5j02k77J24J27k82L25j43JK52k14N2M4j74q1J87J55n31K49J36n0m09
$$ y = [192, 39, 130, -117, 192, 128, 3, -169, 148, 113, -63, 150, -121, 122, 264, 41, 94, 437, -9, -46, 103, -130, 75, -4, 332, -224, 143, 220, -64, 56, -177, 52, -56, 112, 80, 51, -196, -41, 161, -13, -306, 17, -294, -52, -36, -266, -67, 135, 295, -60, -7, 15, -89, 84, -151, -199, -134, 68, 7, -78, 79, -118, -28, 55, -47, -97, 17, -161, 74, 108, -22, -11, -49, 21, 117, 69, -106, 164, 76, -43, -330, 203, 79, 69, -112, -155, -84, 3, 206, -25, -1, -72, -211, -134, -115, -78, 23, 60, 253, -193, -84, -52, 126, 136, -73, 86, 241, 71, -252, 139, 394, -163, -190, 41, -117, -44, -32, -224, 143, -38, -17, 124, -223, 157, 147, -144, 189, 90, -46, 63, -128, -11, 16, 65, -107, 185, -93, 6, -187, 80, 100, -34, 34, 158, 126, -59, -79, 42, 108, 26, -18, 208, 97, -212, -51, -71, 132, 419, -157, 70, 205, 220, 118, -159, -35, 92, -190, 135, -8, -7, 245, 31, 83, 127, -47, -128, 59, 214, -317, -68, 68, 18, -391]
3804c91L10J90j42k12K42Q4k86N00l61l3J8j38M96l89K09p3k18O3M4q6M33m68
3826b08K40J19J36k03k13k5J71l3K17l0j91J76k61K10j79p5k9K09P1k40J3L9K85
3849A99r7J36k12k7M34m54r5J80K9k63J8J29j94P6K30j08K46q2m04N42j65j45
3871b7j02P5k9K15l35J17J85k68J23%j25J62j47R9K30k20R6o9l0J11j7m2n0q1
3895a29N1K8K99p5k95K62k51K39K6j60J88j81R4R9L4k98Q6j78J53l1N3n8j9m0
3919a03J41K84m62K23o5k71J58J18m7k8j73Q4j19L05j56j53L7J63M07m33N0J01
3941F1J05r4j70m8k86N14j79J58k49K49k4o2j38J9K20j77K31j49K04q4r5o3j75
3964b32K93J11r7j26L6l52M62j86Q4N4j39O0oJ49j99J20l56M59p6j43j76J92j54
$$ y = [-391, -81, 109, -33, -245, -3, 81, -205, 295, -66, -99, -81, -219, 277, -112, 97, 24, -194, -131, -87, -173, 260, -208, 32, 151, 287, 84, -129, -154, 17, -16, 201, 171, -20, 156, -105, 105, -74, -149, -178, 31, 102, -138, -125, -86, 199, 102, 238, 26, -1, 433, -21, -116, 64, 93, -170, -152, -23, -217, -141, 89, -19, 227, 145, -259, 283, 118, -27, -129, -54, -83, 132, -203, -86, 99, -169, -46, -46, -171, -9, -156, -57, 173, -47, 49, -20, -50, 61, 44, 2, -48, -129, -78, -50, 249, 174, -121, 141, -110, 129, 155, -5, 183, 2, 96, 195, 229, -69, 17, -161, -8, -39, 14, -44, -63, -103, 38, 322, -140, 83, 18, -253, -95, 23, -24, -52, -225, -141, -260, 45, -111, -264, -227, -64, 343, -90, -40, 61, 166, 72, -98, -146, -432, 82, -97, 61, -188, 61, 37, -25, -163, -144, 76, -101, 130, -19, 185, 101, 6, -57, -232, 61, 172, 75, -51, -15, -367, 95, -91, -7, 47, -92, -32, -38, 111, -88, 32, -324, 135, 59, -84, -260, -68, -222]
3987b22K90K07l42m2L2J37R2r6O6j11j84J41o8K25j03K15l48J25K01rj75k36J3
4010a92K01N0l11L86j90J72M5k96N02m63K79j51j7k0J58q2r2o4J84k4p1J05j01
4033HN4O0k80L88j67k40j76L05j83K12J45r9J42m24K75r6n2J45m8n4j28J47M8
4056a8q0k9p8M75l77J64O4q1qp3K1J63j87j79L80j47k72K2L23l34RL11l5j28L70
4081B76m72J80P6O1n4j47R3K07l92L05j83L99m32P5j2m49N94j29J6R4k81J45j49
4104a79J58k16Q8L08l91K37l07M23k3j23N2J20j60j2K52j98m8J18J3j64Q2j27
4126i7k09J89nM07k10K43l59r1K95j50O2J56l59l52N21k21L40j84K91j51j3k12
4148a09K30J51r6k78k16L32r7L27l87L27l87K76p9J5p8J86k20J51R2k79oJ23l8
$$ y = [-222, 68, 275, -67, -109, -77, 60, 152, 56, 122, 11, -173, -32, -100, 125, 22, 237, -111, 14, 215, 206, 31, -205, -192, 9, 59, -252, 134, -56, 116, 161, -135, 367, -96, 183, 32, 15, -5, 153, 71, -21, -85, 99, 75, 4, 109, 8, 62, 122, -158, 230, 63, -177, -353, -48, -231, -19, 126, 27, 169, -255, 20, -76, -128, 17, -31, -85, -213, -66, -18, -98, -127, -205, 270, -107, 57, 121, 40, 32, -41, -20, 143, -44, -223, 157, 10, -262, -240, 83, -251, -242, 69, 34, -94, 276, -196, -16, 60, 121, 67, -80, 13, 220, -172, 133, -50, 349, -83, -8, -20, -469, 125, -4, 12, 106, -175, -30, -179, -21, -237, -149, 159, -232, 5, -302, 121, 98, -25, 27, 147, -13, -25, 227, 29, -19, 99, 112, -52, 30, -97, -306, -117, -122, 285, 75, 318, -41, -132, 163, 13, 75, 231, -128, -480, 41, -180, 160, -24, 267, 116, 103, -109, 121, 272, 176, -102, -318, 14, -83, 244, -143, 184, -203, 73, -6, 9, -69, 117, -103, 48, 140, -139, -145, -22, -60]
4171f0k3J18J38nk96LK9M1q5rM9L7j90K66N4j09L09m58K53k77L22j54l14K82L25
4196B46m87K87k83J13K45l49N87m34NJ85k09J61k53J56N4L9L4M8q4J29k28M3L
4219Hj90R9k9K32k21L55l7j1k07J1k71L5p2L54J48j63j08k5J53k90J70P0k9J8
4243@k11J32J44j4o8P0O8k53k47L99J5J09j98p6J1M7K08n8j25J54l4k31L35k50
4267g3j35j67L82l4pk01l50O70k77J90j51J34r8J26mK00J2j08n0l06L02M0l08
4290b13K46k7k14J75k2l0Q7k02K97L0j97P4J23n3j70K68p3j64Kqp7K99l75L64
4314A40j43j0j04J64O4P9k70J0L62k66j15m6J12j04P6m7j69M41m50M23K2n1j35
4337a7K93l05J57l18R3K26j24K0j6j28J92j97K0K26R5k98RJ61j16K16k84J60L13
$$ y = [-60, -83, 35, 173, 168, -128, -125, -96, -55, -140, -149, -100, -63, -253, 13, 67, -42, 267, -191, 62, -215, 107, -47, -361, -79, 246, -241, 46, -237, -124, 121, -228, 359, -75, -70, 115, -94, 67, -186, -30, 24, 63, 97, 145, 61, 190, -38, 5, 8, -182, -83, -112, 120, -101, 254, 217, 206, -1, 10, -261, -226, -298, 56, 204, 41, -67, -92, 61, -229, -59, 11, -18, 0, -211, -79, 65, 51, -17, 53, 121, -132, -379, 20, 35, 144, -54, -130, -119, -72, 136, 78, -47, 107, 73, -158, 177, -73, -208, -375, 7, -27, -34, -235, -585, 85, -192, -2, -153, -19, -117, 9, 5, 205, 217, 109, 59, -247, 55, 95, -213, 33, 6, -208, -33, -55, -85, 2, -200, 97, 127, -70, 4, 127, 74, -96, 172, 99, -65, -63, -71, -148, 151, -224, 140, -3, -13, -117, 47, 111, 190, -80, -70, 292, 26, -89, -135, -23, -127, -51, -98, -267, 174, -276, 147, 169, 118, -17, 276, -29, 128, -190, -97, 129, 5, 25, 9, -119, 73, -124, -104, 122, 217, -81, -72, 89, -27, 189, -95, 65, 378]
4360C78n01J49k09L74M3k16k45r7M53k29J96m0p2q2J38O0l41J87j2J91n9j71J08
4383CK8J43K7j2q0k38J80j63L18j80k9K7nj2k01J72J0J6J86J97m41K79r9k34M48
4408C40n40J32L0mj8J8M0k6k00R0K38l44L53l79P0K09o8J09j26J51R1k82K96j30
4432E0p1J0o1MP8M2l8J63l48n2M89k61p3K55j01J04k14R3N6k21p2q1K34L19m51
4457a47M3j75K12J18M5k57L10m6n9j11kL70l61k3l6j50mQ1K69k32q8K45m9P8j27
4482i6j8K72j59r0k72N37m65K11p4O8J28l68L43P0l77L21k6J78j4m09J17K58R1
4505B26J1K3l46J34j14l12N67k49k26J75q3K48j07k19K02L9P4j86J84K58j35l07
4527a43J09K68n5l01J46k59J02N4K10j68k80L42Q2l4j10j47L05J9k33J04j83K12
$$ y = [378, -123, 26, -183, 191, 234, 18, -227, -324, 129, -100, 96, 56, -16, -98, 40, 100, -241, -54, -66, 125, 66, -105, 3, 31, 174, 201, 189, 109, -129, 51, -112, 206, 26, -3, 24, 19, 7, -194, -22, -12, 4, 190, 387, -54, 225, 126, -108, 340, -200, -68, -38, -42, -60, -42, -2, -28, -228, -138, 100, -244, 109, -270, -200, 9, -59, 50, -76, 75, 166, -116, 180, 50, -21, -11, -72, -68, 10, 52, 14, 177, -171, -223, 266, 5, -68, 187, 86, 190, -24, 69, 125, -96, -168, -249, -15, 304, -147, -104, -279, -67, 51, 96, -161, 149, 103, 44, -67, -69, 301, -60, -83, -119, -269, -273, -192, 77, -155, -243, 2, -47, 31, -96, -114, 158, -1, -91, -363, 174, -291, -80, -154, -86, 42, -326, 17, 87, -290, 31, 5, 183, 169, -240, -123, 135, 226, 237, 260, -86, 48, -66, -378, 189, -60, -286, -111, -194, 54, -53, -272, -70, -31, 43, -143, 41, 299, 164, -143, -34, 234, 179, -122, 24, -235, -133, -79, 131, -37, -317, 25, 107, 73, -37, -184, 121, 140, -93, 11, -172, 40]
4549D0q8J33l37jL11k2k35K75j03J49j93J07j49J04o4J54k30L05j21j37J10j2
4571dN1j10J36j52K2o3k3n1q3K07j39P9K16j46Q8P8n2n8l7K06j20K9j0K10l96
4596a22L9J08j32j68M71l98L15k04J5K83o7n2l53K85M2j30q1J23j80K23l16L77
4618G8k84K34p3L9k01M14k51o0K48k26K67k33o3Q3j06J18j42K73o0p7J29q7K70
4641B90J04n43p0L16l21K62j34OL9L49k66K00l05K98l23P2N7r7J79o1K39j39j88
4664c6qQ5p9q4K69J7k46Qj88M18k94M1J16J07j36R6j78j98J03L70o2J64k47Jn3
4689a4l1K8q2M29j95j96J2q5K56l42K8J29K73k35o5J77j88J53O7j91J4J22j54
4712i0J04k41M03k91K10r5l5r1M14m79K84l0j22M1r4J61l49P3J49o1k50J60M14
$$ y = [40, -48, 85, -252, -253, 58, 36, -199, 76, -27, 122, -71, 36, -113, -9, -73, 81, -149, 156, 35, -102, 8, -4, 47, -63, 73, -79, -57, -120, -143, -194, -277, -70, -209, -130, 86, -60, 28, 106, 54, -4, -41, 165, 45, 74, 64, 274, -122, -83, 25, -107, -275, 196, -202, 113, -91, -76, 207, 140, 88, -265, 20, 62, -68, -149, -26, -206, 17, -299, 78, -206, 28, -45, -6, -207, 207, -44, -104, 144, -82, 185, -48, -111, -28, -134, -16, -158, 115, 55, -22, 107, 20, 290, 394, -149, -219, 97, -224, 38, -96, -90, -51, 298, 32, 232, -73, 225, -98, -26, 31, -66, 113, 52, 291, 152, -36, -44, 41, -38, -122, 147, 164, -82, -74, -262, 156, -138, -97, 19, 126, -10, 86, -92, -290, -187, 183, 121, 285, 38, 39, -14, -45, -17, -99, 330, 135, -61, -49, -134, 122, -220, -192, -63, 210, -25, -90, 87, -101, 52, 119, -72, -58, 64, -90, 14, -227, 176, -115, 95, 0, -35, -126, 288, -191, 93, 63, -59, -18, -112, 49, -300, -227, -78, -139, -389, -229, 185]
4735A85m81J35O4j1K28k92qK13k34K82k51J69J11n1j5P8j72Km1j61J58K71n0n3
4759G6l34J37J53O8k34L52p5Rj3j57N6j12L22j41o9j31j50J74K01r9l6k2o6k9
4783a20J94k51L98j67M6L7N6k17pq7k98N67o9j96J81j24j07O0M9R1k62K66J9l12
4807b53l3L53J34k40J30k98K94k16L71k75K41k64K2J25j54K95j84j87J92N7K1
4828A31j29j4J40l19L63m38Q5J48j82K99o2k46M85j48j83J84Q0j36k11l6J52K18
4850A81k10K65l17K24k31L1L05j49qp7Nj72J58JJ45j7k19j31J26J26j33rj03J32
4874g7m8J03j26P1p1K67qK8R0k96J92j39l66M80j29j79J76q2J22j74J65K23j25
4897I7r2j4J73k3n7p1J75l87K5L35j6j87J19p6L10k03J3l52K71m2j74J87j08P1
$$ y = [185, -296, -161, -97, -108, 120, -172, -180, 33, -201, 81, -170, -1, 110, 59, 44, 122, -50, -48, -89, -250, -92, 179, 129, 76, -258, -121, 32, 100, -134, 218, 143, 152, 139, -18, 38, -74, 248, 107, 38, -93, -243, -69, 132, 33, -3, -25, -91, -120, 74, -177, 221, 54, 100, 137, 193, -24, -31, -118, -416, 151, 82, -114, 67, -57, -164, -104, -55, 36, -226, 40, 59, -253, -286, 67, 201, -39, 91, -207, 87, -129, 242, -33, 208, -56, -34, 91, -63, 232, 48, -139, 53, 110, 131, 2, -12, 128, -191, 172, -266, -181, -33, -215, 84, 22, -224, 261, 113, -70, 114, 194, 58, -153, -189, -37, 181, -29, 236, -81, 143, -88, -57, 248, 99, 91, 14, 19, -153, 5, 6, 151, 134, -85, -216, -90, 36, -97, -106, -209, -77, -125, -22, -148, -77, -148, 119, 111, 139, 229, -67, 125, -14, -380, 100, -29, -208, -32, -114, 8, -166, -1, 222, 97, 5, -9, 164, 141, 84, 13, 188, -199, -174, 161, 145, -42, 77, 1, 311, 108, 121, -231, 40, -2, -176, 11, -97, -26]
4921b6J8n6K30k09n5j92N39j79r9Q0mjn3l28M86m2r5q8K35j0j01Q4j52J37n0k06
4947a37N26o0m13L10M6j99q6n1J27k64J28K31l84J41p8K88J5Pl1j64J57k85J73
4970ck0K0j31J05N6q8J5j95L78l96L12j68n9Q2L7L56l65L7Q8K54k48l04N28p1
4994B20m83L26j11Q9m7o2J78j18J25j65j15N0o7J96k12J39K03p0M1k30j49J00
5016a62K04J12l97J24Q7L1K33l01J63r5N0k2q6K30K0j48j25K80l72L9N8J00L04
5039C27K4l60J22r2k22J68p3M9P2K43m46L69J12k24P4k21N7L38k68k50K51L4q
5062G6k07J26j27K86J05m68K7L14l84Nqm1L51j09J91j21J12k85K59k22R8k07L13
5085H4J40k8j15o7j79K13P1l18o4J32J0K4L73m70J14M3Q9J83k3j30q0J39o8l7
$$ y = [-26, -8, -64, 166, -43, -98, -290, 249, 70, -29, 51, 47, 46, -7, -335, 151, 109, 14, -74, 161, 151, 50, 134, -18, 119, 69, -137, 389, 329, -84, 226, 272, 73, -13, -64, 63, -201, -73, 158, -226, -85, -163, 125, 140, 147, 116, -48, 109, -176, -3, -23, -3, -134, -29, 27, -61, -46, -241, 137, -259, 53, -115, -174, -92, -55, 301, -64, -27, 61, 315, 67, -237, 291, 220, -263, 63, -48, 41, -6, -68, 110, -8, 117, -48, -163, -113, -180, 16, -196, -57, 146, 76, 117, -113, -262, -162, 42, 154, -243, -119, -32, -1, 232, -69, 94, -1, 49, 27, -59, 171, 191, 43, -82, 198, -174, -135, -77, 23, 327, 351, -9, 113, 21, -201, -33, -106, -57, 15, 258, -188, 181, 293, 69, 143, -78, -21, 317, 49, -201, 50, 84, 76, -131, -5, -132, 154, 259, -209, -182, 132, -252, -247, -255, -296, 55, -54, 137, 16, 128, -157, 102, -120, -22, -229, 84, 224, 196, 81, 14, -165, 48, 119, -199, -263, -131, -121, -97, 276, -194, -80, -37, 52, 235, 212, 82, 2, 141, 73, 36]
5109C6J83k60J66k02j64J26L04m2j44j12J54j75J18j2M3j6p7J68k11K42m2kl00
5132b19P2J15J92o6k85L27j93K66j68j21k4L7r3l1P2P5r9L09P1l64J31J62j8j1
5156A37j27j01l57M93NK46k83k20K81l25M30m33M01j32J37l80M25j85J01j06o7
5177f0J84k0j87J28M8J38j65m97M07j11j59m3M07l39J94q3K89l65L24J2j22p2
5199i2J00J93r4M1n2L6M5l6k57J29J52j79r2oj95M30l35J62N8J49j01n7j9J42
5223A22l81K54R9j18N3j43K83l12K75j04J12k56J43j3j86O6r9N5L17j41J6l9r2
5246h9J76k10p6K39k74J32j12K88l18J28j3L73j74L1J08o8j59o5R0k15k49R60
5268E03l64k26N6po1Q2j5j6l60M34l2K30l88rK83j53K4j22J26l9L6J47l39M15
$$ y = [36, 219, -41, 125, -77, -241, -115, 189, 147, 3, -109, 45, -130, -12, -24, 19, 3, -74, 94, -117, 125, 83, 81, -219, -147, -32, 160, 94, -191, 136, -57, 209, 41, -80, -104, -67, -160, -191, -119, -44, -143, 166, 237, -127, 4, 166, 148, 137, 10, -91, -448, 45, 50, 296, 13, -207, 74, -251, 179, -254, 147, 15, 152, -228, 197, 12, 113, 7, -60, 124, 104, -83, 45, 93, 231, 66, -431, -24, -135, -294, -337, 70, -269, -75, -158, 131, -234, 90, 102, -20, -92, 8, 201, 107, 148, 96, 132, 177, 141, -116, 13, 165, -14, -106, -112, -307, 123, -212, -50, 8, 157, 56, -1, -20, 122, -259, -5, 94, -24, 29, -114, 169, -143, 132, 28, 140, -116, 27, 14, -172, -106, -205, -150, 167, 26, 42, 3, -89, 87, -123, -199, 40, -234, -102, -214, 74, -244, -116, -129, 244, 70, 101, 209, 141, -18, -83, 7, -208, -457, 503, 139, -87, -31, -38, -99, -17, -32, -48, -408, 26, -6, 224, -164, -173, 110, -43, -19, -141, -15, -54, -18, 129, -210, 205]
5292B05k50N4nn4l5J21K3j97J75m2J67l89K30L6pk6l48K25j98J59J41K21M0k66
5316b0K58l82J79P5l03K90J07l09q3M05pN4j72n19O54k16kQ2r8j55oK13k30J8
5340a67N4J07K38m60Q3M16j65m10L54Jj44j12o1L36J6k41J66M9j38K40n6k28J3
5363a09J44p0J40Jp8j77J65qpj4q6J26j71K05j81K40Nk78J40j59L26j22N4j6l81
5388c11L15K1R5k47J56M7j14L49m01L67l22l4L9jK19M4k26P5o2Q8K63m17P4k21
5412b04N3j44M33J22j56O5q6N5J36k25j33K5l3j16L51J2j69R4j33n7k10K55j3
5435g8K21j37o8P7l6j92J87j95N0j5J86j53L45k26p5J18P2j05J77M8k21J37O8
5458A85l16K44j35K04j44n6K9m4K7j38J78j44L00j60K9j64K7K7j03J93j05K27
$$ y = [205, -45, 9, 4, -50, -85, 36, 59, -138, 37, -5, 162, -227, 3, 39, 32, 6, -342, -117, -315, -156, -15, 206, 246, -20, 238, -144, 35, 110, -193, 97, 204, -105, -188, 217, 210, 264, 92, -427, 227, 11, 9, 91, -7, -162, -168, 45, -185, -167, -113, -6, 232, -228, -145, 271, 106, -304, 50, 51, -93, -205, -266, 70, 86, -155, 11, 60, -78, 162, 106, -122, -109, 35, -35, 105, 106, 28, -149, 16, 8, 1, -13, -99, 27, -144, 61, -120, 120, 125, -153, -13, -172, 154, 32, 86, 70, -311, 4, 25, 120, -127, 29, 76, -38, 311, -90, 277, -45, -79, -40, -41, 178, 222, -4, 71, 9, 97, 360, -57, 17, -204, -151, -295, 138, 260, 104, 169, 83, 138, 274, 49, -84, -59, -92, -208, 143, 155, -14, 80, -53, -110, -320, -65, -78, 143, 6, -62, 15, -21, -213, -26, -221, -171, -186, 0, -153, 192, -34, -109, 9, 81, -24, 153, 201, -20, 117, 185, -131, 113, -22, 182, 38, -18, 11, -33, -6, -144, 34, -110, 190, 30, 59, -105, -78, -51, -154, 39, -66, 161]
5480A61L5k05J25j60J69j42ql9R5k3Q9l5k10K18K88m26j41L39L23k78k78J61j8
5503D0j51ML4Q9k3o1k7K02j03j44K62j32J44j17j21J57k05J89J75l22L54l31J09
5526B2O6j13L23nq2j06M56l99j67k13J06J40j65L1K57j47K5O9o1j12K51l8j9j44
5550b5M6J13o6O8j95L7j10J05r7K41l10K91j50J59k20l5L37j97j5K0j30J96m1
5573B2n5J31J05J6m13K38r8q8r6L37N5j04oK5j11PJ86L30o86L62L9k14J8j7j27
5598a44%n9J72q1O1K13k37K38Q8m12o3L60K73m43rk3N9J01k2J28q1n5pj76J36
5623A7K6J28J51l04M14m55j41O01o52K87L87l90L4j64J9K01j17r1j32K21L06m55
5645a09N6N8j04j18M80j74l08J82L18j10jJ46m39P2k55L16q3K32pj91q1J5J72
$$ y = [161, 196, -9, 116, -44, 125, -17, -25, -64, 31, 8, 97, 62, -148, 70, 358, -68, -209, 130, 453, 175, -103, 58, 40, -111, -107, -73, 16, -7, -68, -95, 107, 4, -140, 122, -10, 134, 17, -104, 53, -152, 37, 212, -110, 244, -87, 22, 88, -25, 298, 293, 211, 105, 561, 162, -5, -218, -112, 28, -137, -106, 151, 4, 29, 98, 37, -75, 176, 138, 119, -25, 21, 134, 68, 136, -59, -22, -132, -27, -124, 117, -193, 98, -52, 107, -113, -148, 189, -8, -23, -3, -133, 63, 22, -33, 98, 203, 219, -194, 44, -54, -142, -238, 99, 154, 50, 44, 69, -42, -35, 151, 481, -205, 157, 196, -18, 0, -17, -144, -144, -203, -31, -112, -51, 162, -75, 163, 251, -161, -224, 136, 409, -34, -43, -66, -7, 94, 72, 200, 119, 64, 57, -119, 17, 43, 171, 322, 18, 432, -23, -164, 437, -215, 72, 459, 69, 103, -61, -42, 159, 42, -49, -181, 40, 346, -109, -53, 5, -99, -217, 263, 89, -219, -37, 281, 171, 170, 316, -123, -51, -306, 10, -73, 159, 152, -39, -120, -105, 67]
5668F7k13J32N7J60j61k52R0p4J84k8O4k79J05K99k5q6k7m7L4o5J69rL8k16k13
5693b96L71j33M2J04q7m9K68l45q6Q8J43r1k51K15L3J66k14p4P0O4J07R9m08M01
5717A37l63J51L12k17l53L28N4J44m07L63j1j86O5k76L52J5K5Q4j21j57J49j11
5739b3J1J01qJ14j83J22P3j4m93J69K32p5L9K7k4j11J61L7R1m49J49J83j06j68
5763a45J45J80k96K02n2l42N14Mo0r4J44j20n7j86K21m1q5k20J98p0L81j16J75
5786B80m30K78k31K19J91m58J45j52N08l57m2j91L15j87L51k00j07L97k16k23
5806a10p2K55l90K80j14L51j95k28J59M0J7j20J51J48J2j94q1K20j4r5j97J35
5828d2J72k37L8k2N7j14J92j36Q1k9l35J61L2K07L41m17m1JJ37Q3j80j88K00Q4
$$ y = [67, -146, -14, 43, 203, 42, -210, -120, -194, -10, -38, 26, -253, -148, 151, 126, 40, 13, -34, 0, -65, 104, 95, 133, -83, -296, 75, -58, -16, 88, 1, -48, 220, -125, -211, -123, 20, -71, -322, -107, -74, 92, -122, -196, -126, -62, 45, 144, -264, 137, -226, -75, 237, 20, -333, -5, 49, 193, -214, 149, 138, -48, 17, -259, 93, 108, 133, 217, 96, -61, 88, -23, -12, 89, 81, 195, 12, 134, 207, 193, -300, -131, 101, 26, 65, 92, 68, -43, 118, 155, 246, -203, -54, 129, 23, -145, 0, 180, -116, 86, 34, -308, 206, 210, 150, 56, 200, 80, 23, -163, 58, 17, -68, -288, -90, -160, 221, 105, 280, -150, 128, -103, 116, 307, -151, -6, -158, 350, -7, -49, -240, 75, -112, 239, 39, -68, 329, 113, -110, -182, 73, -317, -37, -151, 200, 5, -223, -64, -24, -7, -127, 24, 172, 184, -10, -91, 129, 115, 20, -177, -42, 130, -107, -69, -91, -34, -148, 44, -92, -11, -40, -375, -214, -182, 25, 366, -51, -92, -91, 46, 129, -51, -239, -39, 45]
5852D5k9J67k92j30J2L17k74K02N7j95K07Jl37K43q4L42j05p5j4j99J14r5J24
5875Bk9L2r2n8K37j80L48o9k29J44nj8J61l97L44j35m5K3kk00J11j7K01J42K5
5900B94l83lr9K20j05K56rk29J47J41j72j47l3M7j1R9q2J02J1J66j49k15J63J67
5924A76j13j72K16j32J21j15qJ77j26J02m02K99j49O6J86k37P6j1K4k8Q4K4R2
5947A50j03k04N30l61kM2O1nj30p2J34l9M7l6l1J55l4j94j4N6n6J67l7p5K42j46
5973D5j48p7M6J71o6P2j51L5Q1l2J69j97n7L87Jr6k72J77m8L6J62m56j6J92K3
5998a9Q4N8kl0J69l23pL62j92j59L6K78l06o6j08P5K59k20K83K9k89R6k36J25
6022a03K17j92NK55n9J60k52l7L6k10J52K31r7k87j35J54J39k35J38J58n2L79
$$ y = [45, 16, 183, -109, -239, -227, 90, -184, 18, 75, -120, 87, 88, -249, -6, -90, 252, 147, 72, 58, -141, -27, -122, 2, -27, 5, -87, -145, 92, -88, 260, 191, -38, 106, 101, 83, 244, -153, 191, 56, 11, 34, 32, -168, -57, -74, 127, 269, 294, -89, -92, -191, 29, -76, 180, 171, -58, 89, 230, 58, -89, -122, -75, -86, 13, -69, 33, 44, 210, 61, -154, 9, 176, 63, -109, 107, -25, 96, -19, -27, 150, 24, 126, -276, 23, -126, -60, 126, -111, -35, -46, -22, -50, 34, 58, 150, 47, -157, 373, 12, 10, 52, 113, 108, -22, -94, 40, 1, 48, 12, -19, 136, 102, -92, -106, -50, -106, 61, 24, -51, 191, 45, -103, -180, -134, 37, -29, 43, -108, -73, 8, -24, 145, -52, -109, 278, 279, 183, -89, 88, 40, 76, 238, -218, -234, -42, -19, 65, 123, 121, 91, 260, -63, -70, 292, 100, -59, -23, 255, -51, -117, -225, -150, 109, -111, 172, 201, -88, 8, -228, -103, 114, -78, -73, 182, 123, 283, 31, -6, 30, -180, -28, 203, 106, -181, -316, -162, -23, -258, -120, 38, -14, 365]
6044C65k10j69J60j04P9o0o3K56l33J21O1j22J6R5j39K72j96j64K36P4k01k20
6066b46L06l91K37J46n8J64k32R3J51l37J0L0J74k05J33J77j65oJ49n0o3q2J92
6089A27j11j35K57k78J72j21j36K08M6j18q9R1k7O8J21M6r1j2J02j70M4m9m0K30
6113A35o4j80M4k1n9L04K0n6O7k38q2J08J37N5l9K0r4J27Q4k97j62J74N5L1N5
6138A24n31O14k32L5l1J3j83L6K68k70K59k74j04K51K37j85K34l56K13K42j10
6159B50k46j71L83j05o6O0j75L05l58K01k02L52l05l3K12P1k16J14k13J64j32
6180a10K47j03o0J02o0n2N0M3p2J6j39J81R8j13m0J20O7k83J21j76J12K28l10
6203a33j7K16o4L6q2j40J87l29K24J57l23L86k6j95K78q3k31M03q9l82K18lo0
$$ y = [365, 155, -14, 146, 42, 121, 61, -2, 254, -79, 42, 103, -19, -3, 92, -47, 225, 29, -135, 101, 175, -26, -246, 60, -331, -94, 52, -6, 158, -74, 19, 170, -167, -157, -127, 47, -158, -25, 152, -13, -19, 130, 80, 17, -65, 127, 16, -119, 138, -140, 32, -89, -225, -17, 29, -89, -178, -87, -114, -46, 75, 121, 30, 18, 120, -50, -6, -55, -95, 135, 71, -109, -65, -86, -145, 159, 179, 123, 190, -48, -130, -22, 115, 170, 131, 151, 57, 184, 268, -29, -191, -17, 38, 69, 124, -407, 207, -25, 10, -21, -8, -191, -155, 113, -157, 102, -172, -276, -25, 212, 27, 261, -95, 118, 360, 250, 4, -167, 216, 111, 45, 105, -70, 235, -123, 78, -124, 228, -77, -110, 102, 173, -43, 71, -142, 22, -110, 137, 34, -26, 76, 16, -36, 14, 57, -15, 1, -138, 43, 141, 28, -12, 108, 175, -108, 13, -163, -51, 177, -133, -150, 66, 2, 38, -44, -184, 3, -326, -102, 55, -268, 118, 92, -103, 175, 92, -139, 264, 175, -207, 11, 8, -52]
6226e2J52l60M50j33J17Q8j83n2J8p8j8J50j36Lj73k5K91K2Oj10K10j04j94K48
6250A37j8j06N2j19K85k23j27L92l62K37K2Q0k42Q4j43%K45j33k80J19J6j42K36
6273A0m3K2J51l57qL55k62K90k42J65j04K09p1j86M5J72k58J12j28j91L07j36
6295a48J18k01L08j4j69L06p5l8k55N8L24k86K45N4k8k86K34k05R8o0J85j38k06
6318a79j00L29N0l32J82K85l30L34q5j44q8j42K71j4j3rj9j08m9l50M76J9j04
6341a20K01j18M5K98k19m3j74q2L8M5M12k19J8k12J83j1P0J3L0j5k61J52l8R8
6365I1k97L79l57J83L4j5M5O5k81k4K24J21m47L88j66m32N27qJ03K89l31j64p8
6388a51K29j15l05K07O3L10k59k48L83j39Q7n2J17M0l9l9j45J12p6j40L1P7j16
$$ y = [-52, 100, -260, 190, 57, 174, 262, 79, 27, 45, -33, -51, 99, -37, -34, -207, -232, 59, 81, 87, -23, 187, 83, -111, 137, 119, 13, 65, -54, 231, 8, -119, 273, -89, 148, 170, 250, 8, 92, -51, -51, 194, 61, -219, -100, -84, -226, 10, -33, -11, 140, -217, -225, 130, -132, 158, -84, 81, -23, 186, 115, -71, -26, 146, -112, 0, -128, -319, -12, -148, -30, -231, 77, 63, -106, 200, 125, 87, -168, -110, 214, -72, 173, 227, 199, -87, 147, -58, 40, -20, 165, 27, -179, -279, 50, 100, -232, -50, 235, -95, 239, 154, 10, -78, -220, 51, 37, 24, 15, -4, -112, -161, -511, -35, -16, -120, 81, -37, 8, 306, 87, 44, -130, -212, -174, -129, 283, 64, 82, -130, 53, 42, 112, 125, 155, 140, -121, 31, -7, 91, -206, 173, -184, -1, 33, 18, 63, 128, -153, -177, 47, 168, -279, 109, -57, -489, 38, 30, 133, 422, 91, -73, -151, 78, -37, -342, -135, -72, 238, -21, -269, 114, -25, 62, 10, 127, 167, 128, 89, -56, 56, -20, -160, -129, -52, -168]
6411a68Q1Q9K09n2k61K14m5n7R7J55k13p5L28k00m66K93J96l1J55k64k37K92O1
6434A01j87L3J73l03J99Q3j52J22o8J06l1j56J31j18P3R9j29R3o4m5m1j65L43
6457I7J45j90j30q9M8R0J69k73j17K04j9j17L62k01J74k49J50Jj53rk09M25j43
6480c4J73O0j80J04n5q1R6K19m08M38j20k61K84j48k82J85J87J91o59J83K01p9
6502A4l2R1k61K96R6l16L55j69J1L5K3o4j44M1J57k03J41J28k52K97o08K37K39
6525A12K4l42J52K55k62%L4L4K23m04m1Q3L29l29M11j39m1M7j48R1k17K14k4q4
6549b2K25m08M24j70L5j60N7j8J73j9p9j6K25l08oL55l27L07l33pJ90l14J07J54
6573F5O5r4O1K42k59J5J1k38R4J83j95L9k18J25N42l45l92L95j59O8j2N7j77J61
$$ y = [-168, -87, 2, 211, 159, -102, 112, 67, 10, 107, 262, 49, -26, 302, 102, -364, -71, 125, 94, 249, -15, -252, 40, 101, -86, -53, 120, -183, 16, 99, -53, 69, 1, 107, 76, -80, 51, -67, 6, 105, -24, 69, 5, -40, -81, -246, 97, 242, 52, -78, -167, -119, -29, 140, -133, -250, -46, -65, -182, 180, -21, 153, -96, 54, 55, -98, -107, -316, 109, -34, 139, 199, 19, 123, 68, -13, 83, 302, -106, 332, 212, -49, 235, 87, -195, -10, 177, 368, -291, -108, 93, 14, -18, 73, -188, 108, 204, -112, 243, 74, 85, 120, 143, 79, -65, -24, 133, -70, 71, 199, -53, 244, -364, -127, 112, 136, -206, -54, 201, -61, -61, -27, 7, 230, -174, -215, -132, 197, -132, 279, 140, 99, 146, -2, 89, -128, 86, 62, -22, 203, -205, 219, 49, 84, -76, -19, -37, 136, 117, 38, 22, 247, -61, -67, 288, -39, 268, -65, -72, 118, -196, -89, 65, 130, 36, 97, 339, 80, 95, 106, -132, -38, 145, -50, -11, -229, -104, 438, 93, -299, 96, -63, 5, -7, 50, -127, 34]
6597C4j69K73l07K52k30m9J15J47q6rK15m63R6J5L60p6n8Oj44JP5j00J44jJ8J92
6623B51k67j69Q9K04l4K8oo9J52j80pJ66L4j00j8k6K29j52j31Q5M6j83K9J12J45
6648B28n8k66r0J99j30J12J44k63K4J45LK4o0K66pl05Jj81o9K39K59k79J17j58
6672a05P7K19j77J26M7j57o6L8j38kN4m6K80p2k18J41K17k01R8J24l46J16l87
6695c78M22j48P1j3r7L14l7n03L74P6j40n3j61L71j7j46Rj1N3j52K51k56J83j8
6719fj31j66L13J17j03j36K06l4Q4j32J2Q7k10N2k7J61j20j4m2P8j26L23j83O3
6743F6j03l4L8N9L54n07q3N20n12J38K70r7j82L44k02j39L23k50P2p6j73L00L0
6766A56q3m28K64K24K7j12k6J42m9l00K51K3j19j03O8L28k30k23J34J66n0m36
$$ y = [34, -135, 138, -169, 83, -147, -196, -81, 66, -20, -29, 186, -277, -181, -166, 194, 118, 60, 66, -78, -77, -2, -102, 42, 41, 59, 251, -16, -185, -96, 108, 74, 102, 96, 27, 179, -1, -8, 158, 192, 92, 74, 48, 277, 125, -6, 79, 125, -58, -29, 83, 228, 170, -96, -186, 13, -117, -5, 139, -124, -100, 45, 48, 72, 12, 278, 271, -34, -33, -214, -283, -44, 215, -64, 53, -105, -28, 191, 14, 140, 187, 30, -36, 2, -136, -138, -84, -130, 150, 78, -140, 1, 218, 17, 115, 239, -107, 9, -378, 44, -104, -33, -46, -143, 171, 134, -369, 5, 81, -59, -112, -273, 98, 81, -65, -56, -67, -14, -166, 85, -171, 12, -6, -137, -303, 10, 127, 24, -112, 94, 60, 144, 12, 24, 111, -99, -47, -74, 87, -33, -47, -89, -11, -137, 186, 3, 66, -37, -71, -33, 26, 380, -127, -210, 310, -202, -64, 206, 109, -73, 271, 69, -70, 253, 3, 75, -1, -174, 126, 156, 73, -355, -91, 133, 160, 48, 22, 164, 115, -185, 66, 89, -30, -133, -65, 263, 33, -190, -56, 110, 60, -376]
6788c76K53J76J65k30M67nl09o0j46K3K60j59j13j69L03L7l98L30j97J30n2k3
6810i3O0Rq4J31j9r0M5k33L35k20K58R2N5pk02KJ01k24j69N4K53j81K96k56J7
6835g0K84j43Q6l8O8k54J62l60J40L71l49R7J22Lk76J02P4j14k52J20K16k73N06
6858B22p0m78L50l18K50l9Q9j98j72M47j31j58K6J67j37K21j13q9J89j11o5J29
6880A1k6O4j35m4J9O2j05K56l8r4l8l8L44j87n5l6J01j00L21k55M9O2q6R8M8r4
6906A04r9k04O1L13j78k10n7J79j40J76l2K88m36O92l16k93R2M60m92M7o0r8O
6929a97L20r5m9j94K42J02m59K96O8L0J84k51K53k04j97J06j66J83J34J87j50
6950A43j10l55K57J12k00L18j21k3j19r6K44r3K2J52j00q9o4R2J59N8J6j28p9
$$ y = [-376, -123, 53, 218, -12, 455, 450, 141, 81, -65, -42, 218, 59, -54, -223, 80, 117, -281, 49, -148, -18, -70, -93, -33, -24, -108, 23, 4, -86, -41, -274, 61, -159, 99, 191, 246, 239, 37, 39, 140, -84, -253, -199, 54, -127, 169, -87, -70, 214, 71, 157, 119, 187, -67, 95, -265, -125, 246, -103, -6, 116, 119, -157, -55, 19, -95, -347, -227, -11, -284, 222, 152, -326, 24, -294, -44, -83, 6, -192, -364, 83, -48, -206, -180, -13, -150, 71, -42, -131, 58, -53, -118, 11, -15, 49, -86, -130, -111, -49, -154, 102, 64, -30, -68, -106, 238, 51, -4, -40, 61, -39, 282, 27, 76, 138, 52, 150, 198, 104, 5, -199, -138, 175, -3, -213, -270, -91, -231, -55, -87, 201, -235, 457, 141, -152, -60, 400, -92, -45, -105, -203, -197, 123, 28, -21, -215, 27, 129, -330, -34, 34, 64, 248, -3, 250, 46, -151, -45, -211, -28, 106, 293, 143, 33, -322, -65, 47, -153, 165, 44, 21, -98, -194, 50, -43, -21, 131, 31, -58, -122, -30, 129, 187, 203, 75, -4]
6973dlj30K97k07K13o66Q68k25k39J61J75j36k02r5KJ27J9l1J13j82k30l0K07
6996a98K36j3L1J30k76J95l13o7J93r0J93J0M0J09n1k71L50l19O4N2k11J72O5
7019C1K27k51j60L56j66J71j78n1q2J55m07L29K58m21P2j28L10J23j50mJ11K7
7041A72l95K7K39L24l42QnM1nO4l07O3J9K0k30M98j99L40j10j29l1l13K7P1J68
7066A5n4K34j22M7l59N83m33J96r0j44j30N38k87K4K0j49L02k00k04J26l1oL62
7089B38l80q5K69J71k84k10L90N8K3k35j25p6J29K35j09r5Oj01L55p1k13o4O4
7112a10j8QK54j93k86O8M53k24L09ql86R7n7N2J06l25L23j76R9%Q8j67J48J52
7136B07k22K45l78J91O1l49L57l75J13O2Q9K24k20K87k24o1J44n6k46L04k81L01
$$ y = [-4, -7, -137, 160, -47, 166, -500, 368, 143, -96, 65, 240, 104, -98, -193, -191, -64, -45, -76, 37, -145, -375, -405, -198, 38, 25, 56, 186, -90, 105, -208, -275, -82, -172, 21, 31, 71, 180, 129, -142, 208, -111, -47, 5, -206, -34, 31, 258, 7, -153, 203, 37, 208, 30, -21, -103, 52, -355, -26, 232, -189, -117, -245, 65, 188, 38, 34, 145, 172, -223, -196, 43, 367, 25, 33, 28, 69, 64, 128, -179, -116, -97, -77, -307, 191, -8, 332, 222, 93, 62, -251, -224, -153, 15, -39, 195, 73, 120, -239, 344, -89, 107, 17, -127, -257, 281, -6, 18, 38, -111, 191, -9, -213, -87, -118, -124, 238, -142, -227, 42, 213, -71, -281, 109, 167, 190, -45, -170, -246, -117, 118, 9, -86, -80, -181, 174, 103, -110, -174, -110, -128, -120, 134, -59, -345, -277, 176, -48, 261, 253, -133, -36, -93, -41, 65, -260, 63, -113, -14, -14, 74, -93, 55, 207, -15, 230, -148, 43, 104, -245, 112, -263, -150, -88, 1, 225, 5, 292, 68, 7, 151, 95, -151, 153, -128, 173]
7158A73k5R3l90J04o5M2Q6j19J71p8K3o5j70L55k1j36K4j49O5j12K25J91m09J05
7182h2M8j88K22N1j34K05p9J46k85rR4p5o7L03k18j58L55j08n3K20O0l67J98R2
7206A71k3j97L87n48K26J3j67K30k84Q7k6m0J57j67K00R9k87QJ79j1k3k3m6L05
7230B20j90k05M84m28P0o7L2j02J04QJ23k06r8M92j09K3j38Jj87p3M09l89K57
7253C1n1q5P8l9P2k5M6JQ7k0k54j07L28J5l3M3r6qk0j66J29Rp9K63m8k15J78r0
7281e6J13l02K68J39J30k87J77Q5n28O9J26J04l1l57L94j32K44j51k15K84n4N12
7303E32l45k23q6K11j4j32m6j09J81Q0j44J27j28K28M7P4L9k90q2K07j77j04L84
7326B30k09j61K08j39P4k01M63O0j85q6k29K34j72L6N4J24k14K46O7K07l28j85
$$ y = [173, 148, 241, -149, -45, -110, -68, 18, -101, 70, -8, 15, -50, -220, 135, 114, -22, 2, -147, -82, -194, 31, 222, -187, -82, -34, -222, 0, 51, -83, 122, 43, 189, -96, -105, -11, -86, -153, 150, -68, -226, 129, 21, -32, 188, 248, -119, 79, 171, 148, -49, 338, -210, 16, 29, -138, 92, -192, -105, -131, -171, -14, -181, 19, 118, -169, -161, 18, 7, -16, -39, -85, 220, 30, -175, 309, -119, -49, -116, -84, -186, -82, -74, 49, -157, -255, 237, 128, 151, 13, 14, -173, -246, 163, -226, 31, -20, -105, -27, -66, 6, -19, 27, 28, 115, 95, -159, -266, 62, 77, 44, 87, -9, -17, -37, -203, -74, -65, -144, 119, 71, -144, 34, -56, 57, -245, 23, 162, 292, 5, 182, 267, -261, -192, -66, 38, 7, -350, 44, -88, 156, 5, -210, 74, 20, 532, 187, -36, -122, 89, 75, -57, -103, -212, -31, 49, -95, 32, -96, 132, 179, 253, 292, 2, -80, 127, -50, -154, 230, 21, -140, 68, -71, 3, -198, 265, 325, 140, 54, -175, 59, -113, -77, -23, 101, -113, 133, 200, 407, 79, -106]
7348a06OJ38L15n45J12m5J77r3k36K60p9K46j67j05J50K9j48J10l00M41m3kJ2
7371A27n9k25J35lN0n3O3N2Oj86J45K77n17J06k6K86j41j80K57k5k44M5m4J51
7395cK4K06n2j73J06j72pK24l14K88l1l0O4k78K54k34K59j28j72M1K83k44m1M0
7419i0P1j0K22k3j36Jk8j86j44K18K16k9j1j21J92l66K16m0R3N4l07M06l33L85
7443B50m39K48J16j92J59j92L9L01k04K3l73K79j32J07o8N1j5L9k6M2m9N5m7k51
7467b79J60J91j38j02K20J28j5k87L65j91NK58m93L68J83k62M0p0j68J21Q1J37
7489B52l57L60l05j62K44k59M33jnp5J30n2n08K10o6J1%L7o4K13N2k6J76l51Q6
7514b7K55nk21M9j60J41j52J78j61l5K45j22L6j60L03j91q6L18k15jk27J40K42
$$ y = [-106, -100, 38, 353, -192, -80, -125, 52, -41, -277, -17, -96, 150, -17, -122, 28, 57, -91, 19, -281, 160, 117, 115, 127, 68, -157, -22, -25, 25, -28, 35, 87, 93, -93, 52, 329, -188, -82, -108, 178, 37, -143, 114, 89, -155, -110, -154, -3, 21, 227, 175, 2, 108, -64, -71, 153, -161, 127, 96, 66, 130, -148, 106, -128, 131, 3, -169, -128, 155, -89, -130, -90, -19, -29, 193, 170, 34, 35, 7, -179, -323, -105, 111, 82, 71, -50, 142, -224, -8, -48, 45, 99, -208, 198, -135, 250, -189, 59, 175, -17, 142, -50, -11, 290, 86, 109, -264, 15, -117, -10, -78, -27, -42, -3, -29, 13, -36, 19, -28, -279, -119, 72, -66, -168, 52, 180, 165, -122, 243, 52, 57, 315, -178, 190, 373, 111, 151, 81, -87, 34, 115, 252, -105, 255, -50, -212, 32, -227, 206, 205, 200, 125, 255, 203, -305, -95, -161, -150, -150, -113, -177, 36, 88, 62, 238, -113, -27, 228, 223, 2, 51, -109, 32, -120, 58, -103, -138, 107, -15, 21, -139, 164, -27, -113, 205, -10, -11, -238, -98, 144]
7537A44k97J12j02J45k63M83p3o4k36M32k86j60Q6J41J35j50j6K25n9m11P7K80
7559A43j25k1j0J11%j64J86l4j39J36m96M53j75JK15k33J46J22r9Nr1J09r8j26
7583a84J74M9r8J71k20L05l88R8J9j17K56j33J25j59L6J72k06R1M1N9J72m24L93
7606B32k57qj69K27k8k52M53j52m99O05p3k4j23K74j89j9j58O7K88j53p3J60l5
7629I4n0J13o6j02J09q6K17k77J02J46j82k04L30j42N0L35n19l5k46K06M32ml11
7652i0KpM4k31j9L72j35j13J43J72j42j68L55k64r0P8L77l59O9L8j30L0o4o3K47
7677E2k08p6K98J03J47k47P8j03j44p5J49j13M01j80j65K44j73P3QO2j82p2q8
7700b11O43m59N2Q9q5O3k76L37l02J97j36J1J95k1k24J45j4J54n6o8O1m55L27
$$ y = [144, -153, -41, -143, 2, -261, 222, 149, 85, -151, 281, -5, -165, -79, 62, 197, 47, 31, 256, 197, -214, -137, 143, 18, -3, -13, 98, 98, -66, 120, 86, -53, 83, -413, 40, -135, -134, 81, -152, -6, 116, 17, 22, -69, 40, -58, -184, -10, 39, -59, 112, -108, 197, -191, -93, -74, -191, 65, -68, 57, -102, -66, 106, -100, -9, 32, 91, 263, -161, 232, -25, -33, -202, 25, -3, -255, 198, 46, -453, 152, 79, 55, -68, 206, 17, -2, -160, -93, 195, 42, -31, 129, 94, 44, 157, 91, -11, 98, 12, 229, -48, 54, 200, 18, -186, 144, 2, 52, 387, -132, -167, -413, -207, 225, 221, -90, -88, -95, -51, -282, -301, 71, -64, -177, -34, 138, -4, -172, 183, -81, -171, -93, 284, -75, -6, 32, -98, -68, -132, -195, 52, -156, -232, 66, 169, 316, 69, 147, 44, -100, -175, -26, -139, 262, 82, -83, 161, -12, 61, 69, 131, -51, -123, -211, 432, -27, 25, 114, 29, 92, -184, 153, -149, 48, -88, -77, 118, 97, -127, 18, 4, 158, 102, 34, 95, -360, -33]
7723c3l1j96P8K54M3j49J44j0M6R0o8m38m9K16k26M97j46J66j26k97M47m53K80
7746C9J0O0l74J15J09L89l66P0l26K01JO8P3P2j02Q3l55K27Q1l5q8j37k7K48N3
7771H9J21j86L0N3k88L14j87J49k13L53m70O9J26L06k87K00k50r2L14k00j53q
7793b10J84j74J09J53M6j85l3L49k9l3m27L40j4j39J33j22m5L00l94O9j20K99
7815E7j44k06O02j34k93NK0K67l01n7L08j81r7L8L58k93j5M1l8J02J29j06K95
7838C57l47J49p3j13r0l3K12l01J27J81o1r2nK81o84N07O2j62Q8m1J02k51L35
7861A48n7p6p9L14k03R7l97Q0K33J50n07M04k79L73j81Q5n3K5j5J53k05q4P9k52
7885b47M18j60k86L37p2nQ4J71j01m4j54J01J28o6j84Q5q5J33j78n9J59j65Q0
$$ y = [-33, -64, -260, -182, 72, 115, -34, 110, 100, 146, 236, 168, -270, -319, -103, -329, 168, 22, 188, 62, -235, 212, -241, 39, 49, 109, -265, -150, -41, 348, -18, 52, -274, -73, -72, -4, 69, 141, 39, 122, -233, -6, 75, 40, -48, -185, -212, 36, 89, 210, 24, 54, 107, -181, 133, -54, 95, -118, 235, -235, -166, -40, 266, -21, 179, -71, -163, 151, -49, -202, -210, -26, -200, -91, 62, 108, -77, -110, 239, 210, 177, -250, 90, 76, -63, 70, -52, -97, 203, -191, -122, -242, 57, -87, -293, 309, 175, -118, -113, -93, 174, -127, -184, 124, -57, -154, -116, 242, -51, -66, -25, -63, 39, 168, 62, 357, 10, 159, 86, -27, -117, -150, 62, -239, -112, 69, 8, -84, -89, 192, -492, 15, 77, -85, 3, -38, 64, -187, 148, 91, 15, -64, 250, 47, 144, -253, -173, 60, 210, -297, 107, -172, 201, 20, 105, 52, 77, 62, 215, 10, -74, 5, -247, 171, 11, -275, 62, -10, -15, 69, 240, 139, 95, -59, 42, 170, 104, -80, 5, -80, 53, -125, -184, -25, -190, -110]
7908a10J18Q0r0J21m59K05Q2J42J86j99q6J39j95J67q7j63J99k36Q1m4J19K06
7930A76j40J07K6l7k84J79n1j35j41K16J45j40J60J21J00j27n3k61K78l36R7K6
7952g4m6K23JJ20k85N3K2J75j91nK2J79m45L14n1K0O8J23l28K27m29K85K88n68
7976c02J69j16L34q1J25j98L4k31J69l0jl5J80O8j79J83m8j36K41k96j05J86k1
7999i0J68m09L32r1q6L24j65j07p7K22K32j57lj49J8O4j6n0J96l67L28M1k66J98
8023I0J1l7p8R4J2j43J94j13r6j58J85K65k27J96n5J78j91j90O2R2l14J17J45
8046C9ql0m0Q1N7k4j80j46J92K60l55J80o0J12O4o6M2r4J57j60R1k4l14L29l4
8071F9J22k26p9J05p4J41l01L05l4k1k29K38k06J58L4J4k81L22j72M1P3J13L0
$$ y = [-110, 8, 88, -2, 119, -340, -135, -53, 89, 275, 76, -10, 129, -66, 101, 14, -149, 50, -186, -105, -149, -30, 176, 36, 143, 169, 132, -152, 27, -24, -159, -300, -84, 61, -79, 81, 202, 302, 175, 122, -139, 139, -197, -100, -74, -120, 103, 104, 224, -61, -8, 14, 189, -2, -7, 15, 194, -251, 63, 12, 32, 100, 223, -105, 122, -307, -22, 266, -302, -133, -249, 85, 4, 129, -69, -35, -266, -97, -127, -128, -163, 17, 85, -94, 89, 41, -95, 146, -150, -255, -69, -90, 78, -331, 1, -90, -176, 148, -17, -124, -201, 21, 253, 96, 93, -56, -38, 26, 10, -40, 156, -211, 117, 158, -108, 90, 101, 64, -14, 80, 92, -51, 143, 30, -66, -224, -39, 226, -1, 195, 140, 318, 127, -63, -1, 91, -223, -106, 39, 31, 1, -39, 42, 99, 75, -105, -251, -59, 201, -154, 26, -34, 78, 142, 76, 118, 24, 181, 21, 112, 88, -226, 103, 69, 191, -35, -114, -9, -83, 58, -243, 62, 28, 7, -222, 16, -190, -32, 2, 16, -265, 57, -115, -74, -1, 112, 142]
8094A42l28L79k97n3N5J00K08m25L06j96N5J76j96J31k40J20j0J68o5J39j43J76
8116B02m27J64K87m12J49K5k9k32K32J72m22R2L35k0j33j33K43k37J64m0j26J69
8138B3n5K47p09M29J04lJ20J14j8m66Q4Q0Q6k07L69j26j01J5J21k18J89j59K35
8161A54n11M05M3Q6k89j6k8r2K14J23m4k58l3J96k87K34M1Q9M4J59j92K33j25
8184A46N3k54J57O1l1k88K73
$$ y = [142, -186, 193, -104, -157, -102, -2, 206, -219, 87, -109, -54, 122, -74, 57, -183, -63, -73, 95, 30, 169, 26, 202, -225, -61, 226, -186, -37, -12, -41, -273, -41, 131, -291, -199, 136, 116, -17, -150, 93, -144, 20, -20, -146, 23, -32, 215, -494, -65, 39, 36, 156, 270, 252, -214, -130, -50, 36, -171, 198, 72, -29, -14, 107, -111, 78, -81, 154, -357, 48, 91, 177, -112, -128, -156, -248, -34, 89, 45, -213, -246, -50, -337, -103, -62, 27, 71, 230, 38, 271, 146, 199, -55, 102, 163, 132, -156, 117]
8191A17
$$ Imaginary data points
##PAGE= N=2
##DATA TABLE= (X++(I..I)), XYDATA
0@%%%%%%QqQj6J6k4L2l8N0o0P2q8J12j41J65j95K35k78L26l76M40n13N90o83P80
31D14q89J011j144J296j460J644j846K063k305K566k854L170l512L888m296M744
47B490n233N769o360P004p717Q504r377J0358j1456J2701j4126J5773j7705K0002
61A0627k2797K6279l0758L6772m5311N8506q1822J35383m91120j74939O62219
72H3039J97395M10058J10019k92237m50545l33697m22257n8191K97093L24193
82a35130L56335M87010N0135l31841k77134l21515m84163j04566K82891L17012
92a60966L92080M13877J9116k23393k26027m02804m27635k0683J88719K03559
102b44157M13883M14969K7643j49592k03810m25142l76225l1540Q4776J97188
$$ y = [0, 0, 0, 0, 0, 0, 0, 8, 0, 8, -8, 8, -16, 16, -22, 28, -32, 40, -48, 64, -77, 88, -107, 128, -150, 176, -200, 240, -273, 317, -366, 414, -475, 536, -608, 688, -772, 872, -974, 1089, -1216, 1350, -1504, 1666, -1846, 2042, -2254, 2490, -2743, 3026, -3334, 3670, -4047, 4457, -4920, 5438, -6018, 6683, -7443, 8330, -9375, 10627, -12170, 14109, -16649, 20123, -25188, 33318, -48504, 86879, -404241, -579180, 83039, 280434, 690492, 800511, 508274, 57729, -275968, -698225, -756416, -459323, -135130, 221205, 708215, 758350, 426509, 149375, -172140, -656303, -760869, -477978, -160966, 231114, 644991, 664107, 440714, 214687, -188117, -615752, -636435, -447716, -244157, 169726, 584695, 612338, 462746, 258936, -166206, -542431, -573971, -489195, -292007]
112b92007M66653L68091M774r0122j84990m15220l21161n4714K4117K03642M31968
123A41031K88519O2415J4374k06444m35413k65630o4144l3685J89386M11415K74403
134C76227J02618J8317k26074l66048k17082j31264o3051K19950L58209K13244
144B85046J49797O8938k17931l39296k12621j59055n6575K05024K93596K14788
154B31711J97972N4130k20732k74601j95650j97108n8909J96308K45519K04490
164A83130K15703N5555j86741k27927k12426k17368m0192J71181J94351K11785
174A47051K30089M5940j57898j89495k19134k19510l3135J34455J63962K21429
184A23754K22187L7795j13785j56978k31725k16162k9429R9376J42978K25061
$$ y = [-292007, 174646, 542737, 547511, 457389, 272399, -142821, -463982, -518696, -494579, -290937, 141031, 429550, 491965, 506339, 299895, -135518, -401148, -465292, -498977, -309591, 101824, 376227, 478845, 497162, 271088, -94960, -312042, -443306, -506357, -286407, 71802, 285046, 434843, 503781, 285850, -53446, -266067, -425122, -481697, -276673, 16923, 231711, 429683, 483813, 263081, -11520, -207170, -404278, -463187, -266879, -21360, 183130, 398833, 454388, 267647, 39720, -172706, -390074, -430266, -259085, -64734, 147051, 377140, 423080, 265182, 75687, -143447, -362957, -396092, -261637, -97675, 123754, 345941, 383736, 269951, 112973, -118752, -334914, -364343, -264967, -121989, 103072]
194A03072K06763M0351p3975j41508k33779j98952l6386O1173J33332K26323J88101
205B74515M5327m1173j29018k26496j82577n0515L2794J27166K16021J68940O0361
216B95345j4439j22802k13174j65761o6957R227J22178K02008J55372P4232J457
227B76686j15793j93618j52837q3292n240J15471J81235J44861Q9452J2666j08115
238A61476j70801j44454r7392j4605J05095J62124J40432R8493J6934r5995j49049
249A2258j40641j05223j8304R0200J40660J37581J06743K1475q1810j31804j36324
260a05189j08675k4214P3765J25127J36562J07670K3997o5263j16528j33801j08129
271a94678k8422N8214J11120J31866J06130L1662m9969j05339j30436j04906l3554
$$ y = [103072, 309835, 350186, 276211, 134703, -99076, -298028, -334414, -273241, -139909, 86414, 274515, 319842, 278669, 149651, -76845, -259422, -309937, -277143, -149977, 66044, 234984, 295345, 280906, 158104, -55070, -220831, -287788, -278561, -156383, 45625, 200997, 275229, 276686, 160893, -32725, -185562, -268854, -274094, -158623, 22612, 167473, 256925, 269591, 161476, -9325, -153779, -251171, -265776, -160681, 1443, 141875, 240368, 257302, 161307, 12258, -128383, -233606, -251910, -161710, -21050, 116531, 223274, 244749, 162939, 31135, -105189, -213864, -238078, -164313, -39186, 97376, 205046, 229043, 163780, 47252, -86549, -194678, -223100, -164886, -53766, 78100, 184230, 215892, 165923, 60584, -69852, -174758, -208312]
282b08312M2470R9419J27440J04226L6978l7392r5172j22315j01468m1569L0603
293a65092R0944J19229J00258M3674k5039q5814j15439r9145m6615K1199Q0696
304h1144J09997R8428M9648j6422p6527j06676r6340n1505J2492P1221J02120
315A5292R5753N3495r092o6623r7642r4655n4900N425O2152R4295R1904N5909
327A51313j214n6760r0790r1591n6470j072N2296Q6481Q9851N7763M061m8721
339I5147q2735q7207n8662p973M4736Q0427Q5097N8292J0596m0252p6265q3835
351f2634n9202j2553L6874P2448Q1261N9880J5117l4329o8291p8853o0396j7117
363a27795L0803O4697P7138O0348J8773k6901o1151p5669o0242k0081K3560N7408
$$ y = [-208312, -165842, -66423, 61017, 165243, 202221, 164829, 69657, -52658, -154126, -195695, -165092, -74148, 45081, 145339, 189013, 163974, 78160, -37279, -136424, -183039, -161840, -81144, 28853, 127281, 176929, 160507, 83980, -22696, -119036, -170541, -158049, -86828, 15292, 111045, 164540, 155448, 88825, -8817, -103472, -158372, -152947, -90795, 3500, 95404, 151313, 150099, 93339, 2549, -89042, -145512, -146584, -94288, -7807, 82044, 139807, 143868, 95147, 12412, -74795, -133457, -141430, -96694, -16267, 68830, 127122, 137718, 97466, 21201, -62634, -121836, -134389, -97515, -25067, 56194, 116074, 131191, 96862, 28571, -50282, -110678, -127795, -96992, -32295, 44843, 105191, 123964, 97063, 35912, -39757, -99999, -120080, -96520, -39112]
375c9112P4378N9957K0678k0434n3471p2228n9722k1913J6729N0899P0553N8800
387H5114K2815j3227m8086o9556n7055k4011R692M5312O8503N5353K4979o424
399I3409m2883o6525n3548k6530K799M2159O4124N1610K7790K49m0400o2400m9171
412e9317k9902k701L9428N9461M7254L2131M203l7987n5941m5606l4626o382L7478
425e2507N2923M4127L6635O777l6203m8542m3441l8603p497L4696M5385M2898
437C6648M0089P223l3057m0628m2667m2264o741L0656L7206M3501M2678N321k7927
450E0038l3027m3544m3837n206K4874L0278M5194M3746L086k1092k6814m6466
462b2770m2604l173J7257K4984M8373M0402K456j2957k3806m8662l8403k672Q452
$$ y = [-39112, 35266, 95223, 115901, 95467, 41996, -30232, -89954, -111867, -95138, -44239, 26314, 85114, 107929, 94702, 46616, -22940, -79995, -104006, -94314, -49002, 19501, 74854, 99833, 93409, 50526, -15999, -69547, -96077, -93278, -51119, 13005, 64615, 92405, 92654, 52254, -10146, -59317, -89219, -91920, -52492, 6969, 54223, 86354, 90557, 52570, -3371, -48977, -83603, -89985, -52507, 416, 44543, 81178, 87955, 51752, 3210, -40231, -78834, -86331, -51635, -6250, 36648, 76737, 83960, 50903, 10275, -32392, -74656, -81397, -50741, -13535, 29966, 72644, 77965, 50038, 17011, -26533, -70370, -75576, -50702, -20424, 24770, 68516, 71602, 50510, 23696, -22770, -65374, -68547, -51290, -26306, 22067, 62469, 64925, 51968, 28162, -20500, -58903, -61575, -53123]
475e3123K2925N0105L6171K482m378k3298m9555l2486m773L11K3913M9445K9980
488D7719O417K396k5167m8056k6276q789n703K5702M6512K4177J2430O516k7484
501C0394m3785k1564j4742q505K8298M0645K0049J8488R259l0476l6995j8312
513b7246k1306q833L0085L2719J8452K4823Q199l0780k9429j8158k7379n515K9413
526b4955K4173J9471L0389M247k8758k1143k0944l0891j689K6016J7159K2673
538A5748L2072J92k3295j4965k5690l1131K469J9778J2354K7089L0751l347j5930
551B6095j1455k9982k8853N025J2205J0601L1174K6958m563q367j0569l3921k4052
564c9704M905M972J1278L4022K0628l043o16j3338l4695j8177K103j145J3807
$$ y = [-53123, -30198, 19907, 56078, 58560, 54182, 30884, -18671, -51157, -55930, -55619, -31706, 17739, 47719, 54136, 56532, 31365, -16691, -42967, -51756, -57459, -31757, 14755, 38932, 51362, 57878, 30394, -13391, -34955, -49697, -58202, -29904, 10741, 30790, 49278, 58537, 28061, -8934, -27246, -48552, -57385, -27300, 5419, 23871, 48694, 56893, 26113, -3316, -21474, -48853, -54368, -24955, -782, 18689, 49078, 53325, 24567, 3424, -17520, -48411, -50100, -24084, -6925, 15748, 47820, 48012, 24717, 9752, -15938, -47069, -44600, -24822, -12468, 14621, 45372, 42025, 26095, 14640, -15342, -44195, -39170, -26965, -16364, 14810, 41768, 37205, 28838, 18269, -15652, -39704, -34799, -29827, -18549, 15473, 36101, 33058, 32442, 19104, -15591, -33768, -31665, -32810, -19003]
577a9003L3579J5728L53L921j5674l3057j3252k633n584J7909L0633J1192N625
590B9737O123j8419k9274r760q630n965J9991K5785R286J1190N839k0273k3263
603g633r032j3970m975K1271J9975R417J5279L672k0014j7023j0405j7460k711
616c3609J9984J5092J1144J8039J166j8307j2510j2882j8759L1J6733J0728J4418
629A1268J8834j739j4424q776j5909j8942K216J2718Q265J7595J7401k846r989
642A5672p634j8824j6286K752P688P925J9627J4830l220n114q182j9847j3723
655b4336K170L882Q647K0024J2373j599k021r277j9694j0884K75N77R797J9513
669I447R725J416j62j1027j8100q636k615r41J1054J7596Q193L798J196j1795
$$ y = [-19003, 14576, 30304, 30657, 34578, 18904, -14153, -27405, -30038, -35622, -17713, 12920, 24112, 29737, 35860, 17441, -11833, -21593, -30223, -36188, -16197, 9588, 18874, 30064, 35903, 15630, -7633, -16665, -30635, -35610, -14339, 5636, 15053, 30332, 34004, 13990, -3033, -13438, -30898, -33609, -13625, 1467, 12611, 30650, 31816, 13509, 999, -11883, -30642, -30611, -13878, -3150, 11268, 30102, 28363, 13939, 5163, -10746, -29688, -27472, -14754, -6489, 11106, 28507, 25661, 15672, 8038, -10786, -27072, -24320, -16632, -8707, 10920, 25750, 22530, 17416, 9234, -10613, -24336, -22166, -18284, -9637, 10387, 22760, 21161, 19140, 9863, -9831, -20715, -20440, -19863, -10066, 9447, 19172, 20588, 20426, 9399, -8701, -17337, -19952, -20893, -9839, 7757, 15950, 19748, 20944, 9149]
683I149j5947p950n038j076J1583J4895P826O516Q70j1730j3458p978p150o56
697b0144J0978J2207Q584P876L54j0682j1113q885q004m03R856J0099R107R178
711A9008m32q980r574r493q803J31Q267Q689J0157Q726q8p456q456j0289q222
726a6815p8O166Q202J0730Q263mn561p917j0700p849m41M727P674J0771P844P79
742A5791m128q057j0054p396j140L245P517J0162P492J300k640p856r712p148
756a2624j856K584P351R255P411K314k378p151q970p096k768K016O579Q912O817
771A0396L237j885o371q498o925l408J722N897Q259O966L807j642n351p965p082
786h843l681J060N455P477O886L591n93m716p489p085l767N59M325P154P168L735
$$ y = [9149, -6798, -14748, -19786, -20862, -9279, 5616, 13442, 19958, 20828, 9098, -4360, -12338, -19488, -20144, -9166, 3041, 11625, 19501, 19855, 9173, -1940, -10825, -18829, -19232, -9376, 723, 9830, 19008, 18576, 9596, 22, -9471, -18274, -18143, -9876, -1187, 8970, 17696, 17608, 10152, 1696, -8593, -16815, -16893, -10727, -2525, 8205, 16468, 16464, 10903, 2986, -7714, -15563, -16004, -11277, -3603, 7168, 15012, 15791, 11663, 3606, -6448, -13844, -14984, -11739, -4222, 5940, 13432, 14732, 12092, 4236, -5476, -12624, -14480, -11896, -4545, 4710, 12121, 14435, 12057, 4906, -4064, -11160, -13928, -11912, -5333, 3579, 10396, 13633, 11748, 5377, -3121, -10046, -13454, -11732, -5835, 2424, 9390, 13197, 11555, 6204, -1761, -8843, -12524, -11464, -6009, 1468, 8354, 11945, 11352, 6636, -853, -7938, -11705, -11146, -6821, 333, 7501, 11236]
802A1236k39m135o902o837l845j12L798O431O668M350L24l533o690o480l738q27
818a0531L190O484O332M107P22k914o415o047m229r14K919N955N685M223J488
833A0055k620n417n868m521j426K408N217N790M432J411k105n043n661m196k163
848i707K174M868N552M336J732j373m736n180m528k214J630M078N238M585K342
863H797j513m090m783m707k216J186L889M615M572K245p80l813m465m122k568
878g753O71L216M553M117K817n23k988m752m092k407O8L039M299M282K975o29
894F893k782m093m165k729M5K762L593M181L117j21k439l420m255l123m2K176
910d402L537M292K758R4j924k873m393l015O3J229L272M413K717J9j338k860m227
$$ y = [11236, 10997, 6862, -40, -6877, -10722, -10834, -7036, -605, 6063, 10413, 10737, 7204, 514, -5966, -9704, -10531, -7341, -857, 5475, 9582, 10304, 7390, 975, -5072, -9301, -10215, -7296, -1341, 4344, 8567, 10055, 7435, 2018, -3850, -8371, -9797, -7389, -2172, 3618, 8050, 9461, 7356, 2313, -3348, -7544, -9707, -7533, -2665, 2887, 7223, 8955, 7582, 2846, -2334, -6862, -9076, -7446, -3368, 1870, 6455, 8797, 7284, 3194, -1589, -6296, -8512, -7326, -3437, 1178, 5750, 7995, 7215, 3402, -1063, -5185, -7753, -7082, -3866, 687, 4804, 7621, 7098, 4110, -642, -4734, -7141, -7073, -4034, 265, 4547, 7522, 6893, 4111, 18, -4147, -6876, -6831, -4069, -476, 3705, 6822, 6701, 4262, 842, -3413, -6536, -6578, -4402, -865, 3427, 6185, 6279, 4355, 1482, -2911, -5926, -5863, -4634, -1362, 3051, 5768, 5787, 4449, 1589, -2638]
927b638k796k45P64L063M505K685k3n54k874m318k301p17M02K946L931K603R49
944E382k59k901m198k056r69j79L050L723K090J317K88k910l949j766j554j91
960e082L136L112J581J877N26k967l110j564k533k71L426K436J935K231K21k971
976A983k061j754k928K8K891J941J774K967k42k649j430k513l008Q73K259J293
992e76K491K500k85j729j235l127k318N70J547J008K882K582q31q62j490k730
1008a603k400N67R30R85L243K262j011j78j364l193j939P58L8J207L730J347n47
1025B832L72j673k967j593K52m70J281L722O38M33P66j515l608o34l44q68J904
1042a472K735N92R93P22k299k341o03j006p91K260J947N47J654N35k660j268j041
$$ y = [-2638, -5434, -5679, -4915, -1852, 2653, 5338, 5315, 4761, 1887, -2431, -4732, -5449, -5047, -2101, 1830, 4433, 5382, 5123, 2222, -1976, -4032, -5001, -5180, -2130, 1593, 3683, 5000, 5288, 2378, -1571, -3337, -4891, -5082, -1946, 1166, 2747, 4624, 5150, 2183, -927, -2491, -5024, -5295, -1869, 567, 2502, 4733, 4954, 1983, -78, -1832, -4760, -4732, -1841, 100, 1874, 4841, 4599, 1950, 520, -1993, -5001, -4128, -1869, -576, 1915, 4415, 4130, 2401, 1166, -1961, -4279, -3709, -2162, -1154, 1728, 4310, 3479, 2617, 1127, -1603, -4003, -3436, -2506, -1521, 1722, 3984, 2973, 2795, 1431, -1762, -3701, -2943, -2905, -1698, 2032, 3379, 2832, 3204, 1531, -1436, -3029, -2777, -3247, -1966, 1756, 2394, 2827, 3593, 2078, -1530, -2164, -2508, -3376, -1472, 1263, 1855, 2848, 3570, 1271, -1070, -1673, -2679, -3470, -1210, 737, 1284, 2938, 3473, 813, -455, -1496]
1059a496j655q77K929J469M73K251K71k311j190p80j886m70K090R04J246K341
1075C309l30j838r41j109k230N05J451M14J667J888l36j091n59j436k152M11J111
1092a266L58K004J785q14o61k82j923j718O41J12N15K450J207r35R8n13k116r57
1110b015M84m12N55K372J201o62M46o68k363o53J07l63Q41K036L19L09M59j045
1128I48j731m51l91p05J192J873N26O65J3j028j556k45r02m40J267J349M12J085
1146A881K05j326p07r54p06n78J128J330K82J103L86r10j183o84o57n10R95O45
1164b60J106J071j07r03q24l26j588K58N46O81P27J154J77r18n28r31o26j08M77
1183i22K77J149Q53j1j20o25j169p39k09N69Q0J076R75J22j70n14r58p69k16K66
$$ y = [-1496, -3151, -4028, -1099, 370, 843, 3094, 3365, 1054, -136, -916, -2802, -3272, -1182, -278, 968, 3309, 2979, 1141, 200, -909, -3139, -2634, -1183, -769, 898, 2786, 2450, 1359, 800, -636, -2788, -2377, -1266, -908, 1096, 2881, 2067, 1406, 1124, -799, -2517, -1876, -1764, -1249, 1201, 2408, 1473, 1571, 1058, -1058, -2015, -1531, -1943, -1388, 984, 2185, 1523, 1969, 1301, -1062, -1715, -1608, -1971, -1130, 906, 1225, 1534, 1993, 948, -783, -1234, -1625, -2330, -1138, 735, 1261, 1926, 1939, 911, -645, -890, -1792, -2232, -965, 384, 796, 1881, 2086, 760, 53, -901, -1607, -2185, -1057, 273, 555, 1658, 2044, 1134, -49, -733, -1390, -1900, -905, -260, 846, 1917, 1810, 907, 83, -243, -1831, -1573, -1027, -346, 381, 1535, 1712, 794, 266, -665, -1291, -1399, -922, -645, 504, 1357, 1346, 1226, 601, -568, -1307, -1516, -947, -867, 209, 1184, 1306, 1136, 622, -336, -1105, -1321, -1055]
1203a055L86J046Q08J9P6o99o78r68j78J30M21Q30P00J62J09m10r18n21m55K29
1223i66M67N31Q14j1K45l38q87j88o60o9L94P63N90M05J26j98j156k52m09j22
1243i21K89O58M78K63K59m15n37l48q19J88K75M84M13M09L04q6q38l56l74m48
1263a122K91O94N54L18P5k97m10j80o30j31J14N88K76J83Q21n16m30l63o48j51
1283i64J26N69L54M81M56k10m05n45l58j69J28K51L85M30L85j05k86m84n60l94
1303i15L82L5M71N61J44j50r4m58o06j42K6N88K46M27L30j04k4n82n94j18q9j87
1325h53Q08M09P4K88j41m52m71n78O16j65J37N83L71j50Pm52l99k23k08K07P33
1346A41J26J93J93l08kn83k26k71L17J91L56K38n9M56m50m91j34j88j69K81N29
$$ y = [-1055, -669, 377, 1185, 1204, 1280, 581, -97, -1065, -1243, -1113, -692, 138, 838, 1000, 1109, 699, -219, -740, -1195, -966, -499, 32, 846, 835, 1080, 742, -145, -333, -993, -1062, -668, 95, 685, 1090, 1216, 1018, -138, -390, -799, -921, -632, 26, 504, 767, 1026, 611, 74, -274, -1093, -905, -630, -146, 267, 676, 980, 894, 56, -300, -674, -1122, -831, -137, 417, 735, 810, 513, 103, -77, -707, -838, -724, -136, 140, 323, 1144, 628, 198, -165, -813, -964, -838, -269, 85, 566, 1022, 812, 407, -138, -496, -665, -537, -286, 99, 529, 914, 809, 523, 39, -521, -915, -533, -498, -27, 534, 678, 528, 434, -24, -630, -772, -746, -158, 88, 515, 845, 741, 717, 135, -459, -577, -666, -853, -45, 364, 438, 726, 585, 133, -338, -916, -300, -465, -328, 255, 626, 476, 483, 31, -368, -591, -799, -592, 141, 267, 460, 653, 345, 343, -240, -466, -737, -420, -229, 127, 365, 306, 762, 312, -179, -313, -501, -670, -389, 140]
1367A40M48j3j4l41n8n63N7k31N24J86K3L55J66l52l81P4o56J30J09L37K74K93
1389E07j95J0j74n29k53MJ83L24J36L32K57m03q2n2m29R1k47O05L25j79K57k90
1411A98j26k44j97q1L41N3Q9M31O5k69j50k70l49M1J04J31J73M57K97j61k28o66
1433c61j5k65K62K31L00O5%k4J9l89n2k12J57M87j94O5L20j09j79J93m02k60J45
1456b18j00J96K59Q3L50j78o35kK27m35M16K44J4o2J88N6m36k67K72j30m2J16
1478h4M01q1J09k7m67j67k5j76J62K16J19K78o8J22k39j48J19k35J65O9J55J95
1500C93Ml51k52J23j72j09M13l73L86N53k90O3l70jk21j66J07K50r1K48Rj10P1
1523A14O6l58j54J25J00J13J71M5j70j6j16j4j56%J41k68P32o6k11j64L4J12k92
$$ y = [140, 588, 575, 561, 220, 162, -401, -344, -575, -51, 135, 158, 513, 679, 327, -54, 20, -636, -506, -397, -60, 214, 507, 312, 322, 148, -381, -634, -630, -447, -123, 13, 345, 602, 199, 117, 65, -364, -273, -520, 85, 410, 231, 488, 198, 72, -172, -369, -450, -109, -56, 33, 464, 529, 260, 110, -160, -509, -468, -364, -233, -60, 397, 694, 533, 305, -361, -376, -641, -379, -148, 152, 217, 217, 193, 212, -177, -229, -441, -284, 203, 9, 74, 394, 285, 106, 299, -103, -363, -218, -318, -122, 137, 220, 570, 392, -243, -245, -18, -453, -37, 207, 221, 159, 347, 403, -33, -300, -28, -158, -200, -84, 317, 236, 345, 318, -149, -316, -341, -517, -355, -139, -20, 258, 190, 312, 73, -75, 44, -191, -26, 43, 198, 393, 397, 46, -206, -83, -255, -364, 49, -324, 62, 615, 325, 388, 18, 17, -204, -370, -263, -13, -104, 144, 153, 43, 114, 180, -178, -332, -207, -107, 6, 177, 222, 52, 36, -80, -94, -250, -250, -109, -377, 355, 289, 78, -86, -52, 60, -232]
1546b32L18k93J09M78l65J74l8j14l19j21L64%R0OM51l18K8r6j17q4k6l81O35
1569A49k93M17Q2l6l99Q0m7q8M8K97k4j87K97j76M6k57K05n70L73K04K23l66J65
1592A43Q3k44J03j03k16J89l2q4N38k33m5k2j65k19K58Q3j58O7j83L56K3r6j10
1615f7k63n6J95L25j55K39J69l19J19k10m98L37O0K40l28J90K31j2j92J10j25
1636a0j93j32K54J9J7j02M00j63o9l70J94p4O7P5L34j02k63Q4L9n4j65k09L90
1659c3J28J12m2R9j36j19K75l97P5o8L10j31J44j15%j52j32J59j32kL35k55J66
1682H9n3m7l2j04J25N2j71N6j88J06L08j69P3P9l10J41Q5l2M43k79M6j61k42N24
1706C39j92j47j35J75j20j13M31j38n3k92M09l34NJ35J92k37R6m6n8L16n9m51
$$ y = [-232, 86, -207, -98, 380, 15, 189, 151, 37, -282, -403, -39, -39, 51, 57, 508, 190, 218, 122, 5, -79, -105, -486, 149, -144, 273, 355, 319, -80, 0, -47, -135, -87, 210, 186, -1, 296, 120, 166, -91, 114, -456, -83, 121, 344, -22, 143, 226, -18, 85, -18, -234, -45, -77, -161, 377, 144, 99, 77, -88, -307, -49, 34, -124, -57, -240, 116, 139, 43, -67, -330, -386, -191, 134, -21, 218, 387, 68, 187, -23, -521, -184, -124, 116, -212, -22, 209, 197, 5, 115, -10, -203, -335, -81, -62, -45, -147, 253, 90, 21, -349, -155, -229, -162, -87, 247, 145, -118, -34, 5, -49, -214, -423, -33, 95, 207, 165, 264, 128, 9, 284, -113, -38, -106, 204, 73, 217, 102, 102, -50, -182, -23, -155, -157, 178, -77, 89, 36, -11, -43, -147, -22, 30, -141, -85, -273, -167, 141, -28, 45, 124, -186, -45, 40, 8, 451, 172, 218, 57, -185, 339, 147, 0, -135, 40, -80, -193, 238, 100, 47, -245, 164, -170, -165, -30, 162, -75, 21, -25, -83, 233, 174, -277]
1728b77K83l7j26J12OL34m94K11O7l4K81l76K60n8j01P0r1p8j0m27M24J57n0k3
1752B3J17j85J76j37p8p9L4n8J03J79J27k28J31j16Nm00J13N5P4L08q7k96K25
1775Fk50P9J23l2o9K48j45r9M37k42N9j99J40l20L34M4j80J24J38r1P4m2k18n7
1799a38O6q3L44k18J82o1k28L8J64K24n72K51k30N18k42qm4m9N5j65M9m0K42J
1823E6L73j13k79O8l37K41L5k67J43J6J48J02o7n7m8l06J76O6p8K16L21k63n9
1846H7J4k75k08L97k07J38j60K52J02k19l8J94k31j73M52k52L09K3k63l3K04n9
1868E4k73p3M92r6k23j13J8L31j20j36J28J39n0r1K13j71r5N9J46j14k2j81M01
1891B23p0k65K64j07j83J62O4j03j00J05j12j4m1K61J74k86P0j87N0o7j2N1L50
$$ y = [-277, 6, -31, -157, -45, -39, 295, -199, 12, 79, 45, 326, -50, 210, 152, 51, 121, 30, -48, -58, -485, -61, 96, 46, 23, 140, -45, 131, -6, -84, -163, -129, -187, -84, 95, 222, -6, 125, 9, 14, -386, -273, -218, -144, 164, 77, -219, 6, -244, -165, -42, -74, -143, 105, -40, -139, 298, 56, 115, -84, 56, -264, 70, 114, -66, 58, 196, 105, 179, 137, -81, -138, -72, -155, 189, -29, 153, 92, -136, -98, 66, 290, -282, -31, -261, 257, 15, 7, -37, -86, -31, -196, -147, -187, 55, 56, 429, 316, 37, 105, -232, 9, 44, -223, -80, -64, 84, 186, 119, 62, 14, -292, -116, -50, -128, 88, 409, 146, 87, 101, -174, -382, 15, -192, -54, -214, 38, 140, -79, -117, 77, -154, -327, 125, -127, 182, 205, -58, -91, 113, 54, -219, -292, 200, 104, -119, -232, -214, 117, -3, -139, -11, 128, 78, -13, 200, 29, -66, -7, 139, 25, 3, -178, 223, 153, -112, 152, 45, -138, 24, 88, -15, -115, -10, -122, -136, -177, 84, 258, -28, 42, -145, -95, -162, -174, -123, 227]
1914B27j26N2k62J06n9J93k50J87j08J94J23r5p1k95J66J7J65Lj46k30O4K15k07
1937a37n6O6l17K11K29j91N17l08J85j01k27J62j20j74J58J06J11r2L7K58k71
1958D6j13j77J20L55l8j51j65K39j1j20k44K72k09j21L81j93K25j06K6L9l8r0
1980g3J51O7j13o1j9j20J43K24l25K9M9Pj05k8o6L98J24j26m56M28nm7K8l1j69
2005i6L13l02N1j87J64k81L56k19L47o3k25K77L3J08l15K04k21n2J79J05Rk38
2027e3j48L13l73K99l1l47L02n9K63L0k74K50Nk77J91l25L73L0l20J82n1l44K
2050c62K1K22L11k24LO0j24jJ50j59O4O5j72J75P4j08O2j86MM12r5k79K33k74
2074a28L12o6l22P7Q1J56j68L09j54k07L09k88K93l23K69k78M8j93K07q4k1K01
$$ y = [227, 101, 153, -109, -3, -62, 131, -119, 68, -40, 154, 277, 182, 111, -184, -18, -1, 164, 167, 21, -209, -145, 70, -137, -193, -127, -444, -233, -4, -195, 322, 14, 199, 98, -129, 33, -87, -261, -103, 3, 114, 22, 59, 317, 46, -67, -244, -124, 231, 193, 42, -123, 116, 105, -15, -259, 13, -196, -317, 64, -129, 96, -10, 16, 55, 17, -73, 78, 145, 32, -29, -48, -168, -25, 199, -126, -97, -48, -41, -146, -174, -240, 158, 282, 156, -300, 128, 123, 76, 104, 73, -96, 217, -85, -34, -221, -57, -338, 18, -201, 146, 83, -142, 135, 168, 276, -39, 165, -56, -108, 71, 176, 185, -53, -201, 112, -261, 38, 7, -340, -38, -97, 166, 196, -78, 172, 177, -100, 91, -234, 139, 169, -151, 31, -20, -364, -362, -341, -119, 192, -32, -29, 31, -93, -94, 56, -103, -39, 26, -146, 29, 103, -5, 57, -129, -125, 287, 192, -87, 146, -128, 184, 118, -204, -127, -46, 110, -58, 251, 97, -110, 199, -89, 204, -119, 150, -128, -80, -273, -66, -150, -171, 30]
2096C0j86K74P0m32K19k9j11J38K24l24L07n4k92K74k95J72p3R5M1J21k25P7j0
2119A1J15p5k76k1L75n8Qk75J13Q2j48Q1J21j19P1p5J06k02R7K98j90j69J01l40
2143c69L62O5k31J16M7K09j86k3m1l0K1J04o1j1J8J45j35k08O9N1R2k5J57L3j83
2168a4k7J2L14k59R0l7p3qj59Q4o7j01M67n02K09K77k95P3j96J87m1lJ46j37o1
2193a21J94m16N57k17j60L43k58K20j73M0l96K38J57m0m9m0J80R8l2M4p2l9o1
2216cj00K06k86M59r7j55j08J13k21M65k89o7K68j71j82N8p1oJ98k6Oo9J71q1
2240A2j33m8J83l03L0M34j38P1J1j01J84m8q2k00qP7K2j12J54p7J31q3J53l2k51
2265a54j9L23j69J98k34k37M37k11qr2L50K4j63j30l3l5L63k98R5j72L42l84J38
$$ y = [30, -156, 118, 188, -244, -25, -54, -165, -27, 197, -127, 180, 126, -166, 108, -187, -15, -88, 7, 48, 169, -56, 21, 11, 126, 51, -225, -246, 129, 71, 79, -196, -83, -1, -149, -68, 53, -66, 5, -70, 36, -166, -69, 229, 39, -130, -29, -369, -7, 58, -173, -57, -10, 199, 13, -10, -51, -81, -60, 44, -17, -28, -10, 135, 0, -208, -139, -88, 4, -21, 136, 169, -14, -41, -29, 285, 26, 116, 79, 6, -2, -161, -77, -144, -245, 222, -280, -71, 206, -89, -16, -212, -25, -66, -69, 77, -60, -121, 73, -343, 214, -3, -163, 180, -78, 142, -31, 9, -387, -149, 8, -32, -81, -121, 59, 157, 125, 169, 97, 58, -3, -103, 103, -183, 276, 179, 24, -84, 29, -192, 273, -16, -83, 185, 14, -168, -110, -181, -187, 11, -15, -9, -78, 93, 12, -121, -169, 14, -289, -259, 175, 37, 108, 119, 18, 202, 154, 72, -128, -136, -59, -37, -149, 5, -72, 59, -24, 129, 97, -154, -173, 150, -19, 179, -55, -292, 145, -66, -74, -166, 184, 208, 45, -85, -118, -153, 210, -88, 7, -165, 177, -207, -69]
2288f9k23N36j96o4k15J70J68k85L34k26J8j04J70N5l20M25n6l58J46j8J36J41
2310A65m9n4J35k59J02k70J32Ll6Q0K00q9jL4k79Q5j11J98J07j39j6p3J61Mp3
2335d3j38nL51k41J42K16n14K92m59J80J65J90k71L40p8j74j49Q4J75o9L6k94
2357b64L37l16K88k55J96K00j42j68L1K73M1k38J47n6k68l0J94K70l13M6R7r8
2379b8J32Q3j17k63L30j50L4Rl7m1q2L84j15J83l09k24M3L58j26J05Q4k54j42
2402a43K39L1j20J07m62M18J98l82K22l46K15J92j80m1J46k39p6J03J75j01O6
2423B2j79L5J12k32L93ll13N1Q7R3j44O5j55J54K11k89N10j25k15k52L21l07L35
2446A75j20j70Q4K45k26%M6K6k57K31j28K16j38k20M78q8j37j91M08l30J03J6
$$ y = [-69, -292, 244, 48, -16, -231, -61, 107, -178, 156, -70, -52, -156, 14, 69, -251, 174, 118, -240, -94, -112, 24, 165, 116, 62, 197, -62, 40, -230, -98, -95, -131, -51, 149, 60, 59, 93, -186, -101, -212, -14, 93, -46, -62, -135, 26, 30, -43, -181, -186, 165, -76, 66, 282, -232, 60, -399, -219, -54, 136, -135, 205, 127, -47, -196, -112, 63, -6, 30, -264, 73, -243, 45, -210, -14, 186, 44, -124, -93, 180, 221, -17, 130, 74, -194, -224, -30, 240, -73, -27, 70, -28, 104, 187, 70, -193, 137, -13, 21, 30, -7, -48, -130, 254, 139, 322, 13, -211, -168, 190, 64, 169, 253, -1, -143, 96, 127, 7, 114, -348, 70, 268, -114, 108, -238, -23, 169, -11, -52, 94, -145, -221, -118, 57, -44, 22, -157, -122, -10, -242, 151, 148, -165, -114, -27, 66, -78, -13, -168, -14, 197, -92, 418, 293, 78, -174, 147, -160, 175, 55, -115, -31, 214, -12, -12, 34, 60, -197, 34, -94, 122, -16, -236, 242, 154, 17, -174, 234, -96, 7, 23]
2468B3j51R7L06k94J48j5q8K00k96K74k02J23j76O3k49K30j5j51J56J24K3n5j99
2491a24k2J76M4J82m43K54qj11L4J0Q2n1M2j23rL53k68K53l30J13P2j89J3J13
2515F3qM5PlJ08p2l39J99r4k19K67k33N28k22j32K1J73R8k11J10n8K6k21L97j08
2540A22l15K87k62K08j86O5M18m9n00M43m95L84P6l48J78j14R3l7L69k91j90j79
2562c23L11m0J1k0oj04K01l01M06l5J0r6R1j77N1j25J68j3j54J27L1N8j32P6j83
2587a68L44J09r0p6j37j48J97L4j72p0J37k30L71k91K17p1l9J36Jj10o4J85j95
2610a30mj91M52j80l0J40k1p1R7l10J78J82m38J78K33K4l08L12R5k71q0K11nJ58
2634B21nj41k93J70l6J59k7k83L36j04k42L83k28J10k6O4j15J84n7m5k6m2K25
$$ y = [23, -128, -31, 275, -19, 129, 114, 26, 226, -70, 204, 2, 125, -51, 12, -237, -7, -22, -173, -17, 107, 130, 75, -124, -146, 30, 74, 256, -187, 67, 59, -52, -18, -8, 74, 23, 65, -58, -67, 286, 18, 271, -59, 54, 126, -63, -50, 63, 55, 100, 107, 104, 212, 140, -199, 0, -94, -313, -46, -279, 249, 27, -105, -84, 89, 187, -24, 86, 28, 54, -167, 230, 122, -193, 94, -168, 40, -146, -81, 337, 288, -212, 231, -264, 120, 196, -152, 26, -88, 5, -32, 337, 46, -144, -323, -12, -52, -41, -61, -67, -171, 30, -271, 135, 100, 110, 14, 105, -72, -21, -146, 22, 9, -145, -18, 13, 71, -61, 15, -168, 176, 285, 195, 119, -18, -166, 31, 65, -107, -177, -40, -270, 101, -190, 27, -44, -83, 53, 54, -56, -120, 65, -130, -134, -325, 127, -53, -83, 57, 36, -35, 62, -248, -70, 112, -326, -148, 85, 109, -199, 113, 208, -63, -143, 68, 63, 221, 216, 75, -218, -48, -84, 75, 48, -235, 101, -3, -245, 138, -90, 20, -6, 58, -57, 127, 70, 25, -1, -43, 182]
2657A82p6O9k77L35j57ML22p09L58m1j2J20k16j3n5J03J63j39J83k25J57%j94
2680a18j88L35n5J6j25K94j76o4K32l83L38k44j46K29k01J23N8J91jk92N1J34
2702Hl00K55J02m6j0J3k03L18p8Q1j07m8j27O2k4J10j6j51K22J36k57p5N6J5M6
2727a8j14J60m13N24m8j75J68j54Q4k35L86m47K86q8J03j36l7K88k3n5K5k57J00
2750g6NJ60Rl37J78J17k28N2j10L10O5k68k2K68j95R4o1J07r1n5J60k17K35l46
2774b46Q0J43k87L48k03J47j06qj23J87j44r5Q3N74o46L65J0m28N41l67R0M3K91
2797B49j20l36J88Ll3J26k00K55l28K68j52m2L07J25l71K18j73k04L39J27l32
2818h6J44k17k5J79p6P5J8k30J09K11M7Lq4j20j45K18P5P2R5k00n1L6n7j82K95
$$ y = [182, 106, 175, -102, 233, 76, 80, 402, -307, 51, 10, -2, 118, -98, -111, -166, -63, 100, -39, 144, -81, 76, 76, -118, -306, 29, -26, -10, -135, 159, -17, -81, 151, -232, 106, -138, -284, -55, -256, -133, -75, 116, 115, -177, -126, 8, -292, -37, 65, 19, 9, 22, -181, 137, 59, 140, 33, -15, -142, -80, -104, 6, -10, -161, 61, 197, -60, -135, -79, -64, -18, -132, 28, -385, 139, 91, -84, 84, -70, 14, -221, 165, -282, 4, -84, 19, -117, -154, 134, 111, 56, 81, -176, -76, -71, 89, 98, -239, -61, 56, -172, -120, -230, 80, 145, -123, -145, 123, -72, 22, -39, 68, -23, -78, 82, -135, 100, -246, -166, -23, -310, 38, -165, -18, -124, -132, -255, -68, -212, -307, -224, 350, -296, 69, 79, -349, 192, -175, -85, -42, 249, 129, -207, -19, -16, -49, 77, -123, 132, -196, 72, -80, -122, 185, 310, -61, 157, -16, -220, 119, 246, -86, 58, -159, -184, -5, -81, -6, 12, -218, -109, 102, 149, 152, 68, -52, -197, 21, 96, 168, 263, 63, 12, 48, -9, -191, 104]
2843A04k50l2M17l56J51J08k23K00k60J34n3J86j99L3J26j81J78j70K0Jk9J55
2865F0l72K69k36K13J75p5N8o3k06Q2N6pK92m32K44k43K6J45J59k24r5m5L17j46
2889d8j11K47k14L06m1k49K00m48L05j00R8K30j28k6J32j88K79k1l92J31N0R6
2911A08j04j54K25l54J17Q1R4M9j02q2M3J39R5l41L98l74M01j17Rk05K10j80P5
2934C1K36n26L86j96K14j81j3j36j5L35nl52K03j40K99j00j64K24l33K7K13Q4
2956I1j35p4l0J50r4qL63l33K14k14K36l23J22K26j83M0j28LR5o9l1NR2k4m8J13
2982E6J7L42l82rn5l0O7R9J28p0r7r4Q4k77K09l4J58L60k54n01L02k54K54j07
3006h8J53j9L9J7j90K02M5j76J94o5O0k2l14K95m40J27N63l79j00R4k10kL71M3
$$ y = [104, -146, -178, 239, -117, 34, 142, -81, 119, -141, -7, -60, 126, -73, -40, 86, -95, 83, -87, -67, -66, -95, 60, -312, -43, -279, -66, 109, 34, 92, 29, -177, -95, -39, -46, 246, -186, 58, -185, -159, -14, 145, -79, -174, -219, 98, -48, -159, 88, -126, 180, 139, -110, 90, -358, -53, -153, -55, 175, 47, 21, 153, -35, 244, 223, -169, -38, 12, 108, 4, -150, 75, -279, -162, -81, 13, 62, -40, -122, -79, 60, 155, -186, 212, -162, 239, 122, 131, -74, 136, -44, 31, 267, -259, 127, -69, 145, -36, -49, -185, -200, 135, 130, -222, -19, -159, 140, 40, -124, 100, -233, -206, 7, 91, -44, -118, -148, 2, -92, -100, 263, -70, 144, -70, 166, -157, -35, 191, 8, 48, -80, -77, 18, -51, -82, -77, 15, -9, -57, 56, 73, 415, 33, 24, -31, -61, 6, 105, 233, 163, 66, -28, 56, -221, -12, -46, 112, 472, 218, -283, 19, -235, 19, -88, 65, 46, 85, 102, -88, 114, 159, -17, 177, 112, 172, 150, -164, 131, -309, -182, 381, 2, -98, -4, -214, -216, 155, 198]
3030A98l52L15k88K14k2k66K41L38n24l7M6L2O7q3j42K53J35j16J4J0o6j38L34
3053A63o4Ol04N7J89j28O2j5l9L13j42M5O1j36l00L21J8k2k55K17j61Q8l1M4K05
3078A92j95N3k5j49l1K31k13L36k19K0K20l20P2j35M7LK8Q7K44l46l8j15J10J60
3102A7J42p8l64K56J08p0J23m9%j18M1l5J42J07o3l25K7N54k31j95j65K71k52
3125a57K37k92L5K68k63L45l99K40j84K56k15L11j58j39R7R0O0j81K41k87j7J33
3147B1J71l30L19l72K23j33J10j14J15j82N9J42j11k6K07m23L83L4J35l68K19
$$ y = [198, -154, 161, -127, 87, 65, -201, 40, 378, -146, -183, -137, -105, -38, -121, -263, -10, 125, 9, 23, 33, -33, -171, 163, 99, 105, -199, -142, 47, -81, -19, -34, -73, 240, 98, 143, 204, 68, -232, 89, 107, 85, -170, 47, -114, -26, -57, -13, 192, -3, 50, 25, -124, -155, 76, -137, 199, -20, 0, 220, -100, -28, -163, -116, -113, -85, 2, 246, -100, -138, -253, -143, 17, 159, 81, -283, -27, 81, 11, 134, 85, 85, -33, 8, -27, 115, 222, 159, -166, -139, 415, 184, -11, -176, 95, -157, 80, -212, -177, 91, -172, 173, -226, 14, -170, 86, -129, 182, 24, -115, -18, 72, 132, -49, 192, -95, -112, 21, 192, -138, 181, -191, 32, -101, 9, -105, 10, -172, -113, 29, -82, -108, 99, -324, 59, 93, 228, -140, 79]
$$ [...]
8191a7
##END NTUPLES=NMR FID
##END=
