##TITLE=1H_DE-79H_DEK2
 200.13MHz, D2O,
 8 sc
 
 29.1.2025
##JCAMPDX= 6.0         $$ Bruker NMR JCAMP-DX V2.0
##DATA TYPE= NMR FID
##DATA CLASS= NTUPLES
##ORIGIN= UXNMR, Bruker Analytische Messtechnik GmbH
##OWNER= pz
$$ XWIN-NMR		Version 3.5
$$ Wed Jan 29 13:57:10 2025 Russian Standard Time (UT+4h)  she@DPX200
##.OBSERVE FREQUENCY= 200.1313
##.OBSERVE NUCLEUS= ^1H
##.DELAY= (6, 6)
##.ACQUISITION MODE= SIMULTANEOUS
##.ACQUISITION SCHEME= undefined
##.AVERAGES= 8
##.DIGITISER RES= 18
##SPECTROMETER/DATA SYSTEM= spect
##.PULSE SEQUENCE= zg30
##.SOLVENT NAME= DMSO
##.SHIFT REFERENCE= (INTERNAL, DMSO, 0, 14.3821)
##AUDIT TRAIL= $$ (NUMBER, WHEN, WHO, WHERE, WHAT)
$$ ##TITLE= Audit trail, XWIN-NMR		Version 3.5
$$ ##JCAMPDX= 5.01
$$ ##ORIGIN= Bruker BioSpin GmbH
$$ ##OWNER= she
$$ F:/spectra/data/she/nmr/H-C/1/audita.txt
$$ ##AUDIT TRAIL=  $$ (NUMBER, WHEN, WHO, WHERE, WHAT)
(   1,<2025-01-29 13:56:08.28 +0400>,<she>,<DPX200>,
      <created by zg, POWCHK disabled, PULCHK disabled
       configuration hash MD5:
       00 E9 B6 7A A2 85 ED C7 34 08 36 98 17 FE 4E 26
       data hash MD5: 16K
       CF DB E4 91 8E 8C 10 1A 3A 28 6A 56 F4 7B 97 21>)
$$ ##END=
$$ 
$$ hash MD5
$$ 80 9E 2C 28 F3 36 B6 F3 99 0E 88 F4 86 8A 2B D7
##$RELAX= 
##$RELAX= 
##$RELAX= 
##$RELAX= 
##$RELAX= 
##$RELAX= 
$$ Bruker specific parameters
$$ --------------------------
##$DU= <F:/spectra>
##$EXPNO= 1
##$NAME= <H-C>
##$PROCNO= 1
##$TYPE= <nmr>
##$USER= <she>
##$AMP= (0..31)
100 100 100 100 100 100 100 100 100 100 100 100 100 100 100 100 100 100 
100 100 100 100 100 100 100 100 100 100 100 100 100 100 
##$AQSEQ= 0
##$AQ_mod= 1
##$AUNM= <au_zg>
##$AUTOPOS= <>
##$BF1= 200.13
##$BF2= 200.13
##$BF3= 200.13
##$BF4= 200.13
##$BF5= 200.13
##$BF6= 200.13
##$BF7= 200.13
##$BF8= 200.13
##$BYTORDA= 1
##$CFDGTYP= 0
##$CFRGTYP= 5
##$CHEMSTR= <none>
##$CNST= (0..31)
1 1 145 1 1 1 1 1 1 1 1 1 1 1 1 1 1 1 1 1 1 1 1 1 1 1 1 1 1 1 1 1 
##$CPDPRG= <>
##$CPDPRG1= <>
##$CPDPRG2= <>
##$CPDPRG3= <>
##$CPDPRG4= <mlev>
##$CPDPRG5= <mlev>
##$CPDPRG6= <mlev>
##$CPDPRG7= <mlev>
##$CPDPRG8= <mlev>
##$CPDPRGB= <>
##$CPDPRGT= <>
##$D= (0..31)
0 0.7 0 0 0 0 0 0 0 0 0 0.03 0 0 0 0 0 0 0 0 0 0 0 0 0 0 0 0 0 0 0 0 
##$DATE= 1738144567
##$DBL= (0..7)
120 120 120 120 120 120 120 120 
##$DBP= (0..7)
150 150 150 150 150 150 150 150 
##$DBP07= 0
##$DBPNAM0= <>
##$DBPNAM1= <>
##$DBPNAM2= <>
##$DBPNAM3= <>
##$DBPNAM4= <>
##$DBPNAM5= <>
##$DBPNAM6= <>
##$DBPNAM7= <>
##$DBPOAL= (0..7)
0.5 0.5 0.5 0.5 0.5 0.5 0.5 0.5 
##$DBPOFFS= (0..7)
0 0 0 0 0 0 0 0 
##$DE= 6
##$DECBNUC= <off>
##$DECIM= 32
##$DECNUC= <off>
##$DECSTAT= 4
##$DIGMOD= 1
##$DIGTYP= 9
##$DL= (0..7)
0 120 120 120 120 120 120 120 
##$DP= (0..7)
150 150 150 150 150 150 150 150 
##$DP07= 0
##$DPNAME0= <>
##$DPNAME1= <>
##$DPNAME2= <>
##$DPNAME3= <>
##$DPNAME4= <>
##$DPNAME5= <>
##$DPNAME6= <>
##$DPNAME7= <>
##$DPOAL= (0..7)
0.5 0.5 0.5 0.5 0.5 0.5 0.5 0.5 
##$DPOFFS= (0..7)
0 0 0 0 0 0 0 0 
##$DQDMODE= 0
##$DR= 18
##$DS= 0
##$DSLIST= <SSSSSSSSSSSSSSS>
$$ [...]
##$SUBNAM0= <"">
##$SUBNAM1= <"">
##$SUBNAM2= <"">
##$SUBNAM3= <"">
##$SUBNAM4= <"">
##$SUBNAM5= <"">
##$SUBNAM6= <"">
##$SUBNAM7= <"">
##$SUBNAM8= <"">
##$SUBNAM9= <"">
##$SW= 18.0517328524113
##$SWIBOX= (0..15)
0 0 2 0 0 0 0 0 0 0 0 0 0 0 0 0 
##$SW_h= 3612.71676300578
##$TD= 16384
##$TD0= 1
##$TE= 0
##$TE2= 300
##$TE3= 300
##$TEG= 300
##$TL= (0..7)
0 120 120 120 120 120 120 120 
##$TP= (0..7)
150 150 150 150 150 150 150 150 
##$TP07= 0
##$TPNAME0= <>
##$TPNAME1= <>
##$TPNAME2= <>
##$TPNAME3= <>
##$TPNAME4= <>
##$TPNAME5= <>
##$TPNAME6= <>
##$TPNAME7= <>
##$TPOAL= (0..7)
0.5 0.5 0.5 0.5 0.5 0.5 0.5 0.5 
##$TPOFFS= (0..7)
0 0 0 0 0 0 0 0 
##$TUNHIN= 0
##$TUNHOUT= 0
##$TUNXOUT= 0
##$USERA1= <user>
##$USERA2= <user>
##$USERA3= <user>
##$USERA4= <user>
##$USERA5= <user>
##$V9= 5
##$VALIST= <valist>
##$VCLIST= <CCCCCCCCCCCCCCC>
##$VD= 0
##$VDLIST= <DDDDDDDDDDDDDDD>
##$VPLIST= <PPPPPPPPPPPPPPP>
##$VTLIST= <TTTTTTTTTTTTTTT>
##$WBST= 1024
##$WBSW= 4
##$XGAIN= (0..3)
0 0 0 0 
##$XL= 0
##$YL= 0
##$YMAX_a= 674160
##$YMIN_a= -651265
##$ZGOPTNS= <>
##$ZL1= 120
##$ZL2= 120
##$ZL3= 120
##$ZL4= 120
##$ABSF1= 10
##$ABSF2= 0
##$ABSG= 5
##$ABSL= 3
##$ALPHA= 0
##$AQORDER= 0
##$ASSFAC= 0
##$ASSFACI= 0
##$ASSFACX= 0
##$ASSWID= 0
##$AUNMP= <proc_1d>
##$AZFE= 0.1
##$AZFW= 0.1
##$BCFW= 1
##$BC_mod= 2
##$BYTORDP= 1
##$COROFFS= 0
##$CY= -3
##$DATMOD= 1
##$DC= 2
##$DFILT= <>
##$DTYPP= 0
##$F1P= 0
##$F2P= 0
##$FCOR= 0.5
##$FTSIZE= 0
##$FT_mod= 4
##$GAMMA= 1
##$GB= 0.15
##$INTBC= 1
##$INTSCL= 1
##$ISEN= 128
##$LB= 0.25
##$LEV0= 0
##$LPBIN= 0
##$MAXI= 10000
##$MC2= 0
##$MEAN= 0
##$ME_mod= 0
##$MI= 1.114404
##$NCOEF= 0
##$NC_proc= 0
##$NLEV= 6
##$NOISF1= 3.799351
##$NOISF2= 2.8
##$NSP= 1
##$NTH_PI= 0
##$NZP= 0
##$OFFSET= 14.38212
##$PC= 1
##$PHC0= 235.2809
##$PHC1= 30.79223
##$PH_mod= 1
##$PKNL= yes
##$PPARMOD= 0
##$PSCAL= 0
##$PSIGN= 0
##$REVERSE= no
##$SF= 200.129724274929
##$SI= 16384
##$SIGF1= 3
##$SIGF2= 2
##$SINO= 400
##$SIOLD= 16384
##$SREGLST= <1H.CDCl3>
##$SSB= 0
##$STSI= 0
##$STSR= 0
##$SW_p= 3205.1282051282
##$SYMM= 0
##$S_DEV= 0
##$TDeff= 0
##$TDoff= 0
##$TI= <>
##$TILT= no
##$TM1= 0
##$TM2= 0
##$TOPLEV= 0
##$USERP1= <user>
##$USERP2= <user>
##$USERP3= <user>
##$USERP4= <user>
##$USERP5= <user>
##$WDW= 1
##$XDIM= 8192
##$YMAX_p= 0
##$YMIN_p= 0
$$ End of Bruker specific parameters
$$ ---------------------------------
##NTUPLES= NMR FID
##VAR_NAME=  TIME,          FID/REAL,        FID/IMAG
##SYMBOL=    X,             R,               I
##VAR_TYPE=  INDEPENDENT,   DEPENDENT,       DEPENDENT
##VAR_FORM=  AFFN,          ASDF,            ASDF
##VAR_DIM=   8192,          8192,            8192
##UNITS=     SECONDS,       ARBITRARY UNITS, ARBITRARY UNITS
##FACTOR=    0.0002768,     1,               1
##FIRST=     0,             0,               0
##LAST=      2.2672688,     0,               0
##MIN=       0,             -651265,         0
##MAX=       2.2672688,     674160,          0
$$ Real data points
##PAGE= N=1
##DATA TABLE= (X++(R..R)), XYDATA
0@%%%%%%%%%%%mMqJ6j6J6j6K4l2L2m0M8n6O4p2Q8j03J19j36J56j79K03k32K58
35A34k89L27l64M08m55N05n61O20o88P60q37R27j023J128j240J364j506J659j832
54i63K026k244K494k777L113l510L987m581N330o319P686r705J3004j9295L5556
69B3802j59999m59768n5082R0181K49361M36672L87561J17732m6656k55202m33356
80a04754l47597j36970J320K46377M35195L25332J33084J9774k15918m13609l34538
91c92304j62302j3561K27599L82156L06682J81696L2939k22326l62508k91812
101c13741j91755m1509K11346L37724K81793K01647M8868j95023l12520k80593
111b53763k20609n6750J88249K99594K77506K19668N4697j69624k73220k77439
$$ plain form
0 0 0 0 0 0 0 0 0 0 0 0 0 -4 0 -8 8 -8 8 -8 16 -16 16 -24 24 -32 32 -40 48 -55 64 -72 84 -95 108 -124 134
35 134 -155 172 -192 216 -239 266 -295 325 -363 397 -440 487 -536 592 -648 716 -790 869 -963
54 -963 1063 -1181 1313 -1464 1649 -1861 2126 -2455 2875 -3444 4242 -5463 7541 -11754 23802
69 23802 -136197 -595965 -651047 -560866 -311505 125167 512728 630460 583804 328602 -104754
80 -104754 -452351 -589321 -588001 -341624 93571 418903 551987 571761 355843 -57766 -392304
91 -392304 -554606 -568167 -340568 41588 348270 529966 562905 340579 -21929 -313741
101 -313741 -505496 -547005 -335659 2065 283858 485505 534373 339350 26830 -253763
111 -253763 -474372 -531122 -342873 -43279 234227 453895 508592 338968 65748 -211691
121b11691k28552n3346J59139K52004K70721K32391N8581j45160k35332k64028
131a65273k31383o8516J21759K24526K69934K29639O4814j07016k06743k66717
141a34976k28983o6168R3718J93588K61283K27532P2259q0646j85337k55036k19477
152c22243p7263O3058J74054K51449K15400Q1644n0461j64931k46480k10583q5353
163c71709L7848J55348K40538K07711Q9503k9671j48271k31120k00500r4821J8020
174c27124J39580K23289J97236J01171r806j34234k15702j90308j03292J28J24266
185a94796K07150J88099J07809O587j17609j99449j84132j11099j1631J09171
195a99900J89282J79361J16826J8861j04305j81422j73960j18654k5024R6676
$$ plain form
121 -211691 -440243 -493589 -334450 -82446 188275 420666 479247 334087 98755 -165273
131 -165273 -396656 -465172 -343413 -118887 151047 380686 445500 338484 131741 -134976
141 -134976 -363959 -430127 -336409 -142821 118462 345994 418253 337607 152270 -102766 -322243
152 -322243 -399506 -336448 -162394 89055 304455 386099 335638 170707 -75773 -286356 -371709
163 -371709 -333861 -178513 62025 269736 359239 329568 181297 -49823 -250323 -345144 -327124
174 -327124 -187544 35745 232981 334152 324346 190112 -25590 -215898 -319190 -319062 -194796
185 -194796 12354 200453 308262 314849 197240 -2209 -186341 -297440 -309071 -199900
195 -199900 -10618 168743 285569 304430 200125 18703 -155257 -273911 -298935 -202259
205b02259J73687J70058J20842L0459q8460j65575j67142j22875l3869Q1853J55510
216d7771J63219J26204L8264p6567j47263j59010j28386m1491O9982J38833J55298
227I1312J28965M5646o2439j31838j53339j29279m6580N5977J23706J50001J29511
238B01643M8664m9613j15990j47554j29648n0704M2814J09821J44323J27853N3528
249B35137l5623j03803j40923j26551n5983K9048R8255J38811J24014N8111k3090
260A97403r2876j35308j22801n9766J7069Q6980J31511J21128O3231j2380q2733
271A11458j26213j19177o6005O571P9157J22747J16002O8582j220p4398j19148
282a644j14801o9355k010O8277J14184J13820P1908M978o4789j08571j11202p4243
$$ plain form
205 -202259 -28572 141486 262328 292787 204327 38752 -128390 -251265 -285134 -203281 -47771
216 -47771 115448 241652 279916 203349 56086 -102924 -231310 -272801 -202819 -63986 91312
227 91312 220277 265923 203484 71646 -81693 -210972 -257552 -201575 -77869 72132 201643
238 201643 250307 200694 84704 -62850 -192498 -243202 -200388 -90567 53756 181609 235137
249 235137 199514 95711 -45212 -171763 -227746 -198698 -100443 38368 162382 220493 197403
260 197403 104527 -30781 -153582 -213348 -196279 -109299 22212 143340 206571 194191 111458
271 111458 -14755 -133932 -199937 -193366 -114209 8538 124540 193122 191902 117504 -1644
282 -1644 -116445 -185800 -187810 -119533 -5349 108471 180379 185357 120568 11997 -99205 -173448
294a73448r188N9896J04691J09501P4842J2880n4520j00814j08288p5290j5651
305a75389M9576R5783J06702P7088J8489m5689r1965j04524p7009k1309M0474
316a27773Q7952J02521P8005K4228l6930q4088r9940p8225k6636L2681Q0777R7702
328E0274P7194K9384k8486p6701r6148p7303l1490K5130P2409R3143P8244L3677
340A49327k1665o9211q9917p7580l6423J8463O5493Q7943P6758L7866j4401o1460
352F5193q6168p6766l8892J1368N7609Q3436P6776M0199q494n4202q0896p5502
364h6339m2038N176N1434P7822P4561M3410k295m8385p5567p3237m4399r52M4999
377g5810P4484P1517M5203L827m2074p1331p0890m6406o120L9273O8444O9487
$$ plain form
294 -173448 -182636 -122740 -18049 91452 166294 179174 124654 23840 -84448 -159738 -175389
305 -175389 -125813 -30030 76672 153760 172249 126560 34595 -69929 -146938 -168247 -127773
316 -127773 -39821 62700 140705 164933 128003 43915 -56025 -134250 -160886 -128205 -47428 50274
328 50274 127468 156852 128366 51665 -44483 -121786 -153276 -128146 -55737 37406 115650 149327
340 149327 127662 58451 -31466 -109046 -145469 -127006 -61513 26430 103188 141054 126653 65193
352 65193 -20975 -97741 -136633 -125265 -67656 15780 92556 132755 124261 70059 -10837 -86339
364 -86339 -128377 -123201 -71767 6055 80616 124026 121731 73346 -2221 -75458 -119857 -120809 -75810
377 -75810 -1326 70191 115394 119221 77147 5816 -65074 -111480 -117600 -78327 -9883 59604
389E9604M7965Q515l7113o5873o7641m8750j1074L4530O3401O6064M9437J3122
401A12187l1745o0536o5314n0071j4965K9579N7436O3934N1486J6108k7602n3800
413B6697o2391n2300j7833K5098N1331O0799N3105J8415k1961m8496o0222n3164
425h0922j9195J9504M5363N9624N3093K0145j7061m2315n8718n3358k0864J4189
437h0515L9972N7844N2649K1847j1638l7758n6641n1675k3289Q828L5655N6603
449A1882N0870K2556n334l3389n5637n0106k3574L027L1472N4381M9439K4546
461H0133p08l0208n2772m7576k6020k286K9483N1345M6203K6548M816k7635n0231
474A092m4925k7777o607K5979M8422M3744K9598P959k5077m6627m2110l0834r962
$$ plain form
389 59604 107569 116084 78971 13098 -54543 -103293 -114367 -79837 -16436 49628 99065 112187
401 112187 80442 19906 -45408 -95479 -110444 -80865 -23429 40505 91991 108099 80497 26697
413 26697 -35694 -87994 -105827 -80729 -29398 31401 84506 102921 80960 32464 -27758 -80922
425 -80922 -100117 -80613 -35250 24374 77467 97612 80551 38236 -20482 -73840 -94704 -80515
437 -80515 -40543 17301 69950 91797 80159 42401 -14240 -65915 -89204 -80376 -44721 11882
449 11882 62752 85308 79974 46585 -9052 -59158 -82732 -79705 -48233 6148 55587 80133
461 80133 79425 49217 -3555 -51131 -77151 -79437 -49954 1391 47594 74142 78958 51323 1092
474 1092 -43833 -71610 -78217 -52238 -3816 39928 69526 77485 52408 5781 -36329 -67163 -77125
487g7125K4829M3922M0957L2381J1047k3166m2090l9786l3233j2216K1626L9368
499a3486L8940L4970J3194k1024l6863l8317l6380j2847J9747L4012L7532L7112
511E6590J3602j8244l1816l7273l7864j3002J7036K8757L6685L7678J4109j4493
523E1765k6939l7241l8438j2677J2113K4350L6806L8418J3527j0539k2166l7452
535h473l7738j3033Q408K0822L7048L6322J3384n181j9514l7388l5946j3363L520
548e1132J8243L6566L4746J3898j092j7205l6813l3383j4474p94J7324L5761L1564
561C3209J5544K778j6600l4937l0793j5754m709J6216L3871K9299J7016O179j5989
574C5330l2868k7648j8375p188J5210L1301K6697J9727Q015j5727k8928k5758
$$ plain form
487 -77125 -52296 -8374 32583 64964 76011 52845 10755 -29031 -62264 -74480 -52854 -13486
499 -13486 25454 60424 73618 52594 15731 -22586 -58966 -71813 -52066 -18054 19478 56590
511 56590 70192 51948 20132 -17141 -55005 -68007 -50971 -22214 14471 52149 66258 51765
523 51765 24826 -12415 -50853 -63530 -51417 -27067 9739 48157 61684 51145 28979 -8473
535 -8473 -46211 -59244 -50836 -30014 7034 43356 56740 51559 32045 -5343 -41289 -54652 -51132
548 -51132 -32889 3677 38423 52321 51229 34024 -2789 -36172 -50646 -51440 -34116 1645 33209
561 33209 48753 51531 34931 -6 -30799 -46553 -51262 -35046 -1175 28124 45140 51319 35330
574 35330 2462 -25186 -43561 -50749 -35539 -4238 22459 42186 50201 34474 5546 -20212
586b0212k0652q855J5007K7667K4813K1795R328j4162k5697k4994k2563r217J3436
599c4306K3217K4449K4245Q909j2513k1756k4329k4698q622J1462K0389K3981
611A0428K4565Q916j0409j8353k4147k4599q526Q700J6587K4539K4708Q237p008
624C3638j5344k5109k4094q749O085J4913K4394K3759Q056m130j3738k4389k3627
637b8335q326L122J3031K4434K2394R208k058j2154k4320k1697r062K92J2085
650b1386K3599K0991R680O47j1710k2772k0358j0963j428J1585K2352J9706J0516
663C0459L198j1324k1609j8803j1808l127J0813K0395J8626J1917M233j0699j9598
676B673j7700j3054m043R949J8278J7400J3714M352r143j7693j7185j4019m729
$$ plain form
586 -20212 -40864 -49719 -34712 -7045 17768 39563 48891 34729 9032 -15962 -38525 -47742 -34306
599 -34306 -11089 13360 37605 46514 34001 12245 -12084 -36782 -45404 -33942 -13553 10428
611 10428 34993 43909 33500 15147 -9000 -33599 -42125 -33425 -16838 7701 32409 40646 33638
624 33638 18294 -6815 -30909 -39658 -33573 -18660 5734 29493 37549 33419 19681 -4708 -28335
637 -28335 -36661 -33539 -20508 3926 26320 35528 33470 21316 -3004 -24701 -33763 -33471 -21386
650 -21386 2213 23204 32884 33531 21821 -951 -21309 -32272 -33700 -22115 237 19943 30459
663 30459 33657 22333 724 -18079 -29887 -33014 -22201 -1806 16820 28737 32970 22271 2673
676 2673 -15027 -28081 -32124 -22175 -3897 13503 27217 31569 22426 4733 -12452 -26471 -31200
689c1200Q824J6838J6801J4072N120p759j5434j7329j4459m906O953J4683J6851
702I055J4454N475o401j4009j6417j4765n583N615J3002J6668J4668N991n065
715B2688j2557j6321j4410n945L678J2188J6034J4253O619l639j1184j5800j4294
728a8690o786K671J1143J4843J4396P100j902j0538j4899j4148p118J096J0251
741a2581J4474J3819P584r87r158j4239j3681q009P03Q692J3466J3604Q403k2
755B2068q328j3491j3149q432m64P755J3059J2998Q882J97o863j2425j3015q470
769a9678j550O819J1801J2853R091J408o166j1841j2113r028j905N527J0701J2940
783H859R079K189n440j0398j2268r099k365M299J0201J2110R090L163m227r896
$$ plain form
689 -31200 -22376 -5538 11263 25335 30455 22696 7262 -10067 -24526 -29432 -22479 -7796 9055
702 9055 23509 28984 22583 8574 -7843 -22608 -28191 -22576 -9574 7094 21762 27753 22688
715 22688 10131 -6190 -20600 -26545 -22867 -10679 5355 19608 26227 22588 11404 -4396 -18690
728 -18690 -25476 -22805 -11662 3181 17577 24677 22775 12237 -2662 -16810 -23928 -22832 -12581
741 -12581 1893 15712 23296 22309 13151 -1088 -14769 -22778 -22075 -13383 83 13687 22090 22068
755 22068 13740 249 -12900 -21332 -21796 -14041 -982 12016 20898 21095 14232 1807 -11208 -19678
769 -19678 -21228 -14409 -2608 10245 19336 20744 14578 2737 -9376 -18404 -20309 -14782 -4081 8859
783 8859 17938 20127 14687 4289 -7979 -17078 -19443 -15144 -4943 7167 16257 19420 15193 5297
797E297j1656r307k850L010R737J1454R218L513l041r265j1287q753l951K861
811a5020Q426J1193Q732M444k433q332j0882q832m656J994Q133J0032R732M156
825A6687j398p638j0384r015m562J307O954R932R070N062j217o504r504r039m984
840a5233N89O050R183R255N191l46o155q668q961n519L19N148Q962Q474N798J39
856A4226n064q409q522n826m79M625Q393Q336N963N76m284p875q540n854j041
871a3775M331P508Q106N956J443m153p254p726o213j470L596O883Q234N865J727
886A3058l220o845p860o096j726K862O438P505O462K099k716o215p805n925k004
901a1988K313N749P096O057K660k214n322p245o244k490J883M990P242O428K524
$$ plain form
797 5297 -6359 -15666 -18516 -15506 -5769 5685 14903 18416 15375 6110 -5177 -13930 -17881 -15020
811 -15020 -6594 4599 13331 17775 15342 7010 -3872 -12704 -17360 -15366 -7233 2799 12531 16687
825 16687 15289 7651 -2733 -11748 -16310 -15003 -8049 1883 10953 16015 14798 8294 -1210 -10249 -15233
840 -15233 -14644 -8594 589 9844 15035 14689 8534 -134 -9095 -14614 -14295 -9147 -185 8289 14087 14226
856 14226 9162 753 -7769 -13595 -14074 -9449 -1056 7280 13243 13819 9535 1660 -6880 -12734 -13775
871 -13775 -9444 -1936 6170 12126 13569 9416 2162 -5564 -11777 -13247 -9651 -2768 5466 11331 13058
886 13058 9838 2993 -4867 -10963 -12689 -9827 -3389 4116 10578 12677 9961 3746 -4059 -9984 -11988
901 -11988 -9675 -3926 3170 9227 11887 9673 4351 -2894 -9138 -11628 -9745 -4755 2487 8915 11439
916A1439j509m891p159o539k402J578M298P044N832K830q23m452o833n960k649
931a0196O70L837P019N824L060n63l835o617n733l421M05L642O454N617L084O61
947I908m015o195n420l061p02L548N981N395L515M02l397n944n081l265j065L484
963e912N166N140L823J104l167n506m891l726j279L004N220M690M173J333l344
978E828m616m784m017j088K545M487M735M205J280k506m044m988m160j392K334
993f181L915M743L954J856k223l626m668m540j079J762L308M632M609J333j754
1008F041l191m607m404j232J467K458N062M129J291p64k865m717m414j234R24
1023f056K515M327M332J601n77k101n040l841j592k3K416M764M045J449J6k313
$$ plain form
916 11439 9930 5039 -2120 -8659 -11061 -9483 -5185 1859 7691 10521 9698 5246 -1587 -7547 -10196
931 -10196 -9526 -5689 1330 7154 10214 9651 5816 -801 -6534 -9955 -9550 -5908 546 6163 9247 9908
947 9908 5893 -302 -5722 -8783 -9485 -5937 44 5439 8954 9356 5959 15 -5066 -8331 -9396 -5912
963 -5912 -746 4394 8217 9321 6154 648 -4243 -7969 -9248 -6244 -1024 3666 7839 9172 5828
978 5828 1212 -3572 -7589 -8677 -6132 -1645 3090 7295 8575 6069 2025 -2963 -7123 -8515 -6181
993 -6181 -2266 2477 6431 8287 6064 2438 -2230 -6770 -7849 -6087 -2779 1853 6462 7795 6041
1008 6041 2850 -1757 -6161 -7393 -5926 -3468 1594 5723 7014 6250 3385 -1332 -5746 -6980 -6056
1023 -6056 -3541 786 5118 6719 6142 4041 -999 -4840 -6432 -6455 -4039 725 4770 6219 6235 3922
1039C922m654l641j562l53K278M260L647J961O76k489m256l365k044o97K455M077
1055B15L074K148Q69k017m253l171k216q34K360L350L154K407R80j943l796k665
1071b338k803p45K131L062K889K868N73j930k915k950k899q14K064K601L015K823
1087D632P63j336k763l073k851q39J809K011L151K935P56j448k076l226k938n43
1103e036J089K309L066K874L91q71j495l246l107m47M38K006L143K446J002n68
1119C994j718k937k924m70K00J640L406K301N69J24j750l149k376j021J65J537
1135b409L049K162J054j17j100l250k021j221%J323K706K353J203J45j536k315
1151B6j996j568m29J460K308K279J563M46j735k439k015j447n61J799K197J793
$$ plain form
1039 3922 -732 -4373 -5935 -6288 -4010 250 3897 5858 6534 4045 -211 -3576 -5620 -6317 -3862 215
1055 215 3289 5437 6306 4289 36 -3135 -5351 -6185 -3825 -475 2679 5086 6066 4123 327 -2338
1071 -2338 -5141 -5886 -3755 -693 2196 5064 5637 3707 792 -2158 -5057 -5871 -3807 -1206 1809 4632
1087 4632 5395 4059 1296 -1777 -4628 -5467 -3658 -1647 1504 4439 5195 3747 1671 -1555 -4493 -5036
1103 -5036 -3947 -1638 1428 4302 4693 3822 2327 -919 -4026 -4473 -4035 -2029 1114 3560 4562 3994
1119 3994 2276 -661 -3585 -4055 -3855 -2215 1191 3492 4061 4185 2435 -714 -3090 -4111 -3946 -2409
1135 -2409 640 2802 3856 3739 2639 -611 -2632 -3853 -3853 -2530 176 2529 3732 3877 2341 26
1151 26 -1970 -3538 -3967 -2507 -199 2080 3643 4089 2354 -85 -2100 -3547 -4108 -2309 -112 1681
1167A681J561O59j647j788k275j513k91R75J925K556J270M27j052j985j737j715
1183b949m54R02J945J604J737O23o01j944k401j484l29P00J743J934J741L09m63
1200B613j551j762j979p55O84J587K142J552N90n54j470j687j738r53M59J485
1216a337K077J328J167p08j309j730j700n75M15J029J727J716N69l44j113j544
1232c32j849o63J26J200J899J521Q75l37j032j388j839q14j13J200J370J821R26
1249B571Q9r83j871j273q35k60Q90J643J386J022mo47j354j786r18j2O28J165
1267e49J934P90J18o29j330j549p85l87R05J553P53J265J33n57j292j469n85m69
1285b150L97J276J213J225N29j035q11j426r81k98L21J291J096Q54L71k85j021
$$ plain form
1167 1681 3242 3901 2254 466 -1809 -3322 -3613 -2638 -713 1843 3113 3540 2488 503 -1234 -2949
1183 -2949 -3403 -2501 -556 1048 2785 3408 2807 863 -1538 -3022 -3351 -2651 -908 1026 2767 3076 2613
1200 2613 1062 -700 -2679 -3434 -2750 -1163 979 2531 3121 2567 1097 -590 -2328 -3281 -2822 -1337
1216 -1337 740 2068 3235 2527 1218 -512 -2212 -2787 -2372 -1343 384 2100 2669 2325 1212 -332
1232 -332 -2181 -2844 -2718 -1518 381 1902 2777 2440 1408 20 -1819 -2633 -2746 -1546 -176 1645 2571
1249 2571 2660 1677 -194 -1467 -2302 -2562 -1672 -29 1357 2379 2375 1728 374 -1412 -2330 -2342 -1714 -549
1267 -549 1385 2175 2293 1664 334 -1215 -2000 -2387 -1482 71 824 2089 2222 1665 373 -1096 -1681 -2150
1285 -2150 -1753 -477 736 1961 2490 1455 644 -782 -1763 -2061 -1740 -449 647 1501 1872 1587 566
1302E66j502p24l19L18J063J084J144M00l46j216j040j113l23L24Q90Q37J286
1319A329P13p88o88q92j154l59M25P96J154N58Q78k36r57j016j038m50P6Q32J031
1338B14J263L13l78p23q52j134m62P4O16J018Q98J024j69n56j148r26p68L00L60
1357a036J269O50M16L28r04p25r46m64j92M43Q45Q24Q75m7k59j218m23o65m20
1376a649P17O63R72M21J39k25p22q81o08l79L61P66J254M53p5j75o97r04n63j36
1396a268M27O38J033L79J98k80o45j073l85m34M63L65J168L99q5K86p93n00p37
1415h44l51L65N38O05M88M78j25p79o51o79l97K58N36R35M79K62Q7o72o86o39
1435g92l86Q4M15P08N85M07N8p92m56o35l34K35M10P97L22O07r3o62m89n80m77
$$ plain form
1302 566 -936 -1660 -1979 -1661 -598 486 1630 2030 1684 468 -572 -1685 -2008 -1684 -794 43 1329
1319 1329 2042 1254 566 -326 -1480 -1839 -1414 -618 536 1094 1972 1736 779 -237 -1275 -1725 -1649 -817 214
1338 214 1477 1790 1412 689 -163 -1297 -1759 -1685 -1069 -51 847 1871 1702 1146 -2 -928 -1696 -1396 -1036
1357 -1036 233 883 1299 1627 723 -2 -948 -1412 -1604 -1161 -316 508 1383 1336 1077 -141 -564 -1229 -1649
1376 -1649 -932 -269 703 1124 1263 1038 316 -565 -1173 -1552 -1191 -425 829 1282 1207 1032 335 -569 -1132 -1268
1396 -1268 -841 -203 830 1209 1407 1127 482 -591 -976 -1410 -947 -582 586 985 900 1186 393 -107 -844
1415 -844 -1195 -830 -292 313 801 1279 1154 375 -276 -955 -1352 -1094 -558 377 856 1118 1205 533 -153 -792
1435 -792 -1178 -1094 -679 29 614 1021 1079 287 -169 -804 -1138 -903 -493 304 626 1233 1140 478 -11 -591 -1068
1456a068o5O39N24M83M8M82m79p34l15o50L06L23P07M03K60j35Jn55o85n70L92
1477f88L13L09L69O28r4J59o63n36l21m39K79J81R45M31j31k56l83m10m16p7j71
1498i71Q40K65N30J61l51n01l05k77l81N07L20K78N19J27o9l23o61l84k15P5O05
1519b11P59OJ11O6l84p99R2m62J52K75M60N15J94K1o46N2r54j9k0M64L71L79J34
1542E56J2no80j75m57j3L79P54q6J56Q8k25l59m54k69M4L53J73O09J18K49n03
1564B65k85m39q0m18P81p2O41L09n4m08k08l13j75n4K48K55L04K80J98k91n35
1585e1l22k17r8M39LL29M32K04n39K30n38m52j04L80K33N46n5J26j79K6n32j74
1607c13j55RJ82N21L10J2n2j64m87m28J88k26M16M62L21k79L61o06q6m58j75L89
$$ plain form
1456 -1068 -1133 -494 30 513 561 1043 564 -170 -485 -1135 -829 -506 201 604 864 729 730 175 -510 -1080 -688
1477 -688 -375 -66 303 931 837 996 333 -203 -524 -963 -684 -503 442 873 742 486 103 -307 -723 -800 -971
1498 -971 -131 134 664 825 474 -27 -332 -609 -990 -483 -163 115 634 761 692 369 -292 -676 -891 -816 -211
1519 -211 548 554 665 731 347 -452 -360 -822 -670 -395 65 580 774 795 149 201 -753 -772 -792 -328 43 422 556
1542 556 568 563 -117 -292 -749 -762 -383 371 285 441 529 304 -55 -509 -778 -734 -381 -208 401 519 768 265
1564 265 -20 -459 -539 -957 -176 -248 393 702 648 240 32 -281 -456 -510 -262 -7 297 577 775 484 -51
1585 -51 -373 -590 -688 -249 -246 83 515 719 180 410 -128 -580 -684 -304 -71 475 420 546 367 393 -139 -313
1607 -313 -468 -459 -277 244 554 566 514 350 -137 -565 -377 -603 -187 275 596 317 678 72 -14 -472 -647 -258
1629b58K3K91P6K37K6l18j37k65l81K84J27N12j02N06j60n14oj03O9k90p6L56
1651a03J36J72J60k92n2k92n9l5J24J98M22q3J22m41Om64K65k84L13R3L73j31
1673A48J36J6m01j06J07k82k3N49k26K17K4R9k00P0o32J58J91M3L25J08K10k35
1695B96l68l37q0K86J64M7K48J76l19k6J24j28l15K7P5J95L8J15o4K00k06j46
1717Br8j59k05M82L3K62M7o4k39o6k19k80K63J01M01j86L43K7k66l80n2Q3j26
1740b96L05q4L19j8L0j85k22l12M1M54k16K12p1L03j3k77j40L1m5j45%M49J68
1763B88J31l34n2k64l9PK84k60K91J76r2K46j24l36j64K8k35L33J53j23P8K26
1785B18P0m07J74j10k84M8M20QJ70k40l7J66k49j09j59L91k55O4M79j24k86K09
$$ plain form
1629 -258 -235 56 132 369 395 77 -60 -325 -706 -422 -295 217 115 621 461 -53 -59 -162 -93 -383 -459 -103
1651 -103 33 205 365 73 21 -271 -330 -365 -241 -43 379 296 418 -23 -17 -481 -216 -500 -187 -94 279 148
1673 148 284 300 -101 -207 -100 -382 -405 144 -82 135 159 258 58 128 -504 -346 -155 -112 213 321 531 296
1695 296 -72 -409 -489 -203 -39 8 256 432 113 87 211 83 -232 -205 -130 65 103 218 154 354 148 2
1717 2 -96 -255 -460 22 55 317 364 300 61 -5 -224 -504 -241 -140 261 75 418 445 179 -201 -253 -170 -296
1740 -296 9 -75 244 226 256 71 -151 -463 -422 32 -184 28 -43 260 247 -30 -170 -139 -184 -329 -329 120 288
1763 288 419 85 33 -231 -270 -263 21 -239 52 228 136 382 258 -78 -242 -214 -449 -116 37 -86 -8 218
1785 218 288 -119 55 -55 -339 -291 129 137 307 67 30 196 -53 -162 -321 70 -185 -121 358 234 -52 157
1807A57k39j19K8q0P0K19QK05l35J34m7j84r1MK36n4L19P4k36pj51p3J32j1J8
1832b3N0K83r2N0m86L5J28j95K51n1J82k9K30j26j41k85J4K49j23j11L26J0k0
1855A26J59k66M45n21k50K40o7J62J58j24K06m00J76p1k57J72K72l60K59J66j50
1876G5K06j91l37k0K67O0j63J04K46J50l13j90q7j54LM22j68M73m16K59j41l3
1898E2J17j92k68J1J07MO70n88J98k93J62J33j7m23K78K47q2k19J79rj00L2Kk74
1922b73J46J8J11OkJ79l17N3j19k9L44q5j7NlJ4Kpj63K5J97J55k48J84J47m93
1948a70J02n3l3L56m42o5L5L59PK3q8j10J25k84K44kK09J87k63j70R2k82J72l33
1972c84M27j87J4K00M3l42L86Q7j81j35J36k97M41j36KN7j38J0pr6j29M62r2o6
$$ plain form
1807 157 -82 -201 -173 -253 -183 36 44 249 -86 48 1 -183 -274 -270 -34 -88 231 305 69 62 -89 -162 -30 -41 -23
1832 -23 27 310 218 268 -218 -183 -55 -250 1 -50 132 103 333 207 66 -219 -205 44 -79 -190 136 146 126
1855 126 285 19 464 -57 -307 -67 -134 28 186 62 268 -132 44 -27 -284 -112 160 -200 59 225 75
1876 75 281 90 -247 -267 0 60 -103 1 247 397 84 -106 -193 -347 -344 78 -90 383 -33 226 85 52
1898 52 169 -23 -291 -280 -173 -169 501 -87 111 -182 -20 113 96 -327 -49 198 116 -103 76 67 -33 -1 1 -273
1922 -273 -127 -109 2 8 6 185 -132 -79 -198 -227 117 32 15 20 17 31 33 26 -137 -112 85 240 -8 176 323 -170
1948 -170 -68 -121 -154 202 -240 -305 -270 89 96 119 31 -79 46 -238 6 4 213 400 137 -33 59 -223 -51 -384
1972 -384 43 -144 -130 70 113 -229 157 244 63 -72 64 -233 208 72 74 131 -7 3 -4 -100 -229 233 141 75
1996G5O6j20n2M6j86R2j14J50J02j90J14O2l7r8Q2j35J67j3K91n44J26K01l25
2019b40K14j97N52l68k69K55J09Q2j91OK5r9q1j92K23L9K27k2J09k10J6L0P6k63
2043a69j01J56km1L35j28k20K43l42J26J32N4M5R7j99K51j21r9%l39J53L00l68
2066b37K24M3o2m1p7R9J46Pk9k01K13j57J03j8j55J68jR2nJ74m30q6L15k42j5
2091a72P9k79N40k53j62N12J9l34K42j95r0J07k8M4j25K19j00J56j3j31Jj36R8
2114aK48l05j55J10J89p6Pj3J9j9n4L10J48k54k51L03k42J29l1o8j59Q3L54k05
2138F7P6l56O0J58k46J53j58K92j51j52M33L7k60L7PJ9Q0N7q4K5k04J99m9j82
2162a42l6L18k55o2J32l05K32K30l29p0L38j19l91N25l05L63r9J6JK3k49K81j93
$$ plain form
1996 75 141 21 -31 15 -171 -79 -193 -43 59 -131 -17 45 8 -90 -8 -143 24 11 302 -242 -116 85 -240
2019 -240 -26 -223 329 -39 -308 -53 56 138 -53 -47 -22 -121 -202 -394 -171 -132 95 73 182 -28 -12 18 94 -169
2043 -169 -270 -114 -116 -157 178 50 -170 73 -269 -143 -11 43 88 185 -14 237 116 17 17 -322 -169 131 -237
2066 -237 -13 30 -32 -73 -150 -51 95 102 73 -128 85 -72 31 13 -142 26 25 117 112 286 -144 -230 85 -157 -172
2091 -172 -93 -372 168 -85 -247 265 284 -50 192 -3 -93 14 -14 30 -95 124 24 180 167 36 37 -99 -1
2114 -1 247 -58 -213 -103 86 10 17 4 23 4 -50 260 408 154 -97 206 -36 93 62 -6 -165 -82 272 67
2138 67 143 -213 -153 5 -241 -88 -246 46 -105 -257 176 213 -47 -10 -3 16 96 153 69 94 -110 89 40 -142
2162 -142 -178 140 -115 -177 -45 -350 -118 112 -217 -287 51 -68 -459 66 -239 124 25 41 42 65 -184 97 -96
2185i6J71l04L09j17R1R9k83j27L0K0J31l7K96k10J36j47n6P2J68l85L92r1P4
2208A36j31K8R2L6m4j17q2j17J92j45K07O3o4l0l07M24j54O9L9k60J45R2l44K76
2232Dm0J0QK73k58J29K40m28J63k12M4P3J34j37k55N11k14l63L52o8M04m37J94
2255A27l20J85J58J5L2o5L5n9k36L03l81J21r0L16l49K16n1J12k92O9j65K17k8
2278a30J48L39l26j61K43j70p9K3J21k37J74J6JK01l13M23k93m3q3K30j47K95
2300B32k48Q6j65L4k5p8J75J11k02K32l14M94n36K04K54m50nL31j04K82k55j99
2322a46K02n4O9j00o7n9J98J50l41J3J30J53l69P9K10j65o6L98l35M0K22l72L36
2345A26r8J30L4j32J14l67J41m4K95l77l4N43n05J3J01J54k02K11Oj08K75n16
$$ plain form
2185 -96 75 -229 80 -37 54 153 -130 -257 -227 -207 -76 -113 183 -27 109 -38 -94 -22 146 -239 153 62 136
2208 136 5 33 125 161 117 0 -82 -199 -7 -152 55 118 54 24 -283 141 -13 56 95 -165 -20 72 -272 4
2232 4 -36 -26 -18 255 -3 126 366 -62 101 -111 -67 6 140 3 -252 259 45 -318 34 -34 370 -67 127
2255 127 -193 -8 150 165 197 132 167 108 -128 175 -206 -85 -175 141 -208 8 -43 69 -223 -154 -319 -102 -130
2278 -130 18 357 31 -130 113 -57 -136 -113 8 -229 -55 -39 -38 163 -150 273 -20 -63 -146 84 -63 232
2300 232 -16 70 -95 -61 -86 -164 11 122 -80 152 -162 332 -204 0 254 -196 -201 130 26 308 53 -146
2322 -146 56 2 71 -29 -96 -155 43 193 -148 -135 -5 148 -221 -142 68 -97 -163 235 -100 -60 162 -210 126
2345 126 28 158 192 60 174 -193 -52 -96 199 -178 -212 331 -174 -161 -60 94 -108 103 109 1 276 -240
2367b40J91n7k4K6J23m0J26j87P3l3p5j67L29o9N4j34O4p6q0k0n2L62K25o37L47
2392B9J1r4k36K32Q5Q5L5j83j69J38L56n17O0j39K30o0K19J60p3MK1k23j98J3
2416b14J25J30j58K97K17m34j63M3Q4j74L90j49Q3k1l8J80q4k73qL34l82j40L49
2439fM8j43k5N99l54k03k13J63K30o3KJ89l16L72p2l16O3k9k12M4K37k18K42j95
2463a76L54k28K34n8j22j24N9m5j34N61k48J36l15J28J77k39J33l05R6l0K2J90
2485F6R7j00j06k66M61J4j58Q7J34j16k00M1j06J75J08l39M15j01k80L62j83J81
2507A86k04k92J58N4J82k9j2K22k19P2j47K9n2J39K12k25k5rO0kj36L2j43K42
2531I3k73O9N9O5n9j58J88j63r8K85k6r9J98l01K78r4P6l38L31j3R6q7k05R8J14
$$ plain form
2367 -240 -49 -106 -130 -104 19 -21 105 -82 -9 -42 -117 -284 45 -24 30 -104 -40 -116 -196 -216 -268 94 319 -318 29
2392 29 40 -54 -290 -58 27 112 147 -36 -205 -67 289 -228 -168 -307 -77 -137 82 242 169 173 194 -29 -227 -214
2416 -214 -89 41 -117 180 397 -37 -200 -157 -73 -247 143 -6 77 56 18 198 114 -159 -167 167 -215 -355 -6
2439 -6 42 -101 -126 473 119 -84 -297 -134 96 33 35 224 -92 280 208 -108 -45 -74 -286 -242 -5 -223 19 -176
2463 -176 178 -50 184 126 4 -120 -61 -106 -240 321 73 209 -106 22 199 -40 93 -212 -116 -146 -124 66
2485 66 163 63 -43 -309 152 166 8 95 229 113 -87 -46 -152 23 131 -208 207 106 -174 188 5 186
2507 186 -18 -310 -152 -98 84 55 43 265 46 118 -29 0 -52 87 299 74 49 40 100 98 -38 -6 -149 93
2531 93 -180 -111 -52 13 -46 -204 -16 -179 -277 8 -18 -117 81 -220 58 -36 40 -298 33 20 116 29 -176 -78 36
2556C6K0J14M4j62j53J61k88O9K03k89M54m3j15j01N4J44J68n02M6J82K46l85
2578i7P4K15k6j3k77J93k29J84j03o5K95n7O7o4k72J62l1K29j18K60k59k79K33
2601B2j27J57L9n5k25J65nJ72r5l93L0L47k71O53l21k59j20N86l42J28m0o0J03
2624H9j63l3J84J8p4r7j42K78j67K40k40j06K0L42k91J25J65r9j3O0LM2k80J90
2648E1J0P0k36O3n0L30k20n8J38k3j76k3K28k41J98Q8k84M42n16mM10l05J5L1
2672f2L43l76J3R1j58L5K65k84m2N3j6O6N7L13l32J58O8P4k34L07j99K1j26p1
2696c6q3o4J83J76p4j8O6k57O4l3n0J55k9j40J23J5j03j51k8K2M44J2n1j51K95
2721B87m81N16k54J7k27J6L02o3j61j5J50l56M79j97l8J51k71l6L59l59J75J9
$$ plain form
2556 36 56 170 214 52 -101 60 -228 -159 44 -245 209 166 51 -50 4 148 316 -186 -140 42 288 -97
2578 -97 -23 192 166 153 -124 69 -160 24 -79 -144 151 94 161 97 -175 -13 -44 185 67 327 68 -211 22
2601 22 -105 52 91 36 -189 -24 -29 143 48 -345 -315 32 -239 414 93 -166 -286 300 -42 86 46 -14 89
2624 89 -74 -107 77 95 21 -76 -218 60 -107 133 -107 -213 -193 149 -142 -17 148 49 36 96 99 141 -139 51
2648 51 61 131 -105 -42 -92 238 18 -40 98 75 -101 -124 104 -137 61 149 -135 307 -209 -213 197 -108 -93 -62
2672 -62 281 -95 -82 9 -149 -114 151 -133 -175 -122 -138 -72 -15 298 -34 124 192 266 32 339 140 161 35 -36
2696 -36 -119 -183 0 176 102 84 150 -107 -43 -76 -126 29 0 -140 -17 -2 -105 -256 -284 -262 182 194 143 -8 287
2721 287 -194 322 68 85 -142 -126 176 113 -48 -63 87 -269 210 13 -25 126 -145 -181 178 -181 -6 13
2743A3P5m7j26N5j32J57J5n8k22K85J59r9j95J40J63j74Q4j6l13K34m9r7L46m98
2767c00M08j96J28j11kp2J41k3j32J93j41M5J94N4q3j44J68m3k19M27k06j68L2
2790e0P4m5K14m6m0K29n27J74j3j51J18Q7J17J31m94K79j90M16l92K20k64J3l63
2813e03L24K73j48M9p9K45J18j03l31M13lm13J10K87o18L70j51N2k6J55l3j60
2835a72M06k58j7m7L9rJ76m9j29J8j35N34j19l65L12k28k80M64j23j10L4K15J5
2858A72k19k17L98J84j32k97L08l43J44j46q1M23l35K97P2l06q9J09j04K95j11
2879B2J93m14J39L1j3O3M9L2j81O3O8k17P2K54k20J68j09j74K29J90l13p8Q7M9
2903a0J08k62MK2K2J15J33KmK10n90L28R5j57l3K2l88N17j76J92j50J8R6k46K51
$$ plain form
2743 13 88 41 -85 -30 -162 -5 10 -48 -270 15 174 75 -120 20 183 9 93 77 -236 -2 -51 -148 198 -300
2767 -300 108 -88 40 -71 -73 -145 -4 -27 -159 34 -107 -62 132 186 103 -41 127 84 -135 292 86 -82 -50
2790 -50 24 -21 193 147 107 336 -191 -17 -30 -181 -63 24 141 272 -222 57 -133 283 -109 111 -153 -140 -503
2813 -503 -179 94 -54 -5 -84 161 279 176 -155 258 255 -158 -48 239 -379 -9 -160 -108 -134 21 -12 -172
2835 -172 234 -24 -41 -88 -49 -58 118 69 -60 -42 -177 357 238 -127 185 -43 -323 141 18 -92 -58 157 172
2858 172 -47 -264 134 318 186 -111 197 -146 -2 -148 -229 194 -141 156 228 -78 -167 -58 -162 133 22
2879 22 215 -199 -60 -29 -42 21 70 102 -79 -16 52 -165 -93 161 -59 109 0 -174 55 245 -68 -146 -59 -10
2903 -10 98 -164 -160 -138 -116 -1 132 134 130 340 -250 78 173 16 -17 5 -383 134 -42 150 0 18 114 -132 119
2928A19N5l26L6L6J81o1l98L66j49J90l2R3k71LJ69q5L1j28Q8K45n08N14j95M7
2952B0j68O7O7m0J15J60k53J00J3L4k25J96L9O6k46l12J59K36J37N0k81p9R5l3
2976h3J23Q4k21M0J8O6N1m9m1k49K73J51o0k54J78M6l03J47n5kK51L7P4M4m43
3001a77J62K04j34j71J12j71J91m2J03k69K7J63k38J87k68K47J39k30K23n1j31
3022a24j61J77M4J16J76m3j80J02L2PJ3l61L95l16O5J42Pj44J90j26K89l58j9
3045g7R5j82K85J20k70j24J21K70l29J0L14o0n5J4k6j11j68M07j49r8p1J36j37
3068h5L67k16j36j0j73N25m46J26K20j61J13K0j33l25K07M9J37j40J00q7k31L78
3090I9k34lK86j29n5j2M0Q7j26j64K77J58L0j86oj08K10l3k24l8J92j68J03K49
$$ plain form
2928 119 174 -152 -116 -80 101 40 -358 8 -141 49 17 110 -161 -158 11 -74 -43 -171 -83 162 -346 168 -27 20
2952 20 -148 -81 -14 -54 61 221 -32 68 81 115 -110 86 125 191 -55 -367 -208 28 165 215 -66 -145 -50 -83
2976 -83 40 124 -97 -57 -39 27 78 29 -12 -261 12 163 103 -151 27 73 -230 -83 -138 -140 111 148 222 266 -177
3001 -177 -15 189 55 -116 -4 -175 16 -26 77 -192 -165 -2 -240 -53 -321 -74 65 -165 58 7 -124
3022 -124 -285 -108 -64 52 228 185 5 107 139 146 159 -202 193 -123 -58 84 91 -53 137 11 300 -58 -77
3045 -77 18 -164 121 241 -29 -153 -32 238 -91 -81 233 173 118 132 106 -5 -173 234 85 -13 -84 52 -85
3068 -85 282 66 -70 -80 -253 272 -174 -48 172 11 124 144 11 -314 -107 -58 79 -61 39 -48 -279 99
3090 99 -135 -138 148 19 -36 -48 -8 79 -47 -211 66 224 254 68 62 -46 164 131 -93 -131 61 -107 -4 245
3114B45j35m3Q2k12j67K33j27j50J70j9M3J08J60L3k44o1O3K78l16K22J41j97
3136A07k02J30k82J07L50m45J09P6N0j97J30n7K09PL29o00Q2K69k65j31M54j56
3158G4J16m0j10o9K02j55j53m7K81K9m9k5Q8o8k04K57p3j04k01M08j96O4L6J45
3182B06O3k72j12N3j4M5j84M75k61j77M69l96O1J06pq9p1K25k07K44q1j28K66
3205B14n8k74j68M61j80k7M1J0R4m87L68J61j78kM3Mj53J54j00r9K39j44J57j18
3229d2q3J5J73j3j03J73j30j87L09l0j5r6J15k34J73j83J34p4K4K51n2k04O3r9
3253a15J14j44N3m1M03l57J3R4k7L0j08j51J09L5KJ17k69O9L82l65K48k92K34
3276C4q9K61j22k5j13K72k60l5Kl4J71M9j52M5J82l32J13N2J30nj16N8l02M11
$$ plain form
3114 245 110 67 149 -63 -230 3 -124 -274 -104 -123 -80 28 188 221 -23 -84 -21 257 -59 163 304 107
3136 107 -95 35 -247 -140 210 -235 -126 -50 0 -197 -67 -124 85 92 421 -179 -97 172 -93 -224 230 74
3158 74 190 150 40 -29 173 18 -135 -182 99 128 79 54 142 74 -130 127 54 -50 -251 157 -39 25 61 206
3182 206 269 -3 -115 -62 -76 -31 -215 260 -1 -178 291 -105 -44 62 55 -34 -105 120 -87 157 76 -52 214
3205 214 156 -118 -286 175 -5 -32 9 19 113 -374 -6 155 -23 -25 18 22 -131 23 -77 -176 63 -81 76 -42
3229 -42 -125 -110 63 50 -53 120 -10 -197 112 82 67 -29 86 -148 25 -158 -24 -98 -74 177 125 -79 -16 -115
3253 -115 -1 -145 -92 -133 270 -87 -74 20 -7 23 -85 -236 -127 -92 -90 27 -242 -173 209 -156 92 -200 34
3276 34 -55 206 84 59 -54 218 -42 -77 -75 -109 62 111 -41 4 186 -146 -33 19 149 144 28 86 -216 195
3300A95j69P3j22L45m81J46N2j41K05m8J8k00J24j51J03p3J44k2p6N2J56L51n57
3323g6j44K44k55L01k84L65q8n0J82m75L73l2J30l83J00K32l21Q3J88j59m3J51
3345C9%q1O7O3j76J03o9q4j82L88L9j23L0j69J18j03K91j21p3j84M11l68J35Q6
3369C7K04j90l42K02J09J33j62K49k19q7N6p7m0J69l8o6K42j60k14J64l9j5J76
3392I2j46p1O8J53k0n1J3J22j52r7K01l52R2K9J92j67K47k58j39L27j40J07j57
3415a07J71L0J84m6K3l40j8k65M48k45J54j95N67j76o6J00l36M69o14M34j46N4
3437H0k10J51J13J25l2j94O1m75M32k89K00j12P0J51j16j28L20j65K05%k53q9
3459a55J32K07j7nJ92l19j60J8L1J36j86J16O1q6j20j06K18J48o5l31l0L0K41
$$ plain form
3300 195 26 99 -23 322 -159 -13 39 -102 103 55 73 -127 -3 -154 -51 -124 20 -2 -78 -26 130 481 -76
3323 -76 -220 24 -231 70 -214 151 63 13 195 -280 93 61 191 -192 -92 140 -181 -98 90 -69 -112 39
3345 39 39 -42 25 88 -88 15 -54 -138 -320 68 107 -16 14 -155 -37 -140 151 30 -43 -227 184 -184 -49 37
3369 37 241 51 -291 -89 20 153 -9 240 21 -66 -10 -87 -127 42 4 -62 180 20 -194 -30 -69 -84 92
3392 92 -54 -125 -57 96 76 25 38 160 8 -89 112 -240 -148 -119 73 -94 153 -105 -244 83 -57 50 -107
3415 -107 64 94 278 232 255 -85 -103 -368 80 -165 -11 -206 361 185 119 219 -117 352 -262 172 26 80
3437 80 -130 21 134 259 227 33 94 -381 51 -238 -38 -150 -80 71 -45 -173 147 -18 187 187 -66 -155
3459 -155 -23 184 167 162 354 35 -125 -107 -76 60 -126 -10 51 -35 -155 -261 -43 105 40 -291 -321 -291 -50
3482e0J73q5K28m10P9k9K56m36L04p1J51j30p9J44qn4J7k47J75K96j74j05J39
3505H4j97J6L62m04L19j39j55J57J2q1J0K15k2j58R1p2rj63N8o6j6J18J75K3j29
3530B9l02K73l63N54k63K64m78K58J4J17kl98J45J91J3K17O2n96K71n3o9J43N2
3553G9j50J26pJ87k86J21J23j61J20m24O1K15L2J99l87K1J51P1J12k90O9M7J50
3576A79k31m6K76O0l54j26M65l79L41j75No7J65j2m44K97J89k81N07m01j4k96
3598c42L90l36N43l62J47l12O2J69m5O2J55q6Q7M2k31j44J07L82m85L93j31j54
3620h9l1J16L4J38R0k45k03m9J63L1L7N0M7j56J88p0j35nQ4j75O7J70K0j84O4
3645d3J69j60K16r3p3J30j71J17J9j8k18L36j1j62j10P1k48K80m1j14L1J02L2
$$ plain form
3482 -50 123 38 266 -144 -65 -94 162 -274 30 -41 110 -20 -99 45 37 -17 0 -247 -72 224 50 -55 84
3505 84 -113 -97 265 -139 180 41 -114 43 55 -26 -16 199 177 19 110 38 29 -134 -76 -142 -158 -40 135 158 29
3530 29 -273 0 -363 191 -72 192 -286 -28 -14 103 101 -297 -152 39 52 269 331 -265 6 -47 -116 27 79
3553 79 -71 55 48 235 -51 70 193 32 152 -272 -211 4 36 235 -152 -131 20 91 203 -87 -18 29 179
3576 179 -52 -98 178 238 -116 -242 223 -156 185 10 15 -52 113 101 -343 -46 143 -138 369 -32 -46 -342
3598 -342 48 -288 255 -107 40 -272 -210 -41 -86 -24 131 45 132 174 -57 -201 -94 288 -197 196 65 -89
3620 -89 -120 -4 30 168 258 13 -190 -239 -76 -45 -8 42 89 -67 121 51 -84 -89 -5 -180 -113 57 77 -107 -43
3645 -43 126 -34 182 89 16 146 -25 92 111 93 -125 211 200 38 -72 -1 -249 31 -10 -124 -93 9 41
3668D1k86M38j75J21m2m22L96K26k19m0m1j97K81J09o24M79j32K7k4lJ64n8r2
3691g3P3k4k05L17k8k22J72O6j11K28k26j04R1n8o8NL74Q8l01j09J84R7j5k70
3715a19Rj42L03k45L01l12K11l5q3P9R5k28L00j45no8j46L76l13K94j69R3J26
3738A77j67m2P8j60K0J18q6j03L82Q5m09L0K41pk63K48l8j56m0L45J47m06K01
3761A95j96j37M10k51J68P4k41p4j63n8J57P6J19q5K80l54J17J47l36K04r7r7
3783a42J22K98k74L9J6l06K53Lj50J62J41j20j29J71n5p2K76k31k54J92K24l18
3805a54J13k23K57K5Lk46K89l8j73M58k35J25J18j22j23m2J08p7L3r7j9K72N2
3828C04m35L65l3j94r8J83q3l13N69j19j04q8L45o29M71j13j17K06P2k96M0rN6
$$ plain form
3668 41 -245 193 18 139 97 -325 71 297 78 38 -3 -200 81 190 -434 45 -87 -60 -84 -87 77 19 -73
3691 -73 0 -24 -229 88 60 -162 10 76 -35 193 -33 -137 -46 -104 -172 -167 207 295 -6 -115 69 166 151 -119
3715 -119 -110 -252 51 -194 107 -205 6 -29 -112 -33 62 -166 134 -11 -16 -84 -230 146 -167 127 -42 51 177
3738 177 10 -32 46 -114 -94 24 -62 -165 217 302 -107 -77 164 157 -106 142 104 -52 -92 253 400 -6 195
3761 195 -1 -138 272 21 189 263 22 -52 -215 -273 -116 -40 79 -6 274 -80 37 184 -152 52 -45 -142
3783 -142 -20 278 4 43 59 -247 6 9 -141 21 162 42 -87 84 29 -43 233 2 -252 -60 164 -154
3805 -154 -41 -264 -7 18 21 -225 64 26 -147 311 76 201 319 197 74 32 140 63 96 -1 -20 252 304
3828 304 -131 234 201 7 -91 92 9 -304 265 146 42 -46 299 -330 141 28 -89 117 189 -107 -67 -76 -20
3851b0J36r1l0M4l49L11O0r9m9J43j82J37j46J32j68K4K89j53P6j55L8m8j27L28
3875A01M8K6k36k46L62R9l38K88k0j99M92l79P5j98L48j32K7mo0J43o1r1qL09
3899C46j58o5M8l58Q4J5K92N4j89l69K35N04n08J13K3K14k28k10K89p3q2K05k20
3922c8M02j73q0J4N5k23j57K83l5j6N3k07J32N2l6J01k13P3p8j1M9Kl5K00j67
3947e3J99k74KK49J00j11rM9j49j6J63l25j8J83jJ27rj51j71K94j43k23K52j2
3971d7K14j32j23L36m80J39J58n7j5k07R0J41q3N4J1Pj50M11m22p5K49k78m1K78
3995b2R9NL6j69J29j70J37j54r5L5R3j27Q0q9K56j0j24L65l26K06l02J81K96l71
4019d1j49L37o1k45K71j91L47k54R1j38L28j24j94on6K90l29JJ05j25J74p2j24
$$ plain form
3851 -20 116 25 -5 39 -310 1 61 -38 -87 56 -126 11 -135 -3 -171 -147 142 -11 65 -90 -52 -100 -227 101
3875 101 149 175 -61 -307 55 154 -184 104 84 -115 377 -2 73 -125 223 91 118 114 54 197 136 45 37 346
3899 346 188 123 171 -187 -103 -88 204 258 69 -300 -65 439 -69 44 67 281 53 -157 132 59 -23 182 -38
3922 -38 364 191 111 125 180 -43 -200 83 48 32 85 -122 10 62 26 127 -86 -13 -91 -102 -53 -51 -86 114 -53
3947 -53 146 -128 -126 123 223 112 103 152 3 -13 150 -175 -193 -10 -11 116 107 -44 -215 79 -64 -287 -35 -47
3971 -47 167 35 -88 248 -232 -93 65 8 -7 -214 -124 17 -66 -12 -1 6 -144 267 -155 -230 19 -259 -300 -22
3995 -22 77 82 118 -51 78 -92 45 -109 -204 -169 -76 -203 -123 -212 44 34 -90 275 -51 155 -147 34 330 -41
4019 -41 -190 147 86 -159 112 -79 268 14 105 -33 295 171 -23 -29 -85 205 -124 -123 -18 -143 31 -41 -165
4042a65L57k21p2j63J01J19J2L10j84k61K24j79k8K95j49l5L4j55L88r1k14R0
4064A3j83K7J84l31J39K68J4n68M01J27p9k0M6k88R8L06m9j83k90L20J23J6m47
4087c56J18L71l50L59j30k39L41j46j03L57j08PJ7l43L67k29L02j57j7j07J07
4108F1k4m4k1K91j91J69J21m59Q3j68J7k0J20m1q7K15l23L29jJ12j22m3J5J36
4132A25O8k01J37q8J2j90J76K37l70j75L59k62J02r1J68jJ10N5j77RM01k86j86
4155f8L61k48j48k6K61r8k71J23K07N5j37j5j15o1K55J2l2J04l3j66K03k22M2
4178a7K24k58K17O0k38J0N5k36J34j6j94L42k66K13J37j22j52K36j37K38k16N
4200A9j00J2j50J24J44o5J41n4J00j88q0j45L81k36LK38l42L29k49Q1J33j35J66
$$ plain form
4042 -165 192 -29 -101 -264 -163 -44 -32 278 94 -167 57 -122 -150 145 -4 -39 -5 -160 228 137 -77 13
4064 13 -170 -143 41 -290 -151 117 131 -437 -36 91 12 -8 38 -250 -152 154 105 -78 -368 -48 75 91 -356
4087 -356 -238 133 -217 142 12 -227 114 -32 -135 222 114 121 138 -205 162 -67 235 78 61 -46 61
4108 61 37 -7 -28 263 72 241 362 -97 -14 -182 -165 -185 -65 -106 -193 22 -301 28 27 139 17 -26 -11 125
4132 125 193 -8 129 41 53 -137 39 276 -94 -269 90 -172 -70 -161 7 6 116 171 -6 3 404 118 -68
4155 -68 293 45 -103 -129 132 34 -237 -114 93 148 11 -4 -119 -180 75 87 55 159 126 -40 163 -59 -17
4178 -17 207 -51 166 226 -12 -2 53 -183 -49 -65 -259 83 -183 30 167 45 -107 129 -8 230 14 19
4200 19 -81 -69 -219 -95 49 -16 125 71 171 -17 -97 -242 139 -97 -94 144 -198 131 -118 -37 96 -39 127
4223A27k67N3J17J6J40j8N6k63j69J83J19j87J9j32J28k02O33m35J73q1r6K88
4245B02k87K94j30J84j70j33oK92l11J65K51k80m0j9J96k37r9K22m27L67PK12
4267B53j21rj53q0j05j30N08p3j55m2J96k35K27J40l61K62j26J18r4Mj18j26L09
4290H9P3q7L37o17J11P6j34K95l24Q1K13pjJ51k64Jm5J97j62LN4p4K51j14J14
4315B17j83r1J56j85rJ67J48k50L36m84K77J28k30J13k92r0K91j17K43l27N5O0
4337f7M04k44j04J20q2J63k52K62l07K72kJ13k56q2P7N7n9j49K37j05J27Q8j27
4360H4j27M70n02p1L18K7j41Q7l45M34k01L76l77J41l45k4Q7j4N08n36L9j00J70
4383d2K33j95q1L20m11J49J16j38K35j18mk31J4K05K1j97J32n2K0r1K90j03J67
$$ plain form
4223 127 -140 -87 30 46 186 168 224 -39 -208 -25 94 -93 -74 -206 -78 -280 353 -82 91 10 -86 202
4245 202 -85 209 79 263 93 -40 -46 246 -65 100 351 71 31 12 208 -29 -128 94 -333 34 41 253
4267 253 132 123 -30 -110 -215 -345 163 90 -65 -107 89 -146 81 221 -140 122 -4 114 20 24 -94 -220 89
4290 89 162 75 412 -205 -94 -18 -152 143 -181 -100 113 106 105 256 -8 -7 -52 145 -17 -14 40 -34 217 103 217
4315 217 34 -57 99 -86 -95 72 220 -30 306 -178 99 227 -3 110 -182 -272 19 -98 145 -182 -127 -67
4337 -67 337 93 -11 109 27 190 -62 200 -107 165 163 276 20 -62 15 72 13 -136 101 -4 123 211 84
4360 84 -43 427 -75 -146 172 199 58 145 -200 234 33 409 32 173 -172 -196 -109 -123 385 -151 -112 -212 -42
4383 -42 191 -4 -85 235 -176 -27 89 -49 186 68 64 -167 -153 52 73 -124 8 -44 -24 -115 175 72 239
4406B39k25k36N33n62L91k86R1K20l18Q7J57q9J39k78J15jj05J09Kq3k2R3Jm1
4430f9J04j01r2J3L48j71R0m1j79L62R3n99K70j32K4J09Q2J4mM5k8j04o1J6K0
4455In3j9n9L25n9l13J99j32J35n8Q7p4rl3J1J74j5lM2j08j64j31J06L79k90J92
4481A39k74J00j8L73j91k51J38J60J7j62L9k6j58Q8P2r2K15j86j10L20l42N30
4503C81l31j13K40l01o9J11Q2j81J09j65L59k75L35k33o3L83l05J76k38J62k3
4524D1qQ5orj27kL5j99L05J58j66l5r2K33l19K56n6k36J42K0L6k63L56k51K06
4549A04Q7j94j18J64r1kJ59jL33k09l46J82j8J0o8j01O2m8J09q2K39l7j23j60
4573a49MK42j8J44j92P2q3J25j15k04J25R2j13J14J11k41J98j70m1j79K10j5m7
$$ plain form
4406 239 14 -222 311 -251 140 -146 -55 165 -153 -66 91 2 141 -137 -22 -23 -128 -19 -17 -100 -122 -29 -28 -69
4430 -69 35 -66 -158 -145 203 32 122 81 -98 264 357 -242 28 -104 -80 29 111 125 121 166 138 34 -27 -11 9
4455 9 -44 -63 -122 203 144 -169 30 -102 33 -25 62 -12 -21 -54 -43 131 116 113 155 47 -117 -248 -142 237 -53 139
4481 139 -135 -35 -53 320 129 -122 16 176 193 31 70 44 -114 -26 46 -46 169 -17 -127 193 -149 381
4503 381 50 -63 177 -124 -193 -82 0 -181 -72 -237 122 -153 182 -51 -114 269 -36 140 -98 64 41
4524 41 33 118 112 103 -24 -26 9 -190 115 273 107 72 -20 213 -106 150 94 -142 0 20 56 -207 149 -102 104
4549 104 191 -3 -121 43 -48 -50 109 108 441 232 -114 68 50 60 -8 -109 -47 -95 14 -68 171 134 11 -149
4573 -149 -145 97 79 223 31 103 20 145 30 -174 -49 43 -70 44 155 -86 112 -58 -99 -278 -68 -83 -130
4596a30m5j92K97K56o7J03r7l17J52J14l13O3K68J31j45r5k4%K31j71j5O3o7q1
4620h1J97n6k62L24j52L0J52k7j77J61j2j54K23m9P6j49j51J33k18j6l8q1J91
4643a36M71m12J9mq7K49o0N5Q0n4j74o2L43k87J1P0L05l02K18j44k56J34K8j07
4667a02J76P7K2m36M33K15m54J15N8j6k56J7J27pM4J55j95KM5j78K70l71M01j90
4691d8J04j4J68l10L84j67n2p8k37J18J38j36p0m7L52j67M5K04n05L00m4j72M98
4714B64j71Pn07L01M6K50l33P4J48j9J59j46k39L07k25k67J03K00KN4J5k40J88
4737b9J56m4j38K12j54J0rj1R9j39M0JK4R6l60n5L24j52M8J61M2O8m08R1L70K3
4763B66k84m5J13j74J17K66j25j12j43K07J21k43k02J02K65L6j46P3j1K8j08j28
$$ plain form
4596 -130 -175 -367 -70 186 119 222 125 -192 -40 74 -239 -176 92 223 78 -17 -41 -41 190 19 4 67 0 -81
4620 -81 116 60 -202 122 -30 0 152 125 -52 109 97 -57 166 117 193 44 -107 26 -192 -208 -246 -327 -136
4643 -136 335 -77 -58 -62 -149 100 40 95 175 121 -53 -115 228 -59 -48 22 327 25 243 99 -157 -23 5 -102
4667 -102 74 151 173 -263 170 385 -69 46 104 88 -168 -151 -24 -31 13 168 -27 -25 20 -158 112 -259 142 -48
4691 -48 56 42 210 -100 284 117 65 -13 -250 -132 6 -130 -200 -247 105 -62 -17 187 -318 -18 -62 -234 264
4714 264 93 100 -407 -106 -60 190 -143 -69 79 60 219 73 -166 141 -84 -351 -248 -48 -46 8 23 -217 -29
4737 -29 127 83 -55 157 3 13 4 -7 92 -47 -7 -6 18 114 -246 -301 23 -129 -81 80 122 190 -218 -127 243 266
4763 266 -18 -63 50 -124 -7 259 134 22 -121 86 207 -36 -238 -136 129 165 19 92 81 109 1 -127
4785a27L23k83j97L39j19Q0J03j92J98k20J02N5L5j20q5J84p0k33M46j94k37L73
4807A61O2k23R4l63K26K33m88L43K6P8j75M5J9k7j16K11kJ2R8k82L89k88j72J7
4831a22J77j84K49p0o5j24N2M49l18Q4q6L83m12n6q1JL11j47O1j15J41p3j11j53
4855b09O1M8J39j18J13J58p1k14N0M4k4J92K07k35j71J27j74J29N3m32L91k3q3
4878d2pK04k07k77K70K10j45K64k78k09L12p0Q5n8k6J43p3l85o7K10K43m3J53
4901B07k58Q7Q2j96j23L08j0q1L21k40p0J40k18p1L19j04j1j21R7j97K10O7oo3
4925F9n8K72l9j10l39K54j10J53L9j26n8j10P5jK27k51K43L1k74J95j84N0J07
4948E5k05P2j6J1O5o0J68j59j2jL5j5J36Q9j92j89L57l87J80K00j63L45k82l04
$$ plain form
4785 -127 196 -87 -284 55 -64 16 119 -73 125 -95 7 62 97 -23 -108 76 6 -227 219 25 -212 161
4807 161 223 0 94 -269 -43 190 -298 45 71 149 -26 19 38 11 -105 106 104 116 214 -68 321 33 -139 -122
4831 -122 55 -129 120 50 -15 -139 -87 362 44 128 42 425 13 -43 -124 -123 188 41 102 -13 128 55 -56 -209
4855 -209 -148 -100 39 -79 34 192 121 -93 -43 1 -23 169 376 141 -30 97 -77 52 105 -327 64 41 -42
4878 -42 -49 155 -52 -329 -59 151 6 270 -8 -217 95 25 110 52 26 169 96 -289 -356 -146 97 54 207
4901 207 -51 36 118 -78 -201 107 97 16 337 97 27 167 -51 -122 197 93 82 -39 58 -139 71 138 132 69
4925 69 11 283 244 134 -205 49 -61 92 131 5 -53 -163 -88 -89 138 -113 130 161 -113 82 -102 -52 55
4948 55 -150 -78 -94 -83 -18 -78 90 -69 -81 -82 -47 -62 74 163 -29 -218 139 -248 -68 132 -31 314 32 -272
4972b72K47J97l52K74m2N7pJ01m67K04r4K69K1m74L02L4K81l50K7K76r2q2l94
4995c36K45Q1R4l5Nj2K0Kl06K12r7Q6O2m2k8k66N27l22R3m9l16K95P5J34J21k50
5021gP8n5l91N46n7j13M0K5J86o5l03P1k8L00k70J27j64J64K6p3n9l07K20J61
5045E2K6K0j87J03j55J58p4J3P9m3J07j42J53k31n1J48J23J44k56J01O9r4l12
5068b49L91j27J16k85Q7O5j80J57n4J70j60o3N7rL7j0o2J2L5J68k07J64j13J8
5092d2l8L17l72L25k87L2J04k6j47J14o9J15j36P4k3L11j98j37J19l5P6k09J09
5115b3o2K01q4j21rK28lk01L4j64J0K01J6L67m44M49l46j03K51k47k5P3j12M09
5139B95l42N8J03q1Q1O2L0o2l14M17k83k0R1k8J56j58J12J24j80k10J28K40k45
$$ plain form
4972 -272 -25 172 -180 94 52 109 102 203 -264 -60 -154 115 136 -338 -36 -2 279 -71 -44 232 140 58 -336
4995 -336 -91 -10 84 49 54 42 62 64 -242 -30 -127 -41 21 -21 -49 -315 212 -110 -17 -66 -382 -87 -12 122 243 -7
5021 -7 71 16 -375 171 114 1 41 66 252 187 -116 -45 -73 227 -43 84 -80 84 110 37 -22 -329 -109 52
5045 52 78 98 -89 14 -141 17 -57 -44 35 -8 99 -43 110 -121 -172 -24 99 243 -13 88 157 63 -249
5068 -249 142 15 131 -154 -67 -2 -182 -25 -79 91 -69 -132 -75 -84 -47 -57 -119 -107 -72 96 -111 53 -60 -42
5092 -42 -80 237 -135 190 -97 -65 39 13 -134 -20 -89 26 -110 -36 -59 252 54 -83 36 1 77 -132 -23
5115 -23 -85 116 32 -89 -98 130 127 -74 -40 -204 -194 7 23 390 -54 395 49 -54 197 -50 -75 -2 -114 295
5139 295 -47 11 114 33 114 176 206 144 -170 247 -36 -56 35 7 163 5 117 241 61 -149 -21 219 -26
5162b6q2O6J97l61J51m4j18J89K6j9K5J04l2L3j85K72m04L26m2m6K09l2l14r2
5186a99L0q7K99j74O8K80m00P5R2K14k16PK06m9k19M8pj8J63j90k16N28j73j00
5210c8j90K42j54p3J49Q7n7o1K09j50%R6l04J95N8j2l88K10R3j22J68j53L37k41
5234i9k41L09l5l1j8J34m3j95N5J02M6N3j12p2J97l7M2O3l11J10J16m9P2R5j03
5259D8j6j0q9n4m9J40j51J67j27J55k39L15j08j7k02J67j5JN1j9K2j77M40k05
5283B8p3k1J42j79L47k27J89m90L21j4j46J28O9o2j01R5o0N0j86Q8L39l60J90
5306F7k78J45J52O1j03J03l0p6j99J56LPo4m9j37K24j10K30J16l57J2P5M0o6R2
5331A4k12K57J47k4j24n7p1K46j60j49J84j9L35l52J52k90N6J66k00l6L24m68
$$ plain form
5162 -26 -108 -42 155 -206 -55 -99 -217 -28 -2 -21 4 108 76 109 -76 196 -208 118 76 30 239 207 -107 -199
5186 -199 -169 -256 43 -131 -63 217 -183 -108 -16 198 -18 -11 195 146 -73 -25 -32 -50 113 -77 -293 235 62 -38
5210 -38 -228 14 -140 -213 -64 23 -34 -95 114 -36 -36 60 -244 -49 9 -3 -391 -181 -88 -210 -42 -195 142 -99
5234 -99 -340 -31 -66 -97 -115 19 -24 -219 -164 -62 -16 37 -75 -147 50 13 55 118 -193 -83 33 -16 56 151 48
5259 48 32 22 -67 -121 -170 -30 -181 -14 -141 14 -225 90 -18 -35 -237 -70 -85 -84 -33 -52 -30 -207 233 28
5283 28 -45 -66 76 -103 244 17 206 -284 37 23 -123 5 74 12 -89 6 -54 -4 -190 -102 237 -123 67
5306 67 -211 -66 86 147 44 147 117 41 -158 -2 1 8 -56 -105 -242 -18 -128 102 218 -139 -127 -52 -12 -78 14
5331 14 -198 59 206 182 58 1 -70 176 16 -133 51 32 367 15 167 -123 -67 99 -101 -137 187 -281
5353b81L69j23k7L77m96K69o4Q2p3j40J28lj59L6K15k87K18k04L26j64J52k11
5375f0K48Lm07J71M3J37n9j17J24J6r1l0o5P9k66M09j40m2J61l46K30K07k94K65
5399A76j53p4J88j37K3p0j08K9J55j66J99j51j05j49N15k55K70l08K55J92l25
5420Aj15J3q8J75J21k7k36N2L90k67K7q4lN3J32l76K42o4K5k0k8OnO0j6j33J18
5447d7j74k8K39J87N8k15j24j91M84l83Q9M31k83mM7k45K87r5lJ27m74L53j8m5
5471b7J0q7N2j50K28R2k32J32O4m65J66M32l09J31j90J11QQ2l14J81L01k73j09
5494a66J64q3p7K80j94j7J08p3J46j68O6k99K51j7p0J29k79J45J73J21m4k77L2
5517a49L2O3J66K11l10l44K73K0j46J80r8L6j5K23j67K4J2j26K63n9J8j98KJ04
$$ plain form
5353 -281 88 -35 -62 315 -181 88 24 106 33 -107 21 18 -141 -105 110 -177 41 -163 163 -1 151 -60
5375 -60 188 191 -216 -45 -2 135 76 -41 83 99 8 -22 -87 -8 -274 135 -5 -47 114 -232 -2 205 -89 176
5399 176 23 -51 137 0 23 -47 -155 -126 29 -137 62 -89 -194 -343 172 -83 187 -121 134 326 1
5420 1 -114 -101 -189 -14 107 80 -156 -104 286 19 46 -38 -41 12 144 -232 10 -54 -29 -49 -77 -71 -76 -16 -32 -165 -47
5447 -47 -221 -249 -10 177 235 20 -104 -295 189 -194 -105 326 43 39 86 -159 128 33 30 157 -317 36 18 -27
5471 -27 -17 -104 -52 -202 26 118 -114 18 82 -383 -217 215 -94 37 -153 -42 -34 48 -266 -85 216 -57 -166
5494 -166 -2 -85 -162 118 -76 -93 15 -58 88 -80 -14 -313 -62 -79 -149 -20 -299 -154 19 140 96 -181 -149
5517 -149 -117 -54 112 323 13 -331 -58 -38 -184 -4 -102 -66 -81 142 -25 -1 11 -115 148 89 107 -91 -89 15
5541A5j48J51J72K1j12l0J50m30L92j68k57K36P6K6k80L56p9J4j5l51K87r8q8
5564a60J42J51k48j14K88J56m37J9L34j44J33q2n2o6J78N0l31mJ71J48m49M01
5586H4j45j85L23k36Q4L2O1J32j91J3NK67k32J9j00J37Mq0o0j75M78l22P2P0P0
5611A25l04K09n4j26L47k48Q5L0k8o6KP6J18j63K48l00o6%m0R3j46J16Oj60K56
5636A0k7j42J57j0k08J05q0J00K42P1J12m10L14k22J21l60J50p2L94j69j17K07
5658A66j4q5O6k9O7j91k7J47k67J45Q9m6k57J55J7J42R0k7m1j59r3j39n4K95K03
5683A53m42k1L80k55j4Q2j3P7L13r9m38M10j01R4k00M6k0j32P6O7L6J16l41K97
5707G1J22J45j94Jm13N2k1j07J05L96j08k42K07O0k00l2K48j28K3j47L6M1j18
$$ plain form
5541 15 -133 18 190 211 99 69 219 -211 181 13 -244 -8 68 94 -186 170 91 105 90 -261 26 -72 -160
5564 -160 -18 133 -115 -229 59 215 -222 -203 131 -13 120 38 -14 -80 98 148 -183 -187 -16 132 -317 84
5586 84 -61 -246 77 -159 -75 -43 18 150 -41 -28 -23 244 12 31 -69 68 72 -8 -68 -243 235 -87 -15 55 125
5611 125 -179 30 -24 -150 197 -51 34 64 36 -30 -28 48 166 3 251 -49 -115 -115 -155 -62 -208 -92 -86 -246 10
5636 10 -17 -159 -2 -12 -220 -115 -195 -95 147 218 330 -80 234 12 133 -227 -77 -149 245 76 -41 166
5658 166 152 67 133 104 171 -20 -47 100 -167 -22 67 21 -236 -81 -64 78 168 141 100 -59 -152 -291 -345 -50 153
5683 153 -289 -310 70 -185 -199 -117 -130 -53 260 161 -277 133 32 126 -74 -28 -48 -180 -104 -37 -1 115 -226 71
5707 71 193 338 144 145 -268 -216 -237 -344 -239 157 49 -193 14 74 -126 -158 90 -38 -15 -162 -126 -85 -203
5730b03K66qj84M8J48J54j82n1Km6Q1L8o3k31L23O1l11J78r0J23L5Q0pk06P5J96
5756B26l19K64j59p6K69m70L88p3j59J40K9k12K6M24m14l1Q5j05K02Nj05M51n23
5779a37p0M55l8M7m44O1M9J56K41l63J34K1l2N9J5n1k2J87m4p6k92J18L9j48L3
5804a02J10j83J5J0J08M1j10J85L8k92J43Q9m7K37l68n7j51J96K41k73M4J97j24
5827e3Q9j3k59N07k82K82j67Lr1M2k88M86m95N6K49j4J01m4j80M5M24n79K48O6
5851A33k81J55qn0r4L05qj07R8k39J82LK52m64j40L83k42K74J22j25k55K22R2
5874B08n04M62j64k6p8J39r7J09P5j31J86n8k40L22j06l68K76K01l44mK64K49
5896C71j92j43k62k5J06K17l00J83r8L09k1k04j51j8L30K4R5m98M13r7k76K91
$$ plain form
5730 -203 63 55 -129 -81 67 221 39 -12 -10 -56 25 63 0 -231 92 153 -158 20 -70 53 88 168 161 -45 30 226
5756 226 -93 171 12 -64 205 -265 123 50 -109 31 60 -152 -126 298 -116 -147 -62 -167 35 40 -65 386 -137
5779 -137 -207 248 210 257 -187 -126 -77 79 320 -43 91 112 80 139 154 103 81 268 224 148 -144 -26 13 -135 -102
5804 -102 8 -175 -160 -150 -42 -1 -111 74 112 -180 -37 52 5 242 -126 -183 -334 -138 103 -170 -126 71 -53
5827 -53 36 23 -236 271 -11 271 104 107 16 58 -230 256 -239 -183 66 52 153 109 -71 -26 398 -181 67 133
5851 133 -148 7 -1 -51 -145 160 152 45 143 -96 86 89 341 -123 -263 120 -122 152 274 149 -106 116 208
5874 208 -296 166 2 -24 -102 37 -60 49 124 -7 179 121 -119 203 97 -271 5 206 -138 -142 122 371
5896 371 179 36 -226 -251 -145 72 -228 -45 -143 166 145 -59 -210 -228 102 126 221 -277 136 39 -237 54
5918E4J5k95jK14K6K21l50M61j55j76K2j14Mj1j1J59k57J53q6l8N03o60M22M0
5942A40q4q7r2j54N04l54O7l9N7mL4j02K5l8P4k46K3J36J07j90L99n4k1r8j6j98
5968b11K32K44m95J74K1p7Ll5J16M0N1N0q6j4p2L03k25J9k11QJ14p5K31j52j23
5993a70L6K7J90Q1j16K45k50J9K51k46pj43K7K7m6M7P4p3j30M14m80L44qK3p4
6018F2j35J67n6K06l46J43o6L2j1L2j13K3K17j79K49j59j06P6j30J84Pk10j70
6041b83L72oj26j12P2o0K35l33Q0J56j52J63j7Qj40K4K28j08k6j90J42o9M3O9
6065c0n9P0K97k03r9N31p28q2K14M0k6j80L37m8k22N06l91L35j44m0r4j8k22N23
6089B67l56J48l47K71m4J2K09j56j17N3%J59j66J90j52J12M7k31Q5r2k1J58k21
$$ plain form
5918 54 69 -226 -227 -13 13 234 -116 345 190 14 36 -78 -74 -85 -96 63 -194 -41 -127 -165 338 -322 100 140
5942 140 56 -31 -123 -277 227 -127 -60 -99 -42 -46 -12 -114 -89 -127 -53 -299 -276 -140 -33 -223 176 122 101 3 -13 -211
5968 -211 21 265 -230 -56 -35 -112 -109 -144 -28 12 63 113 27 13 -59 244 19 38 -173 -165 -51 -126 105 -47 -170
5993 -170 -134 -107 83 164 48 293 43 62 313 67 60 -83 -56 -29 -75 -28 46 -27 -157 257 -223 121 113 136 62
6018 62 -73 94 38 244 -102 41 -25 7 -4 28 -85 -62 155 -24 225 66 -40 36 -94 90 97 -113 -283
6041 -283 89 83 -43 -155 -83 -143 92 -241 -161 -5 -157 6 -11 -3 -143 -119 109 1 -25 -215 -73 -142 -99 -30
6065 -30 -89 -19 278 75 -24 507 -221 -303 -89 -49 -75 -255 82 34 -188 318 -73 262 118 78 -16 -34 -256 267
6089 267 -89 59 -288 -17 -61 -49 160 4 -113 -60 -60 99 -67 123 -29 83 130 -101 -16 -108 -129 29 -192
6112a92L12l21J63K1j6J86qJ41k49o4N8j80J98M4q8K9K2q4L51m65J44j65j18J72
6136a09K98m08J84rJ36l72J66J41J89j01l45L31j46r3P9J54j1N1Ol0k53L03n4
6159A07l68j4L98o2J1l16l2M17k31q8J20J77k51L82j37n6l2J4p0J0j68K50N2M6
6183A59K5j00j40j49m7R8J84q8n8L0K40k35K34r4K50j27k91J40K9o9J82r0j67
6206h4K2j10Q1K44N3l46K58p5j22K79j63J33j95M6K69j78k02K70k99j33K93j56
6228a15J37M6Kj10j7K87k15k03K11l0j50J1K07k02q5L96j83J93j26Q6k11n8K31
6251A02j16K4K4m6l6R1J25j5k16j08K98j76j44J94R8j15m1L15m0k32N5k03J81
6274A9K95k14n6k64K89j64R1N7j20M25n59J76j37p9L79n4J64m05k9K14j96J59
$$ plain form
6112 -192 120 -201 -38 -17 -33 153 145 286 37 -27 31 -149 49 93 5 34 56 -28 323 -142 2 -163 -281 -109
6136 -109 189 -219 -35 -44 92 -280 -114 27 216 115 -230 101 -45 -138 -59 95 84 135 141 111 -142 161 107
6159 107 -261 -275 123 61 72 -244 -276 141 -90 -178 -58 119 -132 250 113 57 25 39 -31 -21 -189 61 113 159
6183 159 184 84 -56 -205 -252 -154 30 -58 -116 -86 154 -81 153 59 309 182 -109 31 60 -9 173 83 -84
6206 -84 -62 -172 -91 153 206 -140 118 43 -79 200 37 170 -25 21 290 112 -90 180 -119 -252 41 -115
6228 -115 22 68 70 -40 -57 230 15 -188 23 -7 -157 -146 61 -141 -226 170 -13 180 54 140 -71 -129 102
6251 102 -14 10 34 -12 -48 43 168 153 -63 -171 127 -49 -193 1 99 -16 -57 258 218 -14 41 -162 19
6274 19 314 100 44 -220 69 -95 -4 53 -67 358 -201 -25 -162 -241 138 84 248 -157 -186 28 -168 -9
6296iK66j46j58K6K72l94J46j87M22q6j86p8J27k29L88l79K74Q8J3Pk10l5J05
6319C7Q3j09j54Q9J53ol00K9J95j72M3K10j56R9l63M50R0j65m7j02J85j13n7J24
6343D3j27J24p8k44L04J61m54N29l42R3o2J00Q9N8k01l6O1N4j64j50M31p9r1P5
6367I4R8j69K2k2p6JJ42j85J91l5k56J30P5j34L08rk74oJ19j54K40k02L3J36m
6392F3R8k22L31r5k19K46k65q5K20k64J99M9k97L08M2r4j32J61J05J35k32m8r9
6415i5J26p3K30j39J58l27L65k91n9J39J0k30K40q9J14l14L59k16j29N16j62j67
6437c4J4Q8Jn8j48J45r0nJ16J26l35J96M9K2j74N1R4k57J16K36j46rKL25j23p6
6463A26O9l16J47o1J06l2j26J73j71p1K86J45m05J64N4op0j15J18k55M39k89L1
$$ plain form
6296 -9 257 111 -47 -21 251 -143 3 -184 238 152 -34 -112 15 -214 174 -205 69 157 170 177 -33 -68 37
6319 37 120 11 -143 -54 99 93 -207 -178 17 -155 -112 98 -58 41 -322 128 218 53 6 -96 89 -24 -81 43
6343 43 -84 40 -38 -282 22 183 -271 258 -84 9 -53 47 136 194 -7 -43 18 72 -92 -242 189 110 19 94
6367 94 192 23 45 23 -53 -52 90 -95 96 61 -195 -65 10 -124 184 175 -99 -105 14 -140 100 -102 -69 67 63
6392 63 161 -61 270 175 -44 202 -63 -148 72 -192 7 56 -241 67 109 15 -117 44 149 284 52 4 -95
6415 -95 31 -42 188 49 207 -120 245 -46 -105 34 44 -186 54 -35 79 -235 124 -92 -221 295 133 -34
6437 -34 -20 68 69 11 -137 8 -82 -87 29 155 -180 16 65 87 -87 -36 58 -199 -83 153 7 -2 0 325 202 126
6463 126 195 -121 26 -35 71 39 -87 86 -85 -156 130 275 -130 34 88 82 12 -103 15 -240 199 -90 -59
6486e9J41k14L58j67n8MJ4L74k91k6r7q0N5j7J30j41J71l7K0L4l05O5K02j35J93
6511A34k4k20J31J55j17j41J06j61J8P3K67j32k07J1N3j16J52M3M5N5J44l4O4
6534B99l06m3J68Q2k22N0K41q6l51K85q0n7N0j81J11J9Q3O4j14k72O42k72n8J
6558E3j21k33K22J68k48K04j55j47P4M11m37k4J59K79l15l8R1NPl32M91l70J60
6581i6J06J47k84J34Kj04K88k57j48J09J6M1j90K33J44j43j73K74k0k4J24J08
6603B87j89k32J12M3j46j42L49m6j11J70%j40j5N4M9j97J92J07k5k57l6J10n3
6626a16m5L77r0m08l0J69P5oJ31J1J11j41R1j14j74J1K5J87j43j72K91l21K53
6649b8p6O8P2l2J33k34J33k2k09K39N9k7J40l61N9J97k05K97l70K61k06L97m22
$$ plain form
6486 -59 82 -132 226 59 1 5 19 393 102 76 -21 -101 -46 -63 67 -74 97 60 80 114 -191 -126 76 -59 134
6511 134 110 -110 21 176 59 -82 24 -137 -119 -46 221 89 -118 -107 -54 -170 -18 25 70 125 269 235 299
6534 299 -7 -50 118 200 -22 28 269 183 -168 117 37 -20 30 -151 -40 -21 62 126 12 -260 382 110 52 53
6558 53 -68 -301 -79 89 -159 45 -110 -257 -183 228 -209 -233 -74 205 -110 -148 -57 -52 -45 -377 114 -256 -96
6581 -96 10 157 -127 7 9 -95 193 -64 -212 -103 -87 -46 -236 -3 141 -2 -175 99 79 55 179 287
6603 287 98 -134 -22 21 -125 -267 82 36 -75 95 95 -45 -60 -6 43 -154 38 145 120 -137 -173 -63 -116
6626 -116 -161 216 126 -282 -312 -143 -68 -74 57 68 179 38 129 15 -159 -148 -123 64 -79 -251 40 -281 -28
6649 -28 -104 -36 36 4 137 -97 36 14 -195 44 103 76 216 -145 -86 111 -94 203 -167 94 -112 285 -137
6672a37O6j10J69J60j15j76L64j93n7J39l53J61J15j07N0K21q6k32P6J46l29K41
6694A3l18M88j83p0K24k12j16K75n7k2j23J31n7n2L89m06O8J00k57L87l41K64
6716A25mJ19P9k89k20M53m68J07K51J15l78P6jN9r2J20O4P9J37k91j4r8L7j64
6740a98M5o5L55o2Rj45J5j90L52j57j75Nj2K78K92o95J88K73j54K00k67J46j64
6763a26m2K80j89J8j12M7mR5ORL8m6L5L3o0L90k62k23P4j6K04j3j92Qk28M04k56
6790a28J32L44j34J03k21m27M31j2Q2k11o9MJ10P9k76M33m01L5l1J81j95J83K07
6813B19m18P0J04l2O3m2j95L12l6l23K37R5k86K66J20l38L71j74l9K48k81J67
6835A08J4l6j67J5N8P8Q3K09k19k39P6J65Jj07K07k19j59L07J00l98L31j89r8
$$ plain form
6672 -137 -71 -181 -12 148 33 -143 221 28 -29 110 -243 -82 33 -74 -24 197 111 -121 -45 101 -228 13
6694 13 -305 183 0 -70 154 -58 -174 101 44 22 -101 30 -27 -79 310 -96 -28 72 -185 202 -139 125
6716 125 121 240 319 30 -190 263 -205 -98 153 268 -110 -34 -35 24 -68 52 116 195 332 41 27 -71 -34 -198
6740 -198 -153 -218 137 75 84 -61 -46 -236 116 -41 -216 -211 -223 55 347 -348 -160 113 -41 159 -108 38 -126
6763 -126 -168 112 -77 -59 -171 -124 -128 -33 -27 -18 20 -26 9 42 -18 372 110 -113 -39 -55 149 136 -56 -48 -276 128 -128
6790 -128 4 348 214 317 96 -331 100 88 170 -41 -110 -106 4 83 -193 240 -161 -126 -157 24 -171 12 219
6813 219 -199 -129 -25 -57 6 -36 -231 81 45 -278 -41 54 -232 34 154 -184 187 13 -26 222 -59 108
6835 108 122 86 -81 -66 -8 70 153 362 143 -96 -20 145 146 39 246 27 -132 175 275 -123 208 19 -79
6858g9j24K38j22Q6R3o9K79l56J02j6N7J5o4j12J76k77J21q5K3j83M42k67M44
6881C22k81l5R6j68J99l35K46p0J79l42M00k85j22N1J20J26n3j08p3J43o7j54
6903b11N6J9L12jo4N8j02L44j50l50J21l33L56P8j95J39L4q5p1k08M47m5K3k08
6927c6P9J55p3k26J03j20k69M84j0k23K42M7j8l14J13J03J8r8k7K28k09K53k75
6950g3K01n6k1M8j08J66r9J9j12k9j33J33m17Q06k18K8l22J11P7k16N36o8m84
6973b31J20m0L8J16l0j42K33l02L30j47pJ10O0J61k30O1K2l02J91L55k1l38p2
6996f5m5kL43l94M64m52L87k81J68K33n05J94J27r4L21m25q8k99M47o4j49P5K21
7019A17k13n3K44k56J73J95j01m5j53J46r2P8j2o2J57k61J65l8K89l39j01J34
$$ plain form
6858 -79 -203 35 -87 -1 92 23 302 -54 48 32 89 104 40 -72 104 -173 -52 -137 -114 -297 145 -122 322
6881 322 41 6 102 -66 133 -202 44 -26 153 -189 211 -74 -196 -145 -25 101 48 -60 -133 10 -57 -211
6903 -211 -155 -136 176 175 111 169 67 411 261 -89 32 -301 55 133 -62 77 111 26 -45 -253 194 149 172 -36
6927 -36 43 198 125 -101 2 -118 -387 97 87 -136 106 153 135 -179 -66 37 55 -43 -70 158 -51 202 -73
6950 -73 128 72 51 99 -9 157 58 77 -35 -64 -197 -64 -481 325 107 135 -187 -76 1 -215 321 253 -231
6973 -231 -111 -151 -113 3 -27 -169 64 -238 92 -55 -62 48 108 269 39 100 122 -180 11 366 345 7 -65
6996 -65 -110 -112 231 -163 301 -151 236 -45 123 356 -149 45 172 78 399 -26 -114 -413 34 -30 -179 -104 117
7019 117 -96 -149 95 -161 12 207 106 61 -92 54 -38 40 28 -34 123 -138 27 -11 278 -61 -162 -28
7041b8K87l63M4O1J66r1M7k31k1K02P3j11M3j14J44j55k8j01J11n9J72j54q6N48
7065C56m09j86L03j46K10n8q0J77m09L42m19K00L24j30k42K32j04K8j3l4M44n94
7087b08Q1J02n1m2J73nK6l16N9O7o8L17r8J17n5J07k57k29K60l6O6j90K03j97
7111a74L28o7j98q0l4M70l84P9J07k09K17k5j58R9L71l80L13k78k11J20n1r4O6
7134a73o3K67J9J22k56J54l97L59n9k7K35k99J08L4P1j05L24m22J56j59K65m6
7156A08M9k03K51P0l32m8o8J05nL6K0j83K29l8K18j22J05m7k9R4j29j57J79k22
7180a19J1J60K20j67J39k37K26k13m4R2J67l30K11j02j8J11k03L54n52K09J35
7201E0o0j1R8o0j74J22J49N1j19r3j76j96M27lO3k3N9j69J38K69m89J30k17K43
$$ plain form
7041 -28 259 -104 -60 1 167 76 123 -108 -129 73 146 35 78 -36 108 -47 -75 -176 -65 -124 48 -106 -192 356
7065 356 -53 -239 64 -82 128 70 -10 167 -242 100 -319 -119 205 75 -167 65 -39 -11 -24 -58 386 -208
7087 -208 -127 -25 -76 -118 55 50 76 -240 -181 -114 -182 135 37 154 99 206 -51 -280 -20 -56 10 -180 23 -174
7111 -174 154 87 -111 -191 -225 245 -139 -60 47 -162 55 30 -128 -29 342 -38 275 -3 -214 -94 -145 -239 -173
7134 -173 -236 31 50 172 -84 70 -327 32 -27 -54 181 -118 -10 24 95 -10 314 -108 48 -111 154 108
7156 108 157 -46 205 275 -57 -105 -173 -68 -73 -37 -17 -200 29 -9 209 87 192 145 116 210 81 -76 103 -119
7180 -119 -108 52 272 105 244 7 233 20 -24 68 235 -95 116 14 -4 107 -96 258 -294 -85 50
7201 50 -10 -21 77 17 -157 -35 114 165 46 -47 -223 -419 8 5 68 45 104 -65 73 342 -147 -17 -234 9
7225Ij25J22n4K12k5k73L58k3l20J73o4J4Kk4J57l77J89j23J55j98K67k7L5k19
7249a59jL99l19J50j26k14L42j78L54m64K54k24K90J08l97O4j89K57J81o2oj62
7271a02J63P8r5k16K10l40N99j97m23K18J14K4l73M17k80J81m9j24J94J19n5J94
7293B57j22n8k07K22k56M90n42L10k04j98M56k10j88O8K95k69K56l1j32J79j31
7314a5j92K00J37q8J76m40J68J65J94k35qQ7j33k01J36J87j23o9j03L2M48m79
7336a56K1O0L14j27j67O6k3J96j44j34J7K04J2l41K36k0J14k76K34l8J91l02K78
7359B15r5j92K49k9j77K94j98ok07R0N4K25l40K27J09L5j54j94R2l7j14J59L3
7382C9o7j34Q3kM8j14J10J23J39k26j64K78j08O0l2q3k4q7J04kj28J77L17m06
$$ plain form
7225 9 -116 6 -48 164 139 -134 224 201 -119 54 -10 4 6 -18 139 -238 -49 -172 -17 -215 52 25 60 -159
7249 -159 -160 239 -80 70 -56 -270 72 -106 248 -216 38 -186 104 212 -185 -121 -310 -53 128 66 60 -102
7271 -102 61 139 44 -172 38 -302 297 100 -323 -105 9 33 -340 77 -203 -22 -71 -195 -1 118 63 257
7293 257 135 77 -130 92 -164 326 -216 94 -110 -308 148 -62 -250 -182 113 -156 100 69 -63 116 -15
7314 -15 -207 -7 130 42 218 -222 -54 111 305 70 62 149 16 -185 -49 138 15 -54 -157 -125 323 -156
7336 -156 -135 -75 239 112 -55 11 -12 184 40 -94 -77 127 139 -202 34 14 128 -148 86 48 239 -63 215
7359 215 120 -72 177 148 -29 265 67 61 -146 -56 -2 223 -117 110 219 254 100 -94 -2 -39 -153 6 39
7382 39 -28 -162 -79 -81 -33 -147 -37 86 225 -1 -165 113 5 65 33 -50 -74 -161 -57 -59 -187 -10 307 -99
7406i9qR2K3J31k80K12ql0J49l74L16j87L8J35nJ21l67j8K09N7j9k32M1O6J9L0
7432A2n6j4L13n12K84J56k67j01L15j76O1n0R7r3m8J0P1k95L03K65j86j7j1J16
7456A77j27o8l36N48l72P7J42K03l34K11o1M2j82J95j59m06P27l49K17K2k58J04
7478A3o2J51P6j17k37J71p1J81j84Q3j60O3J18J10k35J62j0O7j04l0J50j71J95
7501A59j8k15l5Q6L0K1J06j82J63k23K24k50j3K7J23j89M05j43M9L3l27RK40M
7525H4k4L7k29M4J50J48l60n2J36j0p4M47k96K4L15l17o0K47j5m44O3J35J94j54
7549a1J11M4r6N9j48J63j71J79k54k7J91k64J25J1M4n6OM0rK02j60j13L65k73
7573d2J89k72K34J28k34r2L50l41K80p2j81LJ88J61k66J50m7P4m00L96j78r0J87
$$ plain form
7406 -99 -107 -15 8 139 -141 71 63 33 182 -192 124 -63 -25 110 105 226 -141 -159 50 107 88 -144 -103 -37 -18 12
7432 12 -44 -58 255 -257 27 183 -84 -185 130 -46 15 -35 62 -31 -79 -69 2 -293 10 275 89 72 61 177
7456 177 50 -18 -354 194 -178 -101 41 244 -90 121 60 102 -80 115 -44 -450 277 -72 145 167 -91 13
7478 13 -49 102 178 61 -176 -5 -76 105 -79 4 -156 -93 25 135 -100 62 52 119 15 -15 135 -36 159
7501 159 141 -74 -109 -23 7 28 134 -48 115 -108 116 -134 -147 -120 3 -186 219 76 125 158 -169 -160 80 84
7525 84 60 97 -132 -88 62 210 -150 -202 -66 -76 -150 297 1 25 340 23 -37 210 195 -249 -186 -51 143 -11
7549 -11 100 144 48 107 -41 122 -49 130 -124 -151 40 -224 -99 -88 -44 -100 -94 -54 -63 139 -21 -134 231 -42
7573 -42 147 -125 109 237 3 -89 261 -80 200 128 -53 -50 138 299 33 183 136 210 -190 206 28 -62 125
7596A25j9k12K45l39Q3J72K0J65l09r8M15n45L77o0J09m8j93L6qK59j05j05j97
7619b32M28j00k31L75o80N41j92nK29P0k16l1Q0R5j22J66l44J53J51r5j7J53j81
7642eRl4j13J49N4j50L4J96k51J85R5J50k90P6k45L8j71L34k0k26N9J89k01Mj62
7667b96K61J08j20J70m97M28m74L98m0m0K07k15K33l15L41J06j69j20NM4r6K7
7689e4J5L1PM9rJ24j90J08j85LrL07O8j72j98J94l19L20j62J16K8k34K19l02J11
7714a34K47lL6r6j02K67K1j36j90J11O8q0R9k1j87M07l09j03r0L22j57R4j12J66
7738A18j18k1K7j32L00k06K10q9J4j71J5j17L32j08l56P2J22M1MN0J8K44l92O5
7762g8K70j30J4m23N85l57J36K68j90k70m4K98q4k71K61J52m02L84l33L54P9o2
$$ plain form
7596 125 106 -106 139 -200 -117 55 75 240 -69 -167 248 -297 80 20 129 81 -112 -76 -84 175 70 -35 -232
7619 -232 196 96 -135 240 -440 101 -91 -96 133 203 -13 -44 36 131 9 175 -169 -16 135 40 23 176 -5
7642 -5 4 -30 -143 6 60 -90 -56 140 -111 74 169 319 29 105 -140 -102 -273 61 41 -185 -126 63 -138 -134 -296
7667 -296 -35 73 -47 123 -374 54 -420 -22 -62 -102 105 -110 123 -192 149 255 86 -34 -29 15 -81 -54
7689 -54 -39 -8 -1 48 39 163 -27 81 -104 -101 -110 197 265 93 -105 89 -230 90 -72 44 72 -162 57 -245 -134
7714 -134 113 110 146 50 -52 215 236 100 -90 21 89 9 108 87 -100 307 -2 -105 -195 127 -30 64 -48 118
7738 118 0 -21 6 -126 174 -32 178 89 103 -68 -53 -170 162 54 -302 -230 -108 -67 -63 -13 5 249 -143 -78
7762 -78 192 62 76 -347 238 -119 17 285 95 -175 -219 79 -5 -276 -15 137 -265 119 -214 140 219 157
7784A57j50j53J60r6K51k92J39k07P3J22J98l63L57%j97o0Q9n0L58j64k13M2q
7807gL9Q2k03K73j29K04k97N5Q2r4L0J76k2j08q1k15J01o6L47p5J74l42J00P9
7831A03L3q6k7K13r9j44Q2j22RK00K2l22K08k4l49L06M2k68R5K67l06K51nj39
7855f0J26M2q8r4K27l67M41k84N3L69j48m63K91l6j51K18k11J78N5J81m76N19
7877C22r4j47l23L65O1k62J06P8k69J15p9J09k9L63j38r6m4Ml30J09j18J47R6
7900e4M1m9j94L72k02J16M5J84l89pK21J37j84j13K23p2r8q1l9J91m3K41j39k90
7924a83J41j13J02lL28k99L14j95P4o1j68J1j61K57j36K03lk8p7k41L02l3j74
7947a43O34m91j8j9n5J51R7k38l7J4L5K2pj2p1L82l16Q9k49K04q6K40r3l31K36
$$ plain form
7784 157 7 -146 14 -82 169 -123 16 -191 -118 4 202 -161 196 196 -1 -61 28 -22 336 172 -41 1 -7
7807 -7 32 114 -89 184 55 259 -38 17 99 5 35 211 189 81 0 -215 -114 -180 167 92 266 -76 24 103
7831 103 136 50 23 236 137 -7 75 -47 -38 162 184 -138 70 46 -303 3 45 -223 -128 139 -167 84 79 -60
7855 -60 66 108 20 -74 153 -214 227 -57 -4 365 217 -246 45 9 -142 76 -135 43 98 279 -197 322
7877 322 228 81 -242 123 184 -78 28 106 -163 -48 -127 -18 -47 316 178 82 38 42 -288 -179 -297 -150 -54
7900 -54 -13 -62 -256 116 -86 30 75 259 -130 -137 84 221 37 -76 147 75 -23 -104 -143 48 5 246 107 -183
7924 -183 -42 -155 -53 -56 272 -27 287 92 166 105 -63 -52 -213 44 -92 111 108 80 3 -238 64 31 -143
7947 -143 491 0 -18 -37 -92 59 156 -82 -119 -105 -70 -48 -55 -67 -138 244 -72 17 -232 -28 -114 126 33 -298 -62
7972f2K25nk74J18k00P7r1J81NK1N5k78K22K25j13Q1l52J23K03j07j55Q5J4J20
7996A18k63L3J65j62J22k03M4L27j55J52K6j29j67K05L3j51M7j77q0L02Q4oj76
8019a1J77j42qj34P2j5j02L8M1j00J89J38l57K71m2l4o7L61l52K76l93K31O9n7
8043D9j68j91N09k02k34M06l63J46mQ3R6M0j63K5JJ11P5j96j84K18M3Q1l10J81
8067D9o3L02j15j20r4k65N60j49q4q5j28P1J87k42J84P5k78J15m6K30k0J61m82
8090b37L70m43J76K56n2j96M5j14J42J5N3q6K40j52R3n1l5k14r8L92l37K95j84
8113a22K75J56j60j01Q2k47j12K23j75M0R1o8O8P8l14J65J35j90k6J33K95M0k19
8136D7k04J20P8l2k74L00j4k11L0pM55j97l6j5j41j1R5n3J68Oj77K8M6R3n8o3
$$ plain form
7972 -62 163 158 -116 2 -198 -121 -212 -31 -26 -5 50 -228 -6 219 106 187 -165 -42 161 54 -101 -16 -2 118
7996 118 -145 -112 53 -109 13 -190 -146 181 26 178 204 75 -92 113 146 -5 42 -135 -215 87 171 165 -11
8019 -11 166 24 16 -118 -46 -61 -163 -125 -84 -184 5 143 -214 57 15 -19 -86 275 -77 199 -194 37 106 49
8043 49 -119 -310 199 -3 -237 169 -194 -48 -52 31 127 167 4 29 30 141 216 20 -164 54 97 178 -132 49
8067 49 -14 288 173 53 -41 -306 254 105 21 -64 -192 -121 66 -176 8 83 -195 -80 -126 104 84 245 -237
8090 -237 133 -310 -134 122 70 -126 -81 -195 -53 -38 15 -71 169 17 110 59 24 -190 -288 104 -233 62 -122
8113 -122 153 309 149 48 130 -117 -229 -6 -181 -141 -50 -118 -50 28 -286 -121 14 -176 -202 -69 226 266 47
8136 47 -157 -37 41 9 -265 35 21 -190 -160 -167 288 91 55 40 -101 -112 -17 -70 98 104 -73 -45 1 94 36 -27
8162b7j73K13J73l86K13kK15r1q2q0j40J77j30K47j76l4J69k38J87P4j80r3J34
8185c0K16l85K21J92k95Q3
$$ plain form
8162 -27 -200 13 186 -200 13 11 226 135 53 -27 -167 10 -120 127 -49 -83 86 -152 35 109 -71 -164 -30
8185 -30 186 -199 22 214 -81 2
8191B
$$ Imaginary data points
##PAGE= N=2
##DATA TABLE= (X++(I..I)), XYDATA
0@%%%%%%%%%qJ6j6K4l2M0m8N6p2Q8j09J32j59J84k15K55k96L49m05M64n35O12
31C25p00P98r02J022j151J293j450J623j814K017k244K493k762L060l381L734
47A961m121M541n005N512o072O693p382Q153r019J0002j1123J2417j3940J5754
61H371j7957K0705k4241K8991l5752M6222o4798J07788l98848j90103N35680K57925
73B73983L41051N9126k14490l90941l27394l32303o0297K09313L28694L39303
83B26045L48886O4769k08805k93293l22876l46235r3375J77980K90256L41631
93A84983L23305P6726j48703k57745l45469l19112p5821J28475K38716L42095
103A47450L09528Q0679j04300k21556l34633k98244r2510P5238K10509L37095
$$ plain form
0 0 0 0 0 0 0 0 0 0 0 -8 8 -8 16 -16 24 -24 32 -40 48 -61 71 -88 96 -119 136 -160 189 -216 248 -287 325
31 325 -375 423 -479 543 -608 685 -765 858 -956 1061 -1183 1310 -1452 1608 -1773 1961
47 1961 -2160 2381 -2624 2888 -3184 3509 -3873 4280 -4739 5263 -5860 6557 -7383 8371
61 8371 -9586 11119 -13122 15869 -19883 26339 -38459 69329 -329519 -519622 16058 273983
73 273983 615034 674160 459670 68729 -258665 -590968 -651265 -441952 -113258 226045
83 226045 574931 639700 430895 137602 -185274 -531509 -624884 -446904 -156648 184983
93 184983 508288 585014 436311 178566 -166903 -486015 -561836 -433361 -194645 147450
103 147450 456978 537657 433357 211801 -122832 -421076 -513586 -438348 -227839 109256
113A09256K94249R6505o5005k04988l23637k78065j08673M1433J99887L19128
123H0090K64530J13013k3789j87573l08425k56125j18611J0686J73706K91904
133C9406K53482J35547k018j74367k79200k41983j43266j0626J66785K67031K33842
144B44633J49164K0504j56578k55303k29928j52452k3211J45881K38280K24606
154B05596J61133L0626j37737k25494k20381j65924l5434J28014K12833K15445
164A68677J70005M1195j19335k02707k12093j69251m4109J08093J89676K07231
174A37382J71347M9262r6940j79492k06384j71559n0229Q8216J67448J99932J72118
185B81101N6675p7685j59335j96522j71485n9855O9167J50577J91527J68546O2996
$$ plain form
113 109256 403505 500010 435005 230017 -93620 -371685 -480358 -438925 -239038 80090
123 80090 344620 457633 433844 246271 -62154 -318279 -436890 -426204 -252498 39406
133 39406 292888 428435 426417 252050 -27150 -269133 -412399 -423025 -256240 10791 244633
144 244633 393797 414301 257723 2420 -227508 -379960 -403171 -257290 -19010 205596
154 205596 366729 397355 259618 34124 -186257 -352181 -387615 -259601 -46768 168677
164 168677 338682 379877 260542 57835 -154258 -323509 -367618 -259525 -69849 137382
174 137382 308729 357991 261051 81559 -124825 -296384 -346613 -258397 -90949 108983 281101
185 281101 337776 260091 100756 -95766 -267251 -327106 -257939 -107362 84165 252711 315707
196C15707n7186j42004j89534j67688o5079M9623J32182J84077J66241O8270m1112
207B53497j24226j78942j64272p1738L2596J18153J74484J60680P4245k2893j10793
218A40791j70805j57496p6675J5579J03913J66048J54275P8649q782r6491j61237
229a2231j51368q2436K397R2811J55838J46732Q4907L978q7226j50014j42789
240a39401q8007r766Q2543J44245J39705Q9693J4065p7042j37825j36737r2768
251b11295j7991P1884J31466J34584R5221K1328o7262j24623j31934r6954k4596
262b20172O2199J18846J28326R7710K8892n6650j13552j27047r8055l1248N0172
273a60579J07674J25182R9478L2857m4817j01444j22668j00252l5749M0488R6870
$$ plain form
196 315707 258521 116517 -73017 -240705 -305784 -256161 -123979 60098 226339 294609 253497
207 253497 129271 -49671 -213943 -285681 -253085 -134932 39552 200232 274477 251584 140791
218 140791 -30014 -187510 -264185 -248606 -144693 21355 175630 254279 245497 149006 -12231
229 -12231 -163599 -246035 -243638 -150827 5011 151743 236650 240628 153402 3388 -139401
240 -139401 -227408 -237174 -154631 -10386 129319 219012 233077 156035 18210 -118527 -211295
251 -211295 -229286 -157402 -25936 108648 203869 225197 157935 33312 -98622 -195576 -220172
262 -220172 -157973 -39127 89199 186909 215801 159151 45599 -81448 -179503 -210751 -160579
273 -160579 -52905 72277 171755 204612 159795 58351 -64317 -164569 -200318 -159830 -62960
284f2960J19246R9580L9349l4507r3354j17290r7603m1368K9210Q7337J14829
295D2469R8091M3728k4909q3259j11388r7542m6328K0585P9100J07376R6487M9485
307A73895j5773p4999j04853r5242n1541J2301P0212J01441R4565N2846q073o6186
319H8593r8427r3772n3914M836O1859R5030R2575N6368k223n8054r1211r1464
331h9804n7981j278N4174Q7956Q9915N8614N265n0167q5735q8544n9017p718M5875
344i8445Q2216Q7308O0365J0570m2911p8229q5518o1332j3578L9004P5834Q3675
356E8959O1777J6303l6008p2377q1812o2270j8482L2259O9220Q0417O2611K0435
368A31032k8940o5991p9074o2753k2458K6400O2240P6452O4376K3939k3667n9207
$$ plain form
284 -62960 56286 155866 195215 160708 67354 -49936 -147539 -188907 -159697 -72360 42469
295 42469 140560 184288 159379 76120 -35268 -132810 -179138 -158553 -79453 27923 124410 173895
307 173895 158122 83123 -21730 -116972 -168513 -156212 -86000 15441 110006 162852 154779 88593
319 88593 -9834 -103606 -157520 -152684 -90825 4205 96780 153148 150925 92871 1660 -89804
331 -89804 -147785 -149063 -94889 -6933 82982 141596 146861 96694 10959 -77585 -136602 -144320 -98445
344 -98445 -16229 71079 131444 142014 99103 20874 -64644 -125976 -139554 -100550 -24716 58959
356 58959 120736 137039 101031 28654 -53158 -115428 -133910 -101651 -32431 47986 110597 131032
368 131032 102092 36101 -42973 -105726 -128184 -101784 -39544 36908 101284 125223 101556 42349
380D2349p4647o4085k5868K0621N6298P3223O3455K7243j7188n2648p2669o3324
392h7240k7748J4208M9435P0889O3490K8701j1462m6750o9036o2552l0145Q022
404a00188M4317O7260O1972L1161n062m2050o6165o0252l1591J699L9335O4499
416D935N9529L3127K87l6878o2485n8092l4585l206L5206O0333N6761L6060M975
429I5967l3036n8374n5083l7049p651L1283N6538N3924L8266R158k9696n3844
441A0403n2692l9195j1050K7844N1274N1552M0936J2071k6817m8354n0179m1756
453g5963j3655K5206M5415M9636M2659J4506k3296m2916m8931m2976j4979K0396
465f4898M0269M8167M4506J5175j8889l7259m7471m4723j5718J6694L4372M7328
$$ plain form
380 42349 -32298 -96383 -122251 -101630 -45332 27891 91346 118589 101401 48753 -23916 -87240
392 -87240 -114988 -100780 -51345 19544 83034 111735 100273 53523 -15513 -78065 -108210 -100188
404 -100188 -55871 11389 73361 104522 99460 57410 -8755 -69007 -100598 -98899 -59564 4935
416 4935 64464 97591 97878 61000 -1485 -59577 -94162 -97368 -62162 -1829 54932 90992 95967
429 95967 62931 4557 -50526 -87575 -95226 -63943 -7405 46519 84785 93943 64247 10403
441 10403 -42289 -81484 -92534 -64690 -13416 38136 79072 91143 64326 15972 -34207 -75963
453 -75963 -89618 -64412 -18997 30639 73298 87804 64508 21592 -27339 -70315 -85294 -64898
465 -64898 -24629 23538 68044 83219 64330 27071 -20400 -65123 -80841 -64147 -29775 17553
477A7553M4592J6678j4480l2601m7223m4323j6474J1857L0393M6802M3915J6863
489G3552r357k7720m6664m3761j7155O902K6356M6058M2968J6945l797k4494m5552
502e719m1865j8484J377K3856M5472M0100J8003J444k2196m4454l9192j9256l319
515f4233K1246M3620L7483K0321N339k0443m1575l6368k1763p703K0968M0750
527b358L3528K2880R658j9830l9068l3257k4399j0320J9049L7390L2362K5002
539E0637J0920j8414l4549l0874k7406j1188J8228L2396L0005K7961J2150j7014
551D2852l0315k9842k9151j2241J6521K7866K9547K9650J1492j4440k5836k9201
563a3098l0438j1543J3394K3713K9236L0790J1005j1741k1141k9495l0798j1346
$$ plain form
477 17553 62145 78823 64343 31742 -15481 -59804 -76278 -64421 -34028 12774 56689 73552
489 73552 64195 36475 -10189 -53950 -71105 -64203 -37847 8211 51179 68124 64327 39833 -5719
502 -5719 -47584 -66068 -64691 -40835 4637 44737 62740 64184 41988 -2466 -41658 -60914 -64233
515 -64233 -42987 633 38116 58437 63776 43333 1758 -34610 -56373 -64076 -43108 -2358
527 -2358 31170 54050 63708 43878 4810 -28447 -52846 -63166 -44117 -6727 25635 50637
539 50637 61557 43143 8594 -22280 -49686 -60874 -42646 -10250 19755 47716 59866 42852
551 42852 12537 -17305 -46456 -58697 -42176 -14310 15237 44887 56379 41939 16103 -13098
563 -13098 -43536 -55079 -41685 -17972 11264 42054 53059 41318 20177 -9318 -40116 -51462
575e1462J0355J9565K9670L0374J1092q248j8306k9912l0007j0730O203J7006
587b4400L0275K8740J0721m246j5188k9919k8590j1058K348J5127K9410K6860
599C0080J1918N1j4632k9555k6282j1889j587J4344K8466K5243J2953K746j4192
612B7664k7667k3923j3970l696J3823K6675K3168J4362M947j3274k5854k1871
624a9616j5356n993J2909K4740K1460J6175O096j2773k2781k0682j7475o648J2246
637b7698K2237J9898J7792P048j2006k0475j9780j8464o665J0930J8965J9686
649A1468J8827P058j0312j7575j9453j9338o998R126J6468J9933J9099P120q458
662B6965j5025j9834j9383o887P317J3872J9701J9747O934o489j3361j9486j8753
$$ plain form
575 -51462 -41107 -21542 8128 38502 49594 41346 23040 -6872 -36879 -47609 -41406 -24400
587 -24400 5875 34615 45336 41090 25902 -4017 -32607 -43665 -41317 -26190 3220 30080
599 30080 41998 42049 27417 -2138 -28420 -40309 -41896 -27552 914 26157 39110 41856 27664
612 27664 -3 -23926 -37896 -41592 -27769 -1094 22074 36436 41383 28109 2255 -19616
624 -19616 -34972 -40965 -28056 -3316 18144 34319 40415 27642 4861 -15821 -33296 -39944 -27698
637 -27698 -5461 14437 32229 39277 27271 6796 -12984 -31448 -38113 -27183 -8218 11468
649 11468 30295 37353 27041 9466 -9987 -29325 -36323 -27197 -10729 9204 28303 35423 26965
662 26965 11940 -7894 -27277 -34164 -26847 -12975 6726 26473 33407 26918 13557 -5929 -24682
675b4682p617N141J2520J9513J8816P507m056j2063j9309j8174p652K867J1198
688a5991J9014J7933P790j672j1114j7936j7902q040M55J0781J7953J7305Q800
701B7376k53r932j7406j6819r144n47R447J6912J6183R670J159q964j6413j5875
715a4606j0320j378Q701J5448J5749J0379K197q143j4962j5619j1299j682P339
728a8196J4221J5637J1095K402o785j3834j4867j1588k690O056J3282J4759J1594
741B1086L084n714j2568j4681j1317l715N378J1932J4213J1518M299n075j1516
754F924j3958j1339m666M057J1063J4248J1227M625l503j0742j3490j0984n248
767b1786L308R959J2740J1641N610k575r833j2656j1475n749K173R250J2363J0815
$$ plain form
675 -24682 -32299 -27158 -14638 4875 23691 31198 27142 15079 -4230 -22404 -30056 -27189 -15991
688 -15991 3023 20956 28746 27074 15960 -1976 -19878 -27918 -27463 -16682 1271 18576 27376
701 27376 27123 17191 -215 -17034 -26178 -26725 -17278 -366 15817 25487 26646 17682 1269 -14606
715 -14606 -24926 -26304 -17603 -2155 13594 23973 26170 18027 3065 -12554 -23853 -25535 -18196
728 -18196 -3975 11662 22757 25159 18374 4540 -10327 -21915 -24605 -18549 -5267 9492 21086
741 21086 24170 18456 5888 -8793 -20110 -23825 -18447 -6515 7698 19216 23515 18440 6924
754 6924 -7034 -18373 -23039 -18982 -7919 6329 17556 22181 18678 7936 -5554 -16538 -21786
767 -21786 -18478 -8519 4221 15862 21472 18897 9064 -3592 -15067 -20816 -18643 -9393 2970 13785
781A3785O465j645q923j1841j1366o274J119Q313J2257J0684O553p97p803j1530
795a003j0783o779L60P708J0713J0720P015j07o994j0449j0683p304j0O641R726
810a229J1157O940K33n793r778j0666p524k12M946R754J0629O939J273m729r357
825B583j0584p167j282M821Q572J0351P193J540l824q639j0136p210j730L407
839a2105Q137R834P620K145l446p742r777p189k900L154P869Q891P832K650k930
854A2043p104r089p390l132K807O891Q480P573L219j966o754q657p221l560J789
869a2071O136Q523P505L437j318o117q134p591l700J633N354P987P333L920n62
884A2335n428q108p447l658K28N027P940P099M204m43m657p339p059m186q0M173
$$ plain form
781 13785 20250 18605 9682 -2159 -13525 -19799 -18680 -10367 1890 12574 19127 18330 10527 -1003
795 -1003 -11786 -18565 -18205 -10497 216 10936 17951 17844 10850 401 -10282 -17586 -17596 -10955 -1229
810 -1229 9928 16868 17101 11308 1530 -9136 -16660 -16872 -11926 -2172 8457 15396 16669 11940 2583
825 2583 -8001 -15168 -16450 -11629 -3057 7294 14487 16027 12203 3564 -6572 -13782 -15512 -12105
839 -12105 -3968 5866 13486 15631 12185 4443 -5334 -12523 -15423 -12269 -4400 4491 12323 14973 12043
854 12043 4939 -4150 -11540 -14672 -11865 -4974 3506 11079 14298 12332 5578 -3079 -10300 -13860 -12071
869 -12071 -5935 2588 10093 13530 12212 6095 -2039 -9630 -13330 -11697 -6343 1644 8977 12897 12335
884 12335 6907 -1201 -8648 -12306 -12078 -7051 889 7988 12192 11749 7092 -247 -7306 -11492 -11572 -7399
900g399P386P077M343Qm165p042o706m201o93M324O527O622M399Q85l777o716
916H72o387m591r24L353O262O286N169J391l905n793o392m855j425L251N928O036
932D276M881J553l100n274o045n112j561K729N002O115M943J663k326m889o013
947c158n185j548K045M185O144N555J582j995m260n479n500j659J676L895N816
962B114N225J704j597l148o121n283j483J115L306N809N036J950r49l339n568
977a229m983k339R65K951N882M815J952l00k992n545m567j958l36K801N726M240
993E083K384L24k837n570m100k594o57L223M975M343K350J011k870n019m029k938
1009f921q12K759M660L893L262O43k491m436m050l114p94K187M373L982L240J418
$$ plain form
900 -7399 -13 7064 11407 11415 7250 208 -6498 -10699 -11392 -7068 -541 6081 10480 11365 7588 872
916 872 -5515 -10106 -11030 -7677 -1415 4871 10040 11431 7526 1733 -4659 -9514 -10939 -7688 -1760 4276
932 4276 9157 10710 7610 2336 -3709 -8821 -10382 -7653 -2651 3464 8407 10070 7744 2855 -3158
947 -3158 -8343 -9891 -7846 -3661 2483 8038 9620 7625 3365 -2114 -7614 -9273 -7597 -3702 2114
962 2114 7339 9043 7446 4298 -1823 -7106 -8589 -7474 -4168 1641 6677 8627 7678 4339 -1229
977 -1229 -6212 -8551 -7586 -4635 1247 6062 8014 7714 4722 -823 -5390 -7348 -7684 -4883 843 5083
993 5083 7467 7791 4954 -616 -4716 -7310 -7967 -4744 231 4574 6924 7935 5065 46 -3983 -6921
1009 -6921 -7733 -4974 -314 3579 6841 7484 4993 557 -3493 -6607 -7401 -5214 -841 3141 6381 7799
1025G799k829l962l825l179j442K379L525L810L573J341k099l217l961l811r10
1040f808J746L134L988L583R36j870k825l424l820r73J655K358L700L977Q90j198
1056E049k675l621m079o96J307K278L558L556J000r31k023l811l562r91M64K333
1072b844L738L532J037n98k093l681l149j119O7K137L639L196J031J8j943l310
1088c42l026j314l65J967L558K849J285M78k156k959k811j869m67J828L759K381
1104B796J689N34j994l096k357j982n83J882K973K139K399O24j992k682k359k148
1120d157p05J754K534K303K396O57j719k250k376k285p40J432K131K586K383K29
1136D173j049j886k694k321m63J313J891K239K434O44j242j851k330k189n96O52
$$ plain form
1025 7799 4970 1008 -2817 -5996 -7438 -5059 -1534 2276 5849 7190 5091 1874 -2087 -5898 -6808
1040 -6808 -5062 -1928 2060 5643 6579 4709 1884 -1540 -5360 -6333 -4678 -2320 1380 5357 6247 5049
1056 5049 2374 -1247 -5326 -6022 -4715 -2437 1121 4677 5677 4746 2723 -1088 -4650 -5641 -5177 -2844
1072 -2844 894 4426 5463 4865 2772 -909 -4058 -5177 -5110 -2973 666 3862 4893 4911 2968 -342
1088 -342 -3368 -4682 -5047 -3080 478 3327 4612 5090 2934 -25 -2836 -4705 -5172 -3344 415 2796
1104 2796 4485 5019 3025 -71 -2428 -4410 -4993 -3111 -138 2001 4400 5024 3032 350 -2009 -4157
1120 -4157 -4862 -3108 -574 1729 4125 4782 3063 813 -1563 -3848 -4588 -3156 -1025 1561 3944 4173
1136 4173 3124 1238 -1456 -3777 -4240 -2927 -1036 1203 3637 4281 3039 1188 -1142 -3331 -3927 -3275
1152c275J717K726K173N02m77j616k886k051j044J106J583K231K299Q10p25j592
1168A481k335k040q80O06J506K279K379M93j06j603k137j963j086K40J301K393
1184E28J797J328l83j319k208j933j139M45R52J983K016J041Rj342j734k422m45
1201b826k26J018K194J807J137j03j337j112k195j250k28J108K079J339J454J55
1217C014p41j889j807j264k61R57J577J678J451J60o56j691j954j096m79R75J338
1234f88K071J139L33q25j697j524r89l68L90J517J642J221N88o90j170j640j452
1251b142n59O51J347J077J625N92n82j211j354j386n72L24J233J154J859K83l49
1268A990j093j168j533p85N02J044J547J421N11n55q25j498j223p44N48O92J341
$$ plain form
1152 -3275 -1558 1168 3341 3843 3366 1750 -1136 -3187 -4231 -3125 -1542 689 2988 3798 3073 1481
1168 1481 -854 -2894 -3774 -3168 -1662 617 2996 3489 3383 1780 -357 -2320 -3406 -3166 -1865 528
1184 528 2325 3653 3270 1951 -257 -2190 -3329 -2884 -1932 51 2067 3108 3117 1775 41 -2381 -2826
1201 -2826 -3052 -2034 160 1967 3104 3001 1664 552 -1643 -2893 -3121 -2013 66 1405 2859 3014
1217 3014 2273 384 -1423 -2687 -2948 -1991 -414 1264 2715 2875 2219 528 -1426 -2522 -3001 -2026 -688
1234 -688 1383 2522 2855 2030 333 -1191 -2180 -2548 -2158 -641 1001 2222 2810 2120 950 -690 -2142
1251 -2142 -2701 -2050 -703 374 1999 2591 2009 798 -556 -1942 -2514 -2190 -957 197 2056 2339 1990
1268 1990 897 -271 -1804 -2589 -2087 -1043 504 1925 2436 1881 1056 -442 -1665 -2409 -1861 -1169 172
1285A72J227O74J90j078j610q97j077N75P94J159J271P22k36o64j167j359r61
1302b265K78P56Q94J435P12L53q72j050j407q40J67P98J005J001R93r3k27j571
1320F7p11j142j26P24Q04J454N04K84n47q82j385o62j06J86J256P74J023L25m96
1339A344r44j256m70k66M43Q82J033O26K7k33r38j026o02j99K52Q33J090Q90R
1358A495n07n46r33p54l71J74R03O87R59N41l89n80j132o98k25J21O78P83P97
1377A003N20j96o91r68n15n76Q5Q82M36J284L22j46p01q16q55n76R7O41R59N11
1397G00O47m2o45p00q31n23m9R26L28J134L99J3n89o41r38m64J00O12L27R91N54
1418A309Oo42p01o38n41q7M61O46O52N57l05k87j96p79n18j26M96L12R04N33K92
$$ plain form
1285 172 1399 2073 2263 1185 -425 -1322 -2399 -1824 -1030 129 1400 2122 1886 1222 55 -1304 -2265
1302 -2265 -1987 -1231 -337 1098 1810 2163 1291 241 -1166 -2006 -1839 -1041 -36 965 1958 1865 1638 67
1320 67 -644 -1786 -1912 -1188 -384 1070 1574 1858 1311 429 -956 -1618 -1724 -1538 -282 492 1515 1840 1344
1339 1344 400 -856 -1326 -1592 -1149 -267 766 1392 1419 1186 248 -778 -1380 -1579 -1327 -494 596 1486 1495
1358 1495 988 442 -491 -1245 -1616 -1442 -539 148 1107 1648 1259 679 -453 -1151 -1376 -1255 -577 206 1003
1377 1003 1523 1327 636 -332 -847 -1423 -1338 -456 -20 1264 1586 1440 739 -77 -932 -1508 -1411 -770 189 700
1397 700 1347 1305 660 -40 -871 -1394 -1443 -517 -189 945 1344 1357 768 127 -811 -1275 -1175 -563 -236 755 1309
1418 1309 1315 673 -28 -666 -1207 -1294 -833 -187 465 1022 717 430 234 -545 -1063 -1189 -693 -381 523 1056 1348
1439A348l95o17q17n50K6K00N87P38O01J08l02q25p40m1l99K93O98M93N13J57
1459A076q7o10j002j06k02j73O48P29N09K72k32l15n52q26l21L52N93M98J76O07
1479A034r3n76m66m86l23Q9J37Q34N06K88J20q27l85m77j42J11J71M42M96Q9K69
1500H11j72p20l85p5m15O61O24L34K6P2M8o58p50n78K44L63N47K79M86J6l76j53
1522B29n65q02L53N04N65K49M36j34m30k25l80o90J43J38N73M19M31l4m56o5j86
1543G3n97K3j5r2Q64O00l50J63m57l13n67k15M92k2O98L93k29N6n56j65j90m0
1565d46J38K77J76J62J54L02k92q56k52K84j49K41L78L10L32k44k97k25o17J64
1585d60J55J83J86K18J80n4j47n97p5j9O2L07J41J09J00M74o97J20n17o4L8J64
$$ plain form
1439 1348 953 336 -481 -1031 -1005 -805 -218 520 1121 1229 927 102 -638 -679 -1078 -785 -87 406 919 1076
1459 1076 989 379 -623 -729 -931 -1104 -456 273 782 1054 822 507 -45 -871 -1192 -840 -247 251 427 1034
1479 1034 941 365 -101 -587 -910 -821 -684 150 656 944 1064 237 -148 -625 -767 -656 -485 -43 453 542 811
1500 811 639 -81 -466 -541 -956 -295 329 663 689 761 809 151 -599 -1177 -933 -570 -23 256 742 758 382 229
1522 229 -336 -1138 -785 -281 284 533 969 835 405 180 -200 -890 -747 -609 -36 383 814 780 324 259 73
1543 73 -524 -501 -516 -608 256 856 506 669 212 -101 -668 -883 -391 -413 285 678 449 505 -51 -216 -406 -446
1565 -446 -308 -31 145 307 461 763 471 -385 -637 -353 -502 -261 117 427 759 515 218 -7 -624 -460
1585 -460 -305 -122 64 282 462 408 261 -336 -411 -430 -368 -61 80 189 289 763 66 186 -331 -395 -357 -193
1607a93K54K69K25K80o93j33m53j07K58J94p1K26K22K04l78j52P9n69oJ24O04
1628A84J16P3K59j62l69k09l34n6k4J84N32L55k67J85j71m65l72J26M4N58L64
1649E51k14o1K7J7j18m84k16R5L55k6M11Oqj00m71l0K3k04M51j85O68J56l43k00
1673A00j97kl08K8L6N82L9O9n3l69j68J56l95L31mK11K72j4j5j66j89J6l32j8
1697c90K92N9K91r8K09j87m21mk65O02k08MK93J08L33m28Jm65j41K15J71j2M23
1720C82j10J32l14o3k02m2j1M3K66pK62l7k26j11k27J26l28K60Q9J58M59j76k52
1743G1M52q67K77k1q1K88J69J85j66o4q4l72j92K02q2J12K06M5J75j61N1o0m23
1766c40P6J28pK17J63l4p0L06l31l01O6j12J15j2J43L42l65L6K48n45J87oo6m6
$$ plain form
1607 -193 61 330 555 835 142 9 -444 -551 -293 -99 -170 56 278 482 104 -48 31 -538 -544 -420 184
1628 184 300 373 632 470 101 -108 -442 -498 -522 -338 194 549 282 467 296 -169 -541 -415 -371 187 551
1649 551 337 276 303 320 202 -282 -498 -403 -48 -74 337 343 335 235 -236 -266 -243 -447 4 -181 487 643 300 100
1673 100 -97 -99 -407 -379 -343 239 278 347 294 -75 -243 -87 -482 -151 -155 56 328 314 299 133 -56 -40 -372 -390
1697 -390 -98 -39 252 154 363 176 -245 -249 -514 88 -120 -116 177 285 618 190 191 -274 -415 -200 -29 -41 382
1720 382 272 404 90 27 -175 -217 -228 -185 81 74 336 299 73 -38 -265 -139 -467 -207 -118 40 499 323 71
1743 71 523 -344 -67 -88 -169 119 288 473 307 243 159 -213 -405 -203 -285 -173 33 78 253 92 143 83 -340
1766 -340 -264 -136 -143 74 237 203 133 439 108 -193 -127 -239 -124 -136 7 349 -16 20 268 -277 -90 -96 -162 -208
1790b08L12J01j68J63j91l48J07j25M00M7M9J24j79J95k94n6j19J79J74ok85L59
1812B31M4j08O5n4l19j54O0J32R3J21J87n1k18p7m7n2J77j26J04kK32J01l31k31
1836b23j14L03J2j79M08l49K16K62l8l73J88l45K29J95k33L08k53J87j27j70K0
1857g6J8j68J38j0J21K71J5j65k26J01K0j49j78L75K45l39R2Ok55j35L95l66L08
1880C8J42k2l3n5L9k36r2j23J23m1M89k7J20m45K75l28r9J50j58J53K06K66J30
1903D72k27j30j36k18L57l58L11m3Q9j02K65j87K6k96L5K4j84K30o0O0L01l40
1925a11L89m75K38k67J59j57R0O6J88k01N5m8m6K28k43J52P9rn6L29l49k84J82
1948i1p1L16j53k4K71j6k09O3j10k39j68K26K93r4LJ89k04m5K1p2r8K40q0R8o8
$$ plain form
1790 -208 104 205 37 200 9 -339 -232 -357 43 90 139 263 84 279 -15 -71 -190 -11 163 157 -128 231
1812 231 275 167 232 178 -141 -295 -235 -103 -10 111 298 247 29 -48 -95 -147 30 -96 8 6 238 339 8 -223
1836 -223 -337 -34 -22 -201 207 -142 74 336 298 -75 113 -232 -3 192 -41 267 14 201 74 -96 -76
1857 -76 -58 -226 -88 -98 23 294 309 144 -82 19 39 -110 -288 87 332 -7 85 91 -164 -299 96 -270 38
1880 38 180 158 125 70 109 -127 -219 -342 -219 -260 229 202 322 -123 152 -176 -275 -125 -283 -130 76 342 472
1903 472 245 115 -21 -239 118 -240 71 28 117 15 280 93 119 -177 -142 -118 -302 -72 -132 -72 229 -111
1925 -111 278 -197 41 -226 -67 -224 -134 -68 120 -81 -26 -74 -120 108 -135 17 96 87 31 360 11 -273 -91
1948 -91 -162 154 1 -23 248 232 23 86 -24 -263 -431 -205 88 -6 -3 186 -18 -63 -42 -114 -212 28 -52 46 -22
1973b2J15j8p1J07k98J65j15J62j7k52M07l0K3K39n08K08l62K40P5j4J13j58P1
1996F0J29j14l86J37P5j08L11OO8p6Q9k68P3o5Lp1K27mJ0R4k99L1k60K95N4j7
2022fJ86Qj47J02K2l43K51j16lj10K53o5K01l53J58j35m9K47k65K57k17K47j12
2045A1k5q1N5J80n2k94N4J36l2K21j48J09j07M3k7j13kj8J52J0n8q9Q4J59j49
2070A9r5k85O43j27p0K49l16rJ08l32k8R5J56J84J0P5k42N8J13l64Q5K36O6j88
2094D1J37n5L3j63l10L72r1K66k9j31j28K4l0j3J47k21K13p7k10m8K84M8m4R7
2118A12q3L4N9j94k07M00L0m00J81j64M49l00j69K69j85J79L38l98J0K86k44r1
2140h8K12J44j13j03m1L8n1J60j58j29J84J25J08l93L23j46k53K32n5p7m8K91
$$ plain form
1973 -22 93 75 4 111 -187 -22 -137 25 8 -244 163 133 156 395 -113 95 -267 -27 48 34 147 -11 60
1996 60 189 75 -311 -174 -99 -207 104 110 178 102 191 -77 -4 -69 -66 -137 90 86 96 190 -109 -78 -338 -43 11 -6
2022 -6 180 188 41 143 165 -178 73 -43 -46 -156 97 32 233 -120 38 -97 -146 101 -164 93 -124 123 11
2045 11 -14 -95 -40 140 88 -206 -152 -16 -48 173 25 134 27 70 43 -70 -72 -90 62 72 14 -75 9 168 19
2070 19 -76 -361 282 155 85 334 18 9 117 -215 -243 -148 8 192 202 277 35 93 206 -158 -73 163 229 41
2094 41 178 123 156 -7 -317 55 -36 230 201 70 -58 -34 -64 -77 70 -151 62 -15 -225 -273 11 59 15 112
2118 112 29 63 122 -72 -279 121 151 -249 -68 -232 217 -83 -252 17 -168 11 349 -49 -39 247 3 -88
2140 -88 124 268 155 52 11 49 -2 158 0 -129 55 180 288 -105 218 72 -181 51 -4 -81 -129 162
2162A62l01J11J71k50K38j15j32K03k87M8K45l9m0J74M0r6k79J21k44J24o5L59
2184A48k67j46J79P7P0j6n6J16l24N88k38j73K02j54r2M00l36R9j02K67j75j27
2206f0K37j79J82j24N6j59J92j57L12l25K7j39K51m9j8j00K1J65k24L3N4J89l7
2229A48j24j77j32L54j79R8J92k06p7K38K29n35J47N9m6k20K81J11P3R4m19j33
2251b24P5J9J52r6o5o1L68k69l5Q7J68P4k56p8o5M54l04j54J40J98j54k48K72
2274bj31N41l55k3q6J32o3j63O4p6R7k36J41J26K53R8r3j41l97K6M02j83J99j24
2298FJ5J52j49j52K21m37L07K0J05n8j74O6j7o2L37l08J18j4L45m74K28k56L40
2321A59j04n6K43l54J30Q2J60l84J67l74L65J00k51pK59J67j74k29K5J79k74J29
$$ plain form
2162 162 -139 -28 143 -107 131 16 -116 87 -200 -152 93 54 14 188 228 132 -147 -26 -270 -146 -211 148
2184 148 -119 -265 -86 -9 61 45 -11 105 -219 369 131 -42 160 6 -86 314 -22 77 -25 242 67 -60
2206 -60 177 -2 180 56 112 -47 145 -12 300 -25 2 -137 114 65 47 -53 -32 133 -91 -58 -4 185 148
2229 148 24 -153 -285 69 -110 -12 180 -26 -103 135 364 -171 -24 35 -11 -231 50 161 234 328 -91 -224
2251 -224 -149 -130 22 -74 -139 -200 168 -101 -136 -49 119 193 -63 -141 -206 248 -56 -210 -70 128 -26 -274 -2
2274 -2 -133 408 53 30 -56 76 13 -150 -86 -162 -65 -301 -160 -34 219 317 224 83 -314 -288 114 -69 130 6
2298 6 21 173 24 -128 93 -344 -37 -17 88 30 -144 -78 -95 -157 180 -128 -10 -24 321 -153 75 -181 159
2321 159 55 -1 242 -112 18 100 260 -124 43 -331 34 134 -117 -124 135 302 128 -101 -76 103 -171 -42
2343d2j4J56k74J78r6K2J35j89O2p6J16p1j5K44j40k02K8K40J19j31l8J82l19
2366a25L0J53m9m7j21K33r0J8j17j78j16L16K84k33KJ11j06J11l1l24L47K3j51
2389f0N1m4L14l98M4R8n2Q1J52k52J51l16K80M0R8k09R6k11J11o0L13n7j64N8
2413F4L4l02J25P9n5r2R7L7k11J59K49J54m88J93jj3j12j07K43M9k27K67o3o6
2437A3N3k98L23j26j63M7K20q8o6K99Nm69K76k9%q8j66N37j63k72J17L4l5N0j
2462A0j47L24m65K72k2J09K55p56Q0M42j58n7J54Pm4m8M9Q6j81P1k29J26K36k29
2486a15K01k72L1L19J90k60j8k56L3L93l13j34J37l2j25L93k81J74k63J70j52
2507a80J70j12J31Q8j17K4Q2O8k94J89K1O9j21M7J4l2j4J2J21k63o5M74k50o7
$$ plain form
2343 -42 -56 100 -174 4 -92 -70 65 -124 -62 -138 -22 -93 -108 136 -4 -206 -178 62 181 50 12 194 -125
2366 -125 -95 58 9 -38 -159 74 -16 2 -115 -293 -409 -93 191 -42 -40 71 -35 76 45 -279 68 91 -60
2389 -60 -9 -53 261 -137 -93 5 -47 34 186 -66 85 -231 49 89 187 -22 74 -137 -26 -86 227 170 6 64
2413 64 98 -204 -79 0 -55 -147 -50 -13 -224 -65 184 338 -150 43 42 29 -83 -190 53 102 -125 142 79 13
2437 13 66 -232 91 -35 -198 -151 69 -19 -85 214 219 -250 26 -3 -3 -91 -257 280 117 -155 -38 -4 -39 11 10
2462 10 -137 187 -278 -6 -28 81 336 -420 -340 102 -56 -113 41 48 4 -44 5 91 -90 -19 -248 -122 114 -115
2486 -115 86 -186 -155 164 354 94 76 -180 -147 246 -67 -201 -64 -96 -221 172 -109 65 -198 -28 -180
2507 -180 -10 -122 9 97 -20 4 86 154 -140 49 70 139 18 65 79 47 33 45 166 -97 -162 312 62 -5
2531ej0r5K65R7j42k31L97%k82l3J1L7r3m5K59k6o5P5K4k34N7j28J55j51Q9K48
2557A74k50K71N4k09j79J72p2M5l4j44J35K0M29l63j9k78J4K85K1r2l7J30k59
2580a86J43M0m8j77K99j90J71J05k7j77J59o9j6o6M9j80K38N4k59L63k06J08j78
2603e0K10k2lm4j47Q5Qj48K35N9k14J82k55m5K7K29r6Pl2m5O3P7K3p0p6J76l4
2630A00p5J22K0k28J30l27K83j10J9M06m08j80J4K38R1r8r6p1K55k17J58r9L37
2653B64l19NJ71l87M25j63K45n54L57j47K31k44Q3j04j32M07j61K46l75L11k18
2674e9L68r9j18j03l4O1j24j94M07J24j22j99P8j40K56P6j76K5o2K55n61L85j02
2697e8J68j13j4O2P1k1m0J3O6j87j04J26J60l59L86l76K95l6k99K72O1k18o8J31
$$ plain form
2531 -5 -15 -110 155 252 110 -121 276 276 -6 -39 -28 9 -84 -129 130 104 39 114 138 -96 -39 -167 -12 -163 -74 174
2557 174 -76 195 249 40 -139 33 -39 6 -28 -172 -37 -17 412 49 30 -248 -234 51 72 -20 -57 73 -186
2580 -186 -43 -3 -51 -228 71 -119 52 157 130 -47 112 43 27 -39 10 -170 68 122 -137 226 20 128 -50
2603 -50 160 138 135 91 -56 29 37 -111 124 183 -31 151 -104 -149 -122 107 11 18 -14 -59 4 81 104 34 -42 134 100
2630 100 25 147 167 -61 69 -258 25 -85 -66 340 -68 -248 -234 4 95 -3 -99 -170 85 -132 26 -73 264
2653 264 -55 -50 121 -266 159 -4 241 -313 44 -103 128 -116 -33 -137 -269 138 -23 223 -152 159 -59
2674 -59 309 210 92 -11 -45 16 -108 -302 105 229 107 -92 -14 -154 102 178 2 27 -35 220 -341 44 -58
2697 -58 110 -3 -17 45 116 95 55 68 134 -53 -157 -31 129 -230 156 -220 75 39 -260 12 73 -145 -213 -82
2721h2K50p1j4J2k6q5K92n05K20J22l70L92l23J45j25L93K4j62q9p9J3J01k91
2744b58M31j56J19j39k6j17L13j21l6m0N0P2J8J5k88J23K81l68r8L27J13k44k6
2767e5J23l59L39L6m3p0J9j21j20J42J05j71J96K99m58J71k64J81K10%l3l47J41
2790g9k59L58k47P2M8K08j63J76m51L10J04n8L0k32L38m45K61k5Q1k8k42j34N69
2813A92J16m04J13j96J97k7R0p7j7P5k12j8M21l57J43k08J51K2J49k72K84l35
2835a70L17k12j61J22K40Q1j94p9PJ28j40k69M89j99L8p9J92p2k20J42j25L55
2857A91j64j20J06j51N9o8J91j03oJ19K3j68K17r8K0j7r5J71r7L52l51K06k86
2880f9K68l24J82o8j79K01k12L98J8j29J6j92J27j58M2O8L35o3Jk25k24M8K24
$$ plain form
2721 -82 168 97 83 95 69 -16 276 -229 -9 113 -257 135 -188 -43 -168 225 249 87 -2 -81 -68 33 -258
2744 -258 173 17 136 -3 -29 -146 167 46 10 -30 20 92 110 125 -163 -40 241 -127 -225 102 215 -29 -55
2767 -55 68 -291 48 84 41 -29 -10 -131 -251 -109 -4 -175 21 320 -138 33 -231 -50 160 160 127 -220 -79
2790 -79 -338 20 -227 -155 -107 101 -62 114 -337 -27 77 19 49 -183 155 -290 -29 -54 27 -1 -243 -377 192
2813 192 308 -96 17 -179 18 -9 81 4 -13 62 -150 -168 253 -104 39 -169 -18 4 153 -119 165 -170
2835 -170 147 -65 -226 -104 136 217 23 -56 -49 79 -61 -330 159 -40 -2 -81 111 39 -181 -39 -164 191
2857 191 27 -93 13 -138 -79 -147 44 -59 -65 54 77 -91 126 28 48 31 -64 107 10 362 11 217 -69
2880 -69 199 -125 57 -11 -190 11 -201 197 215 86 102 -90 37 -121 -79 -11 324 261 262 37 -187 -139 85
2903H5J89l02o6n2L56j32j20J64m3j45j69J98K6m4J28o8j60K0k5M56j98k81J92
2926IJ52j58K83m52J52o5o4P3Q0J35L8k57P2o4K86r9j7l8q5k73M37Om1j51q3K1
$$ plain form
2903 85 274 -28 -94 -146 210 78 -42 122 79 -66 -235 -37 -11 -55 73 5 -155 -135 -160 296 98 -183 9
2926 9 161 3 286 -166 -14 -79 -143 -70 10 145 183 -74 -2 -66 220 121 104 66 -19 -292 145 151 110 -41 -124 -103
$$ [...]
8191g
##END NTUPLES=NMR FID
##END=
