##TITLE=1H_DE-79H_DEK
 200.13MHz, D2O,
 8 sc
 
 28.1.2025
##JCAMPDX= 6.0         $$ Bruker NMR JCAMP-DX V2.0
##DATA TYPE= NMR FID
##DATA CLASS= NTUPLES
##ORIGIN= UXNMR, Bruker Analytische Messtechnik GmbH
##OWNER= pz
$$ XWIN-NMR		Version 3.5
$$ Tue Jan 28 14:11:00 2025 Russian Standard Time (UT+4h)  she@DPX200
##.OBSERVE FREQUENCY= 200.1313
##.OBSERVE NUCLEUS= ^1H
##.DELAY= (6, 6)
##.ACQUISITION MODE= SIMULTANEOUS
##.ACQUISITION SCHEME= undefined
##.AVERAGES= 8
##.DIGITISER RES= 18
##SPECTROMETER/DATA SYSTEM= spect
##.PULSE SEQUENCE= zg30
##.SOLVENT NAME= D2O
##.SHIFT REFERENCE= (INTERNAL, D2O, 0, 14.3821)
##AUDIT TRAIL= $$ (NUMBER, WHEN, WHO, WHERE, WHAT)
$$ ##TITLE= Audit trail, XWIN-NMR		Version 3.5
$$ ##JCAMPDX= 5.01
$$ ##ORIGIN= Bruker BioSpin GmbH
$$ ##OWNER= she
$$ F:/spectra/data/she/nmr/H-C/1/audita.txt
$$ ##AUDIT TRAIL=  $$ (NUMBER, WHEN, WHO, WHERE, WHAT)
(   1,<2025-01-28 14:09:52.25 +0400>,<she>,<DPX200>,
      <created by zg, POWCHK disabled, PULCHK disabled
       configuration hash MD5:
       00 E9 B6 7A A2 85 ED C7 34 08 36 98 17 FE 4E 26
       data hash MD5: 16K
       2D 39 9A CD 85 75 D3 15 E8 F8 89 91 48 B7 A2 3B>)
$$ ##END=
$$ 
$$ hash MD5
$$ BB 9C DC 33 AC 0F 02 78 67 F1 3A 2B 56 14 5D 02
##$RELAX= 
##$RELAX= 
##$RELAX= 
##$RELAX= 
##$RELAX= 
##$RELAX= 
$$ Bruker specific parameters
$$ --------------------------
##$DU= <F:/spectra>
##$EXPNO= 1
##$NAME= <H-C>
##$PROCNO= 1
##$TYPE= <nmr>
##$USER= <she>
##$AMP= (0..31)
100 100 100 100 100 100 100 100 100 100 100 100 100 100 100 100 100 100 
100 100 100 100 100 100 100 100 100 100 100 100 100 100 
##$AQSEQ= 0
##$AQ_mod= 1
##$AUNM= <au_zg>
##$AUTOPOS= <>
##$BF1= 200.13
##$BF2= 200.13
##$BF3= 200.13
##$BF4= 200.13
##$BF5= 200.13
##$BF6= 200.13
##$BF7= 200.13
##$BF8= 200.13
##$BYTORDA= 1
##$CFDGTYP= 0
##$CFRGTYP= 5
##$CHEMSTR= <none>
##$CNST= (0..31)
1 1 145 1 1 1 1 1 1 1 1 1 1 1 1 1 1 1 1 1 1 1 1 1 1 1 1 1 1 1 1 1 
##$CPDPRG= <>
##$CPDPRG1= <>
##$CPDPRG2= <>
##$CPDPRG3= <>
##$CPDPRG4= <mlev>
##$CPDPRG5= <mlev>
##$CPDPRG6= <mlev>
##$CPDPRG7= <mlev>
##$CPDPRG8= <mlev>
##$CPDPRGB= <>
##$CPDPRGT= <>
##$D= (0..31)
0 0.7 0 0 0 0 0 0 0 0 0 0.03 0 0 0 0 0 0 0 0 0 0 0 0 0 0 0 0 0 0 0 0 
##$DATE= 1738058991
##$DBL= (0..7)
120 120 120 120 120 120 120 120 
##$DBP= (0..7)
150 150 150 150 150 150 150 150 
##$DBP07= 0
##$DBPNAM0= <>
##$DBPNAM1= <>
##$DBPNAM2= <>
##$DBPNAM3= <>
##$DBPNAM4= <>
##$DBPNAM5= <>
##$DBPNAM6= <>
##$DBPNAM7= <>
##$DBPOAL= (0..7)
0.5 0.5 0.5 0.5 0.5 0.5 0.5 0.5 
##$DBPOFFS= (0..7)
0 0 0 0 0 0 0 0 
##$DE= 6
##$DECBNUC= <off>
##$DECIM= 32
##$DECNUC= <off>
##$DECSTAT= 4
##$DIGMOD= 1
##$DIGTYP= 9
##$DL= (0..7)
0 120 120 120 120 120 120 120 
##$DP= (0..7)
150 150 150 150 150 150 150 150 
##$DP07= 0
##$DPNAME0= <>
##$DPNAME1= <>
##$DPNAME2= <>
##$DPNAME3= <>
##$DPNAME4= <>
##$DPNAME5= <>
##$DPNAME6= <>
##$DPNAME7= <>
##$DPOAL= (0..7)
0.5 0.5 0.5 0.5 0.5 0.5 0.5 0.5 
##$DPOFFS= (0..7)
0 0 0 0 0 0 0 0 
##$DQDMODE= 0
##$DR= 18
##$DS= 0
##$DSLIST= <SSSSSSSSSSSSSSS>
$$ [...]
##$SUBNAM0= <"">
##$SUBNAM1= <"">
##$SUBNAM2= <"">
##$SUBNAM3= <"">
##$SUBNAM4= <"">
##$SUBNAM5= <"">
##$SUBNAM6= <"">
##$SUBNAM7= <"">
##$SUBNAM8= <"">
##$SUBNAM9= <"">
##$SW= 18.0517328524113
##$SWIBOX= (0..15)
0 0 2 0 0 0 0 0 0 0 0 0 0 0 0 0 
##$SW_h= 3612.71676300578
##$TD= 16384
##$TD0= 1
##$TE= 0
##$TE2= 300
##$TE3= 300
##$TEG= 300
##$TL= (0..7)
0 120 120 120 120 120 120 120 
##$TP= (0..7)
150 150 150 150 150 150 150 150 
##$TP07= 0
##$TPNAME0= <>
##$TPNAME1= <>
##$TPNAME2= <>
##$TPNAME3= <>
##$TPNAME4= <>
##$TPNAME5= <>
##$TPNAME6= <>
##$TPNAME7= <>
##$TPOAL= (0..7)
0.5 0.5 0.5 0.5 0.5 0.5 0.5 0.5 
##$TPOFFS= (0..7)
0 0 0 0 0 0 0 0 
##$TUNHIN= 0
##$TUNHOUT= 0
##$TUNXOUT= 0
##$USERA1= <user>
##$USERA2= <user>
##$USERA3= <user>
##$USERA4= <user>
##$USERA5= <user>
##$V9= 5
##$VALIST= <valist>
##$VCLIST= <CCCCCCCCCCCCCCC>
##$VD= 0
##$VDLIST= <DDDDDDDDDDDDDDD>
##$VPLIST= <PPPPPPPPPPPPPPP>
##$VTLIST= <TTTTTTTTTTTTTTT>
##$WBST= 1024
##$WBSW= 4
##$XGAIN= (0..3)
0 0 0 0 
##$XL= 0
##$YL= 0
##$YMAX_a= 678489
##$YMIN_a= -664659
##$ZGOPTNS= <>
##$ZL1= 120
##$ZL2= 120
##$ZL3= 120
##$ZL4= 120
##$ABSF1= 10
##$ABSF2= 0
##$ABSG= 5
##$ABSL= 3
##$ALPHA= 0
##$AQORDER= 0
##$ASSFAC= 0
##$ASSFACI= 0
##$ASSFACX= 0
##$ASSWID= 0
##$AUNMP= <proc_1d>
##$AZFE= 0.1
##$AZFW= 0.1
##$BCFW= 1
##$BC_mod= 2
##$BYTORDP= 1
##$COROFFS= 0
##$CY= -3
##$DATMOD= 1
##$DC= 2
##$DFILT= <>
##$DTYPP= 0
##$F1P= 0
##$F2P= 0
##$FCOR= 0.5
##$FTSIZE= 0
##$FT_mod= 4
##$GAMMA= 1
##$GB= 0.15
##$INTBC= 1
##$INTSCL= 1
##$ISEN= 128
##$LB= 0.25
##$LEV0= 0
##$LPBIN= 0
##$MAXI= 10000
##$MC2= 0
##$MEAN= 0
##$ME_mod= 0
##$MI= 1.114404
##$NCOEF= 0
##$NC_proc= 0
##$NLEV= 6
##$NOISF1= 3.799351
##$NOISF2= 2.8
##$NSP= 1
##$NTH_PI= 0
##$NZP= 0
##$OFFSET= 14.38212
##$PC= 1
##$PHC0= 235.7876
##$PHC1= 32.59222
##$PH_mod= 1
##$PKNL= yes
##$PPARMOD= 0
##$PSCAL= 0
##$PSIGN= 0
##$REVERSE= no
##$SF= 200.129724274929
##$SI= 16384
##$SIGF1= 3
##$SIGF2= 2
##$SINO= 400
##$SIOLD= 16384
##$SREGLST= <1H.CDCl3>
##$SSB= 0
##$STSI= 0
##$STSR= 0
##$SW_p= 3205.1282051282
##$SYMM= 0
##$S_DEV= 0
##$TDeff= 0
##$TDoff= 0
##$TI= <>
##$TILT= no
##$TM1= 0
##$TM2= 0
##$TOPLEV= 0
##$USERP1= <user>
##$USERP2= <user>
##$USERP3= <user>
##$USERP4= <user>
##$USERP5= <user>
##$WDW= 1
##$XDIM= 8192
##$YMAX_p= 0
##$YMIN_p= 0
$$ End of Bruker specific parameters
$$ ---------------------------------
##NTUPLES= NMR FID
##VAR_NAME=  TIME,          FID/REAL,        FID/IMAG
##SYMBOL=    X,             R,               I
##VAR_TYPE=  INDEPENDENT,   DEPENDENT,       DEPENDENT
##VAR_FORM=  AFFN,          ASDF,            ASDF
##VAR_DIM=   8192,          8192,            8192
##UNITS=     SECONDS,       ARBITRARY UNITS, ARBITRARY UNITS
##FACTOR=    0.0002768,     1,               1
##FIRST=     0,             0,               0
##LAST=      2.2672688,     0,               0
##MIN=       0,             -664659,         0
##MAX=       2.2672688,     678489,          0
$$ Real data points
##PAGE= N=1
##DATA TABLE= (X++(R..R)), XYDATA
0@%%%%%%%%%%%%%qQqJ6j6K4k9K9l6M3n2O0o8P7q7J03j17J32j55J76j99K23k48
36a32K80l12L49l89M32m83N34n90O52p19P95q73R62j062J168j288J419j568J734
55I09j922K137k378K666l007L419l930M575n430O612q366J1238j6745L1117j42801
70a21906m41394r7184P6097K59844M30307L90921J47298l9742k58768m28313l64064
81d46904j65250K075K47843M29563L49102J65511J7472k22764m11206l55479j90376
92e80413j7941K28468L86783L35282K07934L5894k21727l71626l25465k17450
102e40261m6091K10167L51845L19139K29036N4554j95917l31387l18496k45803
112e13214o3493J88504L19677L15417K47435O6190j70275k98126l16794k57247
$$ y = [0, 0, 0, 0, 0, 0, 0, 0, 0, 0, 0, 0, 0, 0, -8, 0, -8, 8, -8, 16, -13, 16, -20, 23, -29, 31, -37, 40, -47, 56, -61, 71, -84, 92, -107, 116, -132, 148, -164, 185, -204, 228, -255, 279, -311, 341, -378, 417, -456, 506, -556, 612, -676, 743, -825, 909, -1013, 1124, -1254, 1412, -1595, 1824, -2106, 2469, -2961, 3651, -4715, 6523, -10222, 20895, -121906, -563300, -660484, -584387, -324543, 105764, 496685, 643983, 604241, 345473, -82840, -446904, -612154, -610079, -362236, 67327, 416429, 581940, 599412, 376648, -34558, -390037, -580413, -598354, -369886, 16897, 352179, 560113, 596007, 374280, 2654, -322811, -540261, -586352, -376185, -24340, 294799, 523835, 578389, 382472, 51085, -267411, -513214, -576707, -388203, -68526, 246891, 494326, 560516, 390241, 92115, -224679, -481926]
122d81926o8748J59561K80604L12335K62882P5017j45526k65274l07547k64008
132d42630q6789J24765K55109L11921K64409Q6509j09207k38716l09131k66114
142d09874r1364R5227K26298L05288K66585R9256q1773k17256k99781k61890j06832
153d76116O4076K06232K96431K60592J12665n0655j96516k90970k57984j19027
163d51272L7620J86181K85484K56635J25165k6930j77580k77049k52764j32786
173d27296J4256J68207K70567K50748J39814m596j61230k62901k45590j43869
183d01890o731J50043K55421K43659J50700J5163j42053k47261k42037j54713
193c79699k3209J32895K37027K39045J61752L1533j25263k29859k34739j65185
$$ y = [-481926, -550674, -391113, -110509, 201826, 464708, 539725, 394199, 128925, -178622, -442630, -529419, -404654, -149545, 162376, 426785, 513294, 404087, 165371, -143760, -409874, -501238, -406011, -179713, 125575, 392160, 491416, 409643, 192387, -107394, -369284, -476116, -412040, -205808, 90623, 351215, 463880, 413225, 216709, -74261, -332245, -451272, -413652, -227471, 58013, 314648, 439813, 412883, 235303, -41746, -294510, -427296, -413040, -244833, 25734, 276482, 416296, 411700, 250470, -12431, -258021, -401890, -408621, -258578, -3157, 240502, 391202, 406365, 264312, 17051, -224986, -379699, -402908, -270013, -32986, 206059, 367811, 399344, 274081, 44222, -190517, -355702]
203c55702l9891J16668K21062K31742J69494M6891j06864k13361k28794j73155
213c31910n2332R9086K03238K25780J77514N8488r1583j94817k22237j80523o4107
224c73403Q2653J85606K18811J83298P0412p4062j77579k16857j84665p3682O4767
235b94701J68750K13854J86004P8967n6358j60313k10900j87395q3959M7977J52226
246a45848K07650J87426Q8585l8532j44383k04530j87195r3127K9768J37827K00650
257C8291J86441R7517k1774j30667j96868j85243j01652J2634J22888J92789J84670
268A99026J06979n718j16439j86567j83644j11957j344J10124J81855J81783J15878
279B89976R007j03245j77262j80668j18687j5158R5253J71581J79747J22842K0821
$$ y = [-355702, -395593, -278925, -57863, 173879, 343373, 390264, 283400, 70039, -158755, -331910, -384242, -285156, -81918, 143862, 321376, 379864, 288281, 93464, -128773, -309296, -373403, -290750, -105144, 113667, 296965, 367377, 293315, 115736, -101121, -285786, -359468, -294701, -125951, 87903, 273907, 352874, 296516, 136203, -74697, -262092, -346051, -298074, -145848, 61802, 249228, 337813, 299281, 154898, -49632, -236827, -329954, -300186, -162359, 38291, 224732, 322249, 300475, 169808, -27060, -212303, -313955, -301321, -178433, 14356, 199026, 306005, 300287, 183848, -2719, -186363, -298320, -299664, -189540, -7685, 174098, 289976, 298983, 195738, 18476, -162192, -280879, -296037, -200784, -29203, 150544, 273386, 294207]
290B94207q9177j65095j78229j26446k7211Q3007J59851J76305J28033L3466p5444
301B13267j55041j74712j29980l8131O8091J48543J73313J33167M2806o1742j43049
312G6532j71069j34472m8523N5131J37437J68470J36148N3540m8435j32226j65545
323g3012j37778n7697M2349J26481J63054J38027O2270l5816j21398j60425j38922
334a92867o6108K9484J15395J57967J40071P0328k4555j09931j53479j40379p4818
345b48892J9017J04383J50541J39988P8080j2313r9139j47498j40080q0925O420
356b30418R2643J44201J40796Q4280j721q6824j40342j39987q7544l980Q1340
367a47556J36537J39129R0417R711p6430j33302j37488r2767j5568P0960J29591
$$ y = [294207, 205030, 39935, -138294, -264740, -291951, -208944, -49093, 127212, 255245, 288711, 213267, 58226, -116486, -246466, -284597, -216506, -67963, 105350, 238517, 281323, 219581, 76532, -94537, -229009, -277532, -222401, -84964, 83506, 219654, 273194, 224759, 92533, -73012, -210790, -268487, -226138, -99657, 63397, 201424, 263694, 227878, 106480, -53945, -192867, -258975, -229491, -114096, 43871, 183942, 254270, 229715, 119784, -33695, -174074, -248892, -229875, -125492, 25049, 165037, 243117, 230804, 131665, -15833, -155913, -236838, -230418, -137775, 6426, 147222, 231502, 229781, 142957, 2615, -137372, -224916, -228896, -147556, -11019, 128110, 218527, 228238, 151808, 18506, -118982, -211749, -227317, -156357, -26766]
378b6766J36904R5494J9760o5451j25440j35868r7667k4622O0420J21527J33880
389I2171J00510K9005n6130j17011j32178j02568l3428N1849J12726J30369J04031
400A79346L7365m6950j08407j28797j06327m0342M2429J03584J27469J07849M3846
411B11065l7935r8686j25353j10106m6543L3215R4798J23521J10455M9258k8512
422A75177q9582j22457j11194n1870K3409Q5115J21129J11753N4326j8489q0214
433I7103j19815j11867n6776J3888P5932J17733J11924N8700q954p2274j15055
444i461j11446o1957M002O8412J14253J10367O3389J198o4146j11639j10156o5583
456a72767o099O0290J09565J09010O7978J0398n6978j05925j07764p0972j5208
$$ y = [-26766, 110138, 205632, 225392, 159941, 34501, -101367, -199034, -223656, -163236, -41709, 92171, 192681, 221686, 165556, 48545, -83633, -186201, -219629, -167780, -55054, 75315, 179346, 216711, 169761, 61354, -67443, -173770, -214112, -171683, -68099, 59370, 167219, 211065, 173130, 74444, -50909, -161015, -207558, -174343, -79545, 43976, 154431, 203689, 175177, 85595, -36862, -148056, -199926, -176517, -91402, 29727, 141480, 195806, 177317, 97103, -22712, -134579, -191355, -177467, -101535, 16198, 128122, 186822, 177868, 105594, -9461, -120907, -182864, -178862, -110450, 3803, 114170, 177559, 178757, 114611, 2972, -107184, -172767, -178866, -118576, -9011, 99999, 167977, 178375, 121397, 15472, -92292, -163264, -178472]
467a78472N4007J03910J05243P3636J9464n0779j00873j04140p5501k3177M7018
478a29664R7672J02991P8054K6400m4244r3579j01408q0398k9508M1163Q9734
489d2787R9722Q2663L2506l8192q5858r8437q4388l5130L4824Q1565R6668Q6968
501A30124L7782l1497p7700r6154q8046l9112K8171P2938R4313Q9873M0856k4247
513A37301o9262r3535r0771m1688K0689O4931R2329R0870M3997j6217o1520r2720
525a5596r0829m4026J2396N6201R1501R1227M5985q241n3737r0510r0480m6822
537a42931M532N0551Q8914Q9423M8585L04m7186q8468q8713m9715m224M4220Q6212
550h496Q7260N2054Q313m2237q4748q5423n3321j2194L9723Q2405Q3999N5342
$$ y = [-178472, -124465, -20555, 84688, 158324, 177788, 127009, 26136, -78004, -153505, -176682, -129664, -31992, 70999, 149053, 175453, 131209, 37630, -63778, -144176, -173684, -132521, -42787, 56935, 139598, 172104, 133912, 48054, -50383, -134771, -169901, -135077, -53512, 43156, 130124, 167906, 136409, 58709, -37445, -125491, -164603, -136432, -63494, 30819, 120692, 161548, 137301, 68039, -25496, -116267, -157955, -137266, -72335, 19994, 110864, 154861, 138644, 77124, -15596, -106425, -150451, -138055, -81854, 9647, 100874, 146859, 138618, 84881, -5629, -96109, -142931, -138399, -87848, 1066, 90489, 139074, 139378, 92192, 3724, -84989, -134704, -138928, -94708, -8496, 78764, 130818, 139131, 96894, 12146, -73277, -126598, -138792, -99069, -16664, 67335, 122677]
562A22677J6167l7616q0373q2249n7467j9027L5203P7561Q0387N9951K2018l3178
574A04054p4598p9339o1371k4616L1006P1315P7784O3756K6669k9222o8324p6364
586c9250o5631k8267K7601O4852P4750O7152L0261k4897o1498p4958o8181l0540
598a28606K1462N7952P4118O9720L2011j9380n4669p3575p0401l2996J6795N1885
610e5684P2803P0527L3920j3321m8969p2370p0279l5247J0035M6064P1582P0603
622G9664L6209o891m3841p0789p0502l6839L600M1562P0186O9620L8193o52l9143
635G0377o9579o8808l9356k202L6846O8290O7948M1121M943l5144o6439o7665
647e9668m1896p903L3079O4921O6630M3750J0070l1244o3167o5769m5545j2288
$$ y = [122677, 138844, 101228, 20855, -61394, -118861, -137888, -102685, -25124, 55263, 115214, 137232, 104054, 29456, -49883, -111254, -135870, -104864, -33549, 44235, 107991, 134660, 105438, 37114, -39250, -104881, -133148, -105547, -40695, 34055, 101207, 131468, 106571, 45073, -29885, -98066, -128606, -107144, -49192, 24926, 94646, 126657, 107277, 52608, -20967, -91368, -124364, -107569, -55684, 17119, 87646, 121566, 108245, 59276, -13094, -83373, -118620, -108585, -62521, 9061, 79664, 115873, 108982, 65141, -5648, -76150, -112989, -109389, -67827, 2359, 71979, 110172, 109520, 70377, 798, -68010, -107366, -109568, -72722, -4432, 63516, 104637, 109580, 74436, 7997, -59668, -101564, -109467, -76388, -11467, 55163, 98913, 108983, 77739, 14572, -51197, -96742, -109030]
659a09030K9553O1552O4982M6402J4596k7324n9858o3737m8077j6188K5445N7273
671b4411O3386M9178J8624k3890n5214o2782n0609j9423K1873N2543O1802N1940
683H3017K1460k0325n0569o1297n2541k2829J7970M8801O0604N3088K3787j5278
695H5888m6569o0402n3751k4579J3223M4360N9668N4023K6340j1767m1999n9017
707a4582n4218k7542Q605M0893N7978N4297K9200o786l9007n6878n4322l0390
719i2752M974L7040N5636N4577L1264k798l4838n5481n4141l2355M51L3266N4254
732i03N4030L3937J033l1537n2356n4200l4890k900K9728N1284N3569L5822M828
745H7445k7958n0017n3243l6692o542K5675M8676N3001L7842Q369k3947m7159
$$ y = [-109030, -79477, -17925, 47057, 93459, 108055, 80731, 20873, -42864, -90941, -107129, -81684, -24411, 38975, 88153, 106777, 82887, 27673, -35109, -85718, -105141, -83268, -30725, 31077, 83017, 104477, 84152, 33583, -27714, -80255, -103084, -85114, -36313, 24291, 77379, 101166, 85888, 39319, -21083, -74834, -99413, -86190, -41830, 17838, 71861, 98201, 86434, 44435, -14582, -68800, -96342, -87737, -46844, 11134, 65431, 94631, 87845, 48838, -8040, -62362, -92752, -87778, -50738, 4898, 59475, 90739, 87941, 53103, -2378, -56519, -88874, -88423, -55157, -903, 53127, 87064, 88097, 56560, 4204, -49996, -84886, -87786, -58058, -6774, 46795, 82617, 87445, 59487, 9470, -43773, -80465, -87007, -61332, -12656, 40345, 78187, 86556, 62609, 15450]
757A5450n2846l8461j0223K2052M6227N2349L9152J1379k0238m4016n2118m0069
769g1362j2969J8720M2628N1300M0589J4716j6766m1812n0455m1122j6405J4909
781f8029M0167N0371M1564J7358j2892l8683m9720m1646j8953J1241L7397M9136
793A7311M1896J9908r487l5858m7873m2539k1525P952L4460M7312M2536K2673
805G6766o437l2872m6302m3021k3485M960L1351M5355M3129K4329l268k9975m4470
818c940m3128k5402J984K8298M3750M2867K6612l7k7193m2749m3135k7122j316
831g0511K5127M1952M2884K8440K551k3991m0662m2606k8906m377K2117L9927
843h055M2576L0159M966k0454l8863m2208l0584p337J9161L7972M2321L1244Q034
$$ y = [15450, -37396, -75857, -86080, -64028, -17801, 34548, 73700, 85079, 64841, 20825, -31293, -71362, -84331, -65611, -22983, 28317, 68906, 83622, 66856, 25044, -25411, -66533, -82938, -68029, -27862, 22509, 64073, 81431, 68539, 29856, -19864, -61510, -80463, -69222, -31825, 17311, 59207, 79115, 69628, 33770, -14103, -56642, -78167, -70215, -35755, 11557, 54093, 76766, 70329, 37457, -8845, -51866, -75351, -70391, -39040, 6315, 49444, 73773, 70505, 40530, -3940, -47068, -72470, -70486, -42188, 1562, 44429, 71041, 71004, 43811, 1062, -42073, -69195, -70511, -45384, -3432, 39452, 67892, 70443, 46452, 5790, -36816, -65722, -70099, -47982, -8055, 34521, 64680, 69646, 49192, 10329, -31879, -62463, -69800, -50639, -12667, 29654, 60898, 68932]
856F8932j7403l7020m1803l1413r468J5581L5870M1518L2167J0859j4853l4414
868A8553m1111l2614j1956J3103L3447M0642L2988J3261j1741l2117l9903l3695
880e1143j4400J0629L0661L9833L3905J4973r133k9438l9044l4123j6357P544
892e6093K8443L8517L4820J6960o274k7094l7967l4830j7945M993K5633L7109
904F272L5168J8914l666k4361l7042l4891j9209K065K3110L6351L5044K0052q71
917E6936k1929l5728l4641k1153o25K1114L4964L4301K1908J954j9721l4306l4444
930c1370k2335l328J8559L3485L4366K3110M366j7627l2488l4045k3707n496J6275
943d0235L1433L3685K4534O922j5676l0180l3176k5619p661J4231L0052L2751
$$ y = [68932, 51529, 14509, -27294, -58707, -68175, -52594, -16724, 24794, 56961, 67820, 52967, 18553, -22558, -55172, -67128, -54025, -20578, 20064, 53052, 66313, 54572, 22455, -17448, -51143, -65543, -54914, -24253, 15580, 49485, 64458, 55325, 25887, -13157, -47280, -63637, -56093, -27650, 10867, 45687, 62647, 56373, 29279, -8688, -43518, -61463, -56470, -30837, 6272, 41440, 60354, 56688, 32327, -4715, -39606, -58815, -56750, -33640, 2711, 37755, 57807, 56936, 35007, -721, -35362, -56515, -57140, -36026, -1062, 33239, 55147, 57101, 37380, 3074, -31370, -53705, -57033, -38474, -4989, 29377, 52487, 56853, 39226, 6738, -27307, -51014, -56510, -40235, -8802, 24883, 49417, 56339, 40663, 10483, -22693, -48312, -55973, -41742, -11690, 21061]
955B1061K5929Q342j2952k8826l2264k6563r657J1957K7367L2637K6915J0491
967E4437j1206k6174l1912k7557j1132R930K4952L1969K7395J2386q929k4319
979A9840l1372k8076j2466P955K2681L1193K8474J2979o381k2095l0665k8644
991c6577j3943N386K1379L0378K8194J4516m461k0024l0059k8442j4611L274J8536
1004b6454K9989K8475J5397j707j8131k9715k8154j5876N47J7200K8953K8335
1016B8859J6146P57j6155k8400k8403j6732j708J5297K8122K7756J7263K907j4822
1029C0887k7147k7586j7981l653J3537K6586K7752J8487M444j3006k5808k6965
1041b0453j9343n567J2101K5602K6387J9962O245j1480k4525k5856k0748o949
$$ y = [21061, 46990, 55332, 42380, 13554, -18710, -45273, -54930, -42973, -15606, 17031, 43946, 54437, 43231, 17057, -14855, -42412, -53544, -43614, -18662, 13307, 40702, 53088, 44159, 19840, -11532, -39608, -52074, -44119, -21438, 9755, 38229, 51208, 44827, 22732, -7933, -36577, -50520, -45134, -23755, 6623, 34817, 49333, 44872, 24848, -5211, -33653, -48264, -44990, -26454, 3535, 32010, 47407, 45700, 27569, -2146, -30300, -46176, -45629, -28429, 524, 28859, 45005, 45762, 29607, 1207, -27196, -43928, -45636, -30339, -2217, 25539, 42802, 45709, 30887, 3740, -23846, -41827, -45480, -31943, -5357, 22395, 40882, 45326, 32320, 6512, -20453, -39796, -45363, -33262, -7660, 18727, 38689, 44934, 33454, 8929, -16927, -37675, -44624]
1053d4624J0606K3588K6011K0867P863r638k2687k5622k1799q649R463K1364K5462
1066A2205K1869R185q203k0531k5220k2610r262P410J9436K5216K2385J0123o256
1079C5747j8700k5084k2646j0619N574J7369K5066K2800J1003m572j6771k4525
1091e358k3196j1014L779J5470K4552K2833J1691k440j5212k4077k3200j1812
1103c7984J474J4182K4249K2734J2846j101j3697k3171k2934j2806p32J3414K3088
1116d38K2235J3527J562j2732k2452k2445j3482k449J1943K1588K2372J4673K769
1129C6671j1419k1077k2052j4706l756J0512K0843K1525J5339M440r939j9997
1141F384k1216j6327m786R196J9114K1280J6583N478q490j8379k1221j6905n973
$$ y = [-44624, -34018, -10430, 15581, 36448, 44311, 34673, 11986, -13636, -35435, -44084, -34621, -13257, 12205, 34074, 43259, 35056, 14525, -10695, -33305, -42567, -35157, -15721, 9495, 31880, 42003, 35747, 17047, -8037, -30683, -41302, -35728, -18359, 6707, 29507, 40510, 35938, 19167, -5358, -28554, -39568, -35789, -20319, 4233, 27066, 38757, 36317, 21105, -2972, -26172, -37984, -36510, -22328, 1921, 24655, 37501, 36400, 22703, -468, -23402, -36208, -36940, -23526, -438, 21797, 35324, 36886, 24154, 1702, -20743, -34225, -36674, -24731, -3143, 19229, 33902, 36671, 25252, 4175, -17877, -32583, -36339, -25827, -4984, 16541, 31880, 36320, 26381, 6384, -14832, -31159, -35945, -26749, -7635, 13645, 30228, 35706, 27216, 8837, -12384, -29289, -35262]
1154c5262P761J7846K0634J7320O526o858j7178k0631j7274p319O349J6548K0538
1167I000J7500P323n408j5911k0464j7284q275M713J5288K0057J7730Q527l874
1180B8922j4779j9743j7651q919L150J4102J9415J7700R548k813j3330j9158j7804
1193b1360r491J565J2977J8776J7899J0100j198j1965j8698j8094j0147K95J1673
1206a7668J8050J7607J1454m35j1008j7354j7771j1386l56R962J7383J7987J1473
1219B7938Q00r391j6774j8010j1340k074R001J6489J7812J1695K471q602j5740
1232D275j7608j2257l073P991J5826J6977J2733L615p484j5279j7032j2885l739
1245b7940O448J4665J7309J2945M171o066j4189j6510j3415m704N300J3701J6923
$$ y = [-35262, -27501, -9655, 10979, 28299, 34825, 27967, 10789, -9842, -27116, -34435, -28086, -11538, 9000, 26500, 33823, 28415, 12504, -7960, -25244, -33519, -28806, -13518, 6539, 24269, 32796, 28922, 14143, -5600, -23251, -32170, -29020, -14918, 4497, 22197, 31745, 28932, 15602, -3556, -21360, -30851, -29286, -16309, 2467, 20366, 30466, 29268, 17303, -1395, -19489, -29636, -29341, -17668, 382, 17989, 29443, 29008, 18000, 646, -17125, -28511, -28867, -18905, -1522, 16465, 27938, 28738, 19347, 2573, -15437, -26777, -28851, -19850, -3361, 14451, 26146, 28617, 20015, 4275, -13333, -25590, -28663, -20672, -4846, 12131, 24864, 28479, 20995, 5716, -11316, -24201, -27940, -21492, -6827, 10482, 23427, 27598, 21532, 7343, -9167, -22582, -27286, -21986, -8285, 8638]
1258H638J3036N368m844j3417j6372j3403n942M313J3181J6045J3726O112l918
1271B2523j2367j5857j3646o908L549J1892J5790J3447O802k620j1212j5275j4069
1284a7951p232K462J0840J4705J4412P564k180j0013j5203j3472q250J342R753
1297a3223J4583J4183Q202q61r505j4009j4006q630M60R070J3668J4121Q638L42
1311B3033q526j3764j3714r286n43P944J3285J3931R313J005p186j3178j3867
1324a1553r805j300O918J2554J4051R407K024o254j2423j3688j0053k046N646
1337a6522J1983J3864R967K819n651j1587j2923j0685l061M975J1101J3250J0822
1350A8352L346m618j0906j3278j0644l485L687J0708J3164J0705M117l578j0029
$$ y = [8638, 21674, 27042, 22198, 8781, -7591, -20994, -26936, -22623, -9442, 6603, 20329, 26441, 22523, 10156, -5701, -19347, -26255, -22706, -10814, 4976, 18423, 25225, 22605, 11393, -3882, -17951, -25183, -22721, -11881, 2824, 17236, 24800, 22620, 12607, -2596, -16068, -24318, -22976, -13223, 1360, 15543, 23745, 22884, 13379, -630, -14636, -23266, -22806, -13736, -68, 14053, 22691, 23033, 14507, 743, -12971, -22257, -22800, -14856, -1571, 12360, 21673, 22678, 15492, 2314, -11553, -21358, -22658, -15740, -3186, 10865, 20272, 22296, 16042, 3619, -10069, -20122, -22168, -16522, -4539, 9325, 19292, 22111, 16460, 4873, -8050, -18735, -21796, -16821, -5720, 7530, 18352, 21698, 17080, 6174, -7104, -17748, -21233, -17546, -6838, 6326, 17031, 21148, 17570, 7541]
1363G541j3055j0544m809L114R886J2626J0952N093k920r580j2476j1072n099
1376b0343K366R260J2225J1031N424j797q913j2103j0674o099J507Q227J2338
1389B449J0535O142r66p783j2041j0894o307O32P580J1481J1160O533l55p150
1403A1016j1068j1095o970p9O895J0792J1179P232K62o643j0780j0776p112j063
1417a8210O529R882J1543P040J425n685j0357j0678p945j258N017J0287J0242
1430G832Q241J521m869r535j0616p957k271M806R280J0461Q161K363m143r068
1444D206j0858q082k619L712R102J0277Q399L099l796q161j0393q703l025K959
1458a3883Q481J0079Q338L805k909p502j0314q845l752K853P146J0094Q835L755
$$ y = [7541, -5514, -16058, -20867, -17753, -7867, 4759, 15711, 20804, 17884, 8304, -4172, -15244, -20343, -17977, -8717, 3508, 14539, 19963, 18166, 9253, -2850, -13524, -19623, -18116, -9889, 2449, 12984, 19126, 18160, 10377, -1664, -12558, -18865, -18233, -10653, 828, 11988, 18521, 18166, 11016, -52, -11147, -18117, -18196, -11301, -509, 10670, 17902, 18164, 11521, 741, -10035, -17147, -18210, -11681, -1799, 9744, 16784, 18209, 12524, 2167, -8511, -16456, -17714, -12697, -2410, 7832, 16073, 17594, 12725, 3190, -7426, -15383, -17654, -12848, -3568, 6893, 15054, 17417, 13274, 4206, -6652, -14734, -17353, -13641, -4539, 5738, 14137, 17236, 13440, 5279, -5114, -13817, -16842, -13883, -5402, 4677, 13015, 16820, 13911, 6409, -3905, -12750, -16502, -13649, -6503, 3591, 12426, 16181]
1472A6181k106p261r928q672m036J587P047R601Q824M326j440o379r754q703m590
1487a5303J110N971R566R073M539o13o043r222q676n434M98N855R086Q868N376
1502A4651P5o063q621q625n698l76N640Q462Q796N410R76n236q306q892n652r84
1518a4443M603Q454Q366O242J438m772q007q650n878j535L730P939Q616O457J452
1533A4012m081p189q196o391k362L811P412Q265O375J921l196o707q366o566k338
1548a3596K837P020P985O655K807k706o494q434o518k999K526O314Q054O880K835
1563A3166k013o061p894p110l048J599N985P743P182L179j787n355p922p122k984
1578a2442J062N722P530P099L227j055m901p678p207l467Q82M533P935O827L857
$$ y = [16181, 14075, 6814, -3114, -11786, -15822, -14235, -7188, 2413, 11237, 15563, 14123, 7744, -2010, -10713, -15303, -14193, -8222, 1344, 10417, 14956, 14343, 8300, -922, -9598, -15032, -14534, -8679, 407, 9275, 14651, 14726, 8663, 42, -8583, -14281, -14657, -9017, -555, 8241, 13651, 14627, 9391, 1085, -7807, -13459, -14443, -9840, -1386, 6980, 13222, 14660, 9888, 1881, -6769, -12647, -14182, -10452, -2513, 6103, 12560, 14012, 9931, 2742, -5454, -11845, -14207, -10396, -2984, 5281, 11656, 13577, 10381, 3674, -4692, -11258, -13596, -10759, -3739, 4246, 10901, 13708, 11002, 4508, -3926, -10444, -13443, -10917, -4603, 3451, 10331, 13166, 11153, 5092, -2802, -9912, -12960, -11361, -5376, 2367, 9549, 12728, 10941, 5586, -2336, -9458, -12442, -11380, -5658, 1872, 8971, 12198, 11143, 6242, -1436, -8643, -12110, -11228, -6695, 1240, 8067, 11924]
1593A1924n67m702p102p034l978J09M507P231O884M097k41m095o749p303m136
1608a1155J22L688O958O874M222L18l705o589o647m310j176L807O540O653M329
1623I929J128l385o180o545m850j180L134O274O366M761J524k763o125o466m996
1638i374j623K952N556O527M994J678k645n342o557n138j473J920N817O263N008
1653H563K052k205n429n849n561k097J951M747O801N092K070j550m710o351n474
1668g950k119J519M593O178N250K416j357m252o303n161k542J281M110N581N726
1683F970K641n83m423n915n169l115Q07L714O078N286L071o79l756n526n177l320
1699i096N77L188N702N432L130k53l291n524n253l281o7L534N122N429L152M87
$$ y = [11924, 11357, 6655, -447, -7481, -11459, -11350, -6843, 388, 7272, 11369, 11128, 7033, 284, -7019, -11155, -11033, -7345, -387, 6487, 10709, 11027, 7322, 733, -5914, -10224, -11400, -7593, -1053, 5600, 9929, 11057, 7672, 1492, -5053, -9903, -11083, -7949, -1675, 4691, 9452, 10976, 8213, 2088, -4378, -9374, -10997, -8045, -2489, 4038, 9032, 10710, 8065, 2723, -3834, -8972, -10445, -8525, -2708, 3555, 8563, 10615, 8410, 2981, -2868, -8429, -10526, -8575, -3828, 2973, 8065, 10135, 8585, 3875, -2476, -7950, -10069, -8550, -3957, 2221, 7471, 9887, 8530, 4278, -2025, -7186, -9728, -8447, -4337, 1244, 6970, 9611, 9028, 4605, -1310, -6479, -9594, -8787, -5073, 1005, 6291, 9362, 8683, 4927, -599, -5776, -9096, -8519, -5331, 371, 5803, 8933, 8680, 5389, -135, -5388, -8669, -8736, -5202, -80, 5349, 8501, 8988]
1715H988l352n319n144l546l10K738N109N396L775K77k737m885n355l535q89K460
1731f329N329N108L612R90k526m840m880l810j051K379M607N088L700R35k134
1746F178m247n051m058j034J849M151N217L769J499j949m091m679l911j526J319
1761f564M309M551M058J741j613l743m966m057j603J281L705M904M104J629j002
1776F734l492m882l997k091J264L298M591M106K012j124l091m500l986k444R98
1791f604L131M447M188J874l14k841m682m234k135P54K715M562L934J925k16k741
1807C763l978m063k686L05K790M006M106K353L58k898m136m165k428j28K715L800
1823b86M322K324J38k025m094l810k993L9J871M041L883K758N99k235l552m185
$$ y = [8988, 5636, 317, -4827, -8373, -8683, -5945, -836, 4560, 8335, 8612, 5875, 990, -4365, -7900, -8789, -6329, -1000, 4108, 7720, 8710, 6184, 1344, -3536, -7346, -8397, -6018, -1411, 3677, 7377, 8312, 6178, 1931, -3120, -7178, -8212, -6363, -2212, 3005, 6774, 8273, 6324, 2233, -2446, -6357, -7883, -6564, -2255, 2296, 6354, 8095, 6482, 2739, -2227, -6284, -7887, -6606, -2901, 2003, 6107, 7736, 6734, 3242, -1640, -5637, -7728, -6464, -3166, 1425, 5531, 7543, 6419, 3328, -1172, -5158, -7602, -6604, -3473, 974, 5162, 7036, 6722, 3881, -801, -5035, -7170, -6416, -3701, 861, 4795, 6720, 6504, 3763, -215, -4278, -6964, -6659, -3869, 137, 4243, 6596, 6954, 4056, -80, -4245, -6673, -6801, -4086, -286, 4036, 6360, 6498, 4473, 379, -3431, -6424, -6385, -4514, -473, 3410, 6168, 6767, 4532, 980, -3205]
1839c205k855p67K522L440L656L033O30j756l626m010l030n99J625L413M290K715
1855E476R55j707l125l925l055j100J522L152M319K685J039j309l124l811k998
1870e006j133Q39L320L655L351Q40n66l234l572l136j410O60L046L581L448J176
1886E859o35k966l556l036j513L61K903L560L272J607o20k615l706l023j639P63
1902d984K115L574K973K015m85k282l453l181j638j7K307L128L470J795k30k100
1918C007k922l676j663J38J871L381L122J845J56j982l269l103k084L0J791L008
1934c50L327K346j71j655k961k998k472J12J158K934L340J926N54j608k898k951
1950b367k112n89J249K852L081K386N44j155k868l278k025q21J183K963L241J961
$$ y = [-3205, -6060, -6827, -4305, -865, 2791, 5824, 6454, 4698, 1072, -2938, -5968, -6567, -4942, -1529, 2761, 5476, 6431, 4724, 1599, -2326, -5381, -6481, -4959, -1807, 2512, 5197, 6236, 4927, 1803, -2008, -5006, -6139, -5300, -1980, 1675, 5026, 5866, 5300, 2066, -1506, -4642, -6052, -5392, -2346, 1235, 4683, 5859, 5224, 2258, -1298, -4334, -5847, -5486, -2583, 977, 4249, 5856, 5236, 2621, -1085, -4108, -5747, -4984, -2869, 705, 3678, 5693, 5208, 2926, -527, -3708, -5346, -5363, -3056, 72, 3542, 5337, 5107, 3007, 85, -3591, -5254, -5116, -3245, 136, 3258, 5103, 5259, 3277, 8, -3095, -5179, -5149, -3358, -350, 2977, 5323, 5152, 3497, 536, -2462, -4934, -4822, -3664, -730, 2610, 4536, 5090, 3482, 584, -2367, -4479, -5068, -3819, -967, 2114, 4500, 5044, 3889, 1021, -2257, -4282, -5103, -3920, -957, 2284, 4245]
1966D245P22j043k702k857k516o40P87K465L336K192J043j112k324k924k570q36
1982d734P25K598K738K667P86p43k173l182k240j142P04K141L219K374R79o18
1998D099k279k813k384j025P76J546K784K485J220k19k162k613k639j115L94J573
2014b372K659K465J507j50j900k681k154j574O9K046K183K743J511qk177k068
2030I9k688j230p7J481K301K537J487J00j753k228k196j556l16J466K555J936
2046A918K027K14j406k322k711j620O0J015K348K551J900l0j208k121k231j871
2062c487n70J273K025K545J724N71j322k204k229j786l25J007J834K550J432P28
2078C766o79j741k723j798m62P99J528K458K005M23o48j799k239j949o02O42J776
$$ y = [4245, 4967, 3924, 1222, -1635, -4151, -4791, -4004, -1539, 1797, 3989, 5032, 3920, 1596, -1328, -3898, -4734, -4009, -1411, 1327, 3994, 4780, 4037, 1864, -1318, -3558, -4700, -3996, -1855, 1364, 3738, 4717, 4099, 1820, -993, -3377, -4402, -3626, -2080, 704, 3189, 4409, 4190, 2028, -585, -3224, -4339, -3945, -2372, 287, 2752, 4259, 4109, 2209, -472, -2626, -4200, -4131, -2085, 98, 2841, 4352, 4344, 2167, 99, -2589, -3819, -3896, -2415, -114, 2423, 3910, 4010, 2257, 29, -2167, -3723, -4039, -2573, -18, 1918, 3945, 4159, 2753, 431, -2280, -3900, -3840, -2825, -477, 2074, 3974, 3944, 2736, 615, -1616, -3487, -4057, -2784, -759, 1786, 3510, 4081, 2759, 555, -1674, -3460, -3785, -2778, -944, 1606, 3038, 3766, 3087, 1346, -1377, -3175, -3637, -2838, -1310, 1148, 3153, 3576, 2928, 1129, -1110, -3059, -3661, -3019, -1243]
2095a243K235J975P53o93j790k074j873r21M14J857K424J668N63k68j527k400
2111i00j680r62M64J475K169J811J058k72j727j892j797j298K56J433K165K115
2127B418P88q3j322k315j757j106K44J369J960K016J274l53j098j795k275j294
2143c329O6J449J854J806J367l7j376j864j840j299p9J192J769K131J136L09j158
2160B097j830j818j505k92J158J879J776J472K91p47k215j781j214k06M96J622
2176h17K425Q40Q24q99j789j845j552k52O44J857J658J670O57q96k093j591j624
2193b783l39P42J361K237J235L30j69j586k206j391o24O11J108K062J997O40p45
2210B480j581j705j602n28M98J397J809J416Q28m86j478j503j738q31L82J582
$$ y = [-1243, 992, 2967, 3720, 3027, 1237, -837, -2710, -3631, -3217, -1360, 1064, 2732, 3295, 3027, 1500, -900, -2580, -3542, -3078, -1603, 566, 2377, 3435, 3163, 1436, -456, -2253, -3551, -3295, -1862, 303, 2418, 3206, 3123, 1801, -514, -2271, -3377, -3133, -1764, 196, 2212, 3486, 3133, 2035, 240, -2035, -3329, -3263, -1814, 40, 1846, 3213, 3176, 1800, -64, -1904, -3203, -3282, -2090, -321, 1810, 2946, 3255, 2097, 267, -1551, -3056, -3348, -2190, -311, 1465, 2937, 3228, 2481, 266, -1515, -2729, -2935, -2439, -817, 1608, 2448, 3272, 2373, 584, -1261, -2813, -3065, -2421, -564, 1094, 2764, 3421, 2525, 432, -1159, -2783, -3122, -2380, -1019, 1218, 2453, 2783, 2614, 1028, -1178, -2569, -3193, -2582, -1474, 588, 2585, 3225, 2480, 899, -806, -2408, -2936, -2438, -1041, 768, 2184, 3012, 2526, 1048, -455, -2193, -3024, -2642, -1060]
2226a060J738J347Q38l75j015j839j831j021P20J078J429K131N10m2j274j553
2242b19j602q30J45R27J764J610P66J46j108j864j765o42p5J329J449J475J091
2259B597Nq99j573j381j486K07Q97J677J666R41J19j347j346j715p18k42R64J370
2277b64J575J330j32o16j747j313j496K8N44J773J485J439j15o68j481j421j147
2294b226l04Q47J214J574J007P12o97j551j566j141n27O21J315J607J491K90n79
2311B087j083j690j548p54R36J617J133J309P40p07r99j680j357p06N32J435J157
2328D22J394O21j57j140j696j336n39J27J201J419J575N27m76p89j537j296q33
2345b513L12R56J531J400P43k46q76j428j331j092M06P90J488J463P43j54r81
$$ y = [-1060, 678, 2025, 2863, 2488, 1473, -366, -2197, -3218, -2498, -1420, 9, 2140, 2650, 2608, 1334, -219, -1821, -2651, -2506, -1579, 185, 1795, 2561, 2707, 1599, -265, -2030, -2672, -2747, -1418, 31, 1506, 2597, 2602, 1703, 130, -1251, -2737, -2530, -1633, 44, 1710, 2651, 2770, 1423, 77, -1638, -2356, -2598, -1634, -264, 1311, 2641, 2509, 1893, 146, -1167, -2663, -2635, -2091, -318, 1167, 2606, 2491, 1823, 342, -1079, -2226, -2530, -1683, -469, 1105, 2112, 2824, 2127, 576, -990, -2131, -2658, -2037, -722, 885, 2376, 2666, 2087, 1004, -686, -2234, -2988, -2052, -435, 698, 2007, 2747, 2040, 1041, -639, -1996, -2702, -2170, -735, 422, 1816, 2437, 2280, 1140, -556, -1892, -2431, -2304, -1103, 316, 1891, 2418, 1942, 1153, -384, -1680, -2513, -2201, -1245, 286, 1686, 2429, 2183, 1307, -121, -1452, -2544, -2138, -1348, 140, 1603, 2346, 2192, 1211]
2362A211j295j394o38j27R27J433J086R08K16p77j622j300q48j43Q96J411J403
2379A347Q43K10q90j416j424p56l2Q30J123J288R31K30q41j214j496p45o9K34
2397a847J300J690Q56M89q93j059j426j118j23L27J583J089Q15N52n81j217j342
2414i05j014k0L53R83J379R33K23mj139j330j299n20N07J034J302J072P28n42
2432A741j046j043j271o78L04J140J444J088P16l48j024j402j015q46M70Q35J461
2449E26Q32P68k44p04j388j193o07o5R21J466J179O13k55r16j223q41j094K22
2467b003P93J245J095J162k92q65j473q22r91J81P03J201J290Q32l1q07j178j336
2485a296p63l94J013J277J345N44K62o66j392j178p25j40M63J298J073J054J06
$$ y = [1211, -84, -1478, -2116, -2243, -1316, 117, 1203, 2111, 2327, 1550, -72, -1372, -2220, -2363, -1467, -56, 1347, 2190, 2400, 1510, 94, -1330, -2086, -2118, -1288, -165, 1123, 2054, 2284, 1443, 229, -1267, -2012, -2081, -1847, -547, 1143, 1999, 2488, 1595, 536, -890, -2008, -2131, -1804, -221, 868, 1683, 2235, 1654, 437, -905, -1919, -1939, -1586, -603, 776, 1709, 1932, 1928, 789, -541, -1840, -2360, -1853, -819, 483, 1555, 2283, 1741, 695, -348, -1619, -2297, -1993, -853, 591, 1679, 2395, 2047, 1023, -379, -1394, -2240, -1770, -935, 526, 1358, 2126, 1882, 1178, -210, -1403, -2010, -2075, -1154, 312, 1491, 2104, 1849, 933, -290, -1131, -2225, -2003, -1210, 35, 1130, 2292, 2000, 1135, -338, -1160, -2151, -1970, -1267, -66, 1224, 2056, 2025, 1218, 40, -1296, -2059, -2453, -1440, -163, 1182, 1726, 1988, 1322, -70, -1248, -1973, -2113, -1650, -352, 721, 1775, 1881]
2502A881p35p53j116j189j83M37J088J507P71L91o54r10j036j214l61M48J187
2519d41J047J094L81l63j139j127r98j55j1J149J125R22O71p58o36j357r29k30
2537a755J06P14J353J072M97m94r27r13r06o55N95N57R93J447K36m79o71r82p75
2556i87q82L4Q92J081J004O10r1q47j125n75o93J01O83Q20J438J23J65n78j248
2575g5q90n42l63Q46R81J112O87k84j71j330q29p80j61N41J316R97O18j9l66j213
2595G5j051q76K78N42M59J822K38L15n25j097r79o58j86L21J186J023N98L60n56
2614A289j004r61o74m33M00J009J259O72K84p25j030o34q33k18L57P00Q52J116
2632A426L20n03p39j033j002M3K58O63J037O72M77q1j019p83j057k78K54P51J107
$$ y = [1881, 1146, 393, -723, -1912, -2095, -1658, -570, 937, 1708, 2099, 1445, 535, -501, -1715, -2076, -1628, -441, 606, 1700, 2081, 1718, 579, -548, -1546, -1701, -1712, -563, 562, 1484, 2155, 1397, 761, -596, -1525, -1755, -1649, -935, 418, 1490, 1987, 1493, 566, -347, -1253, -1908, -1313, -756, 237, 1684, 1920, 1441, 770, -212, -987, -1869, -1835, -943, 138, 1142, 1752, 1661, 814, -311, -886, -1579, -1478, -795, 25, 1463, 1586, 1751, 1173, -75, -965, -1507, -1870, -1024, -43, 1069, 1756, 1472, 1301, -29, -858, -1638, -1799, -1258, 58, 1055, 1673, 1654, 1288, 75, -976, -1852, -1574, -1032, -573, 1249, 1487, 1802, 1277, 180, -799, -1457, -1643, -1322, -136, 887, 1485, 1845, 1289, 285, -676, -1350, -1783, -1383, -374, 885, 1557, 1841, 1116, 86, -548, -1381, -1599, -1242, -542, 310, 1426, 1746, 1243, 504, -529, -1531, -1488, -1230, -567, 470, 1142, 1619, 1538, 519, -264, -1321, -1599, -1345, -594, 513]
2651E13Q52K15K74j214r09q20o37M13O61R97Q72K90k25n14p58j342n3o6Q45P61
2671A55P89R33o25l81r54q69n52K58K80R79N05Q20J66o99o24r18p50r0O27R57
2691GQ54O50j87l83q53j037o83O4N59J025P64O46K5j15j207p73o94m87O77P24
2711d24J208N41K48p46m93q92q25k20N55O37P01Q21N74o90p43p09q45J29o4O68
2731e69J242O74J57m31n25j026p52k26N17M91Q22O55L74k09j013n23r10k4J57
2750a119O76Q88L63P55p83j18q65p38l98J03O16R65N45M97k66n18n61q28l85P0
2770a101L82R54P34J58J67m85j060p82l68K90O96N94M74O77Np30m73q44n66K51
2790a027K85P32Q12K69L0k52q39q53m39P1M08O30R01L96J83q04m59r83l41k12
$$ y = [513, 1365, 1580, 1854, 640, -269, -1089, -1726, -1313, -652, 345, 1217, 1507, 1282, 768, 10, -1332, -1385, -1451, -606, 155, 944, 1877, 1252, 871, -83, -952, -1504, -1246, -966, 13, 518, 1338, 1504, 805, 181, -737, -1487, -1577, -950, 7, 861, 1511, 1324, 941, 88, -949, -1632, -1568, -1009, 16, 780, 1426, 1451, 1336, 129, -644, -1338, -1825, -1148, -424, 784, 1325, 1573, 827, 334, -558, -1383, -1603, -1048, -411, 290, 1111, 1685, 995, 252, -457, -1302, -1173, -1237, -569, 673, 1347, 1504, 1073, 548, -478, -1230, -1456, -939, -448, 374, 1029, 1403, 1194, 181, -342, -1252, -1276, -1119, -443, 445, 808, 1563, 780, 662, -203, -941, -1339, -1236, -620, 345, 890, 1387, 1121, 603, 42, -786, -1171, -1101, -719, 235, 969, 1127, 1294, 809, -251, -1033, -1401, -1111, -415, 179, 653, 1330, 1335, 605, 132, -712, -1278, -1027, -742, -10, 802, 1071, 1101, 849, 10, -843, -1282, -1211, -803, -173, 728, 1124, 1307, 503, 44, -939, -1280, -1492]
2810a492O84P53P60K91K32m18o32o46m52l19M13O76O88N12Pl47o08p08j96l29
2830a131K23N89N85P09J32p1p57p36o74j48N37P15K50P06K28l24m50q38o24j61
2850a240P1Q45P65M21L08k82n03m95q24j94J91O09P49O17K22n3q79n20n41m93
2870a226K67L54Q65N98L61n9q53n04n77n39L48N07O50P65o2J09n27n21o68l49
2890a061O1K92P95N99M98l97k69n51n50m38l0J96P41P53M09j33l18n99p61p7J71
2911f69L59L78L50N14J87m78n95o44m29l17R63M93L62K91M14n05p34m58m66J88
2931g96J74K67R64L69qk51l70r21m08M4j41Q74M63O86K75l02p90n62m22j79K20
2952h14L59P95L55K76l53n88j41n84R7m09P11P91K46Q9k04n24k41n97j22J14O46
$$ y = [-1492, -808, -55, 705, 996, 1228, 810, 178, -468, -920, -1239, -826, -150, 538, 1050, 1057, 710, 102, -606, -802, -1131, -908, -319, 266, 975, 1107, 1036, 279, -457, -1131, -1279, -742, -27, 223, 929, 1157, 833, 383, -455, -1079, -1240, -1169, -324, 441, 862, 1170, 888, 385, -110, -934, -1128, -937, -328, 421, 1038, 1260, 1207, 328, -192, -733, -1226, -959, -605, 260, 858, 1219, 1160, 307, -197, -774, -1313, -965, -458, 192, 957, 895, 1004, 477, -44, -712, -1061, -1000, -708, 87, 686, 1184, 787, 518, -33, -583, -1021, -1051, -855, -114, 639, 1048, 915, 597, -2, -763, -840, -669, -310, 68, 418, 932, 1119, 641, 46, -598, -1027, -1344, -381, 112, 474, 765, 1179, 674, -60, -518, -984, -796, -622, -355, 609, 978, 970, 719, 349, -572, -980, -936, -1077, -203, 260, 946, 1221, 919, 129, -433, -855, -1034, -814, -455, 340, 695, 971, 618, 30, -111, -695, -598, -1007, -296, 495, 741, 830, 626, 102, -139, -736, -858, -744, -98]
2973i8M64M54J67j74m63p09j39p90M59L71P14K84L01K35n38n05p81l12M71J45
2993d44P50N21J12k99J1q50n62l04J20Q40M35M6M97n8l99n97l05m81K74J29M89
3014g5Q59P4j27k74k35o24o08J7M02N61O53N04o12p8m03l53l52j93N30L92M12
3035D70J63K6k68k73l83n55m7N25K06Q18K47m4l13p49j42k57o7J01M36O57K06
3056G57p3j23m61k76o56J5K07L48O67K32J73k01l69m20l43l61Q5P83K73L72J55
3077G84l42l4p75k30j57L51K34L57N51J93k7p65m81l34j29M9L23P76O02j97j24
3098F25l83n43m03j46K05L79O14J18J25K58m21r49Q8m14m5L50N32Q23pK38n57
3119D87n95n28l42P6O89K86O47o6M6j22o70l32Kl94O33L38K15N44l09m42j8q51
$$ y = [-98, 366, 820, 987, 813, 350, -359, -498, -1288, -829, -458, 256, 540, 841, 1076, 538, 33, -748, -1060, -589, -444, 306, 827, 939, 640, 651, -199, -761, -1065, -945, -105, 330, 376, 873, 815, 416, -181, -486, -967, -693, -564, -75, 784, 858, 731, 457, 222, -402, -1010, -993, -591, -30, 623, 1127, 515, 437, 34, -319, -671, -864, -334, 58, 470, 633, 659, 391, 118, -265, -820, -867, -342, -136, 682, 929, 885, 572, -177, -319, -576, -643, -542, -106, 551, 757, 684, 561, 100, -176, -832, -817, -610, -262, 405, 637, 810, 609, 240, -180, -523, -884, -799, -16, 257, 629, 784, 442, 408, -367, -597, -754, -403, -169, 188, 739, 932, 905, 140, -341, -675, -804, -755, -432, 344, 946, 749, 625, 242, -301, -704, -850, -645, -266, 348, 466, 591, 849, 428, -521, -433, -847, -892, -542, -10, 813, 806, 1044, 487, -108, -636, -978, -902, -213, 73, 720, 654, 700, 578, -92, -424, -422, -816, -183, 155, 370, 914, 605, 163, 145, -706]
3141g06j10J71K57M11K41L23j15K67r02k67p0j15L63J35O10L43k8m50l09k03o08
3162g62k22M81M57N24P7N6j53n13l19k67q5o5P88M24K80l8l3p90j35m71Q3K96
3184c87K0O24N02K19n8q63l5p16l5N9N67L99K01L40n80j20p01l4k20L78J71M17
3206A48M56J14j20l20o00m8n39L66M92L5M60L2L75o64m98k59k37K42L61K51M68
3227E15J64j01l21m10k31n23J85K28P90K72J91p2o35k42l60l52K54K23N05M79
3247E59K49k08k73n55j80k07j20L29M01N01L32l09j23l75m23j59m34M36N05Q75
3267H21O2k42j45n02k82m45l1N23J47N90K08J8k78n80r6j90l18L76J28N66K3L76
3289G29k86m99l14j32k90J09O11J41M44L87n16j35n40n13J08J94J20O48J78L31
$$ y = [-706, -816, -645, -388, 23, 264, 587, 472, 739, -163, -430, -500, -615, -252, -117, 493, 836, 808, 358, 49, -154, -762, -984, -503, -46, 478, 555, 611, 458, -55, -374, -641, -726, -791, -3, 421, 701, 663, 630, -160, -295, -766, -683, -387, -367, 257, 759, 978, 920, 57, 22, -694, -729, -670, -103, 296, 497, 837, 257, 137, -564, -598, -818, -440, -269, 148, 604, 718, 598, 278, -322, -370, -909, -543, -51, -16, 444, 476, 851, 187, -311, -570, -807, -565, -204, 47, 515, 679, 578, 257, -153, -384, -907, -722, -494, 296, 568, 759, 687, 52, -190, -550, -902, -648, -425, 80, 559, 808, 600, 327, -228, -408, -615, -735, -406, -5, 496, 828, 519, 396, 21, -402, -561, -995, -559, -54, 821, 883, 641, 496, -6, -288, -733, -764, -241, -94, 496, 704, 722, 444, -136, -232, -422, -740, -364, -236, 330, 353, 729, 443, -56, -370, -502, -792, -683, -72, 69, 513, 900, 384, 249, -291, -804, -696, -502, -382, 266, 444, 775]
3309G75L7n80j88p12k0K17M06L33N40L2l75l29n22j86m4o3M51N32M10j1k5k35
3331D43o71n28L12k46L66P62J16P0J35k79o71k62k20K44J57L50L06M26k15k25
3351C70m92m03k62O3N75M03J89L96k90k41j90l54m07j03J64P24K64J44N1l77m18
3372a94m94j3l2M31M64J80M52j60m11l39k66k26L4K37LQ84K90k13j98l16n54m00
3394h41J48Q8O55O7L26O67n69m72k61l20k62J88K47O72M98m44K21o46l28n33p
3415i06N56L08K92J27N43n95k72m36j20Q3j69O12L68J67Mr2m09m62m22K01r2M09
3437c05N89K08M09m39k53k41j95j71k12L16O16L37o3o0k45l66l76l83ON01L93
3458F6K09K78K04o52m4o09O4l14L91N33M58k16Q7j28k09q23m8K69P4P51j19M66
$$ y = [775, 812, 232, 44, -668, -688, -471, -65, 268, 808, 840, 465, 136, -386, -572, -616, -679, -228, 304, 714, 703, 678, 443, -228, -756, -444, -690, -324, 438, 554, 624, 759, 480, -191, -453, -673, -429, -272, 78, 384, 810, 595, 370, -122, -525, -787, -724, -149, 254, 443, 839, 549, 308, 118, -236, -643, -746, -582, 142, 406, 550, 601, 224, -194, -688, -701, -733, -302, 162, 342, 794, 634, 223, -116, -382, -608, -574, -337, -334, 550, 840, 627, 429, 113, -441, -841, -693, -605, 50, 117, 443, 1110, 541, 69, -192, -512, -774, -586, -339, 333, 831, 387, 608, -38, -366, -899, -906, -350, -42, 250, 377, 920, 325, 53, -383, -503, -420, -589, 23, 391, 558, 562, 470, 61, -401, -823, -622, -714, -305, 284, 492, 901, 462, 209, -32, -227, -398, -610, -294, 322, 659, 596, 536, 291, -75, -451, -834, -828, -327, 66, 275, 553, 757, 105, 61, -548, -484, -798, -407, 126, 584, 368, 455, 327, 118, -705, -753, -484, -410, 341, 222, 688]
3480F88k59j26k16m45j22l37M28J27M89N49l25j55k76m15j92j76L30O1L63M33
3500D24L50j19o13l58m54J94j3N32K03L32M36k84l65q27K6k89M41J81M07O05r1
3521G18l77k41j18k80m30L62K87K20M73m5k33l07o1l22l64K20N49M65j79J67k35
3542B69l10Om70j38JM11L10M76K63k51n46k35j44l70j16O28L55L75m0K07m51m54
3564b24k40k85K27k0Q09L8K23J00j71n12n99k32j38P26K41M20L6K83k46l86l60
3585c10l44J63n4P49l9L57J74m34l92j06m22K8K84L30L38K42p8N9m93l82k54k88
3607h72L96M05N39M01m47K91o21m64k23J09J31L28J52O45j86j47j54l01m07j58
3627e83J00L95K73K02L65j91m68k79m59q4M04R6M40RM63l23j02m27m66K1p4L85
$$ y = [688, 429, 303, 87, -358, -480, -817, -389, -262, 227, 776, 451, 296, 20, -395, -587, -763, -433, -372, -9, 424, 774, 655, 42, -316, -770, -576, -589, -57, 146, 478, 914, 630, 265, -562, -536, -825, -384, -203, 204, 809, 718, 341, 100, -18, -298, -728, -366, -79, 141, 614, 569, 336, 29, -32, -354, -718, -498, 51, 516, 337, 504, 269, -41, -35, -505, -643, -642, -231, 79, 555, 818, 567, 21, -214, -358, -728, -844, -216, 139, 514, 474, 681, 230, -224, -464, -749, -522, -542, 267, 305, 528, 628, 457, -55, -654, -886, -1024, -298, -57, 363, 399, 682, 436, 50, -310, -654, -491, -545, 204, 165, 522, 696, 262, -130, -236, -658, -630, -346, -16, 322, 564, 486, 545, 52, -330, -584, -872, -476, -71, 468, 869, 422, 713, 92, -372, -595, -486, -355, -27, 125, 770, 584, 437, 283, -18, -425, -583, -483, -88, 185, 387, 752, 561, 93, -186, -645, -729, -325, -229, 211, 220, 683, 360, 258, -169, -635, -614, -688, -303]
3649c03M49M60N9l4m29m43n7j86K17J61J16M51L12k99j56m50k87k66Q6L9N92N82
3671F14p3Kl55j41l66p6k62N90K39M52J98k35l74j88l65l48L04K62O3N94l2j8
3693D85k0m24n07J4j66L77K52K87M21m40m1K4m47j89k22Q3K61M05N28m3J01r08
3715a69k90k8m98N39N39J35K91N1O4o91l39j37L59j12J47K88N25j05J43o50k24
3736a62l38J8J64K81M29J29J66l39j23m00k42j86l6N27jN43J96j48j74m86j26
3757c08k42j5M22L16L08K22j82k02k21o48j81K02L80L41L63J21j0j08o30o1m79
3778f12J38K52M70N4Q4L73n29k73q0p34j37O64P3L94O00k45j99l23l50k57J09
3799e28J77M97M8Q0J15l48J52n86o3l96N17M25Q8L62J57j29m80l94L1m49N14K24
$$ y = [-303, 146, 606, 665, 631, 202, -241, -298, -484, -267, -106, 10, 461, 773, 474, 318, -132, -419, -685, -599, -560, 32, 614, 541, 543, 188, 47, -319, -395, -657, -67, 172, 624, 822, 587, 213, 25, -340, -688, -384, -122, -59, 535, 503, 485, 465, 41, -466, -452, -618, -241, 11, 298, 719, 279, 238, 262, -185, -374, -596, -513, -252, 153, 681, 638, 739, -169, -459, -487, -985, -446, 93, 228, 519, 570, 634, -57, -396, -533, -174, -286, -139, 149, 674, 569, 712, 62, -162, -500, -482, -318, -37, 392, 521, 687, 348, 225, -175, -417, -603, -639, -112, -113, 430, 626, 478, 304, -182, -308, -550, -565, -143, 173, 481, 703, 521, 319, 98, -550, -731, -529, -149, 192, 555, 676, 666, 558, -72, -133, -612, -474, -222, 248, 302, 386, 759, 230, -43, -123, -857, -994, -330, -257, 137, 737, 492, 293, -30, -380, -637, -528, -351, 146, 194, 274, 389, 41, 193, -393, -456, -852, -335, 90, 178, 540, 697, 568, 88, -306, -275, -724, -210, 14]
3821A4L88l26M76N5p12m7m13L28l52N33k0O70J01l51j76l70k14j57O5K03K80L76
3843C51J33Pl08k97l18M6q1M88K83K81Rj39r4n82rj00l40P6M01O64K4l26L0j21
3867G8j62l90j6K84M27L54Rm43J01k49l10j40l59O72L91K68K60j83q2n02p5l99
3889d66m27M86L16M70K26m9j54m65j89l44k60N88L38K77K00k09q2j76n72J23j94
3910e63oK51N32K16r2J31n15J16n88l00L64M17N87l02J51L64p85j07k27m2K35
3931a63j61M04J90J81L0l51l71l73L01j5J72M45o5N66l11l62m02l06J46R9L61
3952A5MN90k40k1n5m57k3n50L39K75K56J05N07m06j38l34n56J95O7J25K68L13
3974B79k5J38m9l49k21k89J83k1L47M92j1j5k66l79k13K24j76j22M92m3M67j39
$$ y = [14, 402, 76, 552, 607, -105, -152, -565, -237, -589, -56, -76, 594, 695, 344, 168, -202, -416, -573, -508, -305, -25, 351, 484, 491, 183, -114, -432, -386, -467, 21, 304, 585, 594, 455, 361, -221, -230, -330, -670, -594, -193, 471, 495, 169, 199, 78, -84, -474, -490, -206, 221, 575, 584, 141, 242, -7, -317, -457, -816, -144, 247, 515, 775, 592, 510, 8, -67, -466, -893, -407, -91, 379, 605, 556, 402, -63, -252, -596, -856, -268, 70, 347, 547, 338, 256, 80, -492, -369, -563, -569, -318, 214, 430, 338, 469, -46, 70, -518, -818, -454, -37, 550, 248, 399, 763, -22, -129, -356, -398, -163, -324, 80, 270, 451, 481, 130, -241, -614, -313, -328, -156, 289, 224, 790, 479, 117, -285, -591, -445, -346, 15, 19, 609, 369, 348, 293, -164, -187, -737, -398, -123, 133, 238, 745, 339, 201, -133, -689, -494, -427, -302, -34, 279, 254, 392, 343, -6, -227, -516, -333, -354, -7, 485, 474, 459, 193, -186, -399, -175, -351, -473, 19, -24, 443, 304]
3996C04J27k76j88l53K3M2L50J69L83l31j40J31o41n6j25K90J76K75P2J35q9k50
4018B8j63k78J9P5K57K34mM34l69p9l23k46L6N8L73N1K38ml21L47l19k84j43j26
4042e09N52K29K16J68l52J54m14k98n06N76k7J19M96R5r3k53j16k23k14M0K06
4063a54M8O97P2l25j70m38j29p1k31L37N97n6J24K68m88k26M7m07N47k71J11K65
4085A47Q7J71J40p44n8j35L3J22K85J78L67q6o32J80j13j18j24r1L31L08K09j03
4107C54q8j02k79k28j04k2K33M07j5L71p3j48m44k9m79M63M20j2j49L46m08J83
4129A97n33k6k56K87J72J51L39K11j16n21J88n66j0J32K70N29k23M11l68j49N0
4150A69l70j4m34M83K45K97l1J2j4k42n65Q1K4j24P61M2m33L98j36j02m61k25
$$ y = [304, 431, 155, -33, -386, -363, -321, 29, 198, 581, 250, 110, 241, -400, -456, -581, -291, -115, 160, 232, 367, 278, 28, -135, -413, -394, -319, -62, 172, 168, 602, 233, 154, -169, -415, -379, -321, 52, 103, 341, 337, 16, 363, 44, -240, -383, -509, 43, 272, 488, 656, 304, 458, 44, -254, -760, -184, -211, -92, 404, 499, 406, 153, 37, -186, -400, -360, -154, -106, 591, 663, 338, 168, -270, -399, -470, -701, -364, 233, 177, 301, 569, 81, -145, -98, -505, 42, -229, -118, 147, 234, 405, 545, -199, -257, -392, -359, -237, 48, 226, 593, 507, -125, 55, -58, -176, -300, -391, -60, 248, 457, 354, 266, 164, -115, -343, -447, -469, -236, 171, 156, 527, 454, 306, -138, -167, -646, -183, 237, 225, 76, 422, 14, 197, -336, -362, -618, -331, -159, -8, 331, 542, 426, -95, 93, -473, -483, -351, -81, 448, 225, 636, 268, 119, 169, -201, -215, -649, -166, 79, 376, 345, 357, 343, 101, -464, -383, -359, -483, 278, 320, -113, 285, 149, 47, -414, -639]
4172f39K80J67M12j00L91l02j29K7l24L8j09J22J02O70k14J03j98m39l97K35M3
4193b61K19K96K02j53j23K51p11J64l02K2J09M29N6J50m4O0j13m53j7j23n4K98
4215i8K29J05J35j90k84N9n43K04R4K9M06J24j8Q9l16j11j02j27K0L66l0L91o5
4238C67j64k94j45M1m25L91K52J93J31J60k16j66k40j33j15J93n8K57K01O8k26
4259G2J34k54j04m57K28K64K48J49J37k4k23kn76k3L4RL23N70l37J06j27j99O5
4282A3p1k54o5M76P0J78R0j47j95m55j28j2Q4M36L9J69J15j25j18j69l71M04j57
4305a93R1K14J35K53p7n12r8k11j26L95J78L32R6j85r5j45m68j00J26K23q4L88
4327A37M10k42O6l43l33j52L94J0o8j6L50K57l89L7k16k05j45N8L73J92j8P6M35
$$ y = [-639, -359, -192, 220, 120, 511, 209, 80, 107, -217, -179, -288, -166, -64, 606, 392, 495, 297, -142, -539, -304, -261, -42, 254, 456, 303, 180, 431, -280, -116, -418, -396, -287, 142, 198, 348, 304, 364, 251, -202, -219, -342, -396, -98, 131, 236, 371, 181, -103, -44, -587, -383, -289, -260, 146, 270, 252, 341, 25, -86, -188, -315, -295, 71, 41, 432, 367, 203, -91, -236, -195, -620, -229, 23, 216, 347, 507, 291, 125, -115, -248, -363, -170, -228, 29, 230, 298, 72, 206, -48, -152, -609, -381, -117, 131, 280, 417, 393, 170, 168, -408, -431, -397, -388, -65, 505, 168, 274, 147, -52, 13, -58, -312, -377, 99, 169, 347, 437, 290, 95, -360, -488, -500, -416, 20, 59, 228, 343, 218, 100, -69, -440, -36, -193, -102, 112, 247, 500, 423, -89, -187, -398, -524, -129, 49, 381, 477, 292, 197, 52, -416, -516, -390, -167, -251, 137, 547, 305, 371, 28, -305, -457, -63, -53, -121, -137, 213, 470, 81, 118, -98, -303, -448, -390, -17, 175, 157, 233, 668]
4350F68m31k68k68P4J07K35l20N65M3p5o0n35m2j75J12N5N15J55R9k06r1m07K1
4373b29k6J42Q3p8L74K0j08k42K14m84Q0k63M26j5L64K03l14o7j95lj74j14J62
4396b44M10j10J10K07k24j59j94MJ0K3M37k42R1L26k11k78J2l63o9J27M54J92
4418C09k65L66m24M2r1Q2m10N7J88K85J6K02l02M9l00j69P9J54j59N56n1P1P3
4441C58l54j71jj83J52l1L87k4J62lk49p2j29j72O2L55O9R4j29k7jr2l15j37J34
4466c17M11j68K09R6L22o38j15O7L3l35L52J23N1N0J03m7l14J65j83j21N0JL19
4489A14L2R0K7m57j28O7o5J47K45Q8J67j30r8q1N6l63rj01L94J3M78k61P3l26
4513b8l42N4j80K07L90K53k40K48K6j49l45j31k28K86L37J8K3m6j15K66l78j51
$$ y = [668, 237, -31, -299, -225, -118, 117, -203, 362, 405, 330, 270, -265, -307, -482, -370, -315, 200, 355, 454, 248, 157, -250, -229, -255, -113, -30, -108, 266, 286, 178, -64, 150, -334, -254, -517, -91, -106, 258, 461, 147, 80, -115, -118, -292, -406, -244, 166, 56, 166, 373, 149, -10, -204, -200, -190, -167, 270, 28, 119, 445, 234, -44, -32, -395, -464, -337, 117, 309, 44, 410, -14, 28, -63, 19, -391, -334, -146, 139, 155, 357, 55, 104, -196, -365, -286, -132, -291, 265, 214, 285, 358, 4, -167, -168, -351, -199, -230, 157, 133, 295, 292, 43, -29, -158, -330, -268, 87, 156, 250, 121, 94, 93, 1, -314, -451, -317, 94, -74, 135, 231, 553, -85, -200, -133, -100, -435, -83, 40, 91, 141, 244, 197, -117, 48, -135, -256, -206, -205, 114, 146, 236, 263, -194, -322, -255, -320, -173, 72, 160, 327, 197, 99, 18, 74, -289, -298, -399, -5, 8, 486, 225, 298, -28, -370, -316, -496, -289, 101, 354, 114, 362, 388, 239, -106, -237, -465, -179, 158, 176, 199, 153, 38, 304, -74, -225]
4535b25k27L4L42p5M27j13K1j35q4n1l22K44r2J80K05L10k80k77M9J2j50q8N0
4558b45L15J92o3j09P3k35j4j24l1j04L33M32j99K64m45r8Pn1j54K75lJ31J36
4581B83q8k02K4q3J0l21N41p5K60l7k39P6p8l76J37j75J30J97L15k14mK1p0J11
4605A43m89J53j26K33N8J61k19L34j04o04M04N9k63K61J56l27L40j34j08j11j00
4626b83O4K14K22o9j3K37l34K2o4j58j6J2K13R0N8K46o1l43l75N3J42np5L00J09
4651A86O3k36j76L64l61o3k2MO55j04j59K12j65k36o3r6k16M92q9j00Q6J54Ol6
4675A00m18K8m0L90L4J82k52K83j06n61J84o7L3J52J19r7K87j11J3k57J35R4l07
4698a82L15j17L15J71k17j91J13k12j24j42p8M22K56j5m50M24l48j43Q4j24P4
$$ y = [-225, -452, -418, -76, -151, 276, 163, 184, 49, -35, -86, -408, -164, -256, -76, 129, 439, 159, -118, -69, -57, -207, -295, -245, 70, 262, 199, 90, 163, -72, -86, -210, -241, -345, -12, 420, 221, 485, 40, -58, -51, -102, -256, 19, 16, 147, 283, 195, -7, 17, -66, -56, -377, 164, 89, 349, 312, 73, 149, 71, -305, -168, -343, -213, -16, 299, 85, 81, 102, 32, 143, -346, -193, -319, -86, -28, 133, -86, 248, 144, -460, -56, 3, -260, 1, 157, -170, 170, 36, -72, -183, -283, -219, -5, 217, 148, 135, 372, 38, 60, -4, -162, -178, -166, 47, 137, 195, 441, 380, 37, -338, -285, -143, -148, -223, 77, 186, 249, 13, -163, 201, -160, -223, -245, -241, 414, 310, 151, 363, 198, -38, -101, -197, -413, 79, -10, -110, -24, 130, 136, 100, -318, -290, -330, 60, 94, 276, 24, 307, 201, -360, -176, -243, -210, -58, 61, -36, 251, 140, 153, -104, 31, 125, -182, 133, 16, 331, 502, 285, 94, 207, -5, -129, -271, -349, 73, 329, 314, -136, 288, -60, -203, -119, -243, -169]
4719a69P7O6P7J15j06j7j09j71j52J15M57r3J10M0k5P6l97J33k04L29k04n2L83
4742B79k1J75q0k01m3l46N7J96k4lM22j99Q9m88k5O6j26K57j82K29M3J31m1M6
4766B11m90N7K46j43p4J42K66m7k65J30j99J02k05N0K96O9R0R1l08J76m67j28
4788d00lM73l5K86o1J05l23L3k33K9m6j35L49J14J97j50M6k95p2O8j92O01n85
4811b29M95K3J4l21R6j30o3j56RK62R0R2k89K64j48N7M8k85L1L49k91K3P1k35
4835b23M67l36j8J45j95K56j63R2J90k44j62K77k88J23Q6k94M26m1K02q4j14k55
4857a53M9r4j20M35l3kK18j61j99j20J94J6k61k73L66K33Q5j96j49J19M8j43m8
4880a89j04K25P4k0J03J35j48k75n3k36L52K2O7K84m37L08R6j92k65N9N5j23N61
$$ y = [-169, -92, -26, 51, 166, 60, 43, -66, -237, -389, -274, 183, 90, 200, 240, 215, 291, -106, 27, -177, 152, -52, -104, 279, 258, 433, 353, 152, 109, -237, -180, 16, -8, -11, 411, 212, 301, -187, -212, -146, -272, -15, -197, 32, 75, 206, 165, 211, -279, -222, 24, -119, -193, -51, 215, 168, -97, 33, -166, -64, -269, -219, 77, 146, 236, 327, 19, 195, -272, -400, -403, 70, 35, 321, 260, 365, 42, 75, -158, -129, -175, -310, 39, 153, 350, 200, 246, -49, -121, -53, -245, 356, -229, 266, 289, 303, -18, 78, -52, -115, -271, -262, 0, 90, 182, -107, 157, 9, 66, 114, -171, -140, 209, -82, -59, 12, -223, 244, -92, -110, 35, -160, 96, -67, 25, 215, -29, -191, 86, -202, -79, 7, -287, 139, 98, 300, 216, 102, -153, -104, -198, -318, 117, 84, 82, 300, 139, -60, -180, 14, 30, -231, -504, -138, 95, 180, -16, -165, -46, 2, -141, -189, -293, -68, 6, -14, 89, 224, 76, -199, -252, -488, -136, -114, -47, 237, -200, 108, 204, 12, -253, -194, -139, -262, 299]
4903B99o6j08K44m06J05k64j4K77n4m3J01J7j15n6k1P1j4n6J01J3k2M18j18k62
4927B7j26l64L67J03j03L7J43R0m59J41oL3j81L04k39J56J09j59K37qm0J59k19
4950Bk73K71K42k47K32K01m24k5K08m16K03J9J81k58L60q5j18m39K42nj7K82l34
4973a98L36j33Oj17K60j39m75K78O5J99N9M1j85J87k74L2R9k20R3M00k68N8K32
4996C36M9m92K1J33l07J17R1k11L51K01K5m19J00J7j46K06q8J62q0K4j2j74N2
5019d4j17J31N4j33L1K49M3k43k00QK26n9L82m32J69k3J72r7k64J90j59r7j29
5042c42K65R2o0J09j6J07l65R4K00l25k0M41j60K50k65j32J72l11J86qJ7r6J09
5065e8L5K79j95p8k50N63n30L66j73L14p0J5l51K34r9j76Q1q0J01J08J25n5j13
$$ y = [299, 233, 125, 369, -37, 68, -196, -210, 67, 13, -30, 71, 88, -27, -83, -104, -33, -47, -103, -2, 11, -11, 407, 289, 27, -99, -463, -96, 7, -96, -59, 84, 174, -285, -144, -150, -117, -298, 6, -233, -77, 32, -127, 110, 102, 62, 221, 2, -271, 0, 242, -5, 227, 428, 4, -21, 187, -229, -26, -7, 174, -84, 276, 191, 73, -366, -124, -129, -146, 136, -198, 138, 5, 11, -106, 154, 15, -460, -182, -117, 82, 141, 182, -3, 184, -90, -58, 41, -179, -86, 314, 46, 104, 336, 385, -107, -86, 47, -260, -143, -52, -263, 88, 289, 314, -105, -5, 12, -134, 72, -16, 146, 66, 90, 78, -96, -44, -161, -30, 24, -109, -78, 171, 214, -29, -229, -221, 5, -54, 328, -104, 65, 42, 214, 117, -147, 43, -116, -213, -342, -77, 15, -45, 64, 48, 155, -210, -116, 84, -241, -261, 180, 20, 270, 5, -127, 45, -266, -80, -88, -71, -167, -58, -23, 256, 61, -17, -267, 296, -234, 132, -41, 273, 203, 218, -133, 101, 2, -174, -93, -173, -72, 36, 161, 106, -7]
5088gj97J62J37j02j17L05o6n9L47l13O6M1j72l10J85L22j07L21m34J88m50L49
5110H9l84K17M8K01j02q3R5L09m58j20O3j63J59k3J58r4J09k9l3r6j07K7M94k05
5134G2J00Jp5K34j16n37L05K33l08K4J03q7L30l24L04l93K83l81J77R7J00j55
5156a3J65N3l98M19l48Q2l4o3L35p3r3K90j61l57K16r5K94l45L44p0j87J00J34
5179A95m4j6j51j7j97M9L88k68K03k39Lj60J05J78q5K67p6J13n3l56L68j49O1
5202A19Q6k30K29j40J25K2o9j47j34J67l83J78O7O6J27P9k46J20k63J47J1L57
5224B88m31K4K01k82M68m53Q8J35j84K34k27K01L37l83M1k4j52J40j99r6K90r8
5246h2L6J70oL9m09L18qK31o07J4M99l05j62K45K21l01L45j14r9k81M50q7j75
$$ y = [-7, -204, -42, 95, -7, -124, 181, 115, 56, 403, 90, 156, 197, 25, -285, -100, 222, 115, 436, 2, 190, -260, 89, -295, -78, -30, 171, 69, -14, 81, 390, -68, -188, -125, -288, -129, -152, 6, -88, 21, -8, -41, -137, -244, -217, 277, 72, 172, 173, 98, 332, 216, -321, -16, 217, -91, -67, 36, -51, 279, -45, 259, -134, 149, -232, -55, 42, 142, -13, 152, 205, -193, 226, -122, -40, -74, -137, 198, 125, 32, 322, 161, -196, 20, -75, 219, -126, 218, 148, -39, 61, 195, 151, 135, -16, -33, -230, -181, 207, -61, 142, -97, -94, -254, -149, 29, -56, 211, 135, 248, 195, -161, 207, 58, 119, 205, -25, 204, 64, 189, 211, 142, -5, -139, 28, -355, -177, -110, -44, 83, 162, -84, 36, -227, -80, -69, 288, -143, -119, 82, -200, 268, -185, -97, 38, -146, 88, -139, 62, 399, 16, 57, 33, -119, 21, -178, -274, 16, -82, -46, 124, 118, 157, -252, 66, 58, 289, -318, -304, 195, -110, -272, -27, 194, -107, 238, 124, 25, -256, 194, 107, -68]
5269f8J70j76J83l17N3j20N0K56M3k34R6J79k18L31l51m6L75o4n0L7j68j5P0j58
5293a42K13l1n4RQJ45k0o2J4k07K4J66j8k9l0N9K54j81j94O6k2Q2Ol25K11K32
5319A74j10k6j22j09K9N0K32j57K91k11R2r9j25r3K96o4K9j72m4J39k3J41j10
5342Hk27o4R7L27j91J57K6l77K54J80k3m82O26n28p6J69K08j53O4J44k01J76J37
5365B51k03l3O4k28OK96m32J54QK43k24qk1L51M5m26M6L38k78J0k60K85P8M2J8
5390A22r9K12k87Oq4j08J87J28K7J04j70K02k65j32K20l11L74O5k54m3L55n41
5412b92M49k65M7J74Q6l78R7K48k87R1n1J39N7k50j6MK78J11k78K32k20L7o4l6
5436h7K09k3J18j69k06L69j54j64j2R5M2J2O5l48K00j08Q0K49j89K54k04J29P4
$$ y = [-68, 102, -74, 109, -208, -155, -275, -225, 31, 74, -160, -64, 115, -103, 228, -123, -169, 206, 142, 92, 129, -39, -54, 16, -142, 71, 40, -14, -5, 3, 148, 128, 66, 80, -127, -103, 63, 45, 16, -14, 45, 299, 118, -76, -10, -32, 50, 56, -269, -58, 174, 64, 38, -84, -193, -164, -114, 118, -39, 252, 41, 133, 34, -91, -184, 112, 48, 77, -95, -139, 0, -23, 118, 8, -219, -283, -186, 141, -50, 107, 133, -244, 10, 190, 167, -315, 311, -217, -293, -124, 84, -69, -5, 139, -62, 114, 251, 48, 15, 79, -149, -143, 153, -279, -125, -117, 126, -98, -106, -127, 224, 269, -157, -111, 227, -51, -41, -301, -16, 62, 104, 122, 23, 235, -52, -46, -130, -238, -51, 77, 104, 208, 38, 240, -25, -157, 63, -248, 126, 191, -63, -106, 249, -292, 157, -108, -61, 113, 199, -179, -82, 166, -121, -30, -81, 58, 115, -135, -151, -147, 131, 242, -36, 196, -24, 13, -51, -87, 122, 99, 217, 48, -158, 211, 57, -107, -119, -24, 18, 30, 95, -253, -53, -161, -81, 168, -21, 233, 29, 158, 232]
5459B32k52R8j17J6K30j65j04K56k37P3K73k93Mr8J39j82O0M6o7K13J2m01K08
5482e6J39J18o0j35N1k30K30j39L15r9j35j05j6K89k96N1L30k68o1J6k0r1P9J21
5506B8M1m2j29K76m69K57j38j1J40M84m41P3P6j65j1J25P6m15P2P4Q9K76K02l17
5530A51r1M6j18K25j05j65N0J5L7J16k08Q3j96j56K72L21l4k64J47J31l29N2o2
5553h2K06o8q4MpO5j17L81l74K18p7j73J40K6j66M7q7M10j11l01L47j17O2j99
5577e7K72k20P9k13L8P6P8j27K66K90l57n4R7j73p0J58k45J93o9J97K3m49M97
5600B30m44K13j83K6J90j01L56m02K3o8L29o3j69J84J14l79K50L9l7k9k43J56
5622hj24L41m78K87j84K49l24R1L01k40J85j74j34K41n9R0j82J00m28M09M0P8
$$ y = [232, -20, 78, -39, -23, 207, 42, -62, 194, -43, 30, 303, 10, 14, -84, 55, -127, -67, -21, -88, 125, 137, -264, -56, 83, 201, 141, 6, 57, -173, 57, -82, 233, 134, -1, -106, -122, 167, -129, -78, 252, -16, -77, -61, -81, -172, -93, 28, 69, 27, -102, 174, -295, -38, -176, -187, -47, 437, -4, 69, 145, -20, -31, 94, 170, -245, -173, -99, -10, 266, 468, 151, 60, 106, -12, 213, 108, -57, -7, 8, 45, 161, -47, 36, -160, -316, -44, 277, 243, -21, 126, 257, -72, -20, -82, 124, 56, -28, -24, -31, 34, -83, 298, -76, 142, 65, -108, 32, 58, -108, -61, -148, 262, 151, -150, 197, 80, 142, -57, 215, -5, 74, -139, -101, -25, 53, -74, 192, 482, 125, 71, 168, -5, -75, 83, -162, 31, -38, 159, 182, -267, 230, -214, -1, -184, -158, 32, -69, 287, -115, -92, -160, 169, 106, -63, 121, 235, -144, 106, 145, 108, 79, -164, -8, -132, 209, -269, 18, -166, 83, -241, -150, 151, -89, 96, -78, -212, 29, -30, 60, -122, -22, -450, -41, -1, 77]
5644G7j34j7J80p2n1L3p3J4K24j47l52L70p5K81k08k70J31L74j48J6j90J43k09
5667a03J78j2J83j91Q0J03j95k84M37j07r0q6J04q5j58M3L17p7m45N49L2K6k75
5690e6J74k86K68j83m6l8%R3J56J10k19J47k83L72j66Nk0k03N2m8R7J35o6k24
5714b29L82l17n5L04J71j70j07R0K4k81J21P7R5K3k60J61j9J76j20m29J40J04
5736a19L12k35j40L03j92L50m19J38o8k48j2L20O8r0k4J89j26L5J6j79l4K47L8
5759A30j38J14j39l3J25j14Q5l0Ol22K15K34j68k9M8J38k41O8K5O7r5N8Q8l80
5783b88J50O5R3J24j68J12p4j0q1K71P1k24j49K69j16N3J22m71K30J41m01J84
5805i7l9K23j25j59J12rM9K51l1l41J83m0k07R7p9K1J49ll8l8K72k81M69l48r5
$$ y = [77, -57, -74, 106, 34, -17, 16, -57, -43, 181, 34, -318, 52, -23, 258, 50, -220, -89, 285, 137, 153, -37, 106, -103, 75, 63, 246, 55, 135, 238, 43, -241, 196, 89, -1, -87, 17, -68, -226, -183, 134, 57, -388, 161, 193, 219, -56, 118, -168, 100, -83, -129, -167, -167, -74, 82, 192, -27, 120, -163, 209, 43, 48, 28, -175, -123, -171, -74, 61, -5, -229, 153, -164, -219, 85, 256, 86, -21, 69, 93, -188, -67, 10, 105, 128, -132, 29, 10, 186, 66, -363, -223, -119, 193, -42, -182, 121, -71, 279, -140, -2, -70, -318, -330, -10, 58, -32, -56, 133, 7, 42, 58, -121, -155, 92, 130, -8, 106, -33, -66, 59, -55, 30, 0, 6, -316, -101, 133, -35, -64, -16, 122, -119, -51, -26, 41, -54, 4, 92, -288, -138, -73, 20, 144, -24, 88, 14, 4, -77, 194, 265, 41, -108, 161, 45, 98, 220, -251, -21, 120, -281, -97, -136, 87, -38, -197, -85, -94, -45, 206, 175, -166, 17, -23, -230, -133, -212, -191, -42, -45, -83, -121, 151, -130, 339, -9, -104]
5830a04K76J91m88K96O1j46j76p6J47K10j73j08p2L04l01N1j4K00K0O3M9k05j25
5853a20J3K38k94K31o0J71k12K57j27L9r2k41J20J75K2J4N7r9r4Q9j61j82P0J01
5877h5j55K37M3M4L9L0k3q6p2k35J60J28j5R8K56m01r2j35O05k20k85K6J83j00
5901e5J34RQ7j65j46K99k83J58l7J88k02K70j79K6j48Ml4j20j6K30n5O7K12j70
5925G4J30l72K71O3l47L3J28J3K48j70j87J55m1K2J80k35j20L48qN8j09k91O3
5948i4J7M6j0P5j97p1L37k57jnJ59Jk2K9O7o2J26k15Q9P6k80L72j24P1k53J01
5974b5l6N8l6k47L19L5K05l30r2L47r1l86K17R0k03J23Q3P5j18R3p3p7l5K00n3
5999D3J72q0j52O3K8K29k12n9Q4j84N7K0K1j8L1J30nl16P1J65k30J79O6l90Q2
$$ y = [-104, 172, 363, -125, 171, 232, 86, -90, -166, -19, 191, 18, -90, -162, 142, -159, -108, -122, 78, 98, 161, 210, 5, -120, -107, 131, -163, 68, 8, 179, -33, 224, 97, 136, 44, -197, -77, 98, 120, 134, 191, 92, -2, 87, -74, -256, -186, -85, -240, -3, 40, 84, 123, 153, 130, 44, -28, -263, -103, 25, 10, 108, 364, -37, -129, -264, 341, 121, -164, -138, 45, -55, 79, 88, 175, 10, -136, 163, -120, 38, 1, 189, -13, 257, 78, 104, -44, -40, -74, -194, -210, 20, -35, 32, 244, 74, 204, -168, 103, 166, -181, -148, -20, -7, 241, 71, -116, 39, -2, 20, 200, -35, -155, 193, 185, 243, 134, -157, -94, -77, -31, -41, 34, -163, -234, 103, -154, -155, -160, -1, 0, -22, 7, 74, 12, 138, -77, 12, 88, -192, 180, 56, 127, -126, -25, -61, -3, -39, -286, 33, 68, 273, -57, -149, 198, 107, -279, -62, 28, -175, -52, 31, 106, -12, 81, 8, -69, -104, 96, 43, 215, 135, -17, 46, 74, 303, 91, 32, 116, -68, -11, 9, 30, 12, 43, 173, 168, -148, -77, 88, -142, 37, 103, -287, -205]
6024b05J2L63j49j6K8p8j10L21j9J2p8J55k19K82l37J1J5J39j40J36j02j42J77
6047E6Lj16m22O71m21N24k29J59j94j42K44j95J11J48j04j20J37N7J38q8j63j94
6069a40r4J47J41n9k58M1j04L35J87r1l35N40L4k26P5k44N2Kk3o4p7r0K39M0j32
6094a04L03r4k79J10k3Kl9J82K48l07K1j1n5k33K89M8j64R1K56j74j62J46l10
6117b59L24J86k35jr1L68l17J19l5p1k09MK58j9j38K43j6j08p4M2P1O2P1j57o6
6142d8J32j99l3J17K07j46K00p6k51j37K24k13K45k07M64l76kK2J56m0J32j68
6164CK04k64M8K5L6n8K28k85m9J70k09J56P8N5n3o5J0j12R9J98Q5l75J73j31o0
6189i3L70m51M02o6o3k55J7N5L01l39K87j20j9k21J82J34j03K3O9j66j80L5K13
$$ y = [-205, -193, 170, 21, 5, 33, -45, -155, 166, 147, 159, 81, 236, 17, 299, -38, -27, -12, 127, -13, 123, 21, -121, 56, 59, -57, -479, 192, -229, 295, 66, 225, 31, -111, 133, -62, 49, 197, 93, -27, 110, 167, 305, 217, 54, -140, -234, -87, 54, -5, -263, -222, -326, 9, 196, 105, -230, 310, 344, 118, 193, -51, 1, 3, -20, -84, -161, -251, -12, 28, -104, 199, 105, -174, -64, -87, -85, -124, 58, 306, -1, 20, 9, -46, -279, 10, 58, -106, -15, 241, 67, -95, 51, -259, 65, 251, 16, 15, -76, 292, -25, 94, 59, -12, -221, -217, 41, 22, -116, 127, 111, 3, -71, -29, 42, 104, 175, 18, -48, 84, -115, -148, -31, 176, 30, 230, 154, -97, -234, -10, -223, 22, -185, 279, -97, -99, -77, 79, 39, 171, 3, 207, -57, -9, 16, 52, -6, 222, -63, -112, 58, -151, 5, 83, 138, 85, 20, 30, -82, 17, 215, 300, -75, 98, -33, -93, 277, -174, 228, 162, 99, -156, -139, -84, 217, -122, 165, 45, 26, -195, -13, 121, 18, 41, 110, -56, -236, -201, 12]
6212A2l8r7J10P6n0K1m5KK0K7k82m5J14K73k12J17l41L96r8qj61M9J47J4L2O4
6238I7l32L25k67r0o0K54lP8P4o2K67m57Q4j69K25K2J15l4R8k57L25m13p9K55
6262dL3K4j96K25j73q2P8N2J25k95K40K07k76o5j96M22k35o8J00n3J95m1J26p9
6286F4j57J61l0J1p5J8j01K20P7k51O4M2M0l97j17M25l5J53p4l2PM4k53OJ67R1
6312F8m3M5k12J58q4o8K97J9k02m3q7J91o3j68J59j15L37j11j59J3K08j96j4J79
6336A09l9o5j22P9o4k35J92L45j48Q6j98J06k93J07j08K66J91o7k19J2J59p7N0
6359F7k43K72j72j7K31k62K36J32J0l17K39k50k6j32K99j04o2m0M85k41l21M46
6381B30l48L95m21K36o1n8P8k42N71m99L8J81r3K64l5k72j57J70M9j26o4M1m8
$$ y = [12, -26, -123, -13, 63, 13, 34, -11, -9, 11, 38, -244, -289, -175, 98, -114, 3, -338, 58, -40, -48, -209, -160, -13, 1, 33, 97, -235, 90, -177, -267, -327, -73, -76, 2, 76, 14, 281, -176, -92, -261, -36, -14, 101, 67, 165, -92, 233, -180, -259, -4, 29, 53, -143, 82, -91, -173, -95, -43, 82, -213, 27, 234, -42, -107, -303, 119, -116, -184, -84, -137, 58, 17, 143, 64, -93, 68, 38, 49, -26, -8, -109, 111, 188, -63, 1, 43, 83, -314, -431, -6, -41, 112, 38, 6, 13, 57, -196, -190, -23, 68, 25, 70, -142, 16, -68, -136, 161, 180, -22, -65, -152, 39, -24, -192, -33, -148, 189, 78, -81, -68, 140, -56, -70, 109, 70, 5, -117, -38, -102, -337, -145, 200, 52, 138, -60, 46, -247, -140, -248, 18, 209, 142, -77, -65, 94, 17, 67, -176, 96, -76, -93, 138, -124, 112, 244, 254, -63, 176, -74, -100, -232, 67, -37, -99, -139, 346, 105, -216, 230, -118, 277, -144, 92, 31, -27, 51, -191, 380, -119, -81, 100, 7, 271, 236, -36, -193, -23, 26, -100, -164, -123, -171]
6404a71K18J1N4l03K6J11j40K96J51l85K21j62J74k07J48r1K7j08P1J03J41r1
6426I4n9KJ73l48N26k36k46J16j89L12Rl38l3L35j76P5n0j02L26m77J29L28j16
6449E5Q2m50L73k81L29k05L51r6j54l05N22k27J75k8k18P6L08l64N3l2K51l18
6471a03O4P2k06K2L36m3K1J53k93r4J58q4P0j53K82J55l87o7K08j01R8l4j36K7
6495c5J3J99j62j66M0R8j1J03Q4j30q8J8J44p1r4j65Q7J64k30L35p4p9J3j37L8
6520a06r1K21k57K89r3M1J17J4J7J08n48L34j74K23k00L06m5j16J2j97k1K01k43
6543b08K69j52noM14n71K63K89l81P2K71q9J60l13j7L15j50J47k76j68r9J43r4
6566a86L61k42k11J9M09k69K74k34J18J8P4N3k77K46l26L75j60J54o9j50K73m98
$$ y = [-171, 47, 58, 112, -191, -165, -54, -194, 102, 253, -132, 89, -73, 101, -106, 42, -49, -22, -130, -59, 44, 185, 94, 35, 37, 210, -138, 388, 152, -94, 22, -167, 145, 154, -184, -217, 118, -58, 17, -33, -135, 191, -286, -157, 171, 55, 137, -313, 60, -221, 108, -97, 254, 158, 4, -301, 221, -6, 169, 141, -77, -1, 307, -57, -4, -36, 215, -103, -39, 33, -173, -151, 185, 142, 163, 316, 23, -71, 87, 3, 73, -80, 202, 357, -30, -97, 111, 10, 108, 74, -62, -35, -22, 177, 15, -151, -111, -13, -24, 79, 163, 33, -55, -37, 107, 36, -58, -223, -136, 28, -202, 133, 59, -20, -7, -144, -106, -197, 24, -233, 56, -37, 4, 121, 135, 152, 260, -288, 46, -128, 95, -105, 201, 156, 40, 52, -145, -166, 35, -208, 61, -91, -96, -102, 312, -259, 4, 293, -88, -16, 255, 166, 326, 13, -4, 311, 161, 308, 32, -136, -235, -92, -186, 175, -67, -278, -259, 150, -119, 155, -79, 39, 57, 131, 184, -93, 153, -173, 202, 42, 196, 127, -23, 250, -248]
6588b48J81L48k94O6J5j62J04k03J99L0j5j9Mo5k09Q3L47j63j9K28l63M38m42
6611a59R7oR7O5k25L58J7LMK6L9l75J10p7K2J40j06m1J0k03K55n2l7m8K53k09
6637d2k4K81k73L9m3L18k72j58j1J50P1l6O8k69K06k58K44K48l01Q4o4Q1J92l05
6661g4K3O0K60k75J01Ql8m33L61%k19K20n0J70k00p5K94j22m8l9J78MN1k52K17
6686A22L2o1N2j67j5K80k11N9J3m60L66K5J42j32nJ91j40k85L1K40l32Q3K71r9
6710@k6qJ55l08M11l76L85o7j72K75k81j83O3J66k14M14l69j31Q8J79O1K1j13
6733c0J80k59R2J24k05m7Q2J49O6j01J96m87J03J93K9j19M3r5J67k41J73j90L22
6756A45q3r0j2K39k79R6k20j9L71m33M04l30N8L00q8n4o0K07k18j40L23L0k40
$$ y = [-248, -67, 281, -13, 53, 68, -94, 10, -193, 6, 36, 21, 2, 6, -59, -268, -185, 162, -1, -20, 208, -155, 283, -159, -62, -68, 29, 94, -131, 227, 244, 247, 251, 277, 316, -59, 51, -26, -4, 136, 30, -11, -1, -204, 51, -1, -38, -86, 167, -42, -66, 215, -58, -19, -62, 256, -16, -174, -185, -35, 36, 0, 68, -201, 5, -253, -9, 239, -62, 22, -42, 39, 231, -74, -51, 9, 269, -6, 95, 103, 65, -368, -7, -7, -226, -6, -56, 114, -86, -161, 133, 11, -37, -76, 102, 106, 157, -95, 122, 154, 93, 145, -22, -37, 243, 32, 91, 104, -356, 10, 35, 177, 45, 40, 231, 91, -194, -163, 77, -255, -172, 99, 0, -26, -34, 121, -187, 224, -152, 233, 166, -6, 269, -12, -195, -132, 34, -180, 234, -135, -266, -178, 1, 62, 83, -30, 150, -109, -17, 107, -98, -145, -63, 86, 152, 51, 247, -240, -137, 56, 85, -34, 9, -86, 81, -160, 13, -177, 145, 62, -28, -40, 199, -80, 16, -204, -223, 148, -285, 119, -211, -153, 147, 59, 5, -55, 152, -66, -206, 117, 147, -93]
6779i3J65K7j0j45p7K59R6l12J57k89L23nk21K56l43nJ61K76M3k31L1k20R7k40
6803c00L99n9k81M49j29P5J6j0j57O3j50j09K35j72K08j93R2k6K07j07j12K07
6825A46o1k08K52K31m52RL5L23P2k58O2MK9l10J68M0O1k59K01j60L1J60l30L45
6849A31k36J29J20K3q5k34K52m7J43k84K09K38n17J63N2j41Q7p4M4J9P1j09J0
6872c6r3J71j09K52k26o3L9l19O79l23l2K00l23L9K99o3k05k81L27J38q5k50L53
6895H9%l68J05P4L96m72L7J89j25q2K38k49J35K7J59k24J72n3L4k01K1K56k28
6918g0J03J00oRk94K90j2k23m7M9J88o7p2Pl4rJ85mp5k4q1jJ50k28L48k34M4k07
6946b15K3J13M8p1O7K04j07J95o4l78J46k74L02j3m1Q6M56n10O5k47K82J87k42
$$ y = [-93, 72, 99, 89, -56, -133, 126, 222, -90, 67, -222, 101, 96, -125, 131, -212, -217, -56, 220, 263, 32, 63, -157, -60, -300, 99, 40, -241, 208, 79, 154, 170, 160, 3, 66, -84, -193, 42, -130, 78, -115, -23, -49, 158, 51, -61, 146, 85, -123, 129, 360, -92, -83, -48, 275, 347, 89, 151, 155, 184, -126, 42, 82, 143, -116, 85, -75, -44, 116, -214, 131, -105, 24, 144, 167, 82, -152, 100, 53, 196, -88, 121, 359, -158, 5, 57, -84, 3, -71, -27, -8, 63, -46, -36, -129, 42, -67, 185, -41, -104, -65, -384, 295, -28, -60, 140, -183, -144, 155, 92, -113, -394, -67, 71, -14, -264, 89, 89, -279, -174, -100, 296, -176, -139, 50, -75, -157, 81, -168, -33, -6, 153, -71, 101, 48, 82, -119, -98, 158, -70, 33, 133, 127, 136, -158, 132, 120, -103, -150, -101, 87, 20, -52, -45, -79, -88, 97, 93, 18, -6, -87, -88, 62, -166, 182, -52, -8, -215, -192, -79, -31, -102, -35, 169, 62, 257, 193, -185, -39, -313, -11, -24, -65, 21, 477, -33, 32, -215, 67, 254, 12]
6969A2M7j28o4k9L32l6j98N5K78l37L33m30K03J84j86l15K21J9m3J01r0O4M5o
6993C2q3k8J8j7P4k6J0P2j32Q9O4k31K98q2j70K90o9k36Q1k45J70J29J07L4K8
7018A77M5j2m5m9q4k31K14k93O8J34J30J44q5k6j27PK47j89j06K3L7R6k7n5M9
7043D2j30J63n0J03J55l38J79j22QR4p3o2m6J32K3kk8o1r8M6M1j75L84j16J57
7068B26l06j25L99J0j63j66K80k91L14j32k46j59M68l45J21J88q6M5M1j41N1J48
7090A31j01j72J14J79L1r0Kk6p0o9K4j02K05j83J67j58jlJ6J21k2j71K44J39j90
7115A5m0J64k06L15j86l7JP3K69k52l16r0J85j05M04k55J04r7k3K74k30k75L77
7138F9n0q7l5L0J64o0J60K30l86j69J24L32k05p0K0N9J08k32q7J70L1k42J06Q3
$$ y = [12, 59, -69, -133, -162, 170, 134, -64, -9, 269, -68, 265, -165, 38, 222, 36, -279, -58, -39, -82, 19, -71, -7, 38, 32, -51, -79, -61, -78, -4, -30, -20, 52, -80, 9, 73, -158, 140, 58, -112, 178, 109, -127, -46, -291, -121, 8, 115, 149, 177, 222, 210, 165, 116, 32, -199, 15, -278, -210, -76, 54, 198, 113, 87, -40, -33, 214, 25, -81, -58, -21, 75, 48, -7, 42, -88, 75, 25, 128, 283, -55, 124, 2, 10, 104, 31, -31, -77, 55, 78, 76, 48, -13, -111, -65, -24, -199, 185, 69, 226, -80, -205, 194, 204, 41, -125, 155, -136, 178, 46, -200, -359, 109, -236, -115, 73, -13, 32, 73, -68, -17, 131, 30, -142, -28, 151, 182, 92, 94, 68, -2, -71, -47, -149, 56, -127, 40, -118, -119, -122, -106, 15, -7, -178, 66, 205, 15, -25, 139, -67, 248, 62, 25, 26, 99, 368, 116, -200, -290, -105, -210, 194, -61, 43, -54, -77, 197, -33, -308, 69, 19, -68, -103, -73, 91, 31, 191, 421, 35, -134, -10, 322, 117, 47, 67, 126, 234, 2, -85, 85, 116, -126, -20, 63]
7162F3p9L1R9N6j34J62p7k56J97Q4r0J55r2J42M0m83K00o7n1kM7j14K58j81L21
7187B29k83K17l40j88M24l18M49k46j3Q8L19n16K11l0k24L01j32J13J27k31R1
7208D8R2J06l75J01O4P5K3l39M1K64j26j70J16L04j63K40k72M6j41N7J64K56k24
7231A87j99O1oJ19j08k33j9L51j57J21j74k59M41mn3J32j55J53r9k53J15P3m7
7254a3m9O4J21o6l3L0k42J34n6J04J8j98K76k12J54j18J1j03J19J05J70K13q47
7277d18O29j20j31k54o3M67r1J71j34q9j02M2O3K48l32j81L73k36K44j41mk1K9
7300e1l8o4Q4P9N9j84K04J55l52O8n1J66k60L22o3k14L20k53R1n1j64L9P1p0J52
7325eo9J63l7o3j10J96j50J13q0m7j82L38M0J47l49o2O8n7J15J00n5j57K03k34
$$ y = [63, -16, 15, 114, 170, 36, 198, 121, -135, 62, 146, 56, 211, 119, 261, 301, -182, 18, -49, -100, -102, -55, -169, 89, -92, 229, -54, 163, -177, -365, 59, -259, 190, -56, -69, 19, 338, -178, 33, 3, -221, 80, -52, 61, 188, -43, 48, 140, 246, -129, -28, 36, 111, 134, -205, -164, 100, -26, -196, -80, 224, 61, 301, 29, 75, -66, -9, 155, 411, 187, -12, 49, 43, 162, 54, -179, -198, 153, -4, 117, -57, -316, 125, 121, 68, 200, 45, 198, 99, -154, -39, 34, -13, -62, 2, 123, 57, 24, 54, -188, -54, -110, -6, 12, -186, 90, -122, 32, -86, -75, -178, -59, 46, 216, 429, -418, 211, 91, -40, -294, -357, 110, 19, 190, 56, -33, -135, -93, -30, 218, -114, -295, 78, -158, 86, -55, -59, -80, -51, -89, -153, -69, 10, 69, -115, 89, 244, -108, -40, -91, 75, -185, 137, 74, -140, 180, -73, 18, -33, -197, -158, -87, -157, -5, -74, 89, 52, -11, -121, 75, -75, 38, -42, -89, -271, 67, 107, 254, -95, -157, -89, -146, -31, 69, 14, -143, 60, -174]
7349a74oL14P1j97M5j7p9J38l0J03l85N29m33rK55j08j7o5J82J8k25k16L32j78
7373a52J84J50o0l03K69N7r3K53k98O7J5J60k85j03L47n65O05j53k61J04K14q2
7395G0k79L2K35R3k23N2J31j27J48J42l52L17n36K77j49P5L46m81Q1K29j92j6
7417a27L54K21o51K0J11J27k58M24k18R8J6k79K55l0j78L31l68K26j81O0L8j6
7439b5k1Q6K2k49L58l18j06N51k08j83K95j65l15M96k12m6J99k06J28l1j49j06
7461b05K21N3j8j37K01j00r6J13m5J91l25J10J04p3R0J41k40l57L37Q0l89L46
7483BK14k61K74l08J08j07o7K24Q6l73K2J53m0K30l18J68N1j08n8J55j03k24K39
7506d1P7J44j95l01K68M05j62L5j92j6k7j22P4P3k62J60R1j27R0K01k34L84l39
$$ y = [-174, -180, 134, 205, 8, 53, 36, -43, 95, 65, 168, -217, 312, -121, -130, 125, 17, 0, -65, 117, 135, -90, -306, 26, -152, 32, 182, 122, -181, 88, 145, 52, 305, 7, 74, 89, 249, -36, -139, 208, -357, 248, 95, -166, -62, 152, 70, -209, -177, 58, 151, -72, -20, 111, -16, 132, 274, -78, 239, -297, -20, -169, -94, 252, -229, -148, 81, -111, -127, 227, 448, -203, -183, -72, 55, -203, 221, 3, 101, 117, -162, 93, 63, -115, 216, -152, 74, -107, -47, -9, -25, -46, 40, 62, -187, 171, -147, -253, 298, 90, -93, 202, 37, -278, 218, 6, -40, 159, -47, 81, 50, -99, -205, 16, 69, 51, -86, 115, 15, -81, 32, -13, 178, -147, -37, 67, -6, 84, 225, -15, -372, -35, 45, -344, 2, 216, -45, 229, -79, 29, -78, -145, 79, 165, -208, -186, -33, -73, 157, -161, 7, 58, -50, -108, 47, -56, -280, -41, 36, 180, -15, -316, -48, 357, 195, 230, 38, 22, -5, -127, -53, 20, -242, -82, 9, -118, -28, 173, -61, 323, -16]
7529a6j53M25m94K19j56L63mm56L71q2J27l40J65K23j07O4j7o2o6n5Q2k21J56
7552c4p7n2K55J73q7j1r5j06K41n9J7m20L03j65p8q2K54J51j03p1K2J43p9J0k52
7577b02K92m05K63J1r7K26M6j88P2j87J06K15j22k25J74R4j22L68k50Mr5n8K42
7600A62k58o3n4L68k92O8Q8M3K34j78m44P7K33MM4j02P3oj1J24k90L06rj45m0
7625f8M00l24j9J23l60L26j04K14k97j22J09Q0P7P7R2j74Pm8l6R6j54m5j14K26
7649c8J14m9r3Q4j06J64K46j09k05nj10K83l38J94j17O9q2K9L90n79M84j38j07
7672a9J13Nj14K07k58J43J29m16M55l76J56o3P7J6j71M25m57J79N7N2p0Q9k24
7695f5K5J9J5k12J22L61l49j22M91m60l7K33j82M7K38j29J63k40J82O1m49J74
$$ y = [-16, -169, 256, -238, -19, -175, 188, 184, -272, 99, 17, 144, -196, -31, 192, 85, 149, 132, 70, 4, -51, 31, -190, -34, -111, -163, 92, 265, 178, 167, 72, -34, 207, 148, 165, -255, 48, -117, -195, -277, -23, 128, 25, -46, -24, 119, 40, 50, -202, 90, -315, -52, -41, -138, 88, 134, -54, 18, -169, -63, 152, 30, -195, -21, 73, -49, 319, 69, 73, -22, -80, 162, -96, -159, -213, 155, -137, -69, 19, 62, 296, 118, -326, -249, -16, -12, 32, -70, 3, -3, -14, 110, -180, 126, 117, -28, -68, 332, 8, -11, 112, -248, 78, -26, 188, -109, -231, -122, -42, 35, 112, 204, 30, 37, -11, -47, 49, -105, -150, -264, -38, 76, 27, -66, 18, -88, 76, 322, 213, 8, 3, -107, 176, -162, 32, -85, -16, -98, -69, 321, -258, 226, 88, -19, 94, 99, -15, 192, -66, 77, 206, -210, 245, -131, 25, -38, 39, 55, -116, 309, -148, 31, 88, 140, 70, 159, -65, -40, -21, -6, -218, -96, 265, -84, -206, 285, -175, -212, 21, -161, -114, 124, -5, 158, -82, 100, 161, -288, -114]
7717a14P3M11m14J12r6J07O8n19L08K67m03M6L27k35K3KK1K0j52N3j02K40l47
7740c04L74m23M91k54L9m4L33k31j56J15N5J33N0k76L61m19J23k1N0J49j01Q6
7762A30p7L0j46m0K53k16J32N5pj07Q0J6k54j31J58L65j32k92J86jK1k48OJ83
7786c6j76K65P5j08L5J07k80J19o5k5J34m2m2J53l32M4K52q4j91O2K19J30m61
7809b47J75n5K69j23o4K15j38Kk65J49L00k55k51J86Q1l2j35l0M0K25k21J30m8
7832i2L04P1l02J16j05q9Q1p1o0J83R3j14R3p4K56j67k78J51J50j02k07L29n36
7855c70M61k08K61k93R7J49r1J19Rp6J3j4n7j16K92k12j39L1K83k53R6O3N8j05
7879bj43K68k08q7j19M69j54jK8o8q8R2J91Qk29pJ21J33j61k82K56o0N7j7N9R1
$$ y = [-114, -41, 370, -44, 68, -28, 79, 147, -372, -64, 203, -200, -154, 173, -62, -39, -37, -16, 4, -148, -95, -197, 43, -304, 70, -353, 138, -116, -77, -121, 212, -19, -175, -60, -5, 128, 178, -98, 263, -156, -33, -54, -4, 145, 44, 130, 53, 83, -63, -103, 150, -66, 66, 121, 114, 7, 87, 103, -151, -282, -124, 241, 109, -183, 3, 2, 23, -225, -219, -36, -212, 53, 128, 20, 55, 162, -118, 1, -64, -89, 45, 3, -39, 114, -218, -174, 78, -6, -197, -135, 84, 214, -247, -72, -127, 142, 19, -45, 170, 32, 34, -231, -82, 218, -37, -288, -102, -21, -53, -188, -218, -178, 47, -174, -44, -92, 212, 283, -19, 97, -8, -97, -16, -87, -147, 36, 129, 15, 108, 34, 290, 123, -155, -4, 146, 44, -163, 166, -370, 91, -117, 144, -149, -52, 97, 6, 125, 134, 58, 71, 57, 0, -116, 176, -36, -175, -144, 139, -114, -18, 45, 103, -2, -145, 123, -85, -172, -291, 178, 24, 23, 51, -17, -105, -13, 178, 186, -43, -50, 71, 204, 43, -239, 17, -43, 14, -3, 56, 147]
7905A47k11J58q4K72m89L64k02j61N0P9k8j52J78J6L67k70O3l47K27K01k23L9
7927fL8p8j03R9OlK96k82O2n3j36K56k49N3l9J41j27p9L5N65k71j36J06k4O8l25
7953a86J37J99j31J00j01J61J19j41j50m3J78m02J82p7M3j55L39k9qj22L8K77
7975B28l34o1l1M62l37J95j6l82J54J88Jj06M9P1k16L2J6K98k56n3J11o8L8K1
7999Dk12K11J49k93L22j44J13k49R3J55m1R7j02k17J07P8k73L06r7j56P7J06L2
8022F6k29J56j83L08J75l36K64k36PR9k20j1K22J70n24L86k2j32pj7n8k0O1J0
8046g1O5kP1r1R1L6k79M00L7k64J12k7j11J22p4J79k02j25J86J42j45j29p0Q3
8070f6J48j52J99J24j10j05M5m7j54K67j62j11K28kk30m4L53j53M9j34J87R3r3
$$ y = [147, -64, 94, 10, 282, -207, 157, -45, -206, -156, -77, -105, -257, -79, -63, 304, 34, 97, -250, -23, 178, -45, -6, 32, -46, -149, -50, -44, -47, 249, -33, 29, -24, -160, 96, -153, -100, -139, 2, -125, -204, -169, 396, 125, -11, 95, 71, 139, -186, -49, 150, 19, 119, 18, 179, 298, 157, 7, -36, 142, -260, -78, -155, -112, -267, 72, 43, 35, -87, -49, 228, -106, -167, -198, 264, -73, 122, 106, -276, -122, 66, 67, -39, 10, 81, -135, -103, -87, 211, -45, -98, 13, -55, -17, 4, -208, 3, 152, -141, 181, 37, 150, -99, -6, 149, 108, 205, 103, -114, -7, 71, -202, 104, 7, -149, -72, 34, 66, -163, -7, -190, 118, 293, -43, 221, -15, -8, 91, -129, -140, 82, 252, -272, 114, 92, -40, -47, -64, -122, -142, -81, -71, -6, -8, 63, -28, 63, 99, -180, 220, 257, -7, 105, 78, -33, 89, 15, 194, -8, -133, 53, 195, 50, -79, -149, -66, 82, -70, 129, 253, 143, 38, 83, 36, -118, 149, -13, -124, 104, 102, -128, -172, 181, 28, 77, -57, 130, 223, 130]
8093A30j80J91l72K38j29l0J27J02K83k51J49k95k53L03k04L85l09O8m2P7J42
8114A30k70M43m17K31k15j6K53k80K96j08r2k9k45J46K58j59q9m1L55l82K09j88
8136b10K52n2qJ98k12j67L65k0nJ76k48l21K20L73k49J03j00M1L9j72q7k72J64
8159a92L67m29O3K63j0r1k50J95M0M6j45m8J18j29K75l44L94k5j24j5Ql8j2P2
8183a1P3k34K13J32k89q7J85n7
$$ y = [130, -50, 141, -231, 7, -122, -152, -25, 77, 360, 109, 258, -37, -290, 13, -191, 194, -115, -47, -89, -12, 130, -140, 303, -114, 117, -98, -114, 139, -141, 155, 47, -45, -74, -319, -173, 85, -74, -163, -204, 151, -231, -22, -210, 42, -10, -18, 180, -32, -199, 166, 146, 141, 317, 69, -252, -32, 341, 92, 195, 95, 136, 175, 3, -84, -356, -192, 175, -254, -191, 72, 62, -29, -279, -84, -44, 2, -143, -191, -73, -202, 73, -271, 123, 98, -26, -41, -33, -71, -83, -11, 62, -172, 41, 173, -116, -203, -18, -75]
8191g5
$$ Imaginary data points
##PAGE= N=2
##DATA TABLE= (X++(I..I)), XYDATA
0@%%%%%%%%%qJ6j6J6k4M0m8N6p2Q8j04J20j44J76k08K48k88L35l91M49n18N90
31C13o74P69q71R89j115J251j403J570j754J952k169K408k668K955l267L607l977
48b084M383m833N322n863O464p128P872q707R655j0739J1993j3465J5213j7344
62i261K0003k3424K8027l4583M4749o2825J04822l91663k12758N18775K88349
73B70211L46609O1669j93611l89020l49773l37576p3168J89459L38652L59931
83B23383L51511Q2143j87321l09031l49322l50177j06096J60016L02456L64025
93A81587L35659R8294j35565k75175l67126l34497j00872J17495K58507L64196
103A42503L28705J08395r5868k44076l59674l21799j20074P1036K33322L62545
$$ y = [0, 0, 0, 0, 0, 0, 0, 0, 0, 0, -8, 8, -8, 8, -16, 24, -24, 32, -40, 48, -56, 64, -80, 96, -112, 136, -152, 183, -208, 241, -277, 313, -361, 408, -463, 526, -589, 662, -741, 829, -925, 1027, -1142, 1266, -1402, 1553, -1714, 1893, -2084, 2299, -2534, 2788, -3075, 3389, -3739, 4133, -4574, 5081, -5658, 6335, -7130, 8083, -9261, 10742, -12682, 15345, -19238, 25511, -37314, 67508, -324155, -536913, -18138, 270211, 616820, 678489, 484878, 95858, -253915, -591491, -664659, -475200, -136548, 223383, 574894, 657037, 469716, 160685, -188637, -538814, -644910, -484894, -182438, 181587, 517246, 615540, 479975, 204800, -162326, -496823, -597695, -480200, -221693, 142503, 471208, 579603, 483735, 239659, -120015, -441814, -561888, -490852, -257530, 105015]
113A05015L19653J25192n9373k25339l50891l09820j38201L7368K19529L46781
123F9914L00862J44753k0504k08293l37954k95099j52014O963J94370L24552K95267
134C22817J67916K522j92232l13594k86096j77010j6376J82721L02833K81101
144B74602J84437K7516j71787k91531k79065j89954l3085J60612K76374K75660
154B33779J99194M2193j51281k64960k72467k04990m9771J40400K52655K69566
164A94318K09884N7764j29377k42676k66452k12134o3338J16919K30404K62921
174A58233K16051P0095j05307k21012k61495k17584p4151R5180K08693K56509
184A25212K19741Q2576q3739j99255k53391k21610q7799P3830J90088K48817K20099
$$ y = [105015, 424668, 549860, 490487, 265148, -85743, -395563, -533764, -496396, -276867, 69914, 370776, 515529, 495025, 286732, -51222, -346321, -498335, -491372, -297002, 27550, 322817, 490733, 493255, 301023, -12571, -298667, -475677, -492053, -309332, -6499, 274602, 459039, 486555, 314768, 23237, -255828, -445782, -478867, -318255, -41881, 233779, 432973, 475166, 323885, 58925, -213542, -418532, -468303, -327903, -75248, 194318, 404202, 461966, 332589, 89913, -176539, -388673, -452011, -335092, -104688, 158233, 374284, 444379, 339072, 118060, -143435, -361019, -435170, -339990, -131297, 125212, 344953, 427529, 343790, 144535, -108856, -330466, -418265, -344435, -154347, 94470, 314569]
195C14569R3260o0803j81021k46407k20861r7781N1598J70965K41518K20825J02762
206C88624m1422j61757k36983k19967j08328L1349J54571K32265K17831J12824
216C69007k0886j45809k28277k16012j16936J2080J37881K22790K13882J21454
226C49174k470j30120k17737k12518j26767n391J23784K11605K09303J30813J4332
237C44008j16030k05132k06671j35625k2007J08830J98952K04038J39418K8805
247C38586j01436j91853k01793j43808l5298R3895J84547K00346J47942M1094
257C32222q7146j76938j97808j50444m6996P9135J69160J95246J53914N2527p1341
268B51531j63174j93057j55559n7504O2786J56317J90894J57631O2077n4809j48614
$$ y = [314569, 407829, 347026, 166005, -80402, -301263, -399044, -347446, -176481, 65037, 285862, 388624, 347202, 185445, -51538, -271505, -379833, -348484, -193913, 38352, 256183, 369007, 348121, 202312, -25965, -241977, -358913, -346833, -208952, 13838, 227720, 349174, 346704, 216584, -1153, -213671, -340438, -345829, -222045, -10440, 198863, 329676, 344008, 227978, 22846, -183825, -319450, -341457, -232627, -33675, 170363, 309781, 338586, 237150, 45297, -156496, -300304, -335602, -241707, -57160, 143186, 291128, 332222, 245076, 68138, -129670, -280114, -327110, -247975, -78815, 116431, 270345, 322872, 251531, 88357, -104700, -260259, -317763, -254977, -98660, 92234, 249865, 311942, 257133, 108519]
279A08519j88735j59425o7606M8575J41734J84807J60369P3610m0687j36696j81685
290e7220j59977p7293L2529J29585J79338J60594Q1098k5951j23269j74979j61337
301a96882q6064J9737J17454J70531J60490R1303j2894j11070j67526j60002r4142
312b69065O430J04891J62137J59815R8217o17r8339j58506j59234j01630m863
323b60764R1813J54511J58759J04216J0731q5667j49534j57990j07433j6166Q0444
334a77080J44617J56414J09474K1768p4237j40971j54632j11209k6884O7556J36239
345d8945J53657J13502L1988o1732j30996j51922j16053l6879N6227J26055J49589
356H4491J17734M2228n0540j22086j47177j19137m6214M4444J16813J45403J20948
$$ y = [108519, -80216, -239641, -307247, -258672, -116938, 67869, 228238, 301848, 261161, 124465, -57220, -217197, -294490, -261961, -132376, 46962, 207556, 288654, 262703, 139434, -35545, -196882, -282946, -263209, -145755, 24776, 185266, 276569, 263675, 152605, -14921, -174923, -269065, -262635, -157744, 4393, 164208, 262425, 261808, 163469, 4963, -154271, -255901, -260764, -168951, -14440, 144319, 248535, 259266, 173599, 24065, -133925, -241358, -257524, -177080, -32463, 123951, 233425, 255193, 180956, 39985, -114647, -225856, -252740, -185184, -48945, 104712, 218214, 250202, 188470, 57474, -94448, -210501, -247380, -191153, -65098, 84491, 202225, 244453, 193913, 71827, -75350, -194487, -240701, -196257, -79444, 65959, 186907]
367A86907N0146l9196j11425j43133j22682n3747L3830J05826J40705J23938N7664
378B28833k8437j01238j37400j24472o1485K2671R5819J35946J25053O4251j7410
389B02131r0801j34064j25035o6720J2140Q5664J31545J25143O9423p349q0697
400A21380j28869j24622p2148J843P6445J25974J24247P4295L462p2450j23412
411F145j22384p7384q116O7989J20931J21788P9412J2607o3570j17549j20440
422a00571q2137j7245N9965J13776J19087Q4381K1652n6209j10324j17209q7184
433a72018k5870N2775J06560J15919Q9542K9171m8433j02764j14558r1444l2982
444a94102M4567R8836J13074R3901L5189m1049r3747j11317r5750l8591L6705
$$ y = [186907, 237053, 197857, 86432, -56701, -179383, -233130, -199300, -93474, 47231, 171169, 228833, 200396, 99158, -38242, -162714, -224199, -201528, -105709, 30237, 155290, 219541, 202131, 111330, -22734, -147769, -214489, -202349, -116685, 14860, 140003, 209426, 202077, 121380, -7489, -132111, -204259, -202416, -125971, 3, 124250, 198545, 202007, 129557, 6145, -116239, -193623, -201739, -133750, -12819, 108969, 188381, 200988, 137418, 19869, -100571, -182708, -199953, -139988, -26212, 92875, 177256, 198908, 142699, 32375, -84834, -172018, -197888, -145113, -38553, 77366, 166908, 196079, 147646, 44882, -69676, -161120, -194102, -149535, -50699, 62375, 156276, 191465, 150416, 56669, -54648, -150398, -188989, -152284]
455a52284Q9618J10353R7307M1459l2755q5200j09279r8503m3531K7742Q0437
466g4636J08356J00119M5504k3630p6112j06703j01155m7533J9567P1857J05588
477B1222J01069M9768j4979o8328j04440j00881n1306J0406O3685J03661J00579
488A10456N2879n501o0020j01840j00606n4275J003N6166J00383R9182N6403M263
500A58493n3241r8727r8288n8507q175N0799R6583R6511O0373J1947m6824r4962
512A5982r5217o2493j6157M4926R2194R3171O4091K0221m1983q8776r1979o7083
524a33103k3243M0771Q5897Q9071O8810K7101l7671q3131q8044p1418k9004L5583
536a18381P9484Q6161P2920L1497l2464p5293q5183p5179l3403L0259P1299Q3856
$$ y = [-152284, -62666, 47687, 144994, 186453, 153698, 68498, -40781, -139284, -182815, -155073, -74636, 33720, 133839, 179343, 155713, 79601, -27102, -128257, -175790, -156223, -84366, 21222, 122291, 172059, 157080, 88752, -15688, -116569, -167875, -157469, -93784, 9877, 110456, 163335, 157834, 97814, -4026, -104632, -158907, -157904, -101738, -1355, 97827, 154230, 158493, 105252, 6525, -91763, -150270, -158445, -107646, -11063, 85448, 145821, 157768, 110944, 15982, -79235, -141728, -157885, -112959, -20765, 72406, 136497, 156718, 114735, 25959, -66020, -133103, -156346, -115575, -29678, 59393, 128203, 155304, 117633, 34502, -53542, -124960, -153964, -118381, -38897, 47264, 120184, 151681, 119217, 43924, -41259, -116438, -149841, -119582, -48283, 35573]
548C5573P6660L5179k6793o7397q3491p8206l6270K3564O3711Q2276P9178L7722
560A41706j9913n9724q1970p9924l8788J6691N5947Q0797Q0400L9879j2801n2047
572G0253q0489q0805m0937R520M9149P9470Q0387M1643n060m6464p8974p9443
584h1750m3146J613M3713P8306P8300M3761K169m0857p6744p7670m5513n312L9332
597h3798P5415P5708M7073Q919l6974p4251p4704m8642j1931L5128P2447P3532
609E7922N0135J4252l3069o9540p2879n1761j7118L1962O7380P0709N3743J9679
621A21415l0075o4661p0370n5435k0950K7617O2515O8981N7437K2420k5499n9836
633C3559o8382n8052k4789K3708N7342O7215N9394K5877k1694n4001o6756o0535
$$ y = [35573, 112233, 147412, 120619, 53222, -30269, -108475, -144745, -121181, -57470, 24806, 103984, 141706, 121793, 62069, -19901, -99825, -138613, -121922, -65975, 14822, 95222, 135101, 122300, 70253, -10236, -91041, -131978, -122458, -73309, 6161, 86548, 128191, 123131, 76667, -2307, -81750, -124896, -123283, -79570, -1264, 77036, 120797, 122966, 82109, 5365, -72305, -117818, -123130, -83798, -8383, 67325, 114398, 123317, 86343, 12092, -62612, -111254, -123185, -88057, -15610, 57922, 108057, 122309, 89240, 19700, -53179, -104940, -122058, -90096, -22716, 47993, 101736, 121415, 91340, 26679, -43691, -99126, -120076, -92459, -29944, 39037, 96474, 118894, 93395, 33559, -34823, -92875, -117664, -93956, -36614, 30601, 89995, 115872, 94178, 40177, -26579, -87114]
645h7114k7196J9031N1645O6326O1246K8341j6404m8846o5482o2023k9780J4194
657i6062M6091O4917O2299L0676j1068m4253o4212o2398l1872Q806M1399O4065
669H388O1816L3324n894l9492o2853o2091l4349L319L7752O1830O1813L5280n49
682I8294l6008o0929o1578l6375j333L3828N9551O0950L7731L262l1648n8203
694G542o0239l9362n956L0774N6614O0025M0054Q026k8422n5610n9176m1363r418
707i6511K6243N3642N8669M2791J1267k4882n1704n8427m3457j3596K3604N0171
719b2190N7579M4526J4723k0960m7972n7564m5568j6158J8981M6845N6749M5442
731G4433J8216j7082m5247n6187m6157j9494J5332M3568N5268M7047K0319j2893
$$ y = [-87114, -114310, -95279, -43634, 22692, 83938, 112279, 95875, 47029, -18453, -80476, -110256, -96062, -49971, 14946, 77245, 107921, 96853, 52600, -11612, -74010, -105882, -97076, -55677, 8388, 70204, 103528, 97634, 58142, -4711, -66802, -101151, -97832, -60080, 1750, 63563, 98843, 98294, 62286, 1357, -60221, -96596, -97929, -64101, -4550, 56400, 94131, 97393, 65745, 7542, -52697, -92059, -98015, -67241, -10627, 49398, 89452, 97478, 69056, 13446, -45730, -87093, -96511, -70268, -16626, 42043, 84834, 96101, 71219, 19515, -38912, -82369, -95965, -72361, -22190, 35389, 79915, 94638, 73678, 25706, -31858, -77426, -93584, -74603, -27758, 28991, 74433, 92649, 75567, 30320, -25867, -72024, -91518, -76186, -32618, 22650, 69697, 90016, 77123]
743G7123m1570n4850m7149k2391J1202M0171N3760M7272K3506r159l8283n2948
755a3316m7770k4807P425L6309N2111M8159K6395n524l5186n0867m8300k7224
767h2595L473L3387M9870M8177K8580j834l1689m8936m8026k9744O25K9594M7934
780a184M7973L0736J202k8215m6693m7887l1612l212K6726M5564M7904L2705M232
793G8239k4715m4422m7515l3298o173K3142M2949M7550L4054P423k1323m2046
805A3865m7038l4901q701J9882M0657M7250L5097R891j7904l9450m6904l5360
817f3616j1624J6385L8413M5762L6259J2844j4586l7395m5311l6694j4187J3239
829f0511L5879M5112L7124J5657j1820l4676m4861l7410j6556J0451L2944M3674
$$ y = [77123, 35553, -19297, -66446, -88837, -77635, -37464, 16296, 63568, 87074, 77915, 39632, -13316, -61086, -85893, -78468, -42159, 9952, 58111, 84506, 78982, 43796, -7071, -55371, -82595, -79122, -45735, 4135, 52312, 80892, 79058, 47369, -1567, -49593, -79337, -78712, -49118, -1184, 46789, 77525, 78727, 50512, 3819, -44068, -75680, -78892, -52166, -6602, 41302, 74007, 78239, 53524, 9102, -38413, -71711, -77884, -54742, -11793, 35757, 69811, 77234, 55911, 13865, -33173, -68074, -76775, -56893, -16236, 31014, 66111, 76002, 58098, 18648, -28256, -63616, -75240, -58855, -20442, 25320, 61579, 74423, 59837, 22442, -22869, -59563, -73750, -60511, -24632, 20480, 57604, 73261, 61441, 26765, -18096, -55506, -72062, -61611, -28667, 15007]
841A5007L8090J7708q486l1641m3223l8299j9011O949L0640M2457L8614J9696
853F8501n438k9290m1502l8682k1144M250K7958M0923L8603K1982k634k6354m0258
866c085l8726k2756J158K5169L9046L8946K3555Q5k3788l8103l9179k3966j847
879f3491K2374L8079L8156K5537K740k0934l6628l9062k5665m324K0002L5686
891g530L8072K6820N366j8505l4600l7710k7727o464J6978L3835L7794K8048P784
904F2161j6101l2567l7440k8542q657J4113L2036L6582K9519R824j3298l0931
916A6699l6457k9475j0961J1788K9981L6060K9836J2183j0743k8612l5338l0982
928d6021j3020J0026K7101L5092L1139J3872q470k6030l4798l1000j4972P004
$$ y = [15007, 53097, 70805, 62319, 30678, -12545, -50844, -69855, -62906, -32266, 10191, 48805, 68501, 63063, 33773, -7729, -46411, -67555, -63305, -35347, 5576, 44179, 66161, 63527, 37173, -3085, -41811, -64567, -63409, -38240, 806, 39752, 63307, 63392, 39604, 1501, -37678, -61644, -63491, -41117, -3038, 35118, 60655, 63395, 42461, 5833, -33229, -58894, -63218, -43216, -7530, 30542, 57362, 62728, 44223, 9623, -28087, -55814, -62278, -45300, -11465, 26329, 54377, 62161, 46060, 13493, -23947, -52489, -61146, -47033, -14997, 21585, 51104, 60928, 47630, 16699, -19758, -49233, -60194, -48406, -18425, 17635, 47471, 59654, 48911, 20299, -15039, -46021, -59041, -49015, -21914, 13178, 44317, 58189, 49719, 23689, -11109, -42109, -57081, -50077]
940e0077K4840L4511L1482J5231n640k3370l4065l1712j5959M315K2229L3633
952E418L1935J6863l393k1433l3036l1717j7421K083J9899L2431L2083J7508r0
965E1130j9544l1768l1375j8692o49J7999L1489L1342J9271J996j7132l0908l1195
978b8036j9984k931J6621K9878L0515K0534M480j5809k9441l0275k0882n408J4456
991c6282K8890K9855K1955N931j3611k7421l0142k2349o941J2983K6594K9323
1003A8785K3009Q060j2037k5687k8959k3882q740J1073K4898K8705K4376Q865
1015D8466r882k3781k8715k4359j0094R346K2834K8274K4783J0698q276k1858
1027A7436k7809k5241j1206P372K0442K7940K5465J1667o388j9564k7384k5926
$$ y = [-50077, -25237, 9274, 40756, 55987, 50347, 26977, -7088, -38800, -54759, -50444, -28215, 5418, 37353, 54216, 50823, 29390, -3646, -35363, -52784, -50701, -30802, 1629, 33712, 51220, 51130, 31586, -182, -31557, -50249, -50898, -32899, -1410, 29932, 49203, 51199, 34067, 3159, -28036, -48020, -50951, -34330, -4452, 26063, 46597, 51077, 35268, 5827, -24448, -45330, -50738, -36282, -7392, 22463, 44418, 50349, 36738, 9317, -20825, -43174, -50115, -37132, -10538, 18785, 41794, 49854, 37817, 12130, -16829, -40711, -49451, -38378, -13480, 15225, 39601, 48466, 38584, 14803, -13912, -38271, -48365, -39019, -16185, 12089, 36872, 47570, 39294, 17436, -10373, -35614, -46820, -39448, -19006, 8934, 34399, 46066, 39678, 20114, -7270, -33196]
1039c3196j2045N055J8724K7734K5554J2565l948j8063k7061k5767j3039K782
1051d0705J7168K6579K6011J3434j859j6096k6209k5529j4369R26J4758K6428
1063E37K5425J4740J05j4307k5616k5344j5178j472J3503K5224K5271J5884K559
1076D1331j3566k4540k4416j6361l394J2597K3747K4270J6915M519j1917k3452
1088E733k4188j7322m818J1017K2482K3873J7795O025j0575k1603k3863j8008
1100c3452o620R796K1029K2766J9322P052r365k0029k2880j9573p245Q161J9271
1113a1767K2873J9969P683p208j8297k2863j9978q591O708J7196K2548K0575Q667
1126C7515n767j6688k2426k0263r045M648J6037K1856K0448J0237m349j5289k1678
$$ y = [-33196, -45241, -40186, -21462, 6272, 31826, 44391, 40443, 22380, -4681, -30448, -43487, -40705, -23537, 3042, 29053, 42487, 40628, 24532, -1677, -27206, -41575, -40649, -25891, 537, 25962, 40702, 40807, 26500, 884, -24460, -39638, -41110, -27607, -2383, 22888, 38772, 41331, 27765, 3225, -21191, -37552, -40946, -28349, -4602, 19668, 36583, 41102, 29185, 5733, -18455, -35777, -40595, -29578, -7096, 16777, 34572, 40597, 30022, 8419, -15444, -33452, -40072, -30276, -9247, 13519, 32841, 39893, 30528, 10499, -12381, -31954, -39199, -31038, -11767, 11106, 31075, 38758, 31550, 13253, -9610, -29588, -38179, -31471, -14275, 8273, 28848, 37515, 31748, 15060, -7366, -27629, -36674, -32026, -15989, 5867, 26315, 36552, 32203, 16914, -4764]
1139d764k0613j0258L076J4827K1525K0494J0472k130j3692k1493k0304j1033
1151c3893J242J2974K1091K0232J1778l93j2856k0592j9826j2562k7J1986K0113
1164g33J9956J2883O78j1255j9739j9590j3238j613J0751J8869J9884J3303K238
1177C2394j0034j8474j9927j3564k607R303J8209J9213J3820L764q763j7129j9607
1190a3402j4328m154Q572J6437J9282J4453M544p276j6452j8657j5286m893O932
1203b4228J5544J8860J4755O053o027j5540j8647j5243n914N003J5286J8272J5304
1216B3478O326m599j4067j8070j5771o976M106J3725J7885J5597P658l579j3449
1229A2264j7269j5615q029K855J2513J7333J5681Q837k797j1922j6904j5776q894
$$ y = [-4764, -25377, -35635, -32559, -17732, 3793, 24287, 34759, 32629, 18937, -2556, -22860, -33893, -32651, -19677, 1414, 21646, 33424, 33031, 20175, -417, -20243, -32805, -32832, -20846, -733, 19223, 32106, 32784, 21529, 1790, -17800, -31038, -32651, -21900, -3031, 16853, 30156, 32394, 22360, 3886, -16041, -29605, -32212, -22909, -4700, 14513, 28333, 32097, 23334, 6205, -13402, -27730, -31884, -23312, -6875, 12407, 26860, 31404, 24128, 7676, -10981, -26267, -31160, -24228, -8684, 10176, 24931, 30984, 24957, 9417, -9230, -24473, -30387, -25384, -10098, 8174, 23478, 29804, 25205, 11138, -6932, -22703, -29679, -25573, -11848, 6037, 21634, 29292, 25713, 12264, -5005, -20620, -28649, -25794, -13281, 4052, 19733, 28570, 25773, 13851, -3053, -18829, -27723]
1242b7723J991J1489J6395J6083R103j942j0040j6219j6010r724P64J0090J6207
1255D64J5726J0071l18r819j5876j6069r493n86R387J5129J5947J0381M64q353
1269A7055j5121j5659j0463j472Q405J4515J5640J0694J749p522j4136j5626j1256
1282b3197k294P159J3690J6115J0655K847o520j3420j5355j1244l051N729J2925
1295e961J5475J1754L357n597j2538j5327j1526m035M780J2360J5032J2130M012
1308B3916m056j2077j4612j2028m917L966J1425J4490J2069N231l322j1352j4336
1321e603j1964n575K886J0369J4325J2152O425k607j0130j4025j2188o606K481
1334b0060R413J3583J2261O757j634r259j3172j2517o834R42Q855J2953J2713
$$ y = [-27723, -25732, -14243, 2152, 18235, 27338, 25396, 15356, -863, -16873, -26597, -25833, -15743, 464, 16190, 26261, 25943, 16124, 248, -15821, -25314, -25900, -16513, -1384, 14563, 24944, 25408, 17055, 1934, -13725, -24188, -25660, -17255, -2740, 12900, 23594, 25343, 17821, 3685, -11941, -23197, -25491, -18332, -4642, 11473, 22128, 24975, 18455, 5035, -10320, -21564, -24615, -18886, -5961, 9514, 21268, 24625, 19028, 6490, -8837, -20363, -24398, -19618, -7258, 7774, 19904, 23916, 19860, 7783, -6829, -18857, -23774, -19808, -8383, 6107, 18176, 23407, 20085, 8733, -5603, -17567, -23142, -20256, -9887, 4438, 16590, 23015, 20408, 10278, -3747, -15935, -22541, -20060, -10647, 2936, 15197, 21954, 20320, 11061, -2111, -14628, -21462, -20520, -11665, 1288, 14001]
1347A4001P143q62q230j2637j2694p301J81P912J2603J2240Q253j99p315j2293
1361H02j2655q195k68P094J1988J2435Q050J124o899j1587j2157q376j565O361
1375a3848J1485J1974Q827J417n531j1076j2223r262j876N806J0622J1829Q980
1388A7124K702n108j0185j2331r480k310M289J0358J1936R276L141m342r799j1394
1402f123r656l479L983R458J1535R414L836l733q658j1702r432m037K897Q755
1416f942J1377R740M081k331q485j1186r915m328K017Q006J1198R743M877j915
1430A5937p804j0889r919m849J490P354J0600R856N477j228p106j0445r774n708
1444a7008Q18O711J0462R984N611l45o586r991r917n865j79O155J0125R444O540
$$ y = [14001, 21144, 20282, 12052, -585, -13279, -20580, -20399, -12487, 116, 12356, 20609, 20410, 13095, 802, -11853, -20048, -20316, -13222, -1234, 11201, 19251, 20375, 13476, 1889, -10268, -18644, -20209, -13848, -2363, 9611, 18438, 19855, 14324, 3248, -8975, -18237, -20113, -14307, -3685, 8144, 17124, 19826, 14718, 4533, -7798, -17278, -19588, -15299, -4941, 6995, 16271, 19412, 15070, 5271, -6123, -15779, -19258, -15275, -5817, 5718, 15132, 18968, 15235, 6577, -5125, -14557, -18594, -15697, -6942, 4435, 14175, 18256, 15925, 7440, -3746, -13661, -17989, -15972, -7966, 3232, 12975, 17852, 15937, 8133, -2756, -12675, -17524, -16034, -8680, 1920, 11776, 17253, 16025, 8919, -1526, -11300, -17008, -16190, -9479, 983, 10967, 16578, 16233, 9647, -344, -10261, -16126, -16305, -10150, -25, 9419, 15959]
1459A5959L45n875r674r846o328o50N234R869R575O611P35m863r210r700p016
1474a4834j000M620R267R418O741J770m362r028r369p122k108M719Q176R457P398
1489A3743J829l865p916r468p422k457L789P639R409P405K816l250p393r576p614
1504a2331k792K749P626R196P620K764k501p013r217p600l227K184O875R012P748
1519A1093L559j957o604q782p680l912J506O262R057P615L940j322o176q483p867
1534i751m013J207N679Q053Q021M057k73n588q354p790m416M5N314Q500P603M703
1550A2997q7m722q382p719m879lM700P590P582N434L62m376p647p756n073n93
1566a2572M210P237P345N716P97m118p090p415n543j358L834P262P402N339J438
$$ y = [15959, 16304, 10429, 755, -9091, -15419, -16069, -10835, -966, 8609, 15220, 15955, 11092, 1882, -7818, -14834, -15834, -11214, -1947, 7471, 14212, 15982, 11620, 2592, -6777, -13899, -16007, -11288, -3112, 6345, 13743, 15572, 11707, 3791, -5677, -13099, -15556, -11767, -4128, 5281, 12686, 15502, 12252, 4859, -4717, -12331, -15123, -12374, -4748, 4448, 12068, 14832, 12331, 5318, -3899, -11499, -14726, -12542, -5667, 3345, 11093, 14652, 12695, 6091, -2691, -10371, -14283, -12777, -6515, 2542, 10157, 14097, 12775, 6599, -1884, -9751, -13764, -12557, -6878, 1175, 9196, 13253, 12980, 7392, -962, -8752, -13168, -13123, -7809, 691, 8294, 12997, 12910, 8188, -194, -7913, -12792, -12795, -8095, -505, 7077, 12511, 12873, 8497, 850, -6906, -11979, -12572, -8362, -1125, 6220, 11936, 12733, 8615, 1525, -5890, -11433, -12791, -8957, -1695, 5707, 11046, 12484]
1581A2484l467o785p501n447j682L056O865P064N698J995k830o479p412n677k058
1596a2176K922O239O819N922K509k818n805p227n997k146K290N522P067O182K390
1611A1693j915n376p355n916k542K031M915O644O363K629j183n121p079o000k764
1626a0976J163M783O899O006L247j221m395o850o111k884L74M294O775O143L281
$$ y = [12484, 9017, 2232, -5269, -10716, -12398, -9342, -2477, 4587, 10285, 12280, 9450, 2971, -4441, -10118, -12176, -9254, -3015, 3804, 9726, 12235, 9417, 3612, -3615, -9612, -11758, -9468, -3946, 3121, 9303, 11693, 9778, 4402, -2953, -8869, -11411, -9380, -4465, 2179, 8542, 11171, 9988, 4867, -2212, -8212, -10976, -9813, -5030, 1869, 7875, 11122, 9901, 5506, -1344, -7455, -10339, -9965, -5671, 1104, 7247, 10528]
$$ [...]
8191B62
##END NTUPLES=NMR FID
##END=
