##TITLE=1H_DE-79H2
 200.13MHz, D2O,
 8 sc
 
 5.2.2025
##JCAMPDX= 6.0         $$ Bruker NMR JCAMP-DX V2.0
##DATA TYPE= NMR FID
##DATA CLASS= NTUPLES
##ORIGIN= UXNMR, Bruker Analytische Messtechnik GmbH
##OWNER= pz
$$ XWIN-NMR		Version 3.5
$$ Wed Feb  5 16:09:57 2025 Russian Standard Time (UT+4h)  she@DPX200
##.OBSERVE FREQUENCY= 200.1313
##.OBSERVE NUCLEUS= ^1H
##.DELAY= (6, 6)
##.ACQUISITION MODE= SIMULTANEOUS
##.ACQUISITION SCHEME= undefined
##.AVERAGES= 8
##.DIGITISER RES= 18
##SPECTROMETER/DATA SYSTEM= spect
##.PULSE SEQUENCE= zg30
##.SOLVENT NAME= D2O
##.SHIFT REFERENCE= (INTERNAL, D2O, 0, 14.3821)
##AUDIT TRAIL= $$ (NUMBER, WHEN, WHO, WHERE, WHAT)
$$ ##TITLE= Audit trail, XWIN-NMR		Version 3.5
$$ ##JCAMPDX= 5.01
$$ ##ORIGIN= Bruker BioSpin GmbH
$$ ##OWNER= she
$$ F:/spectra/data/she/nmr/H-C/1/audita.txt
$$ ##AUDIT TRAIL=  $$ (NUMBER, WHEN, WHO, WHERE, WHAT)
(   1,<2025-02-05 16:09:00.78 +0400>,<she>,<DPX200>,
      <created by zg, POWCHK disabled, PULCHK disabled
       configuration hash MD5:
       00 E9 B6 7A A2 85 ED C7 34 08 36 98 17 FE 4E 26
       data hash MD5: 16K
       13 C4 B4 2B 9C BE 79 B0 58 7F 31 D0 BA 72 3E 9E>)
$$ ##END=
$$ 
$$ hash MD5
$$ AE D1 09 B2 3E 58 6C E4 BB 54 19 37 32 06 17 2C
##$RELAX= 
##$RELAX= 
##$RELAX= 
##$RELAX= 
##$RELAX= 
##$RELAX= 
$$ Bruker specific parameters
$$ --------------------------
##$DU= <F:/spectra>
##$EXPNO= 1
##$NAME= <H-C>
##$PROCNO= 1
##$TYPE= <nmr>
##$USER= <she>
##$AMP= (0..31)
100 100 100 100 100 100 100 100 100 100 100 100 100 100 100 100 100 100 
100 100 100 100 100 100 100 100 100 100 100 100 100 100 
##$AQSEQ= 0
##$AQ_mod= 1
##$AUNM= <au_zg>
##$AUTOPOS= <>
##$BF1= 200.13
##$BF2= 200.13
##$BF3= 200.13
##$BF4= 200.13
##$BF5= 200.13
##$BF6= 200.13
##$BF7= 200.13
##$BF8= 200.13
##$BYTORDA= 1
##$CFDGTYP= 0
##$CFRGTYP= 5
##$CHEMSTR= <none>
##$CNST= (0..31)
1 1 145 1 1 1 1 1 1 1 1 1 1 1 1 1 1 1 1 1 1 1 1 1 1 1 1 1 1 1 1 1 
##$CPDPRG= <>
##$CPDPRG1= <>
##$CPDPRG2= <>
##$CPDPRG3= <>
##$CPDPRG4= <mlev>
##$CPDPRG5= <mlev>
##$CPDPRG6= <mlev>
##$CPDPRG7= <mlev>
##$CPDPRG8= <mlev>
##$CPDPRGB= <>
##$CPDPRGT= <>
##$D= (0..31)
0 0.7 0 0 0 0 0 0 0 0 0 0.03 0 0 0 0 0 0 0 0 0 0 0 0 0 0 0 0 0 0 0 0 
##$DATE= 1738757340
##$DBL= (0..7)
120 120 120 120 120 120 120 120 
##$DBP= (0..7)
150 150 150 150 150 150 150 150 
##$DBP07= 0
##$DBPNAM0= <>
##$DBPNAM1= <>
##$DBPNAM2= <>
##$DBPNAM3= <>
##$DBPNAM4= <>
##$DBPNAM5= <>
##$DBPNAM6= <>
##$DBPNAM7= <>
##$DBPOAL= (0..7)
0.5 0.5 0.5 0.5 0.5 0.5 0.5 0.5 
##$DBPOFFS= (0..7)
0 0 0 0 0 0 0 0 
##$DE= 6
##$DECBNUC= <off>
##$DECIM= 32
##$DECNUC= <off>
##$DECSTAT= 4
##$DIGMOD= 1
##$DIGTYP= 9
##$DL= (0..7)
0 120 120 120 120 120 120 120 
##$DP= (0..7)
150 150 150 150 150 150 150 150 
##$DP07= 0
##$DPNAME0= <>
##$DPNAME1= <>
##$DPNAME2= <>
##$DPNAME3= <>
##$DPNAME4= <>
##$DPNAME5= <>
##$DPNAME6= <>
##$DPNAME7= <>
##$DPOAL= (0..7)
0.5 0.5 0.5 0.5 0.5 0.5 0.5 0.5 
##$DPOFFS= (0..7)
0 0 0 0 0 0 0 0 
##$DQDMODE= 0
##$DR= 18
##$DS= 0
##$DSLIST= <SSSSSSSSSSSSSSS>
##$DSPFIRM= 0
$$ [...]
##$SUBNAM0= <"">
##$SUBNAM1= <"">
##$SUBNAM2= <"">
##$SUBNAM3= <"">
##$SUBNAM4= <"">
##$SUBNAM5= <"">
##$SUBNAM6= <"">
##$SUBNAM7= <"">
##$SUBNAM8= <"">
##$SUBNAM9= <"">
##$SW= 18.0517328524113
##$SWIBOX= (0..15)
0 0 2 0 0 0 0 0 0 0 0 0 0 0 0 0 
##$SW_h= 3612.71676300578
##$TD= 16384
##$TD0= 1
##$TE= 0
##$TE2= 300
##$TE3= 300
##$TEG= 300
##$TL= (0..7)
0 120 120 120 120 120 120 120 
##$TP= (0..7)
150 150 150 150 150 150 150 150 
##$TP07= 0
##$TPNAME0= <>
##$TPNAME1= <>
##$TPNAME2= <>
##$TPNAME3= <>
##$TPNAME4= <>
##$TPNAME5= <>
##$TPNAME6= <>
##$TPNAME7= <>
##$TPOAL= (0..7)
0.5 0.5 0.5 0.5 0.5 0.5 0.5 0.5 
##$TPOFFS= (0..7)
0 0 0 0 0 0 0 0 
##$TUNHIN= 0
##$TUNHOUT= 0
##$TUNXOUT= 0
##$USERA1= <user>
##$USERA2= <user>
##$USERA3= <user>
##$USERA4= <user>
##$USERA5= <user>
##$V9= 5
##$VALIST= <valist>
##$VCLIST= <CCCCCCCCCCCCCCC>
##$VD= 0
##$VDLIST= <DDDDDDDDDDDDDDD>
##$VPLIST= <PPPPPPPPPPPPPPP>
##$VTLIST= <TTTTTTTTTTTTTTT>
##$WBST= 1024
##$WBSW= 4
##$XGAIN= (0..3)
0 0 0 0 
##$XL= 0
##$YL= 0
##$YMAX_a= 572609
##$YMIN_a= -624157
##$ZGOPTNS= <>
##$ZL1= 120
##$ZL2= 120
##$ZL3= 120
##$ZL4= 120
##$ABSF1= 10
##$ABSF2= 0
##$ABSG= 5
##$ABSL= 3
##$ALPHA= 0
##$AQORDER= 0
##$ASSFAC= 0
##$ASSFACI= 0
##$ASSFACX= 0
##$ASSWID= 0
##$AUNMP= <proc_1d>
##$AZFE= 0.1
##$AZFW= 0.1
##$BCFW= 1
##$BC_mod= 2
##$BYTORDP= 1
##$COROFFS= 0
##$CY= -3
##$DATMOD= 1
##$DC= 2
##$DFILT= <>
##$DTYPP= 0
##$F1P= 0
##$F2P= 0
##$FCOR= 0.5
##$FTSIZE= 0
##$FT_mod= 4
##$GAMMA= 1
##$GB= 0.15
##$INTBC= 1
##$INTSCL= 1
##$ISEN= 128
##$LB= 0.25
##$LEV0= 0
##$LPBIN= 0
##$MAXI= 10000
##$MC2= 0
##$MEAN= 0
##$ME_mod= 0
##$MI= 1.114404
##$NCOEF= 0
##$NC_proc= 0
##$NLEV= 6
##$NOISF1= 3.799351
##$NOISF2= 2.8
##$NSP= 1
##$NTH_PI= 0
##$NZP= 0
##$OFFSET= 14.38212
##$PC= 1
##$PHC0= -142.1093
##$PHC1= 60.99221
##$PH_mod= 1
##$PKNL= yes
##$PPARMOD= 0
##$PSCAL= 0
##$PSIGN= 0
##$REVERSE= no
##$SF= 200.129724274929
##$SI= 16384
##$SIGF1= 3
##$SIGF2= 2
##$SINO= 400
##$SIOLD= 16384
##$SREGLST= <1H.CDCl3>
##$SSB= 0
##$STSI= 0
##$STSR= 0
##$SW_p= 3205.1282051282
##$SYMM= 0
##$S_DEV= 0
##$TDeff= 0
##$TDoff= 0
##$TI= <>
##$TILT= no
##$TM1= 0
##$TM2= 0
##$TOPLEV= 0
##$USERP1= <user>
##$USERP2= <user>
##$USERP3= <user>
##$USERP4= <user>
##$USERP5= <user>
##$WDW= 1
##$XDIM= 8192
##$YMAX_p= 0
##$YMIN_p= 0
$$ End of Bruker specific parameters
$$ ---------------------------------
##NTUPLES= NMR FID
##VAR_NAME=  TIME,          FID/REAL,        FID/IMAG
##SYMBOL=    X,             R,               I
##VAR_TYPE=  INDEPENDENT,   DEPENDENT,       DEPENDENT
##VAR_FORM=  AFFN,          ASDF,            ASDF
##VAR_DIM=   8192,          8192,            8192
##UNITS=     SECONDS,       ARBITRARY UNITS, ARBITRARY UNITS
##FACTOR=    0.0002768,     1,               1
##FIRST=     0,             0,               0
##LAST=      2.2672688,     0,               0
##MIN=       0,             -624157,         0
##MAX=       2.2672688,     572609,          0
$$ Real data points
##PAGE= N=1
##DATA TABLE= (X++(R..R)), XYDATA
$$ [...]
$$ plain form
1849 44 264 -230 82 -77 -132 -80 -16 169 -53 28 -133 74 -77 41 -55 -113 146 -89 62 -202 -262 -182 297
1872 297 27 -142 -80 -164 -141 7 37 -65 -88 -29 -134 61 43 77 -242 27 178 -23 -111 -476 -70 181 -154
1895 -154 -210 -12 14 165 -28 -176 -16 82 67 82 -33 -5 -72 33 -212 -176 -25 -15 -88 -29 117 -298 231 -210
1919 -210 -150 -139 -72 9 61 129 -36 30 136 26 71 152 -87 38 90 -96 -53 -133 330 -66 -5 90 -92 66 202
1944 202 16 -149 -154 77 8 -242 69 103 151 -22 223 53 162 -428 -98 -139 -328 71 -99 80 69 158 -50
1967 -50 65 -10 -95 154 -120 36 -53 -42 138 -22 29 -67 -25 22 3 -93 -210 121 220 -195 -124 58 45 65 138
1992 138 195 186 -57 -66 -135 32 55 108 19 15 276 164 -59 -191 -28 -82 47 -131 39 -165 125 264 -129 149
2016 149 181 76 78 -249 -174 108 97 143 -53 -98 16 -108 117 298 -26 92 -44 152 -101 -86 121 -202 -46
$$ packed form
1849D4K20m94L12j59n5N2O4J85k22Q1j61K07j51J18r6n8K59k35J51k64o0Q0M79
1872B97k70j69O2q4K3J48L0j02k3N9j05J95j8L4l19K69J51k01q8l65M06K51l35
1895a54n6J98K6J51j93j48J60R8j5J5j15K8o7J05k45L6J51J0p3N9J46m15N29m41
1919b10O0J1O7Q1N2O8j65O6J06j10M5Q1k39J25N2j86M3q0M63l96O1R5j82J58J36
1944B02j86j65nK31o9k50L11L4M8j73K45j70J09n90L30m1j89L99j70J79j1Q9k08
1967e0J15p5q5K49k74J56q9J1J80j60N1r6M2M7j9r6j17L31R9m15P1J82j3K0P3
1992A38N7rk43ro9J67K3N3q9mK61j12k23j32J63n4J29j78J70k04K90J39l93K78
2016A49L2j05Kl27P5K82j1M6j96m5J14j24K25J81l24J18j36J96k53J5K07l23J56
$$ plain form
2039 -46 -121 -141 61 154 156 -286 25 -218 72 -297 -16 -197 -25 -99 136 95 -272 -139 68 44 -9 137 96 -135
2063 -135 -229 173 120 -109 -243 128 501 -301 72 -80 111 -182 54 76 156 -113 10 65 -143 -63 23 -28 -53
2086 -53 6 -243 -61 -188 -174 -68 10 92 -114 -69 58 -78 95 -61 336 -61 -43 112 65 247 11 21 213
2109 213 295 -170 -62 -143 -26 -58 -45 56 101 -11 126 -13 -215 72 147 -97 186 -12 6 -138 82 249
2131 249 124 290 33 -118 217 84 111 -90 80 48 -37 -154 -133 233 -51 161 -121 -93 140 -91 -37 226
2153 226 123 21 -39 15 -174 -220 63 -135 -68 96 -105 -106 -22 59 -5 -124 255 55 -146 -182 -177 103 -206 166
2177 166 -309 -14 -162 -230 107 -55 -61 70 141 104 25 -42 -81 -17 10 133 -5 -19 83 93 278 57 -2 203
2201 203 -27 10 -59 283 -96 -358 146 190 249 211 -96 -162 -474 18 -113 -6 8 11 118 -154 -56 -92 77 -173
$$ packed form
2039d6p5k0K02R3Km42L11k43K90l69K81j81J72p4K35m1l67J33K07k4n3J46m1k31
2063a35r4M02n3k29j34L71L73q02L73j52J91k93K36K2Q0k69J23N5k08Q0Q6n1k5
2086e3N9k49J82j27J4J06P8Q2k06M5J27j36J73j56L97l97J8J55m7J82k36J0J92
2109B13Q2m65J08q1J17l2J3J01M5j12J37j39k02K87P5k44K83j98J8j44K20J67
2131B49j25J66k57j51L35j33K7k01J70l2q5j17K1L66k84K12k82K8K33k31N4K63
2153B26j03j02o0N4j89m6K83j98O7J64k01jQ4Q1o4j19L79k00k01l6NK80l09L72
2177A66m75K95j48o8L37j62oJ31P1l7p9o7l9O4K7J23j38j4J02J0J85k21n9K05
2201B03k30L7o9L42l79k62N04M4N9l8l07o6l12M92j31J07J4LJ07k72R8l6J69k50
$$ plain form
2225 -173 -98 180 -94 -143 -153 19 210 -192 182 108 -164 0 -86 150 5 53 -238 110 173 -301 -45 72
2247 72 6 -318 75 150 6 307 138 -146 -9 -171 5 93 -186 -176 36 -148 319 -70 -237 -30 24 152
2269 152 -8 -251 7 53 323 189 -178 23 -147 259 42 68 126 151 76 3 108 -35 -8 88 38 -26 -121 -55
2293 -55 -138 264 214 -404 35 170 -31 84 -86 -115 -30 72 -147 251 -110 166 147 -85 122 111 -53 -19 -13
2316 -13 196 213 277 71 194 151 143 45 -27 255 -51 -19 -72 -40 19 136 123 93 -5 224 101 -121 -56 -112 270 38
2342 38 -7 -171 -234 193 143 202 -119 -206 183 157 3 71 222 7 156 49 124 137 -78 121 -118 135 56 20
2366 20 262 87 116 -174 -122 91 -117 188 22 69 -24 -45 63 262 111 -121 -57 -30 -29 -270 17 -8 10 353
2390 353 -78 -131 70 -49 -11 113 13 152 -5 153 89 10 34 -6 -98 69 -255 47 7 24 34 -31 -139 146
$$ packed form
2225a73P5K78k74m9j0J72J91m02L74p4k72J64q6K36j45M8k91L48O3m74K56J17
2247G2o6l24L93P5j44L01j69k84J37j62J76Q8k79J0K12j84M67l89j67K07N4J28
2269A52j60k43K58M6K70j34l67K01j70M06k17K6N8K5p5p3J05j43K7R6n0o4r5O6
2293e5q3M02n0o18M39J35k01J15j70k9Q5J02k19L98l61K76j9k32K07j1j64L4O
2316a3K09J7O4k06J23m3qr8p2K82l06L2n3L2N9J17j3l0r8K29j23k22O5n6L82k32
2342C8m5j64o3M27n0N9l21q7L89k6j54O8J51k15J49j07P5J3k15J99k39K53p9l6
2366B0K42j75K9k90N2K13k08L05j66M7r3k1J08J99j51k32O4K7Jk41K87k5J8L43
2390C53m31n3K01j19L8J24j00J39j57J58o4p9K4m0r2J67l24L02m0J7J0o5j08K85
$$ plain form
2414 146 26 249 201 66 -140 67 -26 58 137 41 14 86 137 -48 -25 16 46 176 -104 -285 -173 89 188 19
2438 19 45 17 237 -123 -23 -52 62 259 100 140 -135 -207 88 67 -47 -179 -112 47 -194 -113 150 -109 181
2461 181 145 -68 -25 98 -93 -140 194 87 39 -140 132 28 -242 34 133 20 -122 -64 -92 216 225 27 114
2484 114 172 106 84 99 -41 155 -18 -166 -8 176 112 17 35 -120 -22 -161 -43 -55 -61 227 -79 200 -122 -24
2508 -24 -33 -80 -135 -213 -5 4 134 14 92 -188 202 -176 21 47 -236 -141 20 -259 1 71 -2 21 -49 220 133
2533 133 146 -14 90 8 211 -3 159 308 -12 141 -32 161 -146 -282 169 -25 -169 312 -65 -54 -31
2554 -31 39 -396 -68 254 -35 -10 197 -105 -139 167 -287 138 145 27 -31 312 147 41 23 125 -230 159 111
2577 111 -3 -15 -59 -49 311 13 148 -223 -48 189 394 -41 -175 -46 -73 -3 148 -93 156 -35 -58 42
$$ packed form
2414A46j20K23m8j35k06K07r3Q4P9r6k7P2N1j85K3M1L0J30k80j81J12K62R9j69
2438A9K6k8K20l60J00k9J14J97j59M0k75p2K95k1j14j32O7J59k41Q1K63k59K90
2461A81l6k13M3J23j91m7L34j07m8j79K72j04k70K76R9j13j42N8k8L08Rj98Q7
2484A14N8o6k2J5j40J96j73j48J58J84o4r5J8j55R8j39J18j2oK88l06K79l22R8
2508b4rm7n5p8K08RJ30j20P8k80L90l78J97K6k83R5J61k79K60P0p3K3p0K69q7
2533A33J3j60J04q2K03k14J62J49l20J53j73J93l07j36M51j94j44M81l77J1K3
2554c1P0m35L28L22k89K5K07l02l4L06m54M25Pj18n8L43j65j06j8J02l55L89m8
2577A11j14j2m4J0L60k98J35l71J75K37K05m35j34J29k7P0J51k41K49j91k3J00
$$ plain form
2599 42 -112 164 -104 -274 205 -108 32 57 -63 34 -112 -22 6 153 111 -155 56 -114 -61 -103 30 -32 195
2622 195 -165 2 195 105 -46 -212 76 44 -161 -32 91 1 59 -42 -108 -217 -122 117 134 5 -220 -343
2644 -343 182 225 258 -137 86 18 24 -115 -235 36 5 -70 -59 -148 110 -279 131 -130 -175 8 -64 -264 20 87
2668 87 -175 43 -95 100 -70 -75 42 -14 -67 145 175 -131 176 -209 8 -134 99 294 5 110 177 171 -278
2691 -278 -58 89 -82 -213 -27 -44 171 34 -26 113 47 -21 -15 -99 -142 -188 34 201 135 338 -7 49 -170 -203
2715 -203 -268 -21 147 91 23 15 210 86 -55 216 68 38 94 -150 109 74 72 -115 -205 275 36 313 -251 166
2739 166 -133 -37 315 -316 149 -13 -7 -163 35 -138 17 88 -8 -82 24 190 -95 182 77 190 284 88
2761 88 -98 -38 -106 26 -152 -68 -158 -266 56 -246 -99 -25 78 212 184 -152 -18 168 -44 -44 -228 -235 -2 -158
$$ packed form
2599D2j54K76k68j70M79l13J40K5j20R7j46R0K8J47m2k66K11j70N3m2J33o2K27
2622A95l60J67J93r0j51j66K88l2k05J29J23r0N8j01o6j09R5K39J7j29k25j23
2644c43N25M3L3l95K23o8Oj39j20K71l1p5J1q9K58l89M10k61m5J83p2k00K84O7
2668H7k62K18j38J95j70nJ17n6n3K12L0l06L07l85K17j42K33J95k89J05O7om49
2691b78K20J47j71j31J86j7K15j37o0J39o6o8Oq4m3m6K22J67o6K03l45N6k19l3
2715b03o5K47J68n6o8qJ95j24j41K71j48l0N6k44K59l5kj87r0M80k39K77n64M17
2739A66k99R6L52o31M65j62Oj56J98j73J55P1r6p4J06J66k85K77j05J13R4j96
2761H8j86O0o8J32j78Q4r0j08L22l02J47P4J03J34k8l36J34J86k12%j84pK33j56
$$ plain form
2785 -158 -43 -9 -131 -54 -4 140 186 202 110 70 139 -131 -74 -42 14 -150 -105 94 314 106 -167 -101 96 -2 -99
2810 -99 -19 113 200 12 -9 87 65 47 -9 66 -298 29 -258 -302 -205 89 7 -100 -146 67 41 240 -119 -89 -112
2835 -112 -193 223 110 87 -110 71 39 163 49 -36 -275 -171 65 -122 106 -17 -73 33 -67 154 -381 -5
2857 -5 -134 52 126 -265 5 -164 157 190 223 -203 -120 119 -59 19 -24 83 -196 -97 245 -17 88 -320 109
2880 109 -155 113 -12 197 85 -88 -95 65 -22 -211 -132 270 -202 95 169 -144 -34 168 70 -222 -227 -25 -63
2903 -63 -40 -46 -17 -161 -143 261 -114 171 -78 -81 -97 -196 206 257 -84 72 -45 -14 138 95 13 249 136 -170 172
2928 172 -46 56 88 -3 83 -98 54 -70 123 183 -37 161 -13 153 67 -26 -29 214 20 -48 110 103 53 148
2952 148 67 19 -92 104 -80 -6 277 -20 42 289 -57 -51 72 -251 -43 -68 120 -77 208 -75 -44 63 41
$$ packed form
2785a58J15L4j22P7N0J44M6J6r2m0O9k70N7L2N6j64M5J99K20k08k73O6J97r8r7
2810i9Q0J32Q7j88k1R6k2j8n6P5l64L27k87m4R7K94q2j07m6K13k6J99l59L0k3
2835a12q1M16j13k3j97J81l2J24j14q5k39J04K36j87K28j23n6J06j00K21n35L76
2857ej29J86P4l91K70j69L21L3L3m26Q3K39j78P8m3J07k79R9L42k62J05m08M29
2880A09k64K68j25K09j12j73pJ60q7j89P9M02m72K97P4l13J10K02r8k92nK02l8
2903f3K3oK9j44J8M04l75K85k49lj6r9M02N1l41J56j17L1J52m3q2K36j13l06L42
2928A72k18J02L2r1Q6j81J52j24J93O0k20J98j74J66q6r3lK43j94o8J58pn0R5
2952A48q1m8j11J96j84P4K83k97O2K47l46OJ23l23K08k5J88j97K85k83L1J07k2
$$ plain form
2975 41 128 -70 33 -42 44 174 34 -162 -86 -75 -172 53 -173 -93 -25 37 -38 239 104 88 212 178 45 -114
2999 -114 -20 136 80 -138 3 -94 -9 -59 221 -317 -288 87 -98 -224 88 211 -14 360 122 -214 -37 121
3021 121 -131 147 -206 32 152 243 -52 -84 -29 -37 139 195 143 37 -25 69 -49 132 -201 81 -166 78 -61
3044 -61 -185 46 -70 -113 62 121 -93 7 -60 175 -22 -14 -56 9 7 -257 63 -5 33 -6 21 -201 -409 -333 -83
3069 -83 228 -1 -65 -95 -50 200 -29 82 81 -27 -66 168 -118 -144 152 -83 147 -335 -162 -136 115 -14 314
3092 314 -160 116 4 166 -197 145 -69 5 107 -65 58 -168 161 -86 -52 -40 90 196 346 -200 229
3113 229 -80 29 -40 288 245 177 221 -185 3 71 92 51 -33 176 -103 10 -5 78 44 -2 25 -133 -9 5 -85
3138 -85 249 7 -142 -125 82 -161 123 276 61 -134 24 -14 -116 -243 -61 196 -61 -217 116 -225 -97
$$ packed form
2975D1Q7j98J03p5Q6J30j40j96P6J1r7K25k26Q0O8O2p5K77j35j6J24l4j33j59
2999a14R4J56n6k18J41r7Q5n0K80n38K9L75j85j26L12J23k25L74k38l36J77J58
3021A21k52K78l53K38J20R1k95l2N5qJ76N6n2j06o2R4j18J81l33K82k47K44j39
3044f1j24K31j16m3J75N9k14J00o7K35j97Qm2O5kk64L20o8L8l9K7k22k08P6K50
3069h3L11k29o4l0M5K50k29J11jj08l9K34k86k6K96k35K30m82J73K6K51j29L28
3092C14m74K76j12J62l63L42k14P4J02j72J23k26L29k47L4J2J30J06J50n46M29
3113B29l09J09o9L28m3o8M4m06J88O8K1m1q4K09k79J13j5Q3l4m6K7j58J24J4r0
3138h5L34k42j49J7K07k43K84J53k15j95J58l8j02j27J82K57k57j56L33l41J28
$$ plain form
3159 -97 -210 101 207 -74 -24 223 21 -279 131 -65 15 -202 68 58 -114 69 55 505 60 29 -162 -38
3181 -38 89 -195 57 -34 -38 2 -145 -136 -186 10 -2 -121 -32 241 60 52 -19 -134 3 92 103 -194 -228 42 83 -25
3207 -25 -211 -9 -201 -202 89 19 234 225 178 319 -77 63 121 -45 75 120 -196 237 -97 -91 106 -27 18 -125
3231 -125 61 -193 -36 -103 -129 28 -61 116 169 432 31 263 4 -42 -223 -449 -75 -83 116 -177 -492 -119
3253 -119 171 -71 -168 182 -129 115 -170 -70 -44 -136 379 178 179 95 92 -221 19 76 145 42 -61 30 108 255
3277 255 -128 259 81 278 -163 -32 100 64 -132 215 -83 -254 -143 -130 -126 -49 -65 104 -63 109 -106 -211
3299 -211 94 -235 264 -40 98 4 98 138 160 -166 -208 208 -48 193 -115 -97 60 7 -98 61 83 -353 -73
3322 -73 140 -133 77 2 31 -24 137 -4 314 -153 -62 -144 -49 175 20 -84 -50 19 -132 -149 -250 113 72 13
$$ packed form
3159i7j13L11J06k81N0K47k02l00M10j96Q0k17K70j0j72J83j4M50m45l1j91J24
3181c8J27k84K52r1mM0j47Rn0J96j2j19Q9K73j81qp1j15J37Q9J1k97l4K70M1j08
3207b5j86K02j92jK91p0K15rm7J41l96J40N8j66J20M5l16M33l34OJ97j33M5j43
3231a25J86k54J57o7k6J57q9J77N3K63m01K32k59m6j81k26L74qJ99k93l15L73
3253a19K90k42r7L50l11K44k85J00K6r2N15k01Jq4ll13K40N7O9j03j03R1P8J47
3277B55l83L87j78J97m41J31J32l6j96L47k98j71J11J3MP7j6J69j67J72k15j05
3299b11L05l29M99l04J38r4R4M0K2l26m2M16k56K41l08J8J57n3j05J59K2m36K80
3322g3K13k73K10p5K9n5J61j41L18m67R1q2R5K24j55j04L4O9j51j7j01L63m1n9
$$ plain form
3346 13 54 278 -70 82 231 -37 -128 -187 96 118 -194 48 -91 -113 -79 102 253 -123 263 -45 -42 77 -141
3369 -141 108 -269 192 114 -234 60 163 -110 122 -49 -80 -3 38 -207 76 106 124 -12 -128 -225 -31 -228
3391 -228 106 206 225 -141 278 70 162 -20 -174 -126 -247 -256 -348 -61 233 -15 99 15 -59 -28 54 161 -70
3414 -70 -46 5 -196 -34 -93 138 -202 71 -256 -66 64 -15 119 100 -13 74 232 -141 -54 4 149 55 -62
3437 -62 365 -39 -50 -143 142 7 -18 155 132 7 72 15 82 -80 23 -61 126 55 -14 -176 136 178 -62 14
3461 14 69 127 -284 129 81 -44 -11 -97 22 57 47 5 -383 234 68 -141 16 358 57 -42 109 95 -199 160
3485 160 255 33 152 -198 -53 3 -60 -22 -78 207 -150 122 79 84 -167 87 -24 -139 38 74 135 -118 -124 -55
3509 -55 5 -40 52 -54 220 -108 62 112 -211 -51 26 -106 -13 -49 12 135 -140 190 -35 141 -219 -62 -22
$$ packed form
3346A3M1K24l48J52J49k68r1n9K83K2l12K42j39k2L4J81J51l76L86l08LJ19k18
3369a41K49l77M61p8l48K94J03k73K32j71l1P7M1k45K83L0J8j36j16r7J94j97
3391b28L34J00J9l66M19k08R2j82j54M8j21rr2K87K94k48J14q4p4L1Q2J07k31
3414g0K4N1k01J62n9K31l40K73l27J90J30p9J34j9j13Q7J58l73Q7N8J45r4j17
3437f2M27m04j1r3K85j35k5J73k3j25O5n7O7j62J03q4J87p1o9j62L12M2k40P6
3461A4N5N8m11M13m8j25L3q6J19L5j0m2l88O17j66k09J57L42l01r9J51j4k94L59
3485A60R5k22J19l50J45N6o3L8n6K85l57K72m3Nk51K54j11j15J77L6O1k53oO9
3509e5O0m5R2j06K74l28J70N0l23J60P7j32R3l6O1J23k75L30k25J76l60J57M0
$$ plain form
3532 -22 -250 -109 -380 30 247 65 193 150 -104 85 -82 -217 22 126 110 -10 -52 -88 75 244 -42 39
3554 39 213 190 125 184 -84 -97 125 -12 -46 -124 -141 14 37 -167 125 -408 27 -150 -83 103 -85 -79 -138 -25
3578 -25 -55 -39 47 3 89 22 109 322 72 -235 -38 23 111 61 132 -108 -55 176 -62 184 -15 352 -72 -3 -120
3603 -120 260 -60 41 -9 78 -63 301 138 -167 -19 104 -154 46 -83 89 -103 122 -205 162 27 -38
3624 -38 -120 -86 -131 -34 -11 -107 195 48 55 -103 46 -51 167 -86 -64 37 -97 -165 91 217 59 -235 -6 -27
3648 -27 -287 52 -35 -95 69 265 22 79 -234 20 267 291 -95 332 67 9 42 -2 -12 237 -2 77 18 28
3672 28 70 -231 -9 260 -58 59 -87 -82 71 83 -146 -114 -112 -243 383 -67 103 -28 29 -109 -133 22 241
3695 241 -50 -230 -25 -122 -12 186 49 275 205 -80 325 -138 4 110 174 -130 -164 -344 -18 106 -6
$$ packed form
3532b2k28J41k71M10K17j82J28m3k54J89j67j35K39J04j6j20m2l6J63J69k86Q1
3554C9J74k3o5N9k68j3K22j37l4p8j7J55K3k04K92n33M35j77O7J86j88On9J13
3578b5l0J6Q6m4Q6o7Q7K13k50l07J97O1Q8n0P1k40N3K31k38K46j99L67m24O9j17
3603a20L80l20J01n0Q7j41L64j63l05J48J23k58K00j29J72j92K25l27L67j35o5
3624c8q2L4m5R7K3r6L02j47Pj58J49r7K18k53K2J01j34o8K56J26j58k94K29k1
3648b7k60L39q7o0J64J96k43N7l13K54K47K4l86M27k65n8L3m4j0K49k39P9n9J0
3672B8M2l01K22K69l18J17j46NJ53J2k29L2Kj31O26m50J70j31N7j38k4J55K19
3695B41k91j80K05r7J10J98j37K26p0k85M05m63J42J06O4l04l4j80L26J24j12
$$ plain form
3716 -6 -89 -39 -35 154 -106 31 268 -36 -133 62 -17 158 230 -128 -153 -172 216 294 139 -168 127 167 141 -120 -104
3741 -104 315 -106 -148 145 39 20 -113 121 119 153 -36 346 -227 -106 123 71 -165 358 32 -97 -58 153
3763 153 -56 187 -251 -374 233 105 32 144 24 216 275 -251 -123 -44 104 195 -315 94 -57 -100 34 -23
3785 -23 -71 -76 -41 -111 -58 101 179 189 -69 34 82 204 192 240 -71 -148 80 -2 79 -150 125 20 -42 -8 196 10
3811 10 -172 161 104 -59 -92 -237 72 -1 -14 237 202 68 -61 154 73 38 49 -92 -145 3 68 -34 -112 154
3835 154 204 -10 83 217 374 157 279 -32 -12 52 -34 99 -51 -57 108 -95 -93 24 142 57 -76 -114 57 -201
3859 -201 -90 77 -7 -55 -114 -95 -107 -60 185 -11 -165 170 17 -159 -82 13 4 -89 178 -148 -37 134 79 -50
3883 -50 284 11 113 56 194 -33 162 119 8 -29 -39 122 -73 -185 -46 -42 -158 262 226 -60 30 -142 72
$$ packed form
3716fq3N0MJ89k60J37K37l04r7J95p9J75P2l58k5j9L88P8j55l07K95M0k6k61J6
3741a04M19m21m2K93j06j9j33K34kL4j89L82n73J21K29n2k36N23l26j29L9K11
3763A53k09K43m38j23O07j28p3J12j20J92N9n26J28P9J48R1n10M09j51m3J34n7
3785b3m8nL5p0N3J59P8J0k58J03M8J22j2M8l11p7K28q2Q1k29K75j05o2L4K04j86
3811A0j82L33n7j63l3j45L09p3j3K51l5j34j29K15q1l5J1j41n3J48O5j02p8K66
3835A54N0k14R3J34J57k17J22l11K0O4q6J33j50oJ65k03KJ17J18q5j33l8J71k58
3859b01J11J67q4m8n9J9j2M7K45j96j54L35j53j76P7R5rr3K67l26J11J71n5j29
3883e0L34k73J02n7J38k27J95m3j11l7j0J61j95j12J39Mj16M20l6k86R0j72K14
$$ plain form
3906 72 -122 -72 -8 96 63 -10 -17 -201 21 -170 36 185 144 19 -227 1 112 -144 21 152 19 109 -26
3929 -26 112 197 364 74 144 -70 78 -166 99 -221 -7 60 -209 -135 -121 119 26 -107 28 43 -140 -157 -193
3952 -193 -28 20 -74 -154 83 10 128 -130 -70 -140 -78 -155 -72 -94 -88 194 182 84 -40 -206 88 -8 -22 -37 4 -73
3978 -73 132 -89 252 -64 178 194 -161 214 -48 -35 -86 324 -260 14 112 166 -107 71 -45 -227 181 -8
4000 -8 178 149 -167 -329 -136 -116 -19 -87 -353 -152 -26 67 -31 121 80 168 69 -53 -147 54 -128 -73 -61 -33 -168
4025 -168 -13 72 -34 -103 326 -112 38 -39 308 -127 -20 -141 51 -49 107 101 -100 45 8 132 91 -69
4047 -69 -144 -40 -31 -67 83 -6 -185 226 -213 -249 -26 -87 -127 -336 -145 -39 -75 93 -108 -126 194 -69 -321 -11
4071 -11 38 215 -208 28 50 -94 3 159 44 189 -75 52 -145 -15 386 -238 81 -60 -115 106 -166 50
$$ packed form
3906G2j94N0O4J04l3p3pj84K22j91K06J49m1j25k46K28J11k56J65J31j33R0j35
3929b6J38Q5J67k90P0k14J48k44K65l20K14O7k69P4J4K40r3j33J35J5j83j7l6
3952a93J65M8r4q0K37p3J18k58O0p0O2p7Q3k2OK82j2r8j24j66K94r6j4j5M1p7
3978g3K05k21L41l16K42J6l55L75k62J3n1M10n84K74R8N4k73J78j16j82M08j89
4000hJ86k9l16j62J93K0R7o8k66K01J26R3r8J52m1Q8r9j22r4K01j82N5J2K8j35
4025a68J55Q5j06o9M29m38J50p7L47m35J07j21J92j00J56ok01J45l7J24m1j60
4047f9p5J04Rl6J50q9j79M11m39l6K23o1m0k09J91J06l6J68k01j8L20k63k52L10
4071a1M9J77m23K36K2j44R7J56j15J45k64J27j97J30M01o24L19j41n5K21k72K16
$$ plain form
4093 50 -59 -61 238 65 156 288 120 -258 -227 -33 -214 43 -52 241 75 224 62 149 254 81 96 -163 -28
4116 -28 28 -33 -192 -74 -158 -123 -73 -83 -172 193 89 -187 -87 -26 128 -199 -186 -114 3 142 57 -57 84 83 -19
4141 -19 -188 6 -8 212 -151 -102 -213 -209 -194 -92 -112 281 11 -39 -128 108 -272 180 -101 -21 -91 -99 -68 31 -14
4166 -14 3 76 -47 37 10 -169 -135 350 -276 -307 143 153 -112 171 13 -278 -80 -18 -4 -205 -81 -186 31
4189 31 42 64 0 234 -188 -111 84 -173 -194 132 171 -389 -8 31 5 251 -231 -31 101 -178 86 23 107 -201
4213 -201 112 75 111 67 -38 -229 65 -66 94 -60 170 121 139 156 -225 -320 185 -239 -42 7 134 97 178
4236 178 228 27 1 33 -124 -132 112 -80 287 11 7 -86 110 -19 92 131 167 60 -181 76 -120 -38 -127 212
4260 212 269 22 -232 -19 -112 -314 1 -335 4 -243 -76 189 171 207 -220 -161 -24 -233 158 106 25 363
$$ packed form
4093E0j09kK99j73R1J32j68l78L1J94j81K57r5K93j66J49j62Q7J05j73J5k59J35
4116b8N6o1j59J18q4L5N0j0q9L65j04k76J00O1J54l27J3P2J17J39q5j14J41jj02
4141a9j69J94j4K20l63M9j11MJ5J02k0L93k70n0q9K36l80M52k81Q0p0qL1R9m5
4166a4J7P3j23Q4k7j79L4M85o26l1M50J0k65K83j58k91J98O2J4k01J24j05K17
4189C1J1K2o4K34m22P7J95k57k1L26L9n60L81L9k6K46m82K00J32k79K64o3Q4l08
4213b01L13l7L6m4j05j91K94j31J60j54K30m9J8J7l81r5N05m24J97M9J27l7Q1
4236A78N0k01k6L2j57qK44j92L67k76mr3J96j29J11L9L6j07k41K57j96Q2q9L39
4260B12N7k47k54K13r3k02L15l36L39k47J67K65j8L6m27N9J37k09L91n2q1L38
$$ plain form
4282 363 -72 109 -51 265 154 194 -100 18 188 53 135 -173 369 47 -177 -46 89 -30 -59 -291 97
4303 97 59 -124 20 14 -169 32 33 69 31 -30 153 -96 90 -90 32 -137 -35 139 -11 -75 49 114 -230 -2
4327 -2 93 123 176 -105 -194 83 -31 55 199 -75 85 -170 126 41 213 6 235 -135 26 -72 162 149 109 -145
4351 -145 81 72 39 77 -99 -351 1 -9 -87 -62 -33 49 120 -145 -135 -173 203 280 -162 -148 -31 -302 -23 53 93
4376 93 -85 73 -75 -273 287 -56 -197 -231 124 22 155 124 -31 -316 183 15 134 104 -217 248 -267
4397 -267 -154 -1 177 -277 65 -30 102 147 -213 -12 -307 -74 -237 220 57 218 73 97 -73 56 -65
4418 -65 79 10 102 111 -257 -85 -47 -183 61 -127 138 149 69 92 52 -128 -7 -46 371 -187 -38 -13 -100 -46 -273
4443 -273 231 -93 99 -19 201 -17 -13 122 -71 119 -27 157 -254 -68 -58 -70 121 -143 112 -140 -5
$$ packed form
4282C63m35J81j60L16j11M0k94J18J70j35Q2l08N42l22k24J31J35j19k9k32L88
4303I7l8j83J44oj83K01JL6l8o1J83k49J86j80J22j69J02J74j50o4J24O5l44K28
4327bR5L0N3k81q9K77j14Q6J44k74J60k55K96q5J72k07K29l70J61r8K34j3m0k54
4351a45K26rl3L8j76k52L52j0p8K5K9Q2P1k65J0l8L76P7m42J4J17k71K79P6M0
4376I3j78J58j48j98N60l43j41l4L55j02J33l1j55k85M99j68J19l0l21M65n15
4397b67J13J53J78m54L42r5J32M5l60K01k95K33j63M57j63J61j45K4j70J29j21
4418f5J44o9R2Rl68J72L8j36K44j88K65J1q0K3m0j80J21l9M17n58J49K5q7N4k27
4443b73N04l24J92j18K20k18MJ35j93J90j46J84m11J86J0j2J91k64K55k52J35
$$ plain form
4464 -5 -79 108 -151 160 72 25 197 -71 -26 208 -19 18 -32 -211 198 244 278 173 -132 -20 111 71 -141 -234
4488 -234 159 75 116 -130 -56 -76 -100 -174 72 -129 -170 88 -68 -88 65 19 -6 221 48 42 126 12 35 404 -4
4513 -4 87 -91 49 -260 -47 52 -75 -83 132 236 -160 -35 27 2 -65 118 167 276 -243 -92 0 105 0 97
4537 97 -12 -177 134 76 -42 147 56 -34 12 47 282 99 196 -201 93 88 -186 -105 -34 201 62 -131 60 24
4561 24 34 216 122 174 146 229 14 160 -82 -147 -237 192 215 -6 84 46 18 209 28 -68 86 -4 -251 -58 152
4586 152 118 -136 184 137 38 9 -205 381 -102 -42 -204 137 2 -226 163 336 -31 112 48 135 -17 127
4608 127 242 -46 18 139 -262 -175 -84 135 -394 -297 221 79 -192 -105 -234 270 -50 149 -78 82 175 -74
4630 -74 46 -88 -188 -111 -14 -358 -167 -75 -296 -46 113 23 194 -69 112 60 -24 -15 -58 -140 -106 -63 322 115
$$ packed form
4464ep4J87k59L11q8m7J72k68M5K34k27L7n0j79M09M6L4j05l05J12J31m0k12r3
4488b34L93q4M1k46P4k0k4p4K46k01m1K58j56k0J53m6k5K27j73oQ4j14K3L69m08
4513dR1j78J40l09K13R9j27qK15J04l96J25O2k5o7J83M9J09n19J51R2J05j05R7
4537I7j09j65L11n8j18J89r1r0M6L5K35j83R7l97K94nk74Q1P1K35j39j93J91l6
4561B4J0J82r4N2k8Q3k15J46k42o5r0M29K3k21R0l8k8J91j81r6J54r0k47J93K10
4586A52l4k54L20m7r9k9k14N86m83O0j62L41j35k28L89J73l67J43o4Q7j52J44
4608A27J15k88O4J21m01Q7R1K19n29R7N18j42k71Q7j29N04l20J99k27J60R3k49
4630g4J20j34j00P7R7l44J91R2k21K50J59r0J71k63J81n2q4Rm3q2L4M3L85k07
$$ plain form
4654 115 93 110 -289 -88 -207 -201 -110 -71 -33 -137 146 -2 -9 -252 -31 25 -43 81 19 -201 27 9 157 -32
4678 -32 60 35 77 67 60 -266 -64 240 306 -19 -82 -70 -250 -17 -43 -66 7 111 0 239 73 160 189 204 -101
4703 -101 -68 197 7 13 -61 9 -9 -145 -283 -44 32 -46 182 96 77 -3 111 -44 31 -125 -189 -33 90 -296
4727 -296 112 -184 -24 -156 28 -140 -31 141 54 99 -118 -33 -144 -221 -160 8 43 29 29 -238 -117 -34 -1 -166
4751 -166 -65 -62 -176 188 -121 -75 18 7 130 -203 -31 84 -100 25 4 88 -91 172 122 -66 13 76 140 287
4775 287 186 -27 -24 -146 245 -94 -232 210 -152 -27 -17 70 -273 141 22 185 243 -30 62 342 100 101 104
4798 104 -126 64 -180 141 -223 -79 50 -44 -22 -16 72 -101 64 -27 -57 -144 95 -264 -71 118 -137 31 125
4821 125 66 -91 30 90 218 -203 39 223 -180 125 -116 66 -9 -153 -5 261 20 -46 198 -26 140
$$ packed form
4654A15k2J7l99K01j19OR1L9L8j04K83j48pk43K21N6o8J24o2k20K28j8J48j89
4678c2R2k5M2j0pl26K02L04O6l25o3J2j80K33k6k3P3J04j11K39j66Q7K9J5l05
4703a01L3K65j90Op4P0j8j36j38K39P6p8K28q6j9q0J14j55P5j56o4J56J23l86
4727b96M08k96J60j32J84j68J09J72q7M5k17Q5j11p7O1J68L5j4%k67J21Q3L3j65
4751a66J01Lj14L64l09M6R3j1J23l33J72J15j84J25k1Q4j79K63n0j88P9O3O4J47
4775B87j01k13Lj22L91l39j38M42l62J25J0Q7l43M14j19J63N8k73R2K80k42JL
4798A04k30J90k44L21l64J44J29r4K2OQ8j73J65r1l0q7K39l59J93J89k55J68R4
4821A25n9j57J21O0J28m21K42J84m03L05k41J82p5j44J48K66k41o6K44k24J66
$$ plain form
4842 140 130 52 -113 -10 86 -16 109 -117 116 -273 59 -37 -115 57 -128 -11 77 -194 -133 61 372 -83
4864 -83 13 33 180 70 -115 -77 71 -15 230 -146 89 -102 19 24 -150 152 103 63 -27 -46 161 20 -57 199
4888 199 138 21 184 213 17 66 -76 23 5 -207 -83 287 -38 157 -142 -89 -11 216 -35 4 -287 -22 -134
4911 -134 -284 31 -224 -43 -184 -184 150 16 -208 155 -306 315 -1 -5 7 188 -7 -58 -224 95 104 -107 -110
4934 -110 -128 34 -204 -64 -56 -91 -33 -56 107 -88 130 -47 -168 -41 259 -273 -58 -228 -260 32 -169 -183 -8
4957 -8 168 -261 135 -69 70 -81 91 -141 -43 29 27 14 -12 -223 3 -21 17 79 -75 -40 -179 -99 167 143 107
4982 107 -251 -206 6 -137 48 49 -65 -113 199 221 -15 -151 -159 100 300 112 94 -168 215 -257 79 -101 93
5005 93 -60 -118 0 60 -50 -156 18 -159 250 -145 16 61 -101 26 1 143 111 -22 73 226 -233 -224 253
$$ packed form
4842A40j0p8j65J03R6j02J25k26K33l89L32r6p8J72j85J17Q8k71O1J94L11m55
4864h3R6K0J47j10j85L8J48q6K45l76K35j91J21Nj74L02m9m0r0j9K07j41p7K56
4888A99o1j17J63K9j96M9j42R9j8k12J24L70l25J95k99N3P8K27k51L9k91K65j12
4911a34j50L15k55J81j41%L34j34k24L63m61O21l16mJ2J81j95n1j66L19Rk11l
4934a10j8J62k38J40Ql5N8k3J63j95K18j77j21J27L00n32K15j70l2K92k01j4J75
4957hJ76m29L96k04J39j51J72k32R8P2kj3k6k11K26k4L8O2j54L5j39Q0K66k4l6
4982A07l58M5K12j43J85Jj14m8L12K2k36j36qK59K00j88j8k62L83m72L36j80J94
5005I3j53n8J18O0j10j06J74j77M09l95J61M5j62J27k5J42l2j33R5J53m59RM77
$$ plain form
5028 253 152 172 -69 94 35 -188 -96 -18 131 48 20 -44 -147 -29 -97 -210 -171 8 -90 -140 46 64 -65 -123
5052 -123 -124 75 104 -2 -62 333 60 21 -72 290 24 22 70 -86 -93 113 334 -14 41 80 -54 -132 -267 22 26
5077 26 214 43 17 233 -197 -112 -109 17 -62 -122 -267 30 -89 -205 -79 152 163 -129 48 -83 -146 28 -49
5100 -49 12 -229 217 100 280 -123 -88 -202 206 227 -167 71 -361 -122 -68 211 -101 165 -128 -259 -122 -162
5122 -162 -158 303 248 194 -36 -48 42 -66 65 319 -147 -399 -202 -11 6 -111 -22 168 -22 -44 -93 122 30 0
5146 0 -214 -52 174 27 193 24 2 -153 267 -183 -130 156 24 57 -33 23 -278 -126 -58 -199 -108 49 82
5169 82 -5 5 6 -148 96 4 -29 312 -71 86 86 -36 -284 -25 34 -160 -65 231 178 219 104 199 -96 -64 -122
5194 -122 227 35 12 262 11 222 194 -27 8 -326 -52 158 177 -86 148 228 163 -254 -42 -153 66 -80
$$ packed form
5028B53j01K0k41J63n9k23R2P8J49q3k8o4j03J18o8j13L9J79r8n0J86J8j29n8
5052a23jJ99K9j06o0L95k73l9r3L62k66kM8j56pK06K21l48N5L9j34p8j35K89M
5077B6J88j71k6K16m30Q5LJ26p9o0j45K97j19j16J26K31J1k92J77j31o3J74p7
5100d9O1k41M46j17J80m03L5j14M08K1l94K38m32K39N4K79l12K66k93j31J37m0
5122a62MM61n5n4k30j2R0j08J31K54m66k52J97J91J7j17Q9J90j90k2m9K15r2l0
5146@k14J62K26j47J66j69k2j55M20m50N3K86j32L3r0N6l01J52O8j41R1J57L3
5169H2q7J0Jj54K44r2l3L41l83J57%j22k48K59N9j94R5K96n3M1j15R5k95L2n8
5194a22L49j92k3K50k51K11k8k21L5l34K74K10J9k63K34Q0o5m17K12j11K19j46
$$ plain form
5216 -80 -58 18 175 -253 -311 -152 255 96 62 -209 -93 -305 -100 94 -158 1 227 185 -10 -27 -134 111
5238 111 -99 -99 -12 171 353 82 -11 137 422 27 121 33 -293 -420 -457 -89 -21 -231 -61 -74 37 -26 -230
5261 -230 128 -135 -221 -50 27 86 -188 -64 23 358 37 -57 -96 70 -12 82 -19 -80 141 -55 -75 -71 34 -11
5285 -11 114 17 320 196 -39 -122 67 -132 -172 92 174 -356 202 60 -277 -231 -168 119 108 87 -116 119 -222
5308 -222 -137 7 140 -162 0 69 -19 53 16 171 47 280 34 -219 -39 62 -7 -105 -44 94 -29 -167 35
5331 35 51 -167 252 47 -126 -155 56 -80 153 205 101 -138 219 -83 -13 -95 -57 -88 -33 -35 50 -197 64 167
5355 167 84 106 -201 313 -226 -128 -231 -80 127 94 -260 38 -6 155 77 56 -108 -422 -42 113 12 -218
5377 -218 -89 -82 298 33 -3 13 60 167 41 -191 -199 13 29 -99 2 -142 203 8 70 -51 -152 -20 -67
$$ packed form
5216h0K2P6J57m28n8J59M07j59l4k71J16k12K05J94k52J59K26m2j95j7j07K45
5238A11k10%Q7J83J82k71r3J48K85l95R4q8l26j27l7L68O8k10J70j3J11o3k04
5261b30L58k63q6J71P7N9k74J24Q7L35l21r4l9J66q2R4j01o1K21j96k0MJ05m5
5285a1J25r7L03j24k35q3J89j99m0K64Q2n30N58j42l37M6O3K87j1k1k03K35l41
5308b22Q5J44J33l02J62O9q8P2l7J55j24K33k46k53J80J01o9r8O1J38j23j38K02
5331C5J6k18M19k05j73k9K11j36K33N2j04k39L57l02P0q2L8l1N5kQ5k47K61J03
5355A67q3K2l07N14n39R8j03J51K07l3l54K98m4J61p8k1j64l14L80J55j01k30
5377b18J29PL80k65l6J6M7J07j26k32qK12J6j28J01j44L45j95O2j21j01J32m7
$$ plain form
5400 -67 44 75 70 227 -73 124 5 -44 172 -73 109 43 155 -44 122 53 -269 -7 186 -96 -126 79 22
5423 22 88 247 -73 -222 157 -101 42 -201 144 73 -74 -38 39 -137 291 145 -94 21 317 -207 -216 162
5445 162 -131 211 207 -141 -275 -11 -146 -6 -232 32 -238 -113 14 -51 79 125 122 -100 -43 226 -107 -108 -31
5468 -31 64 16 119 -242 -138 142 -101 -56 -165 28 -75 148 -12 -115 -4 103 -238 85 -99 -76 79 -42
5490 -42 258 -156 28 19 79 -40 -26 -51 97 -103 -81 58 134 36 -12 313 52 44 -64 88 -6 12 -88 -212 60
5515 60 -67 103 329 43 -53 -215 18 -53 -171 -206 -18 216 -85 34 -184 375 -172 298 -117 -102 73 -243
5537 -243 131 -103 87 -5 -41 263 16 232 117 -186 168 272 126 185 -96 -271 -114 -12 45 -135 56
5558 56 83 -71 -210 95 249 99 -45 -199 -151 -160 105 -4 32 -158 115 -82 -127 123 -84 -30 -326 -206 -130
$$ packed form
5400f7J11L1nJ57l00J97j19m9K16k45J82o6J12j99J66o9l22K62J93k82l0K05n7
5423B2O6J59l20j49L79k58J43k43L45p1j47L6P7j76M28j46k39J15K96n24rL78
5445A62k93L42ml48j34K64j35J40k26K64k70J25J27o5J30M6lk22N7K69l33jP7
5468c1R5m8J03l61J04K80k43M5j09J93j03K23j60j03J11J07l41L23j84K3J55j21
5490d2L00m14J84rO0j19J4k5J48k00K2J39P6r8m8L25k61qj08J52r4J8j00j24K72
5515F0j27J70K26k86r6j62K33p1j18l5J88K34l01J19k18N59n47M70m15J5J75l16
5537b43L74k34J90r2l6L04k47K16j15l03L54J04j46N9k81j75J57J02N7j80J91
5558E6K7j54j39L05J54j50j44j54M8rK65j09L6j90K73j97m5K50k07N4k96J20P6
$$ plain form
5581 -130 -151 -216 126 -25 -345 -23 63 177 80 -87 -87 -118 -261 28 49 -114 118 75 336 97 -54 -76 401
5604 401 -123 -251 134 44 63 61 -4 -105 -22 83 48 -122 -77 -136 -226 153 312 68 183 -119 -50 -5 123 -7
5628 -7 -79 67 -115 -123 205 149 105 -214 376 -4 -280 -186 222 223 -159 136 17 130 -162 -39 -89 -46 -321 -34
5652 -34 125 66 153 274 -29 -399 73 211 -285 319 -17 194 212 228 217 5 9 247 132 57 -14 57 358 -241
5676 -241 -220 -13 -3 -65 82 -111 -64 37 -48 -198 172 -72 -71 -3 76 -308 -205 135 194 116 20 83 -133 4
5700 4 -127 -196 -331 144 318 -115 -104 -198 96 -91 57 -20 -49 -199 -200 -58 -1 -120 97 127 20 108 -26 -47
5724 -47 -92 -6 -27 -118 -98 -99 -76 -87 -214 195 -75 6 83 -53 75 361 14 9 254 24 -249 201 49 -335 212
5749 212 87 260 -15 24 -1 -113 -230 -58 116 73 79 -95 321 75 -138 -13 8 -89 -46 11 83 95 14 -223
$$ packed form
5581a30k1o5L42j51l20L22Q6J14r7j67%l1j43K89K1j63K32m3K61k39j51k2M77
5604D01n24j28L85r0J9ko5j01Q3J05l5j70M5n9r0L79J59k44J15l02O9M5J28j30
5628gp2J46j82qL28n6m4l19N90l80k76R4M08Jl82K95j19J13k92J23n0M3k75K87
5652c4J59n9Q7J21l03l70M72J38m96O04l36K11J8J6j1k12MK38j15p5p1P1L01n99
5676b41K1K07J0o2J47j93M7J01q5j50L70k44JO8P9l84J03L40N9p8r6O3k16J37
5700Dj31o9j35M75J74m33J1r4K94j87J48p7k9j50jJ42N7j19K17L0j07Q8j34k1
5724d7m5Q6k1r1K0jK3j1j27M09k70Q1P7j36J28K86l47nK45k30k73M50j52l84N47
5749B12j25J73k75L9k5j12j17J72J74m3Oj74M16k46k13J25K1r7M3N7P2J2q1k37
$$ plain form
5773 -223 51 13 -132 -47 67 178 -230 -81 -12 -72 -88 239 113 -101 -111 -6 23 115 1 403 42 86 -148
5796 -148 -341 182 -57 192 -17 -5 102 146 93 235 85 170 -126 -74 -212 -10 -93 -41 114 245 -193 -157 124
5819 124 226 -165 44 10 37 232 -90 5 -86 -218 -5 89 231 167 340 -67 -24 -20 82 204 88 -70 306
5842 306 -452 -64 62 12 60 295 -158 206 5 77 -47 -118 -137 71 -84 122 -98 -10 -70 -164 114 24 57
5865 57 -78 129 146 249 -264 -140 55 193 170 224 98 266 186 60 66 172 -38 -260 261 99 178 -50 -85
5888 -85 232 -27 -57 -249 -66 -1 211 -164 -157 242 -25 -72 62 -154 -61 157 78 227 123 29 157 -117 -62
5911 -62 34 130 189 -13 -180 -159 -63 55 82 -115 159 -60 -346 94 -205 -66 142 184 -8 89 143 -64 19 -18
5935 -18 -154 106 -13 -169 -161 170 116 -122 84 147 61 -167 -49 72 130 -342 -166 136 -308 -110 253 168 34
$$ packed form
5773b23K74l8j45Q5J14J11m08J49O9o0j6L27j26k14j0J05K9R2j14M02l61M4k34
5796a48j93N23k39K49k09J2J07M4n3J42j50Q5k96N2j38K02q3N2J55J31m38L6K81
5819A24J02l91K09l4K7J95l22R5r1j32K13R4J42o4J73m07M3MJ02J22j16j58L76
5842C06p58L88J26n0M8K35m53L64k01P2j24p1j9K08j55K06k20Q8o0r4K78r0L3
5865E7j35K07J7J03n13J24J95J38k3N4j26J68q0j26OJ06k10k22N21j62P9k28l5
5888h5L17k59l0j92J83O5K12l75PL99k67m7J34k16R3K18p9J49j04r4J28k74N5
5911f2R6R6N9k02j67K1R6J18K7j97K74k19k86M40k99J39K08M2j92R7N4k07Q3l7
5935a8j36K60j19j56QL31n4k38K06O3q6k28J18J21N8m72J76L02m44J98L63q5j34
$$ plain form
5958 34 196 272 -24 29 186 89 -59 -30 190 -49 180 -72 13 109 63 83 117 -49 -172 -100 -154 2 63 85 167
5983 167 10 7 -54 171 -103 -100 63 44 -7 -212 142 -110 239 -13 8 250 -92 110 187 -66 73 -14 -121
6006 -121 20 -136 93 -8 -4 75 -286 -140 -219 90 -161 55 142 -247 67 49 110 27 21 177 67 1 19 -190
6030 -190 286 31 103 80 -68 -116 -226 -14 -11 5 -95 80 229 -232 -173 -192 158 -117 -52 -174 149 3 -328
6053 -328 -45 230 190 93 -13 -86 66 -153 -8 124 -79 -18 106 56 -178 103 92 156 120 191 159 -57 -44 2
6077 2 -83 -81 -47 -29 -54 55 67 -79 220 45 28 -173 -65 215 121 -95 261 -130 -488 -118 26 -313 -188 -30
6101 -30 103 31 36 109 23 -149 -68 145 37 214 -254 91 68 -3 -118 9 -182 19 -33 10 -2 0 -72 -89 -113 112
6127 112 232 46 -25 15 -7 -69 -10 -86 387 -36 319 58 26 -55 42 210 -117 49 -85 -137 122 131 69 277
$$ packed form
5958C4J62P6k96N3J57r7j48K9K20k39K29k52Q5R6m6K0L4j66j23P2n4J56O1K2Q2
5983A67j57lo1K25k74LJ63j9n1k05L54k52L49k52K1K42l42K02P7k53J39q7j07
6006a21J41j56K29j01MP9l61J46p9L09k51K16Q7l89L14j8O1q3oJ56j10o6J8k09
6030a90M76k55P2k3j48m8j10K12LJ6j00J75J49m61N9j9L50k75O5j22L23j46l31
6053c28K83K75m0r7j06p3J52k19J45J32k03O1J24n0k34K81j1O4l6P1l2k16J3M6
6077Bq5KL4J8k5J09J2j46K99j75j7k01J08K80r4k16L56l91l58L70J44l39J25J58
6101c0J33p2NP3q6j72Q1K13j08J77m68L45k3p1j15J27j91K01n2M3j2Kp2j7k4K25
6127A12J20j86p1M0k2o2N9p6M73m23L55k61l2q1R7J68l27J66j34n2K59Ro2K08
$$ plain form
6151 277 -133 21 -82 114 -42 184 10 62 159 -140 202 31 -187 14 263 109 47 29 21 283 -213 -42
6173 -42 104 -108 -288 14 -128 49 189 -14 40 -55 17 78 292 -175 -111 119 274 -2 -33 -69 -76 -172 -90 -83 -183
6198 -183 -70 210 -62 130 176 125 -8 -329 -230 -221 -48 -181 -84 197 -86 -105 47 138 128 74 -32 7 -115 155
6222 155 -80 44 152 -25 -132 -147 -37 172 87 -40 83 223 341 66 -108 30 -230 -210 148 32 37 16
6244 16 -17 -149 82 249 -7 127 -228 -183 71 -27 -17 93 211 28 166 -28 -240 -22 131 180 124 200 -72
6267 -72 -172 -90 -189 308 -11 -232 55 -35 -80 -103 -123 -86 -128 -171 -62 -16 -89 47 -143 178 91 -111 -111 -16 79 -131
6293 -131 55 -198 -7 -240 57 -26 79 -49 16 250 70 -156 -174 302 81 -140 212 -33 -183 107 -105
6314 -105 247 183 88 -124 112 -128 -278 76 142 -82 70 79 -21 74 192 -1 104 67 -278 -122 80 -117
$$ packed form
6151B77m10J54j03J96j56K26j74N2R7k99L42j71k18K01K49j54o2j8qK62m96J71
6173d2J46k12j80L02j42J77J40k03N4r5P2O1K14m67O4K30J55k76l1l6pr6Q2Pj00
6198a83J13K80k72J92M6n1j33l21R9RJ73j33R7K81k83j9J52R1j0n4j06L9j22K70
6222A55k35J24J08j77j07j5J10K09q5j27J23J40J18k75j74J38k60K0L58j16Nk1
6244A6l3j32K31J67k56J34l55M5K54r8J0J10J18j83J38j94k12K18J53M9n6P6k72
6267g2j00Q2r9M97l19k21K87r0m5k3k0L7m2m3J09M6p3J36j90L21q7k02%R5R5k10
6293a31J86k53J91k33K97q3J05j28O5K34j80k26j8M76k21k21L52k45j50K90k12
6314a05L52o4r5k12K36k40j50L54O6k24J52Rj00R5J18j93J05l7l45J56K02j97
$$ plain form
6336 -117 -75 175 -149 57 -97 2 260 374 -100 87 56 243 -99 110 -123 -77 -50 -12 -228 158 41 -428
6358 -428 -91 226 -24 -103 238 -24 -60 17 10 -122 -99 25 192 72 73 -289 168 284 -56 -132 179 -86 47
6381 47 2 -264 92 -27 140 97 -73 51 -74 -294 191 -15 152 0 146 -38 206 53 38 -44 462 136
6403 136 -112 43 -149 -153 -146 153 33 102 -167 -214 -88 -116 -143 70 -35 47 33 -114 140 29 -20 202 -42 351
6427 351 -16 -199 -73 176 -85 247 141 111 -106 -97 64 103 -223 161 112 -36 -269 -81 101 40 47 57 -36
6450 -36 45 -118 118 59 -340 -61 64 174 -34 26 120 -80 -7 22 -68 -89 -182 -124 -88 149 100 10 69 81 285
6475 285 106 218 -21 102 4 139 150 107 116 -62 72 134 -317 40 -209 -256 35 39 -49 130 81 -57 -162 -246
6499 -246 36 -47 255 -1 -138 -221 -120 -236 -173 34 180 432 175 -16 2 125 -126 -6 -31 98 240 -97
$$ packed form
6336a17M2K50l24K06j54R9K58J14m74J87l1J87l42K09k33M6K7L8k16L86j17m69
6358d28L37L17k50p9L41k62l6P7pj32K3J24J67j20Jl62M57J16l40p6L11k65J33
6381D7m5k66L56j19J67m3j70J24j25k20M85k06J67j52J46j84K44j53j5q2N06l26
6403A36k48J55j92mPK99j20O9k69m7J26k8k7K13j05Q2j4j47K54j11m9K22k44L93
6427C51l67j83J26K49k61L32j06l0k17RJ61L9l26L84m9j48k33J88J82o1PJ0r3
6450c6Q1j63K36n9l99K79J25J10k08O0R4k00P3K9r0k1r3N8L6K37m9r0N9J2K04
6475B85j79J12k39J23r8J35J1m3Rj78J34O2m51L57k49m7K91Mq8J79m9j38j05q4
6499b46K82q3L02k56j37q3J01j16O3K07J46K52k57j91J8J23k51J20k5J29J42l37
$$ plain form
6521 -97 -40 164 -60 -262 -239 11 141 -77 174 167 182 -21 -89 -126 137 52 76 30 -90 -103 21 -99 -86 115
6545 115 -51 -200 192 -45 -70 87 -18 206 28 104 271 -66 23 15 180 273 -14 27 158 50 -15 326 -72
6568 -72 -1 -113 44 -143 -166 -19 22 -242 -145 213 -53 187 13 133 97 219 48 279 149 -232 25 217
6590 217 246 115 83 111 90 -160 -211 201 -108 136 299 14 153 121 5 42 2 -152 -30 -93 70 198 91
6613 91 -81 -74 6 -112 -101 57 -209 -12 103 235 189 -79 87 -29 -49 -60 -5 150 -160 -165 101 -111 64 -118
6637 -118 -38 101 -78 459 65 91 246 161 -218 -99 -46 -254 46 -29 -166 94 -17 206 -278 -184 -26 65
6659 65 48 -27 -178 40 -22 7 -16 -252 15 175 -161 -107 -41 -16 -463 5 135 -143 131 49 -69 -52 151 -29
6683 -29 161 124 83 -134 -41 -57 -309 216 -35 95 251 -159 -75 114 -173 -163 105 -248 211 33 0 139 -107
$$ packed form
6521i7N7K04k24k02K3K50J30k18K51pJ5k03o8l7K63q5K4m6j20j3J24j20J3K01
6545A15j66j49L92k37k5J57j05K24j78P6J67l37Q9qJ65R3k87M1J31j08o5L41l98
6568g2P1j12J57j87k3J47M1k64R7L58k66K40j74J20l6J22j71K31j30l81K57J92
6590B17K9j31l2K8k1k50n1M12l09K44J63k85J39l2j16L7m0j54J22o3J63J28j07
6613I1j72PQ0j18J1J58k66J97J15J32m6k68J66j16k0j1N5J55l10nK66k12J75j82
6637a18Q0J39j79N37l94K6J55q5l79J19N3k08L00p5j37K60j11K23m84R4J58R1
6659F5j7p5j51K18o2K9k3k36K67J60l36N4O6K5m47M68J30k78K74q2j18J7K03j80
6683b9J90l7m1k17R3j6k52N25k51J30J56m10Q4J89k87J0K68l53M59j78l3J39k46
$$ plain form
6706 -107 116 -251 149 -320 142 77 183 213 215 -335 46 -57 -76 159 0 49 -197 -24 213 149 203 -255 210
6729 210 -103 200 68 -17 58 190 -120 -262 113 -96 117 -86 -76 44 -72 -66 -78 -119 -64 -39 -193 -15 -52
6752 -52 154 87 -23 -80 60 -84 -32 86 140 428 -28 63 -61 317 85 -15 -131 299 -215 -72 71 140
6774 140 -17 -84 -77 123 155 -110 98 -97 23 -36 41 149 41 5 117 -48 -144 221 -210 112 -168 -11 8
6797 8 -90 61 -24 73 -177 8 117 102 19 -237 -5 139 37 4 72 22 21 211 -63 -83 41 297 -155 -178 68
6822 68 -22 -17 80 105 2 -24 -30 -52 5 -52 -23 392 57 -234 -2 -118 -1 36 -71 210 141 -34 190 45 -212
6847 -212 313 316 159 -184 422 -243 -40 187 -261 -127 -179 150 -30 -136 -106 -233 -38 -226 -60 27 -8 -36
6869 -36 -115 -107 151 -109 296 28 160 4 -113 370 316 -77 41 16 -149 -68 -145 24 -17 189 -108 -38 156
$$ packed form
6706a07K23l67M00m69M62o5J06L0Kn50L81j03j9K35j59M9k46J73K37o4N4m58M65
6729B10l13L03j32q5P5J32l10j42L75k09K13k03J0J20j16Oj2m1N5K5j54J78l7
6752e2K06o7j10n7J40j44N2J18N4K88m56R1j24L78k32j00j16M30n14J43J43O9
6774A40j57o7PK00L2k65K08j95J20n9P7J08j08l6J12j65r6L65m31L22k80J57J9
6797Hr8J51q5R7k50J85J09j5q3k56K32J44j02l3O8n0jJ90k74k0J24K56m52k3K46
6822F8r0NR7K5j03k6ok2N7n7K9M15l35k91K32j16J17L7j07K81o9j75K24j45k57
6847b12N25Lj57l43O06o65K03K27m48J34n2L29j80j06L0j27J95j88J66Q7l5k8
6869c6p9QK58k60M05k68J32j56j17M83n4l93J18k5j65Q1p7J69m1K06k97P0J94
$$ plain form
6892 156 -286 59 20 -101 163 -87 56 162 -43 281 -2 -233 -225 121 -5 183 -128 40 -251 -180 38
6913 38 -114 -35 247 -17 -102 -83 302 28 -114 136 -133 50 -197 222 145 -117 105 75 113 237 10 -187
6935 -187 -44 148 -191 59 -91 88 83 -216 -176 95 251 -63 165 27 -89 -89 151 -19 168 -149 -46 205
6957 205 14 319 -56 -29 -43 98 -38 -36 132 437 136 5 -284 153 73 -155 -137 78 -97 18 -293 -151
6979 -151 210 23 159 55 -44 -70 -62 -123 -88 -164 -206 72 -5 257 -7 -173 -22 -67 -137 16 -45 86 90 -87 -39
7004 -39 203 106 -14 -123 -8 15 -142 11 241 121 316 84 304 60 111 187 -32 43 -60 13 140 255
7026 255 -67 195 55 -96 -270 52 67 203 -254 -102 7 -148 30 -40 53 63 92 37 258 -183 -55 320
7048 320 92 -55 87 -290 -142 -53 -110 118 -158 -173 -146 -97 -131 171 19 -69 9 58 -68 196 -88 -66 -24 70
$$ packed form
6892A56m42L45l9j21K64k50J43J06k05L24k83k31QL46j26J88l11J68k91P1K18
6913C8j52P9K82k64q5J9L85k74j42K50k69J83k47M19p7k62K22l0L8J24k27j97
6935a87J43J92l39K50j50J79nk99M0K71J56l14K28j38j16%K40j70J87l17J03K51
6957B05j91L05l75K7j4J41j36KJ68L05l01j31k89M37q0k28J8K15j75J15l11J42
6979a51L61j87J36j04r9k6Qo1L5p6m2K78p7K62k64j66J51m5p0J53o1J31Mj77M8
7004c9K42r7j20j09J15K3j57J53K30j20J95k32K20k44N1P6k19P5j03P3J27J15
7026B55l22K62j40j51j74L22J5J36m57J52J09j55J78p0R3J0K9n5K21m41J28L75
7048C20k28j47J42l77J48Q9n7K28k76j5K7M9l4L02j52q8P8M9j26K64k84K2M2R4
$$ plain form
7072 70 -156 -55 181 11 -67 -96 32 59 8 -162 -119 -79 -53 -30 33 -260 -134 -39 284 -4 -8 -109 -203 -137 -258
7097 -258 -124 72 -17 92 -161 271 -84 4 35 151 274 -102 -30 -53 -20 79 104 -55 320 -71 -171 -115 -5
7120 -5 50 5 111 174 -27 -238 379 -216 22 329 -9 82 -42 -130 74 288 223 -68 152 -93 -43 -107 67
7143 67 60 243 20 350 15 74 -106 -73 51 28 95 -73 46 125 67 -37 -84 317 39 29 162 131 -136 -156
7167 -156 306 24 24 38 36 -131 -239 134 -2 -69 -72 2 -75 49 -156 163 -24 -147 -32 -183 34 -144 39
7190 39 106 -55 -49 43 -241 23 184 33 33 405 103 47 91 -165 -101 87 -11 -46 -179 -83 -77 181 44 -149 108
7215 108 -135 -131 145 312 152 -159 -221 276 78 182 190 167 219 -168 72 -314 -319 45 113 -21 -137 202 63
7238 63 222 140 47 -77 98 -90 33 -286 123 46 83 90 15 77 -246 51 27 -76 29 -262 -267 19 -152 109
$$ packed form
7072G0k26J01K36j70p8k9J28K7n1j70M3M0K6K3O3k93J26R5L23k88mj01r4O6j21
7097b58J34J96q9J09k53M32l55Q8L1J16J23l76P2k3L3R9K5j59L75l91j00N6J10
7120eN5m5J06O3k01k11O17n95K38L07l38R1j24q8K04K14o5k91K20k45N0o4J74
7143F7pJ83k23L30l35N9j80L3J24k3O7j68J19P9n8j04m7M01k78j0J33l1k67k0
7167a56M62k82%J4kj67j08L73j36o7lP4p7J24k05L19j87j23J15j51K17j78J83
7190C9O7j61OR2k84K64J61j51%L72l02n6M4k56O4J88r8l5j33R6OK58j37j93K57
7215A08k43MK76J67j60l11o2M97j98J04Qk3N2l87K40l86nL64O8j34j16L39j39
7238F3J59q2r3j24J75j88J23l19M09p7L7Pp5O2l23K97k4j03J05k91nK86j71K61
$$ plain form
7262 109 94 183 -293 295 23 175 252 87 -226 -66 53 2 81 -159 -43 54 19 -133 -76 264 -4 -28 13
7285 13 12 142 19 206 -96 -114 -350 363 154 -137 -72 -3 0 15 53 51 -33 72 44 180 -158 -92 69 157 139 -159
7311 -159 277 188 135 -164 94 -95 -194 -97 -56 20 243 129 128 193 -34 -21 340 -41 116 364 152 57 183 143
7335 143 -384 -156 57 15 273 70 -139 131 122 51 -378 -129 -87 -27 -41 -390 0 161 324 -58 142 263
7357 263 -145 -8 194 -89 -181 -15 155 -112 -34 -29 49 172 -76 -109 -31 -133 -26 116 10 35 -121 -97 216
7380 216 -138 -44 -79 78 399 -319 62 -134 -448 -80 235 36 153 142 139 69 153 -92 122 85 128 112 116 139
7404 139 -139 -316 -53 58 210 31 -90 84 -136 -112 171 121 -189 28 -118 -148 112 -182 56 -38 199
7425 199 -140 86 104 -390 22 -309 73 -53 148 39 -69 -51 -222 -50 13 7 -141 -38 148 -163 -274 68
$$ packed form
7262A09j5Q9m76N88k72J52P7j65l13J60J19n1P9k40J16R7l5j52N7L40k68k4M1
7285A3jJ30j23J87l02j8k36P13k09k91O5O9LJ5L8kq4J05k8J36l38O6J61Q8j8k98
7311a59M36q9n3k99K58j89r9R7M1P6K23j14jO5k27J3L61l81J57K48k12r5J26m0
7335A43n27K28K13m2K58k03k09K70rp1m29K49M2O0j4l49L90J61J63l82K00J21
7357B63m08J37K02k83r2J66J70k67P8NP8J23k48l3P8j02J07J42j06K5j56K4L13
7380B16l54R4l5J57L21p18L81j96l14L68L15j99J17j1lp0Q4k45K14l7M3j6MK3
7404A39k78j77K63J11J52j79j21J74k20K4K83n0l10K17j46l0K60k94K38r4K37
7425A99l39K26J8m94M12l31L82j26K01j09j08J8j71J72O3oj48J03J86l11j11L42
$$ plain form
7447 68 -74 134 71 -140 -15 -21 -121 -94 -238 140 -104 83 -137 98 -30 286 -7 -59 -181 -1 163 -143
7469 -143 -21 -184 7 87 302 69 -398 -161 66 114 -190 131 -9 22 -214 -7 58 7 -82 4 -52 79 -57
7492 -57 -9 82 23 238 -92 -57 -73 116 -84 161 -18 -133 -242 123 17 115 35 -22 -177 38 162 134 6
7515 6 172 169 -17 304 -46 48 209 231 14 -284 169 198 -137 -180 -96 -181 10 -271 -149 -79 225 -39 235 21
7539 21 9 -208 288 300 286 72 -137 -83 13 155 -31 82 -108 84 68 -102 116 -143 189 237 -235 296 -11
7562 -11 -120 87 69 -12 -306 340 -64 -67 33 -132 48 7 147 -355 204 -74 -23 -220 260 -65 94 38 -22
7585 -22 -85 16 -108 -19 -5 -45 11 -59 174 -114 94 -280 91 -14 15 -142 -153 -49 312 5 -199 -73 70
7608 70 83 289 142 102 -295 -35 108 -107 -83 175 132 146 -144 43 345 -43 2 -142 132 -244 -73 -72 238
$$ packed form
7447F8j42K08o3k11J25oj00K7j44L78k44J87k20K35j28L16k93n2j22J80J64l06
7469a43J22j63J91Q0K15k33m67K37K27M8l04L21j40L1k36K07O5n1q9Q6n6J31j36
7492e7M8R1n9K15l30L5j6J89k00K45j79j15j09L65j06R8q0n7j55K15J24k8j28
7515FJ66lj86L21l50R4J61K2k17k98M53K9l35m3Q4q5J91k81J22P0L04k64K74k14
7539B1j2k17M96J2j4k14k09N4R6J42j86J13j90J92j6j70K18k59L32M8m72N31l07
7562a1j09K07j8q1k94O46m04lJ00j65J80m1J40n02N59k78N1j97M80l25J59n6o0
7585b2o3J01j24Q9J4m0N6p0K33k88K08l74L71j05K9j57j1J04L61l07k04J26J43
7608G0J3K06j47m0l97K60J43k15K4K58m3J4k90J87L02l88M5j44K74l76J71JL10
$$ plain form
7631 238 -216 28 -13 -212 214 -312 -55 -42 65 15 -52 55 104 -96 93 -95 -68 -47 172 -53 130 43 -7
7654 -7 117 -231 -71 10 126 24 -40 161 240 -57 -14 198 15 122 -7 -66 17 -169 -129 -21 -139 -179 -69
7677 -69 -296 50 7 -30 40 76 -45 -106 -181 -209 -2 -26 -165 -43 -106 -200 78 200 -146 110 343 53 10 -124
7701 -124 314 214 210 143 100 -107 -72 8 -12 -119 -240 42 8 112 103 -253 -15 426 -23 -143 -101 -64 -321 -88
7725 -88 -65 72 141 -60 -19 -131 -185 -32 229 165 29 -58 -91 -231 1 43 178 -127 -63 -171 -93 168 -46 175
7749 175 305 -93 -12 -135 -88 -132 98 226 176 -61 -222 -60 118 -90 65 63 70 -168 77 -39 -47 -318 -67
7772 -67 264 -141 -14 -192 -84 -18 9 180 -150 -170 21 32 14 34 6 -199 -218 -271 -17 40 -51 59 -38 -159
7796 -159 -34 -20 -27 -96 -315 16 -10 -2 -142 71 63 -103 203 93 -166 149 36 141 130 -17 -63 188 95 212
$$ packed form
7631B38m54K44m1j99M26n26K57J3J07n0o7J07M9k00J89j88K7K1K19k25J83q7n0
7654gJ24l48J60Q1J16j02o4K01P9k97M3K12j83J07j29n9Q3j86M0J08j18m0J10
7677f9k27L46m3l7P0L6j21o1p5k8K07k4j39J22o3r4K78J22l46K56K33k90m3j34
7701a24M38j00mo7m3k07L5Q0k0j07j21K82l4J04rl56K38M41m49j20M2L7k57K33
7725h8K3J37O9k01M1j12n4J53K61o4j36q7l3j40K32M2J35l05O4j08P8K61k14K21
7749A75J30l98Q1j23M7m4K30J28n0k37j61J62J78k08J55kPk38K45j16qk71K51
7772f7L31m05J27j78J08O6K7J71l30k0J91J1j8K0k8k05j9n3K54N7r1J10r7j21
7796a59J25J4po9k19L31k6Qj40K13qj66L06j10k59L15j13J05j1j47m6K51r3J17
$$ plain form
7820 212 -52 -209 104 -176 -23 189 -205 160 -113 -77 56 -211 -42 74 -182 44 287 152 -52 -149 130
7841 130 259 301 -58 118 53 -83 2 386 69 -280 -73 -73 184 -212 -37 -64 -159 37 187 60 -35 4 -54
7864 -54 104 154 73 26 252 63 187 -4 -17 -123 152 -153 176 241 146 -85 114 -30 -226 -93 -144 137 368
7887 368 11 -159 24 27 -64 56 354 -339 20 -332 -49 -74 -77 25 -33 -27 105 148 6 65 -152 -23 76 35
7911 35 -103 -385 -166 99 15 -171 -368 -76 154 -146 -17 168 226 35 422 76 27 -123 -115 365 92 -131
7933 -131 -51 120 0 330 38 80 -228 68 -128 -160 103 -133 181 -93 198 50 165 -238 75 -6 45 24
7955 24 68 -154 -141 -63 34 -58 -49 -141 112 86 72 24 76 -66 110 -157 13 -100 -91 -90 -176 164 156 -229 -5 -2 53 188
7983 188 49 -58 -193 108 -354 -114 131 -197 -8 -70 -109 -134 -67 -212 -152 32 98 39 234 165 -161 -61 15
$$ packed form
7820B12k64j57L13k80J53K12l94L65k73L6J33k67J69J16k56K26K43j35k04r7K79
7841A30J29M2l59J76o5j36Q5L84l17l49K07%K57l96J75k7r5J96J50j27r5L9n8
7864e4J58N0q1m7K26j89J24j91j3j06K75l05L29O5r5k31J99j44j96J33n1K81K31
7887C68l57j70J83Lr1J20K98o93L59l52K83k5lJ02n8OJ32M3j42N9k17J29R9m1
7911C5j38k82K19K65q4j86j97K92K30l00J29J85N8j91L87l46m9j50QM80k73k23
7933a31Q0J71j20L30k92M2l08K96j96l2K63k36L14k74K91j48J15m03L13q1N1k1
7955B4M4k22J3P8R7r2Rr2K53k6j4m8N2j42J76k67J70j13RJq6L40ql85K24LN5J35
7983A88j39j07j35L01m62K40K45l28J89o2l9k5O7j45O0J84O6n9J95o9l26J00P6
$$ plain form
8006 15 -93 0 34 200 62 -13 105 75 -80 -68 -72 41 -54 -120 288 -31 45 -83 296 6 191 89 -22 -183
8030 -183 255 214 111 -30 104 -126 44 22 -81 -90 83 243 414 -23 -196 -94 -117 54 49 313 31 -196
8052 -196 224 26 -37 182 -29 -35 -41 61 -229 -56 -228 -62 325 -182 -42 -75 -191 88 -50 60 17 -69 179
8075 179 220 5 -17 48 -120 28 85 -142 -116 -88 47 -80 -191 166 16 -212 150 124 -262 242 -109 -200 8
8098 8 -92 -6 -243 -89 -121 -307 -71 56 258 209 -38 106 44 149 -38 -18 -189 -82 -99 3 0 287 227 178
8122 178 83 148 -116 63 -39 -250 61 42 236 -170 59 59 -56 56 -128 76 105 25 -30 135 56 -23 -144
8145 -144 -123 -363 -15 -30 98 82 24 168 67 -12 240 -194 -145 61 -230 354 -35 3 34 335 -19 213 59
8168 59 172 -65 44 -103 -173 60 36 14 -8 27 227 150 205 22 -68 36 55 77 -131 -84 101 66 -277
$$ packed form
8006A5j08R3L4J66j38p5J18l0j55J2mJ13r5o6M08l19P6j28L79k90J85j02j11j61
8030a83M38m1j03j41J34k30J70k2j03rJ73J60J71m37j73J02k3J71nK64k82k27
8052a96M20j98o3K19k11ooJ02k90J73j72J66L87n07J40l3j16K79j38J10m3q6K48
8075A79M1k15k2O5j68J48N7k27K6K8J35j27j11L57j50k28L62k6l86N04l51r1K08
8098Hj00Q6k37J54l2j86K36J27K02m9k47J44o2J05j87K0j71J07j7J02lK87o0m9
8122A78r5O5k64J79j02k11L11j9J94m06K29%j15J12j84K04K9q0n5J65p9p9j21
8145a44K1k40L48j5J28j6n8J44j01p9K52m34M9K06k91N84l89L8L1L01l54K32j54
8168E9J13k37J09j47p0K33k4k2k2L5K00p7N5j83r0J04J9K2k08M7J85l5l43
8191b77
$$ Imaginary data points
##PAGE= N=2
##DATA TABLE= (X++(I..I)), XYDATA
$$ plain form
0 0 0 0 0 0 0 0 0 0 0 -8 8 -8 8 -16 16 -24 32 -32 40 -48 56 -72 88 -102 120 -136 160 -184 215 -248 280 -321
32 -321 366 -414 468 -525 590 -661 738 -825 916 -1019 1130 -1250 1385 -1529 1688 -1862 2051
49 2051 -2261 2489 -2745 3024 -3337 3689 -4082 4534 -5051 5654 -6364 7217 -8266 9592
63 9592 -11327 13705 -17190 22813 -33416 60659 -293874 -507567 -34745 273409 562604
74 562604 572609 411679 64111 -255290 -501212 -519800 -360954 -60385 232890 450568
84 450568 469368 320601 55688 -209390 -403974 -426002 -290803 -48367 196859 365649
94 365649 381271 259504 44672 -179391 -332505 -346376 -234851 -39174 166173 301471
104 301471 311726 210063 34623 -150142 -271427 -282428 -190738 -29907 139112 247023
$$ packed form
0@%%%%%%%%%qJ6j6J6k4L2m0N6o4P2q8J04j28J60j90K22k56K96l44L99m63N28o01
32c21O87p80Q82r93J115j251J399j563J741j935K149k380K635k914L217l550L913
49B051m312M750n234N769o361P026p771Q616r585J0705j2018J3581j5483J7858
63I592k0919K5032l0895M0003n6229R4075l54533k13693M72822L08154K89195
74E62604J0005j60930l47568l19401k45922j8588J58846L00569K93275K17678
84D50568J8800j48767k64913k65078j94584k2028J35199K42436K45226J68790
94C65649J5622j21767k14832k24063j53114j3871J11525J95677K05347J35298
104C01471J0255j01663j75440j84765j21285j1001R1690J60831J69019J07911
$$ plain form
114 247023 255513 172067 25542 -126947 -222891 -231674 -156858 -23133 116924 204113 210684 140458
126 140458 18279 -106832 -184318 -191277 -127704 -15521 98956 168856 174405 115490 12647
137 12647 -89849 -152724 -157596 -104254 -11236 82161 139451 144013 93375 8296 -75285 -126693
149 -126693 -131532 -85361 -7096 68796 116260 119708 77249 5855 -63354 -106331 -108754 -68750
161 -68750 -4414 57594 97236 99654 62341 3202 -53074 -88598 -90373 -56008 -3221 48379
173 48379 81416 82147 50967 2140 -45016 -74794 -74748 -45334 -1590 41184 68408 68202 40945
186 40945 1085 -38205 -62905 -61470 -37088 -892 35376 57612 55891 33554 449 -32728
198 -32728 -52655 -50783 -30559 -181 30508 48043 46487 27885 17 -28019 -43748 -42216 -25258
$$ packed form
114B47023Q490q3446j46525j52489r5944q783P4816J33725J40057Q7189O571p0226
126A40458j22179j25111p7486o959O3573J12183J14477O9900N549n8915j02843
137A2647j02496o2875m872N3342R3018R3397N7290M562n0638q5079q3581n1408
149a26693m839M6171P8265P5892M7464L448m2459p1394o9209m2977k423M0004
161f8750O4336O2008L9642K418l7313n9139n6276l5524j775L4365N2787N1600
173D8379L3037P31l1180m8827m7156k9778M6K9414M3744M2774K7224k06k7257
186D0945l9860l9290k4700J435K4382L6196L6268K2236j721k2337l3105l3177
198c2728j9927J872K0224L0378L0689J7535j556j8602k7868k8036j5729J532J6958
$$ plain form
211 -25258 783 25962 40259 38329 23298 -761 -23870 -36340 -35170 -20732 971 21791
223 21791 33227 31823 19076 -938 -20073 -30617 -29259 -17238 1229 18666 28076 26848 15552
236 15552 -1096 -17022 -25696 -24367 -14211 1414 15441 23334 22303 12799 -1526 -14359 -21117
249 -21117 -20337 -11586 1542 13347 19860 18391 10326 -972 -12159 -18260 -16837 -9238 1213 11223
263 11223 16536 15648 8285 -1825 -10328 -14997 -14014 -7607 1515 9412 13916 12965 6826 -1552 -8717
278 -8717 -12631 -11828 -6099 1109 8274 11685 10598 5598 -1135 -7472 -10485 -9536 -5063 1228 6908 9506
294 9506 8774 4498 -924 -6552 -8724 -8021 -4096 1156 5737 8039 7401 3702 -1126 -5442 -7413 -6626
310 -6626 -3362 1087 5055 6751 6203 3092 -986 -4568 -6822 -5412 -2550 1023 4192 5817 5273 2550
$$ packed form
211b5258K6041K5179J4297j930j5031k4059k3109j2470J170J4438K1703K0820
223B1791J1436j404j2747k0014j9135j0544J358J2021J8467J7437R410j228j1296
236A5552j6648j5926q674J329J0156J5625J4027P893j031r504j4325j2833o758
249b1117P80Q751J3128J1805O513j469q065j1298j1187o101J423P599J0451J0010
263A1223N313q88p363j0110q503m669R83O407R122P897M504r51o139q378p165
278h717l914Q03N729P208P165L411j087n000o733o337l013R49M473O291N680K598
294I506p32m276n422n628k172P03L925N252M581K302o38l699m828m316j971P87
310f626L264M449L968J696n48l111m078l582k254J410K862L573L169J625n44k723
$$ plain form
326 2550 -938 -3999 -5343 -4949 -2244 689 3595 4935 4291 2143 -742 -3190 -4281 -4027 -1981 722
342 722 2830 4238 3586 1976 -1047 -2624 -4011 -3204 -1219 785 2533 3647 3015 1290 -384 -2229
358 -2229 -2924 -2945 -1523 310 2183 3098 2463 1315 -436 -2211 -2616 -2251 -1031 386 1912 2527 2132
375 2132 757 -534 -1771 -2394 -1808 -674 535 1466 1990 1607 844 -764 -1339 -2153 -1724 -390 309 1456
393 1456 1840 1554 721 -382 -1495 -1389 -1475 -732 310 1279 1247 1356 1064 -292 -1269 -1361 -979 -390 311 953
413 953 1398 970 535 -186 -744 -1277 -850 -416 443 757 1185 920 320 -314 -909 -1110 -983 32 123 611
433 611 1079 446 339 -510 -517 -662 -775 -669 91 543 527 599 289 -94 -554 -654 -609 -244 144 726 848 193
455 193 387 -396 -257 -499 -409 -24 149 373 543 484 26 -291 -476 -578 -259 130 17 419 359 477 286
$$ packed form
326B550l488l061j344L94K705K933K906J340o44k148k885k448j091K54K046K703
342G22K108J408o52j610l023j577j387Q07J985K004J748J114o32j725j674j845
358b229o95k1J422J833J873R15o35j148j751j775m05L65J220J417J526O15l95
375B132j375j291j237o23N86J134J209R31N24l83p63j608n75q14M29J334O99J147
393A456L84k86q33j103j113J06q6P43J042R69l2J09k92j356r77r2L82N89P01O42
413I53M45m28m35p21n58n33M27M34Q59L14M28k65o00o34n95k01J27J015R1M88
433F11M68o33j07q49pj45j13J06P60M52j6P2l10l83m60j00M5L65L88N82J22o55
455A93J94p83J39k42R0L85J73K24J70n9m58l17j85j02L19L89j13M02o0J18j91
$$ plain form
476 286 -115 -259 -299 -268 -123 -11 298 437 311 108 55 -147 -358 -190 0 -251 95 378 90 -164 -228 -101
498 -101 194 -169 -215 310 466 179 211 27 -203 -193 -634 -149 -77 1 104 230 -106 277 -128 -526 -217 -373
520 -373 -61 -47 21 261 62 -54 -226 -475 7 -3 15 239 375 22 199 89 -69 -229 93 -237 -159 92
542 92 478 35 98 184 -186 34 63 -265 213 -82 -38 -223 208 -74 -47 -90 -269 -63 -16 66 189 216 289 44
566 44 -62 -27 -25 283 145 92 66 -88 -52 69 -73 78 -169 50 -49 16 125 115 10 67 -11 -41 -112 4 -37
591 -37 140 41 64 -59 -49 -125 -187 -92 -55 171 -18 47 -48 186 75 52 68 -153 -149 63 25 206 151 35 8 -210
617 -210 -37 -22 -68 -36 72 -103 318 94 74 -153 -45 -107 -109 58 314 -55 89 19 -148 -6 135 112 216
640 216 37 79 296 62 182 253 -143 -134 138 -286 231 -19 219 119 -38 61 -101 135 14 22 -138 91 -45
$$ packed form
476B86m01j44m0L1J45J12L09J39j26k03n3k02k11J68J90k51L46K83k88k54o4J27
498a01K95l63m6N25J56k87L2j84k30J0m41M85P2P8J03J26l36L83m05l98L09j56
520c73L12J4O8K40j99j16j72k49M82j0J8K24J36l53J77j10j58j60L22l30P8K51
542I2L86m43O3Q6l70K20K9l28M78k95M4j85M31k82K7m3j79K06M7Q2J23K7P3k45
566D4j06L5KL08j38n3k6j54L6J21j42J51k47K19r9O5J09j0j05N7p8l0p1J16m1
591c7J77r9K3j23J0p6o2R5L7K26j89O5r5K34j11k3J6k21MK12l8J81n5j16k7k18
617b10J73J5m6L2J08j75M21k24k0k27J08o2kJ67K56l69J44p0j67J42J41k3J04
640B16j79M2K17k34J20P1l96RK72m24N17k50K38j00j57R9j62K36j21Qj60K29j36
$$ plain form
663 -45 -234 -70 -23 202 -80 87 -144 213 91 64 -101 143 18 -59 -161 95 121 31 -69 176 -171 -181 176
686 176 87 82 97 -195 -112 15 64 151 96 17 59 126 -164 -98 -44 406 137 72 17 131 -73 -148 232 92 138 -288
712 -288 -143 54 -70 147 151 -47 -320 165 23 -15 -6 167 175 194 -306 -40 261 76 1 260 15 -65 -144 -37
736 -37 90 -149 283 271 217 -119 -78 24 67 83 -194 -107 3 -143 5 71 -103 264 83 -85 51 53 -206 -94
760 -94 -41 -104 24 -299 -1 -64 61 -81 65 -189 -188 -62 295 170 72 -200 -39 202 5 -58 -164 292 0
783 0 260 31 -133 102 -30 -1 10 -191 -19 157 -125 25 -118 -54 157 -20 -3 -124 21 169 50 -39 129
806 129 -140 -53 -258 -203 -83 -158 -76 -105 143 62 -26 -135 -83 139 -163 105 183 18 13 177 276 60 12 -107 93
831 93 -202 -4 105 164 125 -39 2 -45 152 141 -430 274 260 -64 30 169 -128 64 -142 127 170 168 -110 80
$$ packed form
663d5j89J64M7K25k82J67k31L57j22k7j65K44j25p7j02K56K6r0j00K45l47j0L57
686A76q9nJ5k92Q3J27M9Q7n5p9M2O7k90O6N4M50k69o5n5J14k04p5L80j40M6m26
712b88J45J97j24K17Mj98k73M85j42l8RJ73QJ9n00K66L01j85p5K59k45q0p9J07
736c7J27k39M32j2n4l36M1J02M3J6k77Q7J10j46J48O6j74L67j81j68J36Kk59J12
760i4N3o3J28l23K98o3J25j42J46k54JJ26L57j25r8k72J61K41j97o3j06M56k92
783@K60k29j64K35j32K9J1k01J72J76k82J50j43O4K11j77J7j21J45J48j19q9J68
806A29k69Q7k05N5J20p5Q2k9K48q1q8j09N2K22l02K68P8j65nJ64R9k16m8j19K00
831I3k95J98J09N9l9j64M1m7J97j1n71P04j4l24R4J39k97J92k06K69M3kk78J90
$$ plain form
855 80 81 -68 -107 -342 115 -138 146 -137 -173 104 65 181 34 -111 -15 74 -197 -158 -69 -179 -128 230 322 -176
879 -176 1 63 20 -141 139 -14 -146 49 47 -86 31 -114 23 -72 29 1 -145 17 -187 -29 86 177 -3
902 -3 -14 -305 -276 80 119 -95 58 -26 -70 -58 -153 -93 -233 68 53 155 114 262 -11 -125 -74 23 133 79 79 179
928 179 -38 10 -132 -96 113 99 252 126 168 169 113 312 -17 118 270 106 102 153 98 -35 -207 -128 -90 -14 78
953 78 -145 -41 123 -136 265 -1 -161 206 -268 -138 258 -301 -12 164 -108 -164 -24 -83 103 163 100 55
975 55 -24 -61 180 -12 -225 -153 12 -74 -313 150 -1 -100 38 -372 167 -10 47 201 23 48 -316 -11 -171
998 -171 260 85 -124 177 -127 17 -172 -76 8 -12 -64 -47 -27 -135 -13 -186 -292 332 -101 -60 122 149 64
1021 64 -197 -107 -9 52 108 -68 -135 -283 133 165 -242 101 106 -170 -56 86 342 150 -159 151 -285 -84 109
$$ packed form
855H0Jj49l9k35M57k53K84k83l6K77l9J16j47j45R6Q9k71L9Q9j10N1L58R2m98
879a76J77O2m3j61K80j53j32J95kj33J17j45J37r5J01k8j46J62k04J58J15R1j80
902cj1k91K9L56L9k14J53q4m4J2r5O0j40L01j5J02m1J48k73j14N1R7J10n4%J00
928A79k17M8j42L6K09j4J53j26M2Jn6J99l29J35J52j64mN1n5j33j72P9L8P6R2
953G8k23J04J64k59M01k66j60L67m74J30L96n59K89J76k72n6J40n9J86O0o3m5
975E5p9l7K41j92k13P2J65q6k39M63j51r9J38m10N39j77N7J54j78K5l64L05j60
998a71M31j75k09L01l04J44j89R6Q4k0n2J7K0j08J22j73j06O24m33M1J82K7q5
1021F4k61R0R8O1N6j76o7j48M16L2m07L43Nk76J14J42K56j92l09L10m36K01J93
$$ plain form
1044 109 -2 37 -170 45 -136 -138 33 -204 -145 29 91 -59 -110 22 104 -122 -8 218 26 -24 19 -150 -181
1067 -181 -160 -83 145 175 129 -37 62 57 -169 -165 -237 -39 129 -321 385 -49 92 -254 200 -59 29 140 104 173
1091 173 -121 89 340 -139 -37 -92 112 -113 -31 69 -33 -446 116 -60 -58 369 -32 -229 58 9 47 141
1113 141 131 65 -135 -127 -167 53 -259 -16 91 58 -8 -54 119 -145 171 -54 -101 91 -270 138 14 88 18 4
1137 4 -27 -210 110 -37 336 -376 91 91 -97 172 81 205 192 -117 258 -346 -84 -90 -50 -139 -225 -85 76 -21
1161 -21 -61 40 11 6 -307 -137 168 -61 -2 223 -246 -152 59 60 113 416 189 -193 -80 -25 -47 4 -107 286
1185 286 73 -24 -175 -228 124 -148 -14 219 36 10 110 205 -32 6 95 -118 290 89 131 -110 -29 -64 -34
1208 -34 15 -70 -21 -110 -50 -68 -151 170 84 -91 -246 -83 93 45 113 -105 -12 -103 -121 -112 -80 -217 -164 -113 27 -35 90
$$ packed form
1044A09j11L9k07K15j81kJ71k37N9J74O2j50n1J32Q2k26J14K26j92n0M3j69l1
1067a81K1P7K28L0m6j66R9nk26Mp2J98J68m50P06m34J41l46M54k59Q8J11l6O9
1091A73k94K10K51m79J02n5K04k25Q2J00j02m13N62j76KM27m01j97K87m9L8R4
1113A41j0o6k00Qm0K20l12K43J07l3o6m6J73k64L16k25m7J92l61M08j24P4p0j4
1137Dl1j83L20j47L73p12M67%j88K69r1J24j3l09L75o04K62oM0q9q6J40J61r7
1161b1m0J01k9nl13J70L05k29N9K25m69R4K11JN3L03k27l82J13N5k2N1j11L93
1185B86k13r7j51n3L52k72J34K33j83k6J00R5k37L8Q9k13M08k01M2k41Q1l5L0
1208c4M9q5M9q9O0j8q3L21q6j75j55J63J76m8O8k18R3r1j8RL2j37N3N1J40o2J25
$$ plain form
1235 90 -121 -82 -65 -29 37 -168 35 -179 -109 148 -45 150 -106 136 11 -20 10 -160 -59 30 172 -133 18
1258 18 84 -129 141 59 60 17 -79 43 253 -102 -181 -117 -152 85 11 -92 -94 152 140 -31 16 142 7 -29 -36 73
1284 73 139 245 -9 133 196 -4 -28 89 182 -162 42 -148 -14 -204 118 39 -95 -7 100 59 0 45 297
1307 297 169 -149 27 15 -18 -224 2 -44 -105 -121 -164 -61 -82 246 160 -3 26 -67 89 -86 3 -90 -8 155
1331 155 39 213 114 -223 297 -222 138 43 -119 -141 -186 -97 154 -85 -41 60 200 -157 -153 30 -236 -170 -156
1354 -156 55 85 -129 -154 -104 -68 -254 226 -49 7 142 174 29 320 267 57 -204 -160 -112 -74 37 147 -95
1377 -95 -119 -125 -201 101 -64 48 116 197 -58 -45 153 -133 228 -95 55 276 -92 9 -49 -29 -25 -354 -97 79
1401 79 -258 -14 -261 107 -104 20 185 191 -24 57 -191 9 123 115 -141 -218 172 -57 49 192 100 -156 -199
$$ packed form
1235I0k11L9J7L6O6k05K03k14P0K57j93J95k56K42j25l1L0j70J01Q9J42l05J51
1258A8O6k13K70q2Jm3r6J22K10l55p9O4l5K37p4j03kK46j2j71M7J26j35l6pJ09
1284G3O6J06k54J42O3k00k4J17R3l44K04j90J34j90L22p9j34Q8J07m1n9M5K52
1307B97j28l18J76j2l3k06K26m6o1j6m3J03k1L28q6j63K9r3J56j75Q9r3Q2J63
1331A55j16J74r9l37N20n19L60r5j62k2m5Q9K51k39M4J01J40l57MJ83k66O6J4
1354a56K11L0k14k5N0L6j86M80k75N6J35L2j45K91n3k10k61M4M8L8J11J10k42
1377i5k4op6L02j65J12O8Q1k55J3J98k86L61l23J50K21l68J01n8K0Ml29K57J76
1401G9l37K44k47L68k11J24J65Ok15Q1k48K00J14qk56p7L90k29J06J43r2k56m3
$$ plain form
1424 -199 -50 -65 -28 -51 335 167 26 22 -115 155 146 8 2 -1 -98 -79 -182 56 122 -140 42 -18 124 -308 -156
1449 -156 123 -5 -156 -1 -24 -208 84 258 -126 -243 -234 -91 56 68 318 36 155 67 -70 53 89 -74
1471 -74 24 -44 21 108 -23 178 -199 17 -133 101 55 -280 -81 -75 160 260 -99 6 50 -44 -15 -19 -17 132 125 -55
1497 -55 363 -62 176 -95 91 -91 -69 -16 265 -62 -178 119 118 11 -66 103 88 23 -92 -261 -51 25 11
1520 11 135 -112 190 -182 -16 -73 -102 -26 279 -176 -15 25 -269 84 36 -194 114 78 102 -76 -8 200 -178
1543 -178 91 -33 -39 147 -145 257 28 64 -28 266 152 223 175 -37 -14 102 -200 235 119 -43 -73 125 -157
1566 -157 97 93 67 208 -79 -15 54 -109 30 -115 -196 -51 -65 25 -193 277 -10 -114 30 -138 -130 -279 -11
1589 -11 -106 128 -109 -95 -20 -128 197 -14 -158 19 -132 32 262 -304 -139 -203 126 214 -60 25 -98 373
$$ packed form
1424a99J49j5L7k3L86j68j41mj37K70rj38olr7J9j03K38O6k62J82o0J42m32J52
1449a56K79j28j51J55k3j84K92J74l84j17RJ43J47J2K50k82J19q8j37J23L6j63
1471g4R8o8O5Q7j31K01l77K16j50K34m6l35J99OK35J00l59J05M4r4K9mKJ49pj80
1497e5M18m25K38k71J86j82K2N3K81l27j16K97jj07p7J69j5o5j15j69K10P6j4
1520A1J24k47L02l72J66n7k9P6L05m55J61M0k94L53m8k30L08l6K4j78O8K08l78
1543a78K69j24oJ86k92M02k29L6r2K94j14P1m8k12K3J16l02M35j16j62l0J98k82
1566a57K54mk6J41k87O4O9j63J39j45q1J45j4R0k18M70k87j04J44j68Qj49K68
1589a1r5K34k37J4P5j08L25k11j44J77j51J64K30n66J65o4L29Q8k74Q5j23M71
$$ plain form
1611 373 44 146 56 -220 94 176 201 160 -45 286 -248 56 -179 56 -73 276 108 106 18 -16 -60 -84 303
1634 303 -37 -6 132 34 -127 149 82 160 145 -243 -22 -21 -105 46 272 -288 59 -148 36 -122 78 54 -137
1657 -137 157 -71 33 -228 73 405 320 -124 287 153 15 86 -204 12 -25 -61 233 -205 109 291 -48
1678 -48 -245 159 274 89 -36 -259 54 -98 -100 -254 -93 -16 -57 -96 93 -159 -150 -125 140 28 -82 150 -65
1701 -65 22 -120 -72 63 -219 72 -63 295 84 78 -3 123 -82 -294 346 -70 -19 -217 89 10 -114 32 -174
1724 -174 65 -166 4 165 49 58 -97 -240 -92 72 -138 92 -426 -80 -13 64 -130 10 -21 194 111 -98
1746 -98 152 -25 116 242 21 -44 149 -265 73 -170 265 -119 86 17 88 -90 151 -74 40 -55 46 38
1768 38 23 24 40 79 264 -316 -223 -16 -132 -8 -127 29 272 -82 -25 130 -111 67 200 -263 -185 -320 82
$$ packed form
1611C73l29J02r0k76L14Q2K5m1k05L31n34L04k35K35j29L49j68kq8l4m4k4L87
1634C03l40L1J38r8j61K76o7P8j5l88K21Jq4J51K26n60L47k07J84j58K00k4j91
1657a37K94k28J04k61L01L32q5m44M11j34j38P1k90K16l7l6K94m38L14J82l39
1678d8j97M04J15j85j25k23L13j52kj54J61P7m1l9J89k52RK5K65j12j10K32k15
1701f5Q7j42M8J35k82K91j35L58k11oq1J26k05k12O40m16N1j98L06p9j24J46k06
1724a74K39k31J70J61j16Rj55j43J48J64k10K30n18L46O7P7j94J40l1K15q3k09
1746i8K50j77J41J26k21o5J93m14L38k43M35l84K05o9P1j78K41k25J14r5J01q
1768C8j5JJ6L9J85n80R3K07j16J24j19J56K43l54N7J55k41J78J33m63P8j35M02
$$ plain form
1791 82 -87 -98 19 -80 117 26 114 -220 -183 -64 43 -234 198 1 327 -132 -208 -82 131 63 8 289 82
1814 82 82 -182 203 38 69 -231 -218 103 -54 -70 -118 178 203 86 -33 -79 -6 -58 14 -122 -105 -85 97 259 -107
1839 -107 -45 306 121 -103 -147 144 198 11 95 130 -263 -111 56 -78 -107 -12 -41 38 -69 -187 -177 8 -138
1862 -138 -33 282 -179 -192 -3 14 -103 79 18 134 -12 -4 16 136 -126 120 242 -66 -127 -137 181 0 133
1885 133 86 -429 -93 199 -151 330 82 -30 31 67 -83 94 11 168 -168 138 -177 -51 174 329 -50
1906 -50 -148 163 71 8 37 148 -35 123 -196 -138 -139 -9 -19 119 127 -165 -60 138 5 -37 -50 -284 -218 153 43
1931 43 110 -17 113 -128 89 116 280 152 -155 103 -374 -72 -17 167 126 -148 -77 -184 112 125 7 -24 182
1954 182 -17 47 -206 51 -56 157 -210 33 -353 -341 -180 91 97 110 -148 75 24 -127 -152 62 389 -129
$$ packed form
1791H2j69j1J17r9J97r1Q8l34L7J19J07k77M32j97L26m59p6J26K13o8n5K81k07
1814H2%k64L85j65L1l00J3L21j57j6m8K96K5j17j19m6P3n2P2j36J7K0J82J62l66
1839a07O2L51j85k24m4K91N4j87Q4L5l93J52J67j34k9R5k9P9j07j18J0J85j46
1862a38J05L15m61j3J89J7j17J82o1J16j46QK0J20k62K46J22l08o1j0L18j81J33
1885A33m7n15L36K92l50M81k48j12O1L6j50J77q3J57l36L06l15J26K25J55l79
1906e0r8L11r2o3K9J11j83J58l19N8jJ30j0J38Qk92J05J98j33m2j3k34O6L71j10
1931D3O7j27J30k41K17K7J64j28l07K58m77L02N5J84m1k74P1j07K96J3j18l1K06
1954A82j99O4k53K57j07K13l67K43l86J2J61K71OJ3k58K23n1j51k5K14L27n18
$$ plain form
1976 -129 -140 25 107 -158 352 -67 -132 343 332 -273 161 -108 136 105 -62 1 -36 -180 152 57 -103 -210 -100
1999 -100 28 272 102 4 4 76 161 -96 -12 24 -218 35 -97 90 75 98 196 52 2 51 -103 -31 293 218 156
2024 156 -172 -31 33 12 -111 15 55 -36 19 284 46 153 142 76 -9 202 -129 -134 137 -197 -127 -63 -123 -52 126
2049 126 161 -106 -340 -141 72 -165 -106 -150 -15 59 218 28 -105 -170 -75 151 196 -269 -230 -71 23 -119 163
2072 163 104 104 -6 -125 36 235 -107 -169 107 -315 150 -60 107 22 70 49 -83 -41 -138 -65 136 -276 -185 165
2096 165 -52 -19 -163 54 -323 229 72 -27 -307 -214 49 51 -170 -127 140 121 -73 -89 72 163 276 -109 379
2119 379 -47 -5 76 -239 60 127 -211 190 -238 -116 -33 -194 115 -266 -12 174 -9 -42 7 -143 40 -140
2141 -140 -89 105 233 -1 -15 -37 -7 254 49 229 72 -269 10 62 -44 147 7 187 -79 -184 -285 -57
$$ packed form
1976a29j1J65Q2k65N10m19o5M75j1o05M34k69K44l1j67O3l7j44L32r5j60j07J10
1999a00J28K44j70r8%P2Q5k57Q4L6k42K53j32J87j5K3R8j44n0M9j54P2L24p5o2
2024A56l28J41O4k1j23J26M0r1N5K65k38J07j1o6q5K11l31nK71l34P0O4o0P1J78
2049A26L5k67k34J99K13k37N9m4J35P4J59j90j33o5R5K26M5m65L9J59R4j42K82
2072A63n9%j10j19J61J99l42o2K76m22M65k10J67q5M8k1j32M2r7P3K01m12R1L50
2096A65k17L3j44K17l77N52j57r9k80R3K63Kk21M3K67j9j94j6J61R1J13l85M88
2119C79m26M2Q1l15K99O7l38M01m28J22Q3j61L09l81K54J86j83l3M9j50J83j80
2141a40N1J94J28k34j4k2L0K61k05J80j57l41K79N2j06J91j40J80k66j05j01K28
$$ plain form
2163 -57 132 -54 -13 4 121 219 -167 -30 140 -127 46 261 242 85 -75 40 103 -72 37 -70 209 -125
2185 -125 39 -113 -27 -89 -121 -172 97 213 4 182 28 -84 -42 13 -125 111 -15 -129 -12 266 -9 70
2207 70 -85 52 -31 98 -47 -57 139 40 -59 50 -173 -177 21 40 -63 67 195 69 -66 104 63 33 136
2230 136 -255 -158 -1 86 -19 -55 34 -168 151 -10 -172 172 -72 -1 -10 31 107 -123 153 42 -84 10 125
2253 125 -140 77 38 73 29 -77 80 42 -31 144 -171 292 -243 -180 -101 62 -90 39 -83 -4 122 -318 -44
2276 -44 -51 145 39 113 -211 32 -97 129 -90 -128 -27 -334 243 -149 -130 -121 -6 107 -14 -204 82 -16 264
2299 264 131 -325 16 -65 65 -84 125 3 86 -11 17 -78 -129 -75 -69 -202 23 57 144 117 -118 -16 25 -191
2323 -191 -162 -128 -33 142 10 99 -64 -89 -258 -238 28 -140 -231 -51 136 -300 239 -65 -93 -118 -93 -125 48 63
$$ packed form
2163e7J89j86M1J7J17R8l86J37J70k67J73K15j9j57j60J15O3j75J09j07K79l34
2185a25J64j52Q6o2l2n1K69J16k09J78j54j12M2N5j38K36j26j14J17K78k75P9
2207G0j55J37q3J29j45j0J96r9r9J09k23mJ98J9j03J30J28j26j35J70m1l0J03
2230A36l91R7J57Q7j05l6Q9k02L19j61j62L44k44P1rM1P6k30K76j11j26R4J15
2253A25k65K17l9L5m4j06J57l8p3J75l15M63n35O3P9J63j52J29j22P9J26m40K74
2276d4pJ96j06P4l24K43j29K26k19l8J01l07N77l92J9RJ15J13j21j90K86r8K80
2299B64j33m56L41q1J30j49K09j22Q3r7K8r5n1N4Oj33K25L4Q7k7k35J02M1k16
2323a91K9L4R5J75j32Q9j63k5j69K0K66j68r1J80J87m36N39l04k8k5K5l2J73J5
$$ plain form
2347 63 128 32 11 20 1 -220 -60 43 -195 -8 73 -9 394 48 104 -238 146 -75 23 -185 -24 -454 28 143
2371 143 -71 32 -164 76 346 5 328 41 97 -186 -56 206 -166 130 -34 135 91 -159 230 8 -157
2392 -157 -160 -210 141 121 -76 179 22 377 40 202 -124 -290 203 85 142 51 103 -31 -19 -54 -110 -95 -145 -279
2416 -279 20 26 102 -11 -56 -100 219 -54 -312 68 234 198 -2 25 101 -109 -11 129 -117 114 165 190 -291 29
2440 29 146 197 40 4 -172 -189 -38 137 55 43 66 34 0 32 216 5 -156 73 -25 37 -190 299 7 -53
2464 -53 -31 36 -357 -161 -29 -167 125 60 76 13 -203 -81 -15 -160 260 50 -173 61 222 -21 -58 -48 -226
2487 -226 1 11 -66 -64 -136 187 -20 56 -229 11 -181 -112 22 61 -110 209 -55 78 32 253 87 -18 44
2510 44 -181 230 128 100 -173 170 -15 209 -158 139 165 48 -90 -55 51 -146 11 -67 -6 -73 52 17 6
$$ packed form
2347F3O5r6k1Rj9k21J60J03k38J87Q1q2M03l46N6l42L84k21R8k08J61m30M82J15
2371A43k14J03j96K40K70l41L23k87N6k83J30K62l72K96j64J69m4k50L89k22j65
2392a57ln0L51k0j97K55j57L55l37J62l26j66M93j18N7r1N2j34J2l5n6J5n0j34
2416b79K99OP6j13m5m4L19k73k58L80J66l6k00K7P6k10R8J40k46K31N1K5m81L20
2440B9J17N1j57l6j76j7J51J75q2j2K3l2l4L2J84k11j61K29r8O2k27M89k92o0
2464e3K2O7l93J96J32j38K92o5J6o3k16J22O6j45M20k10k23K34J61k43l7J0j78
2487b26K27J0p7Kp2L23k07P6k85K40j92O9J34L9j71L19k64J33m6K21j66j05O2
2510D4k25M11j02k8k73L43j85K24l67K97K6j17j38L5J06j97J57p8O1o7J25l5j1
$$ plain form
2533 6 163 27 138 61 -240 -83 -78 156 -137 -23 28 44 -20 -32 -37 74 -211 -120 -47 274 44 -187 97 99 160
2558 160 62 -121 1 177 144 -164 22 29 -225 214 48 -359 -214 -96 149 195 154 -255 -181 -274 -174 -114 -8
2581 -8 59 43 -53 -40 13 -161 18 -173 -41 124 133 188 -43 -163 -72 -34 -309 163 215 -172 28 -121 54 109 -94
2606 -94 189 -47 86 -16 -154 156 187 -270 183 -166 -7 308 33 1 13 40 -37 70 -137 -182 -35 -342
2628 -342 -83 -118 -48 -57 -194 141 -33 18 -193 102 182 -160 32 -4 -36 65 9 -20 -62 -74 21 -71 -15 166 -231
2653 -231 177 116 -33 227 127 -120 80 -139 59 65 -33 -34 -89 28 -135 -41 4 -21 -32 58 104 309 37 -292
2677 -292 -25 34 40 96 -108 -281 -76 138 -113 -2 -170 -52 241 136 11 -60 152 -126 221 -126 -87 -163
2699 -163 -192 181 -155 -266 86 -169 199 -126 -205 -99 -18 -104 62 -89 -78 -1 -145 -138 126 364 -75 25 -202
$$ packed form
2533FJ57j36J11p7l01J57NK34k93J14N1J6o4j2nJ11k85R1P3L21k30k31K84KO1
2558A60r8j83J22J76l3l08J86Pk54M39j66m07J45J18K45M6m1m09P4r3J00O0J06
2581hO7j6r6J3N3j74J79j91J32J65RN5k31j20R1L8k75M72N2l87K00j49J75N5k03
2606i4K83k36J33j02j38L10L1m57M53l49J59L15k75l2J2K7p7J07k07m5J47l07
2628c42K59l5P0rj37L35j74N1k11K95Q0l42J92l6l2J01n6k9m2j2R5r2N6J81l97
2653b31M08o1j49K60j00k47K00k19J98Or8jn5J17j63R4M5k5j1R0M6K05k72l29
2677b92K67N9ON6k04j73K05K14k51J11j68J18K93j05j25p1K12k78L47l47L9p6
2699a63k9L73l36j11L52k55L68l25p9J06Q1q6J66j51J1P7j44PK64K38m39J00k27
$$ plain form
2722 -202 134 -69 30 218 -26 124 84 136 -121 -24 163 68 347 -9 -24 -104 231 142 -48 97 -110 -39 -204
2745 -204 -76 21 27 -388 212 23 -1 -1 -23 -43 215 242 189 43 36 -37 0 -184 -23 -10 -260 -180 -246 112 -37 -107
2771 -107 102 171 117 -366 -66 136 -229 321 -32 112 55 35 -146 -122 79 72 81 -76 105 142 251 94 65 -172
2795 -172 -96 -30 -26 -117 -145 -144 -62 -235 167 -9 70 -31 129 -287 -185 -76 -136 189 -248 -108 113 154 37 -185
2819 -185 -85 -18 -253 99 67 -10 38 -178 -61 -84 -11 8 -52 189 68 -113 -171 94 -40 26 17 -36 -174 -130 -20
2844 -20 -23 29 -1 -92 -130 192 115 -18 -204 30 74 -46 51 -143 -178 -359 -84 -36 -24 -87 -100 39 98 165 -35 17
2870 17 -143 101 91 70 -40 272 171 -92 39 20 32 69 -33 -144 -65 -264 102 140 -1 88 -22 130 192
2893 192 3 98 21 58 95 58 -94 -187 251 107 225 -261 -157 -133 72 21 208 -136 -95 -16 89 183 138 51
$$ packed form
2722b02L36k03R9J88k44J50m0N2k57R7J87r5K79l56j5q0L35q9j90J45k07P1j65
2745b04J28R7Om15O00j89k4%k2k0K58K7n3j46pp3L7j84J61J3k50Q0o6L58j49p0
2771a07K09O9n4m83L00K02l65N50l53J44n7k0j81K4K01pRj57J81L7J09j57k9k37
2795a72P6O6Mr1k8JQ2j73M02j76P9j01J60m16J02J09o0L25m37J40K21M1j17k22
2819a85J00O7k35L52l2p7M8k16J17k3P3J9o0K41j21j81n8K65j34O6rn3j38M4J10
2844b0lN2l0r1l8L22p7j33j86K34M4j20R7j94l5j81K75M8J2o3j3J39N9O7k00N2
2870A7j60K44j0k1j10L12j01k63J31j9J2L7j02j11P9j99L66L8j41Q9j10J52O2
2893A92j89R5p7L7L7l7j52r3M38j44J18m86J04K4K05n1J87l44M1P9J05R4m5q7
$$ plain form
2917 51 25 92 5 9 88 193 -66 129 -253 -149 175 -129 129 -184 -135 -87 13 -94 258 -156 47 -67 128
2940 128 134 64 -191 -331 -15 -113 47 234 89 70 -192 234 16 415 -69 130 45 -110 -201 -284 -61 -67 -7 25
2964 25 328 -24 87 -106 -67 99 -228 160 26 36 14 -121 -30 -109 -140 -268 -115 348 81 -273 -202 -6 46
2987 46 -47 -252 -121 -94 172 -8 -106 200 118 -147 24 198 179 152 -21 -79 -58 66 -28 -227 -238 177 99 -11
3011 -11 -58 169 55 -69 -94 -132 55 -135 -101 58 -248 25 -139 -192 91 191 64 109 -55 -228 -152 41 39
3034 39 156 -156 -259 252 -77 -112 190 -144 95 248 198 -209 -166 106 -166 -66 -205 134 65 -89 -16 45
3056 45 4 109 -163 -218 -91 117 -85 124 225 -128 171 74 -155 12 8 83 30 209 167 -105 197 93 89 46
3080 46 348 298 -65 -41 -207 106 -100 -88 -62 -164 -63 41 -64 -194 343 69 74 -123 30 -113 -204 -109 27
$$ packed form
2917E1k6O7q7MP9J05k59J95l82J04L24l04K58l13M9M8J00j07L52m14K03j14J95
2940A28Op0k55j40L16r8J60J87j45j9k62M26k18L99m84J99q5j55r1q3K23oO0L2
2964B5L03l52J11j93L9J66l27L88j34J0k2j35R1p9l1j28J53M63k67l54P1J96N2
2987D6r3k05J31K7K66j80r8L06q2k65J71J74j9k7j73n8K1J24r4j99j1M15p8j10
3011a1m7K27j14j24k5l8J87j90L4J59l06K73j64n3K83J00j27M5j64j73P6J93k
3034C9J17l12j03N11l29l5L02l34K39J53n0m07M3K72k72J00j39L39o9j54P3O1
3056D5m1J05k72n5J27K08k02K09J01l53K99r7k29J67mP5n3J79m2k72L02j04mm3
3080D6L02n0l63K4j66L13k06J2K6j02J01J04j05j30N37k74Nj97J53j43r1R5J36
$$ plain form
3103 27 37 31 106 -275 73 -20 202 -38 -84 67 -208 143 -188 70 -187 9 -52 339 171 -103 -49 241 47
3126 47 -125 -121 -96 -54 119 253 -167 -202 -209 118 -150 63 -160 158 28 -54 -62 -62 215 -18 -188 -253 88 96 206
3151 206 -96 -219 233 151 120 -83 -141 -105 160 -134 24 70 -110 126 75 -67 281 89 -289 -61 109 -18
3173 -18 57 -146 94 -148 306 96 128 13 165 -116 -113 -27 -88 206 -71 -9 186 -67 99 -259 246 -54 -25
3196 -25 150 22 20 -22 117 32 -236 -14 -8 -101 4 -114 5 149 9 172 51 -239 -153 84 181 -92 -153 -29
3220 -29 -487 -112 -127 -203 70 -139 -15 -133 26 -63 -117 -149 89 118 -153 238 29 353 -180 101 -48 88
3242 88 110 9 7 -91 236 -93 76 -66 -280 155 117 44 233 -257 -152 3 2 125 108 64 -31 -252 -269 64
3266 64 355 -95 -79 -171 183 20 -206 238 -84 -83 23 -162 117 352 186 30 -96 24 -3 256 5 -11
$$ packed form
3103B7J0oP5l81L48r3K22k40m6J51k75L51l31K58k57J96o1L91j68k74N4K90j94
3126D7j72MK5M2J73J34m20l5pL27k68K13k23L18j30q2q%K77k33j70o5L41QJ10
3151B06l02j23M52q2l1k03n8L6K65k94J58M6j80K36n1j42L48j92l78K28J70j27
3173a8P5k03K40k42M54k10L2j15J52k81LQ6o1K94k77O2J95k53J66l58N05l00K9
3196b5J75j28km2J39q5k68K22Or3J05j18J19J44j40J63j21k90Q6K37R7k73o1J24
3220b9m58L75j5p6K73k09J24j18J59q9n4l2K38K9k71L91k09L24n33K81j49J36
3242H8K2j01kr8L27l29J69j42k14M35l8p3J89m90J05J55jJ23j7m4r5k21j7L33
3266F4K91m50J6r2L54j63k26M44l22JJ06j85K79K35j66j56j26J20k7K59k51j6
$$ plain form
3288 -11 -159 -172 -108 146 218 130 -131 -222 215 -11 -49 170 -2 40 101 199 261 37 3 33 84 53 -101 -232 37
3313 37 290 -31 -249 67 6 155 -429 145 125 -111 137 292 -84 -134 69 183 219 222 46 -190 -245 -338 1
3336 1 -114 -67 -49 44 -220 -90 -80 17 39 -65 2 -138 -88 -113 48 46 262 -21 166 -109 108 149 -77 246 -134
3361 -134 -306 217 148 -7 256 -143 0 205 -72 9 4 -153 -56 169 -53 84 216 13 -105 96 -136 0
3383 0 -20 175 -57 -113 24 109 40 -143 -85 -86 286 38 102 -213 -138 -121 48 349 -138 2 181 100 45 -11 -23
3408 -23 99 -149 55 -16 -135 -53 -191 80 -117 -298 172 -10 -114 -61 -7 -8 -166 19 -164 -47 120 11
3430 11 -61 -24 31 82 5 -80 138 -144 98 -21 -13 -22 204 58 1 -23 -81 -173 57 108 27 9 -80 -4 53 141 -21
3457 -21 132 -159 144 -25 -21 321 -319 -97 -55 88 -361 -31 -120 -167 -61 56 -93 -4 21 -35 -218 151 131
$$ packed form
3288a1j48j3O4K54P2q8k61r1M37k26l8K19j72M2O1R8O2k24l4L0N1l1j54j31K69
3313C7K53l21k18L16o1J49n84N74k0k36K48J55l76n0K03J14L6Lj76k36n5r3L39
3336Aj15M7J8R3k64J30J0R7K2j04O7j40N0k5J61kK16k83J87k75K17M1k26L23l80
3361a34j72N23o9j55K63l99J43K05k77Q1nj57R7K25k22J37J32k03j18K01k32J36
3383@k0J95k32n6J37Q5o9j83N8jL72k48O4l15P5J7J69L01m87J40J79q1n5n6j2
3408b3J22k48K04p1j19Q2j38K71j97j81M70j82j04N3N4jj58J85j83J17J67j09
3430A1p2L7N5N1p7q5K18k82K42j19QrK26j46n7k4n8r2K30N1q1j8q9P6N7Q8j62
3457b1J53k91L03j69ML42o40K22M2J43m49L30q9m7J06J17j49Q9K5n6j83L69k0
$$ plain form
3480 131 104 131 62 -50 146 -246 105 -70 -130 -73 -344 299 -28 -89 -41 -174 -80 23 -54 17 145 276 40
3503 40 -24 -167 301 -160 -421 58 41 84 -114 74 50 0 107 6 -76 -50 -196 223 192 -92 -185 46 45 123
3527 123 119 67 -69 -37 -70 11 30 136 207 37 -201 239 -95 158 15 214 -148 51 46 -88 -26 -58 -78 19 -90
3552 -90 -219 265 -51 99 -264 193 22 -270 -143 89 49 -1 -60 -46 -277 -225 152 -111 217 -234 118 103
3574 103 86 -202 63 131 -186 222 250 272 120 136 -98 -95 4 -104 -28 -169 284 136 -142 -158 14 182 -21
3597 -21 -11 -104 6 77 -46 191 156 24 293 -15 -174 -92 275 227 176 72 -98 -272 -15 -202 1 -179 -138
3620 -138 170 232 95 209 -215 89 -95 -1 483 42 -274 123 63 86 108 295 -77 -275 -3 -13 -141 27
3642 27 -173 -100 -24 291 29 -65 -38 181 -129 -62 -230 -164 -12 92 450 -185 -153 178 118 23 53 -141 -33 133
$$ packed form
3480A31k7K7o9j12J96l92L51j75o0N7k71O43l27o1M8j33R4J03p7P1J28J31k36
3503D0o4j43M68m61k61M79j7M3j98J88k4n0J07j01q2K6j46M19l1k84r3K31jP8
3527A23mn2j36L2l3Q1J9J06P1j70k38M40l34K53j43J99l62J99nj34O2l2k0R7j09
3552i0j29M84l16J50l63M57j71k92J27K32m0n0n9J4k31N2L77k63L28m51L52j5
3574A03j7k88K65O8l17M08K8K2j52J6k34LR9j08P6j41M53j48k78j6J72J68k03
3597b1J0r3J10P1j23K37l5j32K69l08j59Q2L67m8n1j04j70j74K57j87K03j80M1
3620a38L08O2j37J14m24L04j84R4M84m41l16L97o0K3K2J87l72j98K72j0j28J68
3642B7k00P3P6L15k62r4K7K19l10O7j68O6J52J04L58o35L2L31o0r5L0j94J08J66
$$ plain form
3666 133 -11 -20 38 21 54 -108 137 -154 16 70 16 -285 82 -238 59 -50 -29 -162 29 -105 -452 145 137
3689 137 87 -23 15 256 203 -105 -122 114 39 62 296 29 -263 -2 162 173 62 -124 -28 -157 -47 0 287
3712 287 114 -26 241 161 -107 -99 115 -122 -51 -133 -64 -8 -105 -169 -231 -84 6 -208 52 23 221 -77 -13 89
3736 89 167 11 33 -212 -124 64 -103 288 -444 -96 35 170 -174 -34 7 51 -153 39 -100 -66 134 -39
3758 -39 100 -32 -72 -233 -226 -134 74 156 -25 -73 189 52 -313 -145 -146 -65 -21 -83 -10 -72 1 30 22 -211 -317 6
3784 6 -69 -108 -89 177 -54 -114 69 -14 59 -69 -230 93 9 -206 -143 86 29 91 11 35 -80 -292 -140 -1 100
3809 100 170 -39 -56 -39 22 39 -102 50 -378 -196 -12 -16 -99 1 -1 -186 209 -30 189 57 104 -442 -219 80
3833 80 127 -20 -45 -129 -107 -221 99 -83 -211 -134 -264 60 -124 -187 -123 86 193 113 61 2 449 -27 24 -160
$$ packed form
3666A33j44rN8j7L3j62K45k91J70N4n4l01L67l20K97j09K1j33J91j34l47N97q
3689A37n0j10L8K41n3l08j7K36p5K3K34k67k92K61J64J1j11j86R6j29J10M7K87
3712B87j73j40K67q0k68QK14k37P1q2O9N6r7o4o2J47R0k14K60k9J98k98O4J02
3736H9P8j56K2k45Q8J88j67L91p32L48J31J35l44J40M1M4k04J92j39L4K00j73
3758c9J39j32m0j61PR2K08Q2j81m8K62j37l65J68jQ1M4o2P3o2P3K9qk33j06L23
3784Fp5l9J9K66k31o0J83q3P3j28j61L23q4k15O3K29n7O2q0K4j15k12J52J39J01
3809A00P0k09j7J7O1J7j41J52m28J82J84mq3J00kj85L95k39K19j32M7n46K23K99
3833H0M7j47k5q4K2j14L20j82j28P7j30L24j84o3O4K09J07q0n2n9M47m76N1j84
$$ plain form
3857 -160 -109 -233 -87 -205 65 154 -6 1 57 -95 121 75 18 -141 263 -187 -231 219 -258 53 57 -88 -325
3880 -325 -200 154 -54 -44 32 -64 -57 -188 158 12 11 -232 107 98 45 217 -121 -161 -53 -142 -81 -69 57 35 164
3905 164 62 -94 27 -17 -67 -130 -81 180 90 -255 -48 91 21 -64 -115 196 -110 -20 -76 107 -8 -244 -61
3928 -61 142 -66 68 -170 33 114 -144 -194 56 -234 3 21 -2 -144 -21 -215 270 340 161 -69 -155 -117 -34
3951 -34 -107 -235 -21 -72 -86 -154 64 84 64 -17 -82 104 95 10 265 -105 185 -128 140 93 32 -204 -94 -48 -110
3976 -110 -194 78 131 3 -23 -141 11 -68 -185 -224 -47 13 -178 30 120 -30 -248 -6 -88 -74 105 191 197 -75
4000 -75 76 278 -13 17 59 -145 49 -28 -67 9 211 76 73 -190 360 47 -84 155 -160 42 60 225 -69
4023 -69 54 -138 -56 -77 142 48 224 65 244 252 -192 -16 -23 -222 129 41 137 -109 -251 -60 -26 154 -274 229
$$ packed form
3857a60N1j24J46j18K70Q9j60PN6j52K16m6n7j59M04m50m4M50m77L11Mj45k37
3880c25J25L54k08J0P6r6Pj31L46j46jk43L39rn3J72l38m0J08q9O1J2J26k2J29
3905A64j02j56J21m4n0o3M9K61r0l45K07J39p0q5n1L11l06R0n6J83j15k36J83
3928f1K03k08J34k38K03Q1k58n0K50k90K37J8k3j42J23j94M85P0j79k30q6L8Q3
3951c4p3j28K14n1j4o8K18K0k0q1o5J86rq5K55l70K90l13K68m7o1k36J10M6o2
3976a10q4K72N3j28k6j18J52p9j17l9J77O0j91K08R0j50k18K42q2J4J79Q6Ok72
4000g5J51K02k91L0M2k04J94p7l9P6K02j35lk63N50l13j31K39l15K02J8J65k94
4023f9J23j92Q2k1K19r4J76j59J79Qm44J76pj99L51q8R6k46j42J91L4J80m28N03
$$ plain form
4047 229 -36 -115 -36 14 -30 -22 -43 24 3 102 19 -65 -254 106 106 215 157 29 127 162 -8 325 56 79 -104 -371
4073 -371 50 -155 187 333 119 -55 -82 -49 66 76 -214 -144 23 253 19 64 71 -8 10 194 104 141 -68 -101
4097 -101 27 -131 -47 -55 313 -21 422 -68 -1 -38 147 86 -389 121 -73 -121 -48 -26 58 -138 112 89 -178 78
4121 78 72 40 -74 174 -92 163 73 -65 23 -195 23 -232 214 60 -221 -183 16 39 -235 110 -31 -120 -22
4144 -22 61 -124 132 36 71 29 -165 245 173 -23 -121 -57 8 -139 84 77 66 -86 -123 -360 27 -45 -106 114 -3
4169 -3 124 -146 -127 11 -112 206 262 11 57 342 195 244 148 42 -190 80 48 -52 104 104 -183 -119 -162 174
4193 174 -403 -182 -128 -107 -127 -157 -260 -258 90 72 -316 -68 82 42 -107 -256 270 -78 -151 224 87 -91 -94 -101
4217 -101 4 95 -105 88 35 131 314 -144 243 -194 -126 -62 -217 -64 79 18 107 582 61 166 -131 185
$$ packed form
4047B29k65p9P9N0m4Qk1O7k1R9q3q4j89L60%J09n8j28R8L5j70L33k69K3j83k67
4073c71M21k05L42J46k14j74k7L3J15J0k90P0J67K30k34M5Pp9J8J84r0L7k09l3
4097a01J28j58Q4qL68l34M43m90O7l7J85o1m75N10j94m8P3K2Q4j96K50k3k67K56
4121G8ol2j14K48k66K55r0j38Q8k18K18k55M46j54k81L8J99K3k74L45j41q9R8
4144b2Q3j85K56r6L5m2j94M10p2j96r8O4O5j47K23pj1j52l7k37L87p2o1K20j17
4169cJ27k70J9J38j23L18N6k51M6K85j47M9r6j06k32K70l2j00J56%k87O4m3L36
4193A74n77K21N4K1k0l0j03KL48j8l88K48J50m0j49j49N26l48p3L75j37j78lp
4217a01J05R1k00J93n3R6J83m58L87m37O8O4j55J53J43o1Q9M75n21J05k97L16
$$ plain form
4239 185 -128 -170 -236 210 305 -103 229 305 -9 18 8 -201 -225 -255 46 59 -37 -69 -57 51 -220 -85 66 -10
4263 -10 57 -34 181 25 65 154 179 -75 -88 65 194 -171 -139 -92 170 -218 -97 237 77 192 -196 -18 -41
4286 -41 139 87 -139 144 -366 -222 -78 -15 177 81 -200 53 -331 20 -61 -318 163 -193 -163 209 -180 -244
4308 -244 40 -111 196 -63 137 -239 194 -85 235 48 -243 243 10 -1 40 -312 -30 -49 30 -208 105
4329 105 69 -181 94 93 135 179 54 -88 54 73 33 311 364 -12 230 171 -85 -2 20 64 -49 75 -53 -201
4353 -201 -97 104 290 41 12 117 -93 -75 126 -49 221 -26 -177 134 87 116 -39 52 160 180 249 172 268
4376 268 118 96 -36 125 -168 12 -256 -8 103 -217 159 -160 -67 -1 55 151 -7 40 -144 242 -57 72
4398 72 202 302 56 -154 82 -96 -205 230 -77 -22 101 -244 131 136 180 31 -22 -64 133 189 -103 -121 61
$$ packed form
4239A85l13m2o6M46R5m08L32P6l14K7j0k09k4l0L01J3r6l2J2J08k71J35J51p6
4263a0O7r1K15j56M0Q9K5k54j3J53J29l65L2M7K62l88J21L34j60J15l88J78k3
4286d1J80n2k26K83n10J44J44O3J92r6k81K53l84L51q1k57M81l56L0L72l89o4
4308b44K84j51L07k59K00l76M33k79L20j87k91M86k33j1M1l52K82j9P9k38L13
4329A05l6k50K75jM2M4j25j42J42J9m0K78N3l76K42n9k56Q3K2M4j13J24j28j48
4353b01J04K01J86k49k9J05k10J8K01j75K70k47j51L11m7K9j55R1J08K0O9p7R6
4376B68j50k2j32J61k93J80k68K48J11l20L76l19R3O6N6R6j58M7j84L86k99J29
4398G2J30J00k46k10K36j78j09M35l07N5J23l45L75NM4j49n3m2J97N6k92j8J82
$$ plain form
4421 61 103 67 -44 42 114 -9 -11 46 -122 115 -139 -46 -9 158 -78 -137 -307 95 -178 -141 -48 -157 113 66 90
4446 90 340 -342 -73 -223 129 -187 16 37 -231 91 185 -106 36 -195 214 138 55 -115 267 183 8 -64
4468 -64 -70 -11 -57 -116 -231 -21 -392 -70 -119 231 17 26 -109 -272 -172 80 -114 18 -118 105 -73 -61 373
4491 373 151 9 -108 152 23 172 129 92 -350 -121 11 112 -14 -58 29 -74 138 -167 -230 -26 -43 -82
4513 -82 49 169 -62 86 152 107 146 -59 179 -22 -112 60 23 249 73 -143 -5 -169 -23 -126 40 432
4535 432 -155 -153 -116 228 202 -155 -109 -55 102 277 227 -13 -155 -17 113 -161 -42 -235 -54 -54 -248 -182 -121 59
4559 59 -83 79 -161 21 133 -176 -46 20 70 218 -30 49 53 45 -131 -64 -43 -179 -88 121 -44 37 -35 31 -40
4584 -40 -159 119 -30 96 -95 -153 -182 457 28 -114 -4 -183 -35 -57 136 26 -21 -227 -61 64 44 95
$$ packed form
4421F1M2l6j11Q6P2j23kN7j68K37k54R3L7J67k36n9j70M02k73L7R3j09K70m7K4
4446I0K50o82K69j50L52l16K03K1k68L22R4k91J42k31M09p6q3j70L82q4j75p2
4468f4oN9m6n9j15K10l71L22m9L50k14Rj35j63J00K52j94J32j36K23j78J2M34
4491C73k22j42j17K60j29J49m3l7m42K29J32J01j26m4Q7j03K12l05o3K04j7l9
4513h2J31J20k31J48O6m5L9k05K38k01r0J72l7K26j76k16J38j64J46j03J66L92
4535D32n87KL7L44k6l57M6N4J57J75n0k40j42J38J30k74J19j93J81%j94O6O1J80
4559E9j42J62k40J82J12l09J30O6N0J48k48P9Mqj76O7K1j36R1K09j65Q1p2O6p1
4584d0j19K78j49J26j91n8k9O39m29j42J10j79J48k2J93j10m7k06J66J25k0N1
$$ plain form
4606 95 17 -96 -99 131 47 143 -33 73 361 111 154 91 -113 170 92 193 -132 35 91 -81 -47 -235 253 95
4630 95 208 219 -175 -181 -33 -357 -17 -52 -11 -105 -31 10 -200 16 63 118 134 -27 151 -225 -133 -149 50 88 274
4655 274 -37 380 169 -40 88 -21 106 -73 240 29 -32 -177 176 43 85 39 30 115 -143 -9 -103 -309
4677 -309 -34 88 -191 18 137 -310 163 -21 -89 -33 136 -48 216 -114 -115 71 54 -30 379 262 172 61
4699 61 157 -84 167 235 69 91 258 143 61 -4 269 7 -81 23 280 -16 -64 -111 -94 5 147 -131 -101 39
4723 39 -191 55 -74 202 -88 -150 -58 -99 108 -155 55 -238 -86 -101 -209 -54 120 -69 331 -203 -126 133
4745 133 71 24 69 15 -207 -279 112 -51 -15 -172 -125 244 -23 72 84 97 -47 15 -20 40 306 180 -306 258
4769 258 -121 67 -173 3 12 190 84 164 -87 42 63 177 82 -7 173 24 133 79 -9 31 -96 -57 -47 -81
$$ packed form
4606I5p8j13lK30q4R6j76J06K88k50M3o3k04K83p8J01l25J67N6j72L4j88M88j58
4630I5J13J1l94oJ48l24L40l5M1r4P4M1k10K16M7N5J6j61J78l76R2j6J99L8J86
4655B74l11M17k11k09J28j09J27j79L13k11o1j45L53j33M2m6rQ5k58J34r4k06
4677c09K75J22k79K09J19m47M73j84o8N6J69j84K64l30jJ86j7q4M09j17r0j11
4699F1R6k41K51O8j66K2J67j15q2o5K73k62q8J04K57k96m8m7J7R9J42k78L0J40
4723C9k30K46j29K76k90o2R2m1K07k63K10k93J52j5j08J55J74j89M00n34P7K59
4745A33o2m7M5n4k22p2L91j63L6j57M7L69k67R5J2J3j44O2l5O0K66j26m86N64
4769B58l79J88k40J76RJ78j06Q0k51J29K1J14r5q9J80j49J09n4q8M0j27L9J0l4
$$ plain form
4793 -81 1 27 137 113 56 205 242 95 119 -198 75 -137 -78 -128 246 -184 386 123 -94 170 -119 -126 -108 26
4817 26 34 183 -235 29 -182 290 43 -124 164 108 18 41 -10 -189 -273 77 83 174 -228 -61 -21 65 110 97 -3
4842 -3 -11 62 26 23 -142 -87 42 35 -18 -83 -210 278 8 185 -255 66 80 183 114 -55 74 -153 -144 8 -128 -7
4868 -7 -114 -157 -288 160 280 35 -36 57 56 61 -118 31 38 -208 -79 -147 -86 -96 -169 50 -311 64 -126 -169 -21
4893 -21 -49 285 -15 134 85 -114 127 -56 -74 95 -67 121 -286 169 335 -131 38 128 3 14 -30 114
4915 114 -104 -187 -53 -261 77 -456 -413 -204 -37 -52 188 -109 -51 30 -133 -6 229 -121 -28 -201 -181 -145 37
4938 37 260 -89 -103 19 256 -149 220 182 14 214 -65 -159 -2 -143 13 115 304 -122 61 -10 -64 32
4960 32 -36 73 -11 8 11 -155 49 -2 98 243 -193 149 11 153 -54 119 280 -50 -176 -162 72 -36 -88
$$ packed form
4793h1Q2K6J10k4n7J49L7j47K4l17K73k12N9n0L74m30N70k63k17K64k89pJ8J34
4817B6QJ49m18K64k11M72k47j67K88n6r0K3n1j79q4L50OR1m02J67M0Q6M5j3j00
4842cqP3l6lj65N5J29pn3o5j27M88k70J77m40L21J4J03o9j69J29k27RJ52j36J21
4868gj07m3j31M48J20k45p1R3jNj79J49Pk46J29o8O1j0p3K19l61L75j90m3J48
4893b1k8L34l00J49m9j99K41j83j8J69j62J88m07M55J66m66J69R0j25J1m4J44
4915A14k18q3J34k08L38n33M3K09J67j5K40k97N8Q1j63J27K35l50R3j73K0L6J82
4938C7K23l49j4J22K37m05L69l8j68K00k79r4J57j41J56J02J89m26J83p1n4R6
4960C2o8J09q4J9Lj66K04n1J00J45m36L42j38J42k07J73J61l30j26J4K34j08n2
$$ plain form
4983 -88 149 155 -117 68 19 13 -102 76 257 -229 65 53 18 -106 -152 15 -208 -34 -120 -43 40 -195 -38 7
5007 7 31 62 105 -46 40 116 121 74 111 -101 218 -268 -177 57 103 -64 -104 -134 236 196 -13 -277 87 109 -205 117
5033 117 61 2 -166 151 -241 154 193 -184 -94 14 -47 -91 26 -43 -266 -130 -77 37 40 -59 349 -55 -93 -198
5057 -198 -109 -49 -182 100 -32 187 176 -10 10 86 -11 36 -166 24 171 85 -46 -14 -19 -53 -96 21 43 24 338
5082 338 65 -51 -131 38 -200 -113 255 145 -36 182 35 181 60 -249 139 134 -128 -93 54 -146 270 -57
5104 -57 107 123 -50 -10 215 287 19 -88 -29 246 84 -23 105 -161 -28 200 -42 -14 17 -5 247 52 -51
5127 -51 -219 55 200 -98 140 -154 53 -123 -176 -60 43 -74 5 78 -199 -21 164 -51 -52 -31 -190 -99 21
5150 21 -156 192 228 -58 279 144 -27 -117 120 -45 -118 340 -81 119 87 166 -19 -152 32 13 20 -44 -13 35
$$ packed form
4983h8K37Ok72J85m9oj15J78J81m86K94j2l5j24m6J67k23J74q6P7Q3k35J57M5
5007GK4L1M3j51Q6P6Nm7L7k12L19m86R1K34M6j67m0l0L70m0k09k64L64K2l14L22
5033A17n6n9j68L17l92L95L9l77R0J08o1m4J17o9k23J36N3J14Lr9M08m04l8j05
5057a98Q9O0j33K82j32K19j1j86K0P6r7M7k02J90J47q6j31L2nl4m3J17K2j9L14
5082C38k73j16q0J69k38Q7L68j10j81K18j47J46j21l09L88nk62L5J47k00M16l27
5104e7J64J6j73M0K25P2k68j07N9K75j62j07J28k66J33K28k42K8L1k2K52j95j03
5127e1j68K74J45k98K38k94K07j76n3J16J03j17P9P3k77J78J85k15jK1j59R1J20
5150B1j77L48L6k86L37j35j71r0K37j65p3M58m21K00l2P9j85j33J84j9Po4L1M8
$$ plain form
5174 35 130 -69 62 49 6 -267 -69 175 -43 114 -50 154 113 124 119 -129 5 -96 -199 -140 -265 43 151
5197 151 -326 214 -43 88 191 73 -74 67 7 42 -94 -111 170 203 -109 17 -67 -107 -61 -64 -89 -32 73 -71
5221 -71 -247 155 -125 -19 102 -122 -123 -77 -40 -55 -96 -6 403 -142 124 98 -87 185 -85 146 -245 -356 117
5244 117 143 141 127 -263 91 71 -181 191 159 146 -158 -28 -63 -6 -67 6 124 -173 121 -30 -43 34 -22 162 177
5269 177 -24 184 112 -29 -143 38 -111 -12 82 -79 -99 -110 -28 -151 -44 170 -66 -105 -22 -35 239 -98 -136
5292 -136 43 -59 -7 -181 -7 138 -212 298 -84 194 31 -69 175 117 -103 81 342 -26 20 -281 72
5313 72 -126 -131 -102 -108 35 -83 -46 157 35 -128 214 69 -60 223 113 -106 -262 -67 -28 117 -15 -66 145
5336 145 69 26 91 217 -106 102 -246 35 1 136 158 57 -90 85 -107 -301 117 74 52 -11 -8 -256 -27
$$ packed form
5174C5R5j99J31j3m3k73J98K44k18J57j64K04m1J1nk48J34j01j03N9j25L08J08
5197A51m77N40k57J31J03j18j47J41o0L5j36j7K81L3l12J26q4m0M6lk5N7J05j44
5221g1j76M02k80J06J21k24jM6L7j5m1R0M09n45K66k6j85K72k70K31l91j11M73
5244A17K6kj4l90L54k0k52L72l2j3l04J30l5N7o1P3J18k97K94j51j3P7n6J84J5
5269A77k01K08p2j41j14J81j49R9R4j61k0j1Q2j23J07K14k36l9Q3j3K74l37l8
5292a36J79j02N2j74J74J45l50N10l82K78j63j00K44n8k20J84K61l68M6l01L53
5313G2j98nK9oJ43j18L7K03j22j63L42j45j29K83j10k19j56J95L9J45j32n1K11
5336A45p6m3O5J26l23K08l48K81l4J35K2j01j47J75j92j94M18m3k2o3Lk48K29
$$ plain form
5359 -27 -124 -3 131 133 -108 105 -6 59 -54 -70 -13 165 293 -27 51 -138 -127 -92 81 63 63 122 -86 -163 -134
5384 -134 -62 -15 -19 -6 58 -88 79 39 -3 -97 -101 -235 33 -222 139 -78 -42 -115 18 -38 164 27 -151 81 -113
5409 -113 -25 -153 -219 -129 113 -117 179 111 40 149 94 -125 32 157 141 -256 -92 -115 -61 -83 -209 -10 -151
5432 -151 2 306 -86 162 174 143 -13 -10 -57 26 18 -123 -134 9 141 -153 167 -72 -33 -65 -351 -311 -288 23
5456 23 17 -150 325 -56 39 124 214 131 -36 -141 107 -240 -133 -21 103 -151 -73 201 -2 251 -310 -134 -11
5479 -11 -131 187 37 13 -72 40 -162 -99 405 -27 -54 131 -95 141 227 52 45 73 -83 -17 -80 235 32 111
5503 111 -79 -195 327 -206 13 39 -67 1 137 113 182 230 21 -64 178 86 170 -83 -30 -270 315 -255 -94
5526 -94 -78 -112 -172 -75 -85 -116 -98 -23 -282 217 31 113 -60 -263 8 -18 -179 -42 189 135 109 -171 -207 262 162
$$ packed form
5359b7r7J21J34Kk41K13j11O5j13j6N7J78J28l20P8j89J1L5J73j8%N9k08p7K9
5384a34P2M7mJ3O4j46J67m0m2r4mj34K68k55L61k17L6p3J33n6K02j37j78K32j94
5409a13Q8j28o6R0K42k30K96o8p1J09n5k19J57J25j6l97J64k3N4k2j26J99j41
5432a51J53L04l92K48J2l1j56Lm7Q3qj41j1J43J32k94L20k39L9l2k86M0K3L11
5456B3oj67M75l81R5Q5R0q3j67j05K48l47J07J12J24k54P8K74k03K53n61J76J23
5479a1j20L18j50k4q5J12k02O3N04m32k7J85k26K36Q6j75pK8j56O6o3L15k03P9
5503A11j90j16N22n33K19K6j06O8J36k4O9M8k09q5K42r2Q4k53N3k40N85n70J61
5526i4J6l4o0R7j0l1J8P5k59M99j86Q2j73k03K71k6j61J37K31n4k6k80l6M69j00
$$ plain form
5551 162 176 -88 35 248 132 -2 12 -38 115 -140 91 -238 -82 88 263 9 -118 209 229 -24 -192
5572 -192 -20 -199 57 -46 -105 52 -207 149 -55 -93 -9 -271 11 111 -28 -36 71 48 35 -101 231 86
5594 86 65 181 105 236 36 199 4 22 24 -68 97 214 31 -213 -11 255 -73 59 -168 -79 139 252 -47
5617 -47 170 88 17 -255 -142 4 -181 165 -13 115 177 -173 -55 -135 -61 176 -79 211 154 -46 -120 -118 -81 -347
5641 -347 -290 100 -62 97 107 -212 197 238 -76 -71 61 -39 -250 111 -208 187 -21 41 -122 111 84 -91
5663 -91 108 74 -4 -130 57 -69 -51 -158 55 131 200 -40 163 -44 -99 7 -195 -88 -418 341 211 -220
5685 -220 -152 -163 -166 -92 -1 9 208 -122 -145 -61 -31 -84 108 81 -146 -145 151 134 -36 86 151 -43 -194 -121 43 -134
5711 -134 58 -248 83 76 95 363 -125 157 -5 -8 -156 25 25 51 1 167 5 -191 130 -50 -119 165 -35
$$ packed form
5551A62J4k64J23K13j16j34J4n0J53k55K31l29J56J70J75k54j27L27K0k53j68
5572a92J72j79K56j03n9J57k59L56k04l8Q4k62K82J00j39qJ07k3j3j36L32j45
5594H6k1J16p6J31k00J63j95J8Kr2J65J17j83k44K02K66l28J32k27Q9K18J13k99
5617d7K17q2p1k72J13J46j85L46j78J28O2l50J18q0P4K37k55K90n7k00p4KL7k66
5641c47N7L90j62J59J0l19M09M1l14NJ32j00k11L61l19L95k08O2j63K33k7j75
5663i1J99l4p8j26J87j26J8j07K13P6O9k40K03k07n5J06k02J07l30P59j30m31
5685b20O8j1lP4R1J0J99l30k3Q4L0n3J92k7k27JK96j7j70J22O5j94j51P3J64j77
5711a34J92l06L31pJ9K68m88K82j62lj48J81%K6n0J66j62j96L21j80o9K84k00
$$ plain form
5734 -35 55 -22 -130 117 -179 192 127 6 -62 -116 -146 -209 -73 227 -279 160 -32 -99 -131 -33 -73 310 55 -207
5758 -207 30 -35 270 18 200 282 -94 172 -26 -32 57 -181 -127 -86 131 57 -148 280 72 109 16 -76 11 -221
5782 -221 -113 182 -54 61 -26 4 283 131 -8 -81 -205 315 45 -375 240 46 108 21 -42 -210 -50 -55 40
5805 40 -29 -134 150 144 84 -19 40 -264 -281 -120 -220 -145 -189 -19 8 245 -165 -27 -63 -5 -60 95 48 83 179
5830 179 -41 43 -222 174 49 -25 -79 -8 -147 190 -107 -215 130 -44 -29 -86 235 117 301 262 -62 -31 -332
5853 -332 -138 82 88 53 -37 93 113 -143 214 31 -13 91 -165 159 39 -220 -156 216 -64 102 208 58
5875 58 -172 145 181 -88 156 -172 -1 -39 179 -96 -88 -317 -41 -119 -154 -116 -196 159 22 -177 184 -98 145
5898 145 65 49 -123 -200 -197 300 -150 153 -88 -22 -43 -135 -120 -14 93 40 157 125 -116 97 205 -73 316 -216
$$ packed form
5734c5R0p7j08K47k96L71o5j21o8n4l0o3J36L00n06M39j92o7l2R8m0L83k55k62
5758b07K37o5L05k52J82Q2l76K66j98oQ9k38N4M1K17p4k05M28k08L7r3r2Q7k32
5782b21J08K95k36J15q7L0K79j52j39p3j24N20k70m20O15j94O2q7o3j68J60nR5
5805D0o9j05K84oo0j03N9l04j7J61j00P5m4J70K7K37m10J38l6N8n5J55m7L5R6
5830A79k20Q4k65L96j25p4n4P1j39L37k97j08L45j74J5n7L21j18J84l9l24L1l01
5853c32J94K20Ol5r0J30K0k56L57j83m4J04k56L24j20k59O4L72k80J66J06j50
5875E8k30L17L6k69K44l28J71l8K18k75Qk29K76p8l5L8q0L55j37j99L61k82K43
5898A45q0j6j72p7LM97m50L03k41O6k1r2J5J06J07n3J17l2k41K13J08k78L89n32
$$ plain form
5922 -216 68 -105 45 -58 79 227 -86 70 15 3 -20 14 -58 201 -226 116 91 -38 -282 238 -46 -130
5944 -130 -46 -308 213 19 -3 174 -132 -9 -115 -168 356 -77 -65 -62 149 -132 102 -110 50 145 38 98 27
5967 27 -311 182 -16 -154 -283 61 -64 -133 229 -83 13 140 57 120 -74 -16 -42 -397 -225 -243 108 -129 27
5990 27 202 248 -71 -145 -36 -107 47 -114 -73 323 33 -176 -78 24 -23 16 144 155 -20 -42 17 -5 39 -32 179
6015 179 3 -103 -52 -85 160 71 -17 135 -44 237 172 -106 82 -15 2 -178 58 39 -170 -104 224 -41 179
6038 179 28 -5 120 74 72 -49 -41 -208 78 20 -243 4 -11 163 150 -22 113 -7 37 132 -151 -151 30 3 -411
6063 -411 -77 -17 104 -168 288 -243 12 212 164 -330 264 310 -64 18 -31 252 25 -251 -229 20 126 -68
6085 -68 -232 -126 45 3 12 -87 49 135 105 138 -178 -53 63 -2 95 73 44 -310 47 -352 -329 -19 112 -130
$$ packed form
5922b16K84j73J50j03J37J48l13J56n5j2k3L4p2K59m27L42k5j29k44N20k84q4
5944a30Q4k62N21j94k2J77l06J23j06n3N24m33J2LK11k81K34k12J60R5j07O0p1
5967B7l38M93j98j38j29L44j25o9L62l12R6J27q3O3j94N8k6l55J72j8L51k37J56
5990B7J75M6l19p4J09p1J54j61M1L96k90k09R8J02m7L9J28J1j75k2N9k2M4p1K11
6015A79j76j06N1l3K45q9q8J52j79K81o5k78J88r7J7j80K36j9k09O6L28k65K20
6038A79j51l3J25m6kj21Qj67K86n8k63K47j5J74j3j72J35j20M4R5k83%J81k7m14
6063d11L34O0J21k72M56n31K55K00m8m94N94M6l74Q2m9K83k27k76K2K49J06j94
6085f8j64J06J71m2Rr9J36Q6l0L3l16J25J16o5R7k2k9l54L57l99K3L10J31k42
$$ plain form
6109 -130 -17 51 -180 -431 -264 -162 19 -2 -68 -254 26 -4 -308 119 -479 46 34 222 236 -31 -137 -143 -34
6132 -34 -286 129 -52 -231 -71 282 320 -174 5 178 -21 9 291 134 210 -226 -229 8 152 111 330 -218
6154 -218 -57 2 -93 48 192 -200 -18 -210 77 96 51 180 -293 -218 -40 -327 81 15 190 -160 -244 112
6176 112 75 -194 264 175 -218 -141 35 -262 -58 130 -75 37 174 -119 140 81 -128 -102 -53 52 -179 -135
6198 -135 -348 -119 -12 102 57 63 294 -66 59 59 114 -267 172 -81 -230 62 -157 118 192 122 199 49 98
6221 98 177 64 -79 13 166 -43 -29 160 17 21 -68 -400 -91 114 85 -106 140 22 -67 -35 -63 -68 -20 -237 17
6246 17 -87 -80 113 -171 171 -100 -23 -206 13 35 161 104 83 -204 243 -72 -150 193 -131 -225 122 58 -21 102
6270 102 302 145 142 29 -182 76 44 -217 -182 261 -93 -122 -242 -169 128 -214 25 -117 4 83 -22 -12 -130
$$ packed form
6109a30J13O8k31k51J67J02J81k1o6j86K80l0l04M27n98N25j2J88J4k67j06oJ09
6132c4k52M15j81j79J60L53L8m94J79J73j99L0K82j57P6m36lK37J44m1K19n48
6154b18J61N9r5J41J44l92J82j92K87J9m5J29m73P5J78k87M08o6J75l50q4L56
6176A12l7k69M58q9l93P7J76k97K04J88k05J12J37k93K59n9k09K6M9J05k31M4
6198a35k13K29J07J14m5OK31l60J25%N5l81M39k53j49K92k19K75P4p0P7j50M9
6221I8P9j13j43R2J53k09J4J89j43Mq9l32L09K05k9j91K46j18q9L2k8nM8k17K54
6246A7j04PJ93k84L42k71P7j83K19K2J26n7k1k87M47l15p8L43l24r4L47o4p9J23
6270A02K00j57lj13k11K58l2k61L5M43l54k9j20P3K97l42K39j42J21P9j05J0j18
$$ plain form
6293 -130 -19 -75 68 129 -160 -18 207 -92 -132 -97 131 -89 358 280 -47 -32 96 206 168 -353 64 196
6315 196 -149 10 33 253 -199 153 -319 24 -158 -114 168 91 185 -120 345 -145 -10 -100 -96 124 50 -103 -99
6338 -99 -116 78 -87 -57 3 448 42 112 -19 -63 88 180 -48 105 48 -65 114 103 14 36 -63 -268 -9 -24
6362 -24 85 -203 43 24 -20 86 31 -50 200 66 1 152 -196 -136 122 140 119 -270 -157 -87 -59 -152 -197 -149 -6
6387 -6 86 -54 -199 81 87 -257 12 -319 -142 -208 208 -150 11 -115 66 25 -7 155 -18 -60 176 -88 -122
6410 -122 -295 146 201 34 -113 -90 -85 9 100 4 -17 206 -111 18 -199 -59 269 -4 -54 14 108 101 79 229 71
$$ packed form
6293a30J11n6J43O1k89J42K25k99m0L5K28k20M47p8l27J5J28J10l8n21M17J32
6315A96l45J59K3K20m52L52m72L43j82M4K82p7R4l05M65m90J35r0MK20p4j53M
6338i9j7J94j65L0O0M45m06P0j31m4J51R2k28J53n7j13J79j1q9K2r9k05K59j5
6362b4J09k88K46j9m4J06n5q1K50j34o5J51l48O0K58J8k1l89J13P0K8r3m5M8J43
6387fR2j40j45K80Ol44K69l31J77o6M16l58J61j26J81m1l2J62j73m2K36k64l4
6410a22j73M41N5j67j47K3NR4R1r6k1K23l17J29k17J40L28k73n0O8R4pk2J50j58
$$ [...]
8191A48
##END NTUPLES=NMR FID
##END=
