##TITLE=1H_DE-78_oil5_TFA2
 CDCl3
 8 sc, 
 25.12.2024
##JCAMPDX= 6.0         $$ Bruker NMR JCAMP-DX V2.0
##DATA TYPE= NMR FID
##DATA CLASS= NTUPLES
##ORIGIN= UXNMR, Bruker Analytische Messtechnik GmbH
##OWNER= root
$$ XWIN-NMR		Version 3.5
$$ Wed Dec 25 15:24:28 2024 Russian Standard Time (UT+4h)  she@DPX200
##.OBSERVE FREQUENCY= 200.1315
##.OBSERVE NUCLEUS= ^1H
##.DELAY= (6, 6)
##.ACQUISITION MODE= SIMULTANEOUS
##.ACQUISITION SCHEME= undefined
##.AVERAGES= 8
##.DIGITISER RES= 18
##SPECTROMETER/DATA SYSTEM= spect
##.PULSE SEQUENCE= zg30
##.SOLVENT NAME= D2O
##.SHIFT REFERENCE= (INTERNAL, D2O, 0, 15.7039)
##AUDIT TRAIL= $$ (NUMBER, WHEN, WHO, WHERE, WHAT)
$$ ##TITLE= Audit trail, XWIN-NMR		Version 3.5
$$ ##JCAMPDX= 5.01
$$ ##ORIGIN= Bruker BioSpin GmbH
$$ ##OWNER= she
$$ F:/spectra/data/she/nmr/H-F/1/audita.txt
$$ ##AUDIT TRAIL=  $$ (NUMBER, WHEN, WHO, WHERE, WHAT)
(   1,<2024-12-25 15:23:29.43 +0400>,<she>,<DPX200>,
      <created by zg, POWCHK disabled, PULCHK disabled
       configuration hash MD5:
       00 E9 B6 7A A2 85 ED C7 34 08 36 98 17 FE 4E 26
       data hash MD5: 16K
       84 81 4E F6 32 DC 94 60 B0 FB 62 D3 3B A7 45 AD>)
$$ ##END=
$$ 
$$ hash MD5
$$ 27 58 A0 2F 8E B1 04 40 8B AF 17 D0 13 A3 DB 8C
##$RELAX= 
##$RELAX= 
##$RELAX= 
##$RELAX= 
##$RELAX= 
##$RELAX= 
$$ Bruker specific parameters
$$ --------------------------
##$DU= <F:/spectra>
##$EXPNO= 1
##$NAME= <H-F>
##$PROCNO= 1
##$TYPE= <nmr>
##$USER= <she>
##$AMP= (0..31)
100 100 100 100 100 100 100 100 100 100 100 100 100 100 100 100 100 100 
100 100 100 100 100 100 100 100 100 100 100 100 100 100 
##$AQSEQ= 0
##$AQ_mod= 1
##$AUNM= <au_zg>
##$AUTOPOS= <>
##$BF1= 200.13
##$BF2= 200.13
##$BF3= 200.13
##$BF4= 200.13
##$BF5= 200.13
##$BF6= 200.13
##$BF7= 200.13
##$BF8= 200.13
##$BYTORDA= 1
##$CFDGTYP= 0
##$CFRGTYP= 5
##$CHEMSTR= <none>
##$CNST= (0..31)
1 1 145 1 1 1 1 1 1 1 1 1 1 1 1 1 1 1 1 1 1 1 1 1 1 1 1 1 1 1 1 1 
##$CPDPRG= <>
##$CPDPRG1= <>
##$CPDPRG2= <>
##$CPDPRG3= <>
##$CPDPRG4= <mlev>
##$CPDPRG5= <mlev>
##$CPDPRG6= <mlev>
##$CPDPRG7= <mlev>
##$CPDPRG8= <mlev>
##$CPDPRGB= <>
##$CPDPRGT= <>
##$D= (0..31)
0 1.2 0 0 0 0 0 0 0 0.06 0 0.03 0 0 0 0 0.0002 0 0 0 0 0 0 0 0 0 0 0 0 
0 0 0 
##$DATE= 1735125808
##$DBL= (0..7)
120 120 120 120 120 120 120 120 
##$DBP= (0..7)
150 150 150 150 150 150 150 150 
##$DBP07= 0
##$DBPNAM0= <>
##$DBPNAM1= <>
##$DBPNAM2= <>
##$DBPNAM3= <>
##$DBPNAM4= <>
##$DBPNAM5= <>
##$DBPNAM6= <>
##$DBPNAM7= <>
##$DBPOAL= (0..7)
0.5 0.5 0.5 0.5 0.5 0.5 0.5 0.5 
##$DBPOFFS= (0..7)
0 0 0 0 0 0 0 0 
##$DE= 6
##$DECBNUC= <off>
##$DECIM= 24
##$DECNUC= <off>
##$DECSTAT= 4
##$DIGMOD= 1
##$DIGTYP= 9
##$DL= (0..7)
0 120 120 120 120 120 120 120 
##$DP= (0..7)
150 150 150 150 150 150 150 150 
##$DP07= 0
##$DPNAME0= <>
##$DPNAME1= <>
##$DPNAME2= <>
##$DPNAME3= <>
##$DPNAME4= <>
##$DPNAME5= <>
##$DPNAME6= <>
##$DPNAME7= <>
##$DPOAL= (0..7)
0.5 0.5 0.5 0.5 0.5 0.5 0.5 0.5 
##$DPOFFS= (0..7)
0 0 0 0 0 0 0 0 
##$DQDMODE= 0
##$DR= 18
##$DS= 0
##$DSLIST= <SSSSSSSSSSSSSSS>
$$ [...]
##$SUBNAM2= <"">
##$SUBNAM3= <"">
##$SUBNAM4= <"">
##$SUBNAM5= <"">
##$SUBNAM6= <"">
##$SUBNAM7= <"">
##$SUBNAM8= <"">
##$SUBNAM9= <"">
##$SW= 24.0689530833862
##$SWIBOX= (0..15)
0 0 2 0 0 0 0 0 0 0 0 0 0 0 0 0 
##$SW_h= 4816.95568400771
##$TD= 16384
##$TD0= 1
##$TE= 0
##$TE2= 300
##$TE3= 300
##$TEG= 300
##$TL= (0..7)
0 120 120 120 120 120 120 120 
##$TP= (0..7)
150 150 150 150 150 150 150 150 
##$TP07= 0
##$TPNAME0= <>
##$TPNAME1= <>
##$TPNAME2= <>
##$TPNAME3= <>
##$TPNAME4= <>
##$TPNAME5= <>
##$TPNAME6= <>
##$TPNAME7= <>
##$TPOAL= (0..7)
0.5 0.5 0.5 0.5 0.5 0.5 0.5 0.5 
##$TPOFFS= (0..7)
0 0 0 0 0 0 0 0 
##$TUNHIN= 0
##$TUNHOUT= 0
##$TUNXOUT= 0
##$USERA1= <user>
##$USERA2= <user>
##$USERA3= <user>
##$USERA4= <user>
##$USERA5= <user>
##$V9= 5
##$VALIST= <valist>
##$VCLIST= <CCCCCCCCCCCCCCC>
##$VD= 0
##$VDLIST= <DDDDDDDDDDDDDDD>
##$VPLIST= <PPPPPPPPPPPPPPP>
##$VTLIST= <TTTTTTTTTTTTTTT>
##$WBST= 1024
##$WBSW= 4
##$XGAIN= (0..3)
0 0 0 0 
##$XL= 0
##$YL= 0
##$YMAX_a= 514044
##$YMIN_a= -808186
##$ZGOPTNS= <>
##$ZL1= 120
##$ZL2= 120
##$ZL3= 120
##$ZL4= 120
##$ABSF1= 10
##$ABSF2= 0
##$ABSG= 5
##$ABSL= 3
##$ALPHA= 0
##$AQORDER= 0
##$ASSFAC= 0
##$ASSFACI= 0
##$ASSFACX= 0
##$ASSWID= 0
##$AUNMP= <proc_1d>
##$AZFE= 0.1
##$AZFW= 0.1
##$BCFW= 1
##$BC_mod= 2
##$BYTORDP= 1
##$COROFFS= 0
##$CY= 11.3945322036743
##$DATMOD= 1
##$DC= 2
##$DFILT= <>
##$DTYPP= 0
##$F1P= 15.6554695791079
##$F2P= 12.8336369535428
##$FCOR= 0.5
##$FTSIZE= 0
##$FT_mod= 4
##$GAMMA= 1
##$GB= 0.15
##$INTBC= 1
##$INTSCL= 1
##$ISEN= 128
##$LB= 0.24
##$LEV0= 0
##$LPBIN= 0
##$MAXI= 10000
##$MC2= 0
##$MEAN= 0
##$ME_mod= 0
##$MI= 1.114404
##$NCOEF= 0
##$NC_proc= 0
##$NLEV= 6
##$NOISF1= 3.799351
##$NOISF2= 2.8
##$NSP= 1
##$NTH_PI= 0
##$NZP= 0
##$OFFSET= 15.70392
##$PC= 1
##$PHC0= -26570.32
##$PHC1= 13.78744
##$PH_mod= 1
##$PKNL= yes
##$PPARMOD= 0
##$PSCAL= 0
##$PSIGN= 0
##$REVERSE= no
##$SF= 200.130013532006
##$SI= 16384
##$SIGF1= 3
##$SIGF2= 2
##$SINO= 400
##$SIOLD= 16384
##$SREGLST= <1H.CDCl3>
##$SSB= 0
##$STSI= 0
##$STSR= 0
##$SW_p= 3612.71676300578
##$SYMM= 0
##$S_DEV= 0
##$TDeff= 0
##$TDoff= 0
##$TI= <>
##$TILT= no
##$TM1= 0
##$TM2= 0
##$TOPLEV= 0
##$USERP1= <user>
##$USERP2= <user>
##$USERP3= <user>
##$USERP4= <user>
##$USERP5= <user>
##$WDW= 1
##$XDIM= 8192
##$YMAX_p= 0
##$YMIN_p= 0
$$ End of Bruker specific parameters
$$ ---------------------------------
##NTUPLES= NMR FID
##VAR_NAME=  TIME,          FID/REAL,        FID/IMAG
##SYMBOL=    X,             R,               I
##VAR_TYPE=  INDEPENDENT,   DEPENDENT,       DEPENDENT
##VAR_FORM=  AFFN,          ASDF,            ASDF
##VAR_DIM=   8192,          8192,            8192
##UNITS=     SECONDS,       ARBITRARY UNITS, ARBITRARY UNITS
##FACTOR=    0.0002076,     1,               1
##FIRST=     0,             0,               0
##LAST=      1.7004516,     0,               0
##MIN=       0,             -808186,         0
##MAX=       1.7004516,     514044,          0
$$ Real data points
##PAGE= N=1
##DATA TABLE= (X++(R..R)), XYDATA
$$ [...]
$$ plain form
1977 98 -19 -112 484 -117 -20 57 -143 -252 -10 179 98 -4 -67 130 274 177 -53 222 -334 -18 22 242 74
2000 74 8 43 31 -78 217 156 87 -94 -69 204 13 259 -77 189 -185 232 -272 -192 -89 -83 42 -134 74
2023 74 -355 -39 171 321 18 -102 282 -28 182 261 76 112 -108 84 -179 -144 -44 -188 -73 -21 46 -2
2045 -2 47 235 -193 -80 124 -154 -13 306 171 178 -333 139 99 -42 39 207 -77 -92 -287 18 -374 451 77
2068 77 -170 -177 32 0 91 -380 110 4 -115 -15 222 -9 -153 0 -18 -148 269 -95 -37 168 66 260
2090 260 28 94 -144 -108 127 -89 -149 245 190 42 27 102 34 -31 75 9 6 -44 279 172 -185 54 -430 61
2114 61 238 -65 -140 -155 113 22 20 112 -162 46 34 7 23 -272 398 376 -190 -30 -249 -163 -218 -244 -119 12 29
2139 29 -51 57 -328 -26 182 -343 189 20 -19 -146 -86 77 112 -146 -177 83 -208 191 14 201 -41 -192
$$ packed form
1977I8j17r3N96o01R7P7k00j09K42J89q1j02o3J97J44r7k30K75n56L16M0K20j68
2000G4o6L5j2j09K95o1o9j81K5K73j91K46l36K66l74M17n04Q0J03OJ25j76K08
2023G4m29L16K10J50l03j20L84l10K10P9j85L6k20J92k63L5J00j44J15N2O7m8
2045bM9J88m28J13K04k78J41L19j35Pn11M72m0j41Q1J68k84j5j95L05l92Q25l74
2068G7k47pK09l2R1m71M90j06j19J00K37k31j44J53j8j30M17l64N8K05j02J94
2090B60k32O6k38L6K35k16o0L94n5j48j5P5o8o5J06o6ln0L23j07l57K39m84M91
2114F1J77l03p5j5K68r1kR2k74K08j2k7J6k95O70k2n66J60k19Q6n5k6J25J31J7
2139B9q0J08l85L02K08n25N32j69l9j27O0J63L5k58l1K60k91L99j77J87k42j51
$$ plain form
2161 -192 31 209 -101 -55 40 31 245 -168 214 150 153 -179 -8 -276 -218 -71 -100 97 105 286 53 -44 122 -73
2185 -73 11 20 68 -154 -154 -97 -38 193 90 336 160 202 6 304 -178 -402 157 -116 66 -176 49 -43 -45 59
2209 59 181 48 242 52 -128 -161 -98 353 5 -534 -71 156 -59 -319 188 -5 -93 -95 -103 15 90 -4 77 -5
2233 -5 -211 107 -61 87 283 -140 -233 -355 -1 -313 -32 -18 -104 -133 -28 -151 -295 92 70 -150 -260 -231 -68
2256 -68 -16 -464 -42 -15 -265 -303 144 -183 -95 -49 295 270 187 183 52 246 -160 -13 -48 5 159 -39 -319 319
2280 319 207 15 -212 99 149 -182 283 136 -130 63 291 65 -97 196 -73 -171 -41 -264 335 -124 221
2301 221 -95 -94 -275 55 265 -87 258 -51 -80 -65 -94 -157 -138 -22 207 -60 -93 40 -231 159 -205 -27 108
2324 108 -142 87 -32 127 -141 -34 103 40 114 -11 -163 5 -119 -121 179 -103 53 272 -19 88 125 73
$$ packed form
2161a92K23J78l10M6R5rK14m13L82o4Ll32J71k68N8J47k9J97QJ81k33r7J66j95
2185g3Q4RM8k22%N7N9K31j03K46j76M2j96K98m82k24N59k73J82k42K25r2kJ04
2209E9J22j33J94j90j80l3O3M51l48n39M63K27k15k60N07j93q8kqJ18P5r4Q1q2
2233ek06L18j68J48J96m23r3j22L54l12K81J4q6k9J05j23j44L87k2k20j10K9J63
2256f8N2m48M22K7k50l8M47l27Q8M6L44k5q3mj31J94m06J47l5N3J54j98k80O38
2280C19j12j92k27L11N0l31M65j47k66J93K28k26j62K93k69r8J30k23N99m59L45
2301B21l16Jj81L30K10l52L45l09k9J5k9o3J9J16K29k67l3J33k71L90l64J78J35
2324A08k50K29j19J59k68J07J37o3P4j25j52J68j24kL00k82J56K19k91J07L7n2
$$ plain form
2346 73 -221 25 -58 12 115 -51 -189 108 -65 8 -48 -84 102 195 -81 -326 10 -56 138 232 -116 -257 185
2369 185 -100 -12 -49 -4 213 -57 63 55 -140 -61 105 72 30 8 243 37 208 105 -15 91 -111 -217 194
2392 194 -204 -48 -67 -100 134 131 -4 -175 74 141 352 -228 -87 -94 -129 233 -95 188 158 130 60 -81 63 -199
2416 -199 57 93 -1 -252 -58 251 72 62 -147 -265 -11 -282 -8 220 268 72 -105 -197 109 -100 161 27
2438 27 88 205 -151 236 267 44 -233 37 -140 212 -64 64 -110 -204 68 29 -34 -75 -10 60 47 286 -21
2461 -21 81 71 -72 -11 92 33 86 28 -199 -42 229 297 -168 -260 -102 -232 -123 -9 11 58 -127 -112 191 -145
2485 -145 8 164 -63 -3 42 168 -65 -54 99 131 56 -196 -56 -20 174 328 -173 -283 -267 -104 32 83 187
2508 187 88 -197 -200 20 -11 21 -214 -277 37 184 66 32 314 -103 202 -53 -182 216 -233 -140 -220 57 304
$$ packed form
2346G3k94K46q3P0J03j66j38K97j73P3n6l6J86R3k76k45L36o6J94R4l48j41M42
2369A85k85Q8l7M5K17k70J20qj95P9J66l3m2k2K35k06J71j03j20J06k02j06M11
2392A94l98J56j9l3K34lj35j71K49O7K11n80J41pl5L62l28K83l0k8p0j41J44k62
2416a99K56L6r4k51J94L09j79j0k09j18K54k71K74K28M8j96j77r2L06k09K61j34
2438B7O1J17l56L87L1k23k77K70j77L52k76J28j74r4K72l9o3m1O5P0j3K39l07
2461b1J02j0j43O1J03n9N3n8k27J57K71O8m65r2J58j30J09J14K0M7j85J5L03l36
2485a45J53J56k27O0M5J26k33J1J53L2p5k52J40L6J94J54n01j10J6J63J36N1J04
2508A87r9k85lK20l1L2k35o3L14J47j18l4K82m17L05k55j29L98m49R3q0K77K47
$$ plain form
2531 304 -169 -224 34 -166 -23 -114 88 37 55 207 412 206 158 -118 46 112 26 -124 209 37 58 333 101
2554 101 215 -101 -98 -129 34 -117 -137 59 189 45 169 -80 23 -214 128 -63 -162 -149 244 -4 -186 167
2576 167 -95 -191 -166 46 -12 293 211 -237 -3 79 -239 144 15 -89 -16 -85 -83 377 -45 -115 -19 203 46 -117
2600 -117 42 -114 -3 -33 -293 -60 75 -174 74 1 136 -155 -15 -203 -42 -132 -52 76 322 256 163 -49
2622 -49 229 321 125 -34 288 140 370 169 -436 105 47 -96 -161 350 -64 224 -143 -105 119 -5 -57 -69
2644 -69 -123 38 -44 -34 164 7 -126 7 273 186 106 -30 208 -331 -298 61 203 61 -147 10 -107 317
2666 317 -57 268 182 127 252 -32 52 354 222 136 203 -135 331 380 -212 48 -11 19 -123 -153 171 -11 -79
2689 -79 -73 186 -335 4 198 -238 4 -9 62 12 305 -265 -189 310 -288 -249 -265 23 -85 71 -140 -12 90
$$ packed form
2531C04m73n5K58k00J43r1K02n1J8J52K05k06m8k76J64O6q6j50L33j72K1K75k32
2554A01J14l16Ll1J63j51k0J96J30j44J24k49J03k37L42j91r9J3L93k48j82L53
2576A67k62r6K5K12n8L05q2m48K34Q2l18L83j29j04P3o9KM60m22p0R6K22j57j63
2600a17J59j56J11l0k60K33J35k49K48p3J35k91J40j88J61r0Q0J28K46o6r3k12
2622d9K78R2j96j59L22j48K30k01o05N41n8j43o5N11m14K88l67L8K24j24n2j2
2644f9n4J61q2J0J98j57j33J33K66q7q0j36K38n39L3L59J42j42k08J57j17M24
2666C17l74L25q6n5J25k84Q4L02j32q6O7l38M66M9n92K60n9L0j42l0L24j82o8
2689g9OK59n21L39J94m36K42j3P1n0K93n70P6M99n98L9j6K88j08J56k11J28J02
$$ plain form
2712 90 38 213 142 68 -164 -133 -10 119 -90 -180 -69 217 -116 -26 190 293 255 -17 95 -94 156 58 -266
2735 -266 -44 305 224 137 -44 -52 133 212 242 26 172 93 -160 212 -95 55 -192 -291 20 3 -64 47 -92
2758 -92 -173 25 220 143 102 282 -171 3 160 -221 155 -296 119 -29 170 324 -118 143 153 -130 37 -280
2780 -280 286 3 19 296 -240 48 -80 104 -116 -58 26 -154 -360 157 -195 -24 -106 -32 -46 -217 -155 110
2802 110 -327 -217 -187 -246 -3 61 -80 -18 173 37 106 -55 -135 -54 -262 -292 140 153 -249 -73 -53 275 -133
2825 -133 13 95 -102 112 -12 -204 -195 156 104 -49 135 -149 -85 -55 285 58 233 85 -269 68 -327 137
2847 137 308 188 48 -136 -184 -129 -14 459 36 57 -10 109 138 182 249 -229 121 76 306 99 -30 -66 201
2870 201 -19 11 409 62 80 -144 -18 -78 22 63 -79 114 94 48 97 70 128 105 -142 -90 114 -100 109 -45
$$ packed form
2712I0n2J75p1p4k32L1J23J29k09r0J11K86l33R0K16J03l8k72J12j89K50r8l24
2735b66K22L49q1q7j81qJ85P9L0k16J46p9k53L72l07J50k47r9L11j7o7J11j39
2758i2q1J98J95p7m1J80m53J74J57l81L76m51M15j48J99J54m42K61J0k83J67l17
2780b80N66k83J6K77n36K88j28J84k20N8Q4j80k06N17l52J71q2P4j4j71O2K65
2802A10m37J10L0n9K43O4j41O2J91j36O9j61q0Q1k08l0M32J3m02J76K0L28m08
2825a33J46Q2j97K14j24j92RL51n2j53J84k84O4L0L40k27J75j48l54L37l95M64
2847A37J71j20j40j84m8N5J15M73m23K1o7J19K9M4O7m78L50m5K30k07j29l6K67
2870B01k20L0L98l47J8k24J26o0J00M1j42J93k0m6M9k7N8k3k47N2K04k14K09j54
$$ plain form
2894 -45 90 1 31 -197 -48 -47 -76 114 -325 300 6 339 -348 196 63 -137 -111 -246 -123 -96 42 -35 63
2917 63 282 -97 448 74 310 -168 246 -114 224 281 -94 -171 -172 -17 -11 -274 206 -58 -75 -225 281 -94 -95
2940 -95 -24 55 -126 195 -41 154 80 -166 168 -185 -99 -161 -260 -14 28 -108 -35 -57 -83 -27 105 106 9 16 210 27
2966 27 -16 30 -47 -358 -98 -223 -252 353 2 166 -233 34 22 -25 -127 266 -134 66 485 -66 -172 98
2988 98 146 -37 -168 204 150 88 140 7 -279 -45 245 277 81 -211 25 -112 7 102 202 41 189 58
3010 58 148 21 64 -179 127 79 -221 19 334 137 119 -108 158 -257 232 118 9 -88 82 390 -169 -100
3032 -100 -131 222 -83 240 -19 -48 -90 -283 80 -86 363 -27 337 -16 -258 -145 -271 88 129 37 -185 337
3054 337 92 154 271 43 -62 -74 -144 -207 42 112 45 16 37 554 -236 157 -259 99 221 258 -160 81 267
$$ packed form
2894d5J35q9L0k28J49Jk9J90m39O25k94L33o87N44j33k00K6j35J23K7J38p7R8
2917F3K19l79N45l74K36m78M14l60L38N7l75p7jJ55Ok63M80k64j7j50N06l75j
2940i5P1P9j81L21k36J95p4k46L34l53Q6o2r9K46M2j36P3k2k6N6J32Jr7PJ94j83
2966B7m3M6p7l11K60j25k9O05l51J64l99K67j2m7j02L93m00K00M19n51j06K70
2988I8M8j83j31L72n4o2N2j33k86K34K90L2j96k92K36j37J19R5J00j61J48j31
3010E8R0j27M3k43L06m8l00K40L15j97j8k27K66m15M89j14j09r7J70L08n59O9
3032a00l1L53l05L23k59k9m2j93L63j66M49l90L64l53k42J13j26L59M1r2k22N22
3054C37k45O2J17k28j05j2p0o3K49P0o7k9K1N17p90L93m16L58J22L7m18K41J86
$$ plain form
3077 267 1 184 -81 -225 -104 -138 101 0 333 232 263 235 112 76 274 213 53 -131 -424 -2 -166 -156
3099 -156 -131 -267 -50 -18 -12 3 92 -200 -121 54 -25 90 -191 3 451 -32 89 1 276 47 65 -191 220
3122 220 170 22 236 231 18 245 -56 9 137 -47 137 -171 131 -113 -152 -80 -52 -8 186 161 -56 -184 -102
3145 -102 102 -48 -103 251 43 -12 192 376 -225 133 232 153 162 175 -5 138 -227 22 7 161 245 226 -116
3168 -116 -167 113 -213 -82 -261 65 -33 -57 -61 418 37 -28 407 -108 -153 290 503 147 122 -125 25 -145 259
3191 259 156 -223 157 132 -144 -566 -53 -95 -27 322 105 150 37 -148 -286 58 257 20 -213 -249 -163 0
3213 0 201 -115 118 -37 191 -109 378 -86 93 -33 -12 -345 99 26 -409 -42 59 8 227 26 40 -86
3235 -86 -134 -55 -128 45 -138 10 154 117 59 84 -32 184 182 140 115 133 -211 51 -13 -285 -35 -270 106 -229
$$ packed form
3077B67k66J83k65j44J21l4K39j01L33j01L1k8j23l6J98o1j60j84k93M22j64J0
3099a56K5j36K17L2OJ5Q9k92P9J75p9J15k81J94M48m83J21q8K75k29J8k56M11
3122B20n0j48K14nk13K27l01O5J28j84J84l08L02k44l9P2K8M4J94k5k17j28Q2
3145a02K04j50n5L54k08n5K04J84o01L58R9p9RJ3j80J43l65K49j5J54Q4j9l42
3168a16n1K80l26J31j79L26r8k4mM79l81o5M35n15m5M43K13l56k5k47J50j70M04
3191B59j03l79L80k5k76m22N13m2O8L49k17M5j13j85j38L44J99k37k33l6Q6J63
3213@K01l16K33j55K28l00M87m64J79j26K1l33M44p3m35L67J01n1K19k01J4j26
3235h6m8P9p3J73j83J48J44l7n8K5j16K16km2k5J8l44K62o4k72K50k35L76l35
$$ plain form
3259 -229 111 -93 30 144 -259 -61 -175 -177 -270 -137 85 195 -43 281 -68 9 -22 -110 39 56 206 678
3281 678 -4 -178 114 -167 96 105 212 29 180 234 220 12 -31 23 243 165 116 68 122 -379 -158 -64 -11 -213
3305 -213 -148 -55 164 -89 -85 332 -246 -52 222 -150 -181 -110 239 -272 22 137 209 -38 64 -366 -193 -452
3327 -452 -188 -134 248 84 80 -204 139 140 354 180 59 22 -148 329 8 44 -93 183 38 63 166 190 -121
3350 -121 -109 122 -247 93 2 33 -158 -76 43 7 -374 173 94 -48 -118 -163 -18 -218 49 17 3 67 195 86
3374 86 25 -472 -107 5 40 277 109 -101 -65 31 328 124 -79 -117 100 130 44 -42 -197 -137 -342 215 96
3397 96 8 -55 397 12 153 -208 80 -130 205 -139 92 -17 -174 -84 -101 -185 180 359 -123 9 127 122 -283
3420 -283 157 94 21 -191 89 83 50 119 132 -36 120 -162 -300 -28 194 -153 -207 191 60 26 -13 64 -34 -211
$$ packed form
3259b29L40k04J23J14m03J98j14kr3J33K22J10k38L24l49P7l1q8J49J7J50M72
3281F78o82j74K92k81K63RJ07j83J51N4j4k08m3N4K20p8m9m8N4n01K21R4N3k02
3305b13O5R3K19k53MM17n78J94K74l72l1P1L49n11K94J15P2k47J02m30J73k59
3327d52K64N4L82j64mk84L43JK14j74j21l7j70M77l21L6j37K76j45K5J03K4l11
3350a21J2K31l69L40r1L1j91Q2J19l6l81N47p9j42p0m5J45k00K67l2j4O4J28j09
3374H6o1m97L65J12L5K37j68k10L6R6K97k04k03l8K17L0q6q6j55O0k05N57j19
3397I6q8o3M52l85J41l61K88k10L35l44K31j09j57R0j7q4L65J79m82J32J18nm05
3420b83M40o3p3k12K80ol3O9J3j68J56k82j38K72K22l47n4L98j31l4l9P7r8j77
$$ plain form
3444 -211 -91 131 -126 413 -101 301 27 -328 -70 8 -7 -117 -123 5 -97 120 162 -123 -98 -442 424 24
3466 24 -98 -87 65 -157 108 -40 -110 -146 74 -53 -143 361 -280 -332 50 -14 -236 -57 49 -176 21 -130
3488 -130 108 -149 3 -33 -155 -60 -107 -79 -169 -386 -12 -50 -167 94 -3 3 -47 52 132 -112 -251 241 95 200
3512 200 27 37 287 -210 21 -86 -12 386 227 -27 -17 -73 28 295 97 -321 280 -49 200 -64 31 -29
3534 -29 -76 95 166 -137 -25 -67 29 121 155 62 122 -58 67 -235 120 283 -206 -47 -200 136 194 299 -118
3557 -118 90 -198 43 -34 160 128 -179 343 -189 -110 -57 39 11 147 -291 200 -137 226 55 239 -54 -91
3579 -91 -24 222 -214 -98 -97 -56 -145 187 -148 74 -100 245 59 -12 -183 25 71 -40 -6 -137 0 10 -26 -226
3603 -226 -99 -106 -105 317 222 308 444 78 -80 195 -113 7 -153 244 -104 -2 -20 27 -13 43 260 185 19 -143
$$ packed form
3444b11J20K22k57N39n14M02k74l55K58P8j5j10oJ28j02K17M2k85K5l44Q66m00
3466B4j22J1J52k22K65j48p0l6K20j27r0N04o41n2L82o4k22J79J06k25J97j51
3488a30K38k57J52l6j22R5m7K8r0k17L74l8j17K61r7On0R9Q0k44j39M92j46J05
3512B00j73J0K50m97K31j07P4L98j59k54J0n6J01K67j98m18O01l29K49k64R5o0
3534b9m7J71P1l03J12m2R6R2L4r3O0j80J25l02L55J63m89J59j53L36N8J05m17
3557a18K08k88K41p7J94l2l07N22n32P9N3R6k8J36m38M91l37L63j71J84k93l7
3579i1O7K46m36J16JM1q9L32l35K22j74L45j86p1j71K08M6j11L4j31J37J0l6k00
3603b26J27pJM22r5Q6J36l66j58K75l08J20j60L97l48J02j8M7m0N6K17p5j66j62
$$ plain form
3627 -143 57 150 124 -85 177 -64 -90 86 48 225 -97 -239 -154 -51 -144 -164 233 15 -194 -93 -69 169 -73
3650 -73 70 28 19 -13 2 -71 38 165 47 476 111 105 -72 -13 -243 122 15 -109 365 -57 -69 25 -67 48
3674 48 125 -196 120 69 -55 228 86 -252 43 68 -24 -111 202 70 7 70 -163 -44 16 -164 98 -107 74
3697 74 21 -66 4 133 -64 294 112 61 393 243 192 -363 48 12 -233 119 -46 -126 -17 -83 -28 -150 -45
3720 -45 91 156 -87 -242 286 -301 45 121 125 -159 215 -22 220 92 10 87 -367 -80 -50 232 -250 143 13
3743 13 43 94 -163 -69 -103 -54 -118 -35 -25 118 -15 -88 -87 -284 140 -120 -88 -96 146 -128 178 70 -215 -222 188 -22
3769 -22 -103 230 310 -466 81 110 274 113 63 -30 -527 -111 87 91 255 93 -275 197 -167 31 -5 -99 93
3792 93 207 90 -23 311 18 129 -193 -72 81 -169 -141 -56 -86 188 98 -134 67 137 -260 115 -145 22
$$ packed form
3627a43K00R3k6k09K62k41k6J76l8J77l22j42Q5J03r3k0L97k18k09J01K4K38k42
3650g3J43m2rl2J5p3J09J27j18M29l65oj77N9k30L65j07j24M74m22j2R4r2J15
3674D8P7l21L16n1j24K83j42l38K95K5r2q7L13j32o3O3k33J19O0j80K62k05J81
3697G4n3q7P0J29j97L58j82n1L32j50n1n55M11l6k45L52j65q0J09o6N5j22J05
3720d5J36O5k43j55N28n87L46P6Mk84L74k37K42j28q2P7m54K87L0K82m82L93j30
3743A3L0N1k57R4l4M9o4Q3J0J43j33p3Jj97M24k60L2qK42k74L06j08k85pM10k10
3769b2q1L33Q0p76N47K9J64j61n0r3m97M16J98MJ64j62l68M72l64J98l6r4J92
3792I3J14j17j13L34k93J11l22J21J53k50K8Q5l0K74r0k32K01P0l97L75k60J67
$$ plain form
3814 22 100 -123 -91 84 111 -7 -487 -95 -40 -107 -88 -145 99 64 91 77 175 65 -176 -110 -59 225 51 -86 50
3839 50 107 162 17 -70 -31 34 -6 -87 -278 -160 171 49 71 68 -145 156 -32 -68 18 101 185 -504 46 -103 -219
3864 -219 206 -105 -184 42 -216 -173 48 -163 -41 -192 223 -149 184 -13 -95 -125 -137 334 -343 -15 155 -69
3886 -69 81 -63 -116 153 -12 -64 -223 303 232 -38 -364 -123 -31 125 187 356 -180 -16 -211 -43 -42 12 210
3909 210 -99 33 17 149 47 62 56 127 48 168 -319 -138 -216 -133 90 -315 41 22 49 20 -60 64 154 -21
3933 -21 -60 246 -62 95 111 -33 144 193 108 203 -117 -96 157 88 72 -90 111 -173 -76 91 -170 61 -145
3956 -145 148 -8 -12 58 -151 -168 9 1 -71 13 174 224 127 -94 96 345 -50 23 -63 28 -381 -16 134 225 -9
3981 -9 -63 26 25 -70 131 29 -18 114 161 -215 111 66 -43 174 -135 -277 -156 -79 -93 413 -78 41 -213 -49
$$ packed form
3814B2P8k23L2J75K7j18m80L92N5o7J9n7K44l5K7j4R8j10k41O6N1K84j74j37J36
3839E0N7N5j45q7L9O5m0q1j91J18L31j22K2lk13L01j88l6Q6Q3Q4o89N50j49j16
3864b19M25l11p9K26k58M3K21k11J22j51M15l72L33j97q2l0j2M71o77L28J70k24
3886f9J50j44n3K69j65n2j59N26p1k70l26K41R2J56O2J69n36J64j95J68JN4J98
3909B10l09J32j6J32j02J5oP1p9J20m87J81p8Q3K23m05L56j9K7k9q0J24R0j75
3933b1l9L06l08J57J6j44J77M9q5R5l20K1K53o9j6j62K01k84R7J67k61K31k06
3956a45K93j56mP0k09j7J77qp2Q4J61N0r7k21J90K49l95P3q6R1m09L65J50R1k34
3981in4Q9jr5K01j02m7J32M7l76L26m5j09K17l09j42J21P7j4N06m91J19k54J64
$$ plain form
4005 -49 -183 58 -56 9 -141 81 30 216 -82 67 126 144 178 -132 22 -3 -289 172 234 195 -238 159 -40
4028 -40 75 -24 -191 -293 -27 67 -76 93 233 -167 -320 53 -213 78 -5 2 -177 170 7 -81 18 215 71
4051 71 108 -39 -79 244 198 489 -73 20 -85 -169 -39 -101 436 -245 -32 320 282 161 -100 -161 84 -103 -188
4074 -188 -28 -14 -32 158 29 -281 -64 -147 6 94 -181 11 -233 115 -28 -50 47 175 -84 142 106 -131
4096 -131 -79 -11 140 -227 136 218 -23 97 41 -70 186 283 -8 75 211 -60 212 118 150 182 221 -80 43
4119 43 63 -82 94 -21 77 109 -132 -7 201 224 -88 37 165 -80 37 255 -72 126 15 143 57 -101
4141 -101 238 58 -50 28 -39 32 144 114 350 -247 -148 96 43 96 -141 -87 -203 112 -216 89 4 -195 -150
4164 -150 -28 179 121 136 -80 -39 84 -7 -19 198 346 231 24 210 153 381 28 28 1 73 13 152 -258 44
$$ packed form
4005d9j34K41j14O5j50K22n1J86k98J49N9J8L4l10J54k5k86M61O2l9m33L97j99
4028d0J15r9j67j02K66R4j43J69J40m00j53L73k66K91q3Pj79L47j63q8R9J97j44
4051G1L7j47m0L23m6K91n62R3j05q4J30o2N37o81K13L52l8j21k61o1K45j87q5
4074a88J60J4j8J90j29l10K17q3J53Q8k75J92k44L48j43k2R7J28k59K26l6k37
4096a31N2O8J51l67L63Q2k41J20n6j11K56R7k91Q3J36k71K72r4L2L2L9l01J23
4119D3K0j45J76j15R8L2k41J25K08K3l12J25J28k45J17K18l27J98j11J28q6j58
4141a01L39j80j08P8o7P1J12l0K36n97R9K44n3N3k37N4j16L15l28L05q5j99M5
4164a50J22K07n8J5k16M1J23r1j2K17J48j15k07J86n7K28l53%k7P2o0J39m10L02
$$ plain form
4188 44 -56 -158 226 23 48 107 1 273 69 -65 37 33 56 21 27 157 110 -46 189 96 -112 -414 -266 -87
4212 -87 -223 -95 -249 -51 -32 -195 13 -214 -3 84 -135 189 -211 330 -131 -175 -22 -100 -50 -76 307 281 76
4235 76 34 88 253 123 -103 183 9 130 163 117 118 -202 368 -196 -14 206 4 9 -54 215 267 -178 504 127
4259 127 -240 -29 -180 -192 -223 -65 27 -45 -35 199 -176 26 260 266 47 84 286 -96 76 150 165 6 163
4282 163 -174 -8 84 -7 -143 32 211 -268 59 -40 80 -3 -90 66 384 -94 152 69 -176 376 -17 -60
4304 -60 -202 159 151 3 -67 86 164 -14 108 -29 -231 221 351 49 -495 -44 -167 -176 -460 -70 245 -138
4326 -138 -236 -10 -321 42 176 147 -202 263 2 103 -74 173 -77 -136 -135 22 318 -5 181 311 -121 90
4348 90 146 72 -150 78 188 84 282 -72 -200 16 179 275 -122 307 122 151 -12 -271 71 316 -41 189
$$ packed form
4188D4j00j02L84k03K5N9j06K72k04j34J02mK3l5OJ30m7j56K35r3k08l02J48J79
4212h7j36J28j54J98J9j63K08k27K11Q7k19L24m00N41m61m4J53p8N0k6L83k6k05
4235G6m2N4J65j30k26K86j74J21L3m6Jl20N70n64J82K20k02No3K69N2m45O82l77
4259A27l67K11j51j2l1J58R2p2J0K34l75K02K34Ok19L7K02l82J72P4J5j59J57
4282A63l37J66R2r1j36J75J79m79L27r9J20q3q7J56L18m78K46q3k45N52l93m3
4304f0j42L61qj48p0J53P8j78J22j37k02M52J30l02n44M51j23rk84L90L15l83
4326a38r8K26l11L63J34k9l49M65k61J01j77K47k50n9JJ57K96l23J86J30m32K11
4348I0N6p4k22K28J10j04J98l54j28K16J63R6l97M29j85K9j63k59L42K45l57K30
$$ plain form
4370 189 0 -191 -22 -81 -310 46 -129 209 95 133 -8 154 369 249 421 5 -242 -21 141 -438 -194
4391 -194 -235 -41 -205 -26 44 81 29 30 -141 227 33 41 -296 319 -105 70 121 -351 -162 -78 -213 -186 24 253
4415 253 263 265 -218 37 -71 90 91 58 -177 -8 213 295 134 -63 309 -175 -348 -202 -116 -31 -111 236 91
4438 91 158 57 153 16 116 27 -91 424 25 194 93 398 136 -11 29 19 -147 170 -109 108 7 -182
4460 -182 380 -316 109 172 -108 136 -18 25 -61 9 -320 80 61 181 -198 113 137 49 -75 14 94 -22 224
4483 224 76 -265 27 -243 350 305 -287 73 247 207 97 -27 92 -262 -159 24 4 -110 -131 56 96 -191
4505 -191 321 83 -205 61 -68 130 227 270 154 -205 55 76 -73 -84 -5 -47 -112 -141 18 336 16 43 33
4528 33 421 -59 -43 -232 143 315 19 144 -147 -106 136 -78 49 -78 -76 -7 183 128 -163 -1 -103 -185 -60
$$ packed form
4370A89j89j91J69n9k29L56j75L38j14L8j41J62K15j20J72m16k47K21J62n79K44
4391a94m1J94j64J79P0L7n2Jj71L68j94Ql37O15m24J75N1m72J89Q4j35K7K10K29
4415B53J0Km83K55j08J61Jl3k35J69K21Q2j61j97L72m84j73J46Q6Q5q0L47j45
4438I1O7j01R6j37J00q9j18N15l99J69j01L05k62j47M0j0j66L17k79K17j01j89
4460a82N62o96M25O3k80K44j54M3q6P0l29M00j9J20l79L11K4q8j24Q9Q0j16K46
4483B24j48l41K92k70N93m5n92L60J74m0j10j24J19l54J03J83k0j14k1J87M0k87
4505a91N12k38k88K66j29J98R7M3j16l59K60K1j49j1P9m2o5k9J59L18l20K7j0
4528C3L88m80J6j89L75J72k96J25k91M1K42k14J27j27KO9J90n5k91J62j02q2J25
$$ plain form
4551 -60 -62 263 72 89 106 -8 -80 -89 46 -378 36 92 109 -181 195 -70 -40 -98 119 -157 -97 -173 -116 38 -69
4576 -69 264 -193 48 138 116 -140 -48 -268 -77 -116 -260 -42 149 55 143 154 2 139 -29 160 33 -175 35
4599 35 134 -114 -78 153 -37 -31 83 243 -99 -118 124 44 96 138 -99 -82 106 198 -180 -304 -141 -21 -292 9
4623 9 -224 -106 8 1 -67 135 120 146 -83 -121 34 -88 349 255 -87 156 94 20 117 -179 -104 -187 103 15 -64
4648 -64 -42 192 -153 18 71 196 108 -41 -131 33 -13 255 1 10 8 -127 -45 297 111 -87 81 254 -21 87
4672 87 86 46 -112 182 -123 242 55 -88 -128 -24 49 -14 -101 205 -21 177 242 18 18 -109 82 181 257 -94
4696 -94 -18 52 330 -76 -41 238 18 131 -77 193 337 219 5 365 176 262 195 -64 -142 -57 274 49 94
4719 94 -290 -114 170 66 125 288 177 -76 -168 -107 -171 206 74 0 68 -53 248 260 -54 127 148 41 -169
$$ packed form
4551f0kL25j91J7J7j14p2rJ35m24M14N6J7k90L76k65L0n8K17k76O0p6N7J54j07
4576f9L33m57K41R0k2k56R2k20J91l9j44K18J91r4Q8J1j52J37j68J89j27k08K10
4599C5R9k48L6K31j90OJ14J60l42j9K42q0N2M2k37J7J88R2l78j24J63J20k71L01
4623Ik33J18J14po8K02j5K6k29l8J55j22M37r4l42K43o2p4R7k96P5q3K90q8p9
4648f4K2K34l45J71N3J25q8j49r0J64m6K68k54Rkj35Q2L42j86j98J68J73k75J08
4672H7jm0j58K94l05L65j87j43m0J04P3o3q7L06k26J98O5k24%j27J91R9P6l51
4696i4P6P0K78m06L5K79k20J13k08K70J44j18k14L60j89Q6o7k59p8Q5L31k25M5
4719I4l84J76K84j04N9J63j11k53r2O1o4L77j32p4O8j21L01J2l14J81K1j07k10
$$ plain form
4742 -169 381 -109 5 89 56 133 99 161 87 -394 -55 345 199 14 7 172 48 10 -133 -217 -177 31 -158 77
4766 77 102 202 97 56 -152 -73 -112 100 -47 137 82 178 46 97 72 -340 -119 48 -98 108 142 -35 -164
4789 -164 133 -151 88 -44 -132 -297 1 48 -179 280 157 258 -119 72 -214 -19 -15 -240 -38 164 -63
4810 -63 43 -221 -70 293 -36 -142 153 -18 78 180 183 -74 -300 -197 -151 -60 -278 -97 192 379 124 -187
4832 -187 217 168 134 -106 -121 57 -55 -4 -67 31 59 -9 24 -7 -378 -207 -70 -146 -220 -63 -269 4 -114 31
4856 31 -114 -186 -51 -39 110 108 155 -7 -70 87 263 50 38 -50 -1 -273 18 -67 28 70 10 -253 -173 15 -170
4881 -170 -79 230 264 -199 -80 -285 -18 87 141 85 123 421 96 -164 -135 192 133 100 -340 -133 211 -47 180
4904 180 -350 -221 -96 -33 60 -11 24 -156 113 42 -221 -10 116 -82 122 1 188 -472 43 -139 289 -81
$$ packed form
4742a69N50m90J14Q4l3P7l4O2p4m81L39M00j46j85pJ65j24l8j43q4M0K08j89K35
4766G7K5J00j05m1k08P9l9K12j47J84n5R6j32N1k5m12K21J67j46K06L4j77j29
4789a64K97k84K39j32q8j65K98M7k27M59j23J01l77J91k86J95Mk25K02K02k27
4810f3J06k64J51L63l29j06K95j71R6J02Lk57k26J03M6R1k18J81K89J87k55l11
4832a87M04m9l4k40j5J78j12N1o3R8K8o8L3l1l71J71J37p6p4J57k06K73j18J45
4856C1j45p2J35J2J49kM7j62o3J57J76k13j2q8M9k72K91q5R5M2o0k63Q0J88j85
4881a70R1L09L4m63J19k05K67J05N4n6L8K98l25k60K9L27n9l3m40K07L44k58K27
4904A80n30J29J25O3R3p1L5j80K69p1k63K11J26j98K04j21J87o60N15j82M28l70
$$ plain form
4926 -81 -84 -293 136 79 -94 79 -100 165 -61 -29 269 28 -65 0 135 282 -18 20 234 144 -232 -58 -136
4949 -136 141 55 -121 127 63 113 -147 -260 -170 -77 26 276 1 195 73 -39 222 -50 10 333 179 251
4971 251 -255 -33 -151 185 -79 106 -304 -174 -139 27 104 -141 -78 453 -81 195 64 74 -67 -47 91 -308
4993 -308 264 205 -65 -89 -195 100 50 -75 -64 -102 -70 84 13 239 -348 -109 163 53 54 54 20 -39 -353 -219
5017 -219 -72 -47 -130 186 -16 -102 -252 85 -43 -257 87 -157 25 -265 -26 56 -66 -243 151 -59 -57 99
5039 99 -102 113 40 -152 -113 -10 508 39 -108 -363 139 -258 34 62 84 60 -476 272 -151 -80 -66 18 -146
5062 -146 -161 -26 -2 116 141 -142 136 -210 -30 74 -222 -65 -222 67 -208 160 -178 58 160 40 -176
5083 -176 11 -97 208 -180 -251 -62 19 -120 86 -15 -100 -98 -295 -5 185 -116 -7 61 182 -34 -92 183
$$ packed form
4926h1lk09M29n7j73J73j79K65k26L2K98k41r3O5J35J47l00L8K14r0l76J74p8
4949a36K77q6j76K48o4N0k60j13R0R3J03K50k75J94j22j12K61k72O0L23j54P2
4971B51n06K22j18L36k64J85m10J30L5J66P7k45O3N31n34K76j31J0j41K0J38l99
4993c08N72n9k70k4j06K95n0j25J1l8L2J54p1K26n87K39K72j10J%l4n9l14J34
5017b19J47K5q3L16k02q6j50L37j28k14L44k44J82k90K39Q2j22j77L94k10KJ56
5039I9k01K15p3j92L9J03N18m69j47k55N02l97K92K8K2k4n36P48m23P1J4Q4j64
5062a46j5J35K4J18K5k83K78l46J80J04k96J57j57K89k75L68l38K36J02j20k16
5083a76J87j08L05l88p1J89Q1j39K06j01q5Kj97K90J90l01J09O8J21k16n8K75
$$ plain form
5105 183 -139 197 112 -356 -156 225 183 127 -47 222 -87 133 -208 78 65 -104 47 -37 -260 63 10 239
5127 239 -21 -166 -81 -321 -44 -60 47 110 -220 -32 110 -263 -68 301 81 120 75 126 -162 262 149 -444
5149 -444 -334 114 -15 240 -183 26 97 -136 -203 54 -22 23 -181 59 15 96 341 81 42 -129 106 -37
5171 -37 -164 -108 -184 326 68 236 53 -5 -67 -135 26 75 211 -135 14 143 158 -18 59 191 61 142 -90
5194 -90 -37 -33 118 -263 159 -117 -54 -199 60 -61 -131 -107 87 -110 -70 20 -272 -143 -86 207 307 12 -96
5217 -96 -48 -21 90 -103 -108 30 10 -19 260 -312 282 -110 147 -171 -22 -33 -506 3 -319 126 -189 238 112
5240 112 -163 63 -50 -347 210 -361 -132 6 19 23 -12 3 -124 0 141 66 94 109 169 -28 150 -12 -60
5263 -60 9 101 -97 -298 -230 -123 -154 393 83 162 -355 -45 154 -55 -170 46 197 -231 21 -291 214 144
$$ packed form
5105A83l22L36q5m68K00L81m2n6j74K69l09K20l41K86j3j69J51q4k23L23n3K29
5127B39k60j45Q5k40K77j6J07O3l30J88J42l73J95L69k20L9m5N1k88M24j13n93
5149d44J10M48j29K55m23K09P1k33o7K57p6M5k04K40m4Q1K45k60l9j71K35j43
5171c7j27N6p6N10k58J68j83n8o2o8J61M9J36l46J49J29J5j76P7J32j30Q1k32
5194i0N3MJ51l81M22k76O3j45K59j21p0K4J94j97M0R0k92J29N7K93J00k95j08
5217i6M8K7J11j93nJ38k0k9K79n72N94l92K57l18J49j1m73N09l22M45l15M27j26
5240A12k75K26j13k97N57n71K29J38J3Ml5J5j27J24J41p5K8J5O0j97J78j62m8
5263f0O9R2j98k01O8J07l1N47l10P9n17L10J99k09j15K16J51m28K52l12N05p0
$$ plain form
5285 144 220 -48 25 195 259 -42 -208 325 36 89 57 -221 -66 -306 51 -124 -294 32 161 157 -128 -151 -160
5308 -160 -49 113 -148 73 -174 403 -111 -136 -145 238 46 -172 106 -180 67 -9 -55 -3 -42 58 -323 25
5330 25 97 -8 73 71 61 -65 -287 145 35 -418 61 407 -78 -14 137 236 -378 68 -105 194 -16 1 -100
5353 -100 162 113 -426 16 29 -128 -290 58 31 -173 -94 -133 -89 -43 -166 227 170 204 27 18 -22 -246 77 215
5377 215 176 199 288 -211 -197 -99 74 -138 -80 -241 -156 -452 -8 -12 -241 15 152 -86 -383 111 -50 213 -233
5400 -233 150 -119 -54 -115 -25 -16 -9 -28 -133 169 303 64 16 366 420 -147 215 118 140 -5 -337 -234 -6 139
5424 139 -58 158 -30 -42 -66 25 -111 285 98 202 168 -317 -14 -16 73 -80 125 -189 -4 136 189 15 228
5447 228 -106 -154 180 372 -217 -35 11 -100 -227 40 -172 -57 132 -155 30 311 -15 132 -259 -128 -162
$$ packed form
5285A44P6k68P3J70O4l01j66N33k89N3l2k78J55k40L57j75j70L26J29mk85k3r
5308a60J11J62k61K21k47N77n14k5rL83j92k18K78k86K47p6m6N2l9J00l81L48
5330B5P2j05Q1kj0j26k22M32j10m53M79L46m85O4J51R9o14M46j73K99k10J7j01
5353a00K62m9n39M42J3j57j62L48k7k04P9l9M4M6j23L93n7L4j77rm0k24L23J38
5377B15l9K3Q9m99J4R8J73k12N8j61Q5k96M44mk29K56J37k38k97M94j61K63m46
5400b33L83k69O5o1R0RPj9j05L02J34k39m8L50N4n67L62r7K2j45l32J03K28J45
5424A39j97K16j88j2k4R1j36L96j87J04l4m85L03kQ9j53K05l14J85J40N3j74K13
5447B28l34m8L34J92n89J82M6j11j27K67k12J15J89k87J85K81l26J47l91J31l4
$$ plain form
5468 -162 -293 13 -70 184 -11 -144 239 -108 -5 45 49 -48 -393 89 164 -21 -176 -115 -194 172 -115 238 182
5491 182 -302 348 -126 -231 -36 14 -130 -323 -173 100 165 230 -170 -122 79 -193 58 27 -13 -12 203 310 -83
5514 -83 30 -24 25 284 -3 -44 -192 -27 41 -477 60 -44 -316 -243 58 24 131 39 0 302 193 -41 -89
5537 -89 -126 -115 -31 -338 -252 -86 -223 -108 150 -281 -68 112 245 21 -104 0 -73 229 -207 383 17 -123
5559 -123 19 30 -230 -197 -118 -69 64 40 -73 -166 -11 116 158 438 104 166 326 -4 -280 78 138 57 -262
5582 -262 -78 -170 -73 65 4 46 -276 242 0 -163 212 -25 -302 218 -208 -163 -19 66 451 -133 78 -85
5604 -85 -76 170 203 -20 -185 73 103 -271 -162 -75 -158 87 108 -184 211 178 253 61 -269 64 -16 -19 -284 68
5628 68 -134 -133 48 273 135 91 -119 430 -174 -49 48 168 -142 284 -46 139 -275 20 16 141 -151 -129 155
$$ packed form
5468a62j31L06q3K54j95j33L83l47J03N0Mr7l45M82P5j85j55O1p9L66k87L53n6
5491A82m84O50m74j05J95N0j44j93J50K73O5O5m00M8K01k72K51l1m0JK15J07l93
5514h3J13n4M9K59k87m1j48J65O8n18N37j04k72P3L01l4J07r2l9L02j09k34m8
5537h9l7J1Q4l07Q6J66j37J15K58m31K13J80J33k24j25J04p3L02m36N90l66j40
5559a23J42J1k60L3P9M9J33k4j13r3J55J27M2K80l34O2J60l30k76L58O0q1l19
5582b62J84r2R7J38o1M2l22N18k42j63L75k37k77N20m26M5J44Q5L85n84K11j63
5604h5RK46L3k23j65K58L0l74J09Q7q3K45K1k92L95l3P5j92l30L33q0lk65L52
5628F8k02JJ81K25j38m4k10N49o04J25R7J20l10M26l30J85m14K95mJ25k92K2K84
$$ plain form
5651 155 -348 -30 -164 -89 207 -5 339 216 24 69 57 259 282 -58 -164 103 -42 -177 -32 -171 89
5672 89 75 -199 75 -31 -7 -142 129 -262 25 -158 -4 57 115 228 27 -76 109 231 113 358 -158 238
5694 238 -161 -46 195 302 141 -125 -140 -150 -39 95 370 106 100 151 57 97 -90 -8 276 144 232 -53 -142
5717 -142 -153 -104 50 260 237 -178 128 -368 -261 -126 39 -132 54 165 -74 136 -183 -208 -90 -454 30
5738 30 141 -29 -249 266 27 142 -218 -288 -140 36 -191 -48 6 284 47 23 336 -100 -88 -81 257 -291
5760 -291 42 234 -338 -46 252 -3 -189 205 221 167 8 119 220 -10 81 75 317 26 -294 403 -23 -133
5782 -133 240 22 -191 -159 113 199 -199 91 -190 250 278 -38 135 -12 67 61 41 -149 123 9 277 96
5804 96 -129 96 76 41 52 -16 343 59 -159 -129 -254 -105 219 -19 129 48 270 -195 -211 -48 319 76 -105
$$ packed form
5651A55n03L18j34P5K96k12L44j23j92M5j2K02K3l40j06K67j45j35J45j39K60
5672H9j4k74K74j06K4j35K71l91K87j83J54O1N8J13k01j03J85J22j18K45n16L96
5694B38l99J15K41J07j61k66j5j0J11J34K75k64oN1r4M0j87Q2K84j32Q8k85q9
5717a42j1M9J54K10k3m15L06m96J07J35J65j71J86J11k39K10l19k5J18l64M84
5738C0J11j70k20N15k39J15l60p0J48J76k27J43N4K78k37k4L13m36J2PL38n48
5760b91L33J92n72K92K98k55j86L94J6n4j59J11J01k30R1oK42k91l20O97m26j10
5782a33L73k18k13L2K72Q6l98K90k81M40K8l16J73j47P9ok0j90K72j14K68j81
5804I6k25K25k0l5J1o8L59k84k18L0j25J49L24k38J48q1K22m65j6J63L67k43j81
$$ plain form
5827 -105 -275 -268 260 -34 101 -192 132 -394 -77 51 -55 -142 256 -58 142 -221 114 -46 -177 -240 -69
5848 -69 66 126 71 183 27 -150 -110 -110 -39 39 210 123 -37 -11 129 -335 83 69 -461 -260 -10 -76 -360 -35
5872 -35 -222 -22 64 -296 165 260 -52 177 194 -74 143 -40 -170 -229 371 -31 107 81 -180 268 -96 75
5894 75 -438 -294 104 -7 216 -61 -34 -27 -217 -111 -212 138 10 -32 -362 350 -309 82 66 -156 -131 42
5916 42 -2 -4 134 -22 77 -100 -130 -14 100 -1 -136 273 -53 49 194 31 59 -41 29 17 132 -21 -95
5939 -95 -89 448 -452 341 -112 164 -2 -338 -187 -184 -332 32 -96 -215 176 -300 -6 170 55 88 -7 -46 388
5962 388 -190 -110 -51 -180 -414 129 -109 -296 244 482 -32 7 -161 -268 204 14 -77 56 172 -34 -127 -117
5984 -117 248 406 124 -282 -130 -271 -73 338 233 416 -80 79 -140 -58 208 193 -97 232 126 -194 -69
$$ packed form
5827a05j70PN28k94J35k93L24n26L17J28j06q7L98l14K00l63L35j60j31o3J71
5848f9J35O0n5J12j56j77M0%P1P8J71q7j60K6J40m64M18j4n30K01K50o6k84L25
5872c5j87K00Q6l60M61R5l12K29J7k68K17j83j30n9O00m02J38k6k61M48l64J71
5894G5n13J44L98j11K23k77K7Pj90J06j01L50j28m2l30P12o59L91j6k22K5J73
5916D2m4kJ38j56R9j77l0J16J14j01j35M09l26J02J45j63K8j00P0j2J15j53p4
5939i5ON37r00P93m53K76j66l36J51Lj48L64j28j19L91m76K94J76j15L3r5l9M34
5962C88n78Q0N9j29k34N43k38j87N40K38n14L9j68j07M72j90r1J33J16k06r3J0
5984a17L65J58k82m06J52j41J98M11j05J83m96J59k19Q2K66j5k90L29j06l20J25
$$ plain form
6005 -69 79 -33 -106 -140 178 -177 -123 19 -35 20 -154 240 -95 -207 226 -58 256 2 -228 -154 128 -137
6027 -137 208 91 337 -93 -80 55 -228 15 -170 -3 -163 106 190 22 -33 -87 99 -168 -111 -120 -315 17
6049 17 34 -108 27 47 -203 73 -149 -98 209 118 -100 173 -86 447 -27 -398 -126 397 -64 -31 57 2 -57
6072 -57 2 -198 4 -56 56 268 77 -64 19 204 -17 -317 71 155 -131 240 45 -37 -15 0 267 -24 -95
6095 -95 242 -163 151 37 187 319 253 -117 -52 -38 145 1 -151 -141 -288 -83 -128 143 124 -61 -110 -311 343
6118 343 -70 244 83 116 55 -253 194 73 310 12 172 -153 -171 -40 136 -202 -7 -57 -254 170 -40
6139 -40 -101 -108 -48 -163 -157 -72 -154 -68 143 -160 228 79 379 -142 193 2 -6 92 43 -22 -68 -285 -70 197 -189
6164 -189 -58 -110 -224 -19 -234 -12 -85 19 310 294 -40 233 49 -126 -186 -30 108 82 54 -52 -111 -35 -69
$$ packed form
6005f9J48j12p3l4L18l55N4J42n4N5j74L94l35j12M33k84L14k54k30P4K82k65
6027a37L45j17K46m30J3J35k83K43j85J67j60K69Q4j68n5n4J86k67N7rj95L32
6049A7J7j42J35K0k50K76k22N1L07r1k18K73k59N33m74l71K72N23m61L3Q8n5n9
6072e7N9k00K02o0J12K12j91j41Q3J85k21l00L88Q4k86L71j95q2K2J5K67k91p1
6095i5L37m05L14j14J50J32o6l70O5J4J83j44j52J0j47K05m5K71j9j85m9k01O54
6118C43m13L14j61L3o1l08M47j21K37k98J60l25j8J31J76l38J95n0j97M24k10
6139d0o1pO0j15OQ5q2Q6K11l03L88j49L00n21L35j91qR8m9o5m6k17K15K67l86
6164a89J31n2j14K05k15K22p3J04K91j6l34K73j84j75o0J56J38k6k8j06n9P6l4
$$ plain form
6187 -69 54 -45 -81 82 -119 109 57 202 -258 -83 175 109 -225 -95 1 -163 69 -29 330 -157 -188 3 144
6210 144 291 210 57 -234 -122 -56 -167 75 -68 -452 -14 257 -179 131 -128 -140 -138 28 -93 105 151 -79
6232 -79 5 -12 -63 -57 191 22 114 225 -155 34 -158 131 69 -107 164 -12 19 54 -48 -184 -167 322 93 -124
6256 -124 226 118 -297 3 23 266 -201 43 -73 150 245 13 -76 -128 80 154 -98 71 -27 -78 213 -25
6278 -25 32 253 -161 -251 32 75 147 84 251 -71 140 -60 154 64 341 -87 -70 12 16 -222 -267 -48 -42 -75 -79 44
6304 44 -73 -146 112 273 -208 121 11 -33 37 -109 -183 -28 -287 92 -192 240 366 249 -36 -38 175 37
6326 37 314 -220 1 261 -27 -97 215 228 -216 -203 -6 -251 208 -266 -71 -181 126 268 42 345 56
6347 56 404 -97 30 59 -150 -67 25 -224 -40 184 -86 -5 -50 -19 79 116 151 -72 43 51 -20 259 -162 75
$$ packed form
6187f9J23r9l6J63k01K28n2J45m60J75K58o6l34J30R6j64K32r8L59m87l1J91J41
6210A44J47q1j53k91J12O6j11K42j43l84M38K71m36L10k59j2KJ66j21J98M6k30
6232g9Q4j7n1OK48j69R2J11l80J89j92K89o2j76K71j76L1L5j02j36J7M89k29k17
6256a24L50j08m15L00K0K43m67K44j16K23R5k32q9n2K08P4k52J69r8n1K91k38
6278b5N7K21m14r0K83M3P2o3J67l22K11k00K14r0K77m28J7Q2Mk38m5K19Ol3mJ23
6304D4j17p3K58J61m81L29j10m4P0j46p4J55k59L79k84M32J26j17k85kK13j38
6326C7K77n34K21K60k88p0L12J3m44J3J97k45M59m74J95j10L07J42k26L03k89
6347E6L48n01J27K9k09Q3R2k49J84K24k70Q1m5L1R8L7L5k23J15Qp1K79m21K37
$$ plain form
6371 75 34 252 -245 133 290 -279 -17 4 -91 -163 331 175 316 -58 -148 -36 64 32 69 383 124 -262 -56
6394 -56 229 83 -13 -108 -544 -179 -18 4 251 -55 -171 87 -234 28 88 -227 1 41 -106 -89 -125 192 -444
6417 -444 -232 122 -76 -65 5 -342 145 -31 450 251 -220 -291 -55 -150 21 57 -262 95 168 38 -168 95
6439 95 106 0 -90 -158 154 2 -156 291 135 -27 50 42 -37 58 110 -80 -180 -161 -17 5 -226 78 224 -99
6463 -99 -35 153 -7 29 -151 -67 -153 -97 109 -13 -52 57 129 34 -330 48 176 -24 117 -60 91 -29 -293
6486 -293 233 174 -262 -261 -204 -309 -69 106 -69 -283 -104 75 -13 125 -402 115 -166 76 -75 90 -34 168
6508 168 142 -240 172 87 152 60 -54 156 -43 70 68 -127 -34 12 -24 147 -190 -11 -176 -44 210 -87 164
6531 164 171 -154 128 362 89 0 -159 -24 198 5 117 -260 118 -91 -76 131 -137 380 -5 206 32
$$ packed form
6371G5m1K18m97L78J57n69K62K1r5p2M94j56J41l74r0J12J00l2L7L14k59l86K06
6394e6K85j46r6r5m36L65J61K2K47l06j16K58l21K62O0l15K28M0j47J7l6L17o36
6417d44K12L54j98J1P0l47M87j76M81j99m71p1K36r5J71L6l19L57P3j30k06K63
6439I5J1j06r0o8L12j52j58M47j56j62P7qp9R5N2j90j00J9J44K2k31L04J46l23
6463i9O4J88j60L6j80Q4q6N6K06j22l9J09P2r5l64L78J28k00J41j77J51j20k64
6486b93N26n9m36JN7j05K40J75j75k14J79J79q8J38n27N17k81K42j51J65j24K02
6508A68k6l82M12q5O5r2j14K10j99J13kj95R3M6l6J71l37J79j65J32K54k97K51
6531A64Pl25K82K34k73q9j59J35K22j93J12l77L78k09J5K07k68N17l85K11j74
$$ plain form
6552 32 -60 -167 191 287 37 101 -32 227 -213 -88 19 240 -53 147 317 7 -136 112 -75 -7 58 -317
6574 -317 92 202 -87 -68 127 179 -68 362 -16 191 -98 378 68 -251 148 72 -64 129 -81 57 -15
6595 -15 46 -93 68 -141 192 -62 -102 -87 -361 358 79 119 170 327 274 28 45 -73 79 -41 100 252 69
6618 69 -448 103 -88 268 -194 -103 -140 50 -5 70 64 97 82 98 -330 -47 -171 9 222 171 33 -153 217 -74
6642 -74 59 113 335 14 -121 48 -91 79 39 -18 28 74 202 -107 -55 123 -118 201 239 245 230 -16 91 -114
6666 -114 72 179 249 257 -225 -270 251 -107 -324 -306 92 -162 -17 -284 -156 -55 73 -51 139 -234 155 -220
6688 -220 -342 147 -180 4 173 115 -212 -147 284 -137 -355 71 -67 109 329 -49 51 242 -37 212 -118
6709 -118 -110 148 350 71 167 238 -4 -54 -320 -153 44 -82 -281 -220 51 -172 162 -62 131 -48 349 128
$$ packed form
6552C2r2j07L58R6k50O4j33K59m40J25J07K21k93K00J70l10j43K48j87O8O5l75
6574c17M09J10k89J9J95N2k47M30l78K07k89M76l10l19L99p6j36J93k10J38p2
6595a5O1j39J61k09L33k54m0J5k74P19k79M0N1J57n3k46J7j18J52j20J41J52j83
6618F9n17N51j91L56m62R1l7J90n5P5oL3j5J6m28K83j24J80K13n1j38j86L70k91
6642g4J33N4K22l21j35J69j39J70m0n7M6M6J28l09N2J78k41L19L8Oj5k46J07k05
6666a14J86J07P0Qm82m5N21l58k17J8L98k54J45k67J28J01J28j24J90l73L89l75
6688b20j22M89l27J84J69n8l27O5M31m21k18M26j38J76K20l78J00J91k79K49l30
6709a18QK58K02k79R6P1k42n0k66J67J97j26j99O1K71k23L34k24J93j79L97k21
$$ plain form
6731 128 -108 51 -156 -177 -200 -90 -31 212 -18 147 -113 -230 -79 -27 -164 -261 -21 -100 -56 122 155 -57 -51
6754 -51 84 -93 173 -136 -187 -221 -312 101 242 196 -135 28 298 151 282 27 121 -87 57 -39 -267 126
6776 126 -316 -135 -173 -262 17 18 109 -103 127 -185 -179 -205 6 187 -194 -217 377 35 -17 8 -152 140 -141 -235
6800 -235 109 60 -38 71 -2 229 106 -99 -131 -135 -279 -128 -50 -177 3 117 -144 -311 -155 -202 -78 44 123
6823 123 -68 -162 -97 -14 -90 -59 -102 257 -103 -127 167 7 14 200 13 -144 118 -94 -352 -111 39 10 -82 -49
6847 -49 -9 -72 23 -235 201 -26 -167 -381 97 -97 -8 -26 -244 -149 -235 107 -106 234 59 -313 -32 13 74
6870 74 -362 -173 -224 -150 -232 219 356 -67 108 265 139 -131 9 -35 -110 167 -109 110 60 158 139 251 178
6893 178 148 -320 49 129 -255 -88 125 221 64 -142 39 107 168 -24 112 -59 156 -160 -255 0 163 127
$$ packed form
6731A28k36J59k07k1k3J10N9K43k30J65k60j17J51N2j37r7K40p9M4J78L3k12O
6754e1J35j77K66l09n1l4r1M13J41m6l31J63K70j47J31k55R4k08J44r6k28L93
6776A26m42J81l8q9K79JR1k12K30l12Ok6K11J81l81k3N94l42n2K5j60K92k81r4
6800b35L44m9r8J09p3K31j23k05l2mj44J51P8j27J80J14k61j67J56m7J24J22P9
6823A23j91r4O5Q3p6L1m3L59l60k4K94j60PJ86j87j57K62k12k58K41J50k9r2L3
6847d9M0o3R5k58M36k27j41k14M78j94Q9j8k18R5q6L42k13L40j75l72K81M5O1
6870G4m36J89n1P4q2M51J37m23J75J57j26k70J40m4p5K77k76K19n0R8j9J12p3
6893A78l0m68L69Q0l84J67K13R6j57k06J81O8O1j92J36j71K15l16r5K55J63l6
$$ plain form
6915 127 -133 -72 348 377 -102 -17 -87 137 214 165 213 5 11 2 -200 89 11 133 334 -176 -86 101 -91 259
6939 259 -84 86 -140 18 248 -46 296 44 166 97 45 73 -175 179 -6 -260 166 183 45 -301 -183
6960 -183 -100 -14 -114 -38 115 236 64 -173 -257 178 308 362 -346 49 -4 -39 349 220 -138 -247 -273 -66 229
6983 229 30 207 233 303 76 23 -140 54 -82 -187 94 245 -240 -274 96 72 128 -224 -149 -303 -60 110
7005 110 -16 -57 114 -7 -66 -130 22 9 -55 -19 -57 -89 -27 -246 -188 42 195 -26 30 3 171 101 -8 -190
7029 -190 -10 -103 180 127 139 0 -147 -204 121 125 -86 -152 170 21 -151 -333 -50 14 -425 334 66 -148 -314
7052 -314 -132 96 -7 120 19 -282 -53 58 -24 286 -52 -157 79 -56 50 22 102 29 58 74 -227 -200
7074 -200 183 -20 52 -202 -186 -129 -132 -82 117 -210 -410 -87 190 100 -165 293 325 -130 93 79 -17 151 213 -114
$$ packed form
6915A27k60O1M20K9m79Q5p0K24P7m9M8k08Ork02K89p8J22K01n10R0J87j92L50
6939B59l43J70k26J58K30k94L42k52J22o9n2K8k48L54j85k54M26J7j38l46J18
6960a83Q3Q6j00P6J53J21j72k37q4M35J30N4p08L95n3l5L88j29l58j09k6K07K95
6983B29j99J77K6P0k27n3j63J94j36j05K81J51m85l4L70k4N6l52P5j54K43J70
7005A10j26m1J71j21n9o4J52j3o4L6l8l2O2k19N8K30J53k21N6k7J68p0j09j82
7029a90J80r3K83n3J2j39j47n7L25Mk11o6L22j49j72j82K83O4m39P59k68k14j66
7052c14J82K28j03J27j01l01K29J11q2L10l38j05K36j35J06k8Q0p3K9J6l01K7
7074b00L83k03P2k54J6N7lN0J99l27k00L23K77r0k65M58L2m55K23j4r6J68O2l27
$$ plain form
7098 -114 39 -134 106 272 97 -207 -240 232 -67 -316 8 -119 262 -102 -11 -82 -36 196 269 111 112 -118
7120 -118 -17 262 -55 31 -113 186 121 279 -28 -198 -48 -74 9 -103 -12 -68 -90 -143 108 50 -2 -1 440 218
7144 218 79 35 -113 -138 118 74 -32 224 -152 2 187 -136 -13 125 -272 -17 -49 137 -20 -123 87
7165 87 -137 33 27 -23 -110 155 129 243 51 7 47 156 304 181 -115 39 54 -242 30 -107 145 211 -441
7188 -441 21 -42 -56 3 -133 -22 -296 93 -132 -164 -18 192 -212 228 0 -38 -127 128 -208 -95 -61 -193
7210 -193 -178 81 184 210 140 -203 236 -272 258 -283 229 124 -233 -251 -390 161 333 106 23 -338 274 -102
7232 -102 -1 67 48 48 -93 -2 41 -38 -304 1 -280 -240 -11 426 244 94 147 12 -44 -337 120 -8 15 72
7256 72 342 -256 -101 219 95 -73 16 108 -87 -172 -33 75 -441 0 -139 412 -234 -145 62 -30 220 88
$$ packed form
7098a14J53j73K40J66j75l04l3M72k99k49L24j27L81l64R1p1M6K32P3j58Jk30
7120a18J01K79l17Q6j44K99o5J58l07j70J50k6Q3j12R1n6k2n3K51n8n2JM41k22
7144B18j39m4j48k5K56m4j06K56l76J54J85l23J23J38l97K55l2J86j57j03K10
7165H7k24J70on0q7K65k6J14j92m4M0J09J48j23k96J54J5k96K72j37K52O6o52
7188d41M62o3j4N9j36J11k74L89k25l2J46K10m04M40k28l8q9K55l36J13L4j32
7210a93J5K59J03K6p0l43M39n08N30n41N12j05l57j8j39N51J72k27q3l61O12l76
7232a02J01O8j9%j41R1M3p9k66L05k81M0K29M37j82j50N3j35n6k93M57j28K3N7
7256G2K70n98J55L20j24j68Q9R2j95q5J39J08n16M41j39N51o46Q9K07r2K50j32
$$ plain form
7278 88 7 -80 93 -35 -46 -14 102 114 78 -22 -95 -2 -187 -51 131 -202 -82 -188 -353 296 -5 -84 106
7301 106 35 -322 119 129 -125 26 92 31 -150 -149 145 -22 92 -91 50 278 -112 -366 -18 -116 115 -79
7323 -79 305 -297 0 -346 -285 -149 135 200 105 -144 136 66 -160 -344 -357 -16 82 -1 49 -139 149 -54 167
7346 167 28 -101 5 3 173 35 -6 5 158 125 9 11 -7 53 20 286 -28 245 -57 -152 -158 117 16 -32 38
7371 38 -89 -235 -193 -4 157 -325 184 180 -41 120 -63 -186 -44 43 3 -384 -239 44 -79 121 -108 -287
7393 -287 -28 9 -67 7 62 -131 -153 338 161 120 250 263 -131 -172 -244 289 -14 137 26 -159 -368 9 95
7416 95 -27 335 -101 -63 137 -117 45 -39 -75 282 2 -110 238 234 -74 -2 143 -21 83 -152 418 4
7438 4 162 206 -143 48 -71 108 -89 112 132 -44 -161 289 2 289 199 33 120 25 -184 -98 31 161 378
$$ packed form
7278H8q1q7J73j28j1L2J16J2l6j00p3R3j85J36J82l33J20j06j65O49l01p9J90
7301A06p1l57M41J0k54J51O6o1j81JK94j67J14j83J41K28l90k54L48r8K31j94
7323g9L84o02K97l46O1J36K84O5r5k49K80p0k26j84j3L41R8q3N0j88K88k03K21
7346A67j39j29J06kJ70j38m1J1J53l3j16Kj8O0l3K66l14K73l02r5oK75j01m8P0
7371C8j27j46M2J89J61m82N09mk21J61j83j23J42Q7m0l87J45K83j23K00k29j79
7393b87K59L7p6P4N5j93k2M91j77m1J30J3l94m1p2N33l03J51j11j85k09L77Q6
7416I5j22L62m36L8K00k54J62q4l6L57k80j12L48ml08P2J45j64J04k35N70m14
7438DJ58M4l49J91j19J79j97K01K0j76j17M50k87K87r0j66Q7r5k09Q6J29J30K17
$$ plain form
7461 378 -8 -114 -101 151 -172 10 188 204 252 282 233 37 -43 -31 190 -1 281 271 -346 55 32 -38 15 518
7485 518 134 -312 100 -75 151 153 130 220 24 -27 190 282 -8 78 -210 -240 70 -265 -207 -65 110 208 -21
7508 -21 -152 -43 220 196 369 -132 -294 155 -236 -92 22 -40 93 9 26 -2 198 207 -154 -92 332 -262 -283
7531 -283 283 -84 -92 -24 -298 -191 -1 257 -5 67 270 -66 180 13 336 37 -18 43 -343 238 -168 161
7553 161 62 -169 361 -203 131 237 -94 -133 -144 6 -38 443 6 -21 215 -48 100 131 -66 -134 298 90
7575 90 31 -34 -53 -23 -4 60 -54 230 199 66 -141 282 -141 -13 -146 -81 -63 -69 42 -236 131 120 94 54 -174
7600 -174 -31 -146 -74 -147 92 170 33 -21 234 -66 131 10 -14 23 59 -86 -134 77 320 19 -239 -30 -60
7623 -60 -91 -93 12 -128 122 22 76 -47 225 100 294 377 -29 192 -7 -240 236 -14 133 232 -150 -6
$$ packed form
7461C78l86j06J3K52l23J82J78J6M8L0m9j96q0J2K21j91K82j0o17M01k3p0N3N03
7485E18l84m46M12j75K26Kk3R0j96n1K17R2k90Q6k88l0L10l35N8J42J75R8k29
7508b1j31J09K63k4J73n01j62M49l91J44J14o2J33q4J7k8K00Rl61O2M24n94k1
7531b83N66l67qO8k74J07J90K58k62P2K03l36K46j67L23k99n5O1l86N81m06L29
7553A61r9k31N30n64L34J06l31l9j1J50m4M81m37k7K36k63J48L1j97o8M32k08
7575I0n9o5j9L0J9O4j14K84l1j33k07M23m23J28j33O5J8oJ11k78L67j1k6m0k28
7600a74J43j15P2p3K39P8j37n4K55l00J97j21k4L7L6j45m8K11K43l01k58K09l0
7623f0l1kJ05j40K50j00N4j23K72j25J94Q3m06K21j99k33M76k50J47R9l82J44
$$ plain form
7645 -6 218 37 114 14 -223 16 -90 -58 112 103 -46 48 164 144 -193 -546 256 -146 -205 93 -26 283 -145
7668 -145 185 -176 18 35 182 102 155 -37 69 100 106 108 7 -112 194 51 250 -1 89 -117 291 -319 79
7691 79 -252 -280 -68 -136 -135 44 456 -51 109 45 163 -44 -4 81 100 -212 27 316 -390 -297 2 -23 146 -43
7715 -43 77 272 119 218 94 38 90 -28 -325 256 50 -31 170 145 96 -78 -25 133 259 -69 146 -393 -33
7738 -33 156 -202 122 -157 -261 146 139 -69 151 340 -115 653 -253 -11 205 -294 52 -21 38 95 19 370
7760 370 32 80 11 102 -97 129 -75 -99 150 87 31 -286 -98 -117 292 -186 129 283 -91 31 239 -278
7782 -278 -8 -37 -74 -74 -30 -116 -94 9 35 -76 -377 -91 53 -190 -124 -194 54 207 -7 181 156 -245 101 141
7806 141 -43 -142 27 35 -12 15 -117 -12 153 -243 -239 -140 157 111 182 105 309 283 -179 6 0 14 85 -273 66
$$ packed form
7645fK24j81P7j00k37K39j06L2J70rj49R4J16k0l37l53Q02m02n9K98j19L09m28
7668a45L30l61J94J7J47q0N3j92J06L1OKj01j19L06j43J99k51R0k06M08o10L98
7691G9l31k8K12o8JJ79M12n07J60o4J18k07M0Q5J9l12K39K89p06R3K99k5J69j89
7715d3J20J95j53R9j24n6N2j18k97N81k06q1K01k5m9j74N3J58J26l28K15n39L60
7738c3J89l58L24k79j04M07pk08K20J89m55P68r06K42K16m99L46p3N9N7p6L51
7760C70l38M8o9R1j99K26k04k4K49o3n6l17J88j9M09m78L15J54l74J22K08n17
7782b78K70k9l7%M4q6K2J03K6j11l01K86J44k43O6p0K48J53k14J88k5m01L46M0
7806A41j84r9J69Qm7K7j32J05J65l96MR9K97m6P1p7K04k6m62J85oJ4P1l58L39
$$ plain form
7831 66 -44 -98 160 -49 263 235 -13 161 83 -6 -154 -304 131 -326 34 -159 -120 223 189 30 -24 146 30
7854 30 40 -76 243 -113 128 261 -72 111 146 -91 277 175 324 59 -413 -51 -93 127 43 137 -87 -253
7876 -253 -65 132 -110 153 63 -81 60 -17 -57 -59 -175 6 116 61 -220 -208 291 225 86 -218 -37 247 -114
7899 -114 109 101 84 3 35 148 -183 135 74 237 255 -69 -82 -129 28 -53 -134 -278 96 67 -295 -23 84 164
7923 164 60 -160 -193 -418 160 103 85 205 -6 -17 258 -159 -72 69 55 63 -131 363 -181 97 -147 -141 265
7946 265 105 -174 -364 -89 174 -124 38 -246 -99 47 152 102 -108 10 -106 -17 -52 -128 102 309 -126
7967 -126 101 113 -281 -25 107 -166 138 -24 -136 228 29 -10 -45 210 -293 50 62 -172 -37 45 184 -44
7989 -44 -254 162 23 197 163 88 9 -105 63 69 -57 -65 -175 38 191 27 115 -31 231 29 19 -9 -243 19
$$ packed form
7831F6j10n4K58k09L12k8k48J74p8q9j48j50M35m57L60j93L9L43l4j59n4J70j16
7854C0J0j16L19l56K41J33l33J83L5k37L68j02J49k65m72L62m2K20q4R4k24j66
7876b53J88J97k42K63r0j44J41p7m0kj16J81J10n5k81J2M99o6j39l04J81K84l61
7899a14K23qj7q1L2J13l31L18o1J63J8l24j3m7J57q1q1j44L74k9l62K72J07Q0
7923A64j04k20l3k25N78n7j8J20k11j1K75m17Q7J41j4Qj94M94n44K78k44OM06
7946B65j60k79j90K75K63k98J62k84J47J46J05n0k10J18j16Q9l5p6K30K07m35
7967a26K27J2l94K56J32k73L04j62j12L64j99l9l5K55n03L43J2k34J35Q2J39k28
7989d4k10M16j39J74l4p5p9j14J68Oj26qj10K13J53j64Q8j46K62k02j0k8k34K62
$$ plain form
8013 19 173 270 35 68 -10 132 207 159 -68 41 70 232 65 -315 209 -76 -102 83 -19 159 166 -385 192
8036 192 -117 -40 -104 37 -23 -72 183 -185 -73 -194 -52 -121 -9 161 -20 -55 -166 -158 105 37 186 162 132 -96
8060 -96 278 -113 -192 -116 -52 -33 -71 52 -263 -81 -108 158 227 74 155 80 181 208 -231 -124 -172 -202 263 7
8084 7 -235 -31 112 -20 33 -93 32 -134 208 349 274 240 -147 114 -170 -249 -82 470 110 -75 -210 -437
8106 -437 -121 194 55 -53 -22 24 -122 -77 -79 183 -184 16 -231 28 -21 77 -62 -82 89 -67 -308 133 -24
8129 -24 39 -263 193 -82 -393 -360 -135 0 -7 -82 -152 188 -42 -132 289 34 -307 -81 138 161 99 306 219 104
8153 104 -192 -144 -97 249 68 -249 93 81 281 -67 -145 -180 54 -297 -276 -158 -389 -5 -30 105 74 133 21
8176 21 272 299 54 -140 -48 -345 72 143 14 -175 46 -147 223 -265 -115
$$ packed form
8013A9J54R7k35L3p8J42P5m8k27J09K9J62j67l80N24k85k6J85j02J78Pn51N77
8036A92l09P7o4J41o0m9K55l68J12j21J42o9J12J70j81l5j11QK63o8J49k4l0k28
8060i6L74l91p9P6O4J9l8J23l15J82k7K66O9j53Q1p5J01K7m39J07m8l0M65k56
8084Gk42K04J43j32N3j26J25j66L42J41p5l4l87K61k84p9J67N52l60j85j35k27
8106d37L16L15j39j08L1M6j46M5kK62l67K00k47K59m9R8j39k0J71j56k41M41j57
8129b4O3l02M56k75l11L3K25J35pp5p0L40k30r0M21k55l41K26K19K3o2K07q7j15
8153A04k96M8M7L46j81l17L42j2K00l48p8l5K34l51K1J18k31L84k5J35l1N9j12
8176B1K51K7k45j94R2k97M17P1j29j89K21j93L70m88J50
8191a15
$$ Imaginary data points
##PAGE= N=2
##DATA TABLE= (X++(I..I)), XYDATA
$$ plain form
0 0 0 0 0 8 -16 16 -16 24 -32 48 -56 64 -88 104 -128 152 -185 224 -264 305 -361 424 -489 562 -649 744
26 744 -848 962 -1091 1234 -1389 1562 -1750 1959 -2187 2435 -2711 3010 -3340 3703 -4099 4539
42 4539 -5025 5563 -6164 6840 -7599 8461 -9452 10605 -11962 13588 -15581 18090 -21357
55 -21357 25811 -32280 42567 -61529 108134 -455253 -400113 514044 -119345 -424373 90890
66 90890 361824 -326034 -543024 -60291 132506 -260554 -221280 149448 82682 -328643 -230168
77 -230168 128924 76053 -235211 -161093 56958 -37102 -238271 -106450 99443 35461 -121766
88 -121766 -58851 42717 -41254 -160310 -75075 59117 9036 -117794 -71245 47467 9191
99 9191 -92800 -33359 60002 -21275 -127858 -51667 43553 -20292 -70287 32353 78992 -43485
$$ packed form
0@%%%Qk4L2l2M0n6Q0j04J20j52J92k32K80l37M09m88N69o66P85r13J051j211J393
26G44j592J810k053K325k623K951l312L709m146M622n146N721o350P043p802Q638
42D539r564J0588j1727J3004j4439J6060j7913K0057k2567K5550k9169L3671l9447
55b1357M7168n8091P4847j04096J69663n63387N5140R14157o33389l05028N15263
66I0890K70934o87858k16990M82733J92797l93060L9274L70728o6766m11325R8475
77b30168L59092n2871l11264P4118K18051r4060k01169J31821K05893o3982j57227
88a21766O2915J01568q3971j19056Q5235J34192n0081j26830M6549J18712l8276
99I191j01991N9441R3361q1277j06583P6191R5220o3845m9995J02640M6639j22477
$$ plain form
111 -43485 -104716 307 44171 -54791 -70285 46401 60558 -57597 -71712 35168 42434
122 42434 -48444 -40504 38828 18321 -54218 -27430 35658 12600 -27962 4861 33809 -8903
134 -8903 -40358 -3553 24053 -4441 -21099 9471 25648 -2099 -18848 3170 16001 -2346
146 -2346 -12448 3457 11647 -1848 -6493 6374 11841 -833 -6656 3827 8419 -2997 -6541
159 -6541 7222 11912 -1811 -6121 7620 10356 -4182 -5167 9152 8537 -5331 -3226 9593 6611
173 6611 -4900 -462 9609 3832 -5405 463 8838 2717 -3956 2086 8230 1281 -3163 3503 6576
188 6576 -287 -2032 4298 4834 -935 -789 4721 3886 -710 -428 3863 2875 -92 462 3277 2205 240
205 240 805 2334 1652 406 1643 2471 989 -125 1388 2251 1321 -553 1320 2908 1493 -303 1116
$$ packed form
111d3485o1231J05023M3864r8962j5494J16686J4157j18155j4115J06880P266
122D2434r0878P940P9332k0507p2539K6788O3088k3058m0562L2823K8948m2712
134h903l1455L6805K7606k8494j6658L0570J6177k7747j6749K2018J2831j8347
146b346j0102J5905Q190j3495m645J2867N467j2674n823J0483M592j1416l544
159f541J3763M690j3723m310J3741K736j4538r85J4319o15j3868K105J2819k982
173F611j1511M438J0071n777r237N868Q375o121o673O042O144o949m444O666L073
188F576o863j745O330N36n769J46N510q35m596K82M291r88k967N54K815j072j965
205B40N65J529o82j246J237Q28j482j114J513Q63r30j874J873J588j415j796J419
$$ plain form
222 1116 2776 1826 -598 682 2244 1172 -577 914 2075 613 23 1310 2131 72 -99 1719
238 1719 1863 -11 272 1592 1646 167 -33 1623 1608 -166 52 1391 973 -115 158 1344 928 128
256 128 90 1160 686 -74 367 1133 767 -102 650 1175 495 68 780 719 292 -127 555 1010 38 -35 666
277 666 854 210 -230 111 580 364 -39 216 586 460 93 214 553 103 -2 382 586 200 141 639 948
298 948 32 -254 298 718 -113 -109 456 698 78 283 395 665 -122 230 224 305 -374 234 681 245 118 331
320 331 352 276 170 133 621 -47 -382 340 656 176 -37 718 646 -43 -237 -23 571 248 -22 -200 519 296
342 296 -182 180 385 315 -122 406 525 87 498 788 725 -136 21 534 189 -441 25 519 693 -180 172
363 172 499 347 1 78 262 143 -106 186 605 311 -154 176 552 1 41 19 -193 -47 69 141 396 204
$$ packed form
222A116J660r50k424J280J562j072j749J491J161j462n90J287Q21k059j71J818
238A719J44j874K83J320N4j479k00J656j5j774K18J339m18j088K73J186m16q00
256A28l8J070m74p60M41P66l66q69P52N25o80m27P12o1m27m19O82M55r72p3P01
277F66J88o44m40L41M69k16m03K55L70j26l67J21L39m50j05L84K04l86n9M98L09
298I48r16k86N52M20q31MN65K42o20K05J12K70p87L52oQ1o79O08M47m36j27K13
320C31K1p6j06l7M88o68l35P22L16m80k13P55p2o89j94K14N94l23k70j78P19k23
342B96m78L62K05p0m37N28J19m38M11K90o3q61J57N13l45o30M66M94J74q73L52
363A72L27j52l46P7J84j19k49K92M19k94m65L30L76n51M0k2k12J46J16P2K55j92
$$ plain form
385 204 -330 314 235 -42 -92 41 316 -82 84 284 -19 -132 66 436 249 -362 162 624 66 -87 303
406 303 134 -386 -187 -80 85 299 -314 385 469 -23 164 183 253 3 -120 -21 186 -53 226 -90 9 -135
428 -135 -94 281 -82 -38 264 47 -130 70 -102 192 -265 -277 173 51 -114 -78 -80 97 -183 -131 -175 48 -577
451 -577 -9 -225 -24 -193 49 101 -31 -354 -133 24 -155 151 -57 95 -315 -349 264 -34 -192 -285 352
472 352 -114 -69 45 103 32 -121 -194 180 179 -363 -338 180 14 -293 -108 62 -345 -414 102 198 -183 -397 192
495 192 -28 -91 -55 39 200 -48 -195 40 86 -148 -555 -79 -122 -209 -213 219 326 -30 42 110 -233 129 -9 -166
519 -166 152 -51 37 37 66 -312 -127 -151 268 50 324 -242 240 -81 144 -149 -47 -153 12 -104 105 -180
541 -180 42 -105 -356 419 -74 -1 93 17 -47 -5 135 323 294 -76 25 66 -34 14 10 35 -458 158 -196 7
$$ packed form
385B04n34O44p9k77n0J33K75l98J66K00l03j13J98L70j87o11N24M62n58j53L90
406C03j69n20J99J07J65K14o13O99Q4m92J87J9P0k50j23R9K07k39K79l16R9j44
428a35M1L75l63M4L02k17j77K00j72K94m57j2M50j22j65L6kJ77k80N2m4K23o25
451e77N68k16K01j69K42N2j32l23K21J57j79L06k08J52m10l4O13k98j58r3O37
472C52m66M5J14N8p1j53p3L74jn42K5N18j66l07J85J70m07o9N16R6l81k14N89
495A92k20o3L6R4J61k48j47K35M6k34m07M76m3q7mM32J07l56P2O8l43L62j38j57
519a66L18k03Q8%K9l78J85k4M19k18K74n66M82l21K25k93J02j06J65j16K09k85
541a80K22j47k51P75m93P3R4p6o4M2J40J88k9l70J01M1j00M8mK5m93O16l54K03
$$ plain form
565 7 26 273 26 40 -137 85 -196 -459 106 -49 -126 -238 -301 55 -129 68 -189 -115 44 -67 178 -191 -222
588 -222 -292 187 42 -116 -169 -77 -92 -106 96 -135 -73 -67 312 -225 133 -294 -161 -53 -9 54 323 -27 -79 -243
612 -243 -12 -247 122 -318 -105 -25 -101 232 164 -153 -18 74 -100 1 -444 -204 -193 -246 -406 -187 -193 -5 -174
635 -174 -158 177 37 -100 237 115 -32 315 -47 169 -249 -14 -173 -208 -227 -111 -17 113 134 -242 226 -27
657 -27 -234 52 -40 -223 394 -19 159 -117 -343 182 75 267 -10 -142 174 390 145 52 20 48 -179 27
679 27 68 -47 -236 -158 6 30 -110 117 64 227 22 39 14 -33 -223 80 -126 -125 -183 124 108 -199 9 326
703 326 -406 -35 -52 303 -137 16 -52 -157 42 363 -26 281 146 -18 -170 -144 -71 -132 117 -36 301 -167
725 -167 -234 122 2 -211 101 -36 177 1 63 113 171 46 214 214 17 -7 356 82 -115 -185 -289 -24 -285
$$ packed form
565GJ9K47k47J4j77K22k81k63N65j55p7j12o3L56j84J97k57P4J59j11K45l69l1
588b22p0M79j45j58n3R2j5j4K02k31O2OL79n37L58m27J33J08M4O3K69l50n2j64
612b43K31k35L69m40K13Q0p6L33o8l17J35R2j74J01m45K40J1n3j60K19oJ88j69
635a74J6L35j40j37L37j22j47L47l62K16m18K35j59l5j9J16R4J30K1l76M68k53
657b7k07K86r2j83O17m13J78k76k26N25j07J92k77j32L16K16k45r3l2K8k27K06
679B7M1j15j89P8J64K4j40K27n3J63k05J7k5m7j90L03k06Jn8L07j6l07K08L17
703C26p32L71j7L55m40J53o8j05J99L21l89L07j35j64j52K6P3o1K49j53L37m68
725a67o7L56j20k13L12j37K13j76O2N0N8j25J68%j97k4L63k74j97p0j04K65k61
$$ plain form
748 -285 -164 22 41 57 181 -14 132 -214 -162 105 -204 36 95 -91 46 -302 -6 424 -262 -109 233 230
770 230 104 -393 136 -181 -96 -49 -150 -49 -8 -83 -134 17 -25 -111 -44 -234 -75 -267 -626 235 -33 245 31
793 31 203 97 260 -235 -258 104 -81 181 60 -255 -134 99 18 -111 32 34 -293 -161 80 -4 157 69 -62
816 -62 -313 -117 133 217 210 -24 6 -149 136 -185 67 -105 -134 147 162 -217 -135 -70 -265 -105 -58 -9 -42 76
840 76 56 -37 -37 22 255 -74 223 41 -133 117 47 -392 81 187 16 -383 91 -109 58 71 1 -86 75 -148
864 -148 -303 181 -99 -34 133 41 -164 -15 250 -100 -89 64 41 -97 83 -126 106 -118 -127 -44 345 -168 33
887 33 -49 -310 158 -26 198 -134 -92 -69 -193 -152 -33 86 -172 -93 -105 83 14 -38 268 -5 61 -4 7 96 -196
912 -196 73 -214 -17 178 89 -57 -399 -77 135 235 42 419 188 205 40 -76 -174 14 37 -117 13 -42
$$ packed form
748b85J21J86J9J6J24j95J46l46N2K67l09K40N9j86J37l48K96M30o86J53L42l
770B30j26m97N29l17Q5M7j01J01M1p5n1J51m2q6O7j90J59j92l59Q61k68K78k14
793C1J72j06J63m95k3L62j85K62j21l15J21K33q1j29J43Kl27J32K41q4J61q8j31
816f2k51J96K50Q4pk34L0j55K85l21K52j72k9K81J5l79Q2O5j95J60M7M9l3J18
840G6k0r3%N9K33l29K97j82j74K50p0m39M73J06j71l99M74k00J67J3p0q7J61k23
864a48j55M84k80O5J67r2k05J49K65l50J1J53k3j38J80k09K32k24rQ3L89n13K01
887C3q2k61M68j84K24l32M2K3j24M1J19J19k58P9j2J88o9n2L06k73O6o5J1Q9k92
912a96K69k87J97J95q9j46l42L22K12J00j93L77k31J7j65j16r8J88K3j54J30n5
$$ plain form
934 -42 217 318 -65 193 67 -351 130 83 -72 42 15 -51 -3 -58 -15 -3 101 -332 -157 263 -172 159 -191
957 -191 65 98 -207 22 162 -297 6 22 -196 3 246 -256 -7 -153 -38 -212 -128 97 98 -54 -61 -391 -35
980 -35 230 -22 180 -144 263 -158 -200 52 127 437 411 116 -115 -27 1 -296 -96 146 57 184 115 -163 4
1003 4 242 134 45 -202 -164 -167 -371 414 -16 -180 -97 -353 64 -107 -296 -47 -56 147 117 189 -9 -184 -140 -142 102
1028 102 242 -90 -156 -224 -68 -8 198 -163 -387 95 -98 200 -356 60 245 68 335 61 80 166 206 48
1050 48 -236 299 -29 171 99 -58 -57 -248 56 154 103 -160 52 -31 54 -46 209 150 -77 -75 140 -177 -3 286
1074 286 53 -172 -39 167 170 -114 25 36 -134 -112 152 28 46 -149 -232 -298 -156 -130 22 -246 -100 -197 -6
1097 -6 -24 35 -69 374 268 -334 106 -42 33 8 54 51 -45 -195 -152 114 -162 -104 -23 82 68 44 -35 263 28
$$ packed form
934d2K59J01l83K58j26m18M81m7j55J14k7o6M8n5M3J2J04m33J75M20m35L31l50
957a91K56L3l05K29J40m59L03J6k18J99K43n02K49j46J15j74Q4K25Jj52pl30L56
980c5K65k52K02l24M07m21m2K52P5L10k6k95k31Q8K8k97K00K42q9J27o9k78J67
1003DK38j08q9k47L8lk04P85m30j64Q3k56M17j71j89K49rK03l0P2j98j75M4kK44
1028A02J40l32o6o8J56O0K06l61k24M82j93K98n56M16J85j77K67k74J9Q6M0j58
1050D8k84N35l28K00p2j57Jj91L04R8n1k63K12q3Q5j00K55n9k27KK15l17J74K89
1074B86k33k25J33K06Lk84J39J1j70K2K64j24J8j95q3o6J42K6J52k68J46r7J91
1097fj8N9j04M43j06o02M40j48P5k5M6lr6j50M3K66k76N8Q1J05j4k4p9K98k35
$$ plain form
1122 28 -117 87 38 -264 -273 -202 -126 -363 -230 9 -194 195 327 52 -109 -9 -358 64 135 -49 18 191 155
1145 155 333 -225 -138 -53 142 35 -29 28 182 30 -102 46 -70 96 -7 260 -209 26 50 28 122 -301
1167 -301 -192 -49 51 93 49 60 109 59 36 -88 -171 200 -34 -102 68 97 -177 181 127 -92 39 4 -196 116
1191 116 88 21 63 -323 -178 119 137 235 30 92 -225 -337 4 68 -37 35 115 311 212 350 -164 -209 -45 -41
1215 -41 67 -263 228 -191 30 -69 -114 -143 -27 8 162 12 102 268 83 175 112 135 39 -343 166 72 153 315
1239 315 -12 12 -132 270 28 5 -54 -11 -61 95 -237 93 7 145 35 97 277 -209 -201 6 -157 101 -60
1262 -60 -6 -64 24 204 -75 -435 -86 -87 138 -18 158 -10 -194 -9 82 178 -121 -112 105 102 -184 -146 88 297
1286 297 138 -79 -74 289 -40 -27 52 39 -20 188 246 -22 -153 -124 -51 -43 118 188 -131 -57 51 242 107 450
$$ packed form
1122B8j45K04m9l02rP1P6k37J33K39k03L89J32k75j61J00l49M22P1j84O7J73l6
1145A55J78n58Q7Q5J95j07o4N7J54j52j32J48j16J66j03K67m69K35K4k2R4m23
1167c01J09J43J00M2m4J1M9n0k3j24q3L71k34o8J70K9k74L58n4k19J31l5k00L12
1191A16k8o7M2l86J45K97J8R8k05O2l17j12L41O4j05P2Q0J96r9J38n14m5J64M
1215d1J08l30M91m19K21r9m5k9J16L5J54j50R0J66j85R2o3K3r6l82N09r4Q1J62
1239C15l27K4j44M02k42k3n9M3n0J56l32L30q6J38j10O2J80m86QK07j63K58j61
1262f0N4n8Q8J80k79l60L49jK25j56J76j68j84J85R1R6k99RK17lk86L8K34K09
1286B97j59k17NL63l29J3P9j3n9K08N8k68j31K9P3QJ61P0l19P4J08J91j35L43
$$ plain form
1310 450 81 20 -80 -134 -252 -183 50 178 109 -12 78 -460 183 -219 -51 -48 -232 153 189 -190 -122 37 223
1333 223 128 17 10 -2 314 -294 -99 -170 12 343 0 129 3 -165 158 46 -131 -85 -322 -144 357 -54
1355 -54 96 157 143 -56 -140 147 19 7 -170 -71 -99 73 123 -47 42 353 -8 128 -337 113 133 -152 -241 214
1379 214 438 205 -113 -192 -92 -257 104 127 139 -51 125 -161 -348 -150 126 -17 34 -122 17 -117 -273
1400 -273 -31 -49 126 -18 55 -203 297 80 -253 19 194 105 -52 -14 -23 109 125 133 26 -180 110 162 -86
1423 -86 63 -35 107 83 99 -13 -230 111 -102 -60 10 24 93 294 50 -29 -120 -106 355 184 -20 -131 -160 -117
1447 -117 -186 3 -110 10 -182 -31 22 50 -101 -313 44 -266 -102 -12 -120 -21 35 34 91 -262 43 189 80
1470 80 154 -36 152 19 -84 -226 159 -17 148 226 6 189 61 49 186 -75 -159 -108 -5 -16 -57 171 -109
$$ packed form
1310D50l69o1j00n4j18O9K33J28o9j21R0n38O43m02J68Lj84L85L6l79O8J59J86
1333B23r5j11pj2L16o08J95p1J82L31l43J29j26j68L23j12j77M6k37J78N01m11
1355e4J50O1j4j99q4K87j28j2j77R9k8J72N0j70Q9L11l61J36m65M50K0k85q9M55
1379B14K24k33l18p9J00j65L61K3J2j90J76k86j87J98K76j43N1j56J39j34j56
1400b73K42j8J75j44P3k58N00k17l33K72J75q9j57L8rJ32J6Qj07k06K90N2k48
1423h6J49r8J42k4J6j12k17L41k13M2P0J4O9K01k44p9r1J4M61j71k04j11k9M3
1447a17o9J89j13J20j92J51N3K8j51k12L57l10J64R0j08R9N6jN7l53L05J46j09
1470H0P4j90J88j33j03j42L85j76J65P8k20J83j28j2J37k61q4N1J03j1m1K28k80
$$ plain form
1493 -109 -11 14 122 -376 -243 298 165 168 -291 -8 91 74 90 168 -21 58 123 -85 -282 81 142 81 -108 286
1517 286 -234 -176 271 84 -128 104 239 88 103 94 96 -271 276 -164 -44 17 275 122 -241 262 59 -20 -204
1540 -204 -131 143 144 -280 -55 230 26 59 -225 -236 -70 99 -172 -82 36 -52 69 -198 -148 111 77 -263 144
1563 144 266 -49 -115 -46 -34 -74 -13 -114 140 182 -92 13 43 -200 -183 -243 117 -275 77 238 -33 -63 -73 -30
1587 -30 -102 295 -24 -120 -14 -20 67 5 62 231 -20 11 241 256 475 136 43 -252 -77 -51 123 166 120 -73 98
1612 98 -11 -274 210 -25 -214 185 119 148 -98 71 18 -202 -9 35 -134 -226 -238 -107 -271 66 -52 -172
1634 -172 65 -47 -21 -290 -119 277 -94 -70 165 110 216 153 86 -137 -280 3 -104 81 -116 -300 39 -200
1656 -200 -26 40 72 -160 81 -79 135 -27 -109 -206 -43 -289 -152 404 24 22 175 361 379 -39 -107 254 -399
$$ packed form
1493a09R8K5J08m98J33N41j33Lm59K83R9j7J6P8j89P9O5k08j97L63O1o1j89L94
1517B86n20N8M47j87k12K32J35j51J5rKl67N47m40J20O1K58j53l63N03k03p9j84
1540b04P3K74Jm24K25K85k04L3k84j1J66J69k71R0J18q8J21k67N0K59l4l40M07
1563A44J22l15o6O9J2m0O1j01K54M2k74J05L0k43J7o0L60l92L52J61k71l0j0M3
1587c0p2L97l19r6J06oQ7o2N7J69k51L1K30J5K19l39r3k95J75K6J74M3m6j93J71
1612I8j09k63M84k35j89L99o6K9k46J69n3k20J93M4j69r2j2J31j64L37j18j20
1634a72K37j12K6k69J71L96l71K4K35n5J06o3o7k23j43K83j07J85j97j84L39k39
1656b00J74O6L2k32K41j60K14j62q2r7J63k46J37N56l80kJ53J86J8m18o8L61o53
$$ plain form
1679 -399 -49 2 2 -333 -247 270 3 -117 -204 -78 -5 -84 -99 180 74 -124 322 181 257 29 -324 -189 -27
1702 -27 -130 -168 -421 101 76 -71 94 244 235 113 36 -218 142 -57 49 95 10 -284 -16 29 291 127 -13
1725 -13 83 -125 -49 -20 185 184 -64 216 -54 239 -182 -98 469 -152 56 -22 243 -114 -190 165 4 188 -17
1748 -17 43 69 -384 -130 -71 18 241 -152 -129 -131 64 -34 70 -95 199 -58 29 150 -2 -178 -41 75 -208
1771 -208 116 129 -6 -11 136 160 127 -221 -73 143 -120 -68 19 36 66 -132 -338 139 -35 -237 -126 -123 139 -96
1795 -96 -219 199 218 106 -157 -23 83 -98 16 4 -223 51 -128 20 15 186 -372 -101 195 118 151 -434
1817 -434 60 -243 206 -93 30 132 -164 316 94 -101 -171 -133 65 124 256 87 -250 -135 -267 -28 276
1838 276 134 47 195 118 306 -163 -74 -218 -84 332 -88 96 -98 116 -358 -58 -169 -123 192 -66 -230
$$ packed form
1679c99L50N1%l35Q6N17k67j20q7J26P3p9j5K79j06j98M46j41P6k28l53J35J62
1702b7j03l8k53N22k5j47J65J50rj22p7k54L60j99J06M6q5k94K68M5K62j64j40
1725a3R6k08P6K9K05jk48K80k70K93m21Q4N67o21K08p8K65l57p6L55j61J84k05
1748a7O0K6m53K54N9Q9K23l93K3kJ95r8J04j65K94k57Q7J21j52j76J37J16k83
1771b08L24J3j35nJ47K4l3l48J48K16k63N2Q7J7L0j98k06M77j74k02J11LK62k35
1795i6j23M18J9j12k63J34J06j81J14j2k27K74j79J48nJ71n58K71K96p7L3n85
1817d34M94l03M49k99J23J02k96M80k22j95p0L8J98N9J32j69l37J15j32K39L04
1838B76j42q7J48p7J88m69Q9j44J34M16m20J84j94K14m74L00j11M6L15k58j64
$$ plain form
1859 -230 58 182 154 -261 48 -170 -170 50 286 235 -379 225 241 250 -26 -125 68 -69 141 -322 70 373 25
1882 25 25 -70 -5 -252 187 -209 99 -7 112 0 239 -55 92 -239 221 -42 90 76 -13 -45 -8 -45 -49 114
1906 114 -166 66 -10 118 -194 171 -24 -7 -193 112 11 -3 190 32 89 -50 -120 145 70 -157 -352 270
1928 270 -268 -353 30 41 -298 -117 -53 70 135 131 -307 18 -119 -71 31 -103 181 121 157 214 -289 255 -86
1951 -86 103 111 -38 -175 -101 247 147 173 -175 79 597 80 -2 131 -52 -20 43 159 -87 -147 248 -202 -122
1974 -122 151 -93 -161 64 44 201 182 22 378 -35 -174 167 -79 -30 49 105 -85 47 117 -183 -324 282
1996 282 6 13 52 6 67 7 75 -25 -30 171 -282 -38 -126 68 -46 55 -337 -43 15 -220 -85 -149 -4 -238
2020 -238 134 -140 305 25 -79 -100 449 -98 269 122 228 -108 -134 185 -43 208 -116 62 78 -130 115
$$ packed form
1859b30K88J24k8m15L09k18%K20K36n1o14O04J6Rk76r9J93j37K10m63L92L03l48
1882B5%r5O5k47M39l96L08j06J19j12K39k94J47l31M60k63J32j4q9l2L7l7mJ63
1906A14k80K32p6J28l12L65j95J7j86L05j01j4J93j58N7j39p0K65p5k27j95O22
1928B70n38q5L83J1l39J81O4J23O5mm38L25j37M8J02j34K84o0L6N7n03N44l41
1951h6J89Qj49j37P4L48j00K6l48K54N18n17q2J33j83L2O3J16k46o0L95m50Q0
1974a22K73k44o8K25k0J57j9j60L56m13j39L41k46M9P9N6j90J32P0l00j41O06
1996B82k76PL9m6O1o0O8j00nK01m53K44q8J94j14J01l92K94N8k35J35o4J45k34
2020b38L72k74M45k80j04k1N49n47L67j47J06l36k6L19k28K51l24J78J6k08K45
$$ plain form
2041 115 19 6 -124 114 -53 145 97 97 95 -141 -235 353 168 -139 96 314 -42 -181 -156 49 334 -74 -356
2064 -356 175 -86 114 129 -63 -83 -194 240 -199 159 93 -18 69 134 -145 -154 -54 42 -117 37 -50 -55 -194 186
2088 186 -41 -108 -110 -35 -219 279 -74 196 -97 94 -319 -41 117 -84 72 251 -141 147 -28 -108 288 -52
2110 -52 198 106 342 -49 164 -76 54 -76 -223 61 -17 -23 82 -115 -291 -82 -99 28 68 -20 214 46 -105
2133 -105 -310 65 -10 234 312 22 -233 -45 118 -90 -235 -43 -173 7 151 272 209 390 -119 68 24
2154 24 -127 -86 -198 -69 -123 106 -339 119 -115 352 54 -314 28 -235 -106 -93 -146 101 -195 102 -327 160
2176 160 225 447 0 -23 97 -60 -36 -91 40 -9 -113 3 16 62 50 -25 -10 247 -149 130 90 42 199 84
2200 84 192 -174 24 -263 169 -3 -13 -368 151 37 160 -22 -58 -251 -117 153 -197 -69 -200 7 -36
$$ packed form
2041A15r6j3j30K38j67J98m8%kk36r4N88j85l07K35K18l56j39K5K05K85m08k82
2064c56N31k61K00J5j92k0j11M34m39L58o6j11Q7O5k79rJ00R6j59J54q7nj39L80
2088A86k27o7kP5j84M98l53K70k93J91m13K78J58k01J56J79l92K88j75q0L96l40
2110e2K50r2K36l91K13k40J30j30j47K84p8oJ05j97j76K09j7J27M0q8K34j68j51
2133a05k05L75p5K44P8k90k55J88J63k08j45J92j30J80J44J21o3J81n09J87m4
2154B4j51M1j12J29n4K29m45M58k34M67k98l68L42k63J29J3n3K47k96K97m29M87
2176A60O5K22m47k3J20j57K4n5J31m9j04J16J3M6j2p5J5K57l96K79m0m8J57j15
2200H4J08l66J98k87M32j72j0l55N19j14J23j82l6j93J34K70l50J28j31K07m3
$$ plain form
2221 -36 260 -20 32 0 -2 -25 33 259 232 -50 -138 -118 134 23 -35 132 -275 145 324 -80 16 118 79 252
2245 252 -89 -609 254 171 292 44 -141 5 -194 115 -7 122 -224 -76 -187 7 43 -174 -67 -2 112
2266 112 -126 -163 -329 551 -132 94 -66 -84 150 -43 17 23 -97 30 4 123 -85 158 157 99 49 -131 112
2289 112 -186 221 78 -14 132 -14 -26 238 -82 47 140 221 209 -135 -32 -51 128 -173 101 -315 -308 135 -459
2312 -459 -3 156 -72 22 65 24 104 101 320 -310 170 54 -28 -47 -119 47 96 -12 182 -98 -149 348 -212 44
2336 44 280 -131 -103 -13 38 139 117 -29 51 -142 151 58 -84 360 57 -132 146 219 -3 -55 286 181 -103
2359 -103 75 -187 363 -22 227 -33 -5 186 35 -50 -155 -206 -159 259 101 -60 -80 44 -137 39 -108 129
2381 129 -164 114 -292 56 -190 -6 -199 11 -92 83 31 17 90 -35 6 17 162 114 -131 -85 0 -185 214
$$ packed form
2221c6K96k80N2l2kk3N8K26k7k82q8K0K52j11n8J67m07M20J79m04R6J02l9J73
2245B52l41n20Q63q3J21k48j85J46j99L09j22J29l46J48j11J94L6k17J07O5J14
2266A12k38l7j66Q80o83K26j60j8K34j93O0Oj20J27k6J19k08K43jn8n0j80K43
2289A12k98M07j43r2J46j46j2K64l20J29R3Q1j2l44J03j9J79l01K74m16PM43n94
2312d59M56J59k28R4M3m1Q0lK19o30M80j16q2j9p2J66M9j08J94k80n1M97n60K56
2336D4K36m11K8R0N1J01k2j46Q0j93K93r3j42M44l03j89K78P3k22n2L41j05k84
2359a03J78k62N50l85K49k60K8J91j51q5j05n1M7M18j58j61k0J24j81J76j47K37
2381A29k93K78m06L48k46J84j93K10j03J75n2j4P3j25M1J1J45m8k45M6Q5j85L99
$$ plain form
2404 214 25 -249 -229 -123 114 -265 65 91 -248 -109 241 72 152 -178 31 -93 -46 47 165 228 40 91
2426 91 5 11 330 -33 76 -18 -42 142 -121 -61 7 -15 223 116 -42 -45 5 -283 -37 -152 -182 404 230 241 197
2451 197 281 -275 40 69 52 88 49 97 17 197 -62 177 57 -100 240 147 15 141 46 -270 7 -80 225
2474 225 135 -200 -30 88 -159 -106 55 -26 182 -29 -126 66 -87 31 -224 -78 -302 120 140 156 319 -24
2496 -24 93 -302 -36 344 238 186 -179 -174 -391 -91 -226 -88 17 -186 -91 -416 -58 27 -107 118 247 98
2518 98 -85 237 93 -40 -95 -280 302 30 139 191 18 -129 -224 -164 -190 -188 -23 -394 -219 189 282 -107 -125
2541 -125 -76 37 149 91 -402 -221 -248 -132 55 -85 108 166 -342 35 109 -40 -105 -121 166 171 -231 -377 -102
2564 -102 -11 260 367 68 -49 94 219 -61 89 580 -416 4 -250 156 -101 308 210 -152 -228 102 -154
$$ packed form
2404B14j89k74K0J06K37l79L30K6l39J39L50j69Q0l30K09j24M7R3J18O3j88N1
2426I1q6OL19l63J09r4k4J84k63O0O8k2K38j07j58lN0k88K46j15l0N86j74J1m4
2451A97Q4n56L15K9j7L6l9M8q0J80k59K39j20j57L40r3j32J26r5l16K77q7L05
2474B25r0l35J70J18k47N3J61q1K08k11r7J92j53J18k55J46k24M22K0J6J63l43
2496b4J17l95K66L80j06n2l65Nk17L00j35J38J05k03R5l25L58Q5j34K25J29j49
2518I8j83L22j44j33n5j85N82k72J09N2j73j47r5O0k6KJ65l71J75M08R3l89j8
2541a25M9J13J12n8m93J81k7J16J87j40J93N8n08L77P4j49o5j6K87Nm02j46K75
2564a02R1K71J07k99j17J43J25k80J50M91r96M20k54M06k57M09r8l62p6L30k56
$$ plain form
2585 -154 334 300 -5 70 170 75 -76 6 95 -130 7 -2 15 -86 62 66 -64 160 -233 -185 -136 55 13 -42 92
2610 92 -187 -253 71 3 159 159 -169 286 210 291 63 229 -277 17 301 132 99 182 -217 103 -177 94 -157
2633 -157 148 -37 -375 -37 -60 169 -228 50 153 -300 -254 -165 186 -92 -246 295 -235 52 56 -365 33 -128
2655 -128 -56 276 221 155 -21 -45 160 111 85 37 -36 26 173 -259 49 -55 -113 -238 -2 55 -327 135 373 -19
2679 -19 39 -204 61 70 111 -33 183 107 -27 38 -119 -140 3 -11 -147 -74 146 -53 54 -85 -28 -106 -66 -51 -248
2704 -248 239 58 -40 -14 -34 -96 -186 -8 -23 -89 -69 -9 211 -58 -118 -262 -18 -39 338 82 -80 -189 43 -99
2728 -99 -226 -90 219 -229 -134 -28 -263 263 -146 -147 -3 -102 320 66 -44 -89 153 261 -116 82 24 -251
2750 -251 -162 14 -72 -257 136 229 -126 -160 -255 110 -47 203 -277 29 -231 -59 -129 -264 32 220 -140 10
$$ packed form
2585a54M88l4l05P5J00r5j51Q2Q9k25J37rJ7j01J48Mj30K24l93M8M9J91m2n5J34
2610I2k79o6L24o8J56%l28M55p6Q1k28J66n06K94K84j69l3Q3l99L20k80K71k51
2633a57L05j85l38L38k3K29l97K78J03m53M6Q9L51k78j54N41n30K87Mm21L98j61
2655a28P2L32n5o6j76k4K05m9k6m8p3O2J47m32L08j04n8j25K36N7l82M62K38l92
2679a9N8k43K65RM1j44K16p6j34O5j57k1J43j4j36P3K20j99J07j39N7p8M0J5j97
2704b48M87j81r8K6k0o2r0J78j5o6K0O0K20k69o0j44K44k1L77k56j62j09K32j42
2728i9j27J36L09m48R5J06k35N26m09jJ44r9M22k54j10m5K42J08l77J98n8k75
2750b51Q9J76q6j85L93R3l55l4r5L65j57K50m80L06k60J72p0j35K96J88l60J50
$$ plain form
2772 10 73 236 265 -34 141 23 -1 -1 36 42 -229 -20 27 -136 -272 5 534 28 -80 212 -102 12 -9 83
2796 83 -43 80 307 16 7 -238 284 -13 -86 -129 24 179 -73 -57 -109 -205 -219 -93 -7 17 -2 -10 -101 232 -141
2821 -141 124 109 -152 -67 108 -171 -353 84 45 -12 64 -134 3 61 129 121 -143 185 6 261 255 183 -373 27
2845 27 -353 -162 191 61 43 20 -284 23 34 -71 -31 -227 248 255 188 -202 -54 -49 -70 70 150 -5 -5 -4 20 62
2871 62 0 143 206 -139 -5 61 37 25 -7 157 209 37 192 20 94 228 -21 68 -164 2 1 87 -40 346
2895 346 -427 129 -218 98 -155 -148 66 -222 219 -118 69 -33 -226 6 206 -276 -61 295 281 -215 -182
2916 -182 29 363 -1 28 -99 -179 218 97 -112 -153 -190 -283 -9 259 65 -45 -568 -84 -83 -288 23 -62 -22
2939 -22 8 160 37 -90 123 -15 139 -70 84 461 94 -271 289 41 -111 132 -45 54 0 -145 -83 67
$$ packed form
2772A0O3J63K9k99J75j18k4%L7Ok71K09M7j63j36K77N29n06j08K92l14J14k1R2
2796H3j26J23K27k91rk45N22k97p3m3J53J55k52J6n2r6j4J26Q6K4j9qr1L33l73
2821a41K65j5k61Q5J75k79j82M37l9n7P6j98J37N8O8qk64L28j79K55op2n56M00
2845B7l80J91L53j30j8k3l04L07J1j05M0j96M75Po7l90J48Nk1J40Q0j55%JK4M2
2871F2o2J43O3l45J34O6k4j2l2J64N2j72J55j72P4J34k49Q9k32J66jQ6j27L86
2895C46p73N56l47L16k53PK14k88M41l37J87j02j93K32K00m82K15L56j4m96L3
2916a82K11L34l64K9j27q0L97j21k09m1l7r3K74K68j94j10n23M84Jk05L11q5M0
2939b2L0J52j23j27K13j38J54k09J54L77l67l65N60k48j52K43j77R9n4j45O2J50
$$ plain form
2961 67 -368 73 -16 12 -58 -27 91 -73 -359 69 -88 220 71 23 197 91 -37 -23 148 155 95 -133 -69 -316
2985 -316 92 -191 277 163 -46 -59 60 40 56 -123 -152 37 399 -173 -144 -61 237 173 141 -2 127 72 194
3008 194 307 -71 -41 84 -179 -314 55 22 -177 -139 -86 6 132 29 -89 356 -100 -187 105 -169 -90 -355
3030 -355 -109 10 -84 -209 -209 -166 -25 103 -55 -13 60 46 201 -41 72 -1 -296 -25 187 -90 79 227 23
3053 23 82 10 -111 -42 56 109 -227 -16 -110 -111 -196 48 -186 125 -262 221 -128 40 123 72 184 -338 -55 -230
3077 -230 125 -151 126 -47 233 6 -210 21 -363 69 -49 -165 101 -164 39 -251 -142 -27 -153 191
3097 191 -83 -166 166 123 -275 -36 37 51 264 21 25 -86 -118 -8 126 37 -110 374 -78 135 -48 -291 110
3120 110 197 107 -19 -222 -253 76 -221 18 -114 136 -307 75 -248 -256 416 -22 -152 124 -12 134 -118 -128
$$ packed form
2961F7m35M41q9K8p0L1J18j64k86M28j57L08j49m8J74j06j28J4J71Po0k28O4k47
2985c16M08k83M68j14k09j3J19k0J6j79k9J89L62n72K9Q3K98o4l2j43J29n5J22
3008A94J13l78L0J25k63j35L69l3j99L8N3R2J26j03j18M45m56q7K92k74P9k65
3030c55K46J19r4j25%M3J41J28j58M2P3j4J55k42J13p3k95K71K12k77J69J48k04
3053B3N9p2j21O9R8N3l36K11r4jq5K44k34L11l87M83l49J68Q3n1J12n22K83j75
3077b30L55k76K77j73K80k27k16K31l84M32j18j16K66k65K03k90J09J15j26L44
3097A91k74q3L32m3l98K39P3J4K13k43Mj11l2J10J34q9j47M84m52K13j83k43M01
3120A10Q7r0j26k03l1L29k97K39j32K50m43L82l23qO72m38j30K76j36J46k52j0
$$ plain form
3142 -128 60 -198 -153 -271 -253 -165 188 116 -202 -148 -405 -461 -134 -313 -136 -13 -280 -22 -37 193 103 -113 135
3165 135 -199 44 136 20 25 189 -41 -12 217 -23 -183 -323 1 85 -151 109 69 83 -165 -59 69 -75
3187 -75 35 -303 -32 173 148 30 84 8 -2 387 282 -5 -116 -61 -205 -80 -8 103 133 -24 22 141 -127
3210 -127 -10 -235 -14 -125 -77 121 171 165 -137 -89 2 51 -118 -91 -132 100 341 -232 -81 73 47 41 -175 34
3234 34 -135 -90 65 -259 -292 -182 -188 132 -50 164 83 1 -40 -18 -128 -20 0 38 164 -436 -87 119 22 -109
3258 -109 -166 -141 235 -47 -83 -25 -32 -43 -267 54 -225 -190 190 295 222 10 234 -227 -102 -133 -14 238 196 277
3282 277 563 -37 -40 -1 -157 96 72 80 -112 -3 115 -286 -284 -64 -60 -54 221 -168 -39 24 -145 -40 62 -311
3306 -311 -53 -261 -144 148 -80 196 78 -232 -37 -70 295 19 -124 167 -203 -245 -20 163 210 -226 -75
$$ packed form
3142a28J88k58M5j18J8Q8L53p2l18N4k57n6L27j79J77J23k67K58j5K30r0k16K48
3165A35l34K43R2j16NJ64k30K9K29k40j60j40L24Q4k36K60m0J4k48J06J28j44
3187g5J10l38K71K05k5j18N4p6j0L89j05k87j11N5j44J25P2J11L0j57M6J19k68
3210a27J17k25K21j11M8J98N0ol02M8R1M9j69K7m1K32K41n73J51J54k6ok16K09
3234C4j69M5J55l24l3J10oL20j82K14q1q2m1K2j10J08K0L8J26o00L49K06r7j31
3258a09n7K5L76k82l6N8pj1k24L21k79L5L80J05p3k12K24m61J25l1J19K52m2Q1
3282B77K86o00lL9j56K53k4Qj92J09J18m01KK20MOK75l89J29O3j69J05J02l73
3306c11K58k08J17K92k28K76j18l10J95l3L65k76j43K91l70m2K25J83M7m36J51
$$ plain form
3327 -75 -106 -291 -22 -209 -60 -40 30 55 18 320 -31 -281 62 -100 277 -284 13 14 -98 -137 190 -190 45
3350 45 175 71 202 22 -258 -52 48 -69 -303 -259 -56 -124 -64 160 30 21 -69 -142 26 -247 -17 89 68
3373 68 134 -115 74 194 6 77 -1 -58 187 118 -196 14 10 -173 -236 -122 24 221 -81 41 171 -214 134
3396 134 -202 -39 -7 69 16 71 -112 -43 58 -61 -18 -78 227 -15 56 -74 -35 154 -40 -30 -61 -303 -39 45
3420 45 -82 -187 -41 -133 60 49 183 199 16 -133 -67 -41 -65 -297 109 72 -286 -24 -174 494 78 -268 -25
3443 -25 80 55 10 -118 -127 25 106 -1 -148 91 -113 117 -172 220 -81 84 -40 -26 300 -96 -155 -468 33
3466 33 85 -87 -63 -80 -63 162 -87 175 -36 -94 17 -12 -221 95 60 93 41 -27 102 316 -153 66 7 138
3490 138 251 38 181 439 -194 -59 102 107 116 -344 -110 -156 -4 167 43 80 -109 -248 130 109 -146 -85 192
$$ packed form
3327g5l1j85K69j87J49K0P0K5l7L02l51k50L43j62L77n61K97Jj12l9L27l80K35
3350D5J30j04J31j80k80K06J00j17k34M4K03o8O0K24j30rr0p3J68k73K30J06k1
3373F8O6k49J89J20j88P1p8n7K45o9l14K10mj83o3J14J46J97l02J22J30l85L48
3396A34l36J63L2P6n3N5j83O9J01j19M3o0L05k42P1j30L9J89j94J0l1k42K64Q4
3420D5j27j05J46r2J93j1J34J6j83j49O6K6k4k32M06l7l58K62j50O68m16l46K43
3443b5J05k5m5j28rJ52Q1j07j47K39k04K30k89L92l01J65j24J4L26l96n9l13N01
3466C3N2j72K4j7J7K25k49K62k11n8J11k9k09L16l5L3n2o8J29K14m69K19n9J31
3490A38J13k13J43K58o33J35J61NRm60K34m6J52J71j24L7j89j39L78k1k55O1K77
$$ plain form
3513 192 -329 171 -32 -285 -71 136 385 -9 202 -19 -32 62 -94 -163 -52 -294 -230 96 -142 -133 117 -48
3535 -48 238 -369 6 53 -271 60 -139 144 307 328 170 -82 -102 -44 175 -88 344 68 -49 -100 33 262
3557 262 6 -214 129 -166 124 -84 9 -22 291 145 -234 58 -77 54 -96 70 101 -339 95 79 173 -269
3579 -269 -77 -120 68 -82 76 -164 172 -73 85 169 -375 103 273 51 -407 69 193 194 16 168 86 42
3601 42 -274 76 -14 -13 -65 -248 -86 -21 113 -220 -105 -111 265 118 -16 166 82 -10 54 -367 39 0 322 164
3625 164 -173 -143 -216 53 160 -4 139 242 -85 103 -179 -521 -71 192 -2 -331 210 -285 397 122 -302
3646 -302 168 -55 -499 -171 -173 -91 7 38 -186 124 35 165 197 147 152 -149 39 110 272 33 35 151 94 44 224
3671 224 70 77 15 -163 -116 152 1 162 169 -323 -219 -84 17 31 -71 230 -47 -30 38 -276 47 69 407
$$ packed form
3513A92n21N00k03k53K14K07K49l94K11k21j3R4j56o9J11k42O4L26k38RK50j65
3535d8K86o07L75M7l24L31j99K83J63K1j58k52k0N8K19k63M32k76j17n1J33K29
3557B62k56k20L43k95K90k08R3l1L13j46l79K92j35J31j50J66L1m40M34j6R4m42
3579b69J92m3J88j50J58k40L36k45J58Q4n44M78J70k22m58M76J24Jj78J52q2m4
3601D2l16L50r0Jn2j83J62O5J34l33J15oL76j47j34J82q4r2O4m21M06l9L22j58
3625A64l37L0p3K69J07j64J43J03l27J88k82l42M50K63j94l29N41m95O82k75m24
3646c02M70k23m44L28kQ2R8L1k24L10q9J30L2n0Nl01J88P1J62k39KJ16n7n0J80
3671B24j54Po2j78M7K68j51J61Pm92J04J35J01J4j02L01k77J7O8l14L23K2L38
$$ plain form
3694 407 229 93 -9 -321 156 157 96 201 -74 -176 106 -59 372 -74 -3 -7 187 262 -25 -274 -177 31 -145
3717 -145 72 -195 -67 -4 -102 -113 33 -54 212 -24 -245 105 102 -160 -25 228 -223 232 -39 80 168 -78
3739 -78 -40 -21 262 -39 101 132 -108 -91 67 -229 34 -200 -572 71 -4 237 62 -131 -124 42 70 -11 -336
3762 -336 -69 -29 -295 87 -32 -31 -139 -92 91 -341 -197 -70 78 -43 -317 69 245 9 45 246 -112 -78
3784 -78 -214 13 -55 113 87 -97 102 159 -451 12 -27 135 172 -197 -240 147 254 0 190 -274 -93 -38 66
3807 66 432 88 17 -142 -250 -49 120 -4 89 -124 114 -109 75 71 132 -114 73 100 243 116 147 47 59
3830 59 203 84 25 98 106 -341 5 169 17 -100 150 124 114 -25 108 65 -47 73 -83 36 -154 -20 220
3853 220 266 1 -307 235 -21 -71 -122 22 -263 153 291 207 -241 173 -30 143 171 -108 80 -210 -75 7
$$ packed form
3694D07j78j36j02l12M77Jo1J05k75j02K82j65M31m46P1mJ94P5k87k49R7K08j76
3717a45K17k67J28O3r8j1J46q7K66k36k21L50lk62J35K53m51M55k71J19Q8k46
3739g8L8J9K83l01J40L1k40J7J58k96K63k34l72O43p5K41j75j93PJ66K8q1l25
3762c36K67M0k66L82j19Jj08M7J83m32J44J27J48j21k74L86J76k36L6K01l58L4
3784g8j36K27o8J68k6j84J99N7o10M63l9J62L7l69m3L87J07k54J90m64J81N5J04
3807F6L66l44p1j59j08K01J69j24R3k13K38k23J84mO1k46J87K7J43j27L1j00J2
3830E9J44j19n9P3Qm47L46J64j52j17K50k6j0j39J33m3j12J20j56J19j90J34K40
3853B20M6k65l08N42k56n0n1J44k85M16J38q4m48M14k03J73K8k79J88k90J35Q2
$$ plain form
3875 7 -106 -243 -48 25 -217 95 -167 -14 -56 157 21 77 127 -6 186 38 159 -4 49 124 -118 -243 28
3898 28 54 24 -219 -224 358 -38 -87 -251 -167 -24 -195 14 431 -72 -95 193 -156 -164 -317 -43 -155 -1 153
3921 153 247 312 -59 254 4 -229 104 -47 -83 177 -48 120 -188 277 -94 -311 23 -36 43 219 -209 -62
3943 -62 102 -156 239 92 31 53 -35 246 247 306 118 22 -77 138 109 -193 135 13 -31 15 119 -126 -234 258
3967 258 144 129 28 22 194 -112 168 31 62 -248 205 -229 83 -148 -197 -214 101 5 -194 -42 -356 73
3989 73 -142 -254 -58 -57 -51 -184 240 -348 -343 -47 400 189 -18 -57 121 185 -155 -202 -179 106 -52 117 29 -114
4013 -114 1 -89 -257 158 65 -32 -321 44 51 84 -147 99 -193 7 -27 186 123 212 50 -148 76 13 -50 122
4037 122 111 -161 35 92 360 128 -97 -486 -161 80 12 -6 -23 37 -256 21 247 -459 -132 -25 130 148
$$ packed form
3875Gj13j37J95P3k42L12k62J53m2K13j36N6N0j33J92j48J21j63N3P5k42j25K71
3898B8K6l0k43nN82l96m9j64Q4J43j71K09M17n03k3K88l49qj53K74j12J54J54
3921A53R4O5l71L13k50k33L33j51l6K60k25J68l08M65l71k17L34n9P9J76m28J47
3943f2J64k58L95j47o1K2q8K81JN9j88r6r9K15k9l02L28j22m4M6J04k45j08M92
3967B58j14j5j01oJ72l06K80j37L1l10M53m34L12k31m9j7L15r6j99J52l14M29
3989G3k15j12J96JOj33M24n88NK96M47k11k07l9J78O4l40m7K3K85j58J69q8j43
4013a14J15r0j68M15r3r7k89L65PL3k31K46k92K00l4K13o3Q9j62j98K24o3o3J72
4037A22j1k72J96N7K68k32k25l89L25K41o8j8j7O0k93K77K26p06L27J07J55J8
$$ plain form
4059 148 54 50 -274 -6 18 -263 66 -22 -56 125 60 128 63 -26 -35 19 -100 397 -294 -160 -217 311 -142 -55 -104
4084 -104 -20 45 -82 -400 -62 -343 -144 120 265 -260 -188 -64 -20 -104 82 261 -33 175 20 -56 -308 -66
4106 -66 3 5 -138 -156 -212 -40 34 21 -18 78 -364 45 -33 118 257 -143 -66 138 -154 17 432 20 5 68 -115
4131 -115 -120 71 -3 42 38 86 76 -132 43 -185 -13 -254 6 161 -111 46 304 -21 -341 142 -44 -149 257
4154 257 269 134 81 -233 195 191 274 165 0 13 -278 -92 93 124 120 202 -125 128 -219 -344 -116 -30 -154 -60
4178 -60 100 -89 -52 -19 103 -126 81 -400 220 -132 121 472 -230 -82 95 -62 -223 -149 -165 52 203 200
4200 200 -144 -55 -49 70 291 62 74 -263 -154 7 -136 -19 236 492 10 104 254 -256 114 149 -155 -53
4222 -53 -213 -85 162 -146 101 -3 -277 -487 -40 98 -249 46 -131 -71 156 -146 -184 -256 4 -33 213 67
$$ packed form
4059A48r4ml24K68K4k81L29q8l4J81o5O8o5q9rN4j19M97o91J34n7N28m53Q7m9
4084a04Q4O5j27l18L38k81J99K64J45n25P2J24M4q4J86J79k94K08j55p6k52K42
4106f6O9Kj43j8n6J72P4j3l9R6m42M09p8J51J39m00P7K04k92J71M15m12j5O3j83
4131a15nJ91p4M5mM8j0k08J75k28J72k41K60J55k72J57K58l25l20M83j86j05M06
4154B57J2j35n3l14M28mQ3j09j65J3k91J86J85L1mQ2l27K53l47j25K28Q6j24R4
4178f0J60j89L7L3J22k29K07m81O20l52K53L51p02J48J77j57j61P4j6K17J51l
4200B00l44Q9OJ19K21k29J2l37J09J61j43J17K55K56m82R4J50n10L70L5l04J02
4222e3j60J28K47l08K47j04k74k10M47J38l47K95j77O0K27l02l8p2K60l7K46j46
$$ plain form
4244 67 80 249 -267 -15 23 5 -9 -13 -114 -250 122 21 -62 69 70 -166 -2 78 446 262 -176 -76 46 40
4268 40 82 -73 53 -54 -223 -246 -199 191 -54 -74 25 26 -174 -61 -224 -10 88 2 51 -13 -48 -285 95 -76
4292 -76 -216 33 98 12 -50 -161 -204 13 167 224 -54 -112 165 282 278 -120 233 -70 -82 144 -193 41 -415
4315 -415 1 131 255 14 79 -62 -158 -107 156 63 -33 273 37 -89 -216 287 51 108 -88 -115 104 131 58
4338 58 -223 -109 -21 -191 -119 165 26 -294 240 -23 -147 -45 -26 134 -95 -143 -246 300 -337 15 -217 44
4360 44 -2 -79 182 28 209 11 162 210 145 -260 -277 -44 -181 -55 202 259 134 97 -220 10 -45 -168 217
4383 217 -79 151 46 8 -91 -281 -178 39 -186 -255 195 239 -139 42 7 120 66 -212 159 273 -29 -11
4405 -11 396 -13 122 8 1 86 -132 -43 51 74 37 -78 -5 116 -314 146 35 115 5 -48 -184 80 212 98
$$ packed form
4244F7J3J69n16K52L8j8j4mj01j36L72j01q3J31Jk36J64Q0L68j84m38J00J22o
4268D0M2j55J26j07j69k3M7L90k45k0R9Jk00J13j63K14R8q6M9o4l5k37L80j71
4292g6j40K49O5q6o2j11m3K17J54N7k78n8K77J17ml98L53l03j2K26l37K34m56
4315d15M16J30J24k41O5j41r6N1K63r3r6L06k36j26j27N03k36N7j96k7K19K7p3
4338E8k81J14Q8j70P2K84j39l20N34k63j24J02J9J60k29m8j03N46o37L52k32K61
4360D4m6p7K61j54J81j98J51M8o5m05j7K33j37J26K57N7j25l7l17K30n5j23L85
4383B17k96K30j05l8r9j90J03K17k25o9M50M4l78J81l5J13n4k78L71J14l02J8
4405a1M07m09J35j14pQ5k18Q9R4K3l7j15P3J21m30M60j11Q0j10n3j36K64J32j14
$$ plain form
4429 98 121 211 122 71 45 23 -163 163 -293 54 -100 182 -182 -239 89 -140 -80 -232 192 -169 76 76 -161 209
4453 209 133 -91 121 124 164 112 264 -105 136 39 -245 108 238 -165 112 10 -60 185 -67 -202 -261 -74 -105
4476 -105 -75 168 188 42 133 -326 10 -27 -260 -213 21 -294 -38 324 60 108 -26 46 -191 -100 136 -172 187
4499 187 -80 -53 92 -276 140 2 289 -331 285 -163 307 144 -126 -201 -95 70 19 171 -87 -87 -156 -112
4521 -112 -85 23 -234 3 296 231 145 175 51 288 -142 -164 369 -216 -66 162 38 -144 -8 -9 115 -102
4543 -102 267 -138 -33 -75 56 228 48 -156 -85 -212 40 -171 216 242 -55 -4 -250 19 -49 244 -34 -11
4565 -11 154 -31 -9 -114 -97 37 -122 -76 -135 -169 -308 233 -176 -53 266 45 67 -211 152 -219 -158 -78 51
4588 51 -108 -114 32 133 -67 182 319 56 -141 68 -21 174 366 -65 -43 60 86 -264 23 24 -288 -129 -255
$$ packed form
4429I8K3R0q9n1k6k2j86L26m56L47j54K82l64n7L28k29O0j52M24l61K45%k37L70
4453B09p6k24K12LM0n2J52l69K41r7k84L53J30m03K77j02p0K45k52j35n9J87l1
4476a05L0K43K0j46R1m59L36l7k33M7K34l15K56L62k64M8j34P2k37R1K36l08L59
4499A87k67K7J45l68M16j38K87o20O16m48M70j63k70p5J06J65n1J52k58%o9M4
4521a12K7J08k57K37K93o5q6L0j24K37m30k2N33n85J50K28j24j82J36jJ24k17
4543a02L69m05J05m2J31J72j80k04P1j27K52k11L87K6k97N1k46K69o8K93k78K3
4565a1J65j85K2j05J7J34j59M6n9l4j39N41m09J23L19k21K2k78L63l71O1Q0J29
4588E1j59oJ46J01k00K49J37k63j97K09q9J95J92m31K2J03K6l50K87Jl12J59j26
$$ plain form
4611 -255 108 29 -149 -143 -29 93 -103 285 19 34 -175 201 -121 -135 -169 -10 -168 64 -63 -118 -28 -60 -157
4634 -157 -142 288 382 -286 254 162 -313 49 12 105 93 171 166 160 -124 -116 -117 96 32 -74 92 -225 -69 382 -298
4659 -298 11 105 213 14 -48 -65 154 -80 155 25 -106 130 -232 155 -301 396 179 332 70 -212 195
4680 195 -287 -252 -117 -121 114 -111 43 -84 -126 148 -276 71 49 95 -16 -49 92 188 137 -130 -379 -4 -158
4703 -158 112 -213 163 -87 -217 257 -10 340 34 94 -69 36 -3 17 191 125 -127 132 251 75 -296
4724 -296 110 309 29 -78 -116 -136 19 197 389 204 400 88 87 52 306 -58 216 -89 -55 -43 237 -177
4746 -177 -190 -244 73 -20 -200 -121 -247 -186 -238 -132 61 20 -43 66 340 -71 -132 -100 -41 144 39 204 -74 -91
4770 -91 113 303 -53 318 82 -125 -338 101 -155 -71 -316 88 -333 81 -260 38 150 103 83 2 57 -124
$$ packed form
4611b55L63p9j78OJ14J22j96L88k66J5k09L76l22j4l4J59j58K32j27n5R0l2r7
4634a57J5M30R4o68N40r2m75L62l7R3j2P8nok84QjK13o4j06J66l17J56M51o80
4659b98L09R4J08j99o2j7K19k34K35j30j31K36l62L87m56O97k17J53k62k82M07
4680A95m82L5J35mK35k25J54j27m2K74m24L47k2M6j11l3J41R6n1k67k49L75j54
4703a58K70l25L76k50j30M74k67L50l06O0j63J05l9K0J74o6k52K59J19j76l71
4724b96M06J99k80j07l8k0J55J78J92j85J96l12jl5K54l64K74l05L4J2K80m14
4746a77j3n4L17r3j80P9j26O1n2J06J93m1o3J09K74m11o1L2N9J85j05J65k78j7
4770i1K04J90l56L71k36k07k13M39k56Q4k45M04m21M14l41K98J12m7k0q1N5j81
$$ plain form
4792 -124 338 128 -170 175 136 65 115 -57 220 51 121 -35 33 94 -6 -108 26 -228 -118 52 -73 151
4814 151 17 -61 -160 220 -201 -71 -85 134 -134 -249 153 -161 -242 118 155 10 -323 4 -176 -53 173 168
4836 168 13 -169 -156 -165 178 88 -58 128 167 213 -259 -39 -59 -205 25 -23 51 -220 -148 87 -27 237 -198
4859 -198 17 195 468 -208 3 -119 89 -59 -38 125 79 -300 123 -33 -6 -269 48 -140 6 -24 -90 129
4881 129 -282 -75 126 38 -248 -47 -11 23 285 190 -107 30 8 -27 175 -136 132 -316 -81 -45 -82 0 -186
4904 -186 -57 -58 -37 42 17 17 153 133 275 -69 3 341 -193 -185 228 112 -194 -249 -106 -180 28 -9 312 -23 -176
4929 -176 13 150 130 173 71 337 193 212 -6 143 -112 -82 -38 -188 58 -111 -152 -263 219 108 -57 45
4951 45 288 -245 318 390 207 162 158 274 -78 44 152 -91 -31 237 129 212 0 330 -371 -92 145 12
$$ packed form
4792a24M62k10k98L45l9p1N0j72K77j69P0j56O8O1j00j02J34k54J10J70j25K24
4814A51j34p8r9L80m21J30j4K19k68j15M02l14q1L60L7j45l33L27j80J23K26n
4836A68j55j82J3rL43r0j46J86L9M6m72K20k0j46K30m8P4k71P2K35j14K64m35
4859a98K15J78K73o76K11j22K08j48K1J63m6l79M23j56K7k63L17j88J46l0o6K19
4881A29m11K07K01q8k86K01L6L4K62r5k97J37k2l5K02l11K68m48K35L6l7Q2j86
4904a86J29jK1P9k5%J36k0J42l44P2L38n34QM13j16l06n5J43p4K08l7L21l35j53
4929a76J89J37k0M3j02K66j44J9k18J49k55L0M4j50K46j69m1j11M82j11j65J02
4951D5K43n33N63P2j83m5mJ16l52J22J08k43O0K68j08Q3k12L30p01K79K37j33
$$ plain form
4973 12 -16 146 -1 -92 -99 -21 122 -64 51 36 84 270 -62 73 9 -140 118 -119 -187 -167 -25 -42 131 -57
4997 -57 231 -54 -123 -53 359 -75 -43 66 237 389 -142 209 371 188 -113 -3 63 -24 235 -167 -102 106
5019 106 17 287 108 177 -137 -103 -166 185 -50 76 48 276 13 -8 -80 224 -45 -384 177 304 -95 -51 -8
5042 -8 -27 100 -140 -171 -81 116 78 -58 -115 -380 -148 -137 -65 179 -1 56 92 136 30 -90 49 74 133 -37 67
5067 67 162 55 -102 4 -320 120 -65 -1 -121 249 -244 9 -19 -60 -390 -237 -130 -80 -270 -88 36 126
5089 126 -23 -267 147 82 174 228 51 -130 -235 44 183 -347 -346 -127 123 22 -165 -69 17 -275 35 166
5111 166 153 -148 152 51 -163 -240 -374 -91 -95 -40 -27 230 218 21 -111 27 134 79 118 -109 154 31 90
5134 90 70 89 -158 243 -184 310 73 -118 -133 98 -140 -122 123 -296 -20 -56 -216 -103 65 137 -370 289
$$ packed form
4973A2k8J62j47r1pP8J43j86J15j5M8J86l32J35o4j49K58k37o8K0J42j7J73j88
4997e7K88k85o9P0M12m34L2J09J71J52n31L51J62j83l01J10O6q7K59m02O5K08
5019A06q9K70j79O9l14L4o3L51k35J26k8K28k63k1p2L04k69l39N61J27l99M4M3
5042hj9J27k40l1R0J97l8j36n7k65K32J1P2K44j80N7L6M4j06j20J39K5N9j70J04
5067F7R5j07j57J06l24M40j85O4j20L70m93K53k8m1l30J53J07N0j90J82J24R0
5089A26j49k44M14o5R2N4j77j81j05K79J39n30JK19K50j01j87R6Q6k92L10J31
5111A66j3l01L00j01k14p7j34K83mN5J3K57j2j97j32J38J07n5L9k27K63j23N9
5134I0k0J9k47M01m27M94k37j91j5K31k38J8K45m19K76l6j60J13J68P2n07O59
$$ plain form
5156 289 20 -75 14 384 -26 -367 -188 -50 113 227 -113 137 43 -336 162 -80 -124 -337 149 -161 130
5177 130 -65 25 144 -95 -44 -8 -85 -105 209 225 495 194 -407 -246 -22 35 -105 192 -91 -2 -18 41 17 -77
5201 -77 -38 193 -43 -93 52 -26 9 64 -316 -69 34 183 190 103 72 25 -183 19 200 -199 -290 92 -27 -284
5225 -284 -268 -52 -30 149 279 -47 -100 481 -58 -23 -179 206 13 116 230 115 -79 -79 29 76 351 -121
5247 -121 166 78 -336 -73 98 96 -100 -211 -123 -30 62 41 -190 -42 78 62 173 -196 -112 -195 -136 97 208 3
5271 3 231 20 16 -147 -63 -57 -143 49 216 -50 -86 -195 229 135 263 -45 164 -57 152 -13 1 247 -96 302
5295 302 -149 210 98 388 -288 -108 97 78 446 -76 274 -87 -156 337 -371 251 73 -331 -107 -126 165
5316 165 101 206 -179 -110 -72 115 128 -62 -199 -248 94 -169 -150 -187 -344 -216 287 -158 -140 106 281 -18 128
$$ packed form
5156B89k69r5Q9L70m10l41J79J38J63J14l40K50r4l79M98k42m4k13M86l10K91
5177A30j95R0J19k39N1L6p7k0L14J6K70l01o01J61K24N7j40K97k83Q9j6N9k4r4
5201g7L9K31k36n0J45p8L5N5l80K47J03J49Pq7l1m7k08K02J81l99r1L82j19k57
5225b84J6K16K2J79J30l26n3N81n39L5j56L85j93J03J14j15j94%J08M7K75m72
5247a21K87q8m14K63J71kj96j11Q8R3R2k1k31J48J20j6J11l69Q4q3N9K33J11k05
5271CK28k11mj63Q4Oq6J92J67k66l6j09M24r4J28l08K09k21K09j65J4K46l43L98
5295C02m51L59j12K90o76J80K05j9L68n22L50l61o9M93p08O22j78m04K24j9K91
5316A65o4J05l85O9L8J87J3j90j37m9L42k63J9l7j57J28N03m45J8K46J75k99J46
$$ plain form
5339 128 60 43 -60 243 -80 -242 -236 -137 59 -61 -97 -53 -126 17 56 81 16 92 -222 -206 -37 -180 -7 42 -48
5364 -48 17 -60 -122 -61 -421 -174 -40 27 84 91 53 219 174 21 -230 56 75 0 205 24 -151 83 -48 267
5388 267 209 -232 -2 -116 352 -43 -142 -125 170 216 127 -180 29 20 82 141 -271 -73 79 192 -51 32 -17 152
5412 152 -36 -48 -65 95 -165 293 -111 46 101 -316 -259 11 10 -145 -60 -34 20 25 154 -166 -110 -61 290 -159
5436 -159 -124 -73 99 157 -137 -358 -89 144 -10 87 114 -150 -120 342 167 -334 -288 -90 130 -206 -59 56
5458 56 62 -207 -66 -40 -269 11 137 -32 -59 88 -111 -17 23 -316 156 57 -92 70 20 100 50 153 -186 104
5482 104 165 174 -59 -262 -310 80 151 103 1 -70 110 263 31 15 29 241 181 85 19 16 -34 58 91 -171 -12 -42
5508 -42 349 74 45 69 -127 34 -14 46 -178 29 100 -149 292 -1 104 -18 25 -68 15 -35 -173 14 20 125
$$ packed form
5339A28o8j7j03L03l23j62OR9J96j20l6M4p3J43L9K5o5P6l14J6J69j43J73M9r0
5364d8O5p7o2O1l60K47J34O7N7Pl8J66m5j53k51K86J9p5K05j81j75K34j31L15
5388B67n8m41K30j14M68l95r9J7K95M6q9l07K09rO2N9m12J98J52J13k43Q3m9J69
5412A52j88j2j7J60k60M58m04J57N5m17N7K70jj55Q5K6N4NJ29l20N6M9L51m49
5436a59L5N1J72N8k94k21K69K33j54R7K7k64L0M62j75n01M6J98K20l36J47J15
5458E6Ok69J41K6k29K80J26j69k7J47j99R4M0l39M72r9j49J62n0Q0n0J03l39K90
5482A04O1Rk33k03m8L90P1m8j02p1J80J53k32j6J4K12o0r6o6ln0R2L3k62J59l0
5508d2L91k75k9K4j96J61m8O0k24K07P1k49M41k93J05j22M3r3Q3n0j38J87OJ05
$$ plain form
5532 125 70 181 2 -63 -56 -312 43 -27 -246 -230 29 84 -41 0 190 97 -126 -172 -12 -71 113 -29 2 33
5556 33 258 -277 -193 -58 -72 197 -220 167 122 136 -53 -26 -250 4 -206 -57 -38 -19 212 235 -4 36 -15 -178
5580 -178 -32 189 -45 -89 32 137 82 -118 -56 182 167 179 -35 -175 -123 -39 -154 78 -215 -268 -122 -144 -136 -95
5604 -95 48 158 -127 -81 10 -39 260 -22 52 -10 41 -262 -156 -61 42 63 -203 -115 -37 92 43 -281 51 70
5628 70 219 342 81 91 235 -266 223 96 52 -214 -131 149 18 -5 200 61 122 80 -163 72 114 76 -119
5651 -119 -423 344 -163 -211 263 -42 -175 -84 41 68 203 437 -62 161 -301 180 132 78 -125 89 -185 67
5673 67 -64 325 203 -240 259 358 3 -75 -34 268 71 72 132 -274 -1 116 -144 195 -5 -94 58 -102 -107
5696 -107 -189 -434 159 -143 147 -123 -113 140 328 198 219 102 -4 -316 250 -119 375 -46 -167 141 -80
$$ packed form
5532A25n5J11j79o5Pk56L55p0k19J6K59N5j25M1J90r3k23m6J60n9J84j42L1L1
5556C3K25n35Q4J35j4K69m17L87m5J4j89K7k24K54k10J49J9J9K31K3k39M0n1j63
5580a78J46K21k34m4J21J05n5k00O2K38j5J2k14j40N2Q4j15K32k93n3J46k2QM1
5604i5J43J10k85M6R1m9K99k82P4o2N1l03J06R5J03K1k66Q8P8J29m9l24L32J9
5628G0J49J23k61J0J44n01M89j27m4k66Q3K80j31k3K05j39O1m2k43K35M2l8j95
5651a19l04P67n07m8M74l05j33R1J25K7J35K34m99K23m62M81m8n4k03K14k74K52
5673F7j31L89j22m43M99R9l55p8M1L02j97JO0m06K73J17k60L39k00q9J52j60n
5696a07q2k45N93l02K90k70J0K53J88j30K1j17j06l12N66l69M94m21j21L08k21
$$ plain form
5717 -80 -49 -256 -192 -71 -95 135 25 166 395 58 150 116 120 -224 45 127 -58 337 27 12 57 67 -234 51
5741 51 334 314 250 252 99 -191 174 -368 72 -27 169 -257 -211 -121 91 -73 120 175 130 -8 78 16 -199 -28
5765 -28 -263 153 65 154 155 165 240 -216 -316 38 70 112 142 -283 99 146 56 147 337 -356 240 90 52 -282 30
5790 30 -72 27 -146 -65 -17 18 12 -104 191 41 -74 -114 -109 -242 30 -160 -111 238 194 222 -215 -113 -83 133 82
5815 82 295 -168 -289 -2 -114 92 -14 -199 -68 111 100 -67 78 84 58 93 152 -249 -58 -27 250 25 -80
5838 -80 34 46 -148 0 15 -88 -228 118 121 199 -128 -27 -103 -120 -526 147 90 -54 -147 4 77 -38 -147 -184
5862 -184 203 -58 29 150 193 224 125 -321 -83 -82 74 352 20 -99 201 126 -5 -83 127 62 -136 58 231
5885 231 -101 109 121 82 -344 -86 -135 -32 133 -57 44 49 103 -39 180 -26 -168 -10 -2 -102 76 141 -219
$$ packed form
5717h0L1k07O4J21k4K30j10J41K29l37R2l4Ml44K69Q2j85L95l10j5M5J0l01K85
5741E1K83k0o4Kj53k90L65n42M40r9J96m26M6R0K12j64J93N5m5j38Q6o2k15J71
5765b8k35M16q8Q9JJ0P5m56j00L54L2M2L0m25L82M7r0R1J90o93N96j50l8l34L12
5790C0j02R9j73Q1M8L5oj16K95j50j15m0Nj33K72j90M9L49m4K8m37J02L0K16n1
5815H2K13m63j21K87j12K06j06j85J31J79j1j67J45Ok6L5N9m01J91L1K77k25j05
5838h0J14J2j94J48J5j03j40L46LP8l27J01p6j7m06O73n7j44r3J51P3j15j09l7
5862a84L87k61Q7J21M3L1r9m46K38JJ56K78l32j19L00p5j31p8K10o5j98J94J73
5885B31l32K10J2l9m26K58m9J03J65j90J01NN4j42K19k06j42J58Qj00J78O5l60
$$ plain form
5908 -219 42 191 -127 -229 -147 81 165 -33 -150 414 -67 77 -104 280 -163 132 17 172 214 56 -99
5929 -99 126 256 -1 -357 105 31 -159 -106 119 -236 89 54 258 -140 179 -164 30 171 -4 116 213 -25
5951 -25 -104 -3 185 -232 -195 448 -85 171 -224 -64 110 -245 -286 -90 -10 154 151 13 -226 108 -237 82
5973 82 -85 230 9 -55 -142 -252 252 -139 -166 91 191 173 111 323 -200 200 21 15 -63 -184 -13 -20 -114 180
5997 180 84 81 81 -190 -176 -38 -234 307 163 -259 -237 33 45 47 -16 330 -84 -52 187 -148 -147 115 -29 -106 386
6022 386 -281 -171 -90 30 -129 405 142 77 119 -35 -27 -133 -23 327 118 -48 27 45 190 169 351 3 190
6045 190 -205 -73 -27 223 -96 41 -102 60 47 68 298 102 98 -151 188 -53 -34 262 50 -74 404 115
6067 115 48 21 39 -30 157 -170 54 -148 -145 -282 -136 329 -117 60 6 162 -21 32 105 251 223 -141 -302
$$ packed form
5908b19K61J49l18j02Q2K28Q4j98j17N64m81J44j81L84m43K95j15J55M2j58j55
5929i9K25J30k57l56M62p4j90N3K25l55L25l5K04l98L19l43J94J41j75J20R7k38
5951b5p9J01J88m17L7O43n33K56l95J60J74l55m1J96Q0J64lj38k39L34l45L19
5973H2j67L15k21o4q7j10N04l91k7K57J00j8o2K12n23M00j79op8j21J71pr4K94
5997A80r6l%k71J4J38j96N41j44m22K2K70J2Ko3L46m14L2K39l35JK62j44p7M92
6022C86o67J10Q1J20j59N34k63o5M2j54Qj06J10L50k09j66P5J8J45k1J82l48J87
6045A90l95J32M6K50l19J37j43J62j3K1K30j96mk49L39k41J9K96k12j24M78k89
6067A15o7k7J8o9J87l27K24k02Lj37J46M65m46J77n4J56j83N3P3J46k8l64j61
$$ plain form
6090 -302 -50 285 -90 100 181 -272 -110 48 -304 44 51 70 28 51 48 109 184 83 -194 40 -23 -114 30 -82
6114 -82 -244 -280 -199 -50 -352 -8 -405 -5 -359 -124 -80 130 535 -55 253 -14 41 68 162 -228 -146 59 248
6137 248 -151 9 198 -117 -192 -134 71 334 165 -57 30 -391 -209 27 -19 209 76 303 -36 -252 -104
6158 -104 -406 -52 -13 20 61 40 36 34 -215 -3 -42 124 -273 -30 353 -72 -110 -49 -167 141 84 71 114 -82 13
6183 13 -135 133 -16 -131 -198 70 87 199 227 185 55 113 115 26 -21 -144 281 -204 33 88 245 270 -161 -110
6207 -110 10 121 -78 24 77 -200 -61 -194 -17 51 162 351 -335 324 47 -104 -55 -160 -41 258 90
6228 90 -125 230 189 -129 -69 -3 -159 -80 76 -77 134 -167 300 -92 97 -142 90 -113 47 431 -183 121
6250 121 59 96 345 355 123 -138 -258 -137 -137 24 -125 192 -114 -89 27 94 -51 169 74 -62 -200 -346 167
$$ packed form
6090c02K52L35l75J90Q1m53J62J58l52L48PJ9m2K3lO1P5j01k77K34o3r1J44j12
6114h2j62l6Q1J49l02L44l97M00l54K35M4K10M05n90L08k67N5K7R4l90Q2K05J89
6137B48l99J60J89l15p5N8K05K63j69k22Q7m21J82K36m6K28j33K27l39k16J48
6158a04l02L54L9L3M1k1mkk49K12l9J66l97K43L83m25l8O1j18L08n7j3M3j96R5
6183A3j48K68j49j15o7K68J7J12K8m2j30N8Kq9m7j23M25m85K37N5J57K5m31N1
6207a10J20J11j99J02N3k77J39j33J77O8J11J89o86O59k77j51M9j05J19K99j68
6228I0k15L55m1l18O0O6j56P9J56j53K11l01M67l92J89k39K32k03J60L84o14L04
6250A21o2L7K49J0k32k61j20J21%J61j49L17l06K5J16O7j45K20r5j36j38j46N13
$$ plain form
6273 167 -103 244 118 79 80 32 -233 116 41 25 -308 -103 194 -173 -154 340 68 -102 -166 65 204 -112 141
6296 141 245 305 -378 -6 -184 -253 -29 -241 83 190 -172 -281 -529 217 23 120 98 -22 297 -207 -269 172
6318 172 87 139 -206 206 237 326 151 -110 -170 71 -430 -224 54 55 -36 -161 -20 232 -199 225 98 -3 -208
6341 -208 25 -103 -224 -48 -122 54 -150 -252 -179 10 -144 -194 130 47 -123 -108 -76 -446 -24 28 -320 71
6363 71 -134 -23 47 182 47 316 204 79 102 -109 10 229 107 -10 -124 37 3 -6 317 -159 -173 32
6385 32 131 298 -105 107 54 24 71 162 84 20 42 102 100 -47 40 -73 391 -226 8 -83 -41 165 312 -96 128
6410 128 43 -16 -430 204 -47 -378 -98 -62 26 142 30 -22 -60 -122 -217 245 58 122 202 178 -205 -131 268 397
6434 397 307 -51 -55 84 136 51 -111 96 136 202 299 70 118 255 46 -95 -94 54 153 14 49 -323 185 125 351
$$ packed form
6273A67k70L47j26l9Jm8k65L49p5j6l33K05K97l67J9M94k72j70o4K31J39l16K53
6296A41J04O0o83L72j78o9K24k12L24J07l62j09k48P46j94R7k2j20L19n04o2M41
6318A72q5N2l45M12L1Q9j75k61o0K41n01K06K78Jr1j25J41K52m31M24j27j01k05
6341b08K33j28j21J76p4J76k04j02P3J89j54n0L24q3j70J5L2l70M22N2l48L91
6363G1k05J11P0J35j35K69j12j25K3k11J19K19j22j17j14J61l4rL23m76j4K05
6385C2R9J67m03K12n3l0M7R1p8o4K2O0kj47Q7j13M64o17K34r1M2K06J47m08K24
6410A28q5n9m14O34k51l31K80L6Q8J16j12n2l8o2r5M62j87O4Q0k4l83P4L99J29
6434C97r0l58mJ39N2q5j62K07M0O6R7k29M8J37k09j41JJ48R9j39L5l72N08o0K26
$$ [...]
8191C00
##END NTUPLES=NMR FID
##END=
