##TITLE=1H_DE-78_oil5_TFA
 CDCl3
 8 sc, 
 23.12.2024
##JCAMPDX= 6.0         $$ Bruker NMR JCAMP-DX V2.0
##DATA TYPE= NMR FID
##DATA CLASS= NTUPLES
##ORIGIN= UXNMR, Bruker Analytische Messtechnik GmbH
##OWNER= root
$$ XWIN-NMR		Version 3.5
$$ Mon Dec 23 14:02:19 2024 Russian Standard Time (UT+4h)  she@DPX200
##.OBSERVE FREQUENCY= 200.1315
##.OBSERVE NUCLEUS= ^1H
##.DELAY= (6, 6)
##.ACQUISITION MODE= SIMULTANEOUS
##.ACQUISITION SCHEME= undefined
##.AVERAGES= 8
##.DIGITISER RES= 18
##SPECTROMETER/DATA SYSTEM= spect
##.PULSE SEQUENCE= zg30
##.SOLVENT NAME= CDCl3
##.SHIFT REFERENCE= (INTERNAL, CDCl3, 0, 15.7039)
##AUDIT TRAIL= $$ (NUMBER, WHEN, WHO, WHERE, WHAT)
$$ ##TITLE= Audit trail, XWIN-NMR		Version 3.5
$$ ##JCAMPDX= 5.01
$$ ##ORIGIN= Bruker BioSpin GmbH
$$ ##OWNER= she
$$ F:/spectra/data/she/nmr/H-F/1/audita.txt
$$ ##AUDIT TRAIL=  $$ (NUMBER, WHEN, WHO, WHERE, WHAT)
(   1,<2024-12-23 14:01:18.65 +0400>,<she>,<DPX200>,
      <created by zg, POWCHK disabled, PULCHK disabled
       configuration hash MD5:
       00 E9 B6 7A A2 85 ED C7 34 08 36 98 17 FE 4E 26
       data hash MD5: 16K
       E4 E3 7B 3F C0 D5 6F 8A E4 2C EC 39 BA 76 D5 26>)
$$ ##END=
$$ 
$$ hash MD5
$$ 9B EB 8E 9F 53 3E 9D 90 97 8C 1A 8A 29 96 80 09
##$RELAX= 
##$RELAX= 
##$RELAX= 
##$RELAX= 
##$RELAX= 
##$RELAX= 
$$ Bruker specific parameters
$$ --------------------------
##$DU= <F:/spectra>
##$EXPNO= 1
##$NAME= <H-F>
##$PROCNO= 1
##$TYPE= <nmr>
##$USER= <she>
##$AMP= (0..31)
100 100 100 100 100 100 100 100 100 100 100 100 100 100 100 100 100 100 
100 100 100 100 100 100 100 100 100 100 100 100 100 100 
##$AQSEQ= 0
##$AQ_mod= 1
##$AUNM= <au_zg>
##$AUTOPOS= <>
##$BF1= 200.13
##$BF2= 200.13
##$BF3= 200.13
##$BF4= 200.13
##$BF5= 200.13
##$BF6= 200.13
##$BF7= 200.13
##$BF8= 200.13
##$BYTORDA= 1
##$CFDGTYP= 0
##$CFRGTYP= 5
##$CHEMSTR= <none>
##$CNST= (0..31)
1 1 145 1 1 1 1 1 1 1 1 1 1 1 1 1 1 1 1 1 1 1 1 1 1 1 1 1 1 1 1 1 
##$CPDPRG= <>
##$CPDPRG1= <>
##$CPDPRG2= <>
##$CPDPRG3= <>
##$CPDPRG4= <mlev>
##$CPDPRG5= <mlev>
##$CPDPRG6= <mlev>
##$CPDPRG7= <mlev>
##$CPDPRG8= <mlev>
##$CPDPRGB= <>
##$CPDPRGT= <>
##$D= (0..31)
0 1.2 0 0 0 0 0 0 0 0.06 0 0.03 0 0 0 0 0.0002 0 0 0 0 0 0 0 0 0 0 0 0 
0 0 0 
##$DATE= 1734948078
##$DBL= (0..7)
120 120 120 120 120 120 120 120 
##$DBP= (0..7)
150 150 150 150 150 150 150 150 
##$DBP07= 0
##$DBPNAM0= <>
##$DBPNAM1= <>
##$DBPNAM2= <>
##$DBPNAM3= <>
##$DBPNAM4= <>
##$DBPNAM5= <>
##$DBPNAM6= <>
##$DBPNAM7= <>
##$DBPOAL= (0..7)
0.5 0.5 0.5 0.5 0.5 0.5 0.5 0.5 
##$DBPOFFS= (0..7)
0 0 0 0 0 0 0 0 
##$DE= 6
##$DECBNUC= <off>
##$DECIM= 24
##$DECNUC= <off>
##$DECSTAT= 4
##$DIGMOD= 1
##$DIGTYP= 9
##$DL= (0..7)
0 120 120 120 120 120 120 120 
##$DP= (0..7)
150 150 150 150 150 150 150 150 
##$DP07= 0
##$DPNAME0= <>
##$DPNAME1= <>
##$DPNAME2= <>
##$DPNAME3= <>
##$DPNAME4= <>
##$DPNAME5= <>
##$DPNAME6= <>
##$DPNAME7= <>
##$DPOAL= (0..7)
0.5 0.5 0.5 0.5 0.5 0.5 0.5 0.5 
##$DPOFFS= (0..7)
0 0 0 0 0 0 0 0 
##$DQDMODE= 0
##$DR= 18
##$DS= 0
##$DSLIST= <SSSSSSSSSSSSSSS>
$$ [...]
##$SUBNAM2= <"">
##$SUBNAM3= <"">
##$SUBNAM4= <"">
##$SUBNAM5= <"">
##$SUBNAM6= <"">
##$SUBNAM7= <"">
##$SUBNAM8= <"">
##$SUBNAM9= <"">
##$SW= 24.0689530833862
##$SWIBOX= (0..15)
0 0 2 0 0 0 0 0 0 0 0 0 0 0 0 0 
##$SW_h= 4816.95568400771
##$TD= 16384
##$TD0= 1
##$TE= 0
##$TE2= 300
##$TE3= 300
##$TEG= 300
##$TL= (0..7)
0 120 120 120 120 120 120 120 
##$TP= (0..7)
150 150 150 150 150 150 150 150 
##$TP07= 0
##$TPNAME0= <>
##$TPNAME1= <>
##$TPNAME2= <>
##$TPNAME3= <>
##$TPNAME4= <>
##$TPNAME5= <>
##$TPNAME6= <>
##$TPNAME7= <>
##$TPOAL= (0..7)
0.5 0.5 0.5 0.5 0.5 0.5 0.5 0.5 
##$TPOFFS= (0..7)
0 0 0 0 0 0 0 0 
##$TUNHIN= 0
##$TUNHOUT= 0
##$TUNXOUT= 0
##$USERA1= <user>
##$USERA2= <user>
##$USERA3= <user>
##$USERA4= <user>
##$USERA5= <user>
##$V9= 5
##$VALIST= <valist>
##$VCLIST= <CCCCCCCCCCCCCCC>
##$VD= 0
##$VDLIST= <DDDDDDDDDDDDDDD>
##$VPLIST= <PPPPPPPPPPPPPPP>
##$VTLIST= <TTTTTTTTTTTTTTT>
##$WBST= 1024
##$WBSW= 4
##$XGAIN= (0..3)
0 0 0 0 
##$XL= 0
##$YL= 0
##$YMAX_a= 197319
##$YMIN_a= -261317
##$ZGOPTNS= <>
##$ZL1= 120
##$ZL2= 120
##$ZL3= 120
##$ZL4= 120
##$ABSF1= 10
##$ABSF2= 0
##$ABSG= 5
##$ABSL= 3
##$ALPHA= 0
##$AQORDER= 0
##$ASSFAC= 0
##$ASSFACI= 0
##$ASSFACX= 0
##$ASSWID= 0
##$AUNMP= <proc_1d>
##$AZFE= 0.1
##$AZFW= 0.1
##$BCFW= 1
##$BC_mod= 2
##$BYTORDP= 1
##$COROFFS= 0
##$CY= 11.3945322036743
##$DATMOD= 1
##$DC= 2
##$DFILT= <>
##$DTYPP= 0
##$F1P= 15.6554695791079
##$F2P= 12.8336369535428
##$FCOR= 0.5
##$FTSIZE= 0
##$FT_mod= 4
##$GAMMA= 1
##$GB= 0.15
##$INTBC= 1
##$INTSCL= 1
##$ISEN= 128
##$LB= 0.24
##$LEV0= 0
##$LPBIN= 0
##$MAXI= 10000
##$MC2= 0
##$MEAN= 0
##$ME_mod= 0
##$MI= 1.114404
##$NCOEF= 0
##$NC_proc= 0
##$NLEV= 6
##$NOISF1= 3.799351
##$NOISF2= 2.8
##$NSP= 1
##$NTH_PI= 0
##$NZP= 0
##$OFFSET= 15.70392
##$PC= 1
##$PHC0= -26574.11
##$PHC1= 16.38744
##$PH_mod= 1
##$PKNL= yes
##$PPARMOD= 0
##$PSCAL= 0
##$PSIGN= 0
##$REVERSE= no
##$SF= 200.130013532006
##$SI= 16384
##$SIGF1= 3
##$SIGF2= 2
##$SINO= 400
##$SIOLD= 16384
##$SREGLST= <1H.CDCl3>
##$SSB= 0
##$STSI= 0
##$STSR= 0
##$SW_p= 3612.71676300578
##$SYMM= 0
##$S_DEV= 0
##$TDeff= 0
##$TDoff= 0
##$TI= <>
##$TILT= no
##$TM1= 0
##$TM2= 0
##$TOPLEV= 0
##$USERP1= <user>
##$USERP2= <user>
##$USERP3= <user>
##$USERP4= <user>
##$USERP5= <user>
##$WDW= 1
##$XDIM= 8192
##$YMAX_p= 0
##$YMIN_p= 0
$$ End of Bruker specific parameters
$$ ---------------------------------
##NTUPLES= NMR FID
##VAR_NAME=  TIME,          FID/REAL,        FID/IMAG
##SYMBOL=    X,             R,               I
##VAR_TYPE=  INDEPENDENT,   DEPENDENT,       DEPENDENT
##VAR_FORM=  AFFN,          ASDF,            ASDF
##VAR_DIM=   8192,          8192,            8192
##UNITS=     SECONDS,       ARBITRARY UNITS, ARBITRARY UNITS
##FACTOR=    0.0002076,     1,               1
##FIRST=     0,             0,               0
##LAST=      1.7004516,     0,               0
##MIN=       0,             -261317,         0
##MAX=       1.7004516,     197319,          0
$$ Real data points
##PAGE= N=1
##DATA TABLE= (X++(R..R)), XYDATA
0@%%%%%%%%%%qJ6j6J6j6K1k9L2l7M5n3O1p0Q2r5J10j24J40j60J79k00K26k54K84
34A50l16L50l90M34m79N32n90O52p23P98q85R84j093J220j365J533j732J973k274
53a221K653l150L840m862O518r641J7474p1056j00977K56816J00925k83627j75009
66b61317K24525J78565r3840o2093O6519q4047j67481Q2476K40577J3734j77180
77c9562n5437O1805j8410j7102J20553Q8548j29111j72410J4296J23682N6598
88C3450O523K0791l4227j24185o7257J02711J44146j91j03753m7444Q202j6716
100g7950J8801J11388N4663j14886j20748L3420P4877J04J5649O2889l6110j30683
112a08586j0683J32449N0789q0428l0483M0749l4436o3353P1676J18359l7708
$$ plain form
0 0 0 0 0 0 0 0 0 0 0 0 -8 8 -8 8 -8 13 -16 16 -21 24 -29 32 -38 44 -51 59 -65 75 -85 94 -106 120 -134 150
34 150 -166 184 -206 228 -251 281 -309 343 -380 418 -467 517 -576 644 -721 812 -920 1053 -1221
53 -1221 1432 -1718 2122 -2740 3778 -5863 11611 -59445 -160422 96394 197319 -86308 -261317
66 -261317 -36792 141773 47933 -14160 52359 -31688 -199169 -116693 123884 137618 -39562
77 -39562 -94999 -33194 -51604 -68706 51847 140395 11284 -161126 -146830 -23148 33450
88 33450 39973 60764 26537 -97648 -164905 -62194 81952 81761 -21992 -69436 -61234 -77950
100 -77950 -59149 52239 106902 -7984 -128732 -95312 -20435 -20331 -4682 58207 22097 -108586
112 -108586 -119269 13180 63969 -16459 -46942 -6193 -40629 -103982 -32306 86053 48345
123D8345j19200p945N8617m193n396N9478R920r1536m8204O8097O2942j5347j9387
136c809M912l0791m8861K3445Q0405K5801m9898m3383J220R181Q921L2473K6227
149C5843k7730n6572j2471L9940L4911K423p107j0167l1228k5471L0996N7885
161C1252L030m7099k0567J3390k923n25L9984K4818m5176m9203J9931L7599o57
174C854k877J7602j4033m8085j253N3802K5219k7915j7568N517j4123j5194L2162
187b892L8995j7273m1073k049J7367l74N123K2902q05l6233j9219K1456K5077
200A1002K970m803n468j3791j2226J0712K3238N485j4955j1548p02r04N029J8884
214A2923J2132j7413k7516k190K2404J2549n753k048K002j1619j2770J3068K4318
$$ plain form
123 48345 -70855 -78800 -20183 -24376 -29772 29706 39626 -51910 -100114 -32017 30925 15578 -3809
136 -3809 1103 -29688 -78549 -55104 25301 51102 1204 -42179 -40959 -31778 -22857 9616 35843
149 35843 8113 -48459 -60930 -20990 13921 16344 9237 -930 -32158 -57629 -26633 31252
161 31252 34282 -12817 -33384 -19994 -22917 -23442 16542 41360 -3816 -53019 -33088 4511 3854
174 3854 977 18579 4546 -43539 -44792 9010 34229 6314 -11254 -5737 -19860 -35054 -2892
187 -2892 36103 18830 -22243 -24292 -6925 -7299 -2176 20726 19921 -16312 -35531 -14075 11002
200 11002 13972 9169 3701 -10090 -22316 -11604 11634 17119 2164 -9384 -10086 -10990 -5961 12923
214 12923 25055 7642 -19874 -22064 340 12889 7136 5088 7090 -4529 -17299 -4231 20087
227B0087k127k0441n840M253l198M452K2652O455k6919j7570J4299J2663n880
240B886J033J2291p668k2960K256K5785Q559j5150o580L174p708o484J5472J8035
254B2941q154j7756r94P265K93J614Q365k062j4475n778J1591R778j498k108N62
269I584o835j1116M123J7274N432j3510q622O597L880l968K902Q386m247j5024
283e144k110J1746O844l804J056J750j0059q574J0956J3275o441j2837L465P333
297G456o190l036J2647N971j4649j1557P455Q510k592j45O071l080j0881M48J1994
312H422K309r310k261M332k936m613P510R907m800j1139j61N110j119j251N946
327E946K035q904n456Q159P775m630n643L163M84o835j285J0920N031q189n876
$$ plain form
227 20087 17960 -2481 -8321 -4068 -7266 -2814 19838 26293 -626 -18196 -3897 8766 2886
240 2886 3919 16210 8542 -14418 -12162 13623 22182 7032 452 3626 -4082 -10566 4906 22941
254 22941 14787 -2969 -3963 3302 3595 5209 13574 11512 -2963 -8741 2850 12628 11130 9022 9584
269 9584 2749 -8367 -4244 13030 18462 4952 -3670 2927 6807 2839 5741 14127 9880 -5144
283 -5144 -7254 4492 11336 7532 8588 10338 279 -8295 2661 15936 9495 -3342 123 7456
297 7456 1266 -1770 10877 16848 2199 -9358 -1903 6607 4015 3870 9941 6861 -4020 -3572 8422
312 8422 10731 1421 -840 3492 556 -4057 3453 13360 8560 -2579 -2740 2370 1251 0 5946
327 5946 7981 -923 -6379 1780 9555 4925 -718 2445 2929 -3906 -5191 5729 10760 2571 -3305
342c305M616J578m107J368P051l072r823Q36J0316J487o509K39N270m384q112
357f551M478J0030j557q329J150L968k307k141N537K340p185m978N807M815l846
372A231j119N326k70q025j363P824K930n915k362L738k28l235K383N691k752o780
388b926R50N160j764l240M268L972o019n327N202O214l772n068L059K186m551
403a656j720P228K889o519l885M958J868n299j16O162k17p143j124P159J798m809
419d26r35L324j981l862K787M624j896n000K284L201l081k472M005L212m845m581
435e642M030M251k421k790K740J349m071j269M894O36l908j097L634o57l730J856
451b195N123j693n943N81M727m28m250K545L068k916l704K841M309k801l289K416
$$ plain form
342 -3305 1311 2889 -1218 150 7201 4129 -5694 -4858 5458 6945 436 675 5945 1561 -6551
357 -6551 -2073 7957 6400 -1929 -779 3189 882 -1259 4278 6618 -567 -5545 262 5077 1231
372 1231 112 5438 5168 -2857 -4220 3604 6534 619 -1743 1995 1767 -1468 915 6606 3854 -2926
388 -2926 -1976 3184 1420 -1820 2448 6420 401 -4926 276 6490 2718 -2350 709 2895 -1656
403 -1656 -3376 3852 6741 222 -3663 1295 3163 -2136 -2252 3910 3693 -3450 -4574 2585 4383 -426
419 -426 -1361 1963 -18 -3880 -1093 3531 1635 -3365 -1081 2120 -961 -3433 572 3784 -1061 -5642
435 -5642 -1612 2639 218 -2572 168 1517 -2554 -3823 1071 1707 -2201 -3298 336 -321 -4051 -2195
451 -2195 2928 1235 -4708 -4127 600 172 -4078 -1533 1535 -1381 -5085 -2244 2065 -736 -4025 -1609
467a609J924l461k089M599L213m152k886L178K254l189p70K762k8l512L9L780
483E3K2k729N55L116j948l922K015M119j180m549J282L978j129k705J712K320
499A010k406k624K078K473j899j560L255P70l874o34M270N97l757j425L498P92
515E64l244N28L667R8m200j26L136k29l029J259K784j484l139K126L359j704l035
532b669P24K405j578j847K263K175k129j544K078Q28j971n28K164O4l010k27L377
549E75J022l039n82K666m47k865M02K485j89k427J154K227j238j667J216J946
565A239k682j930K590J884k144j710K965J825k695k136K715R37k389j039K468
580a02P04k001O99K415q09k853L21K884r29k289P16K470m36k571P37K695r19k305
$$ plain form
467 -1609 315 -3146 -5235 -636 2577 -1575 -4461 -1283 971 -2218 -2988 -226 -254 -3766 -3727 53
483 53 75 -2654 -2099 1017 -931 -4853 -2838 1281 101 -4448 -3166 812 -317 -3022 -1310 1010
499 1010 -1396 -4020 -1942 531 -1368 -2928 327 1097 -2777 -3411 859 1456 -2301 -3726 -228 564
515 564 -2680 -2152 1515 1613 -2587 -2713 423 194 -2835 -1576 1208 -276 -3415 -1289 2070 366 -2669
532 -2669 -1945 460 -1118 -2965 -702 1473 -656 -2200 -122 706 -1265 -1793 371 435 -2575 -2802 575
549 575 1597 -1442 -2024 642 195 -2670 -2268 217 28 -2399 -1245 982 -256 -1923 -707 1239
565 1239 -1443 -3373 -783 1101 -1043 -2753 212 2037 -658 -2794 -79 858 -1531 -2570 -102
580 -102 602 -1399 -700 1715 906 -1947 -1626 1258 329 -1960 -1244 1226 790 -1781 -1044 1651 732 -1573
598a573Q95J155j086j083K104J512j973j288J909Q74j780j333K240J207k368n44
614a132K132Q37j896m71J611j02k087R29K200o91k441J185K645j140k360M60K530
631B209p98k521J435J997j008j680J243J413k033l73J715O04k151p54K436N75
647B309k568m21K774K05k661k73K099N70j801j1J758n73j355N00J292j293j051
664e00J168J390j445j572K119J002j642j105J220J020j078r39J115J132j536o24
680b75J978qj888n99K119R5j942J69K103j85k004J18J658j93j751O32J372r05
698D94j457Q51J929j672q18J335R23j725q23J221J657j685j085J767K05j553m5
715d81J161J37j320Q5J806j375j209J212J517j070j424Q27J692j185j369J027
$$ plain form
598 -1573 -678 477 -609 -1692 412 1924 -49 -1337 572 1446 -334 -1667 573 1780 -588 -1132
614 -1132 1000 1837 -59 -530 1081 979 -1108 -179 2021 1330 -1111 74 2719 1579 -781 -321 2209
631 2209 1411 -1110 325 2322 1314 -366 877 2290 257 -116 1599 2203 52 -702 1734 2309
647 2309 -259 -680 2094 2299 -362 -635 1464 2034 233 222 1980 1407 52 552 1844 551 -500
664 -500 668 2058 613 -959 1160 2162 520 -585 635 1655 577 -362 753 1885 349 -275
680 -275 1703 1695 -193 -792 1327 1422 -520 -351 1752 1567 -437 -319 1339 1146 -605 27 1399 494
698 494 -963 -112 1817 145 -673 662 1585 -140 -963 258 1915 230 -855 912 1117 -436 -481
715 -481 680 817 -503 -418 1388 13 -1196 16 1533 463 -961 -134 1558 373 -996 31
731C1J393p97j471R52J003j274p13J356M71j122j82R81M16j438n79J984J59j420
749b50q27K057n7j375k35J519L75j682m8J234m16j196Q95J463j033j581R92J446
767A281j028j196J224Q42j246o97J162P56j406n18J898o20j452M65J382j84j585
784i22J10J777l23j515J58J491j07j461M03J130q32r26P57J131j332p85J129J109
802I92j380r63J275P76q17j245J081J036j238p03J010R24j456m40J651k04j201
819i02j91J249L75j779L64J439l03j365J30J637p34j066M61J188o21r03Q68M73
837C20r47p07J145Q67r40n85Q93O35j293n84J170L39j111k66J146L46j149K60
855d61J010n64q70O61P53n99q06M23Q41j78r14j1J018o2n68j4O44k96m36K14O43
$$ plain form
731 31 1424 627 -844 108 1111 -163 -876 480 951 -171 -353 628 1044 -394 -973 1011 1170 -250
749 -250 -1077 980 923 -452 -687 832 1207 -475 -523 711 295 -901 -6 1457 424 -1157 -165 1281
767 1281 253 -943 281 1123 -123 -820 342 1098 -308 -826 1072 452 -1000 -535 847 663 -922
784 -922 -812 965 642 -873 -715 776 669 -792 -389 741 -91 -1017 -260 871 -461 -1246 -117 992
802 992 -388 -1351 -76 700 -117 -1362 -281 755 -483 -1186 -176 748 -708 -1148 503 299 -902
819 -902 -1093 156 531 -1248 -884 555 252 -1113 -983 654 -80 -1146 -685 503 -118 -1021 -153 320
837 320 -627 -1334 -189 678 -262 -847 46 681 -612 -1196 -26 313 -798 -1064 82 428 -721 -461
855 -461 549 -15 -885 -224 529 -70 -876 -453 388 210 -704 -715 303 241 -327 -341 303 7 -429 -215 428
876D28o26o18J161O04j210n66R09L98q23m30R05O42o47n10Q28n54m06J89P24j0
896C88j048M74J019p77o40N98N81n24q82Q91L49n89j07N79N0m63j74L07K21n00
916b47J04L66o3j36l99R56j2j068m3P11j32j50j21K44J90k21N5L13j55o64K78
937a94N52o47k17L01J191r36o32J93O09j82o75M21L90l65n24J063J29p62j05Q77
957D87k07q35L46L79mn61N50L24m62k17L09k70N0R8j81O65p05j23K62J29k91L22
979F5K09j04n20j11P81J78o92j67O06M49q04q2M74L8k32j18M46l70j75m2P67l63
1001B33m17M5N97l78j44L42K34j69p99Q52J15n99L2K62L17o42J34K67K49p05k12
1022c86J140o91k99J31O62j72l48K03j27J61l51J72K63n88p2P57o9l25k33J91
$$ plain form
876 428 -198 -816 345 949 -261 -827 82 480 -343 -773 132 774 127 -383 445 -109 -515 -326 398 388
896 388 -660 -186 833 56 -584 14 595 71 -811 80 429 -160 -267 312 362 -101 -275 32 253 -247
916 -247 -143 223 160 24 -375 581 569 -499 -542 169 37 -113 -234 10 200 -21 34 347 192 -472 -194
937 -194 358 -289 -506 -205 986 50 -582 -389 220 38 -637 -216 174 -191 -715 348 477 -285 -390 487
957 487 280 -555 -209 170 166 -395 155 479 17 -200 109 -161 -111 -13 -194 471 -234 -357 -95 34 -257 65
979 65 274 170 -350 -461 320 498 -194 -361 245 694 -110 -192 282 320 88 -30 416 46 -129 -171 596 233
1001 233 -184 -139 458 80 -64 278 512 343 -456 396 511 -88 -56 206 523 -119 15 282 531 -174 -386
1022 -386 754 63 -236 -105 557 385 37 240 113 274 -77 95 358 -230 -302 455 386 61 -172 19
1042A9J53k15k11K65K21m18J86M9K84m10K86L17k52m51Q0N70j86l25q2K56m0j7
1064G9k67M08J5m29K32J82m18R8R0K89l50j34L74K94o16k93M13J64k38k97O16
1085B12O6l18n8K81l00j23K69J48l57l06J76P68m20k20k83O62m7l42J16L40r4
1106A70l01J95K35m03O9p2L03r7k24J30M03m38r0N54k06j77L6k2R2l5m75N35J44
1129C26m51p4P17o51J68k61O97o44K6K17m5m1j6L77j15j19k85L36K89m42j69N79
1151D19m5l31o2L72j05m94K55KJ53l17l03P14k25j25J21J34l21N9P4j09o1o0J16
1174a39L92o4l96Q4K07k40o9K11n3k3j25J68M7ROol54J68m8L19m4m6k16J36Q8
1199A2k50K16K23j26m18J61K00P6k07r8M4j7r7J60M72o34L14j54J61l82L93k26
$$ plain form
1042 19 172 -43 -254 11 232 -186 0 49 333 -77 209 526 274 -177 -97 473 287 -38 -120 136 96 79
1064 79 -188 220 235 -194 38 220 -198 -100 -10 279 -71 -205 169 463 -153 -446 -33 131 -107 -404 212
1085 212 278 -40 -98 183 -117 -240 29 177 -180 -486 -310 458 38 -182 -465 197 150 -192 -76 264 170
1106 170 -131 64 299 -104 -35 -107 196 99 -125 5 408 -30 -120 434 228 51 87 65 157 122 -353 182 326
1129 326 -125 -199 518 -133 35 -226 471 -173 -147 70 25 -16 -32 345 230 111 -174 162 451 9 -160 419
1151 419 374 43 -19 353 248 -246 9 11 164 -153 -456 258 33 -92 29 163 -158 -99 -25 -134 -195 -255 -139
1174 -139 253 189 -207 -123 84 -156 -225 -14 -67 -90 -215 -47 0 9 15 9 -345 -177 -225 94 50 4 -212 -76 12
1199 12 -238 -22 201 75 -343 -182 18 94 -113 -211 -167 -184 -281 -121 351 -283 31 -123 38 -344 49 -177
1221a77j77M2J6M67q7m16L43J85j78n18N42j70J40k26K55j9K07l22k99J57N39
1242C04o36L56J57k35q8K47J04l55j31N20m70l43M13N83k33l48J93J18r1r9k76
1263c10M13J19l03J99J20l80O3M3L54k05n03O08k50L16m58M76N1k61j0M1J78m99
1285a98L60L29m8p52J76K49L3q8k65K42J78k59J09j04M38j27m6Ok85J56j34K88
1307B58k86k87L00K91l71k6R2MM42n79P8K34j13n6p0M85k14l07J47Q0j41j68J94
1330a3NJ27m5K02m70j01M63j32l44L98p0j2Q3o7J09Jm7M1l11K83r1j19q6L76j82
1355bJ65j04J68j58K0J37l1j60PJ90j99p4J03J03q8q9l10M44l0m98O71P8j28n07
1379b92N70L6l60L01mp4Lj18L30k95j24J9L54k11j58j20P3N59r09K60K99l37J13
$$ plain form
1221 -177 -354 -312 -296 171 84 -332 11 196 18 -500 42 -128 12 -214 41 22 229 -93 -392 -235 304
1242 304 -332 24 181 -54 -142 105 209 -146 -277 243 -227 -570 -157 426 193 -155 38 156 65 -34 -310
1263 -310 103 222 -81 118 238 -142 -79 -36 318 113 -390 218 -32 284 -174 302 353 92 82 123 301 -198
1285 -198 162 491 443 -309 -133 116 149 61 -204 38 216 -43 66 -38 400 273 227 233 -52 104 -30 258
1307 258 -28 -315 -15 276 -95 -121 -29 -25 417 -162 -84 150 37 -19 -89 396 182 -125 22 102 -39 -207 -13
1330 -13 -8 119 74 276 -194 -295 168 36 -308 90 20 8 91 24 133 134 87 128 -183 100 9 -110 -196 180 -2
1355 -2 163 59 227 69 89 226 195 35 42 232 33 -41 62 165 77 -12 -322 122 92 -406 265 343 215 -292
1379 -292 278 314 -46 255 251 177 180 62 392 97 -27 -8 346 135 -23 -143 -70 489 -420 -160 139 -198 -85
1402h5NJ23k7k21K13L22j79j60j37K68p8K80o37K77R8j14K17q4k59N3L86J08j12
1425B57k56O1K44l21l9L25j52k70L03J69l65j03M7o9M06l73K22Q1k85j22J47R6
1447Cl06K67K99j78O4k75J54j7L27n97J93J81l40J49N8k30L25J78j05j0j62N4
1469C2K16j92k29K81k64J49k46J84j87L16k12J65j03Ol34M64P2J0J08j0k68N4
1491A2J22l79L7k6P9J55L99j63l48K19J86k55n7LR0m1j32M42n76r8J04L22o85
1514e90L57R8Q2j1RK27j0J2l39L04j40N0N3o4R1j81p5K70l03m8J30M23m38O2j3
1539d4L94p32L10J10K88k94n3R6r8j78j70L48L05k47Q3k39P5J4j61L77k28L62
1561C18l97R8k61K5J91J34p2l97K47J14k49L47k79J7L21m02J00K2n0J20j55J79
$$ plain form
1402 -85 -80 43 16 -205 8 330 151 -9 -146 122 44 324 -313 -36 62 -52 165 81 -178 -125 261 369 257
1425 257 1 62 306 -15 -54 271 119 -151 152 321 -44 -147 -100 -169 237 -136 86 167 -118 -240 -93 3
1447 3 -303 -36 263 85 149 -126 28 11 338 -259 -66 115 -225 -76 -18 -248 77 255 150 140 -22 32
1469 32 248 56 -173 108 -156 -7 -253 -69 -256 60 -152 13 -90 -84 -418 46 118 128 236 226 -42 12
1491 12 134 -245 -208 -234 -155 0 399 236 -112 107 293 38 -19 -16 74 33 -99 343 -233 -331 -227 95 -590
1514 -590 -233 -135 -53 -64 -55 172 162 174 -165 139 -1 49 102 38 129 -52 -127 143 -160 -208 -78 345 -93 -31 -44
1539 -44 350 -382 -72 38 326 32 -21 75 -23 -201 -371 -23 282 35 118 -121 -46 -32 -193 184 -44 318
1561 318 -79 19 -242 -217 -26 108 36 -361 -114 0 -249 98 -181 -164 157 -245 -145 -123 -173 -53 -208 -29
1583b9m07N57R2l31q7J9J33O4j72m8K20k26q4M16j75J55j83J18m2P9n3l6K44j41
1607H3J95m91L44j74q1k3J10J62m16M85j36J58l04K08j36k70J57N0k13L23kL5
1629F4J2J27n45M16j19L47m01N3M28k88q6m1K3J31j60N0P9k06L60l9j12Lk25K66
1653A37L14n82J74J69j27J43P4l19M6j07K06m52M62K08k11o1p9Q3k05M9Q6J83
1675A91Q2j50l93K94R6q7J6J61k60k8j52J16L28m07L24j98j31J21J36k38L72R6
1697B89k56J36k73J66k24j39K84k29J27m4J52pj17q9J72j9L6j34Q1J62l59J65
1719a20Q3O1p5M2K82m00L33n01M55j76N0J97l50K84j51Q0o0k28N33j40p4j41M5
1742B9Q0o0n05P00l7m35M86j01k47J42j56Q2J01j85K18q1m0N5K5n6p4J53Q0k24
$$ plain form
1583 -29 -436 121 213 -118 -205 -186 -53 11 -161 -209 11 -215 -299 117 -58 97 -86 32 -10 69 16 -20 224 83
1607 83 278 -213 131 -43 -124 -147 -37 125 -291 194 58 216 -88 120 -16 -286 -129 -79 -292 31 29 64
1629 64 76 203 -342 74 -45 302 -99 -46 382 94 8 -33 -10 121 -39 11 90 -116 244 205 93 96 -129 137
1653 137 451 -131 43 212 85 228 302 -17 29 -78 128 -324 138 346 135 74 -5 78 -127 -78 8 191
1675 191 273 123 -270 24 120 33 49 210 -50 -78 -230 -114 214 -193 131 -67 -198 -77 59 -179 193 289
1697 289 33 169 -104 62 -162 -301 -17 -246 -119 -163 -11 -18 -135 -224 -52 -71 -35 -169 -88 74 -285 -120
1719 -120 -37 24 -51 -9 273 -127 206 -295 160 -16 34 231 -119 165 14 94 34 -194 339 199 125 -16 29
1742 29 109 49 -456 244 207 -228 258 157 -90 52 -104 -22 79 -106 112 31 -9 46 71 15 -59 94 174 -50
1766e0j18K93k80L72k93K98j54j03J6k3j6j32Q4Q5nn4K07o8J73n68M89K4j13k85
1790b21K12L42k05l2j8m10M38O2j71P0n7q9J28j94k56O04l13m0J10J61L1j1l12
1813a71J20l07J62J90n1J02j6j43M24k88Q8o9J48j79p2L9j42k0K91j35O0OJ26
1836A63m04K15l8k1K15k96L22o0j74m20N10kj54j45L45j91Q0j05J90K34l76n7
1858a69K72q7k47p6M66q2K03j05q6J08j70M23k17n7k01j9P3j65L74j75k54r6M03
1881A16J45k69L02l48k5j40M15k26K19l70M22k88J39r8k14J34P5k19k08M99K20
1902B81j71n8o7L82l43J63r5R4k09j51J12J76k30J45j28J2J19m11M70j67M78k81
1924A21n21M60k0j73J09j47K16j4q4K65l1k44j73p3M40M8R5m19J08r2J27j4O5
$$ plain form
1766 -50 -168 125 -155 217 -76 222 68 -35 -19 -42 -58 -190 -106 -21 -26 -80 127 59 232 -336 153 177 64 -221
1790 -221 -9 333 128 96 78 -332 106 168 -3 67 10 -79 49 -145 -401 203 -110 -150 -40 121 152 141 -171
1813 -171 -51 -358 -196 -6 -57 45 29 -114 310 22 110 41 189 10 -62 -23 -165 -185 106 -29 31 37 163
1836 163 -241 -26 -64 -85 130 -166 156 96 -78 -498 12 10 -144 -289 56 -135 -55 -160 30 264 -112 -169
1858 -169 103 16 -231 -307 159 77 280 175 89 197 27 450 233 176 -25 -44 29 -136 238 63 -191 -287 116
1881 116 261 -8 294 -54 -79 -219 196 -30 189 -181 241 -47 92 -6 -220 -86 -11 -230 -438 61 281
1902 281 110 52 -15 367 24 187 92 186 -23 -174 -62 114 -116 29 -99 -87 32 -379 91 -76 402 121
1924 121 -400 60 40 -133 -24 -171 45 31 -53 212 181 -63 -236 -309 131 179 274 -145 -37 -129 -2 -16 49
1947D9k62M06j98L0n7l%K4J94J8k61L84n53j28K79J9J90l19K44O1j50j19j3L05
1971A40n17N04k41j10M3K6K86j98j05J54rp2J3OR8j72o5J68K08k42P3M9k74M66
1995B29l75j08l00O87j17j3q9k80M93k46R3j32j80K70M4l5J77j84M2o2L90l07
2017cl3J24Q6l23M6J61m51N20m12M29K64l04r2lJ15k07J66j87J61K71o7l94m4
2040a77K41P0r6m26K45L4K94m0r5J14l55K22q0l7k22M37k77n9L66r9l27R3M25
2063B51j50j89L97k06p4j07K37l7n2j59n4K20J16p4N4l54M54k75J3j15J46J65
2085B07m2m7l78M92j47J74l54k90K64O9J48j80J24j3p7J50k43M85k24K5k50j38
2107b45M96l10J72ql28L07l05M32j02k08l2J48o2R0K02j54o6l3k79L51J45k94
$$ plain form
1947 49 -213 193 -5 25 -32 -35 -35 -11 183 201 -60 324 -229 -357 -78 -59 131 -188 56 117 -33 -152 -165 140
1971 140 -377 127 -114 -224 -181 -155 131 -67 -172 -18 -27 -99 -86 -80 18 -154 -219 -51 157 -85 -12 37 -237 229
1995 229 -146 -254 -554 133 16 3 -86 -366 127 -119 -26 -158 -338 -68 -24 -59 118 -66 -24 -86 304 -3
2017 -3 -36 88 174 -149 -103 58 -393 127 -285 144 408 104 12 9 124 -83 83 -104 57 328 261 -133 -177
2040 -177 64 134 38 -388 -143 -109 185 145 50 164 -191 31 -49 -86 -308 129 -148 -207 159 60 -267 -174 251
2063 251 101 -88 309 103 29 -78 159 122 70 -89 -143 77 193 119 173 -181 273 -2 11 -104 42 207
2085 207 165 118 -260 232 85 259 -95 -385 -121 -52 96 -84 40 27 -50 100 -143 342 118 143 -107 -245
2107 -245 251 -59 113 105 -223 84 -221 211 109 -99 -131 17 -45 45 247 93 27 -6 -285 66 211 -83
2129h3j3J45N4k55J1J43q7m2n3J19N6q7j24L19j38N2p1K36j3J47m43J73j74M5
2153h3J38l72O40r6m07K25K03l85J15Q7J39j82Q1M1k65k4K23m1m3NK85j77rj32
2177c4K65l26J67j45q4N42k36k82J35O7j32j30L16j84n7j30K30J31j67N2K32n1
2199A79j96K12j71q9M4J96k08R0P2j68K15n7j87Q1J00J87l84K50k42L67l98k67
2221c74L88K33L3k06k6K22j83K85j17k20M7J58k65K80r1K2k68KL46o44L21J9J05
2244F7Q4o1k9j91J88L3l84J64J05n3j3q3l79K90M78k04M4j65J37L84m66J47q9
2267DK2P4J2J18L0k18K41m01J98M7k17J3N1lN6R4k1J80o90M58j17J45J80l34p2
2292a50L13j69j40K09j64K43o9k09K19k62K93j92J25J3j62j1J91M7j73J09k95
$$ plain form
2129 -83 -96 49 103 -152 -141 2 -85 -127 -180 -61 -5 -92 -216 103 -35 17 -54 182 169 316 -127 46 -128 -83
2153 -83 55 -317 323 227 -180 45 248 -137 -22 65 204 22 103 144 -121 -145 78 37 -6 -1 284 107 98 -34
2177 -34 231 -95 72 -73 -157 385 149 -133 2 69 -63 -193 123 -61 -118 -248 -18 113 -54 -2 230 179
2199 179 -17 195 24 -65 -21 175 -33 57 129 -39 176 119 -68 13 113 300 -84 166 -76 291 -107 -374
2221 -374 14 247 280 74 48 270 87 372 255 35 82 240 -25 255 164 186 -82 -80 266 -378 -57 -38 67
2244 67 151 90 61 -130 58 91 -293 -129 -24 -77 -90 -173 -552 -262 216 12 56 -109 28 412 -54 93 4
2267 4 26 100 112 230 260 42 283 -118 80 127 -90 -77 -26 -29 27 121 100 280 -410 48 -69 76 256 -78 -150
2292 -150 163 -6 -146 63 -101 142 73 -136 83 -179 114 -78 47 60 -102 -113 78 125 -48 61 -234
2313b34M11m44J47J52j71K40j10k1J72n04m9M13k04R8J49q2N9k17L99m94J29K68
2335A07M4k94Q3L5J02r3k18N34l14j20J99l74KP06p82P73j56j24j93L61k77M1
2357D2lq7j3K8o5n8L20k35J15k96J50K62m14P3J19P7k63M09j32j20J24k95J78
2380h4J14J26k16L55m98m7M42k42j59K14k47K31j06J97P7k97l4R0j6j11K84j33
2402f0J3j37M03j05j66O7K3j24N9P7K24m9rq1j62J34k55k2J59j7J36k10P8L5J3
2427B4n7j8r6L2K20m2q8L7nn0J38n6k62K64j79M67m5j19l27J70O0m51L26J35k2
2452E6j64O2J6k05J58K2j64J39J31m1l4j01J17N0Q0K30m08l24J55po4j33N48j44
2476b5K56m5m45K61j78j1L21M3J56l31Q9l47JL96r9jl16L95k52J09K04l51J59
$$ plain form
2313 -234 177 -267 -120 32 -139 101 -9 -30 142 -362 -411 2 -202 -104 45 -37 22 -195 204 -290 -161 107
2335 107 151 -143 -60 -25 77 -16 -234 300 -14 -134 65 -309 -307 399 -383 390 234 110 -83 278 1 42
2357 42 39 -48 -61 -33 -98 -156 164 -71 44 -252 -102 160 -254 -181 -62 15 -248 161 29 -91 33 -262 -84
2380 -84 30 156 -60 295 -203 -250 192 -50 -209 5 -242 -11 -117 80 157 -140 -174 -84 -100 -211 73 -60
2402 -60 -47 -184 219 114 -52 15 38 -86 -27 50 274 225 216 135 -27 107 -148 -170 -11 -28 108 -102 -24 11 24
2427 24 -33 -51 -147 -115 105 63 -25 12 7 -43 95 39 -223 41 -138 329 284 165 -162 8 68 -383 -57 78 56
2452 56 -108 -46 -30 -235 -77 -55 -219 -80 51 10 -24 -125 -8 42 122 352 -56 -380 -225 -232 -296 -429 119 -25
2476 -25 231 186 -259 2 -176 -187 134 177 333 2 91 -256 -255 141 42 41 -275 120 -132 -23 181 -170 -11
2499a1l58M06J47k46j58J56J53j51k0L62l89K05p7J05j93L18j92k90L72j64N2
2520B7r5k7K38m18K64J1J9n0k76J28K03m6j86R3J19K19k4l68K07K39l3j79l15
2543b50K43k5L25l91M5J02Q5j25J50m32J13K19l74K73K5Q1k62K34M0l1J38q0l17
2566b14J97K19j74P9k29J52j92J50j96M86l91K8K18k52j3L21l03J12M0N5k48O4
2588i1r2o3L30J66k08pN1Rj31J73n2lk40R4Q3P9j61J48r5j70L4L56r4j45K75j60
2614H6l32J88n0l48O04j6j37Q9j96J74j97L00j47j50K50r9l2J66j22J29k8j37
2636el6j08K15R1k97j50K54O2K43l0m01k42N50j75J51K8l61L66j46o5o2J02q3
2659i9L20l28J99k80L13l75L52J44n95K44K23l11N46l00J86l00J06Jk6J65m3k05
$$ plain form
2499 -11 -369 37 184 -62 -220 -64 89 -62 -82 280 -109 96 19 124 -69 249 57 -233 139 -25 27
2520 27 -68 -95 143 -275 -11 0 19 -31 -307 -179 24 -22 -208 -115 4 223 199 -169 38 277 244 65 -250
2543 -250 -7 -32 293 -98 -53 49 134 9 159 -273 -160 59 -315 -42 -17 64 -198 36 76 45 183 103 -214
2566 -214 -17 202 28 107 -122 30 -162 -12 -208 278 -113 -85 133 -119 -132 189 -114 -2 38 93 -155 -91
2588 -91 -183 -246 84 250 42 35 86 95 -36 137 85 82 -158 -64 19 98 -63 85 -10 -180 -146 210 116 -29 246 86
2614 86 -246 -58 -108 -456 148 132 -5 84 -112 62 -135 165 18 -132 118 19 -13 153 31 160 132 -5
2636 -5 -41 -149 66 157 -140 -290 -36 26 269 239 -162 -404 146 -29 122 150 -211 155 9 -56 -118 -16 -99
2659 -99 221 -107 92 -188 125 -250 102 246 -349 -105 118 -193 353 53 239 -61 45 46 20 185 142 -63
2681f3j10nL41jo5K37m44L4L37k65j37K39k15L05k52kk92K18K60N4K05k38r1L4
2705H4l16K21k0K63m87J7OP2L09k14n5J30m9K30j85j0O3j27J21n7Q3J1r3Q9j72
2730h6L7j8J01k5k27L01J09k62m8J80l1Q5j51n7Q1K62l40p5Q2O3k21J76J90P5
2754B01k00Q2M23l91k85R7J47r0j38K38j46L16k05J34j8l51L77L4l46R3k9J81
2776A24j59l2M5Joq6K79l39M6K53N6j1n02K59%p2M5R5L9j98L7r6J90K16m90R3
2802b13N01j29j36j00l36M71q6K33j25R2k50j51K12O6K6K4o2k07l5K40N6k7pj76
2826a19k30P5P7J67L8o1m2K69j97j3J76J6l01j04K49M9o1K44j46J8J73l25N7M6
2850E5j07P1j54k03O00j25j31O2P6j35J90j57j17K84k60L1Q0l5k22J71K17j02
$$ plain form
2681 -63 -173 -178 163 162 97 334 -110 -76 261 -4 -141 98 -117 188 -64 -66 -358 -140 120 174 379 141 50 84
2705 84 -232 -11 -31 232 -255 -238 -232 -160 149 -65 -120 10 -39 191 6 -4 59 -68 53 -4 79 90 -3 86 -86
2730 -86 -49 -67 34 9 -218 83 192 -70 -118 62 31 116 -35 -92 -11 251 -89 -164 -82 -19 -240 -64 126 201
2754 201 1 83 506 115 -170 -73 74 -16 -154 84 -62 254 49 183 165 -186 191 225 -121 -28 -57 124
2776 124 -35 -67 -22 -21 -27 -113 166 -173 -127 126 182 171 -331 -72 -72 -144 -99 -4 35 -163 -126 -222 -32 184 -306 -213
2802 -213 288 159 23 -77 -413 58 -28 205 80 172 -78 -229 -17 49 75 99 37 -170 -205 35 91 64 57 -119
2826 -119 -349 -274 -197 -30 8 -53 -95 174 -23 -36 140 156 -145 -249 0 49 -12 232 86 104 277 -48 9 55
2850 55 -52 19 -135 -338 262 137 6 68 144 9 199 42 -75 209 -51 -20 60 25 -197 -26 191 89
2872H9p7J31k82K33K0r5M77o13n1L30Q6n34L24j5Q7j98j73J78m6L67j93m7K8l46
2896c20L20p9j50J84l71J57O41m32j33l68L30Q3n7M28q7m84N4k4L40pj40o1J3
2919a63K70K00m50L24K8o7k68j33M10j70N9J84j35k32j23L56J00k22L7k13m0K94
2941D6L3k09L07l5J6p4P1n20J92O8Q4k87J79K27l18M6M00k56K7O2j85N0J50J04
2965A78k03J14P3n63M76K39m99j28O21l16q8J76l16L36j02J55l10J93R4M3q5k07
2987a19J14N4r3P3j43J15K37k55k50R7M12l51J92Q5r5P0J01j07l70J80K95l60
3009a18O3K3J35J33k70j44L67n8M5K4j88k52L16k00r1K92K91l46O5K04k76k45
3031b30L90k37j75L38M1j24J9J55l09K86k1j11J77M2k32j97R1k0L44j26n8j65
$$ plain form
2872 89 12 143 -139 94 114 19 496 -117 -168 162 248 -286 38 23 110 -88 -261 -83 -129 238 45 -2 26 -320
2896 -320 0 -79 -229 -45 -416 -259 382 -50 -183 -551 -221 -138 -195 233 146 -338 -284 -308 32 25 -115 -176 -163
2919 -163 107 307 -143 181 209 142 -126 -259 151 -19 40 224 89 -143 -266 90 190 -32 5 -208 -248 46
2941 46 79 -130 177 142 158 84 155 -365 -173 -105 -21 -308 -129 98 -220 -174 226 -30 -3 59 -126 -76 74 178
2965 178 -25 89 162 -401 75 314 -185 -313 308 -8 -96 80 -236 100 -2 153 -157 36 130 173 88 -119
2987 -119 -5 49 -44 29 -114 1 238 -17 -267 -170 242 -109 83 168 73 143 244 137 -233 -53 242 -118
3009 -118 -55 -32 103 236 -34 -178 189 131 176 200 12 -240 76 -124 -215 77 368 22 87 291 15 -230
3031 -230 160 -77 -252 86 127 3 22 177 -132 154 133 22 199 241 9 -188 -97 -117 227 101 43 -122
3053a22K92j65K72l41O1m2m3J26n8M3j65N7J41J69k60K28j66k27l1M34l4r4Q2
3076A57k37J65r8m20M36m2JJ2k82O22m24K81O2m13J25N4J41p0k14L83l16o0m39
3099e76O98rj71N4j85J00L75n15J86K61m11J06LL30m05J18J8j73J99j44J54j44
3121a31M0k44N23p9N3R8l84J22N1L4J22o18M25q4M81q66M62J1J72j39n4J62q8
3144F9R3j24Q7j58j54K99l0r5j23k1j2J94J78j61j09L4l09K04J41l25J38L41j67
3167a0rj07j07J4K22O9n7o3j42M21q1j54K11k80J67k2J39j84L6r0J19O6j62J10
3191A06Q1l21J90Q6j72l8L17k73K39l74Q6j89J88R2k21j2J52J64O2k27K93j79
3213E0j37j6K16Q7j57q4RL8k14p1M27k04M2K40l5k71O2j92M77k00L05k65m3j11
$$ plain form
3053 -122 170 5 277 -64 -3 -45 -88 38 -20 23 -142 -85 56 225 -35 193 27 -200 -231 203 169 75 157
3076 157 -80 85 -13 -433 3 -39 -38 -26 -308 314 -110 171 233 -180 -55 -1 140 70 -144 239 -77 -137 -576
3099 -576 122 113 -58 -4 -189 -89 286 -229 -43 218 -193 -87 -84 246 -159 -41 -23 -196 3 -141 13 -131
3121 -131 -91 -335 188 109 162 260 -124 -2 49 83 205 -413 12 -72 409 -457 5 16 188 49 -5 157 69
3144 69 162 38 125 -33 -187 112 82 -13 -136 -157 -169 25 203 42 -67 -33 -342 -138 3 -322 -184 157 -10
3167 -10 -19 -126 -233 -219 3 72 15 -48 -190 231 150 -4 207 -73 94 72 211 27 63 -27 92 158 -4 106
3191 106 187 -134 56 142 -30 -68 249 -24 215 -159 -73 -262 -74 18 -203 -215 -63 101 163 -64 229 50
3213 50 -87 -103 113 200 43 -41 -32 6 -208 -279 148 -56 -14 226 191 -80 -18 -210 267 67 372 107 64 -47
3237d7J12l6K81j52q6J56n53O38l17Q5K05l16j61J76K25k39j73M5O30m98o3K86
3259A98J9j83j72L38j22o3K39l89R1K11l62J56J22k48M00j87K6j14r4O8L89k11
3281A12m3k73l4J24J11M4j1K8J71m67L27j60J96j03L1n6k51J70r0M5l8J26j93
3304b34L17N5j8j55k08M4K04j46J13J5K73j59J12m3ON5k80k26J47K87m00L35J82
3327B76k25k33Q7J30J3j86j02K45J65l58J28L70l13o3K4k19K02j23N4K56M3o6
3349A05j24l17J63L08k28J48K48j82o8K0k29pkJ11L59n16N05k07J03j04l9j60
3371a13K73l6n1K25k48n6j72L04Kq6j40RK69J69m31K17j95J48J2M1k34L9O7OO9
3396H8k06K55O1k75J70k74P3K43j29qJ11j15J2j29Q8R3m02L23O3l4k03M00j69
$$ plain form
3237 -47 65 29 310 158 72 228 -325 313 -4 81 286 -30 -191 -15 210 -29 -202 -157 473 -25 -88 198
3259 198 217 34 -138 200 78 15 254 -135 -44 167 -195 -39 83 -165 235 48 74 -40 -134 -66 323 112
3281 112 69 -204 -238 -114 -3 41 30 58 229 -238 89 -71 125 22 53 -3 -254 -84 -174 -129 -167 -41 -234
3304 -234 83 138 120 -35 -243 -199 5 -141 -28 -13 260 101 213 170 176 231 -49 -275 -128 159 -241 94 276
3327 276 51 -182 -95 35 48 -138 -240 5 170 -188 -60 310 -3 -66 -42 -261 -59 -182 -128 128 171 105
3349 105 -19 -336 -173 135 -93 55 303 121 53 73 -156 -163 -165 -54 305 -211 294 87 190 86 47 -113
3371 -113 160 124 73 298 50 -6 -178 126 128 42 -98 -89 180 349 -82 135 -60 88 100 141 -93 -54 13 19 88
3396 88 -118 137 198 -77 93 -181 -108 135 6 -2 109 -6 6 -123 -35 58 -344 -21 42 8 -195 205 36
3419C6L1J1K1NJ17l34j5PJ67l6k34K87Q9J57m67R2J98l16M52q9k83J57k11R5o0
3444a23K51j56L7K6m1k67N06m63l8L42q3K09k17k36K1L79k07L96l74Rl12N35k77
3467h3R5k0L1p6L20j49m48K14P4o0Q2l06K50J26J01j19k11J72r1L4L38n91L09
3490hL09k37P9n3m3J25M8k26M1j35J36L3K98l82p3J13J86K4m26J12P5k00J05J95
3514I6o8Q3j7Q9p1j64K19k77M56l08L8J46l17l5P4K5J73m6j99L33j29l32L67k90
3538a54L78m9j08P8k44l5J81M0k94J98Km0L01m23J71J60k87K9J70Q8k84K86l84
3561b20N07j41k76L4Pj32J30K4k75L72LJ53q7n7j99K54K6J79m10J17p0O7J67k57
3585h4Q2j74K0j59N20m25L77m32K9N96j37j1P9l89L97p7k58J81m6o2l3N2J11j79
$$ plain form
3419 36 67 78 99 104 221 -113 -128 -121 46 10 -224 63 152 309 -158 -66 132 -184 268 179 -104 53 -158 -63 -123
3444 -123 128 -28 9 35 -6 -273 233 -230 -268 74 -9 200 -17 -253 -232 147 -60 336 -38 -29 -341 194 -83
3467 -83 12 -8 23 -53 267 118 -330 -116 -42 -102 -20 -326 -76 50 151 32 -179 -7 -98 -64 274 -317 -8
3490 -8 301 64 143 90 47 172 220 -6 35 -100 36 69 367 -15 -88 25 211 235 -191 -79 -4 -204 -99 96
3514 96 28 111 94 183 112 -52 167 -110 346 38 76 222 -95 -130 -56 -31 142 96 -103 230 101 -231 136 -154
3538 -154 224 175 67 145 -99 -134 47 87 -207 -9 -7 -47 254 -169 2 162 -125 -96 74 162 -122 164 -220
3561 -220 287 146 -130 -96 -89 -221 -91 -67 -342 30 33 186 99 42 -157 97 123 302 -108 9 -61 6 173 -84
3585 -84 -2 -176 -156 -315 205 -220 157 -275 -246 350 213 202 281 -108 289 212 -46 135 89 27 -6 46 157 -22
3609b2k77K94J0J38l33P0L22k37j63L19k16mJ5N1l24L20k16P0j39L12kOP4o0k70
3634b62L41K88n09K9k83N24p7j04n0L2o4M84k8j54j76NM7p5M7m4j64L14j49N7
3658B9k1j20J60K03j6j31j20J51j43J32k73J57k88k9J79L73m43K15K5n5r4P8J34
3681A03j03j92R2L72j53O5l42J50Pr5J27k0P4k79j19L82j84J38k35K04j05J46
3703C3J5J13j74pJp4j3O1P7k88J11Q4j06J88j09M83m13kK16j25K59m61L58l15
3727h8n8J10J09r9j75J52J9J24j37O4L5r0K5J4l26O16j86j30l9J78Q8k13j21J00
3751b8l6r7J48j84J59j49L85N0j2m02J24J44K2j2l58N45j95j70J27M6Q4m05J41
3774g3K01k31J89L8k06j90L80j96L2M7L2j44L73l91m5J90l29K73J0K88j80l21
$$ plain form
3609 -22 -299 -5 5 143 -190 -120 202 -35 -198 121 -95 -99 -84 -33 -357 -37 -253 -183 -322 -10 -12 -6 68 8 -262
3634 -262 79 367 -142 -113 -396 128 51 -53 -103 -71 -135 349 321 167 -9 -4 43 -32 15 -29 -193 121 -28 29
3658 29 8 -112 48 251 235 104 -16 135 -8 124 -149 8 -280 -309 -130 243 -200 15 40 -15 -109 -31 103
3681 103 0 -192 -100 272 119 184 -158 -8 -1 -96 31 11 85 -194 -313 69 -115 23 -212 -8 -113 33
3703 33 48 161 -13 -20 -19 -93 -106 -45 32 -256 -145 -61 -167 21 -88 395 -18 -20 196 71 330 -131 227 -88
3727 -88 -146 -36 73 -26 -201 -49 -30 94 -43 21 56 -34 -9 5 -321 295 109 -21 -60 118 206 -7 -128 -28
3751 -28 -64 -161 -13 -197 -38 -187 198 248 236 -166 -42 102 124 112 -246 299 104 -66 61 107 191 -214 -73
3774 -73 128 -103 86 124 -82 -272 108 -88 -56 -9 23 -121 252 -139 -184 6 -323 -50 -40 248 68 -253
3796b53j00J80L98k4k4l60M5J19L4K24l91J51J71m06M61j01R6j0k08lm2J45m07
3819c05M11k07P6L01l43J73p9L5k17J70J18j75m4K37p3O9j26o5r0J31Q7J23K5
3842B32r5j57K07k47L64o49L44j48M3O9J33r2j34L87n24M29M6r7j12M96n04K08
3864A99k33Q9k18J5M2K91o00M36J78j59j00J40n0l27M14J38m22Lp6J22J70n6J15
3887A11j47k49L02P2qj56p7J87n1J93j93P3p0j3l3M13n37K09k83R3OR3k10J49
3911a26m9J79J13K61m96O8j4k39L07k61L43m1n43M87L11m73R4L24l53Q6J11K8
3933A17k82K92q3j32l3K68Q7l10K33k56P4j05N2p6J25M1J75l61K5M15k84j47M74
3956C09k27j60K06J94j57k80Q6J21j2Kl09N75m54R7Rk00r2M77k17N03o23J9K12
$$ plain form
3796 -253 -353 -173 225 201 177 -183 -138 -19 15 239 -152 -1 170 -236 225 124 220 210 2 -1 -43 102 -305
3819 -305 106 -101 -25 276 -67 106 27 62 -155 15 133 -42 -86 151 78 147 21 -44 -134 -3 84 207 232
3842 232 137 -20 187 -60 304 -345 -1 -149 -106 -37 96 4 -130 257 -267 162 208 111 -1 495 -9 199
3864 199 -34 55 -163 -148 -106 185 -415 21 199 40 -60 80 30 -297 117 255 -167 -164 -240 -118 52 -4 111
3887 111 -36 -285 17 89 81 -75 -152 35 -16 177 -16 57 -13 -26 -59 354 -183 26 -257 -164 -158 -65 -275 -126
3911 -126 -175 4 117 378 -118 -50 -64 -303 4 -257 86 45 -498 -11 300 -173 -79 245 -108 -22 89 117
3933 117 -165 127 44 -88 -121 147 234 -76 157 -99 -25 -130 -78 -154 -29 12 187 -174 -149 266 -18 -165 309
3956 309 82 -78 128 322 165 -115 -29 92 80 82 -227 348 -106 -9 0 -200 -292 185 -32 471 -152 -133 79
3979G9k83Q2K63l08k12P10n65L51k26N1O4l99M19J98O6m76J16K96n74L94k92L72
4001A26r5R7k15L15k29o3K67l61J63p8J24m34M24p0L31n27J73j14lJ28R5P4r9
4024B9l8pP3j8OK05k81O0L52m63L0q6Q9p7j2n6J38j37J73r4J83j42J3q7L7J77
4050F7k26M33j59n80P00l14k97L76N1j4l50q5M94k03J82R0k70J5j09K45K36m36
4072a54L00n6j36j49q6O85n35M0K86j19L7j12M1R2j78q2N8k2J89j50j69M49o08
4095c79K19J23K39l4l64m0L05l91N52l20K79L0j71j88m6K97L1l27J00L11r3j39
4117fo0M21k19j10n8J26j82K55pj20j90J02l1J9K75k96j70L20l4J55m24K12L02
4140B80j64Q2j22j83j14O0J96R3j6m50N92J20m98K50m60N32O4l1m64K01QL58j26
$$ plain form
3979 79 -204 -122 141 -167 -379 331 -234 117 -109 -58 6 -393 26 224 290 -186 -70 226 -348 46 -246 126
4001 126 31 128 -87 228 -1 -64 203 -158 5 -73 51 -383 41 -29 302 -225 -52 -166 -169 -41 54 128 29
4024 29 -9 -16 57 39 45 250 -31 29 381 -82 -52 -138 -49 -126 -138 -194 -56 -193 -20 -114 69 -73 -60 -147 -110 67
4050 67 -159 274 115 -465 235 -79 -376 0 51 37 -313 -398 96 -107 75 165 -105 -90 -199 46 282 -154
4072 -154 146 90 -46 -195 -281 404 -131 -91 195 76 113 1 42 134 -44 -126 -68 -90 99 -51 -220 229 -379
4095 -379 -160 -37 202 168 -196 -236 69 -322 230 -90 189 219 48 -140 -186 111 142 -185 -85 226 133 -6
4117 -6 -66 355 136 26 -32 94 -88 167 160 40 -150 -48 -79 -60 215 -81 -251 69 35 190 -234 -22 280
4140 280 116 198 76 -107 -221 -161 35 128 112 -338 254 374 -124 126 -334 198 262 231 -233 -32 -24 334 208
4163B08j79q1P8K92j66j62j10j42M98m12J15J42N2j62m4J18j73K95j57k13j4L64
4185A47o0k80O8J95m1K59j03J24m23J35k8O7L17l52l64M02k69K11m6L04m41O9
4207a09J66j49LQ3j82J58k74L98k87J72J10k57J10n3Q6o8j22J94k26K41j96L70
4229A68n3k66K99j7j29o1m5J00J57j40o5J42m04O12j67k25J49l05N96k81k3j9
4251B3j95J64j10K27k58o9k46P05k42J97l51M36m63J59R8j41j0j3J24J59k32l
4273d1K3R3O8p8m12J61K71l50J23K10k53p8K60o2J29J52k32J32m0j25PJ35rk71
4297a87K8MJ46l18K61R0j72J31j7J03k35j7L87m24L76J3M4k57J65j1J01j31K71
4320C51m53p5K2K86l05K78k83Q5Q1m8l01K32m7J86K71k87k6N9L59l90Q1k21L57
$$ plain form
4163 208 29 -52 26 318 152 -10 -120 -262 236 -176 -61 81 133 -29 -73 45 -128 167 10 -203 -217 147
4185 147 87 -193 -125 70 29 288 185 309 -114 21 -7 60 377 25 -339 63 -206 5 -41 263 -178 -109
4207 -109 57 -92 -89 -6 -188 -30 -304 94 -193 -21 89 -168 -58 -111 -25 -93 -215 -21 -247 -6 -202 168
4229 168 115 -151 148 131 2 -59 -104 -4 153 13 -52 90 -314 298 131 -94 55 -250 346 65 42 23
4251 23 -172 -8 -118 109 -149 -218 -464 241 -1 196 -155 281 -182 -23 75 -66 -76 -89 35 194 -38 -41
4273 -41 -18 75 143 65 -347 -186 85 -265 -142 68 -185 -263 -3 -65 64 216 -16 116 76 -49 -42 93 84 -187
4297 -187 -159 -155 -9 -327 -66 24 -148 -17 -34 69 -166 -183 204 -220 156 169 213 -44 121 110 211 80 351
4320 351 -102 -177 -155 131 -174 104 -179 -94 -13 -61 -362 -130 -177 9 280 -7 -33 26 385 -5 76 -145 212
4343B12o35K31J59M24m89J80J26k80N7K05j08J30O8l31jK12l88L04K98l27j80
4364a33L4k5J67R5l21j62L63k59M51j05J2k06K21j64N0j42K96j67ok22J88J54
4386A19j93l7R0j24J69J2n2j29J6j39P5M95k85J30l12L62k35o8J07J90j33J70
4408B28j41l33J92j04J91Q9k67j24K81j42M1L5q8J92K5P1p0J09k64J43rP5n6k59
4432a85J17L5k30L84p9K08P1k50k91K24L06j85n3l09R2M04r5j23j91K65l9m52
4454c76N04j74P0q2o8K17m41K55p8n1L58j52K83m68O18l73l49K57jL32k26L9k8
4477F6l9r8R2l38J32L06J42j40k98J56j07K13j91J8j26J90L6OR5k00K59l84K61
4500E1m0j95M43n80M96l52p3L47k21J13O0n6q6O93m86N1k87J22p0J16m65O89k29
$$ plain form
4343 212 -423 -192 -33 391 -98 82 208 -72 -15 190 82 212 280 -51 -52 160 -228 76 374 47 -133
4364 -133 -99 -124 43 138 -183 -345 18 -241 210 105 117 -89 132 -32 18 -124 172 5 -1 -223 -35 119
4386 119 -74 -111 -21 -145 24 36 -16 -145 -129 -268 -193 302 17 147 -165 197 -38 -106 1 191 58 228
4408 228 87 -246 -54 -158 33 122 -145 -269 12 -130 -89 -54 -142 50 75 146 76 185 -79 64 55 130 74 -185
4432 -185 -68 -33 -263 121 42 250 321 71 -220 4 310 125 72 -237 -145 259 164 41 -150 115 76 -376
4454 -376 128 -46 24 -58 -126 91 -350 -95 -173 -224 134 -18 265 -203 415 42 -307 -50 -51 281 55 94 66
4477 66 27 -71 21 -317 -185 121 263 123 -175 -19 -126 87 -104 -86 -212 -22 14 20 115 -85 174 -210 51
4500 51 11 -184 259 -321 175 -177 -250 97 -124 -11 49 -7 -93 600 114 165 -122 0 -70 46 -419 270 41
4523D1K7R5k22J37K93j26k46Q5l13p6L73R0k10j04j89M87j15J38j96K57m51J04
4545a21J99k06N61l24j19L6k57K36J83j35k14J4K69k27j05J80k38M01n09L69K0
4566A3J64k54J24k16K24rq6L0j99O9l9J27m7J38J88k44j05K61j02o5N6Q7p8m4
4590gk1jk0L32k26l86M30j44J64o4j93J74K32m24L62j94N0k13J15n3o6P9l3j96
4614c03K97l09N3L39j21K9K30j97k31J85J35l19L10k19j49Q1K92k59K06J44L7
4635B31j87j64L28l02j55J21K3L40k43n94P09j86L48l93P9j6J71l09J62k39K27
4656d9L04k47l47L26j77K78k42J30j0L1J93m91J67J64j89J55J97j37J88k35j65
4677a56j13j50M21P5J76k66j89L49r9l03N15q8r1j46j27K09j25J06j21J57K15
$$ plain form
4523 41 68 163 -59 78 371 245 -1 84 -229 -305 68 158 -52 -156 -345 142 27 165 -31 226 -225 -121
4545 -121 78 -128 433 109 -10 26 -231 5 188 53 -161 -147 122 -105 -210 -30 -268 133 -376 -7 13
4566 13 177 -77 47 -169 55 46 -40 -10 -209 -140 -179 -52 -99 39 227 -17 -122 139 37 -28 28 115 37 -7
4590 -7 -28 -29 -49 283 57 -329 101 -43 121 57 -136 38 270 -154 208 14 64 -149 -34 -87 -153 -74 -107 -303
4614 -303 -6 -315 -262 77 -44 -15 215 18 -213 -28 107 -212 98 -121 -270 -189 103 -156 50 194 231
4635 231 44 -120 208 -94 -249 -128 -105 235 -8 -602 107 -79 269 -124 -45 -61 110 -199 -37 -276 -49
4656 -49 255 8 -339 -13 -190 88 -154 -24 -34 -3 190 -301 -134 30 -159 -4 193 56 244 9 -156
4677 -156 -269 -419 2 77 253 -13 -202 147 48 -255 260 172 81 -65 -192 17 -108 -2 -123 34 249
4698B49j46m8n6L0j90J7kJ95j61L2J87l83K90j57j80L17j63K55r0J87l17K31J36
4721B33k03j66J57K8j66m8K1NM29k50J91n1j98L2j10p5K99j05k78L62Rl0l8k12
4745a64L48n1k90P5O3K5L05l43K79k75j16p7J65J14j15j39L08K4m23p1L40O5n8
4768a1Q3j62k3J15K08k29J43n9m17N15l55J99K1J69j19j54L92j33o2k95K98j66
4790d2J45j20l0p9o1K84j20J01j26m5K67j32l19J19L48m48K28O3Jk02M0L07l72
4813a93L34N7k85K63N1l9k87J97j13J87J21k76m5o6J11o8L27r4j76J9j69K71q5
4836D2m41M19L58n1k52m49L88j45p1K82Rj91K4n0N3L8k3j7q9L54l17K63l23J86
4860cj23L11j69O8Q8k54K23q0J25N6k96L04p9j94k95M65l36R9nj60L31l56L23
$$ plain form
4698 249 103 55 -1 29 -161 -144 -146 49 -112 -80 107 -276 14 -143 -323 -6 -169 86 -4 183 -134 97 233
4721 233 30 -136 21 49 -117 -165 -144 -139 290 40 231 180 -18 14 -96 -171 128 23 -255 107 116 86 48 -164
4745 -164 184 133 -157 -82 -19 6 311 -32 247 -28 -144 -221 -56 58 -57 -196 112 136 -287 -358 -18 47 -11
4768 -11 72 -90 -113 2 210 -19 124 65 -352 163 -192 7 28 197 78 -76 316 183 121 -174 124 -42
4790 -42 103 -17 -47 -126 -187 97 -23 78 -48 -93 174 42 -277 -158 190 -258 -30 33 34 -168 -128 179 -193
4813 -193 141 198 -87 176 227 188 -99 98 -15 172 293 17 -28 -94 17 -51 276 182 6 25 -144 127 42
4836 42 -399 20 378 327 75 -374 14 -131 -202 80 89 -102 -78 -128 -75 -37 -60 -77 -166 188 -129 134 -189 -3
4860 -3 -126 185 16 84 172 -82 141 61 186 242 -54 250 171 -23 -318 147 -189 -90 -95 -255 76 -280 43
4883D3J90m35M2J58J66j59K58k18k7k5K47j06k46K09Ol13K32J7m4M3q3Ql8J5K45
4908A85l11K62l23J13K55j98N6J03j31k52J29j45K96k33M37j36j16K05k29r5K41
4929A13O8l17o9q1K67K23k12J44k53K02q5n3K11M4j20J51l79P5qJ11J51l64NJ85
4953Ij97L05O6j8R0m07j47J40M75k42n4k72K74r6j1K9r2j48L89p7j59j34M12j17
4977A8j04P1p9K49j05K31l66qo5J14O7J17j12o3K74l89LRl7K88k73j12K57k42
5001b57M11M3j76p5N6n5L24j81l2j32N9L98l13M9m8J49J83o30J55O0r5L62k69
5024a4k49Q0L28k7O4M9l16p2J62j22M20k26K41m67J93k52j08J64j79M77j96j95
5046b45N6K47J45o13N04k6p9J57j19m0o5Q8j02J18P2o9J22k01J09j07p0Q5K3k63
$$ plain form
4883 43 233 -202 -160 -2 164 5 263 45 18 -7 240 134 -112 97 103 -210 22 39 -5 38 -45 -37 -75 -60 185
4908 185 -126 136 -187 -74 181 -17 39 142 11 -241 -112 -257 39 -194 243 107 -9 196 -33 -128 113
4929 113 181 -136 -205 -286 -19 204 -8 136 -117 85 0 -53 158 202 82 233 -146 -71 -79 32 183 -181 -176 9
4953 9 -188 117 183 165 255 -152 -299 -159 316 74 20 -252 22 -74 -85 -56 -148 -296 93 16 -143 -277 135 18
4977 18 -86 -15 -94 155 50 281 -85 -93 -158 -44 23 140 28 -35 239 -150 -147 -138 -175 113 -160 -272 -15 -257
5001 -257 154 197 21 -54 2 -53 271 90 58 -74 -15 383 70 119 71 220 403 -227 -72 -12 -107 255 -14
5024 -14 -263 -183 145 118 182 231 -85 -157 5 -117 303 77 318 -149 44 -208 -316 -152 -331 146 -50 -245
5046 -245 -189 58 203 -410 94 68 -11 146 27 -13 -78 10 -92 26 98 29 151 -50 59 -48 -118 -33 -10 -273
5070b73L99l00K12L3j02m4L6K50m2k66k5J65m84K51J8L06k93K27k73R1L53k99
5092f0O7p6q1K6J08j8j09J93j07q9J38J30j81j62J34J04L27l61O3K74j36q6Q0
5115A78m87M32j44J88k60m3P0Q1r7J7M8p2J5N8k7J13q0l8J60j26K58n88K96J82
5139A34l1j41Q6R0rk48J83K8m7l7n5J40m41N80m99J36M67n26L5J81J17n01J53
5162b05M15J18k31P9l81K11o5K84l96J33n1P4J81r2J83m82J58j3O9J87j76M13
5184D13o22L27JK4j47nJ17k25j02K50jj24J39j92J53q3J83J66k71K34l95L07k20
5207g3K31j07k42J21k4J96l45K80j21j6j73N58k49q2L44j76k40oR5J2j70K42M0
5230I5J12q1n5J43l45q8J06L9j79J40J17j71P9M22Kk97Q6n01N70m14J92q1K19
$$ plain form
5070 -273 126 -174 38 71 -31 -75 -39 211 169 -97 -122 43 -441 -190 -172 134 -159 68 -205 -114 239 -60
5092 -60 7 -69 -150 -124 -16 -34 -143 50 -57 -146 -8 122 -59 -221 -87 17 344 -17 46 320 184 98 178
5115 178 -309 123 -21 167 -93 -136 -66 15 -82 -65 -17 -89 -74 -16 -43 70 -10 -48 112 -14 244 -344 -48 134
5139 134 103 -38 48 138 129 -119 64 92 45 8 -47 93 -348 232 -267 -131 336 -190 -155 26 143 -358 -205
5162 -205 210 328 97 176 -205 6 -59 225 -171 -38 -89 -15 166 74 257 -225 -67 -80 -11 176 0 413
5184 413 -209 118 119 143 -4 -9 108 -117 -219 31 30 -94 45 -147 6 -77 106 272 1 235 -160 147 -73
5207 -73 158 51 -191 -70 -94 102 -243 37 -84 -100 -273 285 36 -46 298 122 -118 -124 -29 -17 -187 55 95
5230 95 207 126 71 214 -131 -219 -113 -74 -253 -113 4 -167 -88 334 336 39 125 -376 194 -220 -28 -109 110
5253A10j25K43j9J09n22K39k15L39k31L5R1J59p8L5j25k08M96j88L0k60J79j12
5275a8q0R2k29J44J31J10J6j29j48P8n7J41L02n88J0P6K39k09K61j76k8j72r8
5298c32K00J39k80K57K2j58K34J31k75J31K7J56k38r0J37K9J25l69K55k45J30
5319a4K5j42K20q8J88k24j51N8l04N49Q7M2l73J6M9R1K4L1J6k07P3K30j97K20
5343B19l2l59L15k65J43J46j00l04M80k10j18M66l90o5k1l16M61l1rK42k26n5
5365b9n8L99k26l61O3N12p81M92l72L10J42j33jr8J7K43n1j04j52K32O8m6L26
5388C92n80J31K48j61J61l27nK89k06jkN22k13k2l11j2M67n07L1R1mJ78J1k3j91
5413d4J06%P9l22K17l25L59J05q5j66k71O32k31m2Q8J30l35kJ58k52K8L23q6p9
$$ plain form
5253 110 -15 228 209 318 -204 35 -180 159 -72 -37 54 213 135 170 45 -163 333 145 175 -85 94 -18
5275 -18 -98 -6 -235 -91 40 150 166 37 -111 -33 -90 51 353 -235 -225 -149 90 -119 142 -34 -62 -234 -332
5298 -332 -132 7 -273 -16 6 -152 82 213 -62 69 96 252 14 -76 61 90 215 -154 101 -144 -14
5319 -14 11 -131 89 1 189 -35 -186 -128 -432 117 204 246 -127 -111 -62 29 53 84 100 -107 -34 196 -1 219
5343 219 187 -172 143 -122 21 167 67 -237 243 33 -85 381 -9 -74 -95 -411 50 19 10 252 26 -29
5365 -29 -87 312 86 -275 -212 300 -481 11 -361 -51 91 -42 -43 -141 -124 119 68 -36 -188 44 112 66 392
5388 392 -188 -57 191 30 191 -136 -141 148 -58 -59 -61 461 248 226 -85 -97 370 -137 -106 -15 -19 159 170 147 -44
5413 -44 62 62 141 -181 36 -289 70 175 90 -76 -347 285 54 12 100 230 -105 -107 51 -201 -173 150 64 -15
5437a5J1j26K17j42j0J10k6%M7o4M21p47K91J44J14m19K74j03J1L1J49n11M34
5460I1J86j75r1Q3m7k41J93K5O8K3l19J18K4J66N9l1j29l9J91l47N12m17K81j19
5484F5J23rm76K4K28m5j17N18j40q2l0l95M1K06K51o04N47L3n19O33m13L36l13
5507a38M28n34J40J54r7kP1R7o1r1J64m3j33Q4j74O1Q0j20k49M85j71L67l49%
5531c1L00l38L30j04J11k81J9K68r3k52P9J77k26J10o1J48k03J09L24p06K98P2
5553E0l47K96p9J99l83L20n04M66K5J48l81K91N4n3%nJ69j55j83Qj77M25l87J57
5577d6j15o1M40Q3k72o7Q9J43Q8k7l34J85m4r2k26L79k71K15n1k48K49l42K23
5600a02j92N81j40k37Or2j34M37k29J21m3m8M0J55n5P1p3r8j76M79n58J63j59
$$ plain form
5437 -15 -4 -130 87 -55 -65 45 19 19 66 2 423 -324 -33 111 225 -194 80 -23 -12 19 168 -343 91
5460 91 277 102 11 94 47 -194 -1 24 92 115 -204 -86 -62 104 163 132 3 -36 155 -192 320 -97 184 65
5484 65 188 179 -297 -273 -45 -90 -207 311 171 89 59 -336 -295 -89 162 -442 105 138 -381 252 -161 175 -138
5507 -138 290 -244 -104 50 -47 -49 22 119 58 -33 131 88 -45 39 -135 -74 6 -114 -363 122 -49 318 -31 -31
5531 -31 269 -69 261 157 268 -13 6 274 181 -71 8 185 -41 69 8 156 -47 62 386 -320 -22 50
5553 50 -297 -1 -80 119 -264 56 -448 18 43 191 -190 101 155 102 102 97 266 111 -72 -64 -241 184 -203 -46
5577 -46 -161 -222 218 301 29 -38 51 194 282 255 -79 106 62 -30 -256 123 -148 67 16 -232 17 -325 -102
5600 -102 -294 287 147 -90 -84 -176 -310 127 -102 19 -24 -72 -32 123 68 139 66 -32 -208 271 -287 -124 -283
5623b83N68j04l14L91l87K57l49N6k4j2m6J35J17k3K06J70l88n2r6J63m2j2j92
5646b61M06j35J12l33Q6J26J6m3qJ43K13n49N39l56K01j23j01p6j61L21j03m5
5668a31j16L97k68Q7N4n6M06l82K0k70J43K46O0j07n5J22n58K91J50L1j12o2K38
5691A28J60K38n87K95n20N55l29p5j18N1K44n6k6J30k08O8L37m75J99M8l8k48
5713b27n9J03M47o65L80j2j43N47q85N76l6J70k04Q5J6l6M9j98K8j40K30j97J02
5736f9k49N19k98j54J98KK01R2k15n0k60N39m11J08L26l62l5P6j18l6L7N4J4M9
5760d2K18j59j68J50K93p08M38j18oJ82J03N8r8k76j9p4J36m2K96j85K2J58M0
5783A99j63j04p6M26q2j93J87J2j06l7L65l11q0j23M82n00j11q9J26L3K71o6j60
$$ plain form
5623 -283 285 181 -133 258 -129 128 -221 -165 -189 -201 -247 -112 5 -18 188 358 -30 -82 -178 -15 -57 -69 -261
5646 -261 145 10 122 -211 -125 1 17 -26 -34 109 322 -227 312 -44 157 34 -67 -143 -304 17 -86 -131
5668 -131 -247 150 -118 -31 23 -33 373 -9 11 -259 -116 130 190 83 28 150 -408 -117 33 64 -48 -110 128
5691 128 288 526 -61 234 -286 269 -60 -135 -253 -202 42 -14 -40 90 -118 -50 287 -188 11 59 21 -227
5713 -227 -286 -183 264 -401 -21 -33 -176 371 -514 62 26 196 -8 77 93 57 106 -92 -64 -204 26 -171 -69
5736 -69 -318 201 -97 -251 -53 -51 150 242 27 -23 -283 256 -155 -47 279 -83 -118 -42 -160 -196 -159 -105 -91 -42
5760 -42 176 17 -151 -1 292 -416 22 -96 -102 80 183 241 143 -133 -152 -226 -90 -132 164 -21 1 159 199
5783 199 36 -68 -144 282 200 7 194 206 100 63 428 117 37 -86 396 -104 -215 -304 -178 -145 126 60 -100
5806a00J82p6j68L15j82j1J18O7m39N46l73J69L0Q0J5k81j53L69j74J14k37K01
5828A2j88L02k9j66O1j89L0J64O2j05l0j71K86k06P6mJ8J11K49l10j49L66l85
5851a95L61l59L18j20J00m7R5k1j09L3k22j0J29P5m6j38M59j27p3k32j02M14p7
5874A06o6N7L36m43J08P8Q1j94l0k30J70k5K30j88j42J85l51M37m98K33M8J98
5896A00q4l41J24M23l30m2o6L08l48L66K31j85m3K3n37M35o8k96J78J86L37l31
5918D0n1k78L36L0k32J49k20J91j71J66J59n95O21K60l95j7j01M28k65Nl03M85
5940B42l69L93l15O1Q7K56l15j53o1L15m66K77K68n21M25j30K18j1l24K49K77
5961D03o09K05MJ89j7n2P5k45p8K82j63K58J15k18k05J72j26p9P2L22k96Q3m10
$$ plain form
5806 -100 82 6 -162 153 -29 -40 78 145 -294 252 -121 48 78 158 173 -108 -261 108 -66 48 -189 12
5828 12 -176 126 97 -69 -8 -197 -167 -3 59 -46 -76 -247 39 -167 -91 -95 -77 34 283 -27 -176 190 -195
5851 -195 166 -193 125 5 105 58 153 132 23 56 -166 -176 -47 28 -18 -156 303 176 103 -129 -231 183 106
5874 106 40 97 433 -10 98 176 257 63 33 -197 -27 -52 178 -10 -152 33 -318 119 -379 -146 -98 100
5896 100 16 -325 -201 222 -108 -150 -216 92 -256 110 341 156 113 136 -401 34 -34 -330 -152 34 371 40
5918 40 -11 -289 47 77 -155 -6 -226 -35 -206 -40 119 -476 145 405 10 -7 -108 320 55 60 -243 242
5940 242 -127 266 -49 12 99 355 40 -113 -174 141 -325 -48 220 -301 124 -6 212 201 -123 126 403
5961 403 -206 -1 3 192 175 123 198 -47 -125 157 -6 252 367 149 -56 116 -10 -89 -17 305 9 92 -318
5984c18L46m6P1M0l8j3J66K3n8k72m0K38K10n77M98k82l8jK61k34J15J08k81J
6008a21K68k04j10M14j82j49L25j16m9k89R3j41L92r8K5j28L69j03k91J35J17
6029A57j45K5l27K33QK81k93l7O5K24n0l98J2N96j25l12j38K42q1J51l38M91q9
6052A52k79J37R4k90p8L48n0J57j47r9k56K60rJ0K02k44J22K75k55r4K96l96j6
6075a60J26J12l01J73n1J56l32J06J94J44l24J90%J3m7l81N10K97m36l50L04J32
6097G5J17o12L57K1K47J7M9k59r7K54l05J48p0P0K00p2m56M47k08k26Q44n10k98
6120b67J52L5M9l31L85L3L5k42k00K85j53q4K43J12q1K37k12j35J81L01n77M14
6142A80k28O7L71p38K18K00J07l17J50j13K52m11N29j57K0l47J61J52P6j34k0
$$ plain form
5984 -318 28 -18 53 93 55 42 208 231 173 -99 -139 99 309 -268 230 -52 -90 -91 170 -64 51 159 -122 -121
6008 -121 147 -57 -167 247 65 -84 241 125 76 -213 -120 -261 131 33 58 -70 299 196 -95 40 157
6029 157 12 37 -290 -57 -49 232 -61 -98 -33 191 141 -257 -245 351 226 -86 -224 18 -63 88 -250 241 152
6052 152 -127 10 104 -186 -264 84 34 191 44 -55 -311 -51 -60 -50 152 -92 30 305 50 -44 252 -144 -160
6075 -160 -34 78 -223 -50 -101 55 -277 -171 23 167 -157 33 33 46 -1 -382 128 425 -11 -361 -57 75
6097 75 192 -420 -63 -42 205 222 271 12 -85 169 -136 12 -58 12 212 140 -316 131 -77 -303 541 31 -267
6120 -267 -115 -80 -31 -362 23 56 91 -151 -351 -66 -219 -303 -60 52 -29 208 -4 -139 42 343 -234 180
6142 180 -48 19 390 -348 -130 70 177 -140 10 -103 149 -262 267 110 130 -217 -56 96 172 38 18
6163A8q4J87j56J39j10N4m3L55n86K52r7K88J09m53Q5j02O4J98K98o14j5J74O9
6186C0r7j3J18J39k05p2K4L20j27l23q7Q6L13J19l62J93m3Oj51L51m07K16n4J33
6210A07j43J12k89J79K10k20M1q2L64m47J18J66o3n3J2N4o8q5R3J2j6j08L1K00
6234A25j28K03k61J24p8J67J35l10K23k73J4M37k96j63R4k9k34K23P8L4O9k81
6256a27q5R4PM0J49r8o0J56K7J59k52j6K50l49m9O8J51J55l64K42l55K50J3k48
6280b42L87L8k58r3K24l9K39m10J43j30L4M24j85m46K61j64J43k2J70O8k29J5
6302g2J45K38k34j51j17M09k34L1j07J81j85J07k64K10R3k29J92J23k51J98k8
6323E5k33O84n22N32k03l51P5j73K55n34M37J22l23L61k64j6J65k61K96O7n16
$$ plain form
6163 18 -66 121 -35 104 -6 48 5 360 -226 26 -71 217 326 -127 -42 -144 -80 118 416 -198 -213 -39 30
6186 30 -67 -80 38 177 -28 -100 -76 244 117 -206 -293 -207 106 225 -137 56 13 19 -132 219 -188 28 -26 107
6210 107 -36 76 -213 -34 176 -44 -3 -85 279 -168 -50 116 53 0 12 66 -2 -87 6 18 2 -106 -75 125
6234 125 -3 200 -61 63 -15 152 287 -23 200 -73 -59 378 82 -81 13 -16 -250 -27 51 85 154 -127
6256 -127 -212 -118 -111 -71 78 -20 -80 76 103 262 10 -6 244 -105 -154 -86 65 220 -144 98 -257 -7 6 -242
6280 -242 145 183 -75 -168 56 17 256 -154 -11 -141 -107 317 132 -314 -53 -217 -74 -96 74 142 -87 -72
6302 -72 73 311 77 -74 -191 218 -16 15 -92 89 -96 11 -253 -43 50 -179 13 136 -115 83 55
6323 55 -178 506 -16 516 313 -38 37 -136 119 -415 22 144 -179 182 -82 -98 67 -194 102 169 -347
6344c47L63j41K34q7mJ4l42J09L65J03l03K88l53j73K19R4k03J02J41r8n8J53
6366G6J62m05O6K77k18J09K64n55N0K79k6Q3J5j97NK03l03j36K33q5k6L26J79
6389C76m77J29N2L6P8j62Q8j02k57J34K86k87K65r8j1J28m37K55n7N7J71n7l67
6412b57K54Jn7o6R0J71q1j26M5J01m1J66j96k63M96k08lj60M7J76k57J63J85m73
6436b93L23p3R0j96J78K24m38K41n4J29n13M11J1q6k35M39l24J58L06l00j47J06
6458d3Q4K4k4j27k4j17K11o3N9J13k08o8P0j27M46k93ko7J62j52J18R1j37J7l6
6483i3L1K21l05J93J00j65K72n17L90k06J65l7p3M0M8J09j01P2j26j45J28j42
6505a41L12j02j89j04K51j09P9J49k39l06N41r3j10K83j60J06l09Q1J84j51j2
$$ plain form
6344 -347 16 -125 109 22 18 32 -310 -201 164 267 -36 252 -101 -274 -55 39 -164 -62 79 -19 -77 76
6366 76 238 -167 -101 176 -42 67 331 -224 -174 105 79 162 177 -20 -15 188 -115 -251 -18 -103 -129 197 376
6389 376 -101 28 80 116 194 32 120 18 -239 -105 181 -106 159 61 50 178 -259 -4 -61 -4 167 110 -257
6412 -257 -3 -2 -59 -125 -35 136 55 -71 -26 75 34 200 4 -259 237 29 26 -134 -87 89 -168 -5 180 -293
6436 -293 30 -43 47 -149 29 253 -185 56 2 131 -382 29 40 -46 -281 158 -166 -8 298 -2 -149 -43
6458 -43 41 65 41 -86 -110 -227 -16 -79 -20 93 -115 -183 -113 -240 206 -87 -89 -156 6 -146 -28 63 -74 -57 -93
6483 -93 -62 159 -146 47 147 -18 254 -263 127 -79 86 49 -24 16 64 173 72 144 18 -127 1 -141
6505 -141 171 69 -120 -224 27 -82 -3 146 -93 -399 142 49 -61 222 62 168 -141 -60 124 -27 -39
6526c9K71k47lL17p1k4k69Q5oJ33j77J33k97K62K04o12L69j9m0l08P16j75J51
6549C54m94O9J64J1j03J9N4k69K69J86l67J63l00K41r6q6n8L30Q8l36l9L60l36
6572a76j8O5q0M34m1j07j12P3m2q9k35K06J28j85J2N7o7P4j07K60r5j5J90j10
6596B0L49l68J69j52J55m73M5L29k01k05J31K97n3j01J29l00K57J22m18L10p0
6617b8P0j01J54l75K50k61J63K83o3j29K80l18l19K28L5M40j16m18L4L69o8j26
6639a6l0RK70p2J29j86K0n8k17QJ15l21J91K40k48J3K1k11L79J94l48J0L69l57
6663i6p0L03j8o9Ll5L86n74N37k62l36O3P0K28n86P50m44L80k75K50l16l5K63
6686A17J0mj6j84q0L65k39J1K59q8l73K0K15j24k96P21l94k15J33K01K18l08j43
$$ plain form
6526 -39 232 -15 -18 299 228 204 -65 20 14 147 -30 103 -194 68 272 -340 29 10 -30 -338 378 203 354
6549 354 -140 -71 93 104 1 20 74 -195 74 260 -107 56 -244 -3 -99 -185 -243 87 175 -161 -200 160 -176
6572 -176 -194 -129 -209 225 184 77 -35 38 -4 -93 -328 -122 6 -179 -167 -110 -177 -103 -210 50 -45 -60 130 20
6596 20 369 1 170 18 173 -300 -255 74 -127 -332 -201 96 43 -58 71 -229 28 150 -268 42 -28
6617 -28 42 -59 95 -280 -30 -291 -128 155 92 -37 243 -75 -394 -166 -131 309 193 -225 -191 178 110 -16
6639 -16 -46 -37 233 161 290 104 124 66 -151 -143 -28 -349 -158 82 -166 -153 -132 -343 36 230 -118 -108 261 -96
6663 -96 -166 137 119 50 53 18 404 -170 367 105 -231 -168 -98 130 -456 294 -150 230 -45 205 -111 -146 117
6686 117 127 123 107 -77 -157 208 -31 -20 239 151 -222 -202 13 -111 -407 314 -80 -295 -162 39 257 -51 -194
6709a94J77J16l19J63K09q8k06J7K55j27L6J93K4l05K64J0j82l55P04l60k30K68
6731G0P1j00k4j68J87j02q3Q5P9k85L66j6q7p5J21j39K42j2k25K10j08o7J18%
6755E8O9k11j86M69m0J5k17J64j51L33m07k11J94N6M48o24k28M07J77p3J81j92
6777C1qN4k2J17r8j08J50k49L82k72j46N14n08L41k07J53l35J95K34k29Q6m91
6799d16N79k44L96j90l36L42j22n18N47J65k97n1J70Rp0m6K63j65M9k76L97J07
6821B93j92J32l5j93n0J41J33k73oN1PL26n05J01R6o3K09R5k72M18m40J32k19
6844a14L76Pk60J20j78L10k34j86K62l35M58j00o5J66k08j49P4J71j35%j49K08
6866C9r1N0J3km03N43J41o20L76K13k98j91K84O0J9m7J53qk13p3K10m07J91n3
$$ plain form
6709 -194 -17 99 -220 -57 152 64 -142 -125 130 3 39 232 256 -49 215 225 43 -312 392 32 -198 70
6731 70 141 41 17 -151 36 -66 -149 -64 15 -270 96 80 -7 -82 39 -100 142 130 -95 115 7 -60 58 58
6755 58 127 -84 -270 199 159 174 -43 121 -30 303 -104 -315 -121 -65 383 -241 -469 -62 115 42 223 31
6777 31 23 77 55 172 74 -34 116 -133 249 -23 -169 345 -163 178 -29 124 -211 -16 218 -11 75 -416
6799 -416 163 -81 315 125 -211 131 9 -509 38 203 -94 -145 25 34 -36 -82 181 16 65 -211 186 293
6821 293 101 233 198 5 -45 96 229 -44 -50 1 8 334 -171 -70 26 -37 172 267 -5 413 -27 105 -114
6844 -114 262 269 9 129 -49 261 27 -159 103 -232 226 126 61 227 19 -130 -56 115 -20 -20 -169 39
6866 39 -52 -2 11 9 -394 149 290 -330 46 259 -39 -230 54 114 133 86 239 231 18 -55 155 -252 -61 -114
6890a14J85K37k54K71n02M73k02j37K00j41l3j75J49j08j06K57K16k53j21J97
6910C9l44M68r2n9J2j26J31j46J21j8K01m19L24q8Kl71L26m1K26m13K34k3J63
6933A07k76j25J44J84k19K0j9J53J88n14L03L5J23l0KJ88l18j1L14m90N16l67
6955i2j83M17o4M9j54N9K2q0J49m73L16n6j53N28l87j18K79j23m39N33q1K19k72
6978a04J68l09L47j60j95q5K72K13r1l95K84r8L30j02j88M4Oj72M23k47L18m10
7000a51o4Q2n8L50N4k56J03J89Jl21N3qj55L2L55L5l50K73k67o2q2K75R5L3O4
7025B20l10j21J72Q2P9R6j23r6J4M3m5l15L96j07j5K57l07R2K22K1n51J47j01
7048b50O37m91l2M0j27K98j26K17l39N3K70j95k91K43K79N8l07J76R3K76l87j48
$$ plain form
6890 -114 71 308 54 325 -177 296 94 -43 157 16 -17 -192 -43 -151 -257 0 216 -37 -158 39
6910 39 -305 163 71 12 24 -102 29 -117 4 -14 187 -232 92 4 6 -365 -39 -80 146 -267 -33 -56 107
6933 107 -169 -294 -150 34 -185 -165 -184 -31 157 -357 -54 -19 104 74 76 264 -54 -65 249 -241 275 -92
6955 -92 -275 142 78 127 -27 32 54 -26 123 -350 -34 -90 -243 285 -102 -220 59 -64 -503 30 -51 168 -104
6978 -104 64 -245 102 -58 -253 -338 -66 147 56 -339 -55 -153 177 75 -113 -69 -63 -235 188 -59 259 -151
7000 -151 -215 -133 -191 159 213 -43 60 249 250 -71 -18 -26 -181 -149 206 241 -109 164 -103 -165 -247 28 123 156 220
7025 220 -90 -211 -39 43 122 218 95 -1 13 56 11 -304 92 -15 -30 227 -80 12 234 255 -296 -149 -250
7048 -250 387 -104 -136 -96 -223 75 -51 166 -173 -120 150 -45 -336 -93 186 244 -63 113 206 482 95 -53
7070e3j1Q8k47K62jM6Rk15L8j57J62Q0K24l54q8J15J23l31L30K12l69N5L84j52
7094A50k27q4K77k78J19J53j31L5q6P1k37J68Q8j04M0r4R1k34L40K6j32J4n0L09
7118B24l2j87K92j68k59K39k64O9J39j73J17O6K3l08L80J05m12J17l41M28j47
7139i2K78Oj95j4Q6J30q0k34P7J44j39J03q7n4J70k0P5M2l21j48O29j98k99Q5
7163e6m3L49j15n70L00P5J11L8j91k42O63o73M63j06k85L27j64Q7k2l53N89k42
7185f0M85n73K52k37J04j53l4L37J20l17L78m28j30K47n9R4j14K09j95R7O4K53
7207C40k56m8k2l12M00k8R0j37j29J57mL3K7L75n36k7j42M97n82J92J55m1k21
7230b19m1J72r3L6J04q3Q2J51Rj14K32j23k32K9J06k14N25k36j97k22L40R0l35
$$ plain form
7070 -53 -64 24 -223 39 38 84 93 -122 -84 -241 -79 1 225 -129 -217 -102 21 -310 20 232 -137 -82 302 150
7094 150 -77 -161 116 -162 -43 110 -21 14 -72 -1 -238 -70 18 -86 -46 -140 -49 -283 57 83 -49 -35 -85 224
7118 224 192 5 297 129 -130 109 -155 -86 53 -120 -3 63 86 -222 158 263 -149 -32 -373 55 -92
7139 -92 186 192 -3 -17 69 199 119 -115 -38 106 -33 70 -17 -71 99 79 154 196 -125 -273 356 158 -141 -56
7163 -56 -99 250 135 -435 -135 -60 51 89 -102 -344 319 -354 109 3 -282 45 -119 -32 -54 -407 182 -60
7185 -60 425 -148 104 -133 -29 -182 -216 121 241 -76 302 -126 -256 -9 -68 26 -88 121 -74 23 87 340
7207 340 84 36 14 -298 102 74 164 27 -102 55 51 84 111 486 -50 -77 -219 278 -304 -112 43 2 -219
7230 -219 -260 -88 -181 -145 -41 -124 -42 109 118 4 236 113 -119 -90 16 -198 327 91 -106 -328 12 102 -233
7253b33J39N2J08p2j80k1N8Q5Q6n1J20k17K51j07m12L63M4k3M3k32M63l9n16J21
7277a70M8k34J71k15J97J5J11j01K35j86J48R6l27nJ56J42l8L2N0J70l77J72k67
7300a77L76j55m9k9J23j21%r7K04J21k87Q9k61K46j45K59k96M26l61P4M2j00k9
7323a47K31j11j69K64P1J06l14J89k53M2O93k82j63k62q0K94j46J33k94K84M7
7344A33j50M2p2j89L41j36Q8l1J88m5l24K79l02K63l7j25P3m5j26L65j30q2L2
7367A0k33L66l40K42Q6j35j90K06J47j52k1J07k95pJ46j18J00o1K76n9m2k93K74
7390A4L00m54L31k88J38j28K4po4m2K34m16M84J02j77k35M1J89M3mk09N8K19L8
7414A91k47l2O7j44L03j10k74Q9J79j51L00k59R2J1j04K63j11J28k53K96o84J97
$$ plain form
7253 -233 -94 -42 66 -6 -186 -207 -149 -64 22 -29 91 -126 125 18 -394 -31 13 -10 33 -199 264 225 -291 -170
7277 -170 -122 -356 -185 -400 -203 -188 -77 -178 57 -129 19 115 -212 -217 -61 81 43 75 125 295 -82 90 -177
7300 -177 199 44 -5 -34 89 -32 -32 -129 75 196 -91 -2 -263 -17 -162 97 -199 227 -134 -60 -18 -118 -147
7323 -147 84 -27 -196 68 139 245 -69 120 -133 -91 602 320 157 -105 -185 109 -37 96 -198 86 133
7344 133 -17 25 -47 -236 105 -31 57 26 214 169 -155 124 -178 85 48 -77 -4 -49 -175 190 60 -22 10
7367 10 -223 143 -197 45 131 -4 -194 12 159 7 -14 93 -202 -209 -63 -181 -81 -142 134 75 33 -260 14
7390 14 314 -140 191 -97 41 -87 -63 -70 -134 -176 58 -358 126 228 51 -184 -143 46 89 85 -124 -66 153 191
7414 191 -56 -88 -21 -165 138 28 -246 -157 22 -129 171 -88 4 15 -89 174 63 191 -62 234 -450 -253
7436b53L47l73L56j82rL76k56N2J95m44O8N3J47o8p5J24p9j29k00K05L30o1j7
7459A07k30K97l1L4k27j64M54m00J06K28l67J44J24%J08l79M01q0P6m96L46j2
7481C9N7j39j31Q2J09L26m04J62j42L08Oj55j56n1R0J45k13J12M0O8j46J53l35
7504a75J70K73j42N4k61J06J32l44K88l88N82m31J01M6P6j93J04N1j59o4J90q
7526Hl4k23L55m21L62M03p23M89l64M96n96J94M98l18P4j13J09q8N3o4l67M78
7548B08j23Q4l20J95q2J21j3k27K31J53j02N8l31K01J22l60K21pj4OKj14n4j20
7572b65J43J99m9j10J67N8k62K55k09p6K03J16l21J79o8J01n7j65R8l7K01k89
7594a88L11J9j43l82M84j37N8j9j0l3L82l79O1j80K68k92L5K42m11J30J17j63
$$ plain form
7436 -253 94 -279 77 -105 -114 262 6 58 253 -191 -123 -70 77 9 -66 58 -21 -150 -350 -145 185 124 107
7459 107 -123 174 143 177 -50 -214 240 -160 -54 174 -193 -49 75 75 183 -196 205 125 201 -295 51 39
7481 39 96 -43 -174 -92 17 343 -61 101 -41 267 273 118 -38 -89 1 146 -67 45 85 153 7 160 -175
7504 -175 -5 268 126 180 -81 25 157 -187 101 -287 295 -136 -35 11 87 -106 -2 49 -110 -174 16 8
7526 8 -26 -249 106 -315 47 450 -273 216 -148 348 -248 -54 444 126 200 87 196 108 161 97 -270 208
7548 208 85 169 -151 44 -38 83 70 -157 74 227 125 183 -148 53 175 -185 36 29 15 21 23 -91 -145 -265
7572 -265 -122 77 28 -82 85 143 -119 136 -73 -149 54 170 -151 28 -40 61 4 -161 -63 -100 101 -188
7594 -188 123 142 -1 -383 101 -36 22 3 -7 -40 342 -37 24 -156 112 -180 -145 97 -314 -184 -67 -230
7616b30J94J48k5j62j47L19j18qj14P6K93m97K19j1J5j34L6J09L47k51j13L9k80
7639b95L06Q0O9k78J26j28k50K94MM21j05k29M8K37k99n3K22j60j44L13k09J13
7661H3J11l70K60lq2l8J23m31K14K4J17j61j8q3K99k75L70p1k51J81J02l6j15
7684e0j83o7K51L06l08R5K93l01J20Qq5o1K12j09j45j65K05j81K25R9J51n87M38
7707A61r5m05N85m66M27o3k42R3L5l8l01N72n30N3J21K63k7j90K62j57l5J38m9
7730A12k91O25o85J57Q8N4J91k40k00N8L6J50l59L04R9N2k05J08p8Pn9J9j74K12
7754a9J41j26Q3j1k28Qn3Q2M12k65K12m73m9L65j06j46J03K47L5j57n8mlK45j83
7779E2J55k74L1m09P33k04j13J1j43pM7j71L71k51L51J27l77K45N5j51j50J21
$$ plain form
7616 -230 -36 112 87 -75 -222 97 -21 -29 -143 -67 226 -271 -52 -63 -48 -182 -146 -37 310 59 -54 -15 -295
7639 -295 11 91 160 -118 8 -120 -370 -76 -72 349 244 15 63 300 1 -52 170 10 -134 179 -30 83
7661 83 194 -176 84 81 -1 -39 84 -347 -133 -109 8 -153 -171 -254 45 -230 140 69 -182 -1 101 65 -50
7684 -50 -233 -300 -49 257 -51 44 337 36 156 164 79 18 230 121 -24 -189 16 -165 60 159 310 -277 161
7707 161 66 -339 246 -220 207 144 -98 -5 30 -8 -309 263 -267 -214 -93 170 143 -47 215 58 23 161 112
7730 112 -179 446 -239 -82 6 60 251 11 -189 -131 -95 55 -304 0 99 151 -54 54 -24 -17 -76 -57 -231 -19
7754 -19 122 -4 79 68 -160 -152 -205 -123 289 24 236 -237 -286 79 -27 -173 -70 177 212 55 -3 -7 -10 235 52
7779 52 207 -67 -36 -445 288 84 -29 -18 -161 -168 -121 -292 79 -172 179 306 -71 174 229 78 -72 49
7801D9q7j50M38l0m35M3M85L2k64K70m38j46L10r4j59J82K02J57N0o3l07R7j37
7824EL9j07L44%j86m5p7o4R2J47k14o8J48j54J71k32J65j51J57j13J56m77P10
7847B46rqk26p9P0K8j93L69k41l05L42j50M99m83L43l44M1J78k04J42L8k58M40
7870B36l67l2k4K11k69M01k93K02K43m36K36q3j98J81j3k09L46j53j76K9K25k57
7892b00J08O1k02K38j8j12J67l6J81k94n7P76p97K26j94K10k96L21R2m50j0M63
7914A77k63Mj45J84m2j89N00l50L24r4k0j1O0l51L14J25J66k68Pq5k68Q0q4M63
7938B34j78j58Mj24L33o6n0l2J34l66J80R6J39m3j31j12j57M04l66L9M40m69R5
7961a54K94q0J33l88J76R6l79N93k78j66J67j13k02M79l78L37M14p11j44M35q7
$$ plain form
7801 49 -38 -188 250 220 -215 -172 313 345 81 351 -87 -233 77 -17 -176 6 208 365 415 352 45 142 5
7824 5 44 -63 281 281 95 50 -27 -91 1 148 -66 -134 14 -140 31 -201 -36 -187 -30 -143 13 -464 246
7847 246 237 229 3 -76 -6 22 -171 198 -43 -348 -6 -156 343 -140 203 -141 -100 78 -126 16 54 -204 236
7870 236 -131 -163 -187 24 -245 156 -137 65 308 -128 108 25 -173 8 -5 -214 132 -21 -197 -168 57 -200
7892 -200 -92 -31 -233 5 -13 -125 42 6 187 -107 -164 612 -185 41 -153 57 -239 82 174 -276 -286 177
7914 177 -86 -82 -227 -43 -85 -274 226 -124 200 106 86 75 135 -216 98 223 389 121 128 43 -225 -145 -229 234
7938 234 56 -102 -98 -222 111 45 -5 -37 97 -269 -89 7 146 103 -28 -140 -297 107 -259 -220 220 -249 -154
7961 -154 140 60 193 -195 -19 77 -302 291 13 -153 14 -99 -301 178 -200 137 551 -160 -304 131 44
7982D4K27m56L63j89P2k88M70j80j95J00Q6k72Q0L33j35m8j31L6p5K42k20M37
8004C01p06L42J05k40N09j95O8k87J08k44N4L5J02j51N33j42q1M3l45P9J37m7
8026b2k6q2K82k42r8J58J13o6l86L12l01L92J3J99J95p57N25P9l05m0J69n8l70
8049c16O08l28K28K32l22j99M31m88Q2J67l09K93M8l53K83k74n2O4M29k10k63
8070b49L86m1l05L13k9o8K86m54J76m7L2J46l13K66J48l77J47J4j07J95j70K23
8092A72J68n61L04m3k97K04j80O3O7M22m36K41j09k44K18L3K9P7k70JJ14Q4n6
8115Ak16L55k24J24k21K49J09j54J35K07n55J87k29r9O1L12m71O02k21J11n9J36
8137A40j17n3J30p9l04K63J7P8k08K6q9J39l9K34m36R2J3O9L75n5k95J44L39l69
$$ plain form
7982 44 271 -185 178 -11 61 -227 243 63 -132 -32 54 -218 -138 195 60 12 -119 -83 -158 84 -136 301
8004 301 -405 -63 42 -198 311 116 184 -103 5 -239 -185 -150 -48 -199 334 192 111 154 -191 -112 25 -22
8026 -22 -48 -130 152 -90 -188 -30 83 17 -369 -57 -358 34 47 246 441 -316 209 288 -17 -57 112 54 -316
8049 -316 292 -36 192 424 102 -97 334 -154 -72 95 -214 79 127 -226 57 -217 -269 -205 224 14 -249
8070 -249 137 96 -209 104 75 7 293 -161 15 -32 0 146 -167 99 247 -130 17 31 -76 119 -51 172
8092 172 340 -221 83 40 -257 -53 -233 -170 -103 319 -117 124 15 -229 -11 22 51 128 -142 -141 -27 57 1
8115 1 -215 140 -84 40 -181 68 177 23 158 365 -190 -3 -232 -331 -270 42 -429 173 -48 63 4 140
8137 140 23 -30 100 21 -283 -20 -3 75 -133 -107 -196 -57 -96 138 -298 -206 -193 -124 251 196 -99 45 384 15
8161A5m8J43m34J67L53k40M02m70J09N4j93M17m33K1K35j61k1J95o4k41J78J12
8183I6o1L74m25k5O9J16q8j4
$$ plain form
8161 15 -33 110 -324 -157 196 -44 358 -112 -3 51 -142 275 -158 -137 98 -63 -84 111 47 -194 -16 96
8183 96 35 409 -16 -41 28 144 56 42
8191D2
$$ Imaginary data points
##PAGE= N=2
##DATA TABLE= (X++(I..I)), XYDATA
0@%%%%qJ6j6J6k4L2m0M8n6P2q8J06j30J60j92K24k59L02l53M07m67N38o17P00
28C71p94R02j016J139j280J436j603J787j991K213k457K724l018L345l701M095
44B152m539N033n586O215o934P765q739R897j1302J3052j5303J8320k2596K9181
58A6616m0764O7092k34325j6437L85617j15086r3885O4297j0749k46268R823K71408
70E7339J15710j87263r3186M7563j8630n4617J44820J59760r6315k22345j7180
81a64344J20773M5469q049N5455O487j15560q0633R4387J23323j3543r4802l0509
93f1546J5443j1232R518R3178N9175r1509j21657K4858R4966J3354j9785K9787
105C4550j8711j05572j6295J35117P9153p6213o7498J9751j9667n4980O8677J36270
$$ plain form
0 0 0 0 0 0 -8 8 -8 8 -16 16 -24 24 -32 40 -48 58 -72 88 -104 120 -139 163 -190 217 -250 288 -329 371
28 371 -423 479 -537 602 -678 758 -845 942 -1049 1164 -1293 1431 -1587 1758 -1943 2152
44 2152 -2387 2646 -2940 3275 -3659 4106 -4633 5264 -6038 7014 -8289 10031 -12565 16616
58 16616 -24148 42944 -191381 -207818 177799 62713 -31172 33125 22376 -223892 -214069 57339
70 57339 173049 -14214 -107400 -59837 -78467 -133084 11736 171496 75181 -147164 -164344
81 -164344 -43571 1898 -6151 49304 55791 -59769 -140402 -46015 77308 63765 -31037 -61546
93 -61546 -46103 -57335 -47817 45361 104536 13027 -108630 -83772 11194 24548 4763 34550
105 34550 15839 -89733 -106028 29089 108242 32029 -35469 -15718 -35385 -90365 -21688 114582
117A14582k0701j45793l5491Q0534J9850k4466N0190L7107r1574q8643N8802R4444
129D8841j142k7653J0095k6045o6118R493R1188L7644n5466m7405P931R488n39
142i688L1228L7928k3751o5366j8901M2427L7421M299n740j2029l1280k3541K7136
155i857N3054Q827m1584k7888P303L836J816L2949K8955l6548n7128Q343M6370
168A8448R143j0891J2258n633m6128j4192N1676L6167k5931k6227P063m842j9473
181a8562K1537M4589q322m8801j1379K5031P197j949K0379O470l8062k7919K3988
194e803L2324j222j1228o75r656j6562P008K8887J1462j7586k0279n146K631R643
208C798J8497J1195j6839k5961j897J7758R862k306Q19j62j5061j4144J3781K8561
$$ plain form
117 114582 93881 -51912 -87403 -6869 12981 -11485 38705 75812 -15762 -104405 -45603 48841
129 48841 47699 20046 30141 4096 -62022 -52529 38659 76303 20837 -26568 -18637 -9149 -9688
142 -9688 21540 59468 35717 -29649 -48550 -6123 31298 35597 29857 17828 -13452 -36993 -9857
155 -9857 43197 52024 10440 -17448 -10145 -6309 -4493 28456 57411 20863 -36265 -27922 18448
168 18448 27591 16700 28958 23325 -22803 -36995 14681 50848 24917 -1310 5753 911 -18562
181 -18562 2975 47564 39242 -9559 -20938 4093 11290 9341 29720 36190 -1872 -29791 -5803
194 -5803 26521 25299 14071 13396 3740 -12822 -5814 23073 34535 16949 -3330 -8476 -5845 3798
208 3798 22295 33490 16651 -9310 -11207 6551 16413 14107 14926 14764 -297 -14441 -660 27901
222B7901K801k3260j3114M614P80N94J6419J1470j8210k0320Q201J5602l353k665
236G460J0604n569k4948j288K7713J3229j5658j0270N254m206j0783J0359K0833
249B2730n643k1686k275J2084K445j988P895J097j6147j1635J0077J3787O23l362
263H002m5o229r228L677J4763L761j2633q912N320L673k997M445J1256m030j8418
278g595n644J2825R239m360k888K412m815p404O208J2930l000j2444q86N309m421
293d534k400J3504Q603j3998j4588P407J1454m247n156O708J167j1384j985J2516
307C067O127p921n557L161k607o178O692J1795k604j2277p66P476j4l245L338
322D87L433q063o748P099Q843j817n034K107M84p643j963J0215O043q236p115
$$ plain form
222 27901 30702 7442 -5672 -1058 -278 316 16735 28205 9995 -10325 -2124 13478 10125 7460
236 7460 18064 12495 -12453 -13741 13972 27201 11543 1273 6527 2321 -8462 1897 22730
249 22730 17087 -4599 -6874 5210 7655 5667 13562 14659 -1488 -13123 -3046 10741 11364 8002
263 8002 7957 1728 -7500 -3823 10940 14701 2068 -6844 -1524 2149 -848 3597 14853 10823 -7595
278 -7595 -13239 -414 8825 4465 1577 3989 -826 -8230 -2022 10908 7908 -4536 -5422 -113 -4534
293 -4534 -6934 6570 15173 1175 -13413 -6006 5448 1201 -3955 2753 3920 -7464 -9449 3067
307 3067 9194 1273 -4284 -1123 -3730 -9908 -3216 8579 5975 -6302 -7068 408 394 -2851 487
322 487 3920 -4143 -10891 -3792 5051 3234 -1800 307 791 -6852 -8815 1400 7443 -793 -7908
337g908N053M680l655n35O474p90j0760j713R287L734n369K44N094l871q767M083
353d719J0513j584j0230m07P071p98l676M620M659n736p731L418N920k285j566
368b531M202Q07p634j331P996L421o887l593M030R66m532J222P216J32p560j507
384e583N310k66l491K775L670m838n213M611O770k764n472K063L420m673l426
399g107O492M717n585m990L679L565m005j066N280K78p413j608P249K879n359
414b994j347M279k88n701J078N830l54m993k16L962j627k295L853L131n083m809
430g574M241M408k762l152L203K677m179k957M786L174l510k888K572P15k737
445c983R89M347n75n465M50M739j53m162J203M213k165n072K472N450j601l997
$$ plain form
337 -7908 -2855 1825 -1830 -2365 4109 3319 -7441 -9154 133 3867 -1502 -1258 3836 -35 -8802 -4719
353 -4719 5794 4210 -6020 -6427 644 -154 -3830 790 5449 -287 -8018 -4600 1320 -965 -2531
368 -2531 1671 2478 -5156 -6487 1509 4930 -1957 -5550 -1520 -554 -5086 -3864 3352 3484 -4076 -5583
384 -5583 -273 -539 -4030 -1255 2415 -2423 -7636 -3025 3745 981 -4491 -2428 992 -3681 -7107
399 -7107 -615 4102 -1483 -6473 -2794 771 -3234 -4300 980 1258 -6155 -7763 -514 2365 -2994
414 -2994 -4341 -62 -350 -6051 -4973 857 503 -4490 -4706 -744 -2371 -4666 -813 2318 -2765 -7574
430 -7574 -3333 1075 -1687 -4839 -1636 1041 -3138 -6095 -1309 1865 -1645 -4533 -1961 -1246 -3983
445 -3983 -2994 1353 778 -4687 -4237 502 349 -3813 -2610 1603 -562 -5634 -3162 2288 687 -3310
461c310J319K895k749k594M380L022l843l777L415L422k942j874L394J238m043
476b047j844L983K003k955n28K251k4l527J740L357p28m616J037L900r83l570
492b551K124L723k154m085J432L597j008l038K067J415k232j421L871J434l466
507b92j793L250P12l975R8M320J013m498o57L954L64l545j90K707n13l344J382
524a007L808p55l268J081K677k000k656J758K816j631k286J586K173r28j683J527
540A212M60k336r79K688J143k626m36L148K63l234o4K771K00l361l35L089M24
557B027k346J056J731j217k162J079K197k041k020K760J641k435j707K914K115
572C592l169k239K427J798k552l96K838P98k545o32K279l00k358L5K704l01k603
$$ plain form
461 -3310 -1991 904 -1845 -4439 -59 2963 -880 -4657 -1242 2180 -762 -2636 758 1996 -2047
476 -2047 -3891 92 2095 -860 -1388 863 839 -2688 -948 2409 1681 -2935 -1898 2002 1019 -2551
492 -2551 -427 3296 1142 -2943 -1511 2086 1078 -1960 107 1522 -710 -2131 1740 3174 -292
507 -292 -2085 1165 1877 -2098 -2000 2320 3333 -1165 -1822 2132 2496 -1049 -1239 1468 955 -2389 -1007
524 -1007 2801 2046 -1222 -141 2536 536 -2120 -362 2454 823 -1463 123 2296 1368 -315 1212
540 1212 1672 -664 -1643 1045 2188 -438 -874 2274 2537 -697 -761 2010 2210 -1151 -1486 1603 2027
557 2027 -319 737 2468 1251 -911 168 2365 324 -1696 1064 2705 270 -1437 1477 3592
572 3592 423 -1816 611 2409 -143 -539 2299 3097 552 -80 2199 1899 -459 -424 2280 1979 -624
589f24N92L047l75k619L40J966r60j719R89J949j292j266J339J618j585j483J690
606A607Q95k313r16K457J518k427p73J992J27k033k55K297r5k128J0K462m62k194
624b31O04K379r82l047J122K760j252k226J246J989j202j609J190J443j880j070
640g66J790Q85k247l86K573N66k797q88K467M65k272j53J844K94j611j3J588k32
658A107j506J22J065p70j367J418J230j315j229J223J351j560j255J644R24j661
674e79j018J521J131j085j421J806M06j821J3J469L93k169J83J837o9k248O05
691a046J734l50j820Q02J625j141j310J267J185j460r65J173J543j990j077J761
707f9J177j645o84J594K06j641l6J458J56j294J45J541q34j885J188J730r52j557
$$ plain form
589 -624 -32 3015 2640 21 361 2327 1367 -352 637 2586 1294 28 1367 2985 1400 -83 1607
606 1607 2502 189 -727 1730 3248 821 48 2040 2167 134 -121 2176 2081 -47 -37 2425 1963 -231
624 -231 373 2752 1770 -1277 -155 2605 1353 -873 373 2362 1160 -449 741 2184 304 -766
640 -766 1024 1909 -338 -724 1849 2415 -382 -1270 1197 1662 -610 -763 1081 1375 -236 -249 1339 1107
658 1107 -399 -277 788 18 -1349 69 1299 -16 -1245 -22 1329 -231 -1486 158 1082 -579
674 -579 -1597 -76 1055 -30 -1451 355 761 -1060 -1047 422 815 -1354 -1171 666 597 -1651 -1046
691 -1046 688 338 -1482 -680 945 -196 -1506 -239 946 -514 -1479 -306 1237 -753 -1830 -69
707 -69 1108 -537 -1221 373 579 -1062 -1098 360 516 -778 -633 908 74 -1811 -623 1107 155 -1402
725a402Q55J588j134j477R33J833j172j409J075Q75j118r32J602N73j222o59J330
742A39L47j176n31J754K44j852j92J573K46j298MJ524k66j530J16J442m48j023
760i27L34J502r87j416R77J275j015j271J378J012j334j156J189J170j454m67
776a190J522J32j676J02J538q4j757J92J759j97j585L75J588o05j327K56J223
793B66n51j002J133M58q11p00P57J107r77r87R98J131j309j010J123J369j261
810b66q62R14R21j093q28R82Q61j619j64J637O7j534K1J525m59j222L67J681n87
829C42j257K52J463n36j266O28J289j085r24J344N37q73p20R76P69j150o05J268
847D52J77j073J8P11N15r77J0J074q43n65N12M88%j238M74J313l84j386J97J300
$$ plain form
725 -1402 -547 1041 -93 -1570 -637 1196 24 -1385 -310 565 -553 -1485 117 690 -532 -1191 139
742 139 486 -690 -1221 533 777 -1075 -1267 306 552 -746 -742 782 516 -1014 -898 544 96 -927
760 -927 -593 909 -78 -1494 -517 758 -257 -1528 -150 862 -472 -1628 -439 731 -723 -1190
776 -1190 332 464 -1212 -1110 428 344 -1413 -1221 538 341 -1244 -869 719 114 -1213 -957 266
793 266 -285 -1287 -154 304 -507 -1207 -450 657 -320 -1307 -309 822 -487 -1497 -374 995 -266
810 -266 -1128 -214 707 -386 -1214 -232 629 -990 -1154 483 550 -984 -963 562 103 -1119 -752 929 342
829 342 -915 -663 800 264 -1002 -374 915 -170 -1094 250 787 -86 -806 170 939 -211 -816 452
847 452 629 -444 -426 285 800 -177 -167 907 64 -501 11 499 499 -739 -265 1048 664 -722 -525 775
867G75j41j009J16P07J43q76J98P77o61m80O93O06r63n38J003P68p61q38J123
886F42K76p76p85J034N1p27J62Q54k60r51N69M93l74q85P19O37n51p60O69L85
906D22l70k66L54M97p19j47L23N8j43r0O04k2r39L0N73J67m42k44N21K20o59N3
928b19M02J64m34j39J8%k85N04M58m23m70L68O29p18n00P06J82j42l91M03r3l0
950a0l17N87O7o26J87M74j96n33L16Q35m50o78J76L27O4l35M44l3j18k48J21L97
972D51k37k78K90J81n92J34Q03m07l29m6K67J46j13l75L19K06k89j24N91j62j54
993B82p3J17j2q7m3P46p13l17J50K64J36m99J42R7P5o67N41L56n56k93O44L71
1015F61n88j82O45j51k39k89L72L75q70O9N17j8n79K92L91m41k31Q7M21m51p1
$$ plain form
867 775 634 -375 -259 448 591 -285 -87 690 29 -451 242 848 -115 -653 350 1118 357 -481 642
886 642 918 142 -643 391 442 -285 -123 731 471 -480 89 582 208 -677 42 679 128 -632 37 422
906 422 52 -214 140 637 -82 -229 94 152 9 -81 523 501 -438 -408 165 332 -110 -354 167 387 -272 -219
928 -219 183 347 -87 -226 -208 -208 -493 11 469 46 -424 -56 573 -145 -645 61 243 101 -290 113 20 -10
950 -10 -327 260 327 -299 -112 362 166 -367 -51 784 334 -344 -168 159 223 -112 332 299 181 -67 54 451
972 451 214 -64 226 407 -185 -51 752 345 16 -30 237 383 270 -105 214 420 131 7 598 436 282
993 282 209 326 314 227 184 930 217 -100 50 314 450 -49 93 190 265 -402 139 495 -61 -354 290 661
1015 661 73 -109 536 385 146 -143 229 604 -266 -197 320 302 -277 15 406 -35 -266 -179 242 -209 -280
1036b80L17K61n39k54L82J87m8p65M31K59P3J76rk86K7l07N39k09k70o5N61j08
1058G3m29p7Q24l04k19j28J77K66q18K46L41J44n66K57M95l96k74K89M98r4p86
1079d81N14j11k84O6O99j29j85k53M15k43j43J83K30m16J09j04N39j24p93K04
1099c07N99j8m07J90M04j14m52J70J84l37k20L03Q9j56j08N11P0j92n24N67n8
1120A94o42K64J3M23n41J89M02n0o65J43N25j33m68J83L63j34k84J95J64r1j60
1141a10r7N00j02o42N73n0j94j69K98K6l87k7L08J11q0K4R0j47o1r7J51k88R2
1164b78j99K51K40m99K22N16o02J85j58O04j14l36jJ4O4n53P40o3j72k13J0o0
1186d02k64L95N3J91L98o49J86o5j76L39J68l19l80L37M73l62k70L45J42j55o4
$$ plain form
1036 -280 37 298 -241 -495 -113 74 26 -739 -308 -49 24 200 191 -95 -68 -375 164 -45 -315 -380 181 73
1058 73 -356 -433 391 87 -132 -260 -83 183 -635 -389 -48 96 -470 -213 282 -114 -388 -99 399 305 -481
1079 -481 33 -78 -362 -296 403 274 89 -164 251 8 -135 48 278 -138 -29 -133 406 282 -511 -307
1099 -307 292 274 -133 57 461 347 -105 65 249 -88 -308 -5 84 -72 -180 331 401 209 -315 252 194
1120 194 -448 -184 -171 252 -289 -100 302 252 -413 -270 255 122 -346 -163 200 66 -218 -23 141 50 -110
1141 -110 -207 293 191 -451 122 72 -122 -291 7 33 -354 -381 -73 38 -42 -18 72 -75 -136 -233 -82 -370 -278
1164 -278 -477 -226 14 -485 -263 253 -349 -164 -322 282 168 -168 -169 -155 -91 -644 96 33 -139 -352 -342 -402
1186 -402 -666 -271 -218 -27 371 -278 -92 -157 -333 6 174 -145 -525 -188 285 -77 -347 -2 140 -15 -79
1207g9k20L52q0o2N08M7o09J09J7P4j74j17L60K81n32J52K32Q7p87M53N51k92
1229B71l17M8L66k80j86K29J79n7l69J70J60j59j70P0J90m5j18K13l62L82j03
1250A12J18Pm31J55P0rK5K75j94J21k46l38N29j69O0p2J93k54j05J64J67j38k21
1273a81J97N40o49j15K77J09l31l4M95j95l21J68K43q4O0j94L21l29j94j3L69
1294A39J03n08K36K02j3l19j93K07l9j55L71J27j10j52J90N5Mj5j94K79k06p3
1316f4J16K09K7l16K00m7l2o7p5O48n34k00M97m85N50n72J21O18n59k30K45j48
1338i8mj08N08k14j30J20j50J35j86K47j51L28k71L23m6m44k96N05J85lk12p1
1360c3M4K35m96J85n2J10R4l6j01K04J65l41J82k89K62J18j36p8j4P4J15k28j78
$$ plain form
1207 -79 -299 53 -27 -89 419 466 -143 -34 -17 57 -117 -234 126 407 -125 27 259 346 -441 12 563 271
1229 271 -46 2 368 88 -98 131 310 253 -116 54 214 55 -115 -45 145 100 -18 195 -167 215 112
1250 112 230 237 -194 -39 31 22 47 322 128 249 3 -335 194 25 85 13 206 -48 -153 11 178 40 -181
1273 -181 16 556 -93 -208 69 178 -153 -187 308 113 -208 -40 203 119 179 -15 306 -23 -217 -230 139
1294 139 242 -266 -30 172 159 -160 -353 -146 -185 -340 31 158 48 -104 86 141 145 130 -64 215 9 -64
1316 -64 52 261 288 -28 172 125 93 26 -49 599 65 -135 362 -123 427 -145 -24 594 35 -195 50 -98
1338 -98 -102 -210 298 84 -46 74 -76 59 -127 120 -31 297 26 349 303 -141 -437 68 253 250 38 -33
1360 -33 11 246 -250 -65 -117 -7 87 51 -50 154 319 -22 160 -129 133 251 115 37 23 97 212 -16 -194
1383a94J62Q0k65M51K9l08k01N13p7l30L3Q9J1K58l12R5%P6n5P8m32K09j56L21
1407G5n7l73J92M6N0k3L72k34J98l75J16L01m13O5J29k12Q0J9j37q1K61k03M6
1430a58J27j24n6j89O32j11m34M73k61N9J97j01k94M19j00j41j56J13K74j40L83
1451D12n90K95J26o5l50l1N01m67o6N06m86J31L65j19J53j89q4j09k54L57O0q9
1473GN7j56J47R2j24J11k16J81j3j18rJ68k51K1n5M05l32J22M0m24K64Q9K01k68
1497f1j85K57j52k42l8K96P7j88J13M44k07o0j80j91M59k91J13K62l67j4J10J12
1519F7L0q1k14j3J33k60J1N15k70L5l9L02k36k09J34J39j56J35k07L54j17k27
1541a74L07k27m75N19J8J64K5M4j66k41R2J31J9k8j66k30K87J06K01k85K11n03
$$ plain form
1383 -194 -32 48 -217 234 263 -45 -246 267 190 -140 -107 -18 -7 251 -61 34 34 110 55 133 -299 -90 -246 75
1407 75 18 -355 -163 -117 -67 -90 282 48 246 -129 -13 288 -125 -60 69 -143 -63 -44 -181 -262 -1 -204 -158
1430 -158 -31 -155 -211 -400 232 121 -313 160 -101 -42 155 54 -240 179 79 -62 -218 -105 169 29 412
1451 412 -178 117 243 178 -172 -203 298 -169 -235 271 -215 -84 281 162 315 126 42 -67 -321 36 96 7
1473 7 64 -92 55 147 23 134 -82 99 86 -32 -41 127 -124 -103 -158 247 -85 37 77 -347 -83 6 207 -61
1497 -61 -246 11 -141 -383 -421 -125 -48 -236 -123 321 114 54 -126 -317 142 -149 -36 226 -141 -155 -45 67
1519 67 97 16 -198 -211 -78 -338 -327 188 -82 -47 -86 216 -20 -229 -95 44 -112 23 -184 170 53 -174
1541 -174 133 -94 -569 -50 -32 132 157 201 35 -206 -114 17 36 8 -158 -388 -101 5 206 -79 132 -371
1563c71L51j51R8J57l83M42N1l34j39M36j50O7K16m60J07j81L47l13l7J23o5L78
1585A89p8j69j69P5k0K06Q1N1J78n92L25o1J9j72L83j27m20M49m2k7p8k5j62p7
1609b63K93M6k54K03N0j35j80K41L76j89j24j12K23k52k46O41o05J74N07l86K72
1630B80j89m38L74o6O4J68j2k96j41N18m53oK46O5J27j93O5J51k92Q8k2n1J24
1653A11J67r1j55M5q0J68p2r9Q7o4OK17j75Jj10O8k36P5M03k34J65Q7m27K41o8
1678C0J14j77k6J00J26q2k45K52j09j51L92l52o6J57J30p9L7n9P8j27k43J35o5
1701b30L56J1J52k53K9m8l16O30p5j91k02M57n30J93J89J79l58j3P5L9j85l2L91
1724B68m24K87l02J59J3J43k76J20j36OK40j57K12l8P9n6j12p0o6j1N2J71k17
$$ plain form
1563 -371 -20 -171 -73 84 -299 143 194 -140 -279 157 7 74 290 -170 -63 -244 103 -210 -247 -124 -189 189
1585 189 111 -58 -227 -152 -172 34 115 166 344 -248 77 16 35 -137 246 119 -301 148 106 79 1 -24 -186 -263
1609 -263 30 76 -178 25 75 -60 -240 1 377 188 64 -48 175 -77 -323 318 -287 -113 394 8 280
1630 280 91 -347 27 -39 25 193 181 -115 -256 262 -191 -197 49 114 241 48 113 264 -28 60 38 -13 111
1653 111 278 187 32 77 -3 165 93 -6 81 17 23 240 65 66 -44 24 -212 -137 266 32 197 284 -143 98 30
1678 30 144 -33 -59 41 167 85 -160 92 -17 -168 224 -128 -194 -37 93 14 51 -8 70 -57 -300 -165 -230
1701 -230 126 137 289 36 65 17 -299 331 256 65 -137 320 -210 -17 172 351 -7 -20 55 94 -91 -123 268
1724 268 -156 131 -171 -12 1 144 -132 -12 -148 -142 98 -59 153 115 194 138 26 -44 -110 -121 -69 102 -115
1747a15Q6N4kqj63M34k29RJ16k91K68j24J1J20j70m32M60M7l89L90m83L02j70
1770b79K82R7o6O4q7j7p1R8k06JJ29j25M39n8o32K38j58K17j16M50p6j02r7N7
1794a8j11j37J08L61n2j84L9l28L15j01l6K00m7K23k76O1j39q5Q7L09l37K02j40
1817h6KJ33l0j40M05P2m64J2o8L53k58J6k41N75n8q5k27nQ6J54m58Q8M25k73J91
1842A19m7Q9q4k06m4J07J85N9m75N15j09Jm38L22j73j65M07k2k43J90K64m95J85
1865e8K73l86J23j05kr1j24M79l01L61j61j4q8k05M19K7k57k18K26J83J1J31n0
1888A73nL26m10j39j81K74J67K7m33L51m36K31K43k46mK08k88J11k0j1K45j93
1910a0J60l48M93j76j95j82K62P3k87N28l69k52N08j15k76J03j54J66J15l46J38
$$ plain form
1747 -115 -29 25 23 15 -148 286 57 66 182 -109 159 35 46 166 -4 -436 24 71 -318 72 -411 -109 -279
1770 -279 3 100 34 98 11 -6 -77 21 -185 -184 -55 -180 259 201 -431 -193 -351 -134 -250 200 124 22 -75 -18
1794 -18 -129 -266 -158 203 151 -33 6 -322 -7 -108 -144 56 9 232 -44 17 -122 -207 -120 189 -148 54 -86
1817 -86 -84 49 19 -121 284 356 -108 -96 -164 189 -69 -53 -294 281 223 138 -89 -94 -8 146 -312 -224 201 -72 119
1842 119 72 161 77 -129 -173 -66 119 178 -297 218 109 110 -328 -6 -179 -344 63 41 -202 -12 252 -243 -58
1865 -58 215 -171 -48 -153 -155 -246 -370 109 -192 169 8 -6 -94 -299 120 147 -110 -328 -102 81 92 223 173
1888 173 168 494 84 -55 -236 38 205 232 -201 150 -286 -55 188 -58 -62 146 -142 -31 -51 -62 183 -10
1910 -10 150 -198 295 119 -76 -258 4 77 -210 318 -51 -303 205 90 -186 -83 -237 -71 44 -302 -164
1931a64j95L56J04N7o4j32p4J7J1J72j05p1k69M49j02L29n8q1k42j21J10J21K18
1954B66k53l5L69m76lM3J42q0J03o0m0O7j36K66m86K95j38L9L55r7n34K15N81
1977D03k23k70N0q9M94m72J39j37j77q6Q95m16k77K88P6k91R2M5k84L60J5k01
1999f6j2P3K77m08k0L09k29M17k38K61m50L7J79j13R1J10l59L97n47J70L12j06
2021H5J09M2l50K4j95J07J64j58L06K0j22Q8j29J09k13J82K30j38J75l97K9L59
2043C27m43q7K00K12j20j70M44m56j09N24l36j30M19k20r2j08N0m28O31q7k27
2064b06K51L3j89M35m62m9L35l76J92J11K7j47J3K63n00N65l14j65k5Q9J32J53
2086A66k03m0N6L02m74J98k47N13l61P1k3j2LJ68j81j12K56k76J86R6J5j65K22
$$ plain form
1931 -164 -359 -3 101 158 94 -38 -112 -95 -84 88 -17 -88 -357 92 -10 319 261 180 -62 -183 -73 48 266
1954 266 13 -22 347 -129 -132 -89 53 -27 76 16 -24 43 -93 173 -313 -18 -156 -117 238 141 -393 -178 403
1977 403 180 -90 -40 -129 365 -107 32 -105 -282 -368 527 111 -166 122 198 -93 -1 44 -240 120 135 -66
1999 -66 -78 -5 272 -136 -156 153 -76 341 103 364 -86 -49 130 17 108 218 -141 256 -291 -121 191 85
2021 85 194 236 -114 -90 -285 -178 -14 -172 134 154 32 120 -9 100 -113 69 299 161 336 -61 -32 327
2043 327 -116 -203 -3 209 89 -81 363 -93 -202 322 -14 -144 275 55 -37 -145 -95 -523 108 21 -206
2064 -206 45 78 -111 324 -138 -187 148 -228 -36 75 102 -45 -32 231 -269 296 -18 -183 -208 -119 13 166
2086 166 -37 -77 -21 281 -193 5 -242 271 -90 -19 -42 -54 -51 117 -64 -176 80 -196 -10 86 101 -64 158
2109A58kL8k67K05l03J86J18M4j77J36k54k28L66J9j81N11l17k14K30J0k74K00
2131DN3j76J15J4o1J23n7l8J6K21j57k52L06k26M16n30K52nJ29j40J52j17N2l03
2155b09J37J39j04J99j2Q5J20k82K2K24m34R8J35k16q6J22L84m46j95K84j10m
2177a49K28o4J11m35J09J89j39L78k20l1J1m02M78n5j5j07J69M1k23j56L06m4
2199b0J82m01M14o2j72N3n3P7N0M03j65l64J25M9k84K78k89K45J36N0l43l39N35
2222A05k54P9K88l49N9l0m1M42k49l48L86Ql05N71l53k28K70q4j02o9l0M11l03
2245a26K19k5K2j20L34n61K36J33l41L38j68Q9K1j31O4j7J02J87m53m6K18j33
2267a58P4K12M0o2J2m38M67k46o5J80m0K04k33q4L05j38k1J2k18K88k25j39L65
$$ plain form
2109 158 156 194 -73 132 -171 15 133 177 0 136 -118 -346 20 39 -142 369 52 -162 68 78 -196 4
2131 4 57 -119 -4 10 -51 72 15 -23 -7 214 57 -195 111 -115 301 -229 23 18 147 7 159 42 94 -209
2155 -209 -72 67 -37 162 150 235 355 73 95 319 -115 -17 118 -98 -184 -62 322 -124 -319 -35 -145 -149
2177 -149 79 15 126 -309 -200 -11 -150 228 8 -23 -12 -414 64 9 -6 -113 56 97 -126 -282 24 -20
2199 -20 162 -239 175 113 -59 -6 -59 18 68 471 306 -58 67 116 -168 110 -179 66 202 252 -91 -430 105
2222 105 -149 -70 218 -131 -72 -102 -143 299 50 -298 88 96 -209 362 9 -219 51 -33 -135 -204 -234 177 -126
2245 -126 93 68 90 -30 304 -257 -21 112 -229 109 -59 30 51 -80 -16 -33 69 256 -197 -243 -25 -158
2267 -158 -84 128 168 106 118 -320 147 -99 -164 16 -24 180 -53 -137 168 30 9 21 -197 91 -134 -273 92
2290I2p1k88J96K92k47j7K17J99k07J75j99k64L72l14J06o9L55m15J79j22j8R7
2312D9q0m1Jk28L67Ll31m3J46K94k87K9L33j09q5K11j87n7K53k91N5K2j8L71l34
2337D3N9j7J05o71O19m00M46k51M17k37n7m55K49P3j62j10L23O0j8J80j06K1n
2360A06J32j12o3k14J73J07k75J47M7J48j65l03M64k20L16l66P4P2j88J66k27
2381a81L52k85mJ39N7k87K51k07N67n44N3j66N30j08k56K73J15k61L58k41l53
2402a98K92J5j59O0J82k62K97q4L7m11L32M2n1j44K00j34K4J89J3l11j69J52j88
2425b76L71l19J96J53J1k00K58q8l5k81L23j01N9N9m58L52j19k82L30J96m09L14
2447E4Q7k2k58k4k8K11j49K87l74J76O0K68k41j95Q6K05j16J9j8l13J51P0L08
$$ plain form
2290 92 21 -267 -71 221 -26 -43 174 373 166 341 142 -122 250 -64 42 -27 328 -87 92 -30 -48 49
2312 49 -31 -72 -71 -299 68 71 -260 -303 -157 137 -150 -121 212 103 18 229 42 -15 238 -53 2 24 6 377 43
2337 43 102 85 190 -481 138 -262 184 -67 350 113 56 -399 -150 -77 -239 -349 -26 34 16 196 90 111 106
2360 106 238 126 63 -151 22 129 -146 1 48 196 31 -272 192 -28 288 -78 -4 68 -120 46 -181
2381 -181 171 -114 -118 21 78 -209 42 -165 402 -142 -89 -255 275 167 -89 184 299 38 396 155 -198
2402 -198 94 109 -50 10 192 -70 227 143 180 -231 101 143 92 -52 148 14 38 227 240 -71 -240 -88 -276
2425 -276 95 -224 -28 125 136 -64 194 106 71 -210 113 12 71 130 -328 24 -95 -377 -47 149 -260 54
2447 54 141 119 -139 -163 -191 20 -129 158 -216 -40 20 288 47 -148 -62 143 27 46 28 -285 -134 -64 244
2470B44l28J78k14K95J20q8q9j69K86l15o4J06K38q6k17J21q9p6M1K26q1j4q0
2493e5L68j84k77L72p6l56J16K5j93L65j33K57k38k35K76j88j11J39O7J16j27
2514g2L10k22oK13k68P5l02M37l58K78k66K01j69J06M3k4j03K84J79n77L25m27
2536c43N20l40L0J81p13M38m2r6L36J07K31m50j31K72j41J4K31K1J86k30k18O4
2558g3K39l32L15l52J3m8J34J92L9j42R8j15J15l8P2j10p1j15R3Q7R1q6L7k94
2582b51K23K19m3j17k47K61l77L44JJ99p8j51K32J29j22n1k1m17N50l05K8k0J14
2605A00o9J82k83L67l08j24L80l38K4L02j54j63J65N8j37j51r3K56K06Rl43K45
2627A31j40M0j23k26K11J75K28o2m17K56N3m1L06o68L23qR9K44r5l44m7j57J48
$$ plain form
2470 244 -84 94 -120 175 295 207 118 -51 235 -80 -144 -38 200 114 -103 18 -71 -147 -106 120 39 25 -55
2493 -55 313 129 -148 224 148 -208 -92 -67 -260 105 -28 229 -9 -244 32 -156 -267 -128 -61 55 -72
2514 -72 238 16 10 223 -45 30 -272 165 -193 85 -181 20 -149 -43 0 -24 -127 157 336 -241 84 -343
2536 -343 177 -163 -133 48 -665 -227 -269 -365 -29 78 309 -141 -272 0 -141 -127 104 125 311 81 -137 -73
2558 -73 166 -166 149 -203 -190 -238 -104 88 127 -15 83 -32 83 45 117 7 -64 -179 -86 1 92 6 43 -251
2582 -251 -28 191 148 31 -216 45 -332 12 13 212 134 -17 215 344 222 171 150 -267 283 -22 6 -14 100
2605 100 31 213 -70 297 -11 -135 245 -93 -69 233 79 -84 81 139 2 -149 -242 14 220 229 -114 131
2627 131 -9 31 -92 -318 -107 68 296 234 -183 73 126 85 391 -277 46 38 137 381 286 -58 -105 -262 -114
2650a14L73k44J63j7J54k75m1J5j35P6m0R6m7R4n0J09k60L53j51j85K18K6nL4
2674A47j02j79K80l66L13k3K76n12N1K04K05l50n6K98K17k82k03J59L42n65m9
2695a95K68k08Q9r9K10m2m1K98l17K87l80j62K79K08O0o7K74l41k24J98K12j7
2717B90k14Pm35L76J50l86M51j67J82o07K14J15K2J89k02L65k18l4l67M51r6J67
2739B53j19Mk10L21m62O30l64q5j75o5K67L9J4k93L68k73L35j22Q6J21l68L9J62
2762A03k41n2j1J62K15m10K43R5p5r0m4q3K87J30p8k20L68m22L60k38J97N1n0
2785A97j85j02K08J25m78K95M6j89L75n70K25J24q8L19l35J06j10J10J52q5j70
2806c0K3K33m71K36Q9k32K21k96L46J49l60J58N1n5o1J27J48k15M5k89L22Q1k79
$$ plain form
2650 -114 259 15 178 161 315 40 -1 14 -121 -45 -85 11 -36 58 8 117 -143 210 59 -126 92 118 113 147
2674 147 45 -134 146 -220 93 70 346 -166 -115 89 294 -56 -112 186 403 121 -82 77 419 -146 -195
2695 -195 73 -135 -46 -145 65 23 -18 280 -37 250 -130 -292 -13 195 255 188 462 121 -103 95 307 290
2717 290 76 83 -352 24 174 -212 239 72 254 -353 -139 -24 -2 187 -15 350 132 98 -269 182 86 253
2739 253 134 138 -72 249 -213 417 53 -32 -207 -272 -5 34 48 -245 123 -150 185 63 149 270 -98 -59 103
2762 103 -138 -190 -201 -39 176 -234 9 104 29 -61 -105 -188 99 229 151 -69 299 -123 237 -1 196 247 197
2785 197 12 -90 118 243 -235 60 106 -83 292 -278 -53 71 -17 302 -33 73 -37 73 225 140 -30
2806 -30 -7 226 -245 -9 80 -152 69 -227 119 268 -92 66 117 62 1 128 276 61 106 -183 139 220 -59
2829e9K37m32O3J42K0j19Q4K31k06K35l64J11J53q2O71n16l92P6j97J89J30M4
2851A9o7K53k94M3j04mJ68k57N09M5k74j00J93J51j90k70M48k36J0J13k63L73
2873B66k59j77J21J15j58J98m9k53L67J19k84q2K11Q4m1l73M31n36N61m37K84
2894A08j76Rq3q1M91l43K41l61L00j62J98k25J6Q5K18j2k3k22J41q0j33J37J30
2917A73k66M0O1J80j74l4n2J55m7MO3k0p9K87m33K42k32L11k70K40j46O7n3KO0
2942G9j36k59J92J09m6K6j84K14p6R9j30J07p5M6k46K72L89l84k1L06j45r1K09
2965B55k66r3K86k2m34L54k27J69k7N2qn2k05N8K03O6k04L83l66M4J52j01R4k80
2989a69L03j06O7j70J71q5k31L83j77J25j90k07M43k98j93K19J9j46L48L3m05
$$ plain form
2829 -59 178 -254 -191 -49 -29 -148 -64 167 -39 196 -168 -57 96 14 685 169 -223 -147 -344 -155 -25 19
2851 19 -48 205 -89 -46 -150 -154 14 -243 266 311 37 -63 130 281 91 -179 269 33 43 156 -107 266
2873 266 7 -170 -49 66 -92 106 57 -196 171 290 6 -76 135 219 178 -195 236 -300 261 -176 108
2894 108 -68 -59 -142 -223 268 -75 166 -195 105 -57 141 -84 -68 17 235 223 200 -22 119 39 -94 43 173
2917 173 -93 -53 8 188 14 -20 -72 83 36 40 103 83 4 291 -142 100 -132 179 -91 149 3 70 17 19 79
2942 79 -57 -316 -124 -15 -61 -35 -219 -5 -81 18 -112 -5 -80 -34 -280 -8 381 -3 -24 282 137 46 255
2965 255 -11 -104 182 160 -274 80 -147 22 -5 47 39 -13 -218 -160 43 109 -95 288 -78 -34 118 17 111 -169
2989 -169 134 28 95 -75 96 11 -220 163 -14 111 -79 -286 157 -141 -334 -115 -96 -242 106 139 -266
3010b66Q6M23j93km0n1o4J0j16L51k93K4K23J30l93K29j36j82N79m81N2J65j93
3033a38L8pJ58j30k8K51p8K7Kj25P4L4K1k32J71Q0m94P9M92r0j81J80o8Mj4j60
3059a34J51j1o2r3L11l86K77n3r3j37R0k9L19l89J86N59m77p5J65k3j53O2K31
3082B36k63k8l3J98j05k0J16l7N3j02L03j70k3l14J60n4K88j66k85K61k36M46
3104B25p6j97P0j79K69J25l45k76M87j42K04j4l55L88j19N5J67l39L0K90m70K55
3126E3k58K86j42k2J97o7j02L7L65l67j07l60L09K11J42Qk93R2J62k07J9L43j94
3149A05j77L8Oj31k76L31J43k5j64N8P1k57J13R6M78p66L09J78k70L79j89K7k5
3172E2O7l3n9K76l25j8K5K39l12J85j08j91J52j76M2J02J27k43K43J76j65K7m
$$ plain form
3010 -266 -180 243 50 48 8 -43 -107 -97 -213 138 -155 -131 92 222 -171 58 -78 -260 319 -162 -110 55 -138
3033 -138 -100 -107 51 -79 -107 144 66 93 95 -30 44 78 99 -133 38 118 -376 -297 195 105 -76 104 36 40 26 -134
3059 -134 17 6 -56 -149 162 -224 53 0 -93 -230 -140 -169 150 -239 -53 506 29 -46 119 96 -57 5 236
3082 236 -27 -55 -88 110 5 -15 101 64 117 15 318 148 125 -189 -29 -83 205 39 -246 15 -221 225
3104 225 149 -48 22 -157 112 237 -108 -384 103 -39 165 151 -204 184 65 120 287 -52 -22 268 -202 53
3126 53 -205 81 -61 -83 114 47 -55 -18 347 -20 -127 -487 -178 33 175 183 -110 -18 144 -63 -44 299 105
3149 105 -72 -34 -28 -159 -435 -104 39 14 -150 -92 -21 -278 -165 -69 409 -357 -48 130 -140 239 50 77 52
3172 52 119 86 27 303 -22 -40 -15 224 -88 97 -11 -202 -50 -226 -184 -82 45 -198 45 221 56 83 79
3195G9J87m71k8N23n00M80p24P65j49k37K10J56j85j38L70m1k89J91K3l04K12
3216A30l10M56k83K2j88K55kj44K47j1r4l16J84M02l79j25M26n04K71j37K91k96
3238a05L51j95J58j32j72J35k81J84J73j01j29O7k8j4j11J05o7K90r3l2Jl4j78
3261b08l5J79J32J5j69P8m26O20j35l98N21j49m5P4kj72k8N41k41k5K06l55l9
3284f1J96J52m66J35j06oK44j99m0O4P6pJ11M8l3l3l20k8N89p01M19N7o2L07l90
3309e4J01n1K45k36K0K5l0R3k40L35k65R5p8p4p1L52j35j80K47o0m9Qr6l4o4O9
3335a27J80k60J96J53K21m36J55l40K26qK21l72J57m3k2j32L26K53m61L68k21
3356C4j92N16n72M71m00J7J73k74L30P2j26j2l3O1k16j12J63J08J46k06NRJ0L33
$$ plain form
3195 79 266 -205 -233 290 -210 270 -454 311 162 -75 135 291 106 -32 338 297 8 199 222 -82 130
3216 130 -180 276 -7 15 -173 82 80 -64 183 172 78 -238 -54 348 -31 -156 270 -234 37 -100 191 -105
3238 -105 246 51 209 77 -95 40 -241 -57 116 15 -114 -47 -75 -89 -200 -95 -162 128 35 3 4 -30 -208
3261 -208 -243 -64 68 83 -86 -8 -434 186 51 -347 174 25 -20 54 52 -120 -148 393 152 127 333 -22 -61
3284 -61 135 287 -179 -44 -150 -156 88 -111 -151 -87 -11 -18 93 141 108 75 -245 -273 316 -385 34 91 29 336 -54
3309 -54 47 -4 241 5 25 50 20 113 -127 208 -57 38 -40 -114 -185 167 32 -148 99 39 -10 -2 -98 -132 -196 -127
3335 -127 53 -207 -11 142 363 -73 82 -258 -32 -40 181 -191 -34 -77 -99 -231 95 348 -113 255 34
3356 34 -158 358 -214 257 -143 -126 47 -227 103 175 49 37 4 65 -151 -263 -100 8 154 -52 -47 -38 -28 305
3380C05j17J1n5l37K50R3j91K21n72M37k98L03o5Q3j08K36m08R9Q0j1j74J31k
3403h9J18Jo0m7L7K2n5R1l02L83j57M4j18K94k53j05M24j87j89m8L18k91K15r
3427C7j38K32j26K07k2k19M3j76N48l92J35j49j70jJ80L8j91L54j1k6n2j66J8
3450d7j25L1L36L4j8m63L60j72J30l31J77l84M65n8j17J50P7M3j48k4J16K0j62
3473a10P6L23k7m03M41l77Q5n9K21m0L5j9j92R3L1k43K16Q3o4j52K04Q9l56PL66
3498B28k22J73k13L5r4J09O4j20J16m00J77L61k38k7J2NL37n25J97mJ36j24J72
3521A55l11J64p3m3M4k9j46L14K02k39L1J35j59j2J04k2l07J95n2K47k74K27m8
3544A03k8r2o0K95l12J60L02l46o7L07m67L67r9o0J89k20j01J19N4N0O0j74J46
$$ plain form
3380 305 188 199 144 -193 57 150 -41 180 -392 45 -253 50 -15 68 -40 196 -212 -113 -33 -44 -218 -87 -89
3403 -89 29 30 -30 -77 -40 -18 -73 18 -284 99 -58 -14 -132 162 -91 -196 228 41 -148 -196 122 -169 46 37
3427 37 -101 131 5 212 190 -29 14 -162 386 -6 129 -20 -190 -191 -11 27 -164 190 179 153 101 -65 -47
3450 -47 -172 -141 195 229 211 -252 108 -64 66 -265 -88 -472 -7 -65 -182 -32 45 88 -60 -84 32 52 -110
3473 -110 -34 289 262 -141 300 -77 8 -51 170 130 165 146 -46 47 78 -165 51 134 70 -82 122 211 -145 -138 228
3498 228 6 179 -34 1 -93 16 80 -40 76 -324 -147 214 -24 -51 -39 -34 303 -222 -25 -29 107 -17 155
3521 155 -156 8 -65 -108 -64 -93 -239 75 277 38 69 204 45 33 137 115 -192 3 -49 198 -76 151 103
3544 103 75 -17 -77 218 -94 66 368 22 -45 262 -205 162 63 3 192 -28 -129 -10 44 94 154 -20 126
3567A26J0j28N6J01j71n02Q87l23pk0j27J19J06k89K04J02l72K33k40J6M43j80
3589D4p9p4J02r3j96N8J53J95ko2J95k71K7l91N45n28N4N43l40qk8L12n57L22
3613g9M54j67p2J5k61J67m5K5k29L20K23k94K56m19J47j68Q6P9p4j02K44kk58
3636a54j20Q1jM59l7l03l90N05r3J41p5P7r2J69j37M1k25l3K11j40K13k80K43
3659F0M7L1l00l8J76j4q3K64j94k1Q4K56m5m42J34lJ10j60J84K55n20J54R7l21
3683b89K79O3J9J35l95K05o5k39L57K83n68N0O3K49n0o8Lm18N34k74JJ26J34j12
3707B3j71J32J87r0k07J75L8l00K30o1K20l51K12k9k95J76R2J27l97L47K31m11
3729a22j40K99j32O4M40j97j31j3K1j3j38K09l7j3o8k46L01j79J92j13j8j01L40
$$ plain form
3567 126 136 8 64 165 -6 -508 379 56 49 29 -98 21 127 -162 42 144 -228 5 -235 -219 224 44
3589 44 -35 -109 -7 -100 -296 -238 -85 110 108 46 241 -30 -3 -394 151 -377 -323 220 -120 -128 -156 156 -401 -79
3613 -79 375 208 136 151 -110 57 12 37 -192 128 351 57 313 -106 41 -127 -41 38 -36 -138 106 104 -154
3636 -154 -274 -193 -194 265 228 -75 -465 40 -53 88 13 90 -2 167 30 71 -154 -187 24 -116 97 -183 60
3659 60 107 138 -162 -200 -24 -38 -121 143 -51 -72 12 268 223 -219 -85 -88 22 -138 46 301 -219 -65 32 -289
3683 -289 -10 53 72 207 -188 17 -48 -287 70 353 -215 -165 -102 147 97 29 32 -386 148 -126 -125 1 135 23
3707 23 -148 -16 171 81 -126 49 87 -213 17 -44 176 -175 37 8 -287 -111 -19 108 -289 58 289 -122
3729 -122 -262 37 -95 -31 409 212 81 68 89 76 -62 147 110 97 29 -217 84 -95 97 -16 -34 -135 205
3752B05m74K49j4L1RM1K6L20l28n4K6j68k36N34K3o7O5l45K18N3j23j74L39k60
3776a04K4Q3J96j83l11K0L1p9P2J05J49j62m7K79jj29LP5NJ20k15l3m9M10l52
3801i3K68p8l0k42m9P8K27l07L21P7j86j88L19j84l8M25O9l8l82M13n88J37M49
$$ plain form
3752 205 -269 -20 -34 -3 6 47 73 393 65 11 37 -131 -367 167 190 123 188 -157 61 114 -9 -183 156 -104
3776 -104 -80 3 199 16 -295 -275 -244 -323 -251 -146 3 -159 -206 73 72 -57 -54 21 26 146 -69 -102 -151 259 -93
3801 -93 175 97 67 -175 -224 -146 81 -226 95 172 -14 -202 117 -67 -105 320 389 351 -31 382 -206 -69 380
$$ [...]
8191A91
##END NTUPLES=NMR FID
##END=
