##TITLE=1H_DE-78_oil3TFA
 CDCl3
 8 sc, 
 25.11.2024
##JCAMPDX= 6.0         $$ Bruker NMR JCAMP-DX V2.0
##DATA TYPE= NMR FID
##DATA CLASS= NTUPLES
##ORIGIN= UXNMR, Bruker Analytische Messtechnik GmbH
##OWNER= root
$$ XWIN-NMR		Version 3.5
$$ Mon Nov 25 16:16:17 2024 Russian Standard Time (UT+4h)  she@DPX200
##.OBSERVE FREQUENCY= 200.1315
##.OBSERVE NUCLEUS= ^1H
##.DELAY= (6, 6)
##.ACQUISITION MODE= SIMULTANEOUS
##.ACQUISITION SCHEME= undefined
##.AVERAGES= 8
##.DIGITISER RES= 18
##SPECTROMETER/DATA SYSTEM= spect
##.PULSE SEQUENCE= zg30
##.SOLVENT NAME= D2O
##.SHIFT REFERENCE= (INTERNAL, D2O, 0, 15.7039)
##AUDIT TRAIL= $$ (NUMBER, WHEN, WHO, WHERE, WHAT)
$$ ##TITLE= Audit trail, XWIN-NMR		Version 3.5
$$ ##JCAMPDX= 5.01
$$ ##ORIGIN= Bruker BioSpin GmbH
$$ ##OWNER= she
$$ F:/spectra/data/she/nmr/H-F/1/audita.txt
$$ ##AUDIT TRAIL=  $$ (NUMBER, WHEN, WHO, WHERE, WHAT)
(   1,<2024-11-25 16:14:58.95 +0400>,<she>,<DPX200>,
      <created by zg, POWCHK disabled, PULCHK disabled
       configuration hash MD5:
       00 E9 B6 7A A2 85 ED C7 34 08 36 98 17 FE 4E 26
       data hash MD5: 16K
       98 08 CD 79 62 D7 CA AC 07 28 B0 9F 32 C4 CD A5>)
$$ ##END=
$$ 
$$ hash MD5
$$ F2 91 56 1B 3F 97 81 52 3A 31 DB 35 D0 4C 43 74
##$RELAX= 
##$RELAX= 
##$RELAX= 
##$RELAX= 
##$RELAX= 
##$RELAX= 
$$ Bruker specific parameters
$$ --------------------------
##$DU= <F:/spectra>
##$EXPNO= 1
##$NAME= <H-F>
##$PROCNO= 1
##$TYPE= <nmr>
##$USER= <she>
##$AMP= (0..31)
100 100 100 100 100 100 100 100 100 100 100 100 100 100 100 100 100 100 
100 100 100 100 100 100 100 100 100 100 100 100 100 100 
##$AQSEQ= 0
##$AQ_mod= 1
##$AUNM= <au_zg>
##$AUTOPOS= <>
##$BF1= 200.13
##$BF2= 200.13
##$BF3= 200.13
##$BF4= 200.13
##$BF5= 200.13
##$BF6= 200.13
##$BF7= 200.13
##$BF8= 200.13
##$BYTORDA= 1
##$CFDGTYP= 0
##$CFRGTYP= 5
##$CHEMSTR= <none>
##$CNST= (0..31)
1 1 145 1 1 1 1 1 1 1 1 1 1 1 1 1 1 1 1 1 1 1 1 1 1 1 1 1 1 1 1 1 
##$CPDPRG= <>
##$CPDPRG1= <>
##$CPDPRG2= <>
##$CPDPRG3= <>
##$CPDPRG4= <mlev>
##$CPDPRG5= <mlev>
##$CPDPRG6= <mlev>
##$CPDPRG7= <mlev>
##$CPDPRG8= <mlev>
##$CPDPRGB= <>
##$CPDPRGT= <>
##$D= (0..31)
0 1.2 0 0 0 0 0 0 0 0.06 0 0.03 0 0 0 0 0.0002 0 0 0 0 0 0 0 0 0 0 0 0 
0 0 0 
##$DATE= 1732536898
##$DBL= (0..7)
120 120 120 120 120 120 120 120 
##$DBP= (0..7)
150 150 150 150 150 150 150 150 
##$DBP07= 0
##$DBPNAM0= <>
##$DBPNAM1= <>
##$DBPNAM2= <>
##$DBPNAM3= <>
##$DBPNAM4= <>
##$DBPNAM5= <>
##$DBPNAM6= <>
##$DBPNAM7= <>
##$DBPOAL= (0..7)
0.5 0.5 0.5 0.5 0.5 0.5 0.5 0.5 
##$DBPOFFS= (0..7)
0 0 0 0 0 0 0 0 
##$DE= 6
##$DECBNUC= <off>
##$DECIM= 24
##$DECNUC= <off>
##$DECSTAT= 4
##$DIGMOD= 1
##$DIGTYP= 9
##$DL= (0..7)
0 120 120 120 120 120 120 120 
##$DP= (0..7)
150 150 150 150 150 150 150 150 
##$DP07= 0
##$DPNAME0= <>
##$DPNAME1= <>
##$DPNAME2= <>
##$DPNAME3= <>
##$DPNAME4= <>
##$DPNAME5= <>
##$DPNAME6= <>
##$DPNAME7= <>
##$DPOAL= (0..7)
0.5 0.5 0.5 0.5 0.5 0.5 0.5 0.5 
##$DPOFFS= (0..7)
0 0 0 0 0 0 0 0 
##$DQDMODE= 0
##$DR= 18
##$DS= 0
##$DSLIST= <SSSSSSSSSSSSSSS>
$$ [...]
##$SUBNAM2= <"">
##$SUBNAM3= <"">
##$SUBNAM4= <"">
##$SUBNAM5= <"">
##$SUBNAM6= <"">
##$SUBNAM7= <"">
##$SUBNAM8= <"">
##$SUBNAM9= <"">
##$SW= 24.0689530833862
##$SWIBOX= (0..15)
0 0 2 0 0 0 0 0 0 0 0 0 0 0 0 0 
##$SW_h= 4816.95568400771
##$TD= 16384
##$TD0= 1
##$TE= 0
##$TE2= 300
##$TE3= 300
##$TEG= 300
##$TL= (0..7)
0 120 120 120 120 120 120 120 
##$TP= (0..7)
150 150 150 150 150 150 150 150 
##$TP07= 0
##$TPNAME0= <>
##$TPNAME1= <>
##$TPNAME2= <>
##$TPNAME3= <>
##$TPNAME4= <>
##$TPNAME5= <>
##$TPNAME6= <>
##$TPNAME7= <>
##$TPOAL= (0..7)
0.5 0.5 0.5 0.5 0.5 0.5 0.5 0.5 
##$TPOFFS= (0..7)
0 0 0 0 0 0 0 0 
##$TUNHIN= 0
##$TUNHOUT= 0
##$TUNXOUT= 0
##$USERA1= <user>
##$USERA2= <user>
##$USERA3= <user>
##$USERA4= <user>
##$USERA5= <user>
##$V9= 5
##$VALIST= <valist>
##$VCLIST= <CCCCCCCCCCCCCCC>
##$VD= 0
##$VDLIST= <DDDDDDDDDDDDDDD>
##$VPLIST= <PPPPPPPPPPPPPPP>
##$VTLIST= <TTTTTTTTTTTTTTT>
##$WBST= 1024
##$WBSW= 4
##$XGAIN= (0..3)
0 0 0 0 
##$XL= 0
##$YL= 0
##$YMAX_a= 171676
##$YMIN_a= -153588
##$ZGOPTNS= <>
##$ZL1= 120
##$ZL2= 120
##$ZL3= 120
##$ZL4= 120
##$ABSF1= 10
##$ABSF2= 0
##$ABSG= 5
##$ABSL= 3
##$ALPHA= 0
##$AQORDER= 0
##$ASSFAC= 0
##$ASSFACI= 0
##$ASSFACX= 0
##$ASSWID= 0
##$AUNMP= <proc_1d>
##$AZFE= 0.1
##$AZFW= 0.1
##$BCFW= 1
##$BC_mod= 2
##$BYTORDP= 1
##$COROFFS= 0
##$CY= 11.3945322036743
##$DATMOD= 1
##$DC= 2
##$DFILT= <>
##$DTYPP= 0
##$F1P= 15.6554695791079
##$F2P= 12.8336369535428
##$FCOR= 0.5
##$FTSIZE= 0
##$FT_mod= 4
##$GAMMA= 1
##$GB= 0.15
##$INTBC= 1
##$INTSCL= 1
##$ISEN= 128
##$LB= 0.24
##$LEV0= 0
##$LPBIN= 0
##$MAXI= 10000
##$MC2= 0
##$MEAN= 0
##$ME_mod= 0
##$MI= 1.114404
##$NCOEF= 0
##$NC_proc= 0
##$NLEV= 6
##$NOISF1= 3.799351
##$NOISF2= 2.8
##$NSP= 1
##$NTH_PI= 0
##$NZP= 0
##$OFFSET= 15.70392
##$PC= 1
##$PHC0= -26707.02
##$PHC1= 10.18744
##$PH_mod= 1
##$PKNL= yes
##$PPARMOD= 0
##$PSCAL= 0
##$PSIGN= 0
##$REVERSE= no
##$SF= 200.130013532006
##$SI= 16384
##$SIGF1= 3
##$SIGF2= 2
##$SINO= 400
##$SIOLD= 16384
##$SREGLST= <1H.CDCl3>
##$SSB= 0
##$STSI= 0
##$STSR= 0
##$SW_p= 3612.71676300578
##$SYMM= 0
##$S_DEV= 0
##$TDeff= 0
##$TDoff= 0
##$TI= <>
##$TILT= no
##$TM1= 0
##$TM2= 0
##$TOPLEV= 0
##$USERP1= <user>
##$USERP2= <user>
##$USERP3= <user>
##$USERP4= <user>
##$USERP5= <user>
##$WDW= 1
##$XDIM= 8192
##$YMAX_p= 0
##$YMIN_p= 0
$$ End of Bruker specific parameters
$$ ---------------------------------
##NTUPLES= NMR FID
##VAR_NAME=  TIME,          FID/REAL,        FID/IMAG
##SYMBOL=    X,             R,               I
##VAR_TYPE=  INDEPENDENT,   DEPENDENT,       DEPENDENT
##VAR_FORM=  AFFN,          ASDF,            ASDF
##VAR_DIM=   8192,          8192,            8192
##UNITS=     SECONDS,       ARBITRARY UNITS, ARBITRARY UNITS
##FACTOR=    0.0002076,     1,               1
##FIRST=     0,             0,               0
##LAST=      1.7004516,     0,               0
##MIN=       0,             -153588,         0
##MAX=       1.7004516,     171676,          0
$$ Real data points
##PAGE= N=1
##DATA TABLE= (X++(R..R)), XYDATA
0@%%%%%%%%qJ6j6J6k4L2l2M0m8N6p2Q4r7J15j32J52j76K02k32K64k98L37l81M29
32B27m81N38o03O73p47Q31r25J025j135J257j392J544j710J893k102K338k607
49a376K919l283L716m242M893n727O840q410J0816j5019K4501q5519q754Q4017
63E372k8855Q1877O2338r8789j75531N592J25428P5794L301R691n2236j20073
75a06091l7079J33193J24079k6926r4108l9706k5563k3659O2746J32990L3984
86A33860j06990j02248J637M0885L1423M7755M4077m4597j07616l4530Q2243Q1485
98F7384J242k9081k4226n0842m0968M9926R6203J6901o0997l8400j278r268J0591
111a2813O2197L5024o2319p6635J3382O0848J8881m037J5133j4320o6948k9110
$$ y = [0, 0, 0, 0, 0, 0, 0, 0, 0, -8, 8, -8, 8, -16, 16, -16, 24, -24, 32, -40, 44, -53, 62, -70, 82, -94, 108, -124, 140, -158, 179, -202, 227, -254, 284, -319, 354, -393, 438, -487, 538, -597, 660, -732, 812, -898, 995, -1107, 1231, -1376, 1543, -1740, 1976, -2266, 2627, -3100, 3740, -4670, 6146, -8873, 15628, -69891, -78645, 5372, -23483, 58394, 120732, 21943, -153588, -147996, -22568, 53226, 56527, 66218, 13982, -106091, -143170, -9977, 114102, 87176, -6932, -46638, -72201, -95860, -33114, 99876, 133860, 26870, -75378, -73741, -32856, -1433, 46322, 90399, 45802, -61814, -96344, -14101, 67384, 68626, 39545, 15319, -35523, -76491, -26565, 69638, 86539, 25542, -12858, -14136, -23404, -12813, 49384, 84408, 22089, -54546, -41164, 19684, 38565, 34528, 49661, 35341, -31607, -60717]
123f0717O0181O2442p394l4616j9278k0447j0715L8476N6448k12n3400l7677K350
136b4559J4915K2266L5557J5612l9101n7166o528M1847L4662L834r938k0910k9994
149a9503j0338L1039M1332P815k6350l0820j4842L795K4837L3148P700l1756l5769
162a9712j938K1203J7606J3966O050k1259l6633p036L0255K8468K369j1941j7202
175D196j9047m564K3174K9287K794k2480k1654p385M431J9484K3624K272k4606
188I526k3460j006J3128J4287J3142J219k0397k3041j59K0347J9257M624j1097
201A6370j7467j2774K321J5647J6146L807j0460j4955j0343L505J7349J5556l512
214B1190j9480j4032K407J1678J0698O153j946j1657j4953l205J2937J5848K448
$$ y = [-60717, -536, 61906, 54512, 19896, 618, -19829, -30544, 7932, 64380, 64168, 10768, -26909, -24559, -9644, 12622, 48179, 63791, 24690, -32476, -39004, 2843, 37505, 41339, 31401, 10491, -19503, -29841, 1198, 42530, 50345, 23995, -6825, -21667, -17872, 6965, 40113, 47813, 16057, -19712, -21650, -447, 17159, 31125, 37175, 15916, -20717, -27753, 2502, 30970, 33339, 21398, 4196, -14851, -19415, 3759, 33046, 35840, 13360, -8294, -15679, -11248, 8236, 31860, 34132, 9526, -13934, -14940, -1812, 12475, 25617, 26836, 6439, -16602, -16761, 3586, 22843, 27467, 16370, -1097, -13871, -11550, 4097, 20243, 24050, 13590, -1365, -11708, -8203, 9146, 24702, 21190, 1710, -12322, -9915, 1763, 12461, 18614, 16668, 5011, -9942, -13147, -210, 15638, 18086]
227A8086r195j1925p027L549J3426J1612l184j3916r070j330L336R562J2758J434
241A8116j6119j4018J825J0931P563K273k918q646j0191N04J3663J0267j664q180
255C406q478o199J142J0984J0397j498r574p423j398K841P471P261j538j1774
269d380q865L412R661N511N57k393n799q535j630R109J0020L59p636o817j653
284i079K586O807N906k210q681n667J447M319L722N090J578p433j0690K81J0275
299a749O060k321l943k452l334r3O189O101n78o662m614j393J378N602O824k19
315D796p846n797J722M927K221J451J37m607n289J122O604M903j292l391l356
330c695l074m27N152O344k70o285l345J047J861K154L238M5m991m423J647M851
$$ y = [18086, 8891, -3034, -10061, -6512, 6914, 18526, 15342, 1426, -7644, -8974, -5638, 3924, 16682, 18116, 1997, -12021, -10196, 735, 8298, 10571, 7653, -993, -11184, -10680, 2983, 13250, 11586, 3406, -5072, -11271, -10129, 855, 11252, 9754, 180, -7243, -8641, -5800, 1671, 8932, 7394, -4380, -13245, -9833, -172, 5339, 5896, 3503, -2296, -10831, -12461, -3352, 6668, 7027, -609, -7426, -9079, -6493, 314, 6220, 4010, -4671, -10338, -8891, -4572, -850, 4240, 5818, -1615, -12305, -12024, -1749, 4311, 1990, -1953, -4405, -7739, -7832, -1643, 4458, 3880, -2782, -7396, -8789, -7411, -1809, 5015, 4796, -3050, -8847, -7125, -2198, 23, 1474, 1611, -2996, -8285, -7163, -559, 4344, 3052, -339, -3695, -6769, -7196, -2044, 4300, 4030, -2255, -5600, -4553, -2692, -538, 2700, 2745, -2246, -6669, -5022, -171]
346a71K312L11j79k986n685k89N952M550j612m135j147K60l69J932L907J39m846
363b056l441Q59J981K716L022k9n047l756J185M643J076j714J00j004l081p71
379e317M030L932r45m142j985k20P39K578L082r9m564j923J300J956J79J272J028
396I01k894l992P12M328K291j509j217j359j477p83L301K643r10k935n99J016
412b483l3N59K475N46l287l242J209K922J184J29k46j932k061P44L074R91j710
429a161o21p9o69r87K168L369n22l582j436J295P89M61J210N50j913j974J342
446a760J740M16o49P15j121k244Q1L500K079k133j708N23n8l91J100J873l26k497
464h60n86R91J053l44J157Q67j782k771Q50K665P56j217j74M08j153k76J398J755
$$ y = [-171, 2141, 2452, 2273, -713, -6398, -6687, -735, 3815, 2203, -1932, -3079, -2819, -3188, -1256, 2651, 2790, -2056, -5497, -4638, -2657, 59, 3081, 3052, -1995, -5751, -4566, 77, 1153, -561, -461, -1465, -4546, -5317, -1287, 2645, 1700, -2442, -4427, -4647, -3908, -1330, 1752, 1653, -2911, -4834, -3534, -1578, -1399, -127, 901, -1993, -5985, -5273, -945, 1346, -163, -1380, -2739, -4216, -4999, -1698, 945, 35, -2900, -3499, -2483, -2516, -1957, 518, 1064, -2223, -5465, -4256, -1334, -150, -21, -267, -2199, -4260, -3516, -442, 549, -1161, -1782, -1861, -2530, -3517, -1349, 2020, 1498, -2084, -3520, -2225, -1436, -975, 235, 785, -1128, -3102, -1760, -20, 396, -253, 462, -659, -2903, -2822, 678, 2757, 624, -1084, -561, -619, -1010, 90, 1963, 1637, -860, -1446, -455, 598, 254, 1411, 2278, 496, -2275, -1425, 1240, 1996, 779, 605, 1013, -140, -416, 982, 2737]
482B737j173j166o7k46l19O86K185j32k381p39J101J359o12q63P57p3j779K24
500e01K206K39m61o31k6j043n72J679J505j183j781M97J198o37l57R93N45j346
518C24j829J180J302L11j11M77q29j616N1J918M44j160q78N56J6l73R50O98L6
537A467j356j000J007J46J79P84P6j148o34R39J018m63q63M7M10q85l89J568J199
556B102q86p97K96n19p6M26P55p4j340J64J018J12l90J40J004j039j784M96J609
575A217O22o91n16Q06q53j97M48R37n55r97P98K59q78K76Q68M48j148p56P58M89
595A335o61k13P82l40n45M35P48k24q11J09L04l88p12J063J114p37j276J68J060
614A211j78q53K00N96p54p51J188P16o46k04O49m08j177k70J579L20q63o05P46
$$ y = [2737, 1564, 398, 331, 85, -234, 452, 2637, 2505, 124, -615, 486, 1845, 1233, 370, 1127, 1054, -725, -501, 1705, 1944, 1483, 852, 826, -217, -789, 890, 2395, 1212, -569, -72, 1126, 489, 132, 1125, 1670, 324, -1505, -325, 977, 1288, 1177, 1654, 825, -791, -740, 1178, 1622, 462, -416, 140, 156, -217, 733, 1431, 1467, 111, -889, 118, 264, 443, 1227, 1303, 155, -479, 460, 1478, 1015, 152, 199, 609, -276, -665, 903, 2102, 1216, 419, 715, 196, 120, 546, 1301, 1227, -113, 51, 1069, 1181, 791, 931, 1935, 896, -888, -392, 1217, 1839, 1148, 632, 1438, 585, 388, 836, 1773, 1218, 221, 1019, 1278, 400, 676, 1544, 1992, 844, 88, 846, 1335, 674, 461, 1243, 903, 358, 793, 1541, 1317, 506, 615, 919, 531, -181, 882, 1996, 1259, -17, 151, 1211, 1033, 180, 380, 976, 222, -529, 659, 1375, 729, 525, 1174, 766, -411, -681, 898, 1218, 355, -250, 496]
633D96K38j014J4J078j96q86k27N60J21l62P94J16o81j070P07N73m06r67O01O15
653A04k18m35K69K85n80k50K97K4J07j31O44n05n82j30R25p8k12j13N67m28o66
674a106j15J339K47o80m75j1J22n54Q11O63m90p75M28L94l82j14M47L84l60n78
694h05K18Q24m37k14N2L41n99J3N94j50m29m7P72j8q66M01N25j71m14n9O60m3
716A48l67K7J82o74M2P51P5n61L42m5R1r67M96P98K19p26m9J40k0o4K16K35j86
739A03m18L62l6m70J10L45K95m62n50L37M43k32j35J11K67n77Q2P20j38m12j71
760d26O94k03p16L85M27l45p10N84N09k38p00L37O80q35o6J79P79q68k09P53R4
781A05p30k72P72N50j062k06Q87j69p19L66L13J89m67J50J41l8n60N39L43k41
$$ y = [496, 734, -280, -266, 812, 616, -270, -497, 63, 184, -178, 616, 732, 51, -1019, -312, 261, -145, -1112, -511, 104, -114, -549, -280, 5, -575, -825, -528, -504, -397, -528, 116, -389, -971, -1101, -176, -254, -466, -579, -12, -440, -1106, -1221, 118, 365, -315, -790, -801, -679, -1233, -422, 241, -249, -1024, -596, -202, -584, -698, -251, 133, -227, -805, -587, 237, -200, -414, -362, -21, -620, -607, -13, -163, -592, -639, 133, 115, -751, -350, 175, 4, -410, -469, 191, 148, -219, -192, -10, -684, -642, 109, 184, -377, -35, -80, 11, -956, -460, 338, 557, -169, -218, -78, -98, -162, 54, 289, 103, -315, 47, 11, -459, -349, -4, 291, -171, -721, -384, 59, -173, -308, -197, 70, -507, -425, 295, 157, -255, -426, 268, 65, -651, -266, 161, -184, -894, -310, 199, -39, -739, -402, 278, -557, -623, -444, 335, -533, -742, 11, 105, -625, -897, -125, 425, -637, -843, 44, -125, -844, -478, -165, 24, -443, -293, -152, -190, -750, -211, 132, -109]
801a09m67j52J063m7r32kJ078k62r36O05N43k38o31M96j37J78o47N02J02k65n63
822h21P86O98p01k34N56J39q11j62O63L84r02l86J121J13n85j8Q65n12m60L22
842E5M81k70n25M83M14m85l16j6R36o27L5k2L23l58j82K77N66n87j48N78k15k07
864A90j95M11J17m39m72M73P71q48n1J88J14m70J3K72K39j5m20P91n19m01N11
885B60K06j60n79p7P16l17J50k11L58K50j222O43k13n5l8M29j1l38k4L81J55k57
907D6m77N04m9j4k72O83m88J86j41L62m14L6J06k04R6j30J20L10r9l15j00L72
929A18j28J93k62l36N78k02LJ77n25L74j55L68j97k45K08P1m77L97L24o5J41l22
951C8k30J71K73l5j77k92L56K51j57l30M28k62J61m32M63J3J28K0j89J92O2m76
$$ y = [-109, -576, -728, 335, 288, -644, -646, 432, 170, -766, -161, 382, 144, -487, 9, -128, 50, -597, -95, 7, -258, -821, -35, 663, -38, -272, 284, 423, -388, -550, 113, 497, -405, -791, 330, 443, -142, -160, 705, 193, -267, 55, 536, 266, -259, 224, 638, 153, -163, -179, 757, 130, 165, 143, 466, 108, -74, 203, 769, 182, 34, 612, 397, 190, -5, 406, 523, 84, -388, 85, 856, 8, -43, 145, 259, -211, -198, 74, 313, 298, -122, 669, 150, -251, 260, 466, 306, -273, -350, 366, 49, 199, -12, 346, 596, -626, 17, -196, -251, -289, 140, 129, -209, -233, 148, 303, 46, -431, 73, 24, 10, -262, 421, -67, 119, -22, 340, -74, -38, 68, -136, -40, -170, -50, 260, 161, -154, -254, 118, -10, 183, -79, -415, 163, -39, -36, 141, -384, -10, -165, 203, 6, -239, -31, 40, -437, -40, 284, 219, 360, 38, -192, -21, 252, 217, 40, -252, 104, 355, 198, -132, 296, 34, 195, -237, 226, 239, 367, 387, 198, 390, 452, -24]
973b4L23l61J41k09K88K15m05P3L60k08J29n30K48R8l4Q8M1j44L00j00J22J1p49
996c27L60o8J48l90M06O7j58J6N4j80J92P3k76J8J84lj6l9Mk49J08J83p8l19R5
1021a95N3K46j40j49J79J03O6k93J51L0q6J12l35r5L7N38o6l32j61L31J22l81
1043b65P2K35m1r3j84J91j78Q9R5J1L5k15J98J56m33K04L07k58k65K29J96j98
1065a12K41j79L01l51n0j11L28P7j6l02J14Ql9L10j96Q0l03L56k38N7m7oR6k5
1089gl9O82m53n4l10K28J48jo95M54K84j76k78j19M20q4j52J69j92m4N41l05j54
1112a37J78J23j2k15J29k10j07L55j18l6K91l35R7J56j53j82p2J90J30l45KJ63
1134a08M7K02l58N18k97J17j02m1j29r5L25K21o64L66m11L64J57j70J13K75o95
$$ y = [-24, 299, -62, 79, -130, 158, 373, -32, 41, 401, 193, 322, -208, 40, 138, 104, 192, 233, 89, 389, 289, 411, 422, -327, 33, -35, 113, -277, 129, 196, 38, 54, 108, -72, 120, 193, -83, -65, 119, 116, 100, 61, 65, -184, -76, 107, 29, -290, -195, -142, 104, -36, -185, -6, 97, 163, -130, 21, 51, -35, 77, -258, -353, -316, 222, 156, -176, -337, -6, 116, -265, -193, 42, 1, -92, -276, -85, -263, -174, -79, -68, -33, -248, -50, 106, -327, -123, 184, -74, -339, -110, 86, -112, 129, -50, 251, -100, -150, -261, 67, 144, 128, -174, -60, -52, -91, 219, 23, 103, -200, 156, -82, -25, -72, -78, 18, -7, -46, 636, 183, 129, -181, 47, 195, 194, -501, -47, 237, 61, -217, -336, 84, 0, -152, 17, -175, -219, 322, 17, -137, 41, 164, 152, -63, 66, -144, -251, 104, -14, -50, 241, -94, 3, 159, 6, -176, -248, -58, 72, -273, -271, -108, -61, 141, -217, 301, 4, 121, 19, -22, -151, -246, 79, 300, -364, 2, -409, -45, 112, -58, 55, 330, -365]
1155c65M48l96M70r4k28M60m87P8J72J5n5J3Q0p6l70J87jJ01K79l17L18m9l28
1178a45K43m26N32l27K7j04M34j08n1K4K5k2l43K01K13l78pK34J90m63M42l23
1200a32N2K68j38m7qK05k18L10k54L8n0J60k18o8j7J05J59k3j77K20J33l52L95
1223C43m38P9L1j08J31R4k05L14j85Q5k11R4JpP1k87K39k93K40k91N57n8J01l18
1247b1P9R0k19J83pl82N42k20N1N8l24N64l51k58L28Q9q8j78J22qk99J24k1M17
1271B71o5l94L98J21k61L2K64m32pj33J48J50J05l9j11J81k62L12l94j8j60L74
1293H0L3M4j78M64l40n4j55J48J76k36L29m03M50m21m0J85J23j98j27Mm3M06j84
1316F3J46k36P1L69m40J28k20k85N53p7j70J26j96j22L52J6Q5k0j3J29l22J09
$$ y = [-365, 83, -313, 157, 63, -165, 295, -192, -114, 58, 73, 18, 31, 111, 35, -335, -148, -149, -48, 231, -86, 232, 183, -145, 98, -328, 204, -123, -96, -200, 234, 126, 75, 99, 124, 102, -241, -40, 173, -205, -212, 22, 212, -251, 191, -132, -80, 188, 50, 3, -5, 200, -18, 292, 38, 76, 26, 186, -32, -100, -117, -12, 147, 124, -53, 167, 300, -52, 343, -95, -16, 15, -93, 38, 132, -73, 241, 56, 141, -70, 24, 25, 18, 89, -198, 41, -252, -12, -303, 254, 196, 297, -21, 58, 148, -71, 112, 105, -277, 265, 45, 96, 154, -170, 394, 43, -215, 113, 202, 114, -64, 58, 50, -249, -125, -146, 271, 206, -188, 210, 331, 70, 102, 366, -66, -73, -206, -58, 92, 197, 158, 47, 228, -34, 278, -116, -134, -294, 80, 113, 157, -21, 443, 103, 49, -106, 42, 218, -18, 311, -92, 358, -63, -103, 82, 205, 7, -120, -116, -159, 247, 63, 209, -27, 44, 413, -27, 101, -119, -404, 149, 72, -98, 28, -168, -290, 62, 78, 163, 143, 130, 259, -63, 46]
1338D6k01NN33m37ML14k49l31L44R0J06KP9j39j33k68K50k25%L84l4m50QN25o13
1363c90N66K9q9r6k9R9j89N2P8nj37K13j32K77m41J04L11k08qj99K25K5o7K33
1387B22m60J02mJ86QM4J19l1J05k33n6R8O2k91k9k8J86L7j35j46O0L97j02n1l74
1412c14K31m0k55M05j64L8M0K3K44n75L19J40j29Q1j47k5J48J36j33J28j64j41
1434a54K92j03k56J87k17K01j36K09k37k61M62l18J87k83L33J91j05Oj22L1l6
1455a29J67k69L09q5k04Q7j85k65M12M71l65L31j92m0n8m43L21L0K31J68l58j34
1477b00J63P3k4K08r3k1K3k3q2J1L5k22L1L19l52K37k69K69p8J1k5k01L33l36
1501b13M0M1J9O1R0J7N4k83L44l83K06N9K83m02k4n8L3J15J25o4j45L13k33o4
$$ y = [46, -155, -150, 383, -54, -50, 264, 15, -316, 28, 118, 224, 226, 305, 166, 33, -235, 15, -210, -210, 174, 140, -310, -302, 223, -390, 176, 205, 116, 20, -9, 90, -99, -47, 31, 26, -111, 102, -30, 247, -194, -90, 221, 13, 5, -194, 31, 56, -11, 222, -238, -136, -140, 46, 54, 98, 217, 186, 291, 58, 2, 100, 162, -129, -158, -186, 0, 37, -98, -244, -184, 213, 111, 60, -314, -83, -123, -378, 27, -137, -99, -59, -36, 208, -367, -48, 92, -37, 44, -103, -128, 20, 156, 23, 151, -13, -154, 138, 35, -221, -34, -251, -50, -186, 23, -214, -475, -13, -331, -144, -427, -94, 97, -8, -2, -124, -93, -129, 38, -231, 78, -7, -211, -124, -309, -574, -162, 309, -56, 275, 83, 43, -15, -458, -137, -107, 124, 292, -66, -200, -37, 36, 12, 220, 127, 106, 129, 106, 24, 35, 70, -152, -121, 198, -154, 83, -186, 83, 5, 16, -9, -210, 123, -213, -173, -132, -113, -52, 38, 55, 109, -174, 170, -213, -7, 52, 335, -67, -91, -149, -116, -1, 124, 60, -85, 228, -5, -69]
1525f9J7m8L87m89Q9R3n5M9p9J69K1r9L34N7k3m66K20O5j2l42j26M46L6m7O4j47
1551D5N8m58N56k51J45k85L45o1m4M9p6j5Q9m3j90K70j70K87n7m97O3L05L8m30
1575c27J59M77m37l25O02N2l69L28N6l39K46m21k1M31m3k94M89l04P6k97K74j7
1597dP5p2o4j3r8K54k5j94j13J06M99m09L39K9k30L3P9J10l0k65K49J22k85l27
1621b34K69j41k03M41k26j6M59j50l4j84j8p6p3n8J66P0o6J62jj09k5L1oL09n1
1646B36k86p9n5l7L88k44P3j53J04R8J45N5Ol03j06o7L38n1j40K74l24j56Q4N3
1670a47K29j01l6L00j87j8m16K71N26m38J21k92K28L02k88K53j98M9O2k96K36
1691A60o67O80M4Rj60j01p0M80l70j60O7j34J45%j18N6o6M43l1k35j25J92nm35
$$ y = [-69, -52, -100, 287, -202, -113, -20, -75, -26, -105, 64, 85, -14, 320, 377, 354, -112, 108, 173, 161, -181, -307, 139, 175, 128, 192, 45, 103, -355, 201, -50, 95, -190, 155, 94, 50, 99, 23, 8, 97, 54, -136, 134, -36, 251, 194, -303, -240, 65, 103, -327, -168, 309, -128, -453, 149, 201, -168, 160, 216, -123, 123, -298, -319, 112, 69, -225, 264, -40, 36, -261, 13, -4, 71, -1, -65, -78, -176, 78, 53, -141, -254, -148, 351, -58, 281, 310, 80, 113, 192, 302, 272, 7, 256, 378, 93, -234, 35, -106, -309, 132, -94, -110, 349, 199, 165, -19, -37, -113, -186, -244, -78, -8, -74, 88, 87, -22, -47, -16, -22, 287, 236, -50, -129, -184, -221, 167, -77, -4, -157, -53, 45, 190, 245, 251, -52, -158, -225, 113, 62, -78, 196, -128, -284, -200, -147, 82, -19, -55, 245, 58, 40, -376, -105, 421, -17, 104, -188, 40, 342, 54, 307, 109, 158, 220, -76, 160, -507, 173, 217, 226, 66, -35, -105, 375, 5, -155, -88, -222, -77, -77, -195, -139, -205, 238, 207, -28, -153, 39, 34, -401]
1715d01M70j23O8J01l0n2m14L23N5q9R1K34n18N20n21K07K72j69J69j84m9Q6M0
1738H6j79L6k1p9J26K54N4m76J89k23J53k11L16J3k99J79L5J30j53M45k59Q8k85
1761h1J73J78k20k41J75m1J38L9L2r9j18k36N12m17K90n1j7M5k24M0K45j71M3
1784fK0k35J40k85M83P7j95J18k2q3l32J30L46l66J57J09N1n19K62L26m83L59
1806E2j13P5r7K42k25j35K03j55L31l96L96m94J94M3J17j8q6Q7m00M44ol15L67
1829A11m90M88k17n0J65l43L33j05M07k64J9p9L33m21L52l58J90j98K40k57L14
1850A70p4j13L52J08l05l66K98Ok80N84l09r3k38M15L1n61N10k8j47K20j10J8
1872H8r7Q6k75J42j13p5K68o8M4JK1j2o0l80P50j91J39j44m14K46J16j02N9J97
$$ y = [-401, 69, -54, 14, 115, 85, 33, -381, -58, -3, -92, -1, 233, -285, 235, -286, -79, 193, 24, 193, 9, -40, 46, 86, -93, -57, -78, -157, -31, 223, 277, -199, -10, -233, -80, -291, 25, 38, -261, -82, -47, 83, -70, 375, 116, 204, -81, 92, 270, 50, -191, -16, -57, 81, 120, 152, 53, -65, -301, 211, -206, 84, 33, 16, 61, -163, -123, 122, -49, -6, 14, -221, -81, -366, 117, 194, -1, 117, 95, 12, -320, -190, 156, -210, -53, 56, 107, -412, -150, 176, -307, 52, -61, 14, -83, 159, -66, -201, 2, -153, 178, -218, 178, -316, -122, -79, 38, 20, -66, 21, -379, 65, 59, -256, 111, -379, 109, -108, -158, 7, -336, -3, -108, 299, 35, 54, -25, 308, -113, 239, -119, 71, -127, 113, -144, 170, 96, -17, 335, 443, 138, -228, 70, 76, -204, 380, 71, -22, -260, 155, 186, -375, 135, 107, -40, 180, 70, 88, -9, 77, -198, -56, -169, -244, 24, -44, 0, 1, 22, 10, -50, -430, 320, 129, 268, 124, -290, -44, 72, -30, 29, 226]
1896B26m15L84L4l09p9N04m25K73l42J15j84K2J50Q2J3j79J99j67K53l11J09m2
1918h9L6K43l45J30j7O3k4K38k38K1P9M8j95L77%m05P2L71l89l11O34k73l2L8
1942C2m60K42J18K70r4k77M90m74q4J51J10J34j58j17o3kJ65M7J0j1q7N2N6K13
1966B63k31J20l95K02j35M0L25j59j83L43j46k62J18l01L08N0J53l47J41M31j85
1987A50j61q0q9k23M29Q7m23N05L7q8k53q8N82m79J35j19J4K82k50O1j28J11l39
2010c27M47j76j64L1J08K32r4q2Rj40L02j4k4k12L50k74P6Q8l09K10j39j10L36
2033A24r9J35k45K10o7j82MJ95k86O6J6j24K90K4k20K22j53K30r9p5J76l74K18
2056a4l6N8J69J54l44L2J58j19n1j08L4J69j40j67L51J43k53l00L56J44j82o2
$$ y = [226, -189, 195, 229, -80, -159, 345, -80, 193, -149, -34, -218, -196, -46, 36, 49, -130, 69, -98, 155, -156, -47, -89, -53, 190, -155, -25, -42, 21, -3, 235, -3, 18, 97, 145, -50, 327, 327, -78, -6, 365, -24, -335, 299, 26, -6, 32, -428, -186, -68, 202, 108, -169, 321, -153, -237, -86, 24, 158, 0, -117, -180, -182, -17, 30, 40, 29, -58, -6, 50, 263, 32, 152, -243, -41, -176, -136, 189, 30, -153, 190, 44, -218, -100, -401, -93, -43, 110, -237, -96, 335, 150, -11, -91, -180, -403, 26, 113, -310, 195, 232, 144, -109, -197, 385, -94, 41, -78, -64, 218, -32, 29, -99, 12, -327, 120, -56, -220, -189, -81, 151, 57, -25, -16, -156, 146, 132, 108, -104, 246, -28, 48, 136, -173, 37, -102, -212, 124, 25, 160, -85, 125, 58, -124, -120, 75, -211, -145, -129, -253, 37, 61, -159, 63, -90, 140, 41, -34, 142, -232, -14, -50, 8, 177, 331, -13, 19, 177, 58, 7, -101, -67, 102, -38, -205, 146, 289, 36, -264, 92, 236, 54, -8]
2078hq7J56J68l29K93k99nM3K08J82n17m6K83j3j24J76j16R6j98N7n1M2K25j41
2102epJ31l35M9K89M8n7k29K34l20J91r8l03M97J28Nl22M31o1m25J30P0J26k82
2126a15N66j51l79J89j15r4R9k58L29j13o3M25l33k31K52j29kJ76K4J25l5j57
2148A0k31J20J37K15j15j57oJ72k01L5J34K20k09j09j98L29n5j09M6j44K25L5
2170A44q5l3L0J0k58J86j53L23n8p5J33k25L82l78K13m66K17K58j79j33O3K00
2192A16p1J82j02k63l9K56l5R4O2k90lJ76L03l75J18j63L3J76j10j55J0q8J02
2215f6J6n1q2K11l53K47j82M51j10J7R2j20r0N3o1J53l86K93j20j12Q0Q5K46m70
2239b59L54n18K17J29n3L29j06k84L45j93j09K76q2m5l54lK32j5j3J48M02l6o44
$$ y = [-8, -95, 61, 229, -100, 193, -106, -111, -68, 140, 322, -195, -241, 42, 29, -95, 81, -35, 61, -137, -80, -131, -89, 136, -5, -12, 119, -216, -167, 122, 170, 113, -116, 118, -202, -11, -109, -412, 85, 213, 218, -104, 327, 266, -159, -29, 41, 167, -115, 451, 300, -79, 110, -5, -99, 0, -258, 71, -42, -105, 320, -13, -244, 8, -121, -123, 53, 77, 202, 167, 10, -221, -101, 36, 251, 136, -21, -27, 145, -56, -21, 113, 333, 124, 15, -183, 146, 91, -18, 28, -116, 109, 144, 59, 26, 56, 66, -192, -6, -159, 164, 106, 31, 164, -61, 321, -57, 156, -310, -93, 165, -14, -147, -84, 116, 45, 227, 125, -138, -177, 79, 44, 138, 200, -90, -93, 83, 386, 11, 129, -34, -1, 175, 65, -90, -80, -168, -66, -50, -101, -183, 28, -325, -78, -260, 191, 81, 98, 190, 70, -20, 33, -28, 125, -261, 32, -88, -200, -120, -35, 211, -259, 95, -423, -206, -77, -130, 199, 93, -191, 154, -39, -148, 128, 46, 1, -353, -356, -124, -139, -152, -4, 398, 362, -282]
2262b82K58K62k25k31J26j36L75l39P1P9j39L23k48O3k71L12K05l38N3N20o01
2283a63j51J24K44P1l55K07J10j78K02jk4J17P3j54J21rl57n0L26%k26L49l20
2306d4L0k74L87j63J45k29k58K99J99k11J66m5l2k22J82Q9k99J48J04l3J70K25
2328C34k75j89J83k19k5K13Q6J65j54l2j0k17J45J76p0k83J01m1J94j6j35K77
2350B08l96Q7K85k39J68l26L20l4ok39O3n2K36k94J61p9l52N11Jm0lo9J14J67
2374A92m79O6N09k98o5K5J39q5j02O0k93J33J02J38rK07J20o40L99k01P6k30L44
2397A08k40J60k60K09O3n0L57m00R7j1J43l97k2J54P5k50l8K19Q5K96m51J45l12
2420c20K50J89j29Q8p8K35m27K92k29o5J48L89m99K10j4l34o2N65l08L64j60j27
$$ y = [-282, -24, 238, 13, -218, -92, -228, 147, -192, -121, -42, -181, 142, -106, -43, -314, -2, 203, -135, -82, 438, -163, -314, -190, 54, 125, -230, -23, 87, -91, 111, 110, 86, 203, 276, 122, 243, 234, -123, -173, 153, 153, -73, 276, -44, -14, -288, 99, -64, 81, -148, -406, -107, 92, -119, 47, 2, -30, -252, -70, 19, -280, -132, -28, -61, 109, 334, 59, -130, 53, -166, -191, 22, 108, 273, 119, 87, 77, -140, 5, 181, 111, -172, -71, -112, 82, 66, -69, 208, -188, -101, 184, -55, 113, -213, 107, 73, 67, -172, -109, -161, 75, -219, -58, -137, -489, 22, 23, -17, -20, -89, 25, 192, -287, -221, 288, -10, -75, -50, 89, 4, -98, -38, -331, -198, -96, 42, 33, 240, 360, -280, 119, -82, -6, -236, 108, -132, 28, -232, -23, 40, -10, 347, -53, 44, 33, 176, -221, -243, -89, -14, -264, -302, -83, 2, 298, -153, -8, -320, -70, 119, -10, 78, 0, 235, -192, 100, -129, -194, -46, 343, -156, 54, 40, -294, -356, 209, -99, 265, 105, -22]
2442b2k88j61P67o12N43l01m8M27k19k27J33o8pK1P7q5K16P0j59m5l6j10L43j95
2466A4P8L5k64j21k9L56l82L55j49K14kj01k06J43J70r5j01J60j64J59j09q0J02
2489a7l7K74j46l42J35L59l95j6J33n2R1O1O5k76N8K43j28J66q9j56k42K84j04
2512a31m9J06j7K47m35M19l91M18r6o2k32M08j41O4m92M34Kj3l64J81J40r7R3
2535ho7K15Oj04r8J95K0k39O6k93N59l14Q5K14k32n1n2K61J65k22r3n7j14K45
2559H7o2J78j2m6l37J15l9K22j43j28J5J26N0o3n19N32N5j87kk85L82J34K98n99
2583b28M14j67K08k45q0j42L78m02M38l59M2L56j59Rj50L2P4n1j61J05q7j22P0
2606b27L98k30L9O7k6q0j54M65p7Q1k08m28K71j33j76N03j82K41k36L6j54L24
$$ y = [-22, -310, -471, 296, -316, 227, -74, -122, 305, 86, -141, -8, -76, -83, -62, 15, -70, 146, 216, 57, 12, -24, -134, 209, 14, 92, 127, -137, -258, -287, 69, -313, 42, -107, 107, 105, 4, -202, -59, 111, 16, -85, 75, -89, 70, -39, -119, -17, -54, 220, 74, -268, -133, 226, -169, -185, -52, -104, -13, 48, 113, -163, -105, 138, 10, 176, 87, -69, -311, -27, -131, -180, -74, -91, 156, -279, 140, -251, 167, 71, 9, -223, 185, 44, 108, -384, 50, 52, 39, -325, -144, -4, -101, -8, -75, 140, 146, 42, -56, 139, 159, -80, -14, -307, 252, -62, 23, 237, 5, -46, -98, 163, 328, 106, 13, -44, -158, 87, 25, 203, 191, 145, -192, -77, -116, 106, -37, -165, -150, -24, 26, -37, -556, -24, 31, -156, -158, -443, -61, 73, 371, -228, 186, 19, 227, -18, -98, -240, 138, -264, 174, -185, -143, 213, 54, 63, -87, -55, 19, -32, -193, -88, -175, -297, -227, 171, -59, -20, 47, 21, -59, -213, 252, 175, 256, 48, -380, -109, -242, -418, 85, -97, 144, -92, -56, -210, 114]
2628A14K1j2j81k0L3K28l66N26l44pJ39m6J17q9J1J01l9l2l13J43J77j79M1K20
2652B43j84L2j24K23l29l33M80j95J31Nq1K15k03j00N83r2m36N44q21M46K13k01
2674A6Q9J1k01q2K07J90k53k52K92j70J52o8J74L9p8m47L98l1O5j64j50K58L37
2697C32n74J66K39l41M3N3J59j77p6L22j92R3n6K3p7J05K59l56m2J2O7J73k38
2720h3O0j02J73K20j89q0l9J1K86L5j45J35j87j43J65J79m50R0Q4K73l99J25l6
2743a7j60O2L16l69L24k95P8M23n56K44J34Po16K07l4L95k40J83k23J88L95l91
2765E5P3j7j07m83O20j54j51Q4Q2k71J95J24J95p6L8lm09K34q9J43n8l6j68M28
2789B49j52l26k5L01M0M5J07j84L05l58L25j37m23L77n9m60K71J03L04l74k59
$$ y = [114, 135, 123, -58, -78, -45, 183, -183, 343, -1, -8, 131, 85, 202, 113, 124, 225, 186, 154, -159, -16, 161, -18, 23, 243, 59, 91, -33, 190, -139, -472, 8, -187, -56, -51, -132, 83, -120, -220, 363, 271, -165, 379, -442, 4, 217, 16, 105, 116, -85, -167, 40, 230, -23, -275, 17, -153, -1, -69, 105, 144, 66, -381, 17, -14, 51, -113, -263, -5, 332, -242, -76, 163, -178, -135, -82, 77, -100, -176, 146, -46, 47, -9, 14, -63, 42, 301, -55, -97, -85, -18, 155, -83, -23, -125, 48, 268, 79, -1, -40, -29, 257, 292, 147, 282, 95, -48, 117, 296, -154, -64, 20, 293, -106, 19, -17, -177, -115, 201, -168, 156, -139, -61, 362, -194, 50, 184, 191, -425, -218, -252, 143, -97, 86, -137, 51, 446, 55, 128, 111, 4, -479, 141, -13, -164, -80, 2, -269, -74, 50, 245, 169, 207, 204, -205, 29, -60, 83, 25, -11, -179, 249, 97, -229, -254, 47, 87, 132, 239, 55, 360, 2, 327, 190, -233, 144, 85, -375, -104, -1, 303, -71, -330]
2810c30J74M45k54j38m1P6j0k62K67j31J16J82k04J59Q8j91L9j1k8j29k6n4K73
2833A0J80KQ7l97m7M11k8k54K53j56p0n8J02j70k25K00J09P9P6j20o3N8PM7J32
2858A65q0k48j7M57%m92L24kR3m50K80n9l06P32j3m39J0l3J38j41J97k19J48K21
2882B66r9k84K09K07k12k41J61k00k07L93l0K97j69J5J28m81O7J13p9J61o0p8
2904a23J86J1pj38J24j4k96J12Q6J74j09J71J23j96j25J72j64k25L37r5n4J32
2926H2k4o8N2Q9j40K6K2J02R2k41N2j86j43Q6J98q4mj02J2J13j27J64j48J08j61
2951b30K71k19L05J71l04K31l10K7K31j15j90j79L30R6J37k15l1j19M08k29k81
2972b15M78j28j51N6l44J94N9m5L66j1l96K21k94K68M4j97n2K42k23P1L68l34
$$ y = [-330, -156, 289, 35, -103, -144, -68, -78, -340, -73, -204, -88, 94, -110, 49, 137, -54, -15, -26, -54, -183, -209, -263, 10, 190, 192, 279, -118, -165, 246, 218, -36, 217, 61, -9, -67, 35, -135, -360, -160, -51, 28, 104, -16, -79, -21, -14, 33, 165, 85, -163, -180, 277, 277, -215, 109, 107, 200, -250, 30, -29, -335, 397, 384, -55, -45, -78, 60, -81, 116, -103, 45, 266, 167, -117, 92, 299, 87, -154, 7, -193, -400, -7, -37, 260, 91, 106, 234, -247, -180, -67, -146, 15, -45, -123, 63, 74, 67, -71, 53, 39, -257, -145, -59, 115, 6, 177, 300, 104, -21, 151, -13, -238, 99, 4, -50, 82, 58, -10, 42, 131, -9, 17, 39, 141, 233, -8, 44, -142, -285, -199, -1, -85, -89, -191, -179, -66, -193, -29, -177, -69, -230, 41, -178, 127, 298, -6, 225, -85, -58, 173, 58, -132, -311, 19, 115, 252, 37, 6, -113, 295, 66, -215, 263, 135, -16, 40, -304, -110, -51, -96, 270, 259, -137, 84, -210, 58, 102, -95, -147, 95, -128, -57, 311, -23]
2994b3J70k12J17q6m2O4o2J78m8lK5j02j00J37nJ93j69j16O0k48K41J87nk56P9
3019b6Q4k59L98j26R2k18k32j89L38K15J45k99rN5J81n37K67MJ12J40Q2k59O9
3042B8o0J35l20L35j46k7K98l19J15j21j45L66m1o5j92M7M6J85j87p5J85m0OJ49
3066A57l58J34K39k05R6m15L48N5j03J68j19K3Q1k66K63k86pR2M29o05M69j75
3088A5j45J74r0K8K72J55l87q2K8r6J59k05K60J26m86P9J56J32j00l8J62q2j42
3111a07K87p2p5l37K92j08K72m3N5j76J31j91J98l95J6K47QL09m04p0K28q5m84
3134e04N24k0qL8r6k38N8K04N4N7l56K40k6P5l6O5l89J08M68j75j57J42J84j71
3158D1r0J0r5J73m4m18M86j28K11j10R5j09r4O6m4l30M5K01J89RL7n8NR5k39Q7
$$ y = [-23, 147, -65, 52, -34, -76, -12, -74, 104, 56, 53, 78, -24, -124, 13, 8, 201, 32, -84, -24, -272, -31, 156, 151, -105, -26, 58, -201, 197, 71, 163, -55, -287, -476, -138, 77, 222, -77, -86, -31, 150, -387, -120, -116, -4, 136, 218, -41, 28, -32, 103, -217, 118, -28, -55, 243, -76, 39, -82, -227, 139, 98, 33, -159, -112, -66, 119, -68, -143, 42, 2, 8, 157, -201, -67, 172, -33, 63, -352, -4, 51, -52, 116, -3, 20, 101, -165, 98, -188, -195, -103, 326, -279, 190, 15, -130, 44, -46, -18, 254, 409, 22, -60, -32, -128, 31, -174, 86, 212, -274, -195, -39, 93, -7, -45, 117, 35, -107, 180, 108, 33, -304, -12, -120, 152, 109, 164, -12, 119, -72, 126, -269, -253, -6, 2, 311, -93, -163, 65, -20, -504, 20, 0, -8, 30, -66, -304, -246, -42, 12, 69, -287, -47, -73, 2, -34, 31, -358, -250, 218, 43, -114, 28, 212, 41, -49, -39, -134, 39, -5, -423, 63, -65, 146, 36, 131, 22, -72, -6, -50, -380, -335, -134, 55, 64, 101, 43, 48, 143, -96, -9]
3184ik0J73l02j04L89j69j49K84o1N7k96J46k2j88J88O3K11j21M4J1n4l07N22
3207B86j99J46o69K52K75j07l4J59j84R0L99r83O76N0k79N86l06k79M25k75l4
3228eK05k14K62n55K54L59m07K66l62L60k36J60j26j94Q0K82j63%K1M23m76J78
3250A12k02L2J15J2j25n1j00O7L00l26M58k18M5n4j87J26L9o7j53L58q5j77j59
3273b40K53j63J10j88J03J87R5q7J88j78k35k3J39j11j52K69j65L17M04k97j04
3294A22J55k70k67K63o2J51qJ78k09j74J30k16l9k0M40j29J70j88j76N2l7L01
3316A67L2k34P6k96M11n11K76P6L6K8p9j46N3J85k45K66O3l71m4J72J7M14m30
3339h4j61O6K87k63J97J60j81J08k19j38K9J89K08l25K12l7k40J72J95m24k7O90
$$ y = [-9, -29, 144, -158, -262, 127, -42, -191, 93, 32, 89, -207, -61, -83, -271, -83, -20, 191, 70, 114, 125, 71, -236, 286, 87, 233, -436, -184, 91, -16, -50, 109, -75, 15, 414, -569, 107, 157, -122, 464, 158, -121, 304, 29, -5, 200, -14, 248, -307, -53, 306, -101, 165, -197, 163, -73, 87, -39, -233, -153, 129, -34, -34, -13, 410, -66, 112, -90, -58, 57, 69, -56, -107, -207, -140, 160, -166, 292, 74, 119, 65, -122, 4, 43, -24, -177, 181, 96, -81, -240, 13, -150, -40, -228, -125, 62, 157, 70, 258, 80, -155, -178, -39, -150, -302, -33, -198, 119, 523, 226, 122, 277, 7, -260, 3, -59, 92, 84, 262, 53, -121, 9, -207, -246, -266, 174, 45, 215, 27, -149, -97, -134, 167, 199, -35, 41, -255, 156, -355, -79, -3, 33, 61, -18, -164, -111, 74, -171, 95, 158, -213, -257, -85, -68, 346, -84, -245, -179, 108, -155, 42, 202, 21, 129, -90, -228, -199, -10, 198, -127, 85, 48, -192, -20, 175, -249, -276, 414]
3361D14j75J9q0m22M89l18m7J36j97J47k31J19K11Q5k0K0j58n2j8J51Q6k14l3
3384h8j0K77k07j97L76K29p28K3L14J28j26K1k8L9K70l26K10l24J13J45J31M5
3406B87n13L65n30M21m10K89L26l98M15l02p0L18M3m82M70k09m09M63J9q1L99
3427D11m58K62j02k88K35K39k75j09J11j61K02l97K19L3J20lK01k0j35l66K84
3448Cp2J9K5o2J08k8m9J48j7l02K38n6Q5J69j76K58k90n3k82M66k52j65p4L31
3472b8L37l82L65l11p0J00N6P5K21k41m15K37J68j41j17l4p9K28J22Ok2j45k33
3495c03M02j09j97K13K52l50L12j99N30m65k44R2j50K81j10L79l55J9R5K3J78
3516B94k65m49M58k8j76KP2J50P3k8l53M38R7j47j47j34Ok8M87k81j15K36j92
$$ y = [414, 239, 258, 178, -244, 245, -73, -120, 16, -181, -34, -265, -146, 65, 150, 130, 150, -8, -60, -78, 73, 159, -55, -88, -98, 179, -28, -225, 151, 380, -348, -325, -11, 117, -9, 12, -16, 23, 293, -33, 177, -147, -34, 111, 242, 287, -226, 139, -391, 30, -380, -91, 235, -163, 252, -50, -120, 198, 241, -241, 229, 20, -389, 74, 93, 12, 411, -47, 215, 113, -175, 60, 299, 24, -85, 26, -135, 67, -330, -111, -78, 42, 39, 240, 220, 85, -281, 3, -69, -50, -25, -87, 21, -7, -56, 92, 75, -227, 11, -45, 40, 209, 33, 291, 1, -52, -334, 132, -120, -285, -359, -28, 309, -73, 292, -19, -89, 11, 67, 142, 363, 122, -293, -56, 112, -29, -146, -180, -259, -31, 91, 97, 75, -70, -303, 99, -10, -207, 6, 258, -92, 220, 21, 551, 86, -158, -66, -216, 65, -45, 334, -21, -2, 93, 116, 294, 29, -420, 38, 10, -166, -164, -92, 58, 131, 103, -250, 188, 285, 138, -9, -143, -137, -165, 322, 41, -74, 162, -30]
3539c0K84l64K02q1J08l5q8q9J82J8J28k31j16p7M10k15K3J69k47J10k4R3m2M0
3563A28l45J75L50m80J47J4j2N1J18K12n69L99J43o4j75Q2j97j35K79N9l64L52
3585A68m25L32k79N4K57k28J14l9M9j66L29q0k24L28k20j14L97k59K12j45J38
3606A99j84O5j71k71L41Ml7p2J60Q0j8N8j51J32j12J36J52j85K18k79p7m6l3K02
3630A11j5j91k51M14p3j4J18O1l6k46R1j06J60n6j36J2J14OJ84Q2k22L2J18m33
3654b76K54o5l6nK64J63k42l16o9L15K0MK34n29J16K05j70J60l28J50r4L22l24
3677b47M08j64RK06p6k00j1J43j71M06l19J40j59j75K57P7R2l2J19m74M03k33
3699aJ34Q8q4j88K8M3j39r7R3O9m21O50m65K93k80L44J87m08kK33l81J69K18k62
$$ y = [-30, 254, -110, 92, 11, 119, 84, -4, -93, 89, 107, 235, 4, -112, -189, 221, 6, 29, 198, -49, 61, 37, 130, 88, 128, -217, -42, 308, -172, -25, -11, -23, 28, 146, 358, -211, 188, 331, 267, 92, 174, -23, -158, 121, 180, -184, 168, -257, 75, -204, -150, 107, -121, -7, -46, 3, -163, 166, 86, -138, 190, -30, -144, 253, -6, 206, 61, 199, 15, 80, -91, -362, -21, -17, -54, -126, 34, 114, 96, 154, 3, 135, 23, 159, 311, 126, 344, 65, -12, -58, -91, 111, 96, -95, -346, 68, -5, -19, 99, 160, 124, -122, -31, -137, 23, -33, -169, -157, -43, -37, 147, 229, 7, 39, 157, -276, -22, -87, -123, -128, 136, 299, 57, -259, -328, -13, 7, 11, 245, -284, -168, 37, -133, 27, -301, -151, -245, 77, -247, 161, -3, 6, 212, 136, -64, -75, 68, -103, 303, -16, 124, -35, -210, 47, 124, 216, 184, 303, -171, 232, -1, 133, 221, 137, -51, -23, 20, -119, -216, -123, -54, -475, 175, -290, 3, -277, 67, 254, -154, -156, 77, -304, -135, 83, -179]
3723a79L66k61J05M2J30m16J61L47k91J6k8M19o09J30L22j23q1M56m82m9P3k48
3745b00L87m22J63J77m35M41J30m09j95R5N24k42kK63l23J22N9j75j32p8l2M10
3767A26o9k0J55L8P9m97L90P4n48M72l66L54l7R8n5k88j82L76J25n20M96k45L17
3790B73r7m0j93qJ6P8o3o9K54O4j60k7J21j56o8n3J54j53K99j81j68K12o1j1j94
3815b31N55j96l8J36n00J78L22k26RN1L6J44l98l1L47j72K60j25j66J78l78K20
3837b5K91n10M05m19jJ18M03l70K58j41k7l15q4K84L05m33K26P7k22K25n7QJ49
3860A45j9L44n57J88p3jk63n9M31q8J10k77j38P8j08L56j13l0j22J67K04l24j03
3883b52K46j25J7K85j39j56J35J63L8j88m74P47J45o66K54R6k23Lj58q0K77J75
$$ y = [-179, 187, -74, 31, 73, 203, -213, -52, 295, 4, 20, -8, 411, -198, -68, 254, 131, 50, 506, 24, -25, 48, -200, 187, -235, -72, 105, -330, 111, 241, -168, -363, -268, 256, 14, 12, 275, -48, 74, 133, -42, -174, -252, -284, 126, 57, 37, 192, 230, 309, -188, 202, 276, -272, 200, -166, 188, 151, 249, 194, -94, -276, 100, 225, -295, 201, -44, 273, 176, 136, -57, -65, -49, 29, -34, -103, 151, 215, 55, 28, 149, -7, -75, -128, 26, -127, 172, -9, -177, 35, -26, -37, -231, 324, 128, 90, 226, -274, -96, 226, 0, 9, 60, 96, 240, -158, -189, 158, -14, 246, 121, -45, 133, -245, -25, 266, -244, 161, -258, -259, -141, 262, -108, 150, 9, -18, -333, -417, -133, 172, -261, -35, 42, -180, 45, -12, -4, 145, 126, 470, -87, 101, 28, 27, -236, -295, 136, 48, 158, -119, -257, -179, -287, 69, -44, -74, -196, -29, 175, -149, -252, -6, -131, -114, 171, 32, -124, 11, 174, 212, 24, -450, 297, 442, -224, 30, 126, -97, -94, -252, -332, -55, 120]
3905A20k19J59l4k89L99o9j52O7o1K98K3j89l38N96j95Q8j51j74K00m08M02O0
3927A33Nj84J2l8K68p6p8j10jK17k0j95l5K52j59L1n3k12K77l9l20M57m41K35
3951g4M7l10L31J13j04Q1Oj17K33k26k48K99N1J4l85O5K27r8J8j93L89j79J40
3974H0j0k86N08k94j36K20l00J79J31K13k01k34k40L55Q7j66j65K95o9k21K80
3995B6K36m28M05m02j64K68J25j13q2J46j44j23P2J68L8l38K50j40L30l28K81
4016H3J3j42J54l06J1p9O07k23J23k47j4j24J55K53j94L9k78n4J29L89k49j40
4038i4J89j16L23l78m0J49M9l05K93R4j05k86O4q1P4r9K62N2J68k10j33o4L52
4061A58o8m31M59O9j73J04n4P3M1k18K18n1r6K85k13k54R7L27l22K7j91K46J07
$$ y = [120, -99, 60, 26, -263, 136, 67, -85, -18, -79, 219, 242, 53, -285, 311, 116, 204, 53, -121, 79, -329, 73, 133, 138, -46, -34, -72, 196, 120, 42, -68, -69, 148, 128, -67, -102, 150, -9, 22, -31, -243, 34, -5, -325, 132, -309, -74, -27, -337, -6, 107, 3, 84, 90, -27, 206, -20, -268, 31, 82, 96, -289, -224, 3, -95, -77, -270, 119, -60, 80, 70, -216, 292, -2, -138, 82, -218, -39, 92, 305, 104, -130, -370, -15, 72, -94, -259, 36, -33, -254, 26, 262, -166, 239, -163, -327, -59, 66, -47, -129, 17, -127, -250, -178, -10, 28, -310, -60, -200, 130, -198, 83, 96, -46, 108, -198, -187, -266, 341, 118, 241, -6, -20, -144, 11, 264, 70, 109, -169, -223, -94, 295, 46, -94, 95, -21, 302, -76, -116, 33, 82, -223, 70, 164, 59, -227, -163, -244, -170, -269, -7, 45, 213, 3, -130, -194, 158, 90, -341, 118, 187, 14, 118, 64, 137, 178, -40, 178, 127, 31, 316, 103, -151, -54, 273, -49, -22, -213, 33, 140]
4084A40j69pJ55k91J49O9n6R3l61KL30M3j80Jk27P93m66K3p3r7J62l15M31k63
4108a14K70k09L97j58j31r2J64j40L07m42M17r5m63K23J18R2j24k02J72P7Q0K98
4130D45k31q0J9n0k85K01J07N6k22K29m30L90l01M04j86j4j09n0K3L17j67K6r0
4153Bk61K38R2L27o85K25Q2j55J92J33k19J1j17J66j43O3j08k09K27j27J10K93
4175A37k30j53J02K69l78k72O47j47pL19j90p5K32j94J83m33K72o9mK38k14q9
4197e6K63m22K84L12n79J06o6J37J02L8j45M4J16J00m72M16l24K67l11J91K11
4218B12k25K45L5k3k69J93J3L6l3k40L28k56l77K09M40m55J03N40m19j48K02J65
4240B76l33J81k25J02l53L52j1M31m51j60N48p16K94q2K78m9j36J01j68L57j58
$$ y = [140, -29, -36, 119, -172, -23, 46, -10, 83, -278, -276, 54, 97, -83, -82, -309, 484, 18, 41, -32, -129, 33, -282, 149, -114, 156, -53, 344, 186, 55, -37, 127, -13, 294, -148, 269, 174, -289, -66, 52, 144, 20, -182, -10, 67, 147, 445, 214, 134, 153, 103, -182, 19, 126, 182, -40, 189, -241, 149, -152, 252, 66, 52, -57, -107, -84, 233, 66, 92, 2, -259, -21, 71, 398, -287, -62, 20, -135, 57, 190, -29, -18, -135, 31, -112, -49, -157, -366, -139, -266, -156, 137, -93, -246, -144, 125, -253, -525, 122, -25, -32, 287, 97, 22, 254, 60, 243, -190, 82, 13, 9, 247, 33, -56, 207, -215, 69, 381, -198, -92, -158, -21, 81, 119, -26, 18, 134, 234, -238, 178, -146, 121, -190, 1, 212, -13, 232, 267, 244, -25, 168, 181, 217, 184, -56, 272, 16, -361, -152, 288, -167, -64, 476, 57, -91, 111, 276, -57, 124, -101, 1, -352, 0, -11, 420, -31, -191, 357, -359, -65, -147, 131, 82, -54, 47, -121, 236, 78]
4261G8l69L23j72K94J28k45J01j98J75N5k72J1K93l2j83j66K76j05L06n07M02
4282A93j96l9qK6m1Qj00M5q3J78J38J4l26K62k64L13n4j01pO2n3rK77k32K8k67
4308b36J92p6J4J90l57L45j60j59L31O7k78J59M4l19j73N80k34K5J70J4l30L23
4330A32J02K77k56k89j51L19N4o0P3l17K22j07nJ29j15J33l35J01LJ76j08J65
4352A43k11j9j1K38l64L22l05K49l87K99j77K59K88j98o8J78l30J00k04K73k1
4373E4j37J20l41L58J71p0pk57l55L42K67j33L4J27l53rL63o7k81l0L7q0M69m06
4397a84R0J43k6J14l75j10N9J39k43M15M7n2O0k19J67J7J1j61K04k97K96k0J17
4420A92m9R7j9j97J81j31J91O4l04lj30J69o0K11l33K71j52J71k13J1m2j10K55
$$ y = [78, -291, 32, -140, 154, 282, 37, 138, -60, 115, 170, -102, -91, 202, 170, -13, -179, 97, -8, 298, -209, 193, -3, -42, -50, -24, -65, -57, -157, -112, -195, -17, 121, 135, -191, 71, -193, 120, 66, -35, -42, 20, -33, -42, 235, 3, 31, -236, -44, -120, -106, 84, -273, 72, -88, -247, 84, 151, -127, 32, 76, -243, -416, 164, -70, -45, 125, 139, -191, 132, 234, 511, 255, -34, -185, 134, 188, 128, 201, -116, 106, -1, -6, 123, 8, 141, -194, -93, -90, 86, -22, 143, -68, -87, -98, 140, -224, 98, -207, 42, -345, -46, -223, 36, 324, 126, 58, 236, -94, 6, -198, 75, 54, -83, 37, -304, 54, 225, 155, 148, -109, -464, -122, 145, 12, 46, 173, -180, -189, 174, 107, -174, -204, -167, -247, 222, -184, -94, 49, 23, 137, -238, -348, -289, -150, -393, 22, 69, 17, 77, -142, 25, 42, 53, -108, 96, -201, 95, 75, 192, 143, 240, 221, 24, 205, 74, 265, 329, 25, 22, -108, 61, 1, 212, -121, 150, -2, 169, -44, -33, -75, -185, 70]
4443G0r1N4K18n5r4q3j90j6N27n31k07O62k64N4j61J75l34L22l43J03M2j53M91
4466A96j04q6l26M64J00k88K53L0k05J19o5l64L55k11j36K75K52j61J7m2J0j93
4488a10O9N4K50L7m88J26k74N96l26J14J39l29J91n7N7n04M51J81j93M85r5k03
4510A71k14J32j14l03K67K51m96N51j43j02O1L77l24j98P4N0j49J61j4k43PM30
4532B32j68R6J89k51K66m88L31m51N78n40K24J25K3j63J5j81K3K1J88J82l26J90
4554A15Kn6r4J54k80J27J21j40K48l7l70J99k1o4K25k43L92q0j62j60J64o3n8
4577h1r0N3K18O4k39l0J1L06k7k85J44O2r7j53M55k98K84j38k74J37j93J05K65
4600A99k45J2J92j41o2K31k69PL6l9L17k18l48J34J44J05j22K28j83K18m83l0
$$ y = [70, -21, 33, 251, 196, 102, 19, -171, -187, 340, -191, -398, 264, 0, 54, -107, 68, -266, 56, -287, -184, -142, -295, 196, 92, 6, -320, 144, 244, -44, 209, 239, 34, 153, 88, -276, 79, -132, -268, 7, 259, 98, 115, 73, 83, -110, -41, 13, 263, 300, -188, -62, -336, 260, -66, 48, 187, -142, 49, -8, 49, -455, -4, 177, -16, 469, 374, 171, -43, 89, -25, -328, -61, 190, -306, 245, 102, 0, 61, 438, 114, -84, -10, 40, -109, 52, 38, -205, -198, 232, 64, 160, 349, 98, 364, -124, 207, -244, 334, -206, 18, 143, 166, 3, 18, -163, -140, -119, 69, 251, -75, 115, 117, 61, -33, 121, -159, -32, 89, -51, 197, 160, -210, -11, -32, -96, 129, -114, 278, 198, 36, -124, 40, -23, -81, -171, -118, 100, 164, -75, -105, -94, 212, 185, -100, 44, 106, 9, -144, 311, 13, 297, 159, -115, 22, -171, -66, 199, -46, -34, 158, 17, -45, 186, -83, -76, -40, -79, 238, 20, -328, -194, -50, 55, -67, 161, -22, 196, -287, -317]
4622c17M26J02l28K6J35m3Rr7J43j17Q0q3O6q6L6j30J87J91l04R6Q1Q6j67k79
4646b87N29j22R1k4l5l66L46q5J84k10J24p5Ln2O1J8k27kL73o5k00l0k10L13k08
4671a56R3J50K11m12Mj00L64k70K71k31J5k22L24n99N77Q0j4J8J18l38J44l08
4693b81K96m7j29K74j25K50l67M1K23l21m0N2k5J86jK6K53k55J09j7k26K79m5
4716A10J83k16J09o9j64J46j42J91k12r4J16Nm5j42L39j89P2OP6r1j94K45m9j8
4740b7q1PJ90M3Q7m9m74M12p8J98n01L05L8%L95n95r5M01k0q1k57J63K11j80j95
4765a83R2k9K87k51K01l60K04j55J44j03J8J22n7j16N9K30j68J19L7j01j21L50
4787B19j54rJ1Q8q5j84J24n0K84l91N97m93r1K84q0M5j20j02q7M00j30j91J53
$$ y = [-317, 109, 211, -117, -91, 44, 1, 10, -87, 56, -61, 19, -64, 2, -84, -48, -178, 9, 200, -104, -8, 73, 159, -8, -287, 242, 120, 211, 187, 152, -214, 132, 47, 231, 21, 145, 70, 73, 21, 82, 100, -127, -129, 244, 179, -21, -51, -261, 52, -156, -63, 87, 298, -114, -110, -210, 154, -116, 155, -76, -61, -283, 41, -558, 19, 99, 85, 103, 221, -117, 27, -281, 15, -32, -161, 113, -12, 238, -129, -88, 135, -186, -226, -174, -199, -13, -14, 12, 265, 10, 119, 102, -124, 155, 110, 293, 77, 186, 117, -47, 99, -43, 148, -64, -158, -42, -37, -82, -224, 115, -74, -2, 4, 80, -11, -205, 40, -9, -27, -108, -101, 89, 132, 219, 170, -304, 108, 30, 228, -273, 32, 70, 70, 465, -130, -225, 176, 156, 75, -182, -19, 192, 12, -183, -91, -120, 167, -84, 117, -243, -39, -194, -50, -153, -135, -13, -70, -186, -127, 103, -65, 54, 91, -10, -131, 219, 65, 56, 67, 155, 70, -114, 10, -40, 244, -147, 450, -43, -134, 150, 70, 115, -5, -107, -194, 206, 76, -115, 38]
4810C8q2k46K1L41MJ5k18K87l6k46J90m61M53J56k32j48M31l26L23k97P9j9j90
4833a63J0K29J30l02L25k99Q1l1M33o10o5L27j90L48j94L51j33l16jJ09n8K88
4855B69l85J14P6k3L01j88j94L95l01L4K9R9j98P1J6k52k10K52K25m65P2J13P
4878a43l5K41j05m8L3L11n41J54K86k48K30n53M68j34L1Q3r1J28q1K06J51k58
4900H5K1P9k30k4L62n63M00k24K05l14L82m59K63ON3K3m28K86rM1k93O64j71j90
4924c5l78M12k3K45j18j37j63J19J94l65J83L8K5j56P2R8J42k51K28J64j5l45
4946f6l2Q3Q7k20L1j8l7L89j83j54L04j61J5k52K62K10l63K12J97l59P8J47j92
4969b2k01N37j44k21K66k09M9k02k3M77o05K69R7J83l30k82J97M68k11k3K74j30
$$ y = [38, -44, -290, -269, 72, 76, 91, -127, 160, 124, -122, 68, -393, 60, 216, -16, -164, 267, -59, 264, -33, 46, 27, -163, -153, 76, 206, -96, 229, -70, 11, -20, 413, -197, -262, 65, -125, 223, 29, 380, 247, -69, -70, 39, -19, 269, -116, -2, 74, 51, 352, 164, -30, 365, 64, 98, 127, 226, 28, 99, 115, -137, -347, -95, 130, -335, -263, -150, -143, -178, 63, -42, -90, -57, 254, -287, -133, 153, -95, 135, -418, 50, -84, -53, 30, -61, 67, -14, 192, 343, 85, 106, 185, -45, -69, 293, -270, 130, -94, 111, -203, 179, -280, -17, -11, 42, 65, -363, -77, -86, -45, -338, 326, 155, -35, -413, -1, -24, 221, 103, -34, -197, -78, 116, -249, -66, -28, -3, -159, -87, 11, 153, -98, 130, 294, 279, -66, -98, -15, 72, -148, -117, -135, -172, 217, 34, -120, 184, 23, 38, -214, 48, 258, -105, 107, 304, -55, 23, 170, -22, -223, 314, 170, -51, 215, 6, 55, -147, -170, 307, -298, -29, 68, 251, -79, -361, -164, 304, 93, 70, 344, 214]
4991B14l08J89j75L04j00l28N35n17K59k9k48M04l22K05J32l19J21j1m4QN6J09
5013A35o9k46N3j19K22J80l53J67%j18R1RL6l69M68K41k36p1n6l4j42J51k64J30
5037a94R1j1j79J44J18o6K22M9O9J40l63j1o1k21L45Q1j60r0j36N87m93kl8K18
5061C9J11m68M55l95J91r7K73j81p5QQ5K50n5P2o13K16K90l89J03N00k66J86r8
5084A42k09L1J09q3K62k81J45m04K54o7K3P5M0k37J61J09q9K08k64Mj1o3L69k67
5108d3K11j83J45m3J59j6m24rJ75N9j6J81k02J3LK04p4n2l31K48k18oL41l64L32
5133I0o8k77K33O9l2K09k84qJ64l16k26N01K27m11N6K61l68K61Q2q2j65L04o06
5156c86N18j08k4K5L82j16k68OK50k00j51M9L64j94o3j50J16j31J35k1K00Nj92
$$ y = [214, -94, 95, -80, 224, 124, -204, 331, -186, 73, 44, -204, 200, -122, 83, 215, -104, 17, 6, -38, -30, 26, 135, 66, -180, -127, -246, -24, 156, -197, -30, -30, -148, -57, -48, -12, -381, 87, 328, 92, 21, -35, -69, -211, -60, -324, -194, -103, -114, -293, -149, -31, -97, 125, 174, 243, 383, 20, 9, -52, -273, 72, 153, -7, -97, -233, 354, -139, -141, -179, 39, 150, -318, 137, -258, -67, -164, 109, -72, -147, -139, -54, 196, 141, 213, -400, -184, 106, -283, -180, 320, 54, 240, 142, -67, -36, 73, -10, 252, -29, 116, -288, -34, -101, -78, -3, 37, -200, -39, 70, -19, 189, -75, -71, -82, -145, 224, -43, 168, -15, 130, 87, 246, 230, -194, -203, -28, 31, 15, 196, -6, 7, 10, 214, 140, 88, -243, 5, -213, -219, 122, -242, 90, 22, -255, -22, 47, 15, 224, -60, -68, 96, -220, -446, 55, 282, -129, -73, 188, -180, 81, 163, 81, -84, 220, -386, 132, 24, 0, 25, 407, 291, 23, 29, 279, 79, -72, -23, 341, 147, 84, -66, 50, -81, 54, 33, 233, 238, 46]
5179D6k4J65J23o02L65j67P6m6K08j28m0j47m5J94K11o89N35j47J15Q8k73J90
5201Hk36J12K10j47o4J82k34K96k22K84j4J19l99L20o0L7r0j82K04j84J00k52
5223b12Q1n0L94L1j26J34J01l36k1M2o3Q7j25J3K01j01M9j67L18q3q4q7K2j25
5247a07J94q1kl44L50J04j15Q3k38R9K45k84o8J68j91M23l11o3K13j5M28m62j52
5270a26J86k49J62o9K56n26O93l91O1J74k35j02K17K07m72M82k30m2J5o6r9j62
5292c16L67l2j26O8P9l17L74J7K9k74o7j4L23k98J42k8l1PM7J82m2k4k8J34p04
5317e32M08L2J33MO2o4k68L75k52J51K78l45K05P4l34J48m4M89n69J82q7J52k51
5340e3Q3j08J9n6m1j45M70q6l09O36m79Q8N5k00P7k02J90k65K90Q8p0P2j2j15
$$ y = [46, 22, 187, 310, -292, 73, -94, -18, -64, 144, 16, -24, -171, -216, -22, 189, -500, 35, -112, 3, 91, -182, 8, -228, -116, 94, -53, -117, 65, -169, 127, -95, 189, 175, 294, -105, 215, 155, 192, 102, -80, 124, -60, 40, -212, -131, -181, 213, 244, 118, 252, 353, 17, -4, 38, -25, 62, -63, -50, 151, 50, 99, -68, 250, 167, 83, -4, 18, -107, 87, 6, 4, -340, 10, 114, -1, 82, -156, -57, 188, -96, -164, 4, -187, 236, -75, -138, 75, 60, 488, 26, -126, 60, -189, -27, -96, 160, -366, 327, -64, -3, 171, -64, -166, 51, 258, -214, 268, 38, -4, 11, -55, -154, -316, 51, 19, -107, -39, 40, -277, 97, 114, 143, -131, -198, -212, 111, -187, -45, -73, -104, -97, -50, 132, 90, 66, 38, 172, -532, -124, -92, 41, 45, 107, 43, -225, 150, -102, 49, 327, -18, 187, 261, -73, 75, 31, 520, -49, 133, 46, 198, -53, 30, -78, -59, -115, -156, -301, 169, 83, -226, 410, -69, 19, 74, -126, -49, -251, -61, -326, -36, 52, -18, 54, 42, -73]
5364g3k4J3J41k94J87Q4n1qj45K00j8j47o4K72j81j5K04j3J08m5j89K23j16l72
5388c23L46J20k95N2k47K82N9K50k69n7j51K43J88p6J4J9n21K44J02n5J56O6j90
5411d3J69J38l41rk41M22m3k99O5P2J46K25m98J46m3K07j92J14N0K09j18j68J4
5434a8j38J95J4j7l55O8L00N6Q7l24r4J54Q6k60K47j92J46K42l78P8L08M8l90
5457a37J17J8N58q12q9L92j44R3r9J16l19L73J6l41M08m42M01L5n76M57r9J5P4
5480A5J61j59O2J10o00N65m06j02M38k55L42l97K27j7m0rj27K73j86J30L41l97
5502c1j07K81k49J88Pj08P3k56L01j59J07j08j66J10j95K35J46J60m51K92q6L4
5524A8j11J02p0j9l27K10M8M5O5Q9l11M99k40j68P5J31k90K75l6P6rm82M61k65
$$ y = [-73, -97, -84, 57, -237, -50, 34, -17, -25, -170, 30, 12, -135, -199, 73, -108, -123, 81, 68, 176, 131, -58, 165, 49, -323, 23, 143, -152, -100, -347, -65, -6, 244, -25, -82, -233, 10, 198, 122, 136, 155, -366, -122, -20, -75, 81, 147, -43, 126, 264, -77, -86, -327, 95, 52, -247, -182, -110, 36, 261, -237, -91, -134, 73, -119, -5, 45, 254, 136, -32, -18, -156, 39, 53, 36, -319, -251, 49, 105, 192, -132, -226, -72, 14, -246, 1, -191, -45, 197, -181, -103, 205, 253, -137, -20, -2, 556, -256, -345, 47, -97, -4, -103, 13, -306, 67, 83, -258, 150, -292, 109, 144, -432, 25, -74, -59, 15, 176, 17, 79, 189, -411, 154, -252, -354, 84, -171, 171, -226, 1, -16, -56, -65, -192, 81, -105, 25, 366, -31, -138, 143, -106, 82, 89, -19, 54, -202, 99, -60, 47, -61, -227, -117, -312, -77, 69, 229, -222, 70, -16, 18, -93, 9, -61, -80, -407, -197, -149, -104, -39, 50, -261, 238, -2, -170, -95, 36, -254, 21, -15, 61, 52, -430, 31, -234]
5548b34j7M40Qm55K32MP7l32J64K8r3m6j03R7N8J48n6m4K35o2K00j10j01j83k22
5573c67K04L9l21M38l4j58N6J07J10N2l23K69r3P5j63J46o3J74j69o5L07j59j45
5596h3J49J61j08J17Q5m38J57K4K3j20mj16J11K18R6k37k93m7J64K1J28j03K17
5619A22p6k18K95m5j68K75q2k65k31K55l2J34J61m13L52L6k04J03J89k80J09J
5641A8j38j60J07K15K64k55K5P8k55j9J78P3j96J1nr6K76l00J28l9J04M5L7j61
5665f5n8J24N1j90J89j06J08m03M82J29m81P5J41K09j7qK7n04L01k62K93j38j84
5688b87L47k21L6K56m59J11j62O66k41m6R2k16L22n9l87K54k34J54J46K22K55
5709E49n81K16l61J66j57J56J01N7j5q3j13QJ01n00N41l09K05r9J67M4nk16kK93
$$ y = [-234, -251, 189, 197, -258, -26, -22, 55, -277, -113, -85, -178, -224, -327, -230, -172, -24, -80, -124, 111, 49, 249, 139, 38, -145, -367, -163, -124, -445, -7, -41, -199, -143, -36, 74, 126, -197, 72, -21, 54, -109, 37, -26, 148, -21, -86, 221, 62, -83, 66, 227, 119, 236, 321, -117, 40, 64, 87, -33, -37, -153, -42, 176, 272, 35, -258, -305, -141, -120, 8, -95, 122, 46, -172, 123, 78, -90, 185, 103, -162, -393, -138, -170, -36, 125, -288, 64, 100, -104, -1, 188, -92, 17, 18, -120, -280, -173, 42, 306, 51, 76, 154, -101, -120, 58, 131, -65, -54, -59, -155, 121, -179, -51, -90, 14, 59, 96, -65, -123, 1, 52, -138, 51, -55, 53, -350, 132, 261, -220, -145, -4, 205, 188, 180, 207, -297, 4, -258, 35, -103, -287, 60, -161, -125, 131, -328, -217, -379, 287, 46, 0, 92, -124, 198, 139, -248, 6, -228, -74, 72, 294, 549, -32, 184, -177, -11, -168, -12, 89, 146, 131, 48, -65, -57, 44, -456, 85, -224, -19, -118, 49, 93, 88, -128, -130, 163]
5733A63j91k03J37K87j49R3k05q1L68m5j85j21K71k72K75l87N84j58k89K91l2
5754A51J64n94L80j68o1OJ62k23K31k41N55n51j20P83o06K58j61pn9P6P3L7Q4
5777A69k27N3J00n1nk38k5L96o3J67m23L18r1j55J88J36m10k9K35J51m47M11k17
5800e7j5K80m17J69N3J96k88L76l27k22L75k64r8J08K68j17j23J1lO7J38Q3j58
5823C5J21l55N84m13K72pk99J7Jk38N47m37J89L8l60M24J1k33k61L16n3L24j33
5846I0j83k22N05j68JK6j08N4J66k18K01M5k22J23q8jJ03n69K29J91J6n5J8j4
5870h0L2J53q4L50l92J47K16l61L65l71J13J09l88R8J95J09l69J4P2l3L04j86
5892A3l1J58k21K10mo9jj16J39j7O0J40nq2k14J9J04%o6j83N6r3J07K52n23k3
$$ y = [163, -28, -231, -94, 193, 44, 137, -68, -149, 219, 174, -11, -132, 139, -133, 142, -245, 339, 181, -108, 183, 151, 315, -279, 101, -67, -128, -122, 40, -183, 48, -193, 362, -189, -309, 474, -132, 126, -35, -42, -101, -25, 48, 85, 169, -58, -5, 95, 44, 39, -199, -224, 172, 109, 276, -147, 171, 80, -75, 113, 249, -161, -190, 45, 196, -251, 160, -57, -72, 208, -209, -40, 13, 209, -79, 297, -30, -252, 123, -141, -239, -131, 137, 20, -103, -92, -95, -28, 110, 193, 35, 156, -199, 385, -28, 244, 237, -62, -45, -44, -282, 265, -172, 17, 55, -305, 119, 130, -103, -364, -48, -101, 223, 90, -93, -315, 190, 22, 23, 49, -59, -5, 161, -57, 144, 189, -33, 90, 2, 1, 104, -465, -236, -45, -29, -84, -66, -80, -48, 105, 21, 371, -21, 126, 342, -19, 346, -25, 88, 197, -191, -93, 102, 211, -158, -144, -72, -105, 199, 13, -18, 140, -81, 129, 125, 56, 55, -61, 78, 61, 121, 261, 256, 174, -40, -21, 83, 83, 17, -166, -110, -203, -96, 156, -367, -390]
5918c90N51l92P9J87l09K25K60l12l8K36j24k34K81J05o1r6R8o5M7j50j79L10
5940B9K2k97J23M8J32%l1J04k50J77k35J68J08p5m2j45K90j34o9J54l09K82m5
5963EmK90J64n13j50M71K3l71J54j95K12l5j33l5j22L88l06L09j80L14m42j18
5985b74K87R3k12p2M46m83L81j3n2j45j0K16j50j99L78l5o4j19k20O68m83j33
6007a95L32K0l59N61j59n2j20P2l17J26M65k35n67K61K03l35K94o0Q5J1M7J17
6029A95l04k68N66j93p9L27l34K65J30p4k87p9N0Q5J8L4p8J27j21K29k97R4J2
6052A8k17L26j48j15J77K29l32Q6k17N36q6l14J58k32J07K3k56K0L33q4N7l21
6074b52K06L22l78q0M02k27J78q3l64L19j02nQ6O9J16K64l99Q7l84J73nO8Qk44
$$ y = [-390, 161, -231, -152, 35, -274, -49, 211, -101, -139, 97, -27, -261, 20, 125, 64, -32, 66, 1, 48, -102, -281, 29, 51, -246, -123, -75, 57, 57, 26, 130, -120, 57, -178, -10, 98, 23, -19, -164, 126, -8, -77, 77, -232, 50, 5, 1, 291, 455, -58, -208, 263, 286, -85, 69, -126, 86, 51, -82, -117, -239, 149, -157, 152, -28, 286, -156, -274, 13, 106, -106, -178, 268, -215, 166, 153, 101, -44, -54, 162, 12, -187, 191, 156, 92, -27, -247, 421, -62, -195, 137, 157, -202, 359, 200, 148, 28, 100, -217, -91, 374, 139, -428, -167, 36, -299, -5, -65, 20, 31, 78, 195, -109, -377, 189, -4, -83, 244, -90, 175, 305, 231, -56, -135, -85, 0, 18, 52, -26, 101, -20, 209, -88, 6, 18, -199, 127, -21, -136, 41, 270, -62, 24, -193, 343, 257, -57, 101, -131, -24, -1, -257, -237, 96, 12, 69, -252, -46, 276, -102, -182, 220, -7, 171, 88, -276, 43, -59, -64, 22, 91, 207, 471, 72, 159, -225, -52, -57, 11, 19, -225]
6098b25M32k33K12p3j68J97k85P7m3L53J18n75M10j93rp0K5j71N88k34m17N07
6120B23r3l72K17l7L30l08k40M73k21J07j34J06j09J62l36j16O9M76j35K71k72
6141F1j19n7J93J7l3K18j25j46l6L47p77O00j82K45l15n0M5J76k29O0M3P1L7N7
6165A01o7K23k29K33l10R8J56l72p4M33Jj88l0Pn6L57n0m85L05l42J55J20k49
6188b63J81K4K24j30P1Q5j49r8j48L15l68J64L46j48j7k01R1L36l61K26m2l43
6210b05L56l68Q9M27k04j29j21L84J17m07o1J26o9K15k07M3r8j01L49l34L8K69
6232A09j05J07k67K03j73K2j05J5k2J58k48M66k22J90n7J79n09K40J41k63L01
6253A60l26J97n2j23j55L36l2q3j69M11Mj64J81l91J48J47k14M17k23j05J39k31
$$ y = [-225, 207, -26, 186, 113, -55, 142, -143, -66, -109, 244, 362, -213, 197, 4, -5, -75, -50, -221, 367, 133, -284, 223, 130, -242, -25, -62, 268, -40, -280, 193, -28, 79, -55, 51, -58, 104, -232, -348, -279, 197, 62, 333, 61, -58, -115, 78, 95, 62, 280, 155, 9, -27, 320, -457, 143, -39, 206, -109, -159, -114, 62, -167, -107, -64, 7, 44, 101, 34, 257, 28, 261, -49, 49, 205, -167, -241, 192, 193, 5, -25, -18, -74, 283, 233, -252, 53, -289, -134, -14, -263, -82, -58, 166, 36, 107, 192, 43, -55, -203, 112, -256, -92, 254, 106, 89, -112, -21, 315, -46, 180, 138, -205, 151, -217, -128, 299, 95, -34, -155, 229, 346, -61, -122, 4, -65, 150, -57, -14, -112, -213, 136, -198, -160, 109, 4, 111, -156, 47, -126, -104, -209, -194, -216, -58, -306, 160, -62, 128, 71, 250, -259, -19, 122, -141, 160, -166, 31, -21, -144, -299, 37, 5, -78, -247, 164, 168, 4, 185, -206, -58, 89, -125, 292, 69, -36, 103, -128]
6275a28J74j00P5mj15j00J97N8R0J78l68K39k93N29l6m69N09l28M9k23M5K05m31
6298b47L53m99N15R5j87j03M2Q1q8J41j88J65R8J60k48k96L21PM4k14R7J17o4
6321A02q9J52j60j94r4L69K42l24J46m20M46rJ02m48J75j10K36p1k90P11l67N4
6343A59r9j03O9l15K11J46M8p5l84N45k67K49j03l70J67Q0l5K62p2J31l70P4J35
6366H3l40M69l60K32N9r4k03M9N82m07j3k68J81J24k18j63M41l92L16R2k93L61
6388B38j23k66j04L90j76J09K11k45P5j73k5j51J1N2M42l67j38L05J32QP1K0l70
6411g4K29j03Lj8o7k14K76j58K88l27J95j31k99K27L91J3l21p7J74k58m0K97R3
6434I9m0n7k52K66Q1q8r3k38J63K35N3r2j32K25J77j57k06J22j8Lo8N6l4r1J92
$$ y = [-128, 46, -54, 21, 17, -98, -198, -1, 57, 147, 325, -43, 196, -97, 432, 396, -73, 436, 108, 157, -66, -21, 184, -247, 106, -393, 122, 217, 30, -73, -31, 50, -38, 103, -85, 80, 178, 338, 90, -206, 115, 122, 166, -48, 49, 166, 102, 13, 165, 5, -189, -283, 86, 328, 4, 150, -270, 176, 167, 269, -179, -4, -114, 122, 51, -239, 472, 105, 159, 60, -43, 26, -289, -78, 68, 116, 41, -343, 202, -65, 184, 81, -289, -122, -42, -77, 185, 113, 244, -126, -52, 83, -257, 212, -148, 84, 143, 49, -154, -105, 477, 70, 57, -211, -30, 94, -124, -287, 154, -238, 78, 170, -123, 238, 115, -151, -255, 135, -41, 68, 279, 34, 109, -64, -89, -240, -229, -177, 265, -102, -240, 65, 197, 205, 276, 296, -74, 155, 52, 55, 37, -30, -244, 32, -126, 162, -165, 30, -101, -400, -173, 218, 231, -90, -167, 7, -251, -291, 6, 99, 59, 2, -250, 16, 97, 9, -84, -322, -159, 76, 129, 37, -95, 130, 307, 150, -56, 66, 48, 51, -17, 39, 5, -86, 106]
6459A06O0j26Q1k18KL89j37k37J06k18K45J78k38P8J18q7K65n01J6mj09L06O4
6482A39j86M73m56J45J50m57J73j48K97p00K01O56m87M45l34n0J31k89L70k96
6502b23K85k44L07m1l14L36k57K05Q2k40L37l13M80m31J63j77M7j1K6Q0k94M31
6524B34O6k13L15o63J79J06m33K46L57m84J59j71N49k70k14J20J49k76J96J14
6544F6k36K91k07J67j64r3J27J90j2P6j22K23l7j13q6k65L27k18q6K85j83o9K29
6567I0N8n33O9K19L07j57O1l04j28M17q4l24L42j74K82O6l03J67m53L44N8m20
6589d00L65J21j5j19k26K47R4J08m49R1K43K09l27k8L19j65l00J52J17k20r0J69
6611a04m7J41j74M00j62J17k79L29l23J41L58l29m5mM49m96j05K36k0k45L27k43
$$ y = [106, 166, 40, 121, -97, -95, 294, 157, -80, 26, -192, 53, 231, -7, 71, 189, 102, 367, -134, -118, -122, -231, 75, 139, -47, 426, -30, 115, 265, -192, -19, -167, 130, -570, -369, 287, -200, 245, -89, -139, -8, -297, 73, -223, 62, -182, 125, 84, -230, 106, -151, 54, 136, -104, 233, -80, 400, -31, 132, -45, 2, -9, 17, 97, -197, 234, 300, 87, 402, -261, -82, 24, -409, -163, 194, -290, -131, -302, 247, -23, -237, -117, 32, -244, -48, 66, -170, 121, -86, 81, -83, -176, -49, 141, 129, 205, 83, 306, 269, 156, 70, -195, 132, -86, -172, 113, -70, -139, 90, 148, -385, -316, -97, 210, 53, 114, -190, -318, 99, 15, -309, 33, -141, 141, 207, -96, 71, -382, -38, 20, -400, -35, 86, 71, -48, -274, -27, 67, 175, -274, -183, 60, 269, -58, -86, 233, 68, -232, -80, 37, -183, -273, -104, -151, -10, -184, 216, 54, 171, -108, 221, -102, 39, 397, 68, 23, 19, 468, -28, -133, 103, 83, -162, 165, -78]
6633g8m2K12n6k87K60k48L78j50j22k7K79m11R7N02k44j41J15R1l03M6q2K20j45
6656a36J09k57J77j19M88l27K57J36l94NK58j3l19j01K76M5Q5Ok00N8j66j01M87
6679B54j82Q9j25j1J94L5n5m21K46J67p9k92M08Kk48J50k9j00o1J86k56K02J79
6702B53o0J39k40M3j75L47j98n3K04l42j36L40j48l1J44l44M36k24P3K5j49j60
6724b56K27P9j02J36k45J6L04l45J6M10j95j9m3k1j65K78k33J74l4J5J71n4q8
6747B6j49J91J3j79K66j50l09K27j59M60r2L16p28L6J21K10j19k39L63j9j83J83
6769H6j38j32L60J21m12L44k04rK2oQ0j08j6o7J17j65L17k93M34n81J17J77j7
6792B7j88L40m04L66q2j88pL7L0j80L19j68K31P4k27j46O9J95N2j07j28J50j31
$$ y = [-78, -120, 92, 36, -251, 9, -239, 139, -11, -133, -160, 119, -292, -195, 307, 63, -78, 37, 128, -175, -129, -211, 9, -136, -27, -284, -107, -226, 262, -65, 192, 328, -66, -61, 197, 184, -135, -236, 40, 85, 170, 176, -24, 34, -132, -233, 254, 72, 161, 36, 25, 219, 254, 199, -222, 24, 191, 112, -180, 228, 230, -18, 132, 103, 3, -58, 128, -128, 74, 253, 193, 332, 92, 135, -40, 307, 109, 56, 260, -82, -218, 122, -26, -57, 87, -257, 179, -45, 28, 53, -96, -256, -29, 50, -52, 84, -161, -145, 159, -186, -170, 240, 45, 26, -17, -38, -203, 75, -158, 16, -18, -3, 168, 114, 26, -123, 68, 81, -98, 168, 18, -291, -64, -223, 237, 145, 461, -267, -231, -110, 100, -19, -258, 105, 86, -97, 86, -52, -184, 176, 297, -115, 229, 25, 16, 38, 32, 112, 4, -12, -79, 38, -127, 190, -103, 331, -250, -133, 44, 27, -161, 179, -225, 141, 59, -129, -136, -99, -69, -249, 70, -98, 133, 207, -20, -166, -97, 98, 150, 43, -85, 65, -66]
6815f6Q6k92L73j41j38L33K7n7j30O2J21j01R6j82q2L50l57M40n00L56k4j42l58
6838c26L46k57J30K05j49r1P2J21J7l50J35NJ54j61L49l96M31q6l67J28J90k84
6860a84R5l4K54n7j55l1J27k4L8P7j02l3M6L5p0J29m1q0N5J26k9j10M8m5J80l53
6886a38M42j89k03L05n46K22P1j59L18l40K92L4J9J64m51K80k7J22j43j13m1l58
6908d39N72j43L7l65M48k57J58J80j37O6k74L88K52l98j64J91N1l39j05K23k46
6929c01L92J34r7M9k48m8J55j30K74J5k56J6p9J41m3n3O48l25k87m8J81On9K4
6953F1k75L13J42m47k3J77L72k2j93Ok48R4J56m6p4M5j5P0k86k7O14l82M32o39
6977a95L16j58j6J71N8k87M6j85J14p1J47J44J54m67J78J69K0k72j0J58P1n0l5
$$ y = [-66, 20, -272, 101, -40, -178, 155, 182, 125, -5, 57, 178, 77, 173, -9, -91, 259, -98, 342, -158, 198, 174, 32, -326, 20, -237, -107, 98, -51, -142, -70, 51, 68, -282, -147, -142, 12, -149, 200, -196, 235, 149, -218, -90, 100, -184, -89, -123, 131, 74, -81, -112, 15, -9, 29, 106, 4, -29, 17, 52, -18, 111, 70, -10, 45, 171, 142, 32, 80, 35, 215, -138, 304, 115, -88, 217, -329, -107, -36, -195, 123, -217, 75, 109, 128, 292, -159, 121, 94, 216, 73, -40, -81, -439, 133, -10, 27, -338, 110, -147, 11, 191, 54, 120, -154, 234, 486, 88, -76, 115, 166, -173, -278, -55, -301, 91, 225, 128, 177, -71, -119, 36, -94, 180, 195, -61, -45, -124, 17, -26, -79, 569, 244, -43, -91, 90, 96, 37, 61, -214, 99, 241, -206, -229, -52, 320, 298, 105, 111, -137, -43, 113, 67, -7, 38, 23, 93, -193, -220, 394, 12, 444, -195, 121, -37, -53, 118, 176, -111, -65, -250, -136, -207, -60, 84, 238, -229, -51, 118, 138, -134, -144, 14, 85, 35, 0]
7000@J27l74p4L78k86j57M92j39P8n1j72M8L42o5j34j58J00J1R3l5j11K92n17
7023c12K66j94K00J93j31k35M07j84n9n4j18M57Q2n58K52J55j50Om1J50M4j92
7045a6K33n10L58k33L28k73J74K2j8j96K03q2k31r7M59l1k98J74K7L46k56K7k20
7068a10K22LO5o7r4K49k21L5K2P8j83J05k00K90M8p5J4k63K24p2l22L90j24M8
7092F2k60K87J4r5J54l29J86P0j88P2m8j44L40l53M15l4r6j5p2p7K07K83k35o2
7116H2p1K25P3j46J5n30J17J11K02j12k0l8L64l78J2l7p0J53M35l02Q8m85M83
7139A71j82j02J36J35j57K6l5N7r3l25M45l64M34j99k5K05oL25m87O0J3N1j24
7162d1j1n0R8j03R3r3J6n5M04m98L80l67K08j02J32kk80M36j86O0j02K19l42n4
$$ y = [0, 127, -247, -321, 57, -229, -386, 106, -33, 45, -6, -178, -130, 212, 147, 13, -145, -45, -34, 59, 24, -87, 205, -312, -46, -240, -40, 153, 22, -213, 194, 10, -49, -103, -221, 236, 318, -240, 12, 167, 17, 23, -18, 132, 176, -16, 217, -293, 65, -168, 160, -113, 61, 83, 65, -131, 72, -10, -241, -338, 121, 90, -208, -34, -7, 339, 83, 110, -110, 112, 115, 180, 113, 19, 268, 47, 82, 104, 182, -1, 104, -96, 194, 242, 167, 181, -82, 142, 70, -252, 138, 14, 62, -198, 89, 103, 8, 162, -167, 19, 89, -99, -27, -75, -219, 121, -232, 183, 149, 53, 38, -34, -111, 96, 379, 144, 82, 11, 236, 309, 163, 178, -352, -235, -124, 78, -34, -54, -92, 272, -106, -94, -131, -201, -48, 387, 85, 173, -312, 171, -11, -113, 23, 158, 1, 27, -8, 49, -44, -369, 76, -288, 146, -53, -78, 127, 121, 446, -41, 19, 32, 83, -41, -52, -102, -4, -107, -14, -107, -91, -146, 258, -240, 140, -227, -19, -121, 11, 9, -271, 165, -21, 39, -63, 156, -186, -240]
7186b40Q5L18l12J52J31j67m1n4R1K9j63M37o94M30K4M5R9o04M51J24k86K41P4
7209A70l02KK08Ml73L74p8k75M51j87J7P0j55K72j35J5j37K07j51J20q7J16K48
7232C94n30K45j26K90L2m48L88J28n66j59K53q7M46j35J20k56o5L06l21M32l91
7253e0L47m38r6K85j7j07N7j11J4N04n05R5l0m8j06J96J25pj89J56k69O40n44
7276i8o3j52K05J68j28K4m9J97o8o0O1j12k8K53m24L13QJ25k18K46j34l90M73
7299A49O3J72m53m7r2K44j70M21k20k30J07L54r5k82K24j30j63K70l85K23lL10
7321B67o68J84J34OO9l1k4j05L05j09j3N6P7p38N69J5r3L44J5m42Q0j3J06J18
7345A09l01J83P4j14p8Q7k5K0m9r2P5K22j89J44j70J47o9J12j72J45jq5N7J88
$$ y = [-240, -155, 163, -149, 3, 134, -33, -74, -128, -37, -8, -171, 266, -428, 2, 26, 71, 170, -434, 17, 141, -145, 96, 170, -132, -130, 78, 82, -291, 83, 5, -270, 181, -6, 11, 81, -74, 198, 63, 78, -59, 148, -3, 117, 30, 146, 394, -136, 109, -17, 273, 305, -143, 245, 373, -193, -352, -99, -186, 260, 125, 245, -11, -76, 230, -91, 341, -50, 297, -141, -237, 48, 31, -76, -19, -130, -116, 388, -117, -22, -52, -100, -206, -10, 115, 108, -81, 75, -194, 446, -98, -161, -313, -108, 60, -68, -44, -93, 104, 36, -24, 37, -75, -103, 150, -274, 39, 47, 172, -46, 200, 66, -324, 149, 212, 384, -69, -116, -208, 36, -134, 287, 67, -163, -56, 298, 203, -79, 145, 15, -148, 122, -263, -40, -43, 267, -401, -217, -83, -77, -8, -39, -63, -168, 137, 28, 15, 71, 148, -590, -21, -6, -99, 245, 260, -182, -102, -115, -9, 109, -192, -9, 65, -49, -127, -40, -65, -45, -94, -186, -111, 111, -78, 66, -104, 43, -26, 86, -86, 59, 58, -27, 30, 218]
7369B18l36K92J1j39J98Jj85J9J08k54j93K90L14n01J92j75J66J7k69JL88l70
7391b07K46l16L49N8l31J58J97j60K19k90j21J36Km5K48j36l1kk9j88J37q8K66
7414G2J49n85N83n24Q5Kn3R6J09K02l10J09N5q4J78kk88J04K45k58J92qj19K37
7438A87O2m46K86o8k63K02j0k08J24M7L56k32n8J28R1k87r4N40m25j88N02q9Q9
7461B46k57m2k18L47j42k6K12j36K10n7l76L86k88K69k49M12n64K07p3j24J29
7482a34K35J88k57j31L8l6j85Q28o57J66J03m4J66j89j71j42K31j50kk8Q6K24
7504A39k25L0K57m02K54k17K04R5j73M1J33j02K48k66J42pk20J85k16L71n52K57
7526b4j81J85j45P9J2n0J39k48L21p1j1J56P6j49n6k69L79l07R9J82k97M04k87
$$ y = [218, -118, 174, 185, 46, 244, 245, 60, 79, 187, -67, -260, 30, 344, -157, 35, -140, 26, 43, -226, -225, 163, -207, 39, -277, 72, 130, -201, -43, 154, -6, 213, -77, -198, -62, -60, -105, 143, 7, -24, -26, -55, -243, -106, -194, 72, 221, -364, 219, -305, -220, -218, -271, -175, -66, 136, -174, -65, -10, -94, 84, 82, -206, -102, 143, -115, 77, 69, -50, 187, 249, -197, 89, 21, -242, -40, -50, -258, -134, -87, 269, 37, -21, 107, 198, -89, -183, 357, -68, -256, 246, 157, 246, -11, -53, -271, 76, -66, -92, 120, -16, 194, 137, -239, 147, -141, 128, -121, 291, -273, -66, -139, -263, -134, 101, 289, 32, -99, -61, -97, -282, 546, -111, 55, 158, 114, 280, 91, -80, -222, 9, -141, -143, -171, -85, 139, -86, -56, 201, -201, 53, -164, 40, 135, -38, 3, 136, 34, 282, 16, 158, 151, -69, 116, -100, 271, -281, -24, -205, -20, -165, -86, -74, -124, 15, -233, 88, 17, 6, 162, 238, 89, 33, -236, 143, -164, -65, 117, -180, 224, -63]
7549f3l7J01L5J14k3k27M81K1k97m33N78k66J12Q0j62o5R1m3J72k37J23K04k64
7572eJ83j00p3q2j21K05j61J11O2qq7o8R7k4O6J68K3l1p0J59N0O9n19L07k5N6
7598A82m3N0l19J86o7k86K45L43l84%l23O31k41k7p2J19M85l77M9r1m20L27O6
7621C3J30l47L46r1k67L5k87N55j81J00J77k37j7K72l62L30L5n1j86Q0k9k9j86
7644a77K53j65l5J61o1L7J35m5j56J61m40Q5J37L26m02K6K37J28k34n6K11l71
7666b45L71m97M72lj35J25k79J08J59N7k50k5J16J49J32j07k68N9l9K23M2J00
7688B65k25j11k09J98J37o1j35O0L40k53J95l20LK31r3k8P0k3J37m9j93K4J9K85
7712B64m0m82M22J2%j58j3l8K96n12mj3J59p4J49j1J73m7l4P4k02Ok13L84o4J05
$$ y = [-63, -100, 1, 36, 150, 127, -100, 381, 402, 105, -328, 250, -16, 96, 176, 14, -51, 40, -3, 169, -68, 55, 259, -5, 178, 78, 5, -77, -198, 7, -154, -43, 19, 11, -76, -144, -47, -71, -5, 163, 186, 155, 85, 244, 294, 363, -156, 151, 126, 182, 139, 189, -130, 56, -11, -297, -52, 291, -93, -93, -416, 215, -26, -53, -125, -6, 479, 102, 151, 60, -360, -33, 33, 163, -184, 162, 71, -196, -161, -448, 107, -74, 26, 203, -34, -51, 221, -141, 189, 224, 173, -13, 67, 38, 9, -177, 76, -89, -124, 37, -24, 13, 148, 103, -53, 108, -332, -247, -110, 216, -186, -160, 77, 205, -29, -85, 126, -245, 126, -371, 101, 98, -37, 88, -191, -83, 76, 133, -117, -142, -26, 123, 255, 148, -120, -61, -100, 123, 165, 265, 40, -71, -280, -82, 55, -6, -141, -81, 259, 6, 201, -119, -116, 115, 22, -6, 64, 41, 178, 129, -64, -40, -21, 264, 224, -258, 164, 176, 176, 18, 5, -33, 263, -249, -253, -266, -107, -181, -32, -43, 130, 83, 49, 123, -79, -73, -286, 98, 34, 139]
7738A39k79K58l2L3j13j90N1L64j65j58J31K14j89Q4j00j60N8j8Q1j03K17m2p2
7761Ij51J32J16j46j76n8K99K34m02Q9j01L48pk18K9N2K40k13k27J85Jp0J72j38
7785ak4P5j8j1o6j9K6K60k06P5N3K5Mk16n2K3p2L12j44n7L3M1N3L9j00k79P1K12
7813C7J68jk29j08L5rK59Nn1J90k31m1M3K4k65J66l13N69m22L41l98L24k24L83
7837B52j9k23j93L29rm52J4K51N00n65M6K24k40J96K0j34K6pj98k09M57l43K59
7860a8o5k12K51l00K32J25q4R2j15N0K24j15N13p64J42MJ49L1k65P7j14N51k25
7883A64k25K03j1k5j56j05O5J24J28k39Q1K78k69K53j2n81N02j56j93K19J35k38
7905e8M2j48j3L4j23J56pN7K44j81L33m09q6L80l20j8O0J83j32r0M5q9J05J53
$$ y = [139, -140, 118, 86, 119, 6, -184, -133, 231, 66, -92, 39, 253, 64, 148, 48, -112, -54, -72, 9, -94, 123, 81, 9, -142, -10, 106, -40, -216, -274, 25, 259, -143, -54, -155, 193, 186, -32, -3, 49, 289, 76, -151, 34, 35, -35, 137, -1, -25, 50, 32, 21, -45, -64, -38, 222, 16, 91, 144, 169, 173, -43, -95, -72, -144, 168, 24, -33, 0, 41, 94, 133, 33, -246, -175, 37, 205, 204, -25, -133, -98, -107, 152, 157, 106, 296, 65, 24, 67, 91, -174, -8, -321, 248, -174, 167, -231, 93, -131, 252, 233, 10, -183, 146, 137, -315, -301, -50, 450, -115, -69, 155, -85, 111, 131, -3, 23, 16, -182, -391, 66, -277, -18, -83, -295, -44, -344, -112, 13, -71, 21, -94, -44, 180, 65, 578, -186, -44, -40, 109, 140, -125, -48, -162, 389, 164, -61, 142, 131, 106, -50, -155, -90, 34, 162, -77, 4, 282, 13, 266, 254, -327, 175, 19, -174, 45, 180, -58, -16, -164, -177, -143, -266, -110, -117, -60, 184, 3, 336, -73, -159, 221, -99, -117, -57, 126, -6, -96, -51, -140, -35, 118]
7929A18n03O34k05k00J02J63l06K0M42k28j82r0K79j31J06J44j64Q2J61j20k63
7950a41k0L34n3q3oJ05j50K32J72m29l14M62K4M6l31J65J07r1J06l11J53R9j90
7973a14K38j24J55k07K19j36J9j84k4J80l8k4K44m77M30j83p3J26k81J42L41l94
7995a65J28q4J79p0Q2j62M9qN5j86K14j6L9j37LL82m12L57l32K06J33j6l68J18
8019a1Q9J05j53K40j05j60l69R0K36L6J17pj44K4j44m4L76k00Q3P4M3k89K10k20
8043a23N1J22K68m22o8J96k2J61l13J76L8l03K60K26k32k60L5J3K23P6J06j60
8065D8k5o8oJ76j31J21p6j13L95j29j94j83R8k41J94rL25j58k5k78J6L19k31J96
8089B1o9J55j27L76j81k06J45J8J1l79L1q2L60j48K29j57p2J26k36J97o3Q9J00
$$ y = [118, -385, 249, 44, -156, -54, 109, -197, -177, 265, 37, -145, -235, 44, -87, 19, 163, -1, 81, 242, 122, -141, -161, 173, 120, 37, 31, 136, -14, 218, 390, -39, -353, 109, 133, 179, -152, 13, 120, 29, 135, -176, -23, 76, -114, 124, 0, 155, -52, 167, 31, 50, -134, -158, 22, -16, -40, 204, -273, 157, -26, -99, 27, -254, -112, 229, -165, -37, -121, 58, -12, 70, -92, -43, -51, 4, -182, 32, 16, 55, -82, -79, 303, -109, 248, -84, 122, 255, 239, -129, -11, 78, 183, 30, 270, 165, 5, -364, -274, -38, -2, 115, 108, -36, -12, -156, -200, 176, -24, 59, 133, 176, -113, 97, -123, -72, 50, 318, -104, -172, 24, 2, 163, -150, 26, 64, -239, 21, 247, 15, -245, -210, -197, 26, 102, 208, 48, 23, -45, -51, 125, -6, 115, 39, -74, 321, 192, -2, -185, -87, -328, -134, -143, 182, 24, -1, -279, -263, 56, -175, 21, -48, 107, -20, 356, 175, -31, 114, 132, 143, -236, -205, -287, 73, -75, 154, -3, -75, 51, -185, 12, -51, 38, 138]
8112A38j37J31m80J47j15K60O5j83K05k32L0nJ33J43k50K16j63k3j9K50n9J29
8134A81k09R8j21k88O81l01j41M3K1J88J19j20l66J25M78m39j58J79J85k83n3
8155a81j1m4J70J01n7o4k2J84l2k3q9oK2j30M91m06J19M45m78K63l04QK90j66
8179H0k35K73r6J9j77j06J23K77k39R8M4j44
$$ y = [138, 1, 132, -348, -201, -316, -56, 9, -174, 31, -201, -171, -176, -43, 100, -150, 66, -97, -120, -139, 111, 52, 181, -28, 70, -51, -339, 342, 41, -100, -57, -36, 152, 271, 151, -215, -90, 388, -51, -209, -30, 155, -128, -181, -192, -236, -66, 35, -22, -86, -108, 76, 44, 21, -68, -74, -52, -182, 309, -97, 22, 467, -11, 252, -52, -44, 246, 80, -155, 118, 22, 41, -136, -242, -119, 158, -81, 17, 61, -83]
8191h3
$$ Imaginary data points
##PAGE= N=2
##DATA TABLE= (X++(I..I)), XYDATA
0@%%%%%%%qJ6j6J8k6L2m0M8n6P2q8J04j20J40j65J93k24K58k94L34l80M31m89
30b60N53o22O98p83Q75r72J080j201J335j480J639j817K011k226K466k733L035
47A598l379L773m227M758n392O165p129Q370j0043J2434j6146K2757l8072J33431
61A08898O2778k70006k4470J28168R3972l3711Q903j3599q9307o5994J00182J18079
73A23893r122q4074k3378j8217m1178K4255J20195M4946r5518r2900K3968N1584
85B4454J3200J8508K7432m7844r7113j1996R9900P8638j9619n2609k6171l0928
97b4148k6099M6131R3432J4039q3399o1046J1889K4764K6425N4771K3929p3777
109B6911r3026N001P2137L8568L071R938k2883p7225l7658O8810Q3153p374n4249
$$ y = [0, 0, 0, 0, 0, 0, 0, 0, -8, 8, -8, 10, -16, 16, -24, 24, -32, 40, -48, 56, -64, 76, -89, 104, -120, 138, -156, 178, -202, 229, -260, 293, -329, 369, -414, 461, -511, 569, -632, 703, -777, 862, -955, 1056, -1170, 1296, -1437, 1598, -1781, 1992, -2235, 2523, -2869, 3296, -3833, 4537, -5506, 6928, -9218, 13539, -24533, 108898, 171676, -98330, -122800, 5368, 99340, 65629, 74532, 60933, -28374, -94368, 5814, 123893, 114771, 30697, 7319, -10898, -52076, -27821, 92374, 137320, 41802, -51098, -27130, 24454, 37654, 56162, 83594, 35750, -61363, -73359, 26541, 105179, 85560, 32951, 6780, -24148, -50247, -4116, 89316, 103355, 19956, -41090, -29201, -4437, 21988, 76759, 100688, 26911, -66115, -61114, 11023, 49591, 52662, 62600, 39717, -37508, -75166, -6356, 76797, 69423, 15174]
122A5174k4113j1626j5561K8829O7518J7461n5339n1713m178J4929K1074L7317
134C9772J8531l8673n7416n286M4062L2230j3j0447j7286l1604j6446L2576M8845
147C8845P877l3256l2529j0696P439K3444K9264O584k8248l5712n939K2725K3093
160A2891J3895J881k1722l6925r310L2835L2694P60j6910j5965j6609o734K2456
173f763L2940N107k5348k4432o309P020J6873K1215L631k2111k5198j345J6774
186g946J5738R696j475j9745k2786M36K3500J8804J049j0396j5086j3100P05J7105
200c501J8195K171j5391j8355o498J0616J8719J2420o032j9152j4089N28J0444
213i925J2331R672r67j5285j7343n06J7382J5929L03j3358j2588n193M459J2422
$$ y = [15174, -8939, -20565, -36126, -7297, 60221, 77682, 22343, -29370, -33548, -18619, 2455, 39772, 58303, 19630, -37786, -43072, 990, 33220, 33207, 22760, 5474, -26130, -42576, -10000, 38845, 46722, 13466, -19063, -29759, -22320, 1124, 30388, 36972, 8724, -26988, -32927, -10202, 12891, 26786, 28667, 6945, -29980, -39290, -6455, 26239, 26999, 10089, -5876, -22485, -29219, -6763, 26177, 31284, 5936, -18496, -24805, -17785, -912, 20303, 23934, 1823, -23375, -24720, -7946, 7792, 17488, 16013, -3732, -26518, -26082, -2582, 16222, 17271, 6875, -8211, -21311, -20606, -3501, 14694, 16865, 1474, -16881, -23379, -12763, 5956, 18376, 12344, -6808, -20897, -20369, -9925, 2406, 12078, 11111, -4174, -21517, -22023, -4641, 11288, 11591, -1767, -14355, -19548, -15089, -2667]
227b667J3151J058j3617j3414m275M856J1131J2402M74j5457j3891L664J2177
240d408P395J069k960q577j1699j28J3458J2969k13r621p705n127J321R017J0673
255E464r99j0862p905M21N461Q121O341k515j1595r337K821Q954O930K074k069
270A305o564q389l48J0207R898k217r230n804M23L524N743O559k84p892q476m10
286a1955N650O148M605k90p787p973K016R688N747l790l982j542l845j472O516
301b266R319K94q146o710k18K587N206M549k69o705m602J801N086K873Q52m13
317C238m932n954L7Q435N408j334l735l559k568M20M452N289p47o289l275J545
333c569K769K140L224K00n565n907J389N502L342k20o46k771m605r9N648M148
$$ y = [-2667, 10484, 11542, -2075, -15489, -19764, -14908, -3777, 8625, 9099, -6358, -20249, -16585, -4408, 2987, 4056, 1096, -7481, -19180, -19308, -5850, 7119, 6906, -2715, -10420, -15547, -14226, -5209, 5464, 4465, -6397, -14302, -13881, -8420, -299, 6042, 3527, -8068, -17405, -14584, -5630, 1300, 3374, 1305, -5259, -13648, -13996, -3789, 6109, 3892, -5338, -11142, -10719, -7195, -1452, 5107, 4823, -3069, -11545, -11955, -6305, -157, 4448, 4158, -3629, -11602, -9586, 102, 5849, 2059, -1923, -3465, -7310, -8782, -2266, 7053, 7347, -799, -7509, -7727, -5140, 66, 4615, 4346, -2359, -6961, -5160, -74, 2799, 3651, 3238, -1694, -7648, -7611, 824, 6232, 4898, 1163, -2396, -4964, -4544, -92, 5197, 4450, -1839, -5114, -3569, -800, 1340, 4564, 4764, -801, -6708, -5319, 183, 3525, 3305, 2659, -112, -4717, -4816, 832, 4980]
349D980k659m186o34o5n82K664N262Q82o457m689R84L969J828J147N41l727l506
366d248J244L946J114l98j295j491l454l14M912M815j941m332j769J165L23J330
382c93K538L58l388k647J635K124J027J142P9l444l471N94N140K043j629j633
398G5n99j122j092K560L901r68l580j409J620N34J347K022M83l246l474J480L245
415A777O20j029N43q14j925j99K578K488j193j643n61r60l10K686L184j301l311
432F30j390J918J014l13Q10R97j619k517K70K470J153P9m92j502j716j10K845
449B527J800j454j905L08N33q82P45K053k2k483j659J014J285L69L15N21j965
466A100j344O36J903O65j317m93L07r43o11J190K530n71k330n16J60J37N07J110
$$ y = [4980, 2321, -1865, -2499, -2564, -3146, -482, 4780, 5662, -795, -5484, -4500, -531, 1297, 2444, 2985, -742, -4248, -3004, 942, 2056, 1658, 363, -1128, -4582, -4896, 16, 4831, 2890, -1442, -3211, -2046, -1723, -393, 2145, 2503, -885, -3532, -1897, 227, 1254, 2396, 2475, -969, -4440, -3846, 1294, 3337, 1708, 75, -524, -1646, -2738, -178, 3723, 2755, -825, -2234, -614, -80, 1267, 3289, 3772, 526, -2948, -1468, 1777, 2397, 1368, 1911, 1097, -828, -1027, 1551, 4039, 2846, 1203, 642, -318, -628, 2058, 5242, 3941, 630, -760, 1158, 2172, 1859, 2669, 3666, 2047, -470, -200, 2270, 3423, 3502, 3010, 1508, -208, -318, 2527, 4327, 2873, 968, 1276, 1809, 927, 1672, 3725, 3703, 1220, -439, 575, 1860, 2229, 2544, 3065, 1100, -244, 392, 2295, 2960, 1643, 1150, 1457, 514, -97, 1093, 3623, 3052, 722, 206, 366, 503, 1010, 2120]
484B120L91k164r15J455Q00n97p4O80m69k494M23J846J622j016j218j58L70l31
502B71M75J166p31j518J56N33k07N1J218Q53k016j782P90J499k25j8J57J03j028
521b53j06J291R11j131j009J7K14o68L84K350j58j870q29J015K50j91j52N81n24
540A22p95M98J223j7n17J59k34r98m02J099J688q96r51J82N64k4q83R16K65j136
560a37p17P60O53k51N40N41q98j332N87J229m07p07K11L87o3j122J028J143n63
579H82j524m4Q57l39n8Q01M79j198o82Q42N61o31k99lK32r82p7J120Q74p41n27
600d57j46r3l26J12R54p6r65n0Q51l66k71J55N40o16j078N65R22l2n10M69M30
621A2j172m09P95M14q36m77J042L12q43j42J106j34j308m40J116N39p85L89K09
$$ y = [2120, 2511, 347, -568, 887, 1687, 1090, 1016, 1696, 1227, -1267, -844, 1002, 2624, 1608, 390, 232, 602, 271, 746, 1912, 1181, -337, -181, 352, 145, 196, 1414, 2267, 251, -1531, -741, 758, 533, 515, 672, 775, -253, -359, 932, 1843, 712, -297, -280, -66, -734, -350, 2000, 1842, -28, -857, 158, 408, 217, 65, 646, 122, -673, -175, 1048, 1031, 514, 673, 439, -559, -961, 138, 1826, 930, -21, 161, 725, 701, -182, 734, 999, -137, -854, -94, 559, 308, 848, 1389, 491, -841, -254, 975, 568, -139, 72, 459, 396, -726, 302, 1445, 882, -642, -686, 171, -168, -226, 575, 1054, -144, -826, 16, 577, -54, -353, -356, -124, -1106, -1183, -63, 811, 70, -457, -603, -696, -1022, -910, 44, -32, -997, -1047, -196, -562, -833, -678, -138, -754, -1832, -1267, -345, -377, -887, -418, 12, -1160, -1569, -774, -360, -1196, -1673, -631, -319, -1162, -1304, -198, -332, -1640, -2080, -964, -425, -1210, -821, -612]
640f12m6r56N54J054q86m70K81O89p99n17N59J375n07j181R4N38m7j5M15j8j53
661f48m72L78M60l13L12N64o11p92K61Q63K56q53n3P31k09m97j88Q48O8r03J38
682f60R79m54k92O70j6n66k26O78K81k01o60K18L69n49L37L74L46r18J59P24m88
703A05j49J93N59q3j244N13N13K2o90P25K23q27q7p2M77l86M14j2O7p20R8O52
725B91l3r64L83M17M85r00j18Q39k57k62JJ38l27KM61k86l8j42N89K01o97m49
747f66Q13J14k07p38Q03K49m83m25M32M71p71QJ116n30j067O27K80j15l50L30
767a09K41m2o55L91K62k9n58N04N07o96m61J013M17j015l59Q68J48q71J35P57
787D48L03p60k01O71k04o92R6N41p2j39O0J006m24r74O39N70l22q72N59O25k87
$$ y = [-612, -658, -1614, -1060, -6, -892, -1362, -1081, -392, -1191, -1708, -1149, 226, -281, -1462, -1368, -830, -877, -892, -477, -495, -648, -1120, -742, -282, -595, -283, 281, -330, -1122, -861, 2, 258, -595, -648, 83, -126, -623, -811, 37, 105, -798, -660, 319, -135, -427, 243, 227, -339, -565, 113, 394, 193, -467, -249, 120, -429, -92, 282, 628, -290, -131, 593, 105, -44, 149, 708, 625, -619, -106, 407, 429, -261, 464, 687, -140, -227, -299, 178, -208, 206, 194, 261, -459, -361, 291, 258, -706, -323, 94, 579, -321, -439, 400, 143, -119, -118, 20, -307, -305, 156, -130, -168, -310, 279, 480, -217, -666, 147, 261, 54, -684, 119, 368, -115, -540, -108, 363, -408, -400, 716, 186, -881, -254, 26, -89, -439, -109, 132, 90, -565, -174, 88, 59, -499, 5, 512, -184, -645, 368, 785, -230, -589, 279, 427, -444, -309, 448, 751, -9, -210, 461, 257, -435, -339, 202, 130, -9, 51, 1057, 633, -341, 298, 868, 546, -326, 233, 858, 571]
808E71r48L66N21J13m15K22O56o95l34K76O63o19n98Q48J26q08K3Q24n6l43n01
829a08O91P2q52M4P29P59j082l76P16m79k15k3O93o14n43N34R02m57n10L95K76
850E52k17r17N03M90k05m91L82lQ7p50M39K03n41p1N68K74l28m80M25K06j35o36
872f45O62J80k26k81L37j20m6r4M54m23j05K46N6j3m00L1N03k4l31N2J38j04k93
895d46K91k1l49J54M15J33l96Q1J57J7k57j73N99k12O4m08N39j28N3n6L12k42
917A27j86j19n6L61k24K53O4j97l8k40L65l2m3k19J22J91k20J31J79n79K94M74
939D08j35k31J77j09K28j10p9L13k45k40j67M57l35O5J52j34q9rM16k95K02k44
961dJ98p8j8j61L91j00j56l7K45l05J70p4j73M21n64J07N5n3o4N7J41N0k68K33
$$ y = [571, -377, -11, 510, 623, 208, 430, 1086, 391, 57, 333, 996, 377, -221, 627, 753, -55, -32, 792, 736, 393, -108, 583, 655, -197, -153, 576, 1335, 253, -123, 593, 114, -101, -124, 569, -45, -588, -54, 848, 391, -119, 276, 552, 335, -582, -79, 411, 206, -285, 97, 94, 181, -569, -130, 73, -468, -539, 29, 303, -25, -505, -80, 126, -9, -645, 17, 197, -29, -310, 27, -93, -139, -233, 221, -202, -307, -61, -5, -18, -418, -387, 116, 92, -239, -187, -49, -153, -446, -155, -176, -525, -371, 44, 177, -219, -138, 19, 36, -221, -394, 205, -7, 57, -351, 188, 60, 113, 57, 369, 127, -59, -178, -234, 127, -97, 156, 220, 23, -15, -255, 110, 78, 35, -184, -62, 129, -91, 40, 219, -360, -66, 408, 273, 42, 219, 110, 338, 228, 149, 462, 217, -23, -190, 267, -68, -3, 149, 15, -74, -83, 333, 38, 240, -4, 194, 116, 98, -63, 328, 228, 72, 35, 280, -25, 145, 71, -102, 319, -245, -138, -83, -136, -200, -143, -2, 48, -220, 13]
985A3Qm36J55L95p4j89nm0N1k46P4M19N9j76O8J99m53K66l24J9J03lM0p6K01l9
1011Im6p4R3j54l3K19J00k03r2M91k18j94J55j07k79K35J42q4j50K4K42q1k52
1034b57J53L62m39P1M3M02l21j40K1J65M0k38K12K55m19m9K93M3k55J9M58n07
1056h8Q0k15K74J21k92O3J90k65J59j47kM38j8j64q7k53K45N9O4j83L04k13K39
1079C09k01j40Q7J5q0O1j31L3K00l09J63m7J20j07J12r4r6p8L00K18n19M6n1K31
1103D2j66J41N6O3j48j54J4k95M18J29K13l71J01n7M41m15N31l84J86m99J77J33
1125A56L5k61J10K69k65K03m85O08n92O5j8J28k70M01j44j29K75k55N1J60N8k88
1147a88K24M1k83j85J13Q8K17P4j99J53j05M0J70j47j89l4J71M1J15Rq9q9K3K62
$$ y = [13, 21, -415, -260, 135, 61, -128, -133, -173, -122, -368, -294, 125, 184, 8, 76, 275, -178, 88, -236, -217, -114, -117, -77, -153, 48, 9, -37, -111, -18, -172, -205, 14, 114, -89, -181, 310, 92, -102, 53, -54, -333, -98, 44, -40, -190, -166, 76, -5, -257, -104, 258, -181, -110, -67, 335, 14, -126, -105, 60, 100, -138, 74, 329, -90, -139, 154, 197, -58, -39, 419, -88, -8, -223, 51, 172, -120, -57, 133, -132, 27, -120, -122, 316, 298, 134, 47, -206, 39, 98, 162, -21, 283, 70, 309, 108, -32, 55, 70, -10, 51, -80, -47, 153, -156, 7, -40, 80, -27, 85, -9, -105, -183, 117, 335, -184, -138, -189, 42, -124, 17, 73, 136, -12, -166, -152, -447, -29, 100, 313, -58, 43, -14, 427, 12, 543, 159, 345, -154, 23, 156, 191, -70, 40, 309, 44, 247, -238, 370, -222, -157, -175, -47, -317, 84, -60, -189, 86, -169, -118, 42, 100, -188, 36, 77, -206, -391, -278, -190, 27, 101, -98, 55, -50, -10, 160, 13, -176, -210, -39, 2, 117, 126, 37, -52, -29, 233]
1171B33R2m05j80L51l2L80o99L70l0J16k26J26jj13o9K21L32l42K3m06K78K07
1193B26m37J60K94j81m15M25J92m15K64q5K02o8j02L34l95K03l58J32m45M91J5
1214C7K11j0l75K56m5Q1m51L19K14J27n84K20R9j23l4J39Rjn6J90k16J1K28k83
1238c7P1K7j05JL06m0J8m04L9L42k95R7l24K59m7k01K77m81K90J57K84m17j53
1261c36K84J31k23j50L40q8O1J2j9l85P01m56K01k99K54M5j23j64L79l51K35k51
1283b02R8J06j77J72j56O3pL6J3M5j32q6J48N24k70k98k9kK22K30j29J25l15J4
1307gJ9N4m5m8J34l04K99J8k59N8K68P6o6l35j55L85OJ52O9k43o7k24J40l8L32
1332B19n03M24P0j23m28K34K75j05m2P3q7P9k36J98j8p2K06j23P8l24L51k28K73
$$ y = [233, 325, -80, -260, 91, 59, 439, -260, 110, 80, 196, -30, 96, 95, -18, -87, 134, 466, 124, 147, -259, 19, 226, -211, -51, 243, 62, -353, 72, 264, -151, 113, 28, 230, 162, 60, 394, -1, 202, -156, -24, -469, 22, 37, 248, 238, -137, 119, 74, 155, -296, 23, 237, 364, -220, 0, 99, -24, -58, 81, 90, 89, 33, 223, 7, 18, 246, -37, 34, 61, -44, -43, 263, 223, 241, -163, -124, 218, -77, 20, -304, -45, -92, -293, -16, -497, -207, -50, 234, -183, -336, -52, 79, -144, -294, 46, -42, 19, 31, 12, -373, 328, -128, 73, -226, 28, 73, -50, -214, 165, -186, 49, -202, -104, 2, -175, -3, -159, -96, -103, -67, -54, -9, -141, -227, -79, 445, 175, -123, -152, -154, 68, 298, 169, 294, -21, -7, 12, 66, 21, -27, 107, -197, 102, 120, -139, -81, 187, 263, 197, -138, -293, 92, 98, 250, 319, 76, 9, -215, -75, -113, 219, -284, 140, 210, 87, -341, -107, 168, 63, 21, 94, 7, 86, -150, 48, 30, -42, 164, 41, 119, -205, 146, -82, 191]
1355A91m07P7K75o2K15l32r2NN4j3j06K40l69K25m3J10N9pj15R4q1j74O7K9J36
1380b4J2jL8Ok43K33j95J69k0m6j5M2N4j08JJ47m09L56L7k07l0M83k91pK51j90
1406D3M6j33lJ60j91K7J02J59k31k88R1J23J48K57n6k15j74J62L52k30J43k85
1428GL6r0R1oj5JN9L6L4O0k77J91m72M02K3j06K45R6k02j16m5k79K49k0L02p4
1454A30r1L9R8J02j31o0L09n07O0N3Qn7K96l28J90K1k29K08j53K8R7K66l85m9
1478h5j24M41q2J35k61L12l67j97J22J90n4j7nk68L42Q8m84O1J94l4o4Q7J30j62
1502a02L8O7j7%J64l09r0K31J55n49M18oK48l14J52l9n6J23r1K82l68L84n48q5
1526c12M59j79L6k0M2m0J09R6j95o9k8O43o74J86jj4j20K42k13J13j38NR3j85
$$ y = [191, -216, -139, 136, 74, 289, -43, -135, -130, -76, -89, -195, 45, -324, -99, -142, -32, 27, 20, -95, -1, -82, -256, -189, -160, -24, -12, -13, 25, 31, -212, 21, -174, -5, -25, -71, -86, -44, 10, -98, -97, 50, -359, -3, 34, -173, -203, 280, -11, -18, 233, 43, 89, -44, -47, 113, -78, -51, 51, 210, -21, -309, -218, -95, 53, 310, 254, 39, -135, 27, 379, 149, 292, 7, 43, -47, 44, 38, 23, 24, 83, 119, 153, 213, -64, 127, -345, 57, 80, -26, 219, 315, 113, -3, -48, -327, -78, -98, 204, 130, 39, 78, 176, 278, 147, 87, 396, -111, -51, 2, 10, -47, 249, -79, 111, 132, -97, 111, -42, -14, 83, 349, -36, -85, -209, 232, 150, 285, 24, 336, -31, -228, -106, 84, 30, 13, 8, -260, 82, 170, -314, -253, -59, -93, -157, -70, 60, -102, -64, 3, -14, -14, 150, -159, -249, -18, 137, -412, 6, 0, 248, -66, 86, 47, -9, 114, 23, 305, -63, 321, -227, -312, 147, -32, 4, -16, 26, -14, 95, 191, -4, -73, -101, 542, -132, 54, 53, 39, -81, 161, -52, 61, -77, -72, 21, -164]
1550a64L60k14r7o7J17R0k32L60j29oR7k42K79L2lk36L25l30J31K55l76O5J22
1573A37j93K8j6P5n1L30l9n18M51Rk42K71P4j51j69J8k4j65J43M8J79l08L99k82
1597Dr4J62N3n5K9j50j77J40j32L98L3j98p3M6N9k47N13j63k22K79m08R9L70m24
1621a58M39o66K62j09L13J55j66n0K39n68J30O2J04r2m4j62L38m80N67k09R7J2
1643A4j54Q3M5j60K97J6j01k5K52m97J20L56k91J56m49L15J48l02K6J92O8l32
1665b23J02k64N70l19K45j17L41k28j67K20j31K09m17%J47R3k11J22J88R8l01
1686d3J48j13L1J02m51N12m39K21J1O7j74J6O5K06k21J37J40l56L95j95J07j37
1708B9j7j41J63l07M98l68M21j60j57k71P77j92k97M26m17j93Q0j86L54j12l23
$$ y = [-164, 196, -18, -115, -182, -65, 25, -207, 153, 24, 18, 115, -127, 152, 184, 181, -55, 270, -60, 71, 326, -50, 15, 137, -56, -28, -44, 31, -20, 310, 271, -247, 204, 213, -29, 242, 316, 165, -4, 14, -10, -175, -32, 16, 195, -113, 286, 4, -90, 72, 125, 70, 99, -51, -228, -88, -220, 178, 211, 13, -60, -14, 45, -202, 311, 148, -74, 205, -203, -104, 266, -158, 281, -385, -123, -232, 81, 236, 70, 20, 259, -309, -179, -117, -13, -105, -149, -311, 27, -453, 114, -95, 2, 14, -140, -57, -12, -172, 125, 141, 40, 15, 267, -230, -110, 246, -45, 111, -338, -23, 125, -177, -151, 41, 109, -223, -121, -385, 185, -134, 111, -6, 335, 107, -60, 160, 29, 238, -179, -179, -32, 61, -150, -28, 160, 258, -43, 105, -8, 23, 125, -326, 186, -253, -32, -21, 46, -128, -112, -47, 159, -62, 75, 215, -141, 254, 59, 166, 29, 12, -129, 34, -273, 225, -143, 278, 118, -39, -310, 467, 275, -22, 404, -13, -206, -126, -312, 42, -70, -393]
1729c93L84j51L75k87K29k22K46l21p0R6L08k44l30L85J71k80n5j1Q3J94p1p6
1751d0k16J93q6j8K92Q2j01k1n4O8j07jK42l62L48k26m3r5J24J04j37L7r5Lk64
1776c73M42oK47m96L58L3l51L37k29O8n3r5K65j05r6R7n2l1R9q2J25m42M30m38
1800c48L28J85j18l00K09R8M3j21J33o0k18L25k37K09k40J72l2J9k87K65l04K62
1822a7n3M00k11j25n0m5l53M81jL0l56K40P1P9p0k6M8J89m13J32J3O6M0j47kj06
1848a86K64l91L41M9k36K69J82k66j21j6N38l92j52j48J40R1k67M76j68r5K20
1869A32pm5q2j13OJ48q2K22p1j1j95k1J75o0l16M18j96J59k20l9J62k00L32p8
1893A8j89j55M00l54M83l87J53j54K01L4j17K57l70J86j86j6K59rJ8p1K74j11
$$ y = [-393, -9, -160, 215, -72, 157, -65, 181, -140, -210, -114, 194, -50, -380, 5, 176, -104, -159, -170, -87, 107, 36, -40, -256, -63, -149, -167, 125, 207, 106, 85, 31, 99, -8, -9, 233, -129, 219, -7, -50, -145, -21, 83, -54, -17, -112, -109, -373, 69, 63, 310, -186, 172, 205, -146, 191, -38, 30, -23, -118, 147, 42, -54, 43, -9, -40, 59, -23, 102, -340, 90, -348, -20, 165, 47, -253, -44, 54, 97, -24, 109, 49, -169, 156, -81, 128, -112, 60, 28, 47, -240, 25, -279, -17, -70, 330, 119, -6, -56, -101, -454, 27, 26, 56, -300, -60, 11, 90, 20, -6, 42, 231, -182, -50, -37, 29, 69, -78, -80, -186, 78, -313, 28, 77, -159, 110, 292, 26, -95, -111, 427, 35, -117, -265, -125, -34, -301, 175, 7, -88, 132, 125, 80, -2, -115, -109, 39, -43, 179, 108, 97, -98, -119, 56, -4, -320, 98, -98, 61, -159, -198, -36, -236, 96, 18, -171, -326, 74, -280, 203, -184, -31, -185, 16, 50, -67, 190, -180, 6, -180, -196, 63, 54, 72, 1, 275, 164]
1915A64l08pK46k36K96l48P1K10k82K67j08P5J08k26K79j45j90L4K74n03L04k60
1937b85N46k98L90k43J18l5k59J5j23J85k47L60K6l33N71r9j86o4K91n6j35j45
1959fo2J69k24K7J66j6Q0j18P6p5k0j20J32J24j6j7j88L87k85J37r3J26m01K36
1983A9l3j42R8N2j56M9Q1k92K65J77j95j65M68j41p3l37L75J12m05R5J68M8%R1
2007A59l01J34M9R2o8m0j14K11l94M02k02K94m11R6L22L5k46k39K40O9k3kj17
2030e4J52J61l05l30J73NL36j59K81l58r0L17J48k99m8q5J44j15k05K20L7j2P4
2053a2j6j41J36q9k15K27j64J51K01M3L9k37k66K92J15N5l03j33J19L08J69j97
2075H2l5O6j27J5J15Jj4j08J80L2k42k99J43L5K22l04M22l4k19OL3M5r7k36K28
$$ y = [164, -144, -151, 95, -141, 155, -193, -122, 88, -194, 73, -35, 40, 148, -78, 201, 56, -134, -100, 174, -329, -25, -285, 261, -37, 353, 110, 228, 193, -66, -51, -174, 11, -236, 124, 150, -183, 388, 289, 103, 39, 330, 274, 139, -6, -68, 101, -123, -96, 70, 54, 134, 16, 92, 17, -3, -123, 9, 133, 117, 100, -88, 299, 14, 151, 58, 184, -217, 19, -14, -156, -58, -6, -162, -113, -32, -324, -59, 118, -77, -242, 226, 85, 12, -325, 50, 162, -243, -148, 20, 68, 68, 159, -142, -8, 41, 133, 65, 25, -89, 122, -272, 130, -72, 222, -189, -93, 229, 264, 18, -221, 19, 88, 65, 63, -54, 98, 259, -46, -376, -203, -198, 138, -21, 260, -98, -188, 129, 277, -22, -70, -155, -11, -126, -331, -111, -74, -86, -12, -28, -169, -33, -122, -337, -110, -274, -123, 78, 121, 160, -77, -343, -51, 64, 119, -184, -317, -198, 110, 279, 82, 47, 113, -14, 1, 116, 117, 103, -5, 175, 207, -35, -334, -191, -156, 66, -238, 184, 150, -69, -63, -30, 15, -82, -318, -90]
2100i0r7lM2K24l6j18L25l12m6j37R9K77k0kr8j60J4Q3J14M52q8p41N70k32m1
2125b1K58l97J95k86K50j78K47m0l15j2R2L01l25l06N85l24K21Q2R7k72j4n8M93
2148B73l21N4j0k20L00j43rL1k28K64J84l42M06k03k72L77j52J35k86m2K99N5
2170A50m20M13k14k27L93mj01J11j4o7r2N1o9K9LM6Q7J97k67J33K03k14J09m08
2194a72N76l55o8j43K19l3J53m11J71K01Q0k33R4R3J65n87L21J4l56M70K8l3l30
2217a36Lm4K84K0j57j35r5K10kM7k10l18O65j5l72J91K70o0K6l55J28K38q6n48
2241d51L29J41J43K32n08J76j52k20K39P5J82j21L3j65P5J11k31P2K70l29L60
2262B61m4M1k69L2k57J09J70J69j01K1k17k68M65l06J59J29K5R4l97J03L59j08
$$ y = [-90, -187, -190, -148, 76, 40, -78, 247, -65, -111, -248, -149, 128, 108, 106, 8, -152, -138, -55, 59, 511, 423, -318, 252, 20, -21, 237, -160, 35, -251, -1, -179, 68, 28, -287, -299, -207, 94, -231, -537, 48, -276, -55, 27, 124, -148, -162, -220, 273, -48, 6, -4, -224, 76, -67, -76, -45, -273, -9, 175, -167, 239, 36, -236, 141, -11, 124, -162, -204, 95, 150, -270, 143, -71, -298, 95, 91, -10, 101, 87, 20, -72, -21, -90, -61, -58, -12, 75, 272, 5, 138, 341, 127, 236, -172, 404, 49, -19, -162, 57, 24, 177, -234, -63, 138, 218, -15, 79, 172, 337, -250, 71, 85, -271, 199, 227, 194, -136, -133, -177, 107, 127, -30, -165, -260, -50, -52, -5, -215, -533, 132, 117, -255, -64, 206, 146, 172, -183, -55, 183, 97, -451, -122, 19, 162, 394, -114, 62, -90, -310, -71, 4, 186, 65, 98, -67, 8, 119, -112, -40, 230, -99, 261, 217, 258, -11, 21, -236, -127, 43, 212, 111, 132, -85, -353, 112, -194, -35, 94, 119, 213, -184, -81, 278, 170]
2284A70m64L22j75M9j76J68pl00N37k2p6J17k12o5Q6Rj72L35k98M86k23m2m1J68
2308A74O1k29J26j03K41K0n47K94o4O2P0k41J01J54K0o7j62L6K97k30n0K6J4J15
2332A18o8K58l47k8L21j46o6K82k81j59O0q1Jl0J59k77J63P6r8N0L88m36J43n7
2356e5L42j88J16k25j33L43k10K90l32R9J17m11L41n82M29Q3j90L14j10R5j06
2377B7K68o1o20J65M23k64M4J66j37m02L06J69l45M50l67J34Q5N2p9J07k68L28
2399A81l60P6o2K52k04j3L68k60K91j37J34l59J32k93K03J22k85K43o4J78O6l30
2421a21j37K69j22J63j90K13J68o2k4O3k41j33J98j71K54m89M14q6r5N84l91L4
2443I8j47J24M9j71J48l52L88M1k76K19L9j96O1J46k53O3J03k07J21j8p3n9M23
$$ y = [170, -294, 28, -147, -98, -274, -106, -113, -413, 124, 102, 26, 143, -69, -134, -48, -39, -211, 124, -174, 312, 89, 47, 6, 174, 235, 6, 132, 29, 270, 290, -257, 37, -27, 35, 105, -136, -35, 119, 139, 72, -90, -54, 243, 13, -37, -11, 3, 118, 50, 308, -39, -67, 254, 108, 42, 324, 43, -116, -56, -137, -136, -166, -7, -284, -121, -45, -143, -93, 295, -141, 2, -55, 287, 99, 215, -10, -143, 200, -10, 280, -52, 47, 164, -247, 94, -488, -59, 24, -166, 148, 38, 133, 27, 295, 234, -386, -221, 202, -62, -18, 148, 11, -391, -85, 84, -261, 189, -178, -44, 41, 93, 14, 121, -147, 181, -179, -103, -165, 87, -117, -130, 238, -22, 269, 132, 266, -93, 39, -254, -51, 71, -214, 29, -35, 143, 209, -121, -258, 11, -111, 52, -138, 75, 243, 181, 157, 220, -21, -154, 44, -127, 127, -362, 52, -34, -129, 455, 64, 98, -49, 75, 124, -47, 101, -251, 137, 178, -98, 121, 160, -36, 25, 171, -82, -19, 84, -123, -2, -20, -93, -152, 271]
2466B71n18K83j90M43j36p1J49j35j23l39N62j11pm17J59K06k83L85l8k12m2J10
2488e4O2k01K85J11j9l92J86m6J17k77J8J47J35J40k97M10l37J12P5J13k53k79
2510b44K43K02j29j51j25L99p9j7J14j79P8Q3l1j36q0J75j35k83K44N7l01J83
2532a12j24M24j48J67j33k20Q6L61k25j11j5k86N10k14J07j28N4j35J07J87Ln60
2554d05N33q9K6o9J14l18M43l10K8o9j18J48J41J09k10K01l79Q9p2K3J37K12j
2577A64k29K50j87j55L41k97K24k6k98K77j55L66m11k31L97r6L7J90J34p1L7p4
2599A87k62K6K15j77j66K52l0m8l7K78j52l2K3q0Q2j66L68j57kj97ML36n1l26
2623a12mj00J7N52j8m58O1J34j58j71L98N5j74n6O7kJ24J40j72j52l55L96l2L33
$$ y = [271, -247, 36, -154, 289, 153, 82, 231, 96, -27, -366, 196, 85, 78, -339, -180, 26, -257, 128, 90, -122, -164, -54, 8, -193, 92, 203, 184, -208, -22, -68, 49, -228, -210, -63, 72, 212, -85, 325, -12, 100, 175, 288, 35, -244, -1, 201, 72, -79, -204, 195, 116, 99, 213, 34, 112, 195, 164, 28, -52, 123, -12, -295, -51, 6, -295, -112, -236, 188, 40, 207, 74, -146, -60, 301, 76, -35, -50, -336, 174, -40, 67, -61, -7, -142, -35, 152, 155, -405, 128, 39, 65, -4, 110, -208, 235, -75, -47, -116, -234, -86, 55, 164, -46, 155, -224, -135, -207, -184, -47, 165, 164, -65, 185, -2, -157, 184, -113, 111, 85, -213, 64, -91, 275, -136, -367, 30, -66, -29, 161, 295, 224, 261, 187, -75, -49, 166, -11, -177, 75, 45, -3, -40, 238, 86, 54, 77, -3, 79, -87, 281, 124, 122, -75, -71, 265, 214, -112, -116, -216, -199, 353, 335, -123, -62, 72, -86, -257, 141, 196, 22, -34, 33, 31, 155, 295, 123, -29, -384, 12, -20, 313]
2647C13l44J43r0o7l5J44L7j71q8P7N06l48j86K12k02K7L32l77J29k40K56k71
2669b43J21L98k68j31J32o0K11k44J24rr5P0J01k14L10k1O2k16J17l26J61L26
2691C06l82J51q3L32j06k17n9j25L0M84o6l66L62l81K71R1k21K19j13J96m90m1
2713b08P1pK61k12k7n3L88j79k6J41j61j22j44J24K39k39K07l98L75K16k10l39
2735c03K41K50n54L05j66L60J02J05k13j48k03N8J48j26J53k1K26k0l53R6J95
2756A32r3k3K2J71j09mr8J64k36j45k3K12PpOn4M0J72j9K2k61L44k93M4j80L4
2782a75K52m0J35j63J80J8j48k63J44Q4L5q7m5L17r2n05L19J40l26j85L85k9J62
2805A13k05l4R5O0j8J29j85M24k01m78J25J61j80n6N74o15PL6L38q9N2L0K0M5
$$ y = [313, -31, 112, 22, -45, -80, 64, 101, -70, -158, -81, 425, 77, -109, 103, -99, -72, 260, -117, 12, -228, 28, -243, -122, 276, 8, -123, 9, -51, 160, -84, 40, 31, -64, 6, 107, -107, 203, 182, 244, 28, 145, -181, -20, 306, -76, 75, -8, 324, 218, 1, -58, -183, -153, 331, 265, -101, 261, -120, 151, 242, 21, 240, 127, 323, -167, -208, -137, -144, 117, -95, -122, -175, 213, 34, 8, 149, -12, -134, -278, -154, 85, -154, 53, -345, 30, 246, 36, -303, -62, 188, -366, -61, -227, 133, 235, 340, 127, -21, -224, -166, -18, -144, 9, -12, 214, 194, -159, -63, 132, 39, 16, 38, 209, 100, 96, -2, 162, -74, -219, -242, -30, -23, -30, -24, -78, -38, 134, 115, 137, -124, 220, -73, -29, -209, -175, 77, 37, 172, 9, 189, 207, 59, -204, -60, 24, 59, -28, -73, 244, 152, -353, -34, 106, -220, -405, -20, -49, 113, -92, -126, -31, 29, 11, 140, -45, 379, 178, -300, -175, -14, -194, -250, 324, -291, -284, -248, 90, 1, 53, 83, 103, 148]
2829A48k64J98K44k40O6j32M7J22K17j35j24m65K56q7K12J3k19K47K27k89k25
2850a83J01K75N5p3j29K45j33l68N9L08n00N86j71j33K0j18K08Q1m29M47k62N09
2872C95j46k57ml8j8J70m5k67L70mj73k26O37j36j96j30J08n9K29m20J82J55l11
2895a84J58O8m7j60J63M0N8l9j6J89k50R3k22K37n01N36j39Q6n2k44L18k09Qj8
2919a27J09j00j2j03N13l95j06J03K59k28J96k13N7k0j23N51l63p6Q9o4O1K7P1
2942A06l40L32k56K4O0J5O0k85L02p8Q3M1J53m2l53L03j3p0j99M93q47P02n15
2965c24K21r5J25K23k79R0j43l4K14m2j42O9n9J39k5k9q0L02l09K0j63J59j07
2988b69L12k81N25m64K61l64L60rQ7j00J94k01j54P5Oj4o6L97oj99q4k01L03N2
$$ y = [148, -116, 82, 326, 86, 152, 20, 67, 189, 406, 271, 147, -318, -62, -149, 63, 76, -143, 104, 331, 42, -183, -82, 193, 248, 175, 46, 291, 158, -210, -151, 157, -343, 243, 72, -61, -41, -159, 49, 130, -299, 148, -114, 395, 249, -8, -12, -50, -68, 102, 57, -210, 160, 156, -17, -243, 394, 258, 62, -68, 40, -19, 210, -210, -28, 127, -184, -26, 42, -5, -165, -2, 38, 96, 57, 41, 230, -20, 73, -149, 88, -413, 123, -16, 70, 18, -226, 92, -117, -109, -127, -18, -118, -130, -233, 280, -115, -221, -118, 141, -87, 109, -104, -47, -67, -190, 361, -2, -78, 11, -53, 8, 35, 106, -234, 98, -158, -134, -74, -59, 1, -284, 18, -60, 23, 64, 217, 175, -178, 125, 112, 42, -157, 336, -511, 191, -324, -103, -198, -73, 150, -129, -39, -182, -216, -2, -44, -186, -117, -176, -37, -62, -91, -171, 131, -178, -158, -321, -162, -269, 43, -238, 287, -177, 84, -280, 80, 71, 158, 58, 252, 51, -103, -28, -22, -36, -102, 295, 289, 90, 6, -195, 108, 160]
3012A60k75M34n65L5M4J01N3K37k56o5o3Q4m5np7Q7K20j32K4J03J49m38P9K56
3036A45m15M15j88j01R0N3R8o3oN2n6K09j90J34Pj97j50Q8L1mj45O1Q1K87m14
3061a78J03N3J67J29j70Oj50l9J7Q3M8l33M12j18K22m3k30J16k8l88J73J88K71
3084C11l33J31m8j7J3r8j53L0M40k44J91k81j41J56j63K41M7j14M1N5J05J1k73
3107i3N9P2Nk90M03k83p9k81N01n7k10L76k98J54J23k17j0K22j99M80m36Q3k00
3130a75p0L58j46o8p8K25k13Q6J71j2k05K61q6o7k22K40L1k65M2J16J84J13j70
3153E0q9J05P6l05K46L3J64l67L30j01l33M85l93n7J40J22J00l20J0K12l5k96
3175b23M37l43LJ10K30l3k04l12J8P2L13n3K39m22j7L08m55N98j00l42o5J05j15
$$ y = [160, -115, 319, -246, -211, -167, -66, -13, 224, -32, -97, -160, -76, -121, -126, -203, -116, 104, -28, -4, 99, 248, -190, -111, 145, -270, 145, -43, -144, -54, -1, 97, 34, 28, 80, 24, 233, 43, 177, 184, -13, -163, -75, -44, -48, -193, -132, -51, 236, -178, -75, -22, 145, 274, 104, 110, -40, -79, -62, 21, 69, -264, 148, 30, 252, 209, -21, 95, 67, -321, -148, 40, 311, -22, 109, 61, 44, 57, -41, -194, -164, 276, 32, 223, -58, -199, -43, -206, 35, 82, -32, 9, 64, 169, 180, -93, -34, 38, 43, -247, 156, -127, -206, -487, 14, -43, -253, 123, -175, -21, 102, -115, -125, 97, -102, 378, -58, 25, -175, -245, 113, -33, -101, -179, 46, -167, -81, 90, 78, -127, 134, 48, -19, -241, -1, 30, -235, -193, -77, 107, 220, 50, -39, 66, 142, -163, 83, 116, 280, -87, 243, 142, -191, 294, -99, -156, -16, 106, 206, -114, -104, 108, 73, -223, 214, -129, -126, -16, 214, 181, -23, -335, -317, -245, 68, 15, 254, -168, -185, 123, -332, 266, 166, -176, -241, -136, -251]
3198b51M86n61M65o7L1l06q1J25N8n1K71m69K26J50J77k32J27J10j01j04P8J36
3220B17nl81R6j59M6M16k42J1J59k59J60k02R6k84J23M47j67j34PL72m91K36l02
3243b40Q27p07K09m51J85L66j34J87j37l80K74J70m08j9M12j69J20k3k97K55N
3264D5J38n8o5J51k14O2K9jl09M41m5R1l82J55J08r1qk83j70M98K20l10R5j61
3288f4R2o3o6k7K46j74n1K46P7l81L67l13Q9j47N14k30o5M90o91n3K69R5l21L2
3312a29L44l3j49p9j5J13K14k99k14K92k85K83k7Q5j52J33j07j81Q6P0P7q7N5
3335eM1j24K02j21j38L38j06m29P27p32Q7K12k11K67k3L0n3L39k84j09k10M1M60
3358A99j06j86K13l79K96J55m9J12j19M2k53J35L1j21j26K45k36j00K83K35l22
$$ y = [-251, 235, -326, 139, 72, 103, -203, -284, -159, -101, -152, 119, -350, -124, 26, 203, -29, 98, 208, 107, 3, 81, 217, 212, -169, -73, -232, -186, 230, -12, -1, 158, -101, 59, -143, -47, -331, -208, 239, 72, -62, -55, 317, -174, 62, -240, 587, -120, 89, -362, -177, 189, 55, 242, 105, -275, -1, 169, -239, -258, 154, -15, 105, 82, -215, 40, 45, 183, 125, 60, 211, -3, 59, 88, 87, -222, 219, 174, 265, -117, 38, 146, 55, 47, -236, -406, 92, 312, 2, 97, -64, 28, -35, -101, -128, 118, -56, -107, 139, 216, -165, 202, -111, -22, -169, 345, 115, 50, 540, -151, -204, 65, 160, -161, -129, 215, 182, 33, -46, -61, 52, 266, -33, -247, 45, -240, 43, 16, 101, -51, 82, -25, -206, -120, -50, 27, -60, -5, 36, -88, 114, -7, -145, 193, 87, -342, 385, -347, -260, -48, -259, 8, -15, 15, -38, 301, 17, -92, -302, -261, 199, 93, -93, 120, -259, 37, 192, 143, 255, 136, 178, -75, 60, 91, -30, -156, 89, -147, -247, 36, 271, -51]
3379e1K31m6l45J49O2k24L65J6j84K8J95j11p2J10k6J8k52j7J48j52O26k80k79
3402i1J73J79l85j20L74k43J63N8m26J86j28K90j62J66j22j22K45M0l13n8K40
3423e6l4K34l65L17r1J62j30MJ53k51q1J35j06J18j76R5R0K20j74j99%L65l49
3446a19J88j43p4J02m6n7J73m0k1J2L4q7J22J98l31l0j2R7m1k9K9L69j75j94L17
3471B42m7j59k27l6M99j05L0N4k79j81K05J74o9l2k01M81j28l92j0M22l20k82
3493c61M95J03j41l34J3r5M78K2j72J97q7k7k41J62p1j32L01M4r1k41K54J28l55
3516a51Q5J11k83K03j21P3k13J49Q4L83o0q3l85o1L87M2M7o1k08j01R1L4j8J30
3540G4L22k99P2j42k01L85l03j06M25k56j15K58J11j62P7J59l57l02L15L84l6
$$ y = [-51, 180, 134, -211, -62, 0, -224, 141, 157, -27, 1, 196, 85, 13, 123, 97, 115, -137, -154, -6, -158, 468, 188, -91, 82, 261, -124, -244, 130, -113, 50, 108, -318, -132, -260, 30, -132, 34, -88, -210, 35, 75, -238, -296, -56, -90, 144, -221, 96, 5, 167, 37, 41, 194, -57, -138, -3, -109, 9, -167, -72, 18, 238, 64, -135, -135, 230, -119, 69, -74, -148, -46, -92, -149, 24, -16, -37, -25, 9, -78, 44, 242, -89, -119, -131, -34, -75, -104, -75, 294, 119, -75, 242, 195, 36, -191, -227, 272, 167, 197, 251, -28, -209, -4, 170, 101, 69, -132, 349, 221, -171, -181, 241, -79, -361, 134, 237, 96, -238, -225, -320, 158, 180, 8, 205, 118, 91, -150, 12, -59, -191, 110, 154, 63, -178, 76, 204, -151, -66, 45, -238, -35, -156, -83, -296, -147, -63, 320, 260, 177, -208, -269, 118, 160, 207, 146, -62, -163, -72, -38, -56, 74, 396, 97, 169, 27, -174, 211, -92, -198, 227, -29, -144, 114, 225, 63, 140, 299, -58, -360, -45, 339, 303]
3561C03j23k59M9K24l66K27L05m58K48q1J86j00j99J8k34L48l68K47J0L7n2K0
3583a8n4J04J81r7J30m77n8M50K3k92O9M4j21J86k50M39j19Pn7j93L48k04k79
3606b38j0R7j91N89l01J02o1M02n51O6p6L42k60K36l48J96J60l85K25J69J19k10
3628G2L3l44O8L64l33J25J55m67N58j5j70j22J37m2K54l64K73j11l0j40k3O2Q0
3651B0k21M68k79m5j25K70J95l91K36N0m69J15J39L8J58j47K5K00o14K13K03q4
3673d5K04j46l4l50M60l55L02j39L77n33J72O9j05l18M44K49k67k35k2L06k33
3694a99K23R0j39%o6j51m3L26j5J22K4l8O1l89K73l78J50N2n8J25O9k36J79K06
3718A88M6j65o8J05j50K25j5j76rN2L18k29p3L33m05K77n18L43j63L5j53K96M
$$ y = [303, 180, -79, -30, 194, -172, 55, 360, -98, 150, 69, 255, 155, -44, -26, -260, 88, -280, -33, -23, 14, -38, -18, -72, 32, 213, 116, 246, -231, -289, 161, 184, -108, -39, 5, -116, 70, -180, 259, 140, 147, 90, -103, 245, 41, -238, -248, -151, -342, 247, -54, 48, -13, 389, -162, -96, -172, 170, -90, 146, -202, -6, 154, -231, -6, 163, 282, 72, 105, -239, -171, 193, -140, -15, 140, -327, 231, 216, 46, -76, 61, 19, 273, -91, 182, 71, 41, -99, -122, -60, 20, -201, 267, -12, -57, -182, 88, 283, -108, 128, 178, -291, -176, -37, 1, 159, 12, 37, 237, -377, -164, 39, -45, 159, 13, -21, -371, 89, -266, 36, -103, 274, -259, -87, -18, -123, -441, 3, 252, -15, -250, -272, 34, -199, 24, 114, -25, -25, -91, -242, -285, 41, 26, 148, 172, 134, 195, -194, 79, -299, -149, -97, -155, -30, 39, -197, -18, 188, 234, 69, 1, 106, -44, 181, 166, -10, -19, 33, 351, 122, 49, 382, -23, 254, -264, 79, -84, -49, -202, 94, 98]
3741I8N9rm76K41m0M31k69L75J15n68k23J14L51m29J89J7r2K73o2q9j70L81m03
3764a86l1K55K19o1k53J20j25o3J12O3j63J30r2P3k7J05kk15N78n31K27Ql63J35
3788h7qp0q3N66j60k51j4J83j12P3J11l05K33p1j08K03j86n1K2K18k74M33j70
3811I2l02J03L25k20J0N3R0l47K8J84m33K74oM80m12J49j05J75k55J28l4j12M56
3834C21j27k4k89J50q3K38l4n1m2l63K63J07l65O48k52p6L23l93j00K12o9K25
3856B19k77K14J47l53J83J7J88k72j85L9o1L67k24J74j85kK70j63q3L5n3l94K15
3879a84J58J6j57J85l3M9o9P2m68M45R8J34l22o5M38j45l23L38l19J01J33r6p
3902b1M31k61J2k41J99J22O0l67K76m7j88M42m49O6m2j46K97j77l55K76J41j19
$$ y = [98, 157, 148, -328, -87, -127, 304, 35, 410, 525, -43, -266, -152, 199, -230, -41, -24, -116, 157, 95, 6, -164, 217, -186, -217, 38, 257, 196, -57, 63, -62, -125, -13, 50, -113, 17, -75, -2, -29, 76, 74, -141, 437, -94, 133, 141, -222, -87, -95, -165, -248, 318, 158, -93, -107, 76, -36, 37, 148, -157, 76, 5, -103, 100, -86, -137, -115, 103, -171, 262, 92, -210, -107, 218, -2, 8, 61, 151, -196, -168, 16, -417, -143, -149, 331, -81, 68, -37, 138, -117, 11, -23, -135, 321, 194, 170, -119, 31, -52, 186, 152, 101, 59, -304, -41, 66, -299, 349, 97, 21, 344, -49, -149, 63, -6, 219, -58, 156, 303, -50, 133, 150, 338, 66, -119, -80, -141, 226, 2, 176, -9, -11, 259, 96, 13, 48, -5, -399, -184, -26, -10, -167, 18, -15, 34, -35, 37, -431, 14, 112, 246, -76, -141, 297, 152, -171, 167, -152, -51, 82, -14, -21, 410, 149, 161, -80, 119, 241, 301, -66, 210, 163, -25, 417, -32, 34, -8, -154, 143, -34, -389, -113, 28, -91]
3924i1m4J86j4J21l56Q5L17m0J03r5k18l11M07m90O00l88K2L60k76R8K0P3R8l43
3948a76J37J67n1m4rJ07o0j58N4K38j51l67o0L42j15O5mP6M0k01M50k59l6J05
3972I0J30l84K75k24J82K64j01l02P8k03K0K70q5J35k66J0J40J68l86L89q9j67
3994e6L10k05J05k01QL24m71K69K24n5k34L6j0K05k56K54m83K60j08m6K8K75j41
4017C2k6J39m72K61m8L33k47J28l5M1j91k09R6O3p7K65k97J45K20j44K50l31K5
$$ y = [-91, -135, 51, 37, 158, -198, -113, 204, 164, 267, 172, -46, -357, 50, -440, 160, -228, -206, 154, -122, -24, -4, 69, 167, -176, -39, 128, 77, 33, 24, 131, 71, -87, -33, 205, 54, -313, -373, -31, -146, -81, -85, -9, 31, -170, 280, 21, -15, 90, 220, -164, 111, -113, 69, 333, 232, -70, 8, -195, -175, 95, 10, 145, -121, -111, 29, 197, -189, 200, 111, -56, 254, 49, 154, -47, -39, 285, -186, 83, 307, 252, 18, 54, 44, 249, -7, 247, -236, 24, -84, -130, -102, 173, 32, 6, 145, -327, -66, -114, 219, -28, 100, 65, 106, -85, -294, -198, -135, -212, 53, -244, -99, 121, -23, 227, -104, -79]
$$ [...]
8191A65
##END NTUPLES=NMR FID
##END=
