##TITLE=1H_DE-78H_2_HCl
 200.13MHz, D2O,
 8 sc
 
 30.1.2025
##JCAMPDX= 6.0         $$ Bruker NMR JCAMP-DX V2.0
##DATA TYPE= NMR FID
##DATA CLASS= NTUPLES
##ORIGIN= UXNMR, Bruker Analytische Messtechnik GmbH
##OWNER= pz
$$ XWIN-NMR		Version 3.5
$$ Thu Jan 30 13:57:51 2025 Russian Standard Time (UT+4h)  she@DPX200
##.OBSERVE FREQUENCY= 200.1313
##.OBSERVE NUCLEUS= ^1H
##.DELAY= (6, 6)
##.ACQUISITION MODE= SIMULTANEOUS
##.ACQUISITION SCHEME= undefined
##.AVERAGES= 8
##.DIGITISER RES= 18
##SPECTROMETER/DATA SYSTEM= spect
##.PULSE SEQUENCE= zg30
##.SOLVENT NAME= D2O
##.SHIFT REFERENCE= (INTERNAL, D2O, 0, 14.3821)
##AUDIT TRAIL= $$ (NUMBER, WHEN, WHO, WHERE, WHAT)
$$ ##TITLE= Audit trail, XWIN-NMR		Version 3.5
$$ ##JCAMPDX= 5.01
$$ ##ORIGIN= Bruker BioSpin GmbH
$$ ##OWNER= she
$$ F:/spectra/data/she/nmr/H-C/1/audita.txt
$$ ##AUDIT TRAIL=  $$ (NUMBER, WHEN, WHO, WHERE, WHAT)
(   1,<2025-01-30 13:56:59.50 +0400>,<she>,<DPX200>,
      <created by zg, POWCHK disabled, PULCHK disabled
       configuration hash MD5:
       00 E9 B6 7A A2 85 ED C7 34 08 36 98 17 FE 4E 26
       data hash MD5: 16K
       76 B5 EE 32 2D FD CD 24 C1 A6 1B 3A 28 C5 F0 BF>)
$$ ##END=
$$ 
$$ hash MD5
$$ 49 ED 9B 56 3B 89 9D 12 81 BA 9F 9D C4 73 68 9D
##$RELAX= 
##$RELAX= 
##$RELAX= 
##$RELAX= 
##$RELAX= 
##$RELAX= 
$$ Bruker specific parameters
$$ --------------------------
##$DU= <F:/spectra>
##$EXPNO= 1
##$NAME= <H-C>
##$PROCNO= 1
##$TYPE= <nmr>
##$USER= <she>
##$AMP= (0..31)
100 100 100 100 100 100 100 100 100 100 100 100 100 100 100 100 100 100 
100 100 100 100 100 100 100 100 100 100 100 100 100 100 
##$AQSEQ= 0
##$AQ_mod= 1
##$AUNM= <au_zg>
##$AUTOPOS= <>
##$BF1= 200.13
##$BF2= 200.13
##$BF3= 200.13
##$BF4= 200.13
##$BF5= 200.13
##$BF6= 200.13
##$BF7= 200.13
##$BF8= 200.13
##$BYTORDA= 1
##$CFDGTYP= 0
##$CFRGTYP= 5
##$CHEMSTR= <none>
##$CNST= (0..31)
1 1 145 1 1 1 1 1 1 1 1 1 1 1 1 1 1 1 1 1 1 1 1 1 1 1 1 1 1 1 1 1 
##$CPDPRG= <>
##$CPDPRG1= <>
##$CPDPRG2= <>
##$CPDPRG3= <>
##$CPDPRG4= <mlev>
##$CPDPRG5= <mlev>
##$CPDPRG6= <mlev>
##$CPDPRG7= <mlev>
##$CPDPRG8= <mlev>
##$CPDPRGB= <>
##$CPDPRGT= <>
##$D= (0..31)
0 0.7 0 0 0 0 0 0 0 0 0 0.03 0 0 0 0 0 0 0 0 0 0 0 0 0 0 0 0 0 0 0 0 
##$DATE= 1738231018
##$DBL= (0..7)
120 120 120 120 120 120 120 120 
##$DBP= (0..7)
150 150 150 150 150 150 150 150 
##$DBP07= 0
##$DBPNAM0= <>
##$DBPNAM1= <>
##$DBPNAM2= <>
##$DBPNAM3= <>
##$DBPNAM4= <>
##$DBPNAM5= <>
##$DBPNAM6= <>
##$DBPNAM7= <>
##$DBPOAL= (0..7)
0.5 0.5 0.5 0.5 0.5 0.5 0.5 0.5 
##$DBPOFFS= (0..7)
0 0 0 0 0 0 0 0 
##$DE= 6
##$DECBNUC= <off>
##$DECIM= 32
##$DECNUC= <off>
##$DECSTAT= 4
##$DIGMOD= 1
##$DIGTYP= 9
##$DL= (0..7)
0 120 120 120 120 120 120 120 
##$DP= (0..7)
150 150 150 150 150 150 150 150 
##$DP07= 0
##$DPNAME0= <>
##$DPNAME1= <>
##$DPNAME2= <>
##$DPNAME3= <>
##$DPNAME4= <>
##$DPNAME5= <>
##$DPNAME6= <>
##$DPNAME7= <>
##$DPOAL= (0..7)
0.5 0.5 0.5 0.5 0.5 0.5 0.5 0.5 
##$DPOFFS= (0..7)
0 0 0 0 0 0 0 0 
##$DQDMODE= 0
##$DR= 18
##$DS= 0
##$DSLIST= <SSSSSSSSSSSSSSS>
$$ [...]
##$SUBNAM0= <"">
##$SUBNAM1= <"">
##$SUBNAM2= <"">
##$SUBNAM3= <"">
##$SUBNAM4= <"">
##$SUBNAM5= <"">
##$SUBNAM6= <"">
##$SUBNAM7= <"">
##$SUBNAM8= <"">
##$SUBNAM9= <"">
##$SW= 18.0517328524113
##$SWIBOX= (0..15)
0 0 2 0 0 0 0 0 0 0 0 0 0 0 0 0 
##$SW_h= 3612.71676300578
##$TD= 16384
##$TD0= 1
##$TE= 0
##$TE2= 300
##$TE3= 300
##$TEG= 300
##$TL= (0..7)
0 120 120 120 120 120 120 120 
##$TP= (0..7)
150 150 150 150 150 150 150 150 
##$TP07= 0
##$TPNAME0= <>
##$TPNAME1= <>
##$TPNAME2= <>
##$TPNAME3= <>
##$TPNAME4= <>
##$TPNAME5= <>
##$TPNAME6= <>
##$TPNAME7= <>
##$TPOAL= (0..7)
0.5 0.5 0.5 0.5 0.5 0.5 0.5 0.5 
##$TPOFFS= (0..7)
0 0 0 0 0 0 0 0 
##$TUNHIN= 0
##$TUNHOUT= 0
##$TUNXOUT= 0
##$USERA1= <user>
##$USERA2= <user>
##$USERA3= <user>
##$USERA4= <user>
##$USERA5= <user>
##$V9= 5
##$VALIST= <valist>
##$VCLIST= <CCCCCCCCCCCCCCC>
##$VD= 0
##$VDLIST= <DDDDDDDDDDDDDDD>
##$VPLIST= <PPPPPPPPPPPPPPP>
##$VTLIST= <TTTTTTTTTTTTTTT>
##$WBST= 1024
##$WBSW= 4
##$XGAIN= (0..3)
0 0 0 0 
##$XL= 0
##$YL= 0
##$YMAX_a= 334173
##$YMIN_a= -260119
##$ZGOPTNS= <>
##$ZL1= 120
##$ZL2= 120
##$ZL3= 120
##$ZL4= 120
##$ABSF1= 10
##$ABSF2= 0
##$ABSG= 5
##$ABSL= 3
##$ALPHA= 0
##$AQORDER= 0
##$ASSFAC= 0
##$ASSFACI= 0
##$ASSFACX= 0
##$ASSWID= 0
##$AUNMP= <proc_1d>
##$AZFE= 0.1
##$AZFW= 0.1
##$BCFW= 1
##$BC_mod= 2
##$BYTORDP= 1
##$COROFFS= 0
##$CY= -3
##$DATMOD= 1
##$DC= 2
##$DFILT= <>
##$DTYPP= 0
##$F1P= 0
##$F2P= 0
##$FCOR= 0.5
##$FTSIZE= 0
##$FT_mod= 4
##$GAMMA= 1
##$GB= 0.15
##$INTBC= 1
##$INTSCL= 1
##$ISEN= 128
##$LB= 0.25
##$LEV0= 0
##$LPBIN= 0
##$MAXI= 10000
##$MC2= 0
##$MEAN= 0
##$ME_mod= 0
##$MI= 1.114404
##$NCOEF= 0
##$NC_proc= 0
##$NLEV= 6
##$NOISF1= 3.799351
##$NOISF2= 2.8
##$NSP= 1
##$NTH_PI= 0
##$NZP= 0
##$OFFSET= 14.38212
##$PC= 1
##$PHC0= 87.88512
##$PHC1= 2.792229
##$PH_mod= 1
##$PKNL= yes
##$PPARMOD= 0
##$PSCAL= 0
##$PSIGN= 0
##$REVERSE= no
##$SF= 200.129724274929
##$SI= 16384
##$SIGF1= 3
##$SIGF2= 2
##$SINO= 400
##$SIOLD= 16384
##$SREGLST= <1H.CDCl3>
##$SSB= 0
##$STSI= 0
##$STSR= 0
##$SW_p= 3205.1282051282
##$SYMM= 0
##$S_DEV= 0
##$TDeff= 0
##$TDoff= 0
##$TI= <>
##$TILT= no
##$TM1= 0
##$TM2= 0
##$TOPLEV= 0
##$USERP1= <user>
##$USERP2= <user>
##$USERP3= <user>
##$USERP4= <user>
##$USERP5= <user>
##$WDW= 1
##$XDIM= 8192
##$YMAX_p= 0
##$YMIN_p= 0
$$ End of Bruker specific parameters
$$ ---------------------------------
##NTUPLES= NMR FID
##VAR_NAME=  TIME,          FID/REAL,        FID/IMAG
##SYMBOL=    X,             R,               I
##VAR_TYPE=  INDEPENDENT,   DEPENDENT,       DEPENDENT
##VAR_FORM=  AFFN,          ASDF,            ASDF
##VAR_DIM=   8192,          8192,            8192
##UNITS=     SECONDS,       ARBITRARY UNITS, ARBITRARY UNITS
##FACTOR=    0.0002768,     1,               1
##FIRST=     0,             0,               0
##LAST=      2.2672688,     0,               0
##MIN=       0,             -260119,         0
##MAX=       2.2672688,     334173,          0
$$ Real data points
##PAGE= N=1
##DATA TABLE= (X++(R..R)), XYDATA
0@%%%%%%%%%%%%%%%%%%%%%%%%JkNrJ3j6J6j6J7k1K4k5L0l6L9m2M8n5O1o8P6q5
46d5R5j05J15j27J40j54J69j84K02k23K45k72L02l35L71m11M60n16N80o43O86
67C50o21j15J0400J50558J21798J4286o5327j31679j49598j22212n4355J9975
79b06540P9025J06555J06308P0816J3747m0432p3440q3899o6499l1248R241M3524
91g2842O2598N8834L7889P121k2071m0230m4909l8003j8323N656K3971L3062L2872
104B5625K2437N672j2240k4618k5985j9007r514J956J2941J8507J8021J2490K655
117B8940o220j1887j4538j2478n617J733P341J0108R819P204K248m288p907p095
131b637n761l643L76M014N488N334L961J700j609m507m946l179j577L68K337L057
$$ y = [0, 0, 0, 0, 0, 0, 0, 0, 0, 0, 0, 0, 0, 0, 0, 0, 0, 0, 0, 0, 0, 0, 0, 0, 0, 1, -1, 4, -5, 8, -8, 8, -8, 9, -12, 12, -13, 17, -19, 20, -22, 26, -29, 32, -36, 40, -45, 50, -55, 60, -67, 73, -81, 88, -96, 106, -117, 128, -144, 158, -177, 194, -217, 243, -273, 307, -336, 350, -271, -386, 10014, 160572, 282370, 296656, 231329, 99650, -49948, -172160, -226515, -206540, -127515, -20960, 85348, 156164, 169911, 129479, 56039, -27860, -94359, -125607, -116366, -72842, -10244, 48590, 86479, 93600, 71529, 31299, -13610, -51613, -69936, -64280, -40309, -7247, 25625, 48062, 53734, 41494, 16876, -9109, -28116, -37630, -35674, -22733, -4226, 13795, 26285, 28940, 22720, 10833, -3705, -16183, -21800, -20067, -12726, -2618, 7201, 14405, 16653, 12365, 4458, -2637, -8398, -12041, -11665, -7651, -2163, 3171, 7132, 8832, 7223, 2716, -2230, -5409, -6986, -6618, -4281, -1224]
147a224K864K153P81p60j803k732k290q85L83J111J746J862J251L80n24j153j313
164a53j404n61M54N88P45J010O75K77n5o70q98q12m57K51N75N01M15L40k7j20
184F74q5n29o28m8l1J14L38L03P7Q7o7k15l04l25j72J61K8J65K02P7j69J38lk30
208d42Qj24j29J32K72M7J38n2l2Q7j74m3O4K6j01K02J38j40R2rj47J02M3r8K9
233a11R6k6N9R4n7R5p6q4J74l3j56J48N1j02N9Q1j59LM2km8o7m9N1j1r6N3M1j67
262a97R5J1j26MJ37r2L8Q0j23jqP4k4P4k7K1jj86J42J46j34o2J02j4l0K9joK9
291e0j0p5N6j1j6RP5K1L6n3PJ06n5k4P4Rj18J19l6mql7L6M9j09m1P7l4k2O9p6
322c6o7J24m5o3M4L3p8j0Q5nk2N9m8K0l9O2k1N4pKn3RM9j5m2K2K4l0J7J9J3j1
$$ y = [-1224, 1640, 3793, 4574, 3814, 2011, -721, -3011, -3896, -3513, -2402, -656, 1206, 2457, 2837, 2313, 1160, -153, -1557, -2118, -1664, -1076, -331, 679, 1354, 1631, 1576, 906, 8, -804, -1261, -1010, -435, 66, 481, 821, 794, 674, 589, 60, -568, -616, -647, -533, -195, 108, 185, 272, 205, -10, -314, -639, -811, -650, -622, -457, -255, -178, -347, -209, -212, -442, -434, -558, -687, -555, -283, -236, -98, -150, -182, -95, -269, -312, -248, -222, -323, -121, 17, -123, -31, -40, -187, -85, -42, -140, -111, -15, -41, 18, 112, 55, 150, 74, -10, 164, 131, -25, 123, 174, 72, 131, 212, 53, 56, 98, 96, 48, -19, -68, -17, -28, -124, -71, -30, -197, -102, -91, -217, -213, -76, -168, -130, -50, -173, -174, -182, -108, -132, -58, -85, -64, -65, -251, -109, 37, -97, -159, -57, -71, -101, -72, -73, -79, -50, -60, -135, -79, -90, -106, -97, -22, -1, 35, -18, -11, 95, 40, 16, 90, 99, -19, 100, 64, 60, 52, 15, 51, 100, -9, -50, 27, -7, -29, 40, -36, -103, 21, -24, -87, -43, -10, -88, -98, -13, -18, -40, 19, -29, -9, -48, 14, -7, 47, 40, 42, -11, -2, 47, 32, -10, 12, 36, 6, 23, 42, 55, 44]
354D4j04N7Qo2N2K7l2j2N4jnJ1J8jk1o7M9N1l0J7k9Kn0KKK8m2LJ4k5j2Rj9L5j4
389d3k1j5J02m2LN0n2LL0N3n8mK8j8L0j0%rK6JP3p0N%m2lPM5m3J2k6K9l5orK3
425A4k9j6M5k4J9%MoJ3m3N0K9o1J3PL1m8L4j7o0N0K7j9m1K1k6L8k5l1O5j1K2N
458C0j5m7J13p6k3J1M0j7j9L2K9j03Q0l2J0j7P5n7lll2j8QK1n4P0KJ4q0N4K8k3
490bNK8r1J13o0L3L3n2K0o6M9Nl0J0j4M8k3k3J1m2j1P4J4o0J0j1L7Pm1K6Q3o4
522A6n5j4J38r6m5J20j4Pj6n2j9M0K3j9o7M1L3j8j6%j8j6QK3k2O7l6m1J8M7M7
553F4n5j3K4Kj1l0M5kk3kM0m8Rj1K1l6K6M6o7N3m2N9n5KOK2j8Qn1N5o0M2J8%k5
588gM4m8lQm5R7o1mlL4l6M1n0N1j0k0j2K3m0lN3J8nj5L5n8JJ2N5Jq4K5R4j00k7
$$ y = [44, -60, -3, 5, -57, -5, 22, -10, -22, 32, 31, 26, 37, 55, 54, 33, -34, 15, 66, 36, 53, 24, 26, -24, -22, -20, 8, -34, -31, -17, -42, -54, -45, -64, -29, -43, -64, -79, 23, -19, -16, 34, -18, -15, 15, 68, 10, 6, 34, 16, 46, 36, 36, 27, 53, 54, 127, 57, 62, 62, 20, 17, 24, 69, 26, 38, 12, 41, 6, 0, -9, 14, -15, -31, 14, -10, 9, 9, 13, 7, 20, -23, 27, 56, -5, 8, 15, 46, -2, 32, 15, -45, 5, 32, 13, -28, -7, -33, 5, -20, -51, 14, 3, 25, 30, 15, -32, 81, 5, -18, -7, 33, 16, -3, 29, 58, -45, 35, 3, 13, -4, 71, 14, 11, 8, -24, -42, -34, -13, -67, 3, 5, 19, -61, -7, 21, -2, 3, 31, -60, 53, -7, 26, 59, 7, 27, -39, 10, 15, -15, -5, -19, 29, 6, -17, -6, -48, -59, 15, 29, -31, -21, -32, 5, 12, -29, -3, 80, 16, -39, -53, 85, -11, -56, 64, 50, 57, 41, -11, -30, 10, 33, 14, -53, -12, 21, 3, -13, -13, -31, -47, -39, -16, -38, 29, -7, -48, -30, 17, 64, 9, -4, 20, 22, 11, -19, 26, 24, 1, -1, 39, -9, 0, -11, 10, -26, 0, 46, -21, 32, -10, 49, -6, -4, 2, 24, 6, 14, -37, 18, -42, 0, 18, 18, -7, 37, -11, -14, -6, -51, 46, -15, -19, -22, 12, -24, 17, -33, 18, 8, -12, -24, -1, -41, -44, 9, 27, 22, 7, 42, -16, -15, -3, 52, 53, -31, -6, 88, -12, -39]
623c9L7N5o8N6j9j8L3q3L5j8Okj2JL3Q%q6J08k3k0j3P4m4L4kl7Rjl0O0K6Jk4l2
658EM5Mn3m2O8k0J0K3m9M7o3k4M7M3n4K5n7P0m1k3K8L4k4kl4M4l2J5k3PK1RK7
691C1mn4P4l6Nmo2P1n1P6q3Q0l7k2N4m9m2N8j7P5n4PJ2j9K3j6qJ5n5Rj0M6J2l4
725iL6k6l2R3l1l1O5k2o2N8p4J1M8k8L8k5M2m1j5M0r2R2o6P3j2j6K1k8K4l4k2
756b5Q9n4n4M7n7k6Q4r4J6O3J3J2l5J2k8RpM3L6m8l6R7n7PO1k7k3kn3L6Oj4O4
789E5q6mnL8Jm1O8l0mM5p6N9Nlm9Qj0J0O6o9K2l3J8J0m0k9N9J3pOn0N4l9L6L8
824C6l8M1q4N3k3kj9Q1rj3n2N3m9N0Lm2K9J3n6N7n3M3j3m4M5j8Kl6N8Qj1l2K0
857bJ7M6r6N4k0P9m8l0rK5J8j0j6l2RJL6Rk1l2K8o5N8n5N5%rM1knl0J3lj5j9M5
$$ y = [-39, -2, 53, -15, 41, 22, 4, 37, -46, -11, -29, -23, -25, -37, -36, -3, 5, 5, -81, 27, 4, -16, -29, 45, 1, 35, 33, -4, 5, 4, -26, 34, 60, 61, 37, 5, 50, 54, 1, -41, 27, 7, 17, 40, -9, 38, -25, -49, -2, 41, -13, 12, -45, 25, -16, -39, -11, 23, -1, -3, -37, 7, -25, -10, -33, -26, -5, 4, 31, 27, -27, 47, 11, 16, 12, -50, 21, -30, 46, -37, 43, 6, -16, 38, -11, -53, 5, -12, 63, 9, 16, 28, 9, 32, 16, 8, 23, -32, -23, -33, 13, 25, -9, 27, 1, -31, 62, 31, 0, 65, 43, -19, 39, -35, -24, 24, -4, 34, 9, 51, 10, -5, 35, -57, 35, -31, 42, 30, 14, 35, 7, 31, -3, -25, 64, 10, -44, 3, -54, -80, 4, -90, -74, -11, 2, 14, -21, -9, -37, -28, -35, 8, 44, -4, -40, 57, 0, 7, 68, 41, 18, 16, -37, -1, 5, -9, 55, -31, -35, -40, -2, -1, -42, 26, -4, -8, 37, -39, 20, 25, 22, -27, -19, -29, -19, 47, -22, 0, -33, -15, -5, -45, -74, -15, -2, -9, -3, -53, 1, -38, -2, 36, -2, 39, -45, 8, -15, -17, -36, 45, 36, 23, -29, 24, -25, 25, 28, -14, 15, 28, -28, 29, -24, 19, 6, -38, 7, -11, -9, -45, 13, 21, 10, -22, -2, 15, 61, -35, 19, -1, 78, 30, 0, -9, 16, 34, 24, 8, -24, -15, -14, 22, 31, 10, -22, 6, -59, -1, -56, -1, -1, -10, 31, 29, 24, -6, 7, 4, -11, -30, 15]
893A5j0J1J0o8j0Q3j9m7J7J9j9KL1KMm1NJ4kJ7n8KM9j3k9O4o5M6k6M4k6Rj2l6
927c7O3n7lO3m6JM3l7J7k5M5l9rqO2n4RJ5jM9p6Mk6O6Jn3P5j9l4m1L5K8m9j6L3
962b1K9k1k5K2L7k4M0k6NoJ7jo2NnJ1oJ2O7q0N2o1M2J1j6J9m8K0qK1j2MRj8nK5
998CnL7m6M1p7O3n2N2ok6k2K7l3L3j5L1o5Q2o5O0rj9j4K0k9J22p0KpJ6j1l1j1
1031b4J1j6J13r4M8m3k5M5oq0J16j5n7K8Mk7J5Ql1L8k8L4Ll1pM4k1l9R9k1l3p8
1063g0J16p2Pj3J7Q8p8k7P4m0l8O7m8j7J8N3j9k2j0N6k1o4l3O8Lk4J3oJ4l2N3
1094A3m3J3J6K3l7J6m9M1K3j8Rj8J7L8p7L9Ql6lN7k3j10J60o7K9n1j4RK3N4pj7
1126A8Jm0%j5N9k8j0J3K6k1Mnm0N2k2jO1q1k1O2l7O9o7P2q3J7k3K5Rk7P2o5J4
$$ y = [15, 5, 16, 26, -42, -52, 31, 12, -35, -18, 1, -18, -16, 15, 17, 21, -20, -15, -1, -3, 14, -44, -42, 7, -6, -35, 29, -36, 10, -16, 28, 2, 11, -1, -37, 26, -31, -34, 29, -17, -16, 27, -10, 7, -18, 27, -12, -21, -29, 33, -21, -12, 3, 2, 51, -25, -21, -47, 19, 20, -33, 42, 23, -11, -52, -17, 11, -38, -54, -21, 8, -13, -38, -16, 21, -3, 37, 11, 16, 10, 27, 26, -36, -31, -36, -25, -31, -19, 48, -32, 20, -41, 1, 12, -4, 15, -33, -13, -21, 0, -12, -8, 1, -17, -22, 3, -2, 35, -11, 30, -47, 16, -36, 16, 10, -16, -38, -11, -44, -11, -26, 5, -60, 22, -43, 17, 8, -11, -25, -5, -34, 88, 18, 20, 13, 29, 18, -13, -24, -13, -29, 84, -10, 38, -5, -30, 15, 9, -71, 45, 30, -27, 1, 5, -22, -7, 1, -30, 8, -20, 14, 17, -14, -21, 23, 2, -37, 62, 41, 8, -70, 46, -26, -19, -32, -15, 73, -5, -32, 42, 2, -36, 31, -17, -34, -16, 37, 18, -4, -14, 42, 21, -43, -76, -8, -5, -29, -16, -22, -8, -40, 13, -30, -17, -1, 22, -15, 1, -48, -7, 16, -2, 7, -11, 6, 44, -33, 6, 14, -22, -25, 32, 9, -101, 59, -8, 21, -30, -44, -35, -12, 42, 35, 18, 19, -21, -21, -36, 23, -5, -15, -2, 24, 3, 7, 2, -38, 14, -8, -9, 52, -29, -50, 12, -25, 44, -23, 49, -34, -17, -40, -15, -6, -33, 39, -26, -12]
1159a2P5j12K3Mj7M4KN%mMl1j3N7j6L5r9J02n9j0M3o1N4k4J3J6n5L0j9PK6KO2
1192G2k9p0J5pj2K8K3qk2L2q2N8O3j04K9J4j1mK3N1j00M5OK0n2M6NOm9pJ1kK5
1225A3j6l3L5K2p5L4j9N2qn1N4rLm1M3J6m9M0J1n8M2k6j0O1Pj7l8qN5qp1K2N1
1258B4n2J7K7o9J13j17L8j5K3J3J6j7l8P8n0qL1rj1K2k5k2N0n1O3m6k1Q0n3P6
1288F7j31P3K0n2J6J4k8J1L5m4J0k1qK0L7p3j2N0LJ2oM7ln8k9M6pp1L0K7M1qn9
1321e1O2k6rJ05j00km9J04l9K2jJ9nl8J3Ok4J4J1NMk0n3P3j9l2M7K0m2k6R9p3
1353en1K6pM3lN3m5n2Q7r5oL9j2R3k3j06N3OJ1m7L6Kl2K9M3l1L0m2j4j1L2J2l7
1386b4n2P4M3o1M6l7m2P3n5K3k9O9o7M8j6j4K5OK1n1PLN8o0O4r8M0L3l2N0nm5
$$ y = [-12, 63, -49, -26, -22, -39, 5, 7, 12, 12, 8, 12, -19, -32, 25, 9, 44, -55, 47, -12, -22, 21, -40, 14, -10, 3, 19, -36, -6, -25, -18, 8, 10, 72, 43, -27, -12, -19, -31, -3, 20, 12, -10, 22, -60, -2, 61, -43, -14, 0, -11, -15, 8, 59, -41, 4, 10, 30, -22, 24, 29, 35, -14, -21, -10, -12, 13, -3, -36, -1, 21, -54, -20, -39, 13, 5, -46, 8, -1, 2, -39, 4, 20, -29, 11, 22, -36, 6, -20, -30, 31, 38, 21, -17, -25, 30, 22, -49, -27, 24, -28, -11, 16, -53, 60, -57, -19, -34, -11, 2, 18, 1, -37, 41, -9, -17, 14, 5, -6, 16, -9, -31, 19, -32, 31, -15, -36, 44, -9, 67, -64, 9, 29, -23, -7, 7, -21, -10, 25, -19, -9, -30, -38, -18, 19, -54, -66, -16, -13, -1, -7, 40, 37, -21, -50, -4, -11, -82, -52, -25, 16, 8, -51, 11, -15, -24, 81, -19, -21, -70, 34, -5, 17, 16, 35, 30, -8, 5, 11, -13, 1, 12, 17, 21, 1, -52, 21, 2, -30, 17, 37, -5, -31, 68, -5, -56, -30, -37, 6, 3, 56, 11, -41, 46, -49, -55, -16, -28, 65, 42, -64, -11, -5, 6, -41, -5, -3, -35, -6, 37, 6, 36, -6, -20, -31, 1, 13, -24, -76, -2, 41, -20, 26, -11, -53, 20, -35, -12, -41, 28, -39, 9, -7, -21, 4, 10, 31, -20, -13, -10, 48, -12, 52, -46, -6, 27, -5, 45, 40, -5]
1418eN3m7%J9n3J4Q8k5l7K8pl1Mkj1%J0j1L3q3j0R8l6Ll7K1K8o5O5j2%qkL0k0
1453hJ2j2K5j8m6N0j1K8Mk5j1J9L2r4O8p4O3qP7r5J0L7l0MJ6o0L1nJ0qk4J2M1
1486A0M4n0L1Mm6%P2q2K4o4L9KPj3J8j1Nj8L7J4Jo8N1N5o0Lk5rN7k3mL2j2Pq8
1521f0M7%LK8l8N6rn5N1J2j8q6J01k4j3J5o3M9M%L6l5k0O5o6J0J3L5k1k1L1Jk5
1554Cj5lK5j0J1k3j3J4j4%K4lK0p2J8PJ7J4pK2Nl1KqM2l3qk6K7J8kk5J2K7j9o
1590a0k3QM2n2K5O3l6k3%m6K0K0o4N8L4n0L4l4k0L3J1L1o2N0J1l4l6QL8J2K2o1
1622c1P9m3j0j0LM3m2K4K0n4L0K4m0K9k6%J2qn1P2j1K9m1qpKj5K7k9QM4m9N2j
1656B2m0nJ9L1n8Q7m9l8O7k6K2o3L2Jj0M8o5L2k6J3KlJ3p9O1O0k8K5l7l2L0RJ0
$$ y = [-5, 48, 1, 1, 20, -33, -19, 69, 44, 7, 35, 28, -3, 1, -1, -12, -12, -2, -13, 20, -63, -73, 25, -11, -8, -45, -24, 4, -61, 4, -8, -8, -16, -18, 12, -8, 4, -8, 17, -1, -47, 3, -8, 20, 24, -1, -12, 7, 39, -55, 13, -61, 2, -6, 71, -24, -14, 23, -7, -3, 13, -47, -16, -21, -11, -19, -43, -31, 10, 54, 4, 35, 39, -7, -7, 65, -17, 7, -57, -18, -16, -9, -22, -4, -15, -10, -28, 9, 23, 24, -44, 7, 62, 2, 5, -20, -29, 28, 5, 1, 33, 21, 28, -60, -13, -13, -10, 18, -20, 36, 27, -28, 23, 35, 17, -69, 32, 8, -5, 10, -53, -4, 0, 0, 36, 1, -19, 46, -20, -10, 3, 38, 17, -4, 27, 28, 3, -12, -15, 10, 0, 11, -12, -25, -11, -25, -25, -1, -4, 16, -56, -38, -31, -14, 0, -7, 15, 20, -11, -9, -17, 25, -8, -16, -42, -15, 3, 1, -24, -12, 15, -4, -10, -33, -25, 17, -35, -10, 53, 17, -6, -6, -52, -32, -12, -76, -18, 16, -34, 0, -34, -54, -21, -10, 21, -41, 9, 20, -14, -50, -42, -4, 8, 30, -31, 48, 5, -5, -15, -12, 31, -11, 13, 33, -21, 9, 33, -7, 22, -4, -4, 8, 0, -51, 21, 10, 39, -2, -10, -17, -15, -30, -3, -32, -24, 20, -29, 23, 22, -18, -23, -4, 27, -31, 56, 7, -31, 36, 10, 32, -31, 1, 2, -8, 40, -25, 7, -19, -6, -4, -7, 6, -73, -12, 48, 20, 45, 8, -24, 6, 15, 25]
1689B5n4PqJ4jLN9k7j9j3omJO0kk0k0nK4j8L1L4j5k4l5MN5k4k0l8oQ6n6OJ2o7
1725f1O1J7l5K5m4M7mj2p2L2N1J8l8Oj0j%n3R8qk0Rj7M2j5k7Nk8M6rJ3j8k0N8
1759C6o6L4M4l6L1l5rOl2j2J6OL1j9rrL7J3Nl2L4n7j8K4M1M5q9M3k6%K5m9L5P
1793A5k1K8kk5J7l7Qp3J14j2nq0L6K3M%NM4r9L0L2l7K7o0M7K9J7J0j9n5M1m2M4
1826Dn3Q9r8L2O7q5O6k7K9n0QJ9J1Mk1Qk3K8J2m4L5j9l7R0n8nJ7J8Pn6M0J4o0
1859c8O5p7O3jr6N6%rK9Mn0Q8ko3J9%l5J01m5L1m5K4k4pkj5K6L8m8L8j9n2O9j3
1893A0J8l0Q%j0k9ON5k7n7N7k6M2p8N4K8n1P2n9K9n1L8M6m7l6K5J0J8JM4n3n5
1925d8M4k6O2q4J5N6k5rk7N5Jk2J2k8k9N9k2j4k7P0N3k6%r8P1j3K1p0M8LJmk6
$$ y = [25, -29, -22, -30, -16, -17, -14, 45, 18, -1, -14, -20, -24, -23, 37, 35, 15, -5, -10, 14, -4, 27, 61, 46, 22, -13, -9, 46, 22, 2, -36, -42, 44, -12, -6, 6, -61, 0, 17, -18, 7, -37, 10, 6, -6, -78, -46, 5, 23, -15, -9, -19, -20, -20, -73, 25, 17, -3, 6, -11, 31, 16, -11, -6, -34, 12, 3, 16, -2, -22, 36, -30, 4, 48, 12, 43, 8, -1, 5, -27, -39, -23, -17, 14, -5, -14, -23, 14, 27, 32, 0, 34, -23, -41, -17, 24, 69, -20, 23, -3, -3, 22, -27, 8, 15, -6, 22, 20, -5, 12, -25, -17, -90, 24, 12, 7, -73, -37, -14, -10, -10, -5, 39, -60, -30, 2, -35, -8, -68, -21, 8, 25, 35, 16, -39, 2, -40, 4, -49, 40, -58, -26, 41, -44, 22, -5, 24, -26, -18, 1, 12, 16, -5, 3, -20, 8, 20, -24, 11, -8, -45, 45, -13, -18, -1, 17, 24, -32, 8, 22, -38, 27, -50, 13, 12, -84, -28, -28, -37, -8, -4, -54, 34, 32, -31, -12, -12, -47, 54, 9, 40, -5, 19, -5, -12, -14, -29, -3, 35, -13, 25, 6, -46, 23, 10, 28, -2, 6, 6, -4, -33, -27, 28, 1, -56, 1, -25, 17, -61, -7, 21, -30, 42, -17, 12, -39, -1, 45, -2, -38, -13, -3, 15, 16, 60, 7, -48, -4, -30, 32, -52, -37, 19, -6, -15, -42, 13, 14, -8, 4, -24, -53, 6, -16, -30, -57, 13, 66, 40, 40, -58, 13, 0, 21, -49, -1, 2, 3, -1, -27]
1958b7mJ3J9l4QJ2L4N6j12N3kj0K5J2l0m9jJ7Rkl4P1k1k1N2o3j%j4K0LQM8l4L
1993Dl5L3O4j01O9o1L5Kj9k7K9%M8o2NK7K6l4l4M2k6L7j3l0K0k0k9M7J2Rr4O4
2025a2PM3o0k4Q5j1jq0K7qP1m4K5l1JL3o6N8nLl0M8o8oL7Ln5Q1o4M7k%j1j7P9
2060E3p6M4m8QP7q5K9n7L4L1k1L4M3m9j0j1J5k4l6O1L4p9O4n2J5N6m1KMn5P4n2
2092a8Om5M2M5mnl1KlM2o2L2L1Nj9rl3jmNk8J07k2j08R6n8K7Jj6m7M7M0o9Q7l6
2127cJ0m7N8j5l5J8L5r4N8RkRk6O7n9J1K2j6j2j3JJ6j8Rm7M1L7j9PMJLn5N2k5
2162a8n7J12Lk1j3k3k2O5j4n0L4J7j9k0N8j7j5nJ6j4L5j09Q9Lopj2K9on8K3MQ0
2195F2q0M9o4M7J6j6j1POn9L2l2ML9j9J7K8m3M3J3k8Rm2L3j0kn2N0K9nn7N8m2
$$ y = [-27, -31, -18, 1, -33, -25, -13, 21, 77, -35, 18, 16, 6, 31, 43, 13, -36, -37, -20, -11, -13, -47, 24, 3, -18, 34, -29, -30, -30, -44, -24, -21, -13, 35, 1, 4, -31, 2, 66, -35, 34, -27, 8, 10, -9, -36, -7, -7, 41, -21, -16, 11, 37, 3, -31, 11, -15, 22, 9, -21, -1, -21, -50, -3, 9, 18, -76, -12, -5, 38, -22, -46, 39, 28, 27, -53, -26, -34, 37, -7, 18, -13, -12, 21, -45, 13, 8, 11, -19, 29, -39, -45, -8, -5, -60, 21, -43, 4, 2, 2, -9, -26, 53, -23, 21, -27, -19, 58, -27, 2, -55, -21, 10, -11, 23, 66, 17, 7, -4, 11, -13, -49, 12, 46, -33, 31, -21, -6, 50, 9, 11, 15, -40, 34, -18, -12, -57, -15, 30, 26, 21, -10, -8, -11, 31, -31, 1, 32, 37, 18, 9, -24, -25, -29, -24, -52, 55, 33, -75, 21, -37, -10, -9, -25, -72, -25, 15, -54, 33, -3, 7, -40, 18, 3, -32, -14, 21, -73, -15, -6, -8, 1, -25, 42, -17, -6, 16, 0, -12, -25, -24, -8, -26, -17, -64, -23, 14, -5, 2, 6, 7, 10, -45, 7, -18, -75, 37, 40, 19, 6, -17, -39, 26, 12, -38, -4, 13, -6, -26, 32, 15, 0, -5, 11, -3, 32, -77, 12, 15, 9, 2, -10, 19, 13, -45, -22, -18, 62, -18, 31, -33, 14, 30, 14, 3, 10, 16, -43, -11, -43, -39, 0, -19, -2, 26, -17, 26, 39, 11, 20, -22, 11, 1, -1, -53, -3, 26, 21, -36, 22, -20]
2228b0l3M6J6l4K9k2P5j09M8l5N5mJ7n3J4MOl1R3o6L3Ol0J0m7J1K3J1k5Lm2O3
2260A2m6O4j4Jk6J2K2m1pK4k2O3o7M7p2K5N0l5n6P5J5o2M9nl8oP7l3P3n9mPJ4
2293C7k2JJ3l4J8oPo4N7l9N6o3M0nJ7%j1n5L4N8m6NRO6k9j8p1j3J35j07j6ML4
2326hrL4k4Oj3L1j6pkK2l9J8RJ4o0Q0p5M4n5M7mk3O5m2j7K8j4k6N4j5k3QLL2j1
2361A2Oo2J3MRL4j%j6L9m4rj4mj1L9l0K5kM3j2k2J9k6j0N2j5PJl8K1KJ2q7P5j3
2397cN5p2J6M1j0J0k6l0K6K5k7j4J1pQqk2J1mO0o4N2k0j1j6K2Qo7M3O0l8Qqk7
2431a8K2j3L6o6K9Pk0j5O7Jk6l3J6J1o2K9L6j7qKL4kk9j7J4Ll2J02l4n0O8k6K
2464A1j8j2J7m5k5O3J6J9%k2M6o5K3k0j2kN3q4J9m4P9Oj5L7m6L6l0L1k7J7qJ2
$$ y = [-20, -53, -7, 9, -25, 4, -18, 57, -52, -4, -39, 16, 12, 29, -24, -10, -6, 0, -31, 62, -4, 29, 35, 5, 15, -32, -21, 2, 13, -12, -9, -51, 12, -34, 30, 16, 17, -9, 3, 25, -16, -23, 1, -21, 42, -25, 22, -50, -25, 25, -10, -66, 9, 24, -38, 11, 6, -32, -38, 39, 6, 79, 20, 16, 23, 37, 15, 16, 29, -5, 13, 7, 14, -50, 7, -32, 24, -39, 1, -4, 13, 13, 2, -53, -19, 39, -7, -2, 7, 73, 44, 26, -45, -58, 77, -30, -46, -42, -8, -17, 17, -7, -1, -14, 17, 1, -6, -8, 14, -25, -7, 2, 16, -44, 36, -39, 5, -50, -3, -7, -30, 35, -7, -24, 4, -10, -36, 18, 3, -20, -12, -9, 23, 12, 18, -44, -31, -27, -18, 16, 15, 15, -1, 38, -6, -15, -29, -33, -44, -5, -35, -10, -12, 31, 19, -3, 16, -10, -20, 32, 17, 24, 25, -13, 8, 10, 22, -65, 10, -3, 52, -20, -4, 37, 27, 37, 11, -19, 7, 32, 5, -9, 2, -5, 3, -5, -27, -16, -20, 40, -24, 28, 8, -3, -19, 3, 11, -56, -13, 47, 9, 17, 9, -18, 4, -9, 27, -39, -10, -3, -23, -38, 29, 30, 4, -29, -13, -2, -64, -35, 1, -16, -24, -22, 12, 10, -19, -36, -22, -19, -51, 51, 17, -33, 35, 9, 11, -7, -19, -2, -47, -72, -9, 7, 26, 26, 4, 50, -15, 8, -12, -24, -26, 27, -57, -38, -82, -3, 3, -12, 25, -21, 15, -15, 16, -11, 6, -2, 10]
2496A0m3N9Jl8M1j3j8k9L2%n5M5j4M5l1Mj0K6j6J0k6J9PJ3n3M5k4L0m5L0L0m2
2528a0J5l1K2L3j5k3oM3l4l1OL1P6r5M4o1pJ6k8J10q2lN6k6J6J2L7n3rl3J0J6
2560dK7L8p4l1P6m7L4k0n1M8k1K4K1Nj7nm6P0j7RK3n9K8k3Lj1P%J4PKN4j08N6
2594A2K0m0L1K6m4p9J03j0n2OL8L2l5k4L2J7o0PJ6kJ6k9POK4o5J8Kl7L7M5nk5
2627a2M4j4k4NL7Qm7K7k1J7n0J9jJ9k0k0ML6n7O4L3l6j5m5J0P6r4O9l9mJJk0K1
2661b8mJ0K6L8o3l3P8o8K4K1k2K6RK4l2Qj1J3L1n5J21j15K1PL9n1Rk6%o1M4J5
2693eJ1k6nN5m3O9no4J9Qo8K2K3qnJ6k4M9j1m4K3J1KJ8p1R3o1J2K3o5O0J9j8O2
2727G2j13M2l4J4M3m4N0p0k3L3L3oJ8%k4j7L5j4K9nj4mK2l8m0N4jM4l8rj0K1p
$$ y = [10, -33, 26, 27, -11, 30, 17, -1, -30, 2, 2, -53, -8, -22, 23, -8, -4, -14, 12, -4, 6, -20, -1, 6, 19, -34, 11, -13, 17, -28, 2, 32, -10, 5, -26, -4, 29, 14, -9, -15, 28, -6, -37, -31, 0, 76, -19, 25, -36, -43, -27, -55, 55, -27, -30, 26, 0, 16, 28, 65, 12, 3, -30, -20, -4, 23, 61, -13, -44, 32, -15, 19, -1, -52, -4, -25, -1, 20, 25, 8, 3, -43, 27, 10, 19, 42, -17, 11, -12, -9, -20, -13, -13, 1, 8, 10, 64, -44, 12, 32, -8, 23, 49, 5, -74, 29, 19, -33, -27, 11, 43, 8, -16, 16, 33, -27, -20, -4, -6, 10, -19, -12, -6, 18, -47, -29, -27, -64, -27, 18, 13, -12, 32, 18, -6, -1, 36, 44, -3, 24, 3, 20, -30, -11, -12, 7, -13, -33, -29, 7, -50, 14, 47, 11, -4, -49, -39, 37, -57, 12, -27, -31, -30, -29, -49, -28, -32, -22, 4, 42, -21, -54, 24, -44, -20, 1, -21, 5, 14, 38, 6, 14, 3, 16, 47, -8, 113, -2, 19, 26, 65, 14, 23, -3, -3, -64, -20, -5, 6, -20, -25, 30, -13, 56, 51, -13, 6, 14, -54, -32, -9, -17, -22, -6, -30, 19, 8, -36, -13, -2, 0, 18, -53, 40, -21, -9, 14, -51, 9, 28, 10, 72, -41, 1, -33, -19, 24, -20, 30, -40, -63, -30, 3, -3, 15, 15, -9, -26, 9, -5, 24, 19, 5, 1, 23, -15, -55, -1, -2, 42, 4, -5, -15, 6, -1]
2760ak6N8Mk0m4k8M1OK9k0k9j4M9J8j3k7j2L9l1J5m1L0RqM8r3J5M9L0m5J2k1L6
2793A5n2jk3K7N8j6J6j7lQnj6P6j20K5K9k6J3l2oL8nj7Pj2N3m9MJK0L3m7QP5n4
2828Ejl2P3jo5L5k7O1o2K3J8n3N2j5j5l8mL5l1P8n0J1J7o%j0J6o6P6j8oo5JO8
2862DrlN0r3M2mK1nJ8l5L0Qj5Rok1j5JJ8M5j9j0Lj6K9m8M0J3jmn3L6j3L2l3j2
2898a6M0j9k0PO0l5pK1k8q5K0K9N7l4K0J6j9l5J3L8oL4l3J0n8N3k8K0k3k1QL8
2930A7Om1K8L7n2Qm0L8J8j1mM5j01N2l4oRlL3Pl0j0J3K2k2O3l4J5k9m2N8jLn9
2964d7N5j7k4l0K6M8M9kj8mo3J9j7KJ1o6P3J3M5n3j4k1P5j5p1K7m4M1K8K1m7K2
2996Bro6N3%kK1LK1J5l9P7p9L9j7kj2lJN7l2om9j1J5O5o1N8M5r6kk2K1L9k6p3
$$ y = [-1, -27, 31, 35, 15, -29, -57, -16, -10, 19, -1, -30, -44, 5, 23, 10, -17, -29, 10, -21, -6, -47, -17, -8, -16, 32, -61, -46, 3, 33, -12, 0, -21, 15, -37, -38, -61, -34, 24, 8, 24, 7, 4, 12, 7, -9, 67, -53, -28, 1, -25, -12, -44, -50, -12, -17, -34, -27, -39, 14, -35, -31, -30, -10, 23, -24, -16, 59, 5, 4, -28, 45, 44, -21, 14, -13, 48, -14, 9, 27, -26, 26, 11, -4, -42, -46, -11, -42, 36, -14, -3, 14, 8, 8, -2, 14, -52, 24, 6, 0, -65, -64, 4, -5, -8, 42, -51, -9, -13, 8, 3, 21, -14, 16, 24, 9, 18, 12, -9, -24, -23, -5, 40, 21, 11, 14, -2, 27, -21, 19, 32, 31, 27, -26, 10, -3, 29, -4, -16, 24, 5, -15, -8, 52, 17, 10, 31, 3, -82, -62, -33, 24, -10, 10, 26, 7, -28, -15, 23, 17, 51, 18, 28, -30, 23, -5, 15, -8, -29, -21, 17, 23, -18, 10, 47, -5, 3, -37, 1, 19, 8, 4, 49, -52, 0, -34, -40, -31, -34, -1, 6, -24, -34, -21, 1, -21, 42, 8, 23, -6, -48, 10, 9, 12, -47, 8, -9, -33, -63, -37, 11, 60, 58, 40, 36, -27, -8, -25, -23, -12, -78, -5, 8, 53, 0, -14, -35, 40, 25, -46, -19, -63, -22, 6, 27, -20, 2, -7, -73, -20, -20, -22, -1, 2, 23, 38, -1, 76, -3, 36, 19, 17, 5, 2, 3, 60, 28, 22, -27, -38, -23, 42, -19, 39, 84, -12, -14, -36, -15, 24, -2, -75]
3031g5J8O1L1Ol1lnl2J7M9Op3M6m7J6Rj8L7rk1PN4n3M4k2Kk2N0n3K8k0J6J0l3
3065a0L3l3K2o1j0Q2J7l1Pqk7L0k2K6L8j20J38n6J2K0m5ll8R9n2j4j3N3q3R2n6
3096a3qL6k7J1l9M2K8k5p7O4j1N4n8L7k3J6Nl3J0k4P8m9%J7m8P1k4O%L3l5k1L2
3129B5j0Kl8O5q6N6QJ0k1m0J0OL3j9k7M9l6jK8n3LN9l8jJ9k2L4k0j7l8N7l0L0
3162coJ4rL7k1J7n8j6j6O2oL4Jn3J4J7m1K5K3k3O5l3j8J0Jj8oL6n0j4j7K1M2k0
3196ijJ7J2n3LM2oj8L6Nl2L1o1P4k0J5l2rPL8l9l9N9MJ1n2MJ8m9N0MJ2Nn5Q7j9
3232D0om3O4k7n6N5l7n3K1qM9K5l0k2M7l7kj4K9O1n4j6l1M6j8K4l9J3J3j3N1J0
3264D2o9L5J9m2M6On6J1K2K4j6n6O6l7o1N6K0m8L5O3n3K8o5j6O0n2L9J5J6m5j2
$$ y = [-75, -57, 4, 35, 41, 10, 7, 2, -30, -13, 36, 42, -31, 15, -32, -16, -7, -25, 12, 3, -18, -11, 43, -10, 34, 12, 14, -8, 42, -11, 17, -3, 13, 23, -10, 23, -10, 12, -49, -59, 23, 40, 9, 16, 8, -19, 11, -11, 15, 53, -67, 71, 15, 27, 47, 2, -1, -39, 60, 8, -6, -19, 34, -49, 43, -13, -21, 15, -12, -1, -40, 2, 30, 5, -72, -8, -19, 35, -23, 14, -9, 7, 12, -21, -11, -35, 43, -6, -6, 11, -37, 34, 10, 16, 16, 49, 14, -7, 25, 15, 17, -21, 44, -42, 14, 22, 32, 11, -29, -19, -13, 20, 1, -26, 23, -13, -14, 14, -39, -36, 23, -15, -16, 3, -19, 15, -5, -22, -60, -3, -33, -3, -9, 5, -4, 33, 12, 29, -29, -45, -61, 1, -5, 29, 30, -23, -9, 8, -33, -8, 15, -8, 57, 24, 6, 16, 17, -1, -7, 29, -21, -35, -52, -31, 11, -9, -10, 7, 19, -34, -31, 11, 5, -13, 23, 28, -4, 27, -34, 40, 20, 35, 3, -6, 1, 39, 0, -39, 20, 24, 35, -17, -13, 5, -44, 6, 10, 22, 27, -28, 59, 40, 34, -9, 55, 28, -28, 27, -10, -63, -42, -50, -1, 24, -6, -28, 19, -18, -20, -34, -5, 56, 2, -14, -45, 1, -17, 7, -32, -19, -6, -19, 32, 42, -27, 8, 27, -15, 31, 37, -19, -8, 14, 38, 22, -34, 32, -5, -66, -10, 10, -38, -3, 60, 7, 35, -30, -46, 14, -38, 1, 16, 32, -13, -25]
3295b5l5L9L6o4K1K5N9m3n6J5oO1k9J1n1N3n7Q5l3LmK8M0j32Q4n0pM6J4k4J3k4
3327gL1k9j6k4L9Nk2J9j3j0K7o4PO0K3pj9n8M5l2J19o1j3lO3q7Q4n5K7m9jK2j4
3360a3L1j1k7k4P2l2kk2L5k6MMkl4J4K7O2p6m8Q5n5K1n4O1Ln6Q4l8J0J9J1l1r
3393a7O1j05P9Ok5N2n9j1J1L8l7RpN8p7L6m9P2n3J1Ol8P6m8K5L0l1L6k8j2L9m
3425D4l4j0Jl6J3M9K2n5l2R3pp0lJ6l0m5P2k6M9M%k5N7m9L9Nl9PpK3j3o7L6j6
3459c4L1pj7j7j5O2m9O2j5O0r7L4m6L7%pQj2K9l9j5M7j1J8n7O5l2N0m5K5m9M4
3491Hk7K5N1o7Pk3K8m8J1K3Mk0L1k6Mm9P0oL2k5ML4k2l4J6k4N7k2n1O3l6mMM4
3525C2p0R1k7j7K7p2L7k9M7j7Jl5OJ0k8kJ9L6kol8jkO0L6k8m0K3j9oM3l0m3O1
$$ y = [-25, -60, -21, 15, -49, -28, -3, 56, 13, -43, -28, -34, 27, -2, 9, -42, 11, -46, 39, 6, 9, 5, 33, 73, -59, 25, -25, -32, 14, 28, 4, 17, -7, 24, -5, -21, -45, -6, -1, -23, -4, -17, -27, 0, -64, -57, 3, 26, 19, 0, -58, -13, -45, 74, 13, 0, -3, 60, -27, 57, 2, 29, -20, -21, 1, -13, 18, 7, -20, -44, 28, -4, -6, -28, 7, -19, -15, -11, -13, -47, -33, -6, 56, -20, -68, 17, -38, -17, -71, -10, -7, -63, 21, -17, -7, 12, 23, -8, -17, 44, -61, 18, 24, -1, 51, -8, -19, -8, 30, -7, 2, -5, 53, -24, 12, -37, 35, -18, -7, -1, -39, 37, -11, 14, 44, 13, 49, 21, 9, 48, 44, 10, 0, 1, -35, -22, 27, 49, -6, -38, 55, 48, -22, -25, -9, -39, -84, -12, -38, 11, 15, 15, -10, 47, -2, 37, 42, 3, 10, 3, 26, 13, -54, -18, -34, -3, -10, -27, -44, -59, 3, -46, 16, 1, 61, -36, -2, -48, -11, -11, -18, -10, -22, 7, -32, -47, 0, -11, 7, -50, 15, -17, 33, -12, 13, -36, 8, -19, 6, 57, -10, -3, -26, 2, -46, -35, -12, -8, -28, 3, -23, -19, -68, 2, -4, 28, 3, 7, 41, 19, -15, 1, -23, 34, 12, -39, 24, -12, -16, -12, 32, -38, 53, 26, 9, 36, -36, 1, -28, 19, 2, 3, -32, -26, -16, -44, -46, -27, 9, 7, 1, -37, -38, -40, 20, 56, 28, -12, 11, -8, -14, 29, -1, -44, 17]
3559A7j9j1J9l3k5P7n6L9L0k5m8M8jk6j8O3j6Om4K6j4K4j6N2q4L3k1jRJ3J2n2
3591d2lN5l2K7k2K5J0J8k9l1K9k7NL1j0m0M6j3L2o1mJ9K3l6N9o4nQ7k8j0k3l6
3623e0Q4o4J3J0K1o1LR3m1l2N6l1k8k2M9j8nJ8k0N0K4l8Kj1k8N4qJ3m6N9o1k2
3655c7P4k7l7PK8o3M9jl4K5Ol6J7PJL6o7O9m0OL1Nk8qQ%jk6M9k6PLjM5p6K1l5
3692d9J5L5Qk6J8M2p2L2k1PQm9Q8k9p7K6Q1Lnn8M6j7k3nk2JN3l4M8o1K4k5K9l
3726a2K0r%K8rok5K3k7M8p3K2jL0n2K0M7j05O9K2m9j9M8K5m2K4L8p2L0ok6M8q
3759Ak7L8k7j0m0P5Llm9R3o8rM7l5K4mn6N2OQj9L4l3J1qrlJ3m3N2%LqOL0kp2k0
3797d9R9k2oMl8K5m4M0J0k7L0jqk5L4K9m6n0J3%O7l6J3j8j5O0l5j3Mk6R9j19P
$$ y = [17, -2, -13, 6, -27, -52, 25, -31, 8, 38, 13, -35, 13, 12, -14, -32, 31, 15, 21, -23, 3, -11, 13, -3, 49, -35, -2, -23, -24, -15, -2, 10, -42, -45, 10, -22, 5, -17, 8, 18, 36, 7, -24, 5, -22, -17, 14, 4, -36, 10, -3, 29, -32, -36, -17, 6, -30, 29, -35, -40, 47, 19, 9, -14, -50, 34, -30, -17, -7, 14, -47, -44, 49, 8, -24, 32, 1, -27, -49, 0, -18, -23, -5, -25, 25, 49, 11, 13, 2, -26, 28, 20, 33, -13, 46, -15, -37, 37, 10, -27, -20, 8, -55, -6, -7, -41, -16, -10, -46, -29, -22, -21, 15, -52, 17, -23, -17, 14, 19, -9, -17, -9, -9, -10, -36, 13, -13, -6, -3, -4, 41, -35, -14, -49, -34, 1, 9, -17, 1, 43, -29, 3, -18, -11, -3, -52, 36, 7, -70, -44, 37, 40, 35, -23, 23, 6, -17, -22, -44, -43, 10, -24, 24, -37, -13, -38, -9, -12, 8, -1, -1, 27, 18, 12, -13, 10, -17, 31, -42, -20, -21, 9, -43, -23, 24, -81, -12, 10, -39, -58, -10, 15, -27, -3, 35, -37, -7, -13, -39, 9, 1, -26, 12, -15, -25, -65, 10, 13, 10, -39, 54, -14, -23, 24, -11, 13, 9, -47, 5, 11, 19, 0, 34, 1, 12, 4, -5, -8, 5, -38, 14, 14, 17, 9, 15, 45, 43, -29, -49, 50, 28, 22, 26, -12, 13, -31, 9, 19, -8, 22, 21, 13, -12, 22, 51, 5, -45, -32, -32, 35, -1, 12, -6, -21, 39, 4, -9, -5, -31, 68, -51, -44]
3830d4L1L0m0j6lN5j3j8k8J3R8p4mNjkK4k0l8M6Rn5O3LJ2j7k6J08q8k0J5J4jl8
3864b0J2J1rlk0j2K0j3%L6KJ7m7N0p8O4J7j8poj5K5m6J3N8l1l3K1L5q1L1K0n0
3897e7OL9J2%j0K1Rk1QN4j03Q6m4Ml3L4j2K9l8%O4m4K5n7K6j6j7L8LK6Kn3Q8q3
3931a4qM0l4J2k0M4n3pL3pK2qK6m0jmM2m3rJ2qL4j6kJ1pl1N3Ml7K8qj7M4l0j4
3967a3k5K3K3k2k2j3N6J5p3O5qmN4m4oK1Jj5M7m0k1rk6O4m7rK0Pprj7K3Ln8N5
4002a1M2j0k4j1J5k5j1QO6l1J3n9J1L2MM8n1m6P0p8M7J8kK8n8J7L5jqJ4l6k7k8
4035d9M9Ok5M1p7L4L4n8K9J7M7n8K4L3l6k3NMJ6l8RMm8N3mK5k9K5q0J4L8K1Pm7
4069c7O3Kl7Jm1J8N1On0QKrL5lm7Q1q6L4KO6o7J2k8N5l2k0O4p0K8J3LM5l6k8m0
$$ y = [-44, -13, 17, -23, -39, -42, 13, 0, -18, -46, -33, 65, -9, -13, -8, -9, -11, 13, -7, -45, 1, 10, -45, 18, 21, 33, 16, -10, 98, 10, -10, 5, 19, 18, -20, -8, 3, -6, -9, -29, -41, -21, -34, -34, 2, 4, 21, -26, 24, -54, 10, 27, 9, 2, -4, -19, 6, -40, -27, 31, 0, -33, -12, 23, -58, -27, -7, -57, -51, -12, 0, 0, -10, 11, 20, -1, 7, 61, -42, 44, 0, 4, -29, 5, -7, 22, -16, -16, 48, 4, 29, -28, -2, -18, -35, 3, 6, 32, 34, -19, 69, -14, -22, 18, -16, -4, -24, 20, -33, -40, -7, -14, 8, 0, 26, -14, -15, -19, 23, -20, -29, -17, -25, 9, -7, -9, 2, -5, -36, 17, 21, -16, 12, 4, -13, 31, 1, -13, -38, -15, 8, -14, -36, -49, 7, 22, -51, 14, 6, 2, 56, 12, 6, 27, 28, 13, 60, 20, -1, -10, -36, 28, -19, -28, -8, -1, -8, -17, -34, -11, -8, -66, -11, 31, 21, -3, -14, 1, -24, -35, -27, 39, 8, 21, -38, -27, 5, 9, 57, 6, -40, 30, -48, -1, 17, 15, 43, -15, 2, 37, 36, 28, 42, 6, -21, -49, 0, 6, -19, 22, -55, -21, 13, -45, -16, 1, 48, -10, 14, 47, 11, -12, -7, -3, 13, -25, -16, -12, -60, -7, -11, 14, -15, 10, -70, -56, -18, 3, 10, -37, 26, 28, -9, -8, -49, -31, 20, 26, -24, -16, -14, -23, 12, 9, -38, 43, -43, -9, -7, 59, -8, 4, -24, 31, -1, -21, 43, -27, 1, 14, 17, 62, 26, -2, -42]
4104d2K2k0N6M3k5k9k5K7k1J1J5J8J5k4m9L3Klp4M0mOL3k1oK9n0oKN2l0j8K9k4
4138c8L3j1K6j9J9J9m7jL1k0N7j00J5K6J1O3KOm3pJ5m5Kl6P3Qj3Mm8RLj8M1rq
4173@qNm1R1p1N6l2oO1j3j0n1P3j5r8L1L0K7J4%j5j2m2M5Pj3j9L1l7J9L1j9k8
4206ij5N5K7q5M0K0m8Q2r3J9K2l2m3L4M8K1l0JMM7m5RL7n4k6K2KOK8q7J1J6J3
4239cK6rk3M5q9j8O4K7J3n8K5M6l1l6J6K0K0Qm9P2k7n9M0m6LPN1J2k8j1l6Lj9
4272d4J05l5K0p6j4J21o4j7k6M4N4o2J9n6O2L3o2Oj6J6j9K9j7j5PQqQ9j19N9k7
4303eQN0n1mK0m2O2o1PJ9roP7q2mM4m8MJ0l9P0l1L9J7o4L4J9j8NL7q2jk4N3K3
4338B7L5o5M9l5k6L2k6RK4m8O0m9QP3r9K6kj6L1L9o5N0q0O7k2mJ8Pn6M5n6J13
$$ y = [-42, -20, -40, 16, 59, 34, 5, -20, 7, -14, -3, 12, 30, 45, 21, -28, 5, 7, 4, -70, -30, -34, -28, 5, -16, -22, 7, -43, -49, -47, 5, -25, -43, -14, -38, -5, -16, 10, -9, 10, 29, -18, -19, 12, -8, 49, -51, -36, -10, 1, 64, 66, 72, 29, 22, 37, -8, -6, -42, 31, 39, 26, 30, -18, -9, -6, -24, 17, 8, 0, -8, -3, -44, 47, -24, 32, 0, -6, 55, 42, 32, -19, 54, 39, -59, -28, 2, 29, 43, 43, 28, 16, -26, 19, 26, 13, -6, 25, -12, 7, 38, 19, -9, -24, 31, 58, -27, 13, 33, -15, 67, -26, -7, 15, -17, -60, -26, 22, 43, 13, 14, 18, 65, 20, 29, 66, 12, -14, 8, 10, 16, 44, -43, -32, -16, -3, 23, 14, -9, 36, -53, -71, -7, 20, 33, -25, 0, 46, 15, -21, -5, 15, 35, 43, -6, 66, 39, -20, 20, -26, -23, -16, 35, 47, 19, 8, -28, -25, -44, 61, 26, 46, -30, -44, 77, 13, -4, -30, 14, 68, 6, 25, -31, 31, 64, 2, 8, -8, 8, -11, 18, 1, -14, -7, 1, -7, 82, -37, 22, -5, 3, 53, 2, -2, 18, -24, 38, -23, -16, 3, -6, -12, 65, -17, -21, 23, -25, -21, -11, -50, 20, -11, 28, 45, -19, 15, 34, 16, 21, 58, -24, -25, -49, 4, 27, 62, -3, 46, 11, -15, 17, -9, 0, 24, -24, 36, -13, -5, 68, -31, -5, -7, -23, 8, 47, -18, 32, -48, 19, -3, -7, 11, 18, -38, 7, -49, 64]
4370F4o8JL9q2O1J4l6l1P8k2l1Mj4N9l8oM4n5M6l5M0J3j5l7L9n8N8p8O0J8Nk0
4402A7NK0m1m4N5J4m3R3l0o9j1LL3j9j8J9Mj5J2j0l6M3N7r1N1j6Rm4P6k6m2J00
4434E6ml5j3k0l1M3K3l4M7o8J9K8m7L2mk1N0rk2L7j6j1L3j8n4K7j1K5j9j3L1K4
4466B5k0qn3J1M5O2m1j3n8J5K7M4qk4L1n9K6qJ9l1R5r1L9k3j2qJ6j7k4Q7ql2m5
4499d1R2p0L6k6k9O4j1m1J3j5k1N3j9j0L2k1L2m1O6o9J2k3M4M2m2j6L9j8o1kL5
4530a6N6m4k2k3K8M6l3k1L7j2K1j1j5K2J1jp6j1Q4l7N3o3J0J3L3p1N2L2m8PJ4
4561A5K4q8P3k3l9jP3m5K1k0LM3k5jn8P0l4L6J8l1rk1J0oM4j9m4%O1K0n5rM3R
4595C5o5L9m4Nn5J00K6j7l3L8m3L6Lk0Mn6M1qMK8%J5j4k6o0O2loJ0j2L0k8j8%
$$ y = [64, -4, -3, 36, -46, 15, 29, -7, -38, 40, 18, -13, -9, -23, 36, -2, -8, 36, -19, 27, -8, 32, 45, 30, -7, 32, -26, 32, -46, 14, 32, 37, 17, 22, 42, 1, -43, 12, 26, -17, 76, 46, -23, -34, -31, 2, -17, -35, -16, -12, -27, -15, -25, -61, -18, 39, -52, -1, -17, -8, -52, 24, -2, -44, 56, 52, 17, 4, -16, -47, -4, 19, -15, 32, -36, -17, 11, -36, -4, -8, -29, 21, 12, -10, 27, 11, 0, 33, 15, -39, -12, -23, 2, -17, -30, 1, 25, 5, -3, -56, -45, 0, 62, 21, 8, -50, -35, -8, 36, 28, 4, 35, -24, 2, -6, 13, -18, 77, -14, 25, 2, -10, -18, -2, -19, -43, 44, 36, 4, -41, 51, -19, 17, -9, -38, 26, 15, -26, -13, -28, -49, 4, -15, -25, 7, -14, 18, -23, 43, -26, -14, -37, 7, 49, 7, -9, 30, 12, -49, -51, -16, 40, -4, -26, -49, -21, 25, -8, -29, 8, -4, 17, 6, -9, 13, 24, 23, -53, -64, 20, -17, 36, -27, -17, -4, 29, -42, 10, 42, -6, 1, 15, 39, -49, 24, 1, -38, -39, 34, -11, 10, -10, -7, 36, 11, 10, -48, 22, -12, 24, 42, 11, 2, -19, -9, -15, 29, 10, -34, -34, 27, 47, -8, -17, 26, 35, -30, 9, -35, -30, -85, 15, 41, 24, -9, 29, -14, 22, 25, 5, 9, -47, -6, -14, -10, 18, 18, 33, 19, -7, -67, -5, -8, -14, -4, -16, 14, -14, -32, -32]
4629c2J7mK5K5J0o3N3ro7OM8J0m9MK7J8K5l5k7L2k6oN0j9l1K1ppJ0J0LJ7k1Op2
4664e8P4j1mm5N0j1n4O6m4MJ7M1k3O0l6J9p2qN0k4JJ0jPoNqnoK2J2m0jOM5J2k8
4701A6m2L7pN7n3JrjJ2k3K0L1k4nj9O7r5N7m0L4NN7q3lk%K2PJ7pJ1j9n2oQ8k7
4737B2Q0o9l4JpK7k5L3p1QJ7N9p0L8nJ2pkk0J3L6p3O5o6N1K2l4k8j0O0p2M4J7
4770A2K5n5m6R4p6R2l8mL7m6J6j1mM0k2MM4p5K8K7m4L8m6J5J5j06Q1k9M6m4Q9
4801E7q3L8k7j9JL7L4p9j6R5n0Q5k1q0N9Qo6J0j4J8J6LLKJ5K6m2J8rk4O0l2l2
4834ij1K3N1n1k9L9J3l8M2k1nMm1k9L6L8m5J1MM2j5k3K1L1m8LM1ML4m8n6O4q5
4867e3N1J5M1k8Nm5O2k3K9l7n4j6J27m2k4j2K6L4o7M8o6N0p7L5K4%L%Q4p8J4K4
$$ y = [-32, -15, -19, 6, 31, 41, -22, 31, 22, -45, -39, 9, 19, -30, -26, 1, 19, 44, 9, -18, 14, -12, -18, 32, 13, -18, 3, -4, -11, -1, 9, 12, 29, 8, 14, -58, 16, 5, 1, -44, 6, -5, -59, 7, -37, -33, -16, 25, 2, 62, 26, 45, -27, -35, 15, -9, -8, 2, 1, 8, 2, 7, -1, -6, -12, 10, 22, -18, -19, -13, 32, 44, 16, -26, 11, 4, 61, 8, 9, 0, -1, 11, -12, 8, 39, 15, 10, -9, 58, -37, 20, -20, 14, 19, 76, -7, -10, -12, -12, 10, 17, 34, 27, 38, 19, -33, -39, 49, 22, 102, 33, -1, 0, -7, 20, -5, 28, -43, -35, -18, 41, -29, 9, 4, 16, 9, 7, -13, 0, 36, -37, 28, -38, 13, 35, 1, -27, -37, 23, -49, -5, 12, 37, -18, -64, 30, -46, 46, 8, 4, 41, -5, 11, 0, -4, 36, 14, 18, 62, -13, 15, 42, -2, 36, -10, 5, 20, -86, -5, -34, 12, -32, 57, -26, 12, -15, -34, -33, 4, 38, -41, -57, 38, -12, 73, 52, -28, 31, 39, -27, -17, -31, -13, 3, 6, 9, 11, 26, 52, 10, 28, 19, -5, 55, 23, -9, -20, 3, 54, 3, -26, 13, 26, -12, 30, 9, 4, 8, -33, -62, -26, 12, -33, -22, -18, 24, 9, -14, 7, 38, -10, -7, 34, 38, 72, 24, -32, 32, -53, -2, 13, 54, 26, 31, -14, 48, 25, 54, 17, -37, -53, 74, 32, 8, -4, 22, 56, -11, 37, -29, 21, -56, -21, 3, 3, 6, 6, 90, 12, 26, 50]
4899E0o6k5N8Mj0K1l7rK2k6K6l1nP9q2L5j4j8M4nl5j8PP4nj6l9O1p0N5m0jK8n9
4933d7j0N4M0o7k9P3jl1M1p7O6l5M2m0M0J6m4k7N4Jj4L2m0j4L2j5jkJ4k7J8k8
4965b6L3K4n0Rj1J5l0L5N1n8jJ2j2j9N0l4j2L3j1J4ll0j0Qnm8J06l9L3m0L5k2
4997cRll0L0J6l0k5O4k0pOj2rQ3n3j3LRRpJ5o0K6OJ8O1j14L1jj2j6pK0M2Lq1L6
5034a6L8Rk0L4m6k9M2j7l6K8N6m6j7J1L3k1Orj6lN6m7L6qLJJ9m4p8N8j4O5o0j2
5068d4RJM8j4k5M1M8o9M6k4n9Q0l9k5L0lL2j05N3N2j9O0l6p8k3N8k5J4P1p1Nk1
5100c2K1PPl4lL3k6M7J7p8L6j6K2J0rk5M1l1oql8Q0m2M1kl3K4k8J9Q2m3l2k1m
5134b4L3L0o6J1J3J0J0ln2N7j1oj3M8k8k9M1qJn9L3K6j8M6pl3k2N7m9%Ronk3L
$$ y = [50, -16, -41, 17, 21, 11, 32, -5, -14, 8, -18, 8, -23, -28, 51, -31, 4, -10, -28, 16, 11, -24, -42, -35, 39, 34, 18, -21, 40, -30, 25, -15, -16, 12, -47, -57, -3, 37, -30, -59, 14, 13, -18, 23, -54, 12, -23, 19, -21, 19, 35, -9, -36, 18, 19, 5, 37, -3, -17, 15, 0, -1, -3, 11, -16, 2, -26, 7, 31, -19, -10, -21, -6, -36, -1, 50, -8, -9, 3, -9, -28, 22, -12, -24, 9, -2, 12, 9, -21, -31, -23, -28, -76, 30, -9, 24, -16, 19, -3, 6, 3, -27, 3, 19, -11, -36, 28, 8, 1, 7, -5, -14, 69, 16, 3, 6, 15, 24, 17, 32, -28, -2, 4, 22, 83, -31, 0, -1, -13, -29, -36, -16, 26, 29, -52, -16, 22, 31, 11, 45, -1, -30, 12, -5, -41, -13, 43, -3, -20, -9, 24, 3, 9, 0, -16, -19, 37, -10, 26, 18, 21, 22, 41, -3, -81, -23, -37, 28, -32, -44, -35, -34, 14, 0, -25, 16, 64, -5, 41, 17, -42, 38, -1, -26, 4, 1, 33, -72, -19, 33, 14, 74, 38, -40, -63, -5, -30, -16, 55, -16, -11, -32, -11, -4, 3, -31, -34, -1, -27, 20, 37, -41, -5, -21, 1, 11, 2, -23, 18, -13, -19, -27, -65, 15, -27, 14, 12, -21, 3, -25, -6, 76, 33, 1, -20, -24, 9, 39, -27, -16, -3, 7, 17, 14, -38, 19, 8, 2, -11, 37, 9, -20, 21, 13, 14, -45, -12, 14, -4, 42, 35, 2, -20, 37, -12, -12, -3, -9, -14, -37, -34]
5169c4J5nK8L8k7m0K3j5l2N3%o2L5j0M9j1kk4j6K9nlN5p7O1k0M3k9n5lR3m5KN
5203A4p9P6m1Q3o1K0l7Mm1O1o5Q5o2J5M6ml7N2j8p1M9jL7o2M5n2k3P0l7Q0p8M
5235b8L3L7m3L7l3l5LK0K5o2M4%L3Mk9pL8jk4k3J5jK4k4K6p7N9k5Mk4N7m9J4O0
5269D8n6N%L0o2J9J9j0K7q6Q0k3L7OQl2l2L1L0j3o6J0K9j0M6l9L5m5m1N9K4k4
5301Dk3K3p1L4M4N3q5M6m0Q9p1j3KO4p9R5n4k4L0n4O6j4J3n9JK3jmJ5nRJ7qo4
5335d1J2j2L0o9J06j9j4K3j3l8N2J4j7p5J8O7j8m1j5KN4k7L8n6mO9ojMl9JL7j4
5368Hl4J7J1J2j6J8j7o3O4M2o4O4l4J5l1J8K3j7J6p2R5q2j6N7l0J3m6R6r4R6n4
5399ej2L8m6oJ4J7pJ0m7N4j0j1k7j1J02q2K9k2O5j10Q5j2o9L2O6k5l0M5Lk1j5
$$ y = [-34, -19, -24, 4, 42, 15, -25, -2, -17, -49, 4, 4, -58, -23, -33, 16, 5, 3, -21, -37, -8, -13, -16, 39, -38, 23, 3, 46, 17, -38, -41, 52, 7, 9, 14, -65, 11, -30, 53, -8, 12, -25, -21, -62, -1, -66, 19, -43, -28, 18, 14, -23, 29, 11, -60, -11, -12, 25, -37, 8, -44, -67, 3, -34, 46, -32, -28, 5, 42, -1, 36, 3, -32, -29, -9, 16, -46, -2, -2, 31, 35, 6, -1, 37, 36, 12, -11, 4, 3, 27, 3, 29, -48, 11, -14, -10, -34, 23, -26, -12, 48, -8, -3, -3, 27, -35, -16, 3, -7, 20, -66, 14, -9, 28, 34, 42, 10, -22, 9, 39, 26, -40, -30, -1, -11, 35, -4, 31, -14, -55, 4, 28, 4, -19, 4, -67, -33, 11, 64, -21, 25, -15, 74, 3, -10, -8, 56, -23, 72, 18, -6, 24, -30, 36, 22, 35, -24, -23, 0, -1, -5, 10, 5, 14, 31, 23, -41, -29, -41, -11, -80, 26, 7, -7, 16, 3, -35, 17, 31, 14, -61, -43, 24, 6, -35, -50, -48, 6, -21, 17, -39, -43, 26, 20, 19, 23, -16, -15, 22, 8, -26, -9, 2, 14, -2, 16, -1, -64, 0, 42, -22, 42, 8, 23, -8, 10, 33, 16, 32, -40, 55, -27, -43, 14, -16, -3, -49, 47, -47, 49, -5, -17, 21, -25, -31, -17, 0, -7, 3, -44, 10, 0, -11, -38, -49, 53, -29, 0, -22, 43, -67, 18, 6, -63, -31, 35, 10, -20, 25, 28, 7, -8]
5430hN6o3JK0jj1l7K9ON3r0L3J2QJ0J6m7N4l2Pl4k7O8m9M9L6o5j5J3l9N8rj8J8
5464BL0j00P5j1L3l4OqojLK4QJ8o7J1KN1m0K3m3K3k4j7N8K0k6QK3m5K7k6k0O5
5498D2o9J7J3l1L9L2n6L3n7M7j17J10L3l7k6P4m7n7L6J4N0n0n2N2m7O5j6OPPK
5529A7lo0P0l1L3Ol5J6m9R0po7PkQ8j17L0L0KRj4jJ3j7J6l2M6o3J6j5l0R6o7L1
5563Fk9J0L3k0rK5n3k0N6k7P0mk7kK7l8k8O5m8M7Kk3Lnpj1K2K9p4N0l2knK3j2
5598hJ2lk4K1J7pl4P6q9M7nk8M6m1NK9PPk1K3n6M8J6l8ML5j7j3j4K7k0oPk6MN5
5634C6l5K8m5%PJ9n4L4N2o2K2J5Oj1n5N0p4P7l3M0k4M6m7M6n9K3l8L9K0m3M6o0
5666c4O6o8M7l5M8p6L2J9L7n8O5m5kNKl1J3L3j8j9K2K8k5K4j9lN7p5m4N5L8n2
$$ y = [-8, 48, -15, -14, 6, 5, -6, -43, -14, -8, 45, -45, -12, 0, 8, 18, 34, -13, 41, 9, 16, -18, -45, 23, -26, 23, 59, -6, -21, -8, -47, 11, 2, -16, 2, 32, -68, 7, -4, 29, -5, 1, -7, -13, -14, -11, 13, 21, 39, -28, -17, -15, 36, -4, 19, -24, -1, -25, -42, 16, 36, 10, 18, 41, -4, 23, -3, -23, 42, -27, -10, 3, -28, 11, 43, -13, 20, -37, 10, -107, 3, 36, -1, -27, 47, 0, -57, -21, -7, 43, -7, -59, -7, -54, 11, -5, 1, 8, 15, 17, 14, -46, 24, -7, 26, 32, -3, 13, -36, 54, 47, -20, -13, -15, 73, -44, -14, 16, 18, 27, 13, 12, 25, 8, 24, -8, 38, -25, -9, -24, -54, 42, -25, 6, -23, -13, 20, 0, -9, 16, -37, -57, -1, -28, 42, 38, 11, 9, 36, -2, -30, 35, -13, 34, 36, 13, 16, 11, 4, -7, 15, 44, -30, 20, -12, -14, -19, 4, -8, 4, 1, -23, -2, 15, 8, -26, 50, -39, 8, 3, -25, 21, -20, -15, 14, 21, 28, 7, 30, -26, 22, 38, 0, 4, 39, 22, 9, -5, 22, 2, -4, 3, -23, -19, 36, 1, 29, -16, -16, -9, 10, -44, -10, 42, -20, 2, 17, 23, 12, -43, 7, -67, 10, -23, 17, -7, 39, -8, 38, -21, 2, -36, 3, 23, -20, 26, -34, 32, -36, 11, -24, 24, -52, -20, -1, 36, -22, 43, -2, -4, 1, 3, -28, -15, 18, 0, -19, 3, 31, 6, 30, 11, 8, 65, -10, -54, 1, 39, -13]
5698a3j0K9J4k6k3L9j8KJ9k3L8l4N6No1K9o0M8J1m1J6j6O3o8lK8m1M5QJ9j1k6
5730el6N5J3p3L6nN4n1J5Lj4Oj1RL5k4on5O0J5j5r5P5K5oP1n7Pj4j2M9j5m9k7
5764d2K2RL1m4O7j10Q0Mo6M8Q1j24Q2m7jJ6l0J6K2l3K7J4l6K1m4L0OpkL8n5J05
5796G8j22O2Qo2L6J9l4J5O8qj05K0L0J4j3o6N5nl0O0m8mP1k1j3QK3k9Pk5N3l1
5828A1qk4pRO2o1L3M3n8K7l8j5olL7J1l0mj5L6L0pL6j00L6KjJ7j9LOm6O3n8R2
5863E4j23P0jmk9L5J4n2L9j6L7n2M1O1n0o1O5k6o6J01m5J5K9k7J0Rn2k6N2J7j4
5894EPj7l5O2L5n1l3M9m4jJ8J6J0rM1r1Q3n1J0j5JpO9J3m0q4J17o8L6l0K5j9n1
5927d9N1pJ4k1M7q8L9o4P9J2pj3K1j7l1P5j06M6k2J2J4MJ4RRj6RNk8N5nj0j2l2
$$ y = [-13, -23, 6, 20, -6, -29, 10, -8, -6, 13, -10, 28, -6, 50, 55, -6, 23, -37, 11, 22, -19, -3, -19, 44, -24, -27, 1, -40, 5, 13, 32, 21, -5, -41, 14, 27, -46, -10, -15, 39, -12, 3, 6, -8, -2, -13, -4, 31, 7, 1, -54, 6, 21, 6, -89, -14, 11, 5, 76, 19, 26, 12, 0, 49, 34, -15, -42, -20, -11, 20, -24, 43, -67, 13, 17, -49, -1, 80, -44, 38, -9, -10, 6, -24, -8, 14, -19, 8, 22, -14, 7, -37, -7, -1, -8, -10, 28, -27, 78, -44, 18, 26, -36, 0, 19, -15, 0, 68, 60, -45, -25, 5, 19, 6, -60, -5, -10, -40, 20, -28, -32, 39, 18, 5, 13, 36, 7, 14, -11, 42, 11, 3, -21, -28, -19, 43, -18, 15, 58, 0, 27, -11, -26, -32, -35, 2, 13, -17, -21, -36, 0, 30, 23, 59, -41, -5, -3, -4, 13, -6, -3, 3, -43, 20, -38, 54, -69, 1, 0, -4, -33, 2, 16, -36, 3, -13, 24, -28, 13, 74, 24, -37, 28, 2, -64, 37, -8, 7, 36, 9, 19, 28, -24, -50, 2, 19, 5, 12, -5, -40, 22, 57, 6, -27, 22, -22, -23, -5, 11, 21, 12, 53, -38, 45, -6, 4, -11, -10, -17, 52, 65, 25, -59, 58, -10, 26, -4, 21, 2, -49, 2, -5, 9, -12, 35, -53, -14, -78, 1, 13, 6, -7, 14, -3, -34, 41, -65, -19, -41, -29, -15, -11, 3, 12, 21, 5, 14, 19, -9, 46, 41, 31, 19, -13]
5961a3jk0L1J%J0K2n0k6Q2m8K4J2J8l8Lo6O5KMl1K0K6K0n1l0k3O1j9L5k8K9l0
5994il2J9M6j5m1k0J01k0K0p6L6j2jOn7N4rJ3KL3n3K1J8m2J6K9m2Krl5J16o2j0
6027a3k4L4M5n1j1l3M5Lj2N0p5O9J3Ll1o3K8L3k8J1N3k6o4N5l4j7J5pJ3L6j6j8
6059a7K8j8%J5k7Nm2Q1ol7M6lm1n3P9JLk1RKl3j5J9j2P7nn0j0OM0l0L5l9l1M3
6094aJ1qL6K1Nq1J0L0o4MP7l8Rj9j5j5J4kMK9k9N2n6R9o9j6J2K7l5K2K3jpo3J5
6129a9K1PQRkn7N0J3Mm8N2m6Pj1l1M9Qj2k0J4mK4m9rL5K9l0O6k4jm8NN3m0m9k7
6165g3L5J04o4m8N6K5m6mj9N3m8J2jRL3m5LNK7l4j2MM2rm8K0O0m7m3N6M7q6l5
6198g1O2mqN5m6K4m0%M7m4M6mj2J7m3MM8n5M5j7M5l0k6K5j1k0L2j1J0OKn5NL8
$$ y = [-13, -14, -34, -3, -2, -2, 8, 30, -20, -46, 36, -12, 12, 24, 42, 4, 7, -59, 6, 8, 12, -19, 1, 27, 47, -4, -34, -57, 4, -15, 20, -8, 21, -9, -41, -22, 24, 9, -32, -52, 49, 29, 49, -27, 9, -3, -4, 2, -55, -1, -10, 3, 5, 38, -15, 6, 24, -18, -2, 27, -15, -13, -22, -57, 59, -3, -13, -37, -3, 42, -9, -20, -53, -8, -5, -17, 33, -42, 27, 40, 43, 12, -51, -23, 10, -18, -7, 46, 20, -44, 11, -23, -40, -25, -32, -19, 17, 1, -17, 11, -7, -7, 8, -19, -14, -56, 25, 19, -18, 28, 25, -16, -69, 10, 11, 14, -7, 2, 4, -29, -44, -25, -37, 40, 35, -15, -25, -19, 21, -9, 26, -13, -44, -1, 10, 2, 38, 59, 64, -17, -7, 23, -41, -37, 40, 2, 11, -8, -23, -38, -24, -26, -22, 7, -22, 30, -26, 73, 4, -12, 0, 27, -8, 14, 37, 36, 29, -34, -19, 2, 9, 17, 26, 24, -33, 17, 30, 34, -14, 38, -8, -1, -12, -43, 6, 14, 2, -18, -4, -8, 16, -33, -42, -7, 22, -8, 58, 34, 33, -15, -10, 43, 3, -46, -73, -38, 66, 2, -46, 10, 35, -11, -15, -34, 19, -29, -17, -18, -9, 24, -21, -18, -13, 14, -20, -32, -28, 14, 5, -43, -23, 37, -10, -53, 3, 50, -36, -71, -9, -13, -21, 34, -12, 12, -28, -28, 19, -25, 21, 17, 5, 22, -21, -17, 31, -24, 21, 4, 49, 19, -7, 18, 7, -13, 19, 8, 18, 24, 26, -29, -24, 14]
6232A4l6J8j1kK5M9p0J1J6MRl6mL0J5l0J2j2K0p4R1j1rMj3j2J3j0rlkol5J18o5
6267aJ4k8L2k9J6L9k6j8J8K6j26N3J6N0m5n3J02jn6M2n7j4P0o5N7Omk6M7Jj5k1
6299DnlrqQKK1pl9L9K6k8J5l6J4RpK9m4K7k8L2k8KPlMrkj2J08j01L0m2QM3j5N2
6337E4k5l5J2OOk0Q0j23P3k4k3M4k3L1K4q0j2K9NL8n5M0Mo2N3j0K6n0j3P8o5P3
6369E6p4M0J8p3K8J8j2k0N6k7K9k0j9jLK1j4l7M0o3O0j0j8O9l9nj6K5pl4QN1k4
6402Il4N5K9p9j9O5lj5l9jJ7K6OK3krK1m9J6L3m7JJ3N1j02L4J7o0L1M1k2K9n9
6435b3j4M3K9l1k1J3OK5l0k0K2Q7j36O0L4l8l8j6qL3N1k8k5J4M2k8J6l7N3l0p
6466bk5P5n9R5p9j7P8m4l9J3j0j5K7J4K5j3n3L1k5M6j5o0K4j6L2jK5k2KL0qm3
$$ y = [14, -22, -4, -15, -17, 8, 57, -13, -2, 14, 18, 27, -9, -13, 17, 32, 2, 14, 2, 22, -52, 39, 28, 19, 23, 10, -2, 11, 1, -8, -11, -13, -19, -54, 64, -1, 13, -15, 17, -12, 4, 43, 17, -1, 17, 43, -83, -30, -14, 36, -9, -62, 40, 39, -17, 25, -32, -46, 24, -41, 16, 22, 18, -8, 39, 40, 25, 4, -1, -4, -13, -21, -13, -11, 10, 3, -36, 3, 29, 1, 16, -20, -6, 3, -4, 25, -19, 8, -20, 12, -16, -14, -7, -10, -6, -15, -17, -29, 79, -22, 8, -34, -26, 17, 2, 54, 29, -6, 6, 12, 18, -2, 78, -45, 28, 4, -19, 25, 2, 33, 57, -23, -35, -6, -1, 37, -18, 22, 26, -36, 17, 7, 33, -17, -30, 48, -17, 56, -18, 22, 40, -33, -5, 13, 1, -19, 37, 10, 39, 19, 0, -1, 2, 23, 9, -28, 12, -51, 9, -1, -19, 50, 11, 6, -10, 15, 8, -26, -18, 33, 9, -25, 30, 59, -20, -39, 26, 23, 8, -31, -32, -15, 11, 17, 40, 38, 29, 50, 1, 17, 50, 3, 4, 17, 68, -34, 0, 17, -43, -12, 29, 7, 36, -23, -37, 6, 35, 4, -17, -4, 2, 27, -3, -23, -1, 86, -50, 10, 44, 6, -32, -48, -56, -23, 28, 0, -25, -11, 31, 3, 19, -18, 35, 5, -2, -27, 48, -11, 84, 5, -12, 66, 22, -17, -4, -14, -29, -2, 12, 37, 24, -29, 2, -23, 23, 8, -52, -28, -44, -12, -13, 12, -10, -8, 22, 14, -29]
6498b9M0l8M3o3K6N8l4oM3p5O2L3j16P5p1R7k5pK8n9J8J2Rk7j6N6k4Ql7O0m8j3
6530b0RM6n2j6N1J3n0k3P3l0lK7LK5m4n0O4l9J6l8P9n5oOJ0k6Q3k8k%m5J3K3j2
6564Bk1j1L1K1l5L2K2k0J1j1jn6J03o2oM8l5k0J3KM2p6N7l1k5O8q8Q4m2J7l9J0
6596a6J3j8K5J1QL0n2L4mn0L7j0K6p9J24r0o2Q5j8M3k1kJ7J0l9Nl2O0k0kk8L2
6628A7Jj5m3M3M2k5n6N1O2n4lLJ2p0N2n9Q3n7N5m2K1m1J2j3K9m1P6p3L3j1j9P4
6660D4r9P4kqj9j7K1K8rLj5l8K4K9k3L4k1l8N2m0OJ1M5j8Mn7M6l0M4k5K9rm0M7
6694C3j06R3N2q5J3O4r8O8p0MK4Pj6K1LJ8j3K5Mo1QJ2J1l6M0k1J7k3N5k9m3MN8
6727C3mm5j7N5NRRj5J5n4oK3l%l6J6K0j1P4o9PM4m1Kn1Q6o7J9K3K3k0l1J1L7l0
$$ y = [-29, 11, -27, 16, -47, -21, 37, 3, -3, 40, -35, 27, 60, -56, 19, -52, 45, 20, 13, 41, -18, 0, 12, 21, -6, -22, 34, 10, 18, -19, 41, -7, -20, -11, 35, -17, -33, 18, 31, -19, -42, 31, 1, -2, 25, 28, 53, 9, -41, 23, -16, 0, -38, 41, -14, -20, -14, -4, -30, 53, 25, 23, 23, -22, -9, 14, 2, -19, -30, 1, 22, -13, 19, 41, 21, 32, 21, 20, -36, 67, 5, -1, 47, 12, -8, 5, 7, 49, -27, 30, -1, -26, 42, -46, 38, -4, 13, -26, -16, -3, -21, 4, 15, 23, 53, 1, 35, 31, -19, 18, 8, 34, -45, 79, -11, -73, 12, -6, 37, 16, 14, 31, 41, 2, 7, -25, 35, 15, 13, -15, 17, 18, 3, -40, 3, 45, 20, -36, 15, 77, 23, 20, 23, 35, -35, 17, -42, 41, -16, 39, -3, 18, -23, -11, -24, 5, -36, 40, -33, 0, -11, -30, 44, -55, 19, 17, 9, -10, -27, -6, 22, 13, 16, 1, -37, -13, 16, -7, 27, 6, -32, 20, -20, -14, -3, 42, 24, 28, -29, 17, -13, 31, 6, 35, 26, -14, 33, -73, 20, 72, -13, 0, 64, -34, 34, -36, -32, -8, -1, -17, 4, 7, 25, 12, 37, 41, -20, -12, 0, 11, -25, 15, -6, 11, -12, 43, 14, -29, -25, 33, 29, -16, -33, 22, 27, 36, 45, 30, 45, -9, -15, 8, 5, 5, -31, -15, 5, -6, 68, -1, 6, 50, 9, 11, -40, 46, -21, -2, 21, 44, 24, -7, 4, 41, 11]
6762A1pJ0KM4J0o9plj5O4k5N0r4L7rpj4J9K3l6nO2Rp8K5j1J9M5n9Mm2J4N1l9O
6797a5J8l9k7Q6o8M7K9K7l7l4j4k5O2j8J3k8J5j9J9O3o5kl6M1pM4k7OK7p2J3K5
6829Bj8K1QloK8q3Q6j7lk3K4MjJ0n6P1p2MJ1K8np3J1P0K3%j9o2l7N9K0LJ2%o4
6865d7P8om7J1J8K2m2K2l0MK9j4mM7l1L1n3kN2l2KK9l8L1j8l8J1j3J0Mj6J5LJ6
6899DL3j5j6K6l0RK5l6mm5K5O3Jo6M6o6P5J7k5j5j9j3L7k0RK5k5J8J1l6N3o0p
6932b1%K6j5J6Pk3K6pN6q4L6J4n8L4lk1J6Mj0J7k3kK5m0J13r5K5%Jj6l0K5K1J2
6966B6k6j5O4l7l5m5P5J2o8N1l7J3J3n7N5j1J5k1M1M2n2K5ml2Oj3N5p3L9nj2M5
6998C4m5L5J0j6l3J2l0P2j7n9K8N4l5l0Q7o1K6p5N0K7n2MJ9oN7p6jO7j7j9Ql2
$$ y = [11, 4, 14, 16, 60, 70, 1, -6, -9, -24, 40, 15, 65, -29, 8, -1, -8, -22, -3, 20, -16, -21, 41, 50, -28, -3, -14, 5, 50, -9, -5, -47, -33, 18, -21, -15, 3, -36, -63, 23, -45, 2, 31, 58, 21, -13, -27, -52, 10, -8, 5, -23, -8, -27, -8, 55, -10, -12, -48, -7, -14, 30, 3, 9, 36, -36, -23, 2, -16, 5, 13, 10, 4, 32, -51, 35, 18, 15, -8, 16, 20, 19, 29, -27, 44, -28, -24, -13, 15, 10, -63, -52, 18, 41, 41, 22, -40, -77, -18, 2, 5, 17, 17, -47, 31, 25, -22, -11, 7, 29, -13, 9, -21, -17, 12, -2, -6, 41, 10, 41, -12, -14, 38, 6, 8, 37, -1, 30, 12, -26, -15, -28, -18, -14, -30, -15, -12, 4, 37, 22, 6, 32, 2, 11, 36, 0, -4, -49, -24, 39, 40, -26, 20, -46, 29, 46, 21, 6, -13, -26, 11, -9, 0, 25, 0, 18, 29, -7, 46, -14, -21, -21, 5, -10, 6, 13, -10, 16, 9, 65, -19, 17, 31, -27, 7, 4, -17, -1, 3, -7, 10, -13, -15, 10, -30, 83, -12, 13, 13, 14, -2, -32, -7, 14, 26, 0, -15, 49, 12, -23, -68, 7, 19, -49, 2, -35, -22, -9, -66, -11, -22, -7, -28, 13, 55, 3, 28, 24, -8, -2, -15, 40, -33, 6, 1, -11, 34, -11, 24, 34, 18, -15, -3, -33, 39, 22, -37, -9, 45, 10, -20, 67, 6, 32, -43, 7, 34, -18, -14, 5, -1, 56, -20, -21, 46, 29, 10, 18, -14]
7030a4O4n9Q9n5ok1rL1J4k7K6l7K8p0L3M1n0K5M4r6N2k5P1p1K7K1NJ1o3lL9K8
7062D3j3m7kP2q1J0jJ8j9KJ9K9p8N2j5L4n5J7M6r1L4P5m2l0M8l3J7m0M6Ql2kM5
7095C4m0O6m1l6k2KL1lL2j1lk6L0m0qO8m9J3Qj2l4N6m5M7k6L1K4o8K5j5K4l1L8
7128A9J3k4k7M1j3k3k6J13l4k8l0N1p4K5j1J06p3M0r1j8P6jRk6j3L1J4J4m1J3
7158A2oj7k6N7J1n2K7r0P5J2j6L3Om9O3q0K0NJK6J4n5J0k1P0O2j10J0L8RQJ4n4
7191Gj9M9n9N4n7P9p3j5K8n2N2l8O2l0N7q0M9LJ0j9J2%k9J2kJ7O8m1o7K1j7J6
7223bqL9K1n4p3O2PRn2N5k9LK3Ol1O6p2N2k5Pl1J9K3L2l4k4lL1JLl6j0M4j4k0
7258a5M4l7l5O9l6j8K8%L0l3o1PO5Rpk8J3j9J0j0K0J8k2J5J1j5pj6k5Q8p5J4K4
$$ y = [-14, 50, -9, 80, 25, 19, -2, -11, 20, 34, 7, 33, -4, 24, -46, -13, 28, -22, 3, 47, -49, 3, -22, 49, -22, 5, 26, 31, 42, -21, -24, 15, 43, 30, -17, -19, 53, -28, -18, -19, -1, -20, -18, 1, 30, -48, 4, -11, 23, -32, -15, 31, -60, -26, 49, 7, -23, 25, -8, 9, -31, 15, 23, -9, -11, 34, -6, 60, 19, -17, -39, -37, -6, -9, 23, 12, 9, -17, 13, -27, -35, 33, -16, -3, 5, -7, -41, 15, -30, 17, -9, 22, 46, -22, 3, -12, 12, -19, 19, 32, 8, -19, 22, 9, -14, -40, 73, 39, 11, -19, 32, -42, -17, -28, 78, 5, 45, -46, -64, 12, 11, 20, -6, -19, 12, 26, 40, -1, 12, 6, -11, -37, 20, 31, -21, 6, -84, -9, 3, -13, 20, 26, -23, 40, -40, -20, -15, -14, 12, 26, -29, -19, -40, 30, 92, -18, -8, 30, 39, 47, 61, 7, -12, 37, -22, 32, -25, 54, -19, -34, -6, -58, -6, -44, 18, -12, 45, -35, 14, 17, 27, 8, 20, 20, -9, 3, 1, 18, 86, 45, -22, -1, -18, -2, -10, 29, 50, -4, -77, -15, -8, 1, -51, 4, -25, -22, 1, 7, -24, 42, -30, 22, -3, 4, -27, -8, 15, 47, 13, -11, -14, 17, 18, 21, -15, -25, 19, 5, -15, 29, -8, -43, 26, -10, -28, 0, 0, 30, -3, -64, -57, 8, 17, 10, -18, -5, -24, -14, -24, -4, 14, -8, 7, 18, 3, -4, -20, -45, 43, -32, -18, 6]
7291FJ5k4K6K0j6jm9L3n2N5j9kj2N7j6m4k0L3QL9p6L0M9%l0j6nnn1O6l4ML5L1
7325C5k8J6Pm3N5r3L2L2J1m2PlO1j5k4MpJ4l2j3K1jl5J1K1K4k2L0k9L4j3k%J0
7359B3Rk5J0K2p4k1LP5pn3O1Ll7K2M3o6pJ2k5R9l9k4KK4o0N4k3rl1Q6o2K7pRQ
7394B2m1JJ4m9P0L4l6nLQm7K3M9o0L2m3K8o1O0l6O3j9m8K2N6n1M6j4k9LjRQN6
7428F7o5J9n4P1k4J2n1J9N0j4k7Pl4M0L4m1jMn3MK2j8Q2p2mM1o3L9oO9q5l6R7
7461B9K2n3M6l6j9M6q9O5nm3J8RJL9k1nK9m5j7O8l9LJ5rJ6K4p3J3j0qK5%m7R2
7495D1k4pl2l0K5J9K3l3k9J3L4k1KJ5Mj0j3K8rN1q0K8L9m5K8N0o1Lj4mnQJ1kp2
7530f9R2n7M6%m8L6o9R2K5J1k0o5j1K7N%l2M8O1q0N8K4r6L0mqk1K8J8K2r0O3j
$$ y = [6, 21, -3, 23, 43, 27, 26, -23, 10, -42, 13, -6, -8, -20, 37, 21, -23, -43, -10, -2, 37, -39, -9, 40, 40, 10, -6, -11, -16, -67, -1, -35, -31, 4, 35, 7, 23, 30, -13, 42, -51, -19, 13, 24, -18, -11, -14, 47, 32, 8, 12, 5, 19, -13, -26, -5, -6, -41, -30, -9, 15, -7, 23, -6, 28, 15, 13, 13, 23, 32, 7, 17, 39, -35, -56, -53, 22, 15, -38, 23, 26, -11, 11, 54, -12, -19, -7, -32, 67, 28, 4, 6, 30, -30, 24, 1, -8, -39, 47, -15, 12, 5, 14, 22, -19, -18, -4, -53, 17, 51, 15, 10, 13, 21, -26, -3, 46, -14, 18, -25, 3, -58, 2, -34, 29, 10, -38, -16, 40, -11, 35, 21, -8, -5, -6, 3, 11, 67, 2, 21, -33, 38, 14, 26, -25, -6, 44, 30, 3, 10, -24, 16, 50, 9, 8, 12, -41, -37, -15, -33, 49, -23, -27, 14, -49, -10, -16, 53, -32, -68, 29, 51, -2, 44, 8, -11, 35, -54, 11, 6, -37, -19, -10, -9, 30, 9, 4, 33, -12, -29, 39, 0, 3, 18, 9, 25, 49, -24, -11, -21, -29, -4, -4, -51, 41, 17, 10, -22, -52, -27, -8, 15, -18, -47, -34, 0, -21, -19, -4, 0, -10, -23, 5, -4, 47, -33, -5, 34, -11, 17, 67, 6, 9, -5, -9, -14, -6, 5, 3, -69, 23, -34, 12, 12, -36, 0, -69, 23, 48, 59, 39, -26, -37, -10, -5, -5, -37, 11, 72, -8, 50, 74, -22, 8, 4, -4, -25, 3, 21, 43, -47, 16, 15]
7563A5l3O1m0k3P6n6N5q9O3k2pj1J8m5L8k1J0J6QJ7l8J7lrj7J0J7JlK5l5K0k0
7596eN1l3%Kn3M3mn3P2k3Jm0K4j4M2j9K2L4m8J4nl5J6N4o4j2pP0m5J2nOj6L1k2
7631iK7J5NJn3k7L5j8J4L4l5J4M3n6LLm0M9n0J1K6N6nm9RpK4k5mJ5k6Ql1Q2r3
7666e4O8J5Rn1J7j2J5k7K5ML2j5j0n0M1J6n6%L3J5LNQj8ml0L9o4K5m0Q2k8%kj3
7701b2pO9p2J0K4jPpK0m8M1J7Ln0j9L9l9qL2J7KL0J9l3n4K9j1j0J4l4K5%L3j3
7735CJ9o2K0M0j5PKo4L0L1k6J5Np9R1nk9jN6o0M7Nk7K0m1K8Rl4QNl6J9pM0k1k7
7771c4M6m4O7j9m7L2N2o2j5M8Oj3n9K1J6M3n2Kn5O9LNK3p2M5M1j5j2K7m9k0M6
7803B4k2M0l3O7j09O6l7j9L3QK4n2l2O6k6rK7j0K3L4l7n3K0%Kj0%Rk2k4O4L7j08
$$ y = [15, -18, 43, 3, -20, 56, 0, 55, -34, 29, 7, 0, -11, 7, -38, 0, -21, -11, 5, 13, 30, -8, 9, 6, -3, -20, -10, 7, 8, 5, 30, -5, 15, -5, 46, 13, 13, 15, -38, 5, 1, -52, 20, -3, -2, -42, -18, -32, 10, -9, 13, 47, -1, 13, 8, -27, -11, 43, -21, -33, -40, 30, -15, -3, -8, -2, -18, 13, -9, 18, 33, 38, 39, -14, -41, -6, -24, -10, 24, -11, 3, 46, -10, -7, -4, -44, 5, -45, -34, -8, 48, 43, -6, 3, -4, 20, -5, -9, 6, -20, -12, -43, 39, -54, 14, 29, 38, -13, 4, -8, 7, -20, 5, 9, 41, 26, 16, -34, 7, 23, -33, -33, 0, 15, 18, 23, 31, 13, 9, -21, 18, -46, -21, -61, 21, -7, -7, -9, -22, -29, 40, -32, -22, 2, 1, 8, 1, 21, -27, 14, 31, 34, -16, -35, 4, -35, -43, -11, 6, 8, 38, 57, 24, -30, -1, -12, -22, -8, -42, -17, -17, 16, 3, 22, -40, -20, 20, 5, 12, 14, -50, -20, 11, -15, 0, 5, -74, 17, 12, -17, -18, 38, -22, 25, 30, 3, 23, -18, 10, 19, -15, -7, -2, -38, -19, -26, 14, -7, -34, 12, -32, 35, 16, -31, 1, 53, -9, -24, 24, 30, 17, -42, -21, -5, 38, -14, -12, -67, 2, 5, 10, 33, -39, 6, 47, 32, 20, 47, -2, -22, 24, 2, 42, 9, 76, -33, 33, -4, -23, 10, 18, 42, -10, -42, 24, -2, -11, 16, 6, 29, 63, 26, -27, -7, -7, -5, -15, -15, -6, -28, -52, 12, 49, -59]
7836e9K8M0mj0m2M2K2l8K7k5lQM2Qk1j6pm2N2ORK7n8M2m7oK9noK5K0k6K0ro8M6
7872AJp5P9M2o1j4M8j4MJ5m5K9k2l7Q3kl6K0Oj2m3M3n0N7k1M5l3m9M1m1J5L6k9
7905a9M8%j0k7lM2j1Kl4K0j9n0N2M0l2Rj5N3m7Kj4K8n9O0m4L9Qj8L4oj1m5J0J4
7939cMJ0K0l0K2r8J02%j9Qj1k1RNj2L1Mj07L2R8k5n2O3m8M6k3n5K7k%O7m9N6o8
7973a9NL7l9RKo2J10j8m1P9l1n4K9k0P3j8r4P8l7MqR9r5jk8M9j1k5oL6ll5J5L2
8007A2l3J3N5l3LJk7rM2o2N9k5lK0qm0K3PK0k2N1n7K9j0lJ0k3m8J7J5P5n3L8j06
8041g2R9m6M9m7J9j9%k1O6m5J2l4O0l2k1O8l7N1l2j8j6mk8N2n2PM6Mm6L4O2m6
8073A3n5L0Qk6N9pj2l0OJ0L7Lq8K6J2J6p1M3Pl9M7m3OPM1J3LKk8J5j2O9r7N5O
$$ y = [-59, -31, 9, 5, -5, -47, -5, 17, -21, 6, -19, -22, -14, 28, 36, 15, -1, -8, -50, 2, 8, 17, 44, -14, 28, -19, -25, 4, -1, -7, 18, 38, 12, 32, 23, -45, 1, 2, -73, 6, 48, -13, -27, 21, 7, 11, 26, -19, 10, -12, -49, 34, 32, -4, 16, 22, 10, -33, 10, -40, 17, -4, 41, 8, -41, 0, -41, -26, 10, -19, 29, 29, 19, -8, -11, 31, 20, 22, -12, 8, -11, -61, -9, 31, -1, 8, -7, 46, -1, 1, -13, 15, -44, 16, -28, 11, 19, 1, 35, 29, 18, -27, -17, -3, 1, 11, 31, 1, 23, -75, 27, 27, 8, 16, 5, -16, -7, -2, -14, 17, 21, -86, -54, 44, 19, -33, 30, -18, 28, 5, -50, -23, -25, -25, 42, -7, 49, -19, -14, 23, -16, -7, -5, -67, 43, 25, -16, 63, 32, -22, 7, -13, 60, 42, -52, 26, -11, -7, -15, 84, -11, -12, -40, 9, -2, -27, -33, 3, 0, -35, -20, 12, -21, -8, 47, 14, 17, 18, -9, -18, 24, -38, 21, -4, -7, 13, 5, -35, -12, -5, 15, -7, 44, -13, 16, 6, 3, 13, -10, -58, -41, -26, 49, -4, 34, -72, 27, -19, 30, -17, 2, -17, -17, -38, 28, -17, -5, -39, 21, -11, -32, 36, -1, 50, 18, 0, -16, -20, -48, 4, -48, -41, 5, 9, -37, -3, 59, 13, -42, -12, -4, -30, 29, 22, 10, -20, -14, -4, 33, 36, -52, -26, -14, 2, -69, -26, -19, -58, -11, -54, -48, -41, 0, 13, 16, 18, -10, 5, -7, 62, -35, 20, 26]
8108B6j7k1M4k5j1j6K3jJ4o3K8M6m5L3n1N2no6L2%O1p0J9%JLl2M7p9P2l0M3j1
8141Ak1pP4j5Qo4P6p8M8Mo8P7l9K6K9q1KL5J4o7M3o6P1K9l5kj5J8%Kk7p1O3J1
8175b5P2Rr1l6J22k7k3J1j8K6m4LM8j3kk1
$$ y = [26, 9, -12, 32, 7, -4, -20, 3, 2, 16, -47, -19, 27, -18, 15, -36, 16, 11, -55, -23, -23, 38, -32, -13, -13, -12, -9, -41, 6, -73, -1, -31, 12, 1, -20, -27, 47, 32, 40, -24, 52, -26, 22, 26, -42, 35, -4, 22, 51, -30, -28, 7, 21, -46, -3, -69, 2, 31, -4, -6, -21, -3, -3, -1, -28, -99, -36, -25, 47, 56, -35, -71, 51, 24, 1, 12, -6, 20, -24, -21, 27, 14, 12, -9]
8191i
$$ Imaginary data points
##PAGE= N=2
##DATA TABLE= (X++(I..I)), XYDATA
0@%%%%%%%%%%%Qj6J6j6J6k4L2m0M8n6P2q8J04j20J36j60J84k08K40k80L20l60
33a92M09m65N28n92O64p44Q28r24J026j138J264j396J541j702J878k071K282k514
51a318K769l052L367l718M114m563N076n669O366p198Q209r472J1103j3299J6437
66I152k1328L0090n0717J92900J74076j99432j40720j68491p0408j5241Q8899
77a71220J15215J34053Q1705M0151l2728p3993j04205q0263n1126K784L9742P0529
89b9356O7527N4692J6738j5647m5891n2833m7527k4220k239K3346L7431M0061
101B2082K7143J1622q548k3174l1370k7377j5328K001J2980J9858K1095J6437
113B7421N931m068j3245j6813j4356q579j162P254J2283J2194Q743L351k208o813
$$ y = [0, 0, 0, 0, 0, 0, 0, 0, 0, 0, 0, 0, 8, -8, 8, -8, 8, -16, 16, -24, 24, -32, 40, -48, 56, -64, 72, -88, 96, -112, 128, -152, 168, -192, 217, -248, 280, -312, 352, -392, 436, -488, 538, -600, 664, -732, 809, -893, 985, -1086, 1196, -1318, 1451, -1601, 1766, -1952, 2162, -2401, 2675, -2994, 3372, -3826, 4383, -5089, 6014, -7285, 9152, -12176, 17914, -32803, 160097, 334173, 134741, -5979, -174470, -244878, -260119, -171220, -56005, 78048, 159753, 199904, 167176, 93183, -11022, -91285, -142411, -139627, -99885, -29356, 38171, 92863, 109601, 93954, 48063, -4770, -52297, -76517, -78756, -55410, -17979, 22082, 49225, 60847, 52299, 29125, -2245, -29622, -44950, -42949, -29969, -10111, 10984, 27421, 33352, 29284, 16039, -774, -15130, -23709, -24871, -17617, -5334, 6860, 15603, 18954, 16746, 9933]
127I933r889r015l845O33L230N821O908N018J934j088l489n215n306l271L55K584
143d702L299L667K667Q22o91j832k772k541j831m29J254K197J951J583P50l01
159C091j339j667j488q12j92N74J396J207M48L08k0n80p75q09p26j80L68P69Q07
178C80M26J6n8l84m38j91m12l29M00N28K04L58J57j39j39k54k73j49j67O5L84
199a5K22%K05m4l32m4J0k80r5J15mK36K66p2m4j22l4J9q5p7J02O9j00K14J55j75
225I0n4O1j30l4R9j16K9J06k4K3J0q4J8K5j48R8N1j39J00J50j07l4R0j04l3J02
251D5o0l5oK3P8M6p3o0J01q7j1O6j14K4N4q1k2M8j4j64P6ooJ5K5K1O8r5l4J23
281e5p2qO8rp5P3l3K6M9Lj7j2m0J2N2k6l1R0k7LN9n8p2R5M9l9KP9l8pPP4m9m2
$$ y = [9933, 44, -8971, -12816, -12183, -8953, -3132, 3776, 8794, 10728, 9640, 6151, 936, -4370, -7641, -7286, -4702, -1403, 2264, 4931, 5753, 5062, 3230, 458, -2083, -3914, -4343, -3089, -892, 1059, 2642, 3392, 3091, 1752, 85, -1403, -2215, -2407, -1833, -437, 770, 1218, 1526, 1506, 926, 151, -658, -1384, -1564, -1196, -427, 380, 806, 822, 764, 380, -58, -249, -661, -990, -590, -62, 142, 500, 657, 518, 379, 125, -148, -297, -464, -399, -15, 207, 207, 412, 368, 36, -8, 2, -278, -373, -258, -262, -26, 240, 168, 124, 2, -32, -13, -98, -175, -73, -4, -104, 110, 265, 90, 36, 97, -33, -67, 32, -84, -55, 51, 27, 50, 60, -24, -6, 19, -129, -31, 20, -119, -19, 131, 24, -10, 80, -24, -57, 45, -15, -50, -56, -33, 45, 91, 18, -42, 59, -28, -39, 27, -87, -63, -9, -90, -112, -64, -78, -242, -166, -172, -178, -163, -138, -117, -49, -144, -178, -55, -127, -135, -67, -76, -151, -78, -111, -85, -36, -33, -50, -62, -102, -90, -38, -64, -95, -5, -32, -29, 30, -28, -100, -5, 44, 5, 7, 86, 48, 41, 48, 122, 73, 31]
315C1K8L6l6qk7J6l5J5M4r8M3Ql7l0j9J0Op7JQ3j00P8l3m9n6M0R0ql4L6P9q3L5
348e1k0N%O6Km1J4Jj8nJ8PnRj4k8J8L1k0LL3J2l6K7j7N4m7Ok8N2j7l1Q1o8L5O
384C4n3M1RNm7k8O3%rj3l2Oo5J14k1Nm9L2O2k4p9Q5n0M9J3l5l3NN1l5j4j6M7J
418A9J0l0M8l0o6R4r1kO4o7M1LM7n7KN8o0M0rK3k0Ql4j2P0jn1o9J00k0M7j6m3
451dJ1L7r2P5l2J5p9PM8l2L3j5N4m0PL1k3pL6l8R2mj06Q7Op6Q3ko7Nj3J4K4mp2
486d1j6P3ol2J1kRk4Rk6N8k1MK7m0M6n0QML0n7K0O1r3L8Rj7O6m6nL1m2j1N0m8
521b3J5K8lk7L8p3PL9P8j01N1K9m5J0J3k0M8j05j5M4K4j7k4N8n3n6M3R8n4o4M2
552a5l0L5j9j8R4l9K0NK5k7J2Nk1J6l0k1R4o5L3%n3n9Q8Ml4J0n9K3M5k9jJJ8o7
$$ y = [31, 59, 95, 59, 51, 24, 40, 5, 20, 64, -34, 9, 17, -20, -50, -69, -59, -53, -130, -129, -46, -146, -68, -101, -150, -206, -166, -76, -84, -118, -82, -3, -86, -51, -71, -66, -66, 0, 2, -39, -25, -24, -42, -47, -29, -22, -27, -18, -32, -60, -42, -11, -31, -28, 5, 17, -19, 8, -9, 45, -2, 4, -24, 28, 11, -20, 61, -7, 28, 34, -19, 22, 31, 36, -11, -39, 24, 24, 15, 2, -30, -24, -89, 25, 4, 9, -40, -8, 54, 30, -49, 36, -14, 35, 48, 13, -20, -15, 36, 1, -13, -29, 18, 19, 29, -1, 47, 17, -49, 45, -46, -48, 16, -51, -10, -7, 40, -17, -15, 43, -17, 23, 14, 37, 17, 25, -9, -21, 49, 48, -3, -72, 28, 8, 55, 39, -4, 7, 44, -48, 27, -5, 10, -69, -62, -14, -46, -13, -28, 26, -14, -7, 24, 1, -6, 30, -8, 84, 80, -26, 61, 67, -9, 74, 72, 5, 10, -3, 11, 35, 31, -41, -57, 16, 10, -22, -11, -13, -4, -28, -19, -45, 13, -8, -4, 23, -17, 29, -21, -13, -9, 21, -36, -16, 45, -48, -10, -1, -18, 48, 2, -3, 28, -14, -25, 25, -23, -8, 20, 17, -10, 28, -45, -38, 1, 79, -22, 29, 58, 13, 23, 36, 16, 64, -41, -56, -12, 12, -5, -29, 29, -24, -80, -37, 61, 7, -57, -15, -45, -10, -29, -47, 47, 8, 28, 33, 58, 31, 43, 48, 27, 43, 13, -8, 86, 21, 54, 54, 1, -58, 30, 34, 0, 10, -49, -26, 19, -10, -11, -10, 8, -59]
586e9O8Kj3Lk1k3J9Q7r5L9l7K0P4m9o4R1J2m5P5n1L3n9rj7J0OlkL2n2P1j00O9
619A2k3ok7O2K9o3K3Oj8o7Q8l2k1NK5M3n9J0Nj6J8NM1o4J6N2j12K7J3J2L1j5l1
652c1J6l1Q0k2l6J6O0l1j4j6Q0m0qk2mN0j6M1n9j2j3NJ5l6L8n0L7k0K3Mk9N7m7
685a5j5m1J02Po2P4Lqj9Mo9M8m9M2K1k6M2j13M1L3j3Qj1ml5QO3o0J4j6O2o1J1
718c4Q3k2j0lK5l4K5m2M6Jq8L9K7M4n6N1p5L9j3J9kOj6L1q4M6k7j8oQ3q7rL3R3
752F5j21K7J2N3k9K7n0j5P6o3l2L1K4j2j5L0l1L4MpNN0k8l4pm0R0m3K5K1p2M4
784A9m9J8N7k5m3K1Lm8K2j1N3k0Mn1O8%l7JJ8Mj1j9N8k0KJ8j8j3k5L1pJ0ML0l8
819FK6l4P9p3k8O9p9P6q4M0M1k7j9j8L4Qkkk8k4lJ8N1j7%J5k5Rl8L7Om6O6l1k8
$$ y = [-59, 9, 11, -2, 1, -20, -43, -24, 63, -32, 7, -30, -10, 64, 15, -49, 42, 54, 9, 84, 33, 66, 7, -2, -19, -9, -3, -6, -8, 24, -28, 43, -57, 12, -11, -17, -44, 18, 47, -16, 7, 13, -5, -72, 16, -16, -37, -32, -7, 36, -23, -13, -8, -24, -6, -1, 40, -24, -8, 44, -68, -41, -28, -16, 15, 0, -31, -15, -46, 34, 12, -24, -8, 52, 21, 7, -9, 71, 31, 23, 1, -3, 47, 31, 72, 13, 1, -12, -7, 8, -28, 10, -40, -3, -23, 0, 4, -25, 32, -15, -30, -71, 31, 38, -24, 50, 53, 45, 26, 30, -39, 9, -40, 2, 23, -3, 39, -74, -33, 0, -13, -5, -16, -20, -55, -47, 16, -44, -30, -46, 16, -45, -34, 49, 27, 17, 14, 39, 5, 30, -12, 34, 35, -53, -14, 13, 57, 1, 52, -23, 16, 3, 22, 20, 26, 10, 41, -43, 3, -24, -42, -48, 35, -52, -61, -28, 65, -56, -29, -17, 36, 7, 34, -16, -31, 45, -18, -50, -19, 5, -7, -22, 8, -23, 11, 15, 8, 13, 63, 35, 1, -6, -46, 44, 1, 26, 47, -25, 19, -30, -12, 45, 20, -23, -2, 1, -47, -25, -36, 17, -3, 1, -50, 18, 18, -19, -18, 0, 4, -7, -26, 32, 12, 14, 32, 14, 1, -24, 7, 0, 10, 14, 44, 6, 32, -2, 77, 4, -24, 45, -34, 42, -42, -2, 39, 12, -7, -25, 9, 17, 15, 13, -15, -39, -42, -24, 27, 10, 10, 25, 0, 9, -29, 8, 14, -32, 34, 3, -25]
854b5M5l8lQ6j02O4KJ3k7l0lQL1k8J1J5l5pL9n2PmQM1k9j8M4K2m0K4n9M8l4L7
888A1L0p0K0O1j10P7J3k2ML1pp4pK4P3m4Pj3K2j6J1J6On8m0R3l6m1K3N4k8l2%
921b2N5r8L2j1mO4Qj4r3R1j0o7J3R0l2L0o1P6o1K0L0j5rj5k5J9J2L2m8K7%pj3
954fk6O7m0PjMj4j1k8LJ4nK0L7n6mP0k6k3Kl1O2J9q4M6k2K2L4n3O5J2l9m5O4q
989B6m2K6J6Lj8l6NJ0m5O4j8N3j8l1J8l8N5l8lM9l6nj6N6o8J8L7n9L3J2j6l9N4
1022Ik3l2Q8k3l4NL2l1MRj0J0M8o9ON3m0m1K9rL9m7K7Pl3L9om3JK0m9J05r3K4
1056b8NmL2K7K3o9l4J4M6o4M8P5ol3o3L6M7k9lj4p1P8K4m1M8k9n0M9o0O0j5m5
1088d6P6j7m2M2N6r4O6q5J8J1M7k2qN4p5k4K3M9j29Q0N0m1O2m6K1K7n8l4N7Qm3
$$ y = [-25, 20, -18, -21, 65, -37, 27, 29, 42, 15, -15, -18, -10, 21, -7, 4, 19, -16, -23, 16, -36, -29, -33, -25, 16, -13, -31, 13, 35, -5, 19, -40, 8, -26, 11, 41, -29, -9, 52, -58, 19, 32, 10, 14, 45, 38, -36, -43, -19, 54, 10, 17, 4, 26, 10, 21, 37, 43, -15, -55, 38, 2, -39, -16, 38, 10, -22, -22, 33, -65, -33, -44, -48, 16, 24, 10, -83, 8, -2, -69, -56, 34, 2, 32, -29, 47, -14, 6, 36, 21, 12, -3, -28, -9, 3, 35, -13, 14, 14, 7, -6, -32, 35, -5, 2, 1, 5, -9, -20, -48, -45, -31, -36, -16, 21, -35, -39, 31, 5, -18, -16, -47, 15, 34, -50, -4, -26, -4, 30, -23, 42, 54, 15, -30, 34, 26, -16, 10, 26, 29, 11, -25, -20, -10, -55, 9, -9, 44, 26, -5, 13, -25, 30, -8, -11, 38, 2, -3, -19, 37, -31, -13, 24, -35, -2, 10, -6, -45, 9, -14, -46, 42, 19, -15, -10, 22, -9, -5, 4, -6, 4, 52, -17, -11, 42, 2, -39, -10, -19, 20, -27, 0, 7, -26, 13, 7, -36, -35, -15, -64, 41, -52, -28, -23, -27, 5, 32, 55, -14, -48, -34, 12, -52, -4, 71, 65, 32, -31, 5, 52, 23, 20, 6, -65, 13, 37, -4, 44, 15, -35, 14, -46, 14, -1, -46, 30, 13, -29, 13, 69, -25, 41, -44, -26, -15, 32, 10, 2, 56, -19, -43, -20, 29, -100, -20, 30, -11, 51, 5, 26, 53, -5, -39, 18, 26, -17]
1119a7l6M9J2L4k0o0PO3L4p3K8k0J2Mk3kqjL5j6K9k2N0n9Nl9K5L7m1L0l3M0No2
1153c3J4K8k9L2Ok6j8O7r4N0j9kK8rl3jP8m5J6J1j5k5M6L0k9m7O2k2m1k4M0j0
1185a4M4m1Q3p2J2k9K2o4M5K3O2m3J1l1ll%Qoj0nJ2m6KJ2jL7rnmJ2l8j4M2l0M7
1221FLK7k7Jl5M2k9M2J0l8L4K3l1m6J1N2m5lJ6K5k4j3n2j3M2L7l8M3o6N3J6KK4
1254D9p8L2o3M7NlRL6k6r3R5Mo3L7L2j7Ln6Q8k3o1L1OK8mK1j5j5Qoj6N4ok0m3
1289b3K7N3l7j0l6j6N0l9N8n6PJ9oJ3j1moj1k9O6J3k3j1K5%J8o1Q1o1O8j01R0
1321D7j4p7M7M2n3j0k0Q2k0m3N4m2J5J6Pl6JJ3M5n5K5k6J1m2nM2m5J0J7N8o5j
1353b2N9K0n2j8J7mL2m7R6o3qoK4k3M3m9K0k2M3o9L4k8k9P7l6j0M7j1l7Qm1R6
$$ y = [-17, -53, -4, 8, 42, 22, -38, -31, 32, 66, -7, 21, 1, 13, 17, -6, -8, -16, -17, 18, 2, 31, 9, 59, 0, 5, -34, -9, 28, -13, 17, -16, 24, 29, -33, -19, 9, -20, 12, 18, -8, -26, 41, -53, -3, -22, -24, 4, -5, -38, -39, 39, -6, 10, 21, 6, -19, 27, 57, 28, -19, 43, 21, -20, -44, -4, -14, 30, -11, 72, 0, 12, -17, 5, -59, -14, 9, 71, 28, 39, 8, 5, 2, 2, 10, 4, -6, -11, 1, -45, -43, -31, -32, 5, -4, -9, -13, -1, -39, -53, -11, -41, 6, 9, 36, 9, 10, -25, 17, -12, 30, 40, 2, 36, 59, 28, -18, -7, 45, 0, -3, 13, 38, 14, 1, -51, -64, -22, 15, -23, 20, -46, 7, 23, 25, 49, -29, 3, -60, -13, -8, -11, -2, 34, 8, -85, 10, 14, -49, -12, 20, 3, 6, -50, 38, 15, -46, -15, -9, 19, 15, 36, 21, 6, 14, 8, -8, 46, 40, 20, -23, 4, 57, 20, 10, -26, -42, 8, -31, 27, -29, -22, -3, -9, 4, -7, -11, -17, -28, -57, 9, 22, -1, -12, 13, 13, 31, -30, 51, -10, 58, -43, 47, 33, -44, 3, 45, -8, -18, -38, 44, 24, -19, 35, -7, 8, 24, 31, -5, -4, 9, 54, -1, 24, -2, 9, -33, -38, 4, -41, -31, -14, 44, -21, -22, 37, 57, 5, -13, 4, 0, 32, -15, 81, 18, 10, 4, 28, 5, 48, -1, 19, -3, 40, -29, 5, -23, -52, 25, -11, -21, 26, 15, -22, -14, -55, 41]
1385D1n6oK4pk1j2K7K9%on4J06pm5mK1p0L2J0L4K5o2oM1l9j7JkM8j6m4M1j6K3
1419A3K9o0L6n0J0K1M2j4l3Oj4j2M3jm1J2K8n4K9J3J0K4oQm8J9K2K4n0J4j9k4
1451b3L5K1%p4L5O7j05P7n2Nk8O0km4N9k8PLj2K0J5j6k2M1l6j6K0j7K7kJ8K8j12
1484e1R9m9J8m4Q2J0p8M5J2l1o4L8L2k8K1j1M5l7j6Rl5OK8m0M5pm4O8m3J4PJ6
1516A7j7j0P1p1j8J1K4M6j8l8K6k5ql2R7n1J5k7K7j1PK0n9O9l1oj9Pn6J22q2J
1548a9J1%K7l1j7RrOL3o0L5J3k2k1nN8j1K1n4N9n6J4K4nRK2j4J0jk6OJ1o0J0M2
1583IJ7k8JK2k8k0L3J9l7k8N2m0K3Qm8M7J0l1N8n3L6k7LL0k3k1l1M5k2M3l8K2
1615CK5l9%QPJm2M3n8O0l3M0n1nJ5N2k2J3ml3K1L1o1m1M7N3k8K7o3PJ8mk0QJ9
$$ y = [41, -15, -21, 3, -4, -25, -37, -10, 19, 19, 13, -41, 65, 58, 13, 9, 30, -40, -8, 2, 36, 61, -1, -7, 34, -5, -22, -21, -23, 25, 9, -35, 6, -10, 13, 42, -18, 18, -32, -22, -1, 41, 27, -6, 0, -14, -26, 17, 16, -25, -13, 15, -39, -10, 3, 13, 37, 31, 39, -9, 10, 32, 56, 6, 20, 1, -23, 12, 33, 33, -41, -6, 61, -44, 33, -19, -14, -42, 18, 16, -28, 31, 3, 10, 13, 1, 21, 36, 20, -2, 39, 3, -13, 7, -10, 17, 15, 33, 61, -51, 48, -1, 17, -27, 55, 65, -13, 32, 44, 13, -51, -13, 19, -9, 12, 1, 46, 9, -7, 2, -33, -27, 1, -39, 6, -1, -45, 23, -20, -6, 1, 17, 0, -10, 61, -10, -28, -17, 7, 53, 35, -3, 23, -2, -10, -42, 55, 4, 19, -8, 19, 8, 15, 35, -24, 45, 14, 8, -11, -4, -60, 62, -20, -19, -8, -8, 19, -12, -29, -20, -29, -23, 10, -50, -15, -2, -24, -45, -50, 8, -3, 18, -36, 23, -33, -19, 5, 0, 9, 31, 17, 27, 26, 0, 6, 17, -43, -33, 9, 26, -2, -1, 21, -7, -27, 6, 25, -12, -40, 12, -28, -5, 3, -45, 2, 12, -19, 39, -14, 22, -5, -2, 28, 5, -16, -47, -2, -24, 19, -19, 3, 28, -11, -11, -3, 4, 5, -37, 6, -52, 8, -25, 15, -36, -41, -26, 26, 4, 17, 13, -20, 1, 32, -29, -70, -23, 30, 2, 29, -34, -27, -9, -13, -33, -25, -6]
1650fj2J5L7qk3J3k3JJ9j9K0m0kN4n3K2l0P9j22J39o6L0k0k3%j5LOj6N0Kk0om
1684a8k5J8M8J1m8nK8l6L2lJ8nj8L2k6K9K3j19N6KM4p0L4j5l3M6j1J7k0k2M0n5
1716e1M8m0J5M8jNn7k2J2O9kqo5O5m2P4l1j4J2m4O1J7l8k3L8j7j8M2nJ6nk3n1
1749c5O4j9j6P6p2j5M3rq6M2L2Km5lJ00n6jJmn0O0k0k1O9o2K3k6%O9l5J0K9r6
1782e1M0k7L7n3N9k8M5k9l5KM4kj6M3l7K4L1j2j7pm9N0K2l6m1K9L8n2RN8k1mk6
1815a2L2n6J1L5qm2P6n3P9m3l5LJ9L6k4m6k2N8j3N2n6M7o7K6K1N5o6LPl1rK0k1
1848b4J8l3qQO9n8O5m7K9l8k4J5M2K6m1N2Jm5O4n5o7L1P0j00R0N4j08jJ9M0p7
1879c3J15o8m3N5l8kl6K4LJ5LJ9m3M0m7J8J5k3K0j9koQ6k2JQp9O8l2K1Nm1Q5k2
$$ y = [-6, -18, -3, 34, 26, 3, 16, -7, -6, 13, -6, 14, -26, -28, 26, -27, -5, -35, 44, -78, 61, -5, 25, 5, -18, -18, -33, -30, -24, -40, 10, 12, -8, -14, -18, -43, -25, 23, 34, -14, -19, 9, -27, 5, 2, 20, 15, -3, 29, 3, 32, 55, -64, -8, -6, 38, -32, 2, -13, -46, 0, -11, 6, -14, -36, 4, -51, -3, -43, -28, 20, 19, 24, -33, -55, -43, 26, 24, 16, -49, 16, -26, 48, 17, 3, 15, -29, 32, 49, 11, -12, 26, 9, -9, 33, 28, 44, 39, 16, -35, 29, 10, -6, 70, -2, -17, 26, 17, -69, -27, 5, 7, -38, -41, 59, 3, 2, 3, -1, -51, 9, -11, -32, 37, -25, -2, -28, -28, 41, 6, 16, 45, -51, -11, -38, -1, -54, 5, -23, 22, -7, -42, -40, 4, 2, -14, 29, -8, 16, 47, 35, 18, 11, -38, 12, 34, -2, -43, -14, 24, -28, -19, 39, 18, 14, -12, 20, -36, -25, 10, 2, -40, 36, -17, 62, 19, -16, -13, 6, 42, 18, -28, -50, 8, -5, 47, -9, 38, -29, -3, 18, 73, 7, 10, 17, -14, -23, -3, -24, -6, -39, -47, -39, 30, -28, 37, -10, 19, -19, -43, -28, 14, 40, -1, 51, 52, 7, 71, 16, -51, -20, 50, -50, 40, 94, -14, -15, 4, 44, -33, 82, 14, -29, 26, -12, -14, -50, -26, -23, -8, -5, 14, -29, 11, -36, -18, -3, -26, -6, -25, -27, -33, 53, 31, 32, 40, -39, 29, -3, 18, 23, -18, 67, 45]
1913D5o7L1k1K7k7L4kn8J1L3Qk3K0mk2K0L9m6M2j01P5L8j11O9n2N6j4l5O9j6k7
1944iK0l1j5mP6m2k0O2n3M9k7K4l7j4M1j6Ql7K1J7o6N1l5N9o1M0j5l7K3N1k0O
1976Ik3j8lJ5J2j2N5l7nJ0k7P2n3L2k3J8K9l0j6M2j00P2mj3L2o6L9m6O6l5J6l
2008Ek7Nj3%N0n7M9K5lp7N6l3J1M0k5kJ5j7m4mL2N5k7J4n7N0m9M9okn0NPL0j9
2043a4Qj5M0Jj2Mj9%rL4k8L2n5l1J8N9Lj1Jm7J6QM3q9O6j0K4J2n3M8L9k9Jl6K3
2078B2k3j4ml1J02j05K0N1l9M7KL4oj30L0M6K9Mn2RnL4j8o9K0k3L5J4M0oJ4Jl
2111B6k0k9p5R3J3j1j7L3k3rJ5J5J6Lj7K6l0l5pL3O4m7mj7K6k4Jm8L7l6M1p8O7
2144a8N2m2K2n2mM3M2p0K2L4J1j7k2p0R2oJ9Om5m2R8Kk9j3J8p1J9qQ7j04N5j2
$$ y = [45, -22, 9, -12, 15, -12, 22, 20, -38, -27, 6, 14, -9, 11, 7, -15, 5, 44, -2, 40, -61, 14, 52, -59, 10, -42, 14, 0, -35, 34, 18, -9, 11, -20, -35, -39, 37, -5, -25, 37, -16, 33, 6, 30, -7, -21, 20, 4, 12, -25, -4, 13, -53, -2, -37, 22, -39, 1, -14, -51, -28, 23, 3, 9, -14, -32, -35, -20, -8, -20, 35, -2, -7, 3, -24, 48, -5, 27, 4, 22, 51, 21, 5, 47, -53, 19, 15, 2, 34, -32, 7, -39, 27, -8, 8, 5, -22, -17, -30, -30, 20, -37, 12, 37, 34, -43, 13, -20, -9, 31, 6, 4, 19, 2, -42, -46, -14, 41, 14, 28, -29, 21, -28, 21, 15, 13, -37, -32, -25, 5, -14, -6, -21, 19, 20, 8, 12, -7, -7, -16, 18, -10, 22, -33, -64, -46, 13, 16, 5, 6, -41, -25, -17, 26, -63, 3, -7, 17, 29, -24, 24, 63, 34, 35, -1, 22, -1, -15, -19, -50, 52, -53, -33, 18, -21, 26, 28, 62, 56, -74, -44, 2, 31, 35, -17, -8, -13, 21, 3, -66, -46, -69, -34, -20, 20, 14, 28, 29, 26, 6, -23, -98, -5, 8, -3, -20, 13, -10, -19, -4, 11, 27, 30, 13, 39, 9, -26, -33, 0, 64, 17, 13, -4, 22, -2, -1, -49, -12, -48, -7, -85, -18, 34, -8, 14, -38, -42, 1, 43, -27, -5, 29, 40, 23, 1, -69, 23, 17, 36, 42, -3, -45, 53, 55, 26, 13, 31, -40, -21, -29, 58, -46, 9, -3]
2176c%J6p0O2J2k0m3L8J8o0M5L3m8O7o8pM6%J4l0l6Q8n2JK0j1M0n6RoL9r5N0M0
2210C3l4l3J8K5mM3l7M8n5k4J8m5M3nL9p3N6K3m8L3q0L4N5J0q4O3M7j22J7j5L7
2241a7L6K7k3jm1k2L3j9J4K1l0M4j2lm9k6N8J7o2M3K4jQm5K8m0J9O2l9k9L0j0
2273em9K4J4k2M6j6%J4k6j6O4j7lLp4Q3K1K7k4k5o7N3n2L8l3J9j2mK9omJ0N7o8
2307b1Nj1L9j3pqqN5l2NOM2m8K8j8j7j8J1O8n5K4k7NJ5J8j5ml0qO5n3JJ7j6M8
2342D3l4n2R7q6K6K1k0K9k6m3L7j4O5l6j9JN5n2K4n2K5K8M0n1mk8J9rJ6J6j37
2373a21J05nJ8L4Lm5j7QJ2l9L1Nm1L7n7N5JoK0jNm8jO8p4J7N6n7N5rrl0O2%l7
2408eKj1K4Pjqj7j5K4j4Kk5LK9QJ5km8Pk3M1j5qO6o3j3M2j2J8j6M3l9J3n5R1r6
$$ y = [-3, -3, 13, -57, 5, 17, -3, -46, -8, 10, -50, -5, 28, -20, 47, -21, -28, 18, 18, 32, 2, -34, 54, 2, 3, 23, 12, 52, -4, 5, -1, 38, -57, -7, 33, -1, -34, -16, 9, 5, 48, 11, 59, 4, -20, -2, -47, -4, -9, 30, -43, 13, 36, -12, 21, -59, -25, 30, 40, -44, 19, 66, -56, -39, -54, -17, 19, 46, 23, 22, -19, -41, -8, -27, -13, 8, -22, 22, 10, 7, -42, -68, -10, 7, -55, -12, 12, 11, 19, -26, 2, -38, -19, 43, 4, -25, 5, -5, -54, -30, -16, -38, 8, -8, -8, 6, -20, -36, 28, 11, 8, 11, -63, 20, 41, 68, 44, 19, -48, 5, -47, -9, -42, -23, -35, -39, -10, -16, -20, -10, 47, -21, -16, -27, 12, -1, -8, -16, -24, 31, -1, 4, 10, 52, 4, 32, 14, -3, -21, -10, 58, 3, 27, 0, 5, 20, 38, 23, 19, -11, -19, 46, -7, -6, 11, -5, 43, 9, -43, 54, -32, -6, 15, -5, 24, -2, -45, -8, -22, 43, 7, -12, -11, 44, -8, 16, -36, -11, 17, 57, 6, 2, -26, -7, -16, 0, 16, -121, -16, -21, -3, 31, 34, -11, -28, -20, -8, -47, -16, -11, -52, -15, -72, -17, -16, -22, -2, -3, 2, -46, -47, 21, -53, -36, 20, -37, 18, 9, 0, -30, 32, 32, -5, -3, -14, 10, 17, 16, 8, -9, -24, 0, -14, -12, -37, -34, -5, 3, 18, 16, -32, -25, -48, -7, -22, -30, 36, -27, -40, 2, -10, 8, -8, 35, -4, 9, -46, 45, -51]
2444e1M5l8O6n1J9M2j0Mj8L5%J0l3Rl1kolK9j6jN2l1j3K6Nk9rm2JM1m3lN5J1o1
2480d1O6o4L1l3K3O2m9K6l9mL7m7K8J5j6j8K4K0n8J3P8l3n6L6M3l0J4k9j6J4l
2511fj3N6o2j9L1J6k6L3JJ2m9rn5R0k3M3k1j7J0k2K5l5N8j4M1l4j0K5l5K2M7m4
2543A6m8N0pj7J5nqJ9mk3OL0n1N3m9N1J3m0%K4k5L8l9l6M8Rn4L0L7m7K8pl1K2
2577bNL5j0k4M0pj1mn9k5J9O4m0k6N3mk1Oj7N4k8mo9N1N5k2J1p4k1Q6j2Mm3K6
2611a4J9k1jM5jp6O4J6k9jJ5J5k6L9k2Nm5J3K9j1o5N9oOk5M2n4P1j9n4O9l9j5
2644a7K6M4n7j3pM9J8k8l7l6O4lPK4L3o0j4R5q3j2L2l0J8K5n0pM9q8N6K3l0J5
2676Fl5jO4k9J0Rm4qK7l0L1k7L4j2K2j0l1KmM2n5j1K7j0R6n0qj2L2l9L8n7O1l
$$ y = [-51, -6, -44, 22, -29, -10, 32, 22, 26, 8, 43, 43, 53, 20, 29, -2, -4, -10, -13, 16, 0, -1, 51, 20, 7, 33, 38, 9, 0, -42, -41, 0, -43, -46, 9, 20, -41, 25, -39, -8, -41, -18, 44, -5, 21, -18, -22, 15, -32, -4, 11, -5, -23, 1, 21, -37, -24, 54, 21, -35, 1, 44, 14, 28, -1, -17, -3, -6, -19, 37, -25, -44, -13, 3, -23, 10, 11, 23, -26, -35, -90, 0, -23, 20, -1, -18, -8, -30, -5, -40, 18, 4, 45, 11, 1, 26, -9, 13, 60, 16, -32, 18, 11, -6, 9, 4, -4, 15, 11, -12, -6, 24, -27, 26, -23, 28, 41, 1, 1, 25, 0, 38, -1, -37, 11, 20, -34, -4, 33, -14, 14, 7, -24, -2, 3, 38, 28, 4, 44, 37, 26, 22, -37, -62, -43, 21, -19, -45, 8, 4, -17, -11, -28, 26, -2, -6, -75, -24, 31, 9, 20, -54, -75, 11, -1, 3, -40, -14, 5, -16, -17, 28, 27, -49, 15, 31, 2, 1, 16, 31, 5, 44, 22, 27, -18, -5, 24, 13, -52, 7, 1, 7, -18, 24, -30, 41, 22, -32, 37, -2, -17, 9, 53, -4, -17, -24, 25, 43, 15, -22, -58, 6, 3, 10, 34, 67, 7, -7, 88, 5, -7, 25, -5, 13, 38, -12, -19, 30, -58, -2, 21, -9, 6, -29, -30, 34, 5, 15, 24, -20, -28, -1, -31, 0, -27, 7, -5, 17, 7, -24, -22, -26, 16, -39, -50, -23, -33, 63, 13, 5, -7, 25, -14, 24, -33, 28, 25]
2710B5m6QO5l5kJ0o0L6ml0M9K0o0qMO5k9p5N6M1l1K9k0m6Q5p9M2J1m0J3J8K9n1
2743a0J6J8J9k2p1Q1n9K0M5m6L6n8j4K3L8m2J0Pj6MlJ0lJ1K5k3K3l6j2j7KK6j5
2776c3L0J5m3mM0l9L1n7L9P5o7L3l0M0M1k4k5l8PK5j7J8o1L8L5K5q6L4L1l2JJ
2808Cr1J06Nq3L7n2P6l1R0l5nk8k0j0P8k2k2j5J1kj0O4n8L5n5L5J5M2m6Pk7J7
2840IrRn7K6J2J8o5N9K4l5j0K5lj3k7k0K5K1nNL2m2L7M1n3Nl5rOL1kqL0J0K3q3
2876b8N9m3j0rM2J0l8l1L1j4nQ5l5m8L2Ro4J5JJ8L0n5J7M7rJ6m2Mm5N9Kl7N5J7
2910C6k7J3m7L8qo3J07m6j0J4l1P1n4j3qK5mL1k3M1K8j08N6l9JK7j2l4J6QK8n3
2942d0LP0j07M0N2o3L7l1N4k2k8kN8o0P1n9L1%NM1p5L8m9L6j4qPM2n6PM1k2qJ3
$$ y = [25, -21, -13, 52, 17, 15, 25, -35, 1, -3, -33, 16, 36, -24, -32, -28, 37, 8, -67, -11, 30, -1, 28, 8, -38, 47, -32, 10, 21, -19, -6, 12, 41, -10, 6, 24, 43, 21, -50, 31, -28, -8, 37, -9, 27, -31, -45, -22, 16, -26, -16, -9, -25, -21, -24, -14, -17, -6, 19, -4, 19, -17, -29, -46, -44, -18, -33, -3, 12, -31, -35, 5, -34, -3, -60, -21, 54, -13, 20, -10, 30, 71, 47, 22, -16, -9, 16, -1, 17, -44, -6, 29, 54, -32, 2, 33, 1, 2, 3, -88, 18, 23, -60, -23, -75, 1, -30, 60, 25, 20, -8, -28, -38, 40, 18, -4, -19, -8, -10, -20, 44, -14, 21, -34, 1, 16, 58, 12, 19, -8, 9, 0, 9, -48, -22, -10, 8, -57, 2, 26, -9, -19, 6, 3, -10, -37, -57, -32, -11, -16, -11, 21, -21, 16, 57, 4, 9, -26, -35, -29, 2, 0, -8, 22, 32, 55, -28, 31, -12, -22, -31, 11, 21, -17, -48, -17, -31, -36, 49, 14, -34, -2, 7, -57, -42, -41, -23, 7, -48, -31, 16, 7, 23, -19, -15, -60, -1, 1, -36, 19, 36, 9, 22, -25, 13, 5, -58, 49, 3, -7, 7, -24, 47, -7, -20, -28, -3, -7, 24, 1, 42, 70, -38, 18, -21, -20, 7, -5, -39, -23, -15, 13, -40, -37, 33, -74, -34, 18, -45, -8, -39, 15, -7, -35, -37, 21, -39, 32, -27, 4, 4, 9, 50, -25, 13, -36, 0, -14, -22, -15, 27, -29, -22, 19, -3, -11, 2]
2976BOp1L9k0M0rk5L7n7O4o9N8QNK0o4O9m8L2N3p3M7o8J0J3L4L0k2no1J5N1n7
3009a6L8J5m9n3P6j9l2K1J6l1L8L3n8Ll3J04j6n2j6P0p8L5Mjm0M8j1K1l2k8pL9
3041a1R2j11O6lj0l3J7M2j02N4K4l7J5J4lQj7j0L7n2%j1M4j3m4N6m6M7lm5M5l6
3073b6QJ1o%kM6m1K3k1L9J5p4%N0k5m3N4%M3m6j4M6k9N2r8O3n6J5n1P0%NK3o9
3107c8Q3j27K7RN2j1OnnL6J4r1N0M4l1qMM7l2mm0j7Q3o1K4ol6Q3p1P6p9M8Pl9
3141hKL3p2O3np2N4l3J3j0oJ7QnJ6o2P7l4R3o1j9J00o1m8K8lQJ3k3kk5K2J7o2
3175d7N2j6p7J02k7j4J2Q2p9m2O0J0k5k3P2l4L6n3K1j9N5l1k9MK4m2M3l0J2jJ
3206cO0m2M4m4l6K4j5J1K1l7RJ9j4L3J6n7K5N2o1L4Nj7n5M9l4J5Lm9O0n0J9M1
$$ y = [2, 8, -63, -24, -44, -4, -13, -38, -1, -58, 6, -63, -5, 3, 8, 28, -36, 33, -15, 17, 70, -3, 44, -24, -14, -1, 33, 63, 41, 36, -25, -10, 41, -16, 22, 37, -12, -65, 11, -8, -40, -19, -3, -34, 4, 37, -21, -18, -51, 53, 37, -15, -31, 39, -39, -4, 0, -1, -41, 7, -4, 17, -15, -43, -50, -11, 81, -30, 36, 33, 23, -10, 7, 49, -53, 1, 25, -12, 3, 17, 14, 22, 5, -5, 32, -20, -20, -31, 13, 0, -44, 12, -34, 13, 10, -35, 10, -26, -18, -7, -13, -13, -15, 31, -10, 13, -8, 31, 46, -28, -28, 22, -3, -46, 8, 8, 51, 5, -9, 37, 8, 60, -38, 25, -31, -16, -67, 3, 3, 8, 31, -38, 45, -82, -55, -46, 6, -5, 1, -4, -9, 27, 41, -50, 0, 44, 13, 5, 9, 56, 24, 20, -20, -37, 46, -15, 9, 3, -33, 50, -21, 55, -24, 24, 31, -8, -6, 27, -45, 18, 13, -59, -5, -38, -25, -35, -41, -24, -16, -21, -5, -67, 10, -24, 69, 8, -11, 89, 28, -20, 8, 5, 13, 26, 3, 1, -24, -2, 15, -47, 5, -11, -88, 14, -13, -27, -15, 67, -12, -54, 6, 16, -9, -32, 40, 6, 42, -11, 10, -9, 46, 15, -14, -10, 14, -28, 15, -15, -3, -4, -3, 57, 15, 59, 15, -21, 3, -12, -1, 20, -17, -8, 11, -3, 30, 46, -11, 14, 66, 5, 39, 44, 27, -28, 21, -13, 2, 5, -44, 16, -34, -15, 26]
3238B6J0m4n5R7m9J8j8j7J2M0K3p2P4Jl5K7Rk3k1L9j05J22q4O0k4l1pPO3l7k0
3269a4K1l9K6k5jN8l2k0JK0k3Mj7M9Jn9J14j16L0MN8k7j5J2L0j2j8J9nK1n7P7
3301F5n5l5K0J6m1N0N6Nm9j3j8k3L1qL1m2J0k9K7Lk8L8m3M4l2oRN0%J3k5lp7J8
3335d1j9L8O1mj6rPk8L6l5J5p%OK1ln8L4N9m2j2qJLM9r2M4K2j0N6r4K9KK5M2r3
3371b1j0j5J10p6J7J7k4j2Ooj8J4J8K4p5N7k5N4k6o2K3K8rJ0J0l4j3L1J2j2NJ3
3403A1l3K9K0m7m3P9lj8K7l8k7L5n9R1l9K4mNj1L5n8N0l3nL9q4J05l3jNo5P4k0
3436HmJkJ4n0M5m9P0k5On0L3Ql8PL7K2m8P7m7K5k0l3jJ6qj1N5mn7M0j1k5K4m8
3471d3P4Rk3m9J5j8N1l2N2n7pO6r9R6p2nK1RN1Nm0o3J5J7M0J8j1ro8nP9kl1k7
$$ y = [26, 36, -8, -63, 34, -15, 3, -15, -32, -20, 20, 43, -29, 45, 46, 11, 38, 47, 24, 3, 42, -63, 59, -25, 35, 11, -20, -27, -20, 43, 6, -14, 7, -32, -6, -31, -32, 26, -6, -26, -25, -5, -28, -24, -41, 8, 9, -50, 64, -52, -22, -18, 40, 13, -2, 10, 40, 28, 10, 29, 24, 45, -12, 65, 10, -25, -5, 11, -30, 20, 76, 81, 32, 19, 1, -22, 9, 1, 32, -10, 0, -29, -2, 1, -27, 11, -32, 12, -20, -26, -17, 33, 33, 46, 21, 18, -59, -41, -60, -22, 39, 35, 19, 10, 17, -11, 25, -10, 5, -2, -2, 4, 25, 22, -36, -2, 57, 15, 3, -5, -4, -1, 48, -44, 0, 22, 12, 68, -26, 3, 5, 30, 72, -21, -31, -46, 64, -12, 5, 22, -2, -14, -8, -14, -32, -18, 0, 24, -51, 6, -19, 35, 9, -53, -30, -2, -11, -1, 9, -25, -38, -7, 5, -7, -2, 11, -22, 7, 27, -20, -63, 16, 13, -5, 22, -16, -43, -8, -67, 24, -15, 9, 5, 10, -1, 34, -24, 26, -7, -12, 27, -57, 48, 15, 14, 19, -46, 28, 8, 4, 5, 3, 17, -33, 12, -37, 33, 8, 14, -36, -3, 5, -33, -26, 11, 33, -15, 62, 15, 40, 20, -13, -14, 2, -6, -17, 38, 34, -23, 17, 6, -19, 5, -43, 31, 40, 17, -32, -17, -35, 16, -16, 36, -21, -28, 38, -61, 35, -37, -42, -21, -12, 39, 44, 4, -59, -44, -27, 13, 31, 20, 11, -57, -62, 17, 15, -16, -43]
3505d3N6p4P6Mk9J8J7k8J9l2N4o5%P1k6m0kK4L9m6m0K2j2N4k3Kl2M3p1J1l0J21
3537C8J8q6L9K9j3n0J7M5l9j9L2p4J16k4jNnl2O3n7l8O3m%j5K1m5j7L0m0O2j4
3569Ek5M0m5L0l7N7k1L%L4q3P4Ml2nn1Q7k0j4l0L8p9R7m2L7m3RO4o1M2o1L6k9
3602b1J4l2jO3k7k2L3m6j0O7j0r2J02l2ONn0O5jk4j6L0m8M9K5nn4M8rKK3k4p9
3635g1L1M9M4k8p7P7oj4l1L6k0lmJLK3Po7N9l3K3k7K0K3j02J16m2O0p9L7PPM4
3668F3j00J8J11n8pKm1MM5j4l5Rk9J0K2p3L6L1l2L9JJ6l0km8O9J3m2K3oL2J1o1
3701b3L1k1j0L0m3NL1mM1k8mj5P0m6ml8O7m6K5O7j09lL5K3j5k9J5Nl7Q1j12K5
3733c6L5lOj2j1k4J4l5K2J0N5oK8m7Jl5N9k0MJ2k4K0nnnN1n2P5o4j7J1J5ml3l
$$ y = [-43, 13, -61, 15, 19, -10, 8, 25, -3, 16, -16, 38, -27, -27, 44, 18, -22, -24, 0, 39, -7, -47, -25, -37, 17, -6, -4, -36, 7, -64, -53, -83, 38, 56, -30, 9, 38, 25, -25, -8, 37, -2, -21, 11, -63, 53, 29, 28, 33, 28, -4, 59, 2, -36, 27, 23, 23, 8, 29, -16, -33, -3, -43, 19, 5, -20, 20, -25, 5, -32, 25, 4, 7, 7, 41, -42, 32, 36, 4, -1, -52, 35, 15, 1, -29, 9, -70, 27, -15, 22, -21, -12, 52, -9, 33, -28, 8, -21, -7, -39, -40, 23, -4, -26, 7, -39, -49, 18, 8, -84, 18, -14, -8, -3, -53, 12, 11, -13, -29, 1, -47, 2, 27, 22, -32, 16, 7, 9, 32, 8, -71, -40, 9, 53, 25, -52, 25, 19, 5, -26, 10, -10, -13, -17, -16, -13, 10, 17, -50, 9, -24, -1, -28, -8, 15, -87, 29, -13, 47, -32, 5, 12, 19, 63, -37, -19, 92, 34, 27, 29, -12, -8, 37, 23, -12, -3, -32, -22, 0, -73, -37, -6, -38, 1, 2, 18, -12, -14, -62, 7, 20, -22, 1, -5, 27, 38, -23, 8, -13, -23, 7, -36, -31, 0, -4, 37, 9, 5, -10, 60, 14, 10, -28, 39, -7, 18, 85, -24, -27, 8, 31, 16, -13, 2, 7, -30, 51, -61, -36, -1, -4, 2, -10, -21, -45, -31, -66, -44, -34, 21, 15, 43, -4, -3, -38, 21, 1, 5, 17, -7, 13, 8, 3, -2, 49, -3, 72, 8, -9, 2, 17, 13, -20, -23]
3768b3K1K4k1ml3J0JO4n9M3m6M6n8Oj2L8k2K4J5Rp7K0J6O9m6k9m3M0M5L4r0Qr
3801c9N9J6k2k3j2L3k7L5kj1K5k9n2O6l3K5m1N9l6j7J4mJ1J7m4J4j3J3L8m0O7
3832D7o5j0LQ7q8JK1K2n3K3L7n1rL8Ko7lQ3Kn6J00n0lJ1q3O8k6lM9o1nP5r7N9
3866bK2m3n8J49r1j6k0Q9p1L9j8L6Nqrr7O9jJ3j7K3L1nm1M4jm0J5j6M6j1m3N6
3899B9o6J7%J9l1M1l0K0K2mL1m9Pk8m2J08k2o1j6P2o1J0M2l7M1j8Q4p0M6r0K3
3930a3L7k4KN4n1k0Q%L8l6K6r6P0Qj4m6K2L3no6N8M1o3P6o1J5l0K4M3J0nj4j6
3963EK8n5J6J7mk%N1j1k5J1n1L6lm8M7l0M7m2n3N3L1n9N1m0J8rL4kj5lL3j3m5
3997c2O2o0Rm7P3J3m5K7j0L6k4pl9N4K7n7K1k3O2q5J9KN2m8j0L3j4l9M9j3j1K6
$$ y = [-23, -2, 22, 1, -3, -36, -26, -25, 39, -20, 23, -23, 23, -35, -29, -41, -3, -25, -1, 14, 23, -54, -34, -18, 51, 5, -24, -67, -27, 18, 52, -38, -30, -39, 20, 36, 14, -9, -21, 12, -15, 20, 18, 7, 32, 3, -49, 17, -16, 9, -32, 27, -9, -26, -12, -16, -5, 12, -32, -18, -31, -18, 20, -20, 47, -18, -28, -25, 62, -26, -25, -4, 18, -35, -12, 25, -26, -35, 3, 5, -62, -65, 18, 20, -36, 64, 14, 11, 22, -61, 7, -19, -22, 27, -34, -39, 36, -61, -2, 20, -23, -81, 68, -23, -39, -59, 30, -41, -2, -20, 16, 21, 13, 4, -93, -24, -25, -12, -29, -6, 25, 20, -21, 23, 22, -18, -3, -19, 27, 16, -27, 29, -37, -20, -20, -1, -32, 9, -21, -1, 21, 17, 48, -1, 6, -22, -64, 44, 22, -39, -55, 17, -44, -34, 8, -29, 12, -6, 78, 8, 54, -36, -13, 24, 0, 2, 56, 5, -15, -7, -7, 31, -5, 21, -75, -5, 3, -11, -57, -35, -2, -7, -73, -15, 26, -37, 39, -22, -7, -37, -13, 30, 40, 35, 21, 5, 33, -22, -6, 11, 7, 5, 5, 56, 45, 20, 31, -20, 16, 13, -35, 12, -18, 29, -13, -66, -13, 18, -41, 10, -30, -12, -21, 13, 11, -4, -7, 26, 13, -32, 30, -30, -21, -68, 5, 18, -27, 0, -10, 26, 2, -5, -44, 10, 37, -20, 1, -22, 40, -45, -26, -24, 28, -20, -30, 3, -11, -50, -1, -14, -25, 1]
4029Aj2l3Q5k3j8rm8K8N5Lkj8l4K3kLpJL7O6r7l1MK3K7K4l1jknPN6p6J6J2l6L6
4066B2l6kK1l4L7j1l9J5K5J6l4ok0k1K7OO3qPm9K6l2J08m8J0m5N4k4m3N2k0k6
4098iM0l4J7qm6N4j2l0l9L6P1L4j14N1m8kL9J4qj4l1J12j03K6Mk5J9LO7p2l5O2
4130A9n8O1K5n1L1N1o7J2Nm5N9k7llmJ0k9l0J7P2n6L0J4n5oj6L4L4l2K7o0K7j9
4163c3L4k9K6N7m4k6M7n4L9n0qM5k9M2m9N6m8Q5o8K4M3Rm4KK1l2M2o1M2l0k4O0
4195D5Jl3mn0L3k2M7q1J06j42J15oRj9nk4J5M5o1j8N8K6m5M6m6L6j7K4J7l8pL5
4227D0m3L5k0%Rk2nn2M7k2K6P0q3L4J7l8J5J1j6m8J13o8m0N2Ql5k7M5K2j2kj7
4259fmjL7l8lN8o8QLM5n8K6k4j8L9lJ3j2K0l0qk2M8JJ8J5m6j6P3k6o6K9k6J5P2
$$ y = [1, -11, -44, 41, 18, 0, -9, -57, -29, 26, 29, 27, 9, -25, -2, -4, -1, -8, -7, 30, 96, -1, -32, -28, -5, 22, 46, 15, 14, 12, 7, 14, 70, -6, 10, 22, -14, 22, -14, -16, 5, -29, 8, -3, -42, -27, -2, 14, -20, -26, -46, -67, -40, -34, 29, 21, 28, -21, 5, -27, 81, 33, 43, -2, 52, 28, -15, 37, 17, -9, 31, -3, 14, 6, -40, 14, 2, -28, -67, -31, 40, 74, -40, 11, -37, -39, 0, 14, 6, -8, -39, 73, -30, -4, 0, -25, -6, -3, 64, -8, -43, 19, -39, 22, 47, -4, 27, 78, 11, 23, 28, -17, 42, 15, 12, 9, 5, 15, -14, -44, -27, 45, -11, 19, 33, -22, -28, -44, -10, 24, -8, 19, -41, -14, -33, 1, -28, -2, 55, 11, -15, 32, -22, 17, -33, -41, 4, -25, 17, -32, 24, -24, 61, -7, 17, 60, 69, 25, 27, 48, 16, 58, -3, 39, 9, -15, 45, 46, 13, 9, -41, -8, -30, 17, -64, 42, -100, 15, 9, 18, -1, -6, -30, -15, 30, -31, -49, 9, 35, -10, 36, -10, 26, 9, 33, 50, 12, 5, 40, -3, 32, 12, 12, 21, -1, -6, -58, -11, -33, -7, 63, -20, 14, 31, -7, 8, 19, 3, -45, 68, 0, -40, 12, 20, -15, -42, 3, 25, 13, 11, -6, -10, -11, 26, -12, -15, 43, -25, -17, -14, 31, -27, -1, -25, -43, -4, -7, 6, -6, 14, -16, -24, -46, 2, 3, 21, 36, -10, -26, 47, 21, -45, -16, -42, -27, 45]
4294D5o1J2%k3L9m3M4J5K7n1L2m6L1j1J9j5RK8j41J12n9K1LRMm7N6j3j5Jj4J0
4326b2N4l6j0mJ8J2N8p5j0M3Knl6j9M8N0o6K3m1K4p1P5k1M1J0m4j6N9m9J8j0O9
4358F9m4J4m2j8m2J01n3M1j2k2qk2J8L0L3k0m1RM7j4l1j8RK3kL3rrj4M4o7ON1
4391D0k6j2lJ0k8K9Qn5J4Ok9l2J11l8J9q3K0P8n7J7K3l2rJ3j1K0kK9k4K2l1L3
4423B0j4k6KjM1k8j6Q0p7j9J5L0j5L6Rm7R4o4mp9K8L2Oj8K4oj5L9q8J00l7K5J7
4456D4j0r1J48j18Qnk6N2n4L8lM1m0K7J2l0L5L3m9l8L3%k4N1K5p2j2L8j4L4o2
4487b9o0J56q1M4j2m7M6Jm6m9R6mJ8l1K6p5L6Kl7M2K0m4J1N4Rn8JM3j3QRk7OP
4521B2j6k4K7ljNK2k9nk5L2ll2K8j4K2o2J38j05l6M5K2J1k4K7n3P2k5o5M1j5M4
$$ y = [45, -16, -4, -4, -27, 12, -31, 13, 28, 55, 4, 36, -10, 21, 10, 29, 14, 23, 51, -90, 22, -37, -16, -13, -4, 0, -47, 9, -4, -19, -18, -32, -22, 32, -4, -14, -18, 0, 12, 70, -5, -15, 28, 30, 25, -11, -30, 18, 68, 2, 25, -16, 8, -63, 12, -9, 32, 42, -2, -18, 41, -8, 10, 0, 69, 25, 39, -3, -21, -63, 38, -15, 26, 14, -8, -16, -38, -20, 10, 43, 23, -18, -9, 38, 24, -7, -25, -16, 7, 5, 38, 29, 20, 6, 50, -17, -11, 40, 14, 2, -1, 9, -19, 10, 18, -37, -23, -17, -46, -78, 33, -5, 14, -69, -49, 29, -28, -11, 12, -20, -29, -16, -27, -7, -9, 20, -4, 18, -13, 20, 6, -20, -18, -19, 22, -6, -22, 58, -19, -38, -23, 7, -8, 28, 37, -10, 84, 20, 16, -63, -35, -3, 3, -15, 9, 3, -12, 27, -61, 39, 2, 27, 44, 34, -57, 91, -27, -19, -24, -50, 2, -52, -14, -17, 24, -16, 11, 23, -7, 28, 61, 12, -26, 7, 7, -17, 34, 59, -13, -25, 13, -1, 33, -29, -89, 67, -14, 30, 18, -29, 17, 18, -28, -77, 19, 15, 33, 2, 28, -47, -11, -9, -46, -4, 16, -28, -17, 37, 46, -12, -11, 32, 19, 27, 36, 9, 15, 22, 6, -18, 9, 6, 5, 10, 32, 3, -2, -27, 5, 2, -30, -2, -16, 6, -56, 82, -23, -59, -14, 8, 19, -5, 22, -31, 41, 16, -49, -8, -23, 21]
4553B1l4O5m9K0l6k4K3K0K3J7Kpn0KN7o3MN5p9LL1J6K2q0L8Jo7Q2j4j0k2J4L0
4586A1M3j9j0j08R2L0m7M4Nk5L7j8m2L3l6L3k3M4p0K6k9PK9l2onL2l7L4K2J6k0
4618A1l5J1J2PRn2rN2k0J5j7J2p4J38Lo8pK8K1j10L8L7RJ0K3%Ql2L9m3mj6L0r7
4652g1J05k1J5l0m9J03n9M6o7J7j0qL3Qml7K9ooPoN0K0J1p0j6N2n7M8J1q0N4J
4685A3k0%K7kL8n7rK6j1K9k4J2k8k4l0K8M0NOJq6J09p4M8j6nm6K0K5L4J7m6Km
4719bK5j4L5j8l6RM6nl6M9n0LOK8q1O3L5q4O5n6K9jO8j19N1k2j8N7k4ml8L4J0
4752Ek9k6M9L6o8L3L5p0K9L9m4%k9jM3j1kM6Mk3Op2K7j3K1k3K4JMm9N3L1l3o9
4786g6K0P3l6pL5m9P0mk9N5r9O9k6J0n8P8j2m6J1J4M1j5J8j6k4l7L5l5J1L4J9
$$ y = [21, -13, 52, 3, 23, -13, -37, -14, 6, 29, 46, 48, 41, -9, -7, 50, -13, -9, 46, -33, -30, 1, 17, 39, -41, -3, -2, -69, 13, -1, -11, -33, -19, 11, 54, 35, 25, -83, 9, 39, -8, 36, 41, 16, 53, 35, -7, 26, -10, 23, 0, 44, -26, 0, -29, -22, 7, -25, -31, -36, -4, -41, -7, 15, 31, 11, -24, -13, -1, 6, 15, -37, -46, 6, -14, 1, -16, -4, -78, 60, 63, -5, -12, 16, 37, -73, -35, 2, 11, 21, 44, 44, 52, 20, 59, 16, 12, -4, 26, -71, 34, 13, 28, -2, -51, 52, -7, 39, -28, -11, -21, -29, 4, 12, 8, -29, 0, -6, -12, -5, -11, 39, 59, 70, 0, -16, 36, -21, 27, 38, -42, 12, 13, -7, -7, 20, 18, 56, -1, -10, 16, 5, 34, 10, 22, -6, -30, -60, -32, 8, 13, 19, 20, -66, 43, -31, 17, 1, -4, -50, -30, -5, 29, 46, 0, 2, -2, 23, 9, 44, 26, -10, -1, 45, 40, 4, 53, 3, 6, 12, 40, -41, 22, 57, -27, 38, -18, 11, 10, 78, -41, 10, -12, -30, 27, 3, -1, -39, -5, 5, -24, -50, -1, 35, -33, 0, 35, -35, -6, 33, -11, -11, -40, -41, 2, -9, -11, 35, 39, 16, 22, -50, -23, -36, -15, -38, -14, -13, -9, -58, -5, 26, -7, -76, -56, 17, -19, -26, 9, -40, 30, 26, -3, 52, -47, 22, -4, 6, -52, 26, 14, -32, -21, -7, 34, 19, 37, 21, -3, -40, -5, -40, -29, 5, 24]
4817B4p7J08j9k2j1m0K7j8%O7p8P4m9P4p0J0%K8l4L5n6J6k5L7okj2jN0l9K9J2
4849C2N7n3j4jJ3J7o3K5l1P2r0m1N7jM7l6J4j8L5lRk0l1M4l7ll0P6n3MJ5J0O9
4882G1o2k3l0KM8l8M0l1K5J4K4m2j6L7k4%J0J7j8j3l3L2J2K6n2j6L7jj7l1O4q
4914Dj5N0r2N1m2Q6l3Mk4L3l8K4l0O2Nk8mn5J02l5n8M6j8n3M7K2Nk0L3kj0m5M5
4947A7Jl3l1N7k4P0j2k7p1K4L0l4J3l5P5m0l8M8J9p%k6K6j7QL9rk1l4L7l5J2P
4980a1J9k3L9Lk9J5pj3L8n0n1M5Mj9Q4p0J9nKl0J8KL4kl9Jk0M0M2k1k0k0M9k1
5014CkJ2M4o6L1m8K1n3K3Q2k6j4j1KQO8l7j4j1%k5j3L5o5K7Lj7j1N7kK7l0LJ0
5048A1k1l5J4l4qQ0J9n7N3k9K9k8l0jK2K6k4LJll5L9K7j5J2Pp1P6n4oLl0R5o7
$$ y = [24, -53, 55, 36, 14, 3, -37, -10, -28, -28, 39, -39, 35, -14, 60, -10, 0, 0, 28, -6, 29, -27, -11, -36, 1, -5, -7, -19, -20, 30, -9, 20, 32, 89, 36, 22, 21, 34, 51, -12, 13, -18, 54, -36, -77, -20, -21, 26, -10, 4, -14, 21, 18, 27, 7, -24, 20, -17, -20, -50, 26, -27, -23, -8, 2, 71, 9, -14, -44, -42, 6, -32, 8, -23, 2, 16, 40, -2, -18, 19, -5, -5, 5, 22, 4, -9, -42, -10, 2, 28, -24, -40, -3, -4, -21, -52, 12, 4, -11, 39, -53, -2, -44, 42, 9, 13, -11, 22, -16, 8, -22, 40, 45, 17, 13, -42, 60, 25, -33, 13, -5, -58, -11, 11, 16, -4, 29, 27, 17, -28, 17, 18, -15, -46, 11, -13, 57, 45, 18, -53, -29, 1, -33, -20, -55, 20, -20, -58, -10, 9, 2, 2, -24, 2, -15, -7, 32, 23, 2, -32, 5, -30, -18, -11, 8, -15, 24, 27, -2, 13, 6, -7, 31, -19, -70, -25, -21, -40, 44, -26, -7, -12, -10, -40, -22, -20, 14, 12, -27, -26, -46, -6, 36, 15, -5, -25, 24, 3, 1, 13, 57, -9, 22, -26, -5, -58, -35, 47, 21, 7, -4, -2, 6, 74, 37, 23, 12, 12, -13, -26, 9, -56, -29, -26, -43, -54, 3, 1, 28, -2, 1, 11, -10, -45, -31, -65, -73, 7, 26, -31, 22, -7, 22, -6, -36, -37, -15, 11, -13, -10, -9, -12, -47, -8, 19, 4, 16, 23, -48, 28, -26, -32, -29, -59, 36, -31]
5082c1Q7j11R2m4l7K1M4nl1J3M1n3J5J8K3l1J8m0J3Nj1M9q8O2j7k2L8k7J5J3n2
5113c3L3Lk5K3J1k7M3j7l5J5n2K6K1jl3L5k5MK0J18p6m0L4l1L7m0%N3j7p1O3n0
5145c4R4r7Q5n3J3J6om4K0P4j13Q4o9K6p4Q2p4O1K1l3J5JJ7J7k8O5k4rq0P2r2
5176f7L7J1M2m7J1Qk5Q0n9%M4n7K1L0k5Nn5K5j3K8N3m5k9nJ1J0M3j9Om2j7NK9
5209fRk2MJ8j9N3Mo0P7r7N5o2K0K2QJ5q1J01j9k1j2k0RM7k4j8K7j2l6Q3j2Mp6
5242d1K8lL4Jj9k1j6L9lNp3J34o3J2j9n6Q6Nm2K2j2KO2m3j3j0k0Q4o5L9k6L8j9
5275B7l5l6N2j4oK0p1LM6O0o2k2j1J28p7k4LL7m0k0j7j1L9oO4m4k2L1N1q3R7q0
5307b3j5M7OK3j7k7j4M9j2J5L2o6L0m0N6k9l2Rk1L9qk6pM4p0M2RJ5j0Qm5J1K2
$$ y = [-31, 56, -55, 37, -7, -44, -23, 21, 16, -15, -2, 39, -14, 1, 19, 42, 11, 29, -11, 2, 7, -4, 45, -43, 19, 2, -20, 18, -9, 6, 19, -33, 0, 3, -22, 1, 12, -15, 28, 11, -24, -9, -61, -35, -14, -15, -48, -13, -38, -34, -14, 104, 28, -12, 22, -9, 28, -12, -12, 41, 24, -47, 16, -34, 60, -37, 48, -5, 8, 24, 18, -26, -6, 68, -45, 39, -30, -4, -78, 4, -70, -9, 12, -21, -6, -5, 12, 29, 1, 66, 42, 33, -47, 25, -67, -30, -19, 23, -24, -13, -5, -30, 50, -9, -9, 35, -22, -1, 29, 4, 9, -46, -21, -34, -6, 47, 2, -27, -32, -21, -11, 32, 13, 19, -23, -40, -35, -6, 3, -19, -15, 3, -16, 37, 41, -19, 58, -39, 16, -46, -26, -4, 4, 19, -62, 39, 20, -1, -13, -33, -24, 23, -1, -19, 8, -4, -40, 43, 31, 35, -41, -13, -16, 18, 19, 0, -21, -37, 2, -1, 4, -69, 65, 2, 14, -5, -61, 25, 30, -12, 10, -2, 0, 62, 19, 6, -4, -24, 60, -5, 34, 8, 46, 27, -8, -44, 8, -6, -12, 8, -63, -60, -14, 46, -16, -38, -49, 79, 2, -22, -19, 18, -22, -42, -59, -70, -31, -37, 27, -17, -39, -8, 43, -40, 57, -23, -38, 9, 15, 38, 21, -6, -20, 29, 17, 32, 64, -2, 28, -12, 44, 15, -17, -8, -29, 10, 2, -24, -31, 13, -57, -15, -6, 9, -1, 7, -38, -27, -5]
5340eK0o1J6P1k5L2p9R5q3K5k5L0OQ4o8j%lk1K4j5n5P7n9N0j3NjJ5m0l3k0R2o7
5374c2L0j9L9j1m6M9k4J9J0l1Rl1N4nl9M3J9pk5J5O5l5j7l1jJ2prN4o9M4j4Pp
5408IL2jm9K4n2P7q3L7L3j1o7N1kJ4Rl2Pj7M1l4k2K9K2l0RJ2k7K1pO0o9qL8p4
5442f0R1k0PM3p3Nj1O6m9j5K7J9o4L5k5P0q5J8K9lo5L4J4Pk6N0n4j8P1Mm5Oj0
5475b7J08p1lokj3LM6l1K1oj2J2rk6L4ml0K8j4j9K6l9oO0n6L6J6k2j0Ln0N8L5
5509C0k4Jk6kL2M2m5j4O5n1kKJ4p4N1L8j6m6L5J8J2n6RJn7RN1lj2OL4oj2kL8k1
5545A9k0J3J2l2k1l0O0M4n8Mn0N6N0p3O4m0qJ6l1N3m2k3L0MQL1Jj4JL5j7o3M2
5578B1L2l3m7KMO2l1k9K8Mj7j9Nl1L0Q0j04L6JL9m3Mj4J4RK2NMo1%N1k1l2N4n4
$$ y = [-5, 15, -46, -30, 41, 16, 48, -31, 64, -19, 6, -19, 11, 17, 101, 33, 32, 32, 29, 8, 32, 17, -38, 39, -20, 30, 17, 22, 21, 36, -4, -37, -57, 35, -32, -2, -21, 18, 7, -39, 10, -14, 5, 15, -16, -7, -38, 16, 11, -28, 15, 34, 27, 2, 17, 82, 47, 30, -1, -2, 10, 3, -6, 48, -21, 23, 9, 16, 9, 41, 40, -9, 15, -37, 40, -43, -6, 27, 16, -51, 0, -2, 12, 21, -11, -4, -21, 20, -14, -36, -7, 15, -15, -6, 6, -21, 0, -7, 53, -16, -24, 14, -60, 31, 11, 18, 61, -12, -7, -18, 48, -1, -16, 11, 30, -34, 1, -24, 46, -39, -21, 8, 5, -60, -26, -12, -5, -31, 19, -35, -53, 18, 22, -23, -17, -27, 81, 10, 7, 1, -1, -14, -11, 35, 4, 25, 19, 7, 19, 10, -16, 18, 14, -16, 12, -2, -21, 5, -34, -40, 20, -36, 0, 16, -6, -16, -13, -63, -5, 30, 6, 7, -19, -21, 11, 53, 8, -6, 59, 8, 6, 8, 22, -52, -1, 37, 21, -25, 10, 28, 40, -16, -7, -6, -63, -54, -3, -6, -18, -12, 22, 16, 4, 2, 40, 19, -1, 12, 24, -8, -29, -59, 1, 45, -13, -9, -59, -3, 47, -26, 38, -2, -10, 6, -25, 28, -14, -37, -7, -3, 5, 36, 37, 23, 24, 59, 42, -21, 21, 53, 20, -27, -25, -21, 41, 10, -19, 9, 13, -4, -23, -18, -49, -19, 61, -43, -7, -6, 33, -10, -6, -20, -6, 3, 25, 30, 34, -27, -27, 24, 3, -29, 25, -29]
5613b9K3N0m0L5n6k3M0qJ4j1PJ0l3K7q6R4l5O7j00N4k2K0k7P5k9n4K6M7Kk6k2
5644a0J3rJ2JL2p9N9K0J2p3N8m2j7PL8K1p6O2n9KO2No1K1N0m1m5O4j30J31m2R
5676el1L2p0P6k4N6rp2P7k2k4k3O3j8k9K8K6oNK0pol9K0k1m0P6l0j8K6m2M8n3
5709c6K8j2m5J15l9J5l2M6k8jK5o6J0M8j2m7P4j5nL7o8K9j4K3l6K2k5JLn4PQ0
5741B8J2k0o0Q9r2N8K9m6J7oLl3j8l6M4M2k2J2mRK4J6o2k3O9k9rjj1oj5M6k4K7
5775HJ0M7o5OL5n1L1Mn7J9N6n1J4p6J1O0jPl5K1QL3k8l6OK6J5K3o7L7k8m3R8p4
5809c7M4j6J9NNk9j0JL9qn5L7L5j6Jj9m8M8j1QO7n9j5M4m8L9m9K3J2LMjm2K4m4
5844d9JN5k5K3J3K0n2K6n3O5l1J0k1M5j2j7J3j9j3J8j5M5m0oN7m5O1j02O8j3m9
$$ y = [-29, -6, 44, 4, 39, -17, -40, 0, -8, 6, -5, 2, 12, -21, 6, -80, 14, -21, 46, -54, 0, -22, -2, -29, 46, 17, -37, -11, 36, 38, 12, -10, 3, -6, 6, 7, 39, -40, 19, 39, 51, -22, 36, -6, -23, -16, 22, 43, -33, 29, -30, -28, 34, 39, -22, -1, 49, 8, -37, 27, -103, 28, -14, -5, -36, -4, -74, 2, -22, 34, 25, -47, 30, 8, -16, -39, 24, 6, -23, 5, 31, 25, 30, 50, 43, 37, -2, 18, -3, -43, 33, 3, -15, 11, -31, 17, -36, -8, -20, -65, 50, 11, 26, -6, 40, 12, 11, 36, -30, -20, 28, 16, -31, 43, 28, 23, 60, -8, 21, 7, 30, -6, 16, -9, -8, -5, -59, -52, 28, 40, 20, -40, 49, -43, 15, 44, -2, 15, 9, 12, -21, -39, -75, -31, 11, -11, 1, -3, 6, 30, 46, -16, -39, 30, 1, -8, -9, -20, -26, -41, 5, -19, 8, 18, 65, 0, 6, 41, -10, 21, 25, -32, -13, 43, -8, 6, -70, -59, 1, 0, 7, -28, -7, 1, 34, 6, -30, -24, 2, 17, 40, -27, 10, -18, -61, 37, -37, 7, -9, 10, 15, 20, -9, -19, -18, 21, 13, -42, -5, 30, 14, 15, -4, -52, -4, -15, -7, 60, 1, -14, 30, -18, 21, -28, -5, 7, 10, 14, 13, -29, -5, -49, -48, 7, -18, 5, 18, 38, -14, 12, -41, 24, -7, 3, -18, 27, 15, -2, 11, -8, -21, -3, -18, 27, -13, -19, 38, -7, 54, -48, 20, 7, -42]
5875d2K1J8k0LlJ9k9P7l8j9k1L0oKK6q9Q5M5j02N3K7j3k4K5n5K3Q2k8l8lK3o5
5907c6M2L0o7k1M6l5L5l2QL8J3k3J6J3n8n2P4Lk3J4J8rj5J3J5J7k6m6M2oK1j5
5939fJ6OJ0p1M2k6J9m4N9k1K9K0m6m4N3m9J9N7k4J9Ln4J1L1j4l2K5Nok4LN8n4
5972c0L1%m8M1N0K9q4K4k2j0J8m2J18m6k5J2Jpl0O2o8M6m3K1P9j01OM5mr4L5L0
6004fqK0L1j4l2n0P4m0%L3K3j0M2j14J09p1K4k9N2o8M9L1k2k9j2K7K7j1k3J3N
6035B1M2p7L7l6Om4L3l5N0KOm4N2k0o3P7m5M7j6pO4o7M9n3M0j5J0J1nk1J0J0M0
6068E9j0j4m0j9K9j2Nj9N3K7m6n4R0m4ok9j0K6JK0OK3j01R0k5J7j6L3m7Km0L6
6100a5J1%Mj9OM3l1l1K4JO2n5PjK2n5L5L0q2K9N0l5K8J8o0J3k6J9j4K0qj7LJ0
$$ y = [-42, -21, -3, -23, -20, -23, -4, -33, 44, 6, -13, -34, -4, -10, -8, 18, -71, 14, 59, -43, 10, 37, 24, 0, 25, -30, -7, 75, 47, 9, 6, 29, -36, 6, 36, -31, -52, -6, -41, -6, -38, -30, 8, 21, -2, 14, 27, -31, -83, -9, -6, -29, -15, 3, -6, -21, -8, 7, 24, -2, -48, -6, -12, 9, -6, 10, 16, 26, -45, -3, -29, -10, -54, 5, -16, 13, 33, -13, -57, -4, -53, -34, 23, -1, 18, 21, -33, -22, 9, -5, -37, -12, -7, -13, -37, -34, 24, -30, 1, 1, -47, -6, 44, 73, -11, 13, -9, -19, -1, -43, 75, 29, 4, 16, 17, 10, -20, 42, -26, 20, -23, -2, 77, -24, -18, 27, 23, -71, -36, -6, -14, 6, 37, 23, -9, -59, 15, -25, -25, 8, 31, 21, 63, -51, 58, -13, 11, -18, 34, -34, 15, 46, 24, -5, -17, 10, 37, 26, 3, 16, 21, 63, -14, 23, -13, -7, -51, -18, -53, -3, -1, 5, -39, 13, -7, -70, 7, -38, 9, -7, -14, 50, -17, 32, -21, 19, 4, 14, 25, 20, -1, 9, 19, 59, 49, 35, -5, -24, 5, -7, -2, -21, 32, 59, 13, -41, 49, 5, -1, -30, -40, -14, -13, 7, 13, 36, -65, 25, 0, 17, 1, 34, -13, -11, -51, -15, -4, -4, 0, -19, -13, 30, -1, -32, -8, -7, 55, 0, 7, 6, 28, -27, 8, 38, -44, -15, 35, 0, 28, 46, -14, -1, -27, -8, -22, -2, -10, -27, -24, -14]
6134a4J8o8Q7L5k4m6j1N1k5rL5l3N0j05M3L6j8j3qj4M2J5Nl7n5O4L1kq9O1oj9
6166b3N4n1J9l0LM9k3NLm5L3J9l2J4J0m3J8L4l0O3r2R9o0J1KL6j6m6J5Qok6N5
6199B7K0j0mm4Nk5QN1l1j1K7l6LqM1Nl7K3nk1LJL4k3J8m0L4J8K9n1o4O0K5n2N3
6234B3j6rK7k2M3p5N1Ll8L7K3k4k9J2mJ3K8j6o9O9m6M9j6m2N4p3K5Lol9R6m0L9
6267C1k3M8l6N7o4m6K6K8j6K8Pm9%O7m0n2K2K9J4qk4L5n8J6J7K3Pp5%L4L3m3m
6300a6K9Jl1oK5L7m4ON8n7K9p1J3R2o6J9l2k6P8l9M8p2m3P9Nqlk1N5q2L8k0Nr
6334b9KO5p7K9MLjk0nj5J7J4j1N0k2K4q2O6K2n8L6J3l5L8j2l1l2N8KJrk3M8k0
6368A0o0O8jjk5rN6n7K2m7N8n6N0rK6r7J22q5L7l3J7K1m6NN5p1Q9k7k8M1n8P2
$$ y = [-14, 4, -64, 23, 58, 34, -12, -23, 28, 3, -6, 29, -4, 46, -59, -16, 20, 2, -11, -19, -33, 9, 24, 29, -8, -63, 1, 32, 30, -59, 2, -4, -23, 31, -20, -1, -31, -28, 21, -2, 3, 6, -39, -6, 13, -19, -5, 5, -38, -20, 14, -16, 47, -45, 54, -6, 5, 7, 43, 27, -19, -4, 4, -2, -28, 27, 47, 37, 33, -11, -6, -31, -23, 28, -3, -14, 13, -23, -20, -28, 13, 18, -19, 4, -1, -22, -19, -18, 16, -7, 11, -29, 5, 23, 52, 1, -63, -3, 22, -30, 23, 7, -2, 25, 3, 46, -29, 22, 25, -13, 24, 47, 23, -6, 6, 2, 15, 43, 27, -42, 27, -19, 30, 14, -28, 26, -47, -22, -19, -25, -64, 32, -8, 31, 8, 56, 20, 77, 13, -33, -7, 21, 5, 33, 40, -9, -9, 58, 18, -34, -12, 17, 31, 23, -1, 34, -24, -8, 9, 32, 39, -36, -36, -2, 31, -12, -16, 13, 14, -17, -23, 2, 39, -5, 1, 59, 2, 31, -40, -27, 65, -1, 18, -14, -40, 38, -1, 47, -25, -68, 11, 16, 8, 5, -16, 39, -43, -5, -25, -20, -29, -27, 38, -39, -10, -6, -3, -4, -24, -29, -44, -27, -13, -24, 26, 4, 28, -54, 12, 34, -24, 12, 25, -10, 28, 16, -15, -47, 11, 13, 14, 5, -18, 30, 10, -50, 18, 17, 16, -9, -18, 38, -19, 3, -44, 14, -42, 8, -1, 25, -72, 50, -35, 2, -31, -14, 7, -39, -34, 21, -50, 39, 12, -16, 25, -33, 39]
6400C9n1jM0m3O2m6kj9K6M8o8P9l6j8m0L6L8m3Rl5P2k2k4L5m0rpM2J1%m1K9l8
6433a7J5k2L0k%jMLj7K1J5k5N7%m0j1L2j0L4k5m6L6j3l4J5k2k1J0j0M7K7n0k6
6466d6K2N0l9k1o7R2jJ5k2O4p1k4P6l3N7n4K0QK2n5L8K8n6K3ln0O3l5j6K4%K6
6498C5M5q8N2l6K4j9qj3k3NOL8lk0J0qj7KN1k1o2K5M4J5o8O9jj4l1KJ9l1OK2m
6533COK1p5J2M3j5ML7l9M5l0ko0R0m1kK1J5m7J0lk1M5l1O0o0l9L5Rj3L2j4N0J4
6567F0l4pj4k6Q2m4M6m1j5k9J7l7L9J3rrPK0lmk6L8n0%L6k6j2K9m4lO1K4k7Rn6
6602c5J9n2J04Rl3J6p8O6Om6N6j0L1n8JJ0l6R4p9j0K8L4om6L3l2o6R0j6j7oL9
6634A0K1k1l0J8K9j2n2N7j0p2R9l0n7L3lL1mJ8m2k1M6j9LK4l5O2q0mM1J7J7j2
$$ y = [39, -12, -13, 27, -16, 46, 0, -2, -21, 5, 53, -15, 64, 28, 10, -30, 6, 44, 1, 10, -25, 47, 25, 1, 36, -4, -13, -20, 22, 33, 33, -8, 21, -17, -2, -24, 6, 4, 4, 3, 7, 10, -7, 14, 29, 4, 61, 61, 21, 10, 42, 32, 66, 41, -5, 31, 18, -16, -1, -23, -44, -34, -44, 3, 30, -20, -46, -24, 26, -13, -34, -101, -9, -10, 5, -17, 47, -24, -48, 28, -5, 52, -2, 18, 26, 48, -7, 31, 59, 3, 26, 23, -27, 36, 1, -15, 9, 9, 35, 80, -8, 44, 8, 32, 13, 5, -8, -31, -26, -20, 18, 15, -5, 5, -3, -20, -18, 33, 12, -50, -25, 19, 34, -34, 35, 34, 20, -11, -9, 10, -21, -15, 7, 3, 9, 30, -45, -33, 10, -5, -1, 36, -3, 42, 12, 10, -50, 40, -1, -3, 18, 33, -14, -4, -7, -28, 17, -14, 46, -14, -53, -18, -9, -22, 10, -4, 46, 60, 26, 19, 5, -21, 61, 17, 63, 22, 7, -22, -5, -42, -3, 10, 1, -8, -1, 19, 16, 12, -14, 24, -26, -26, 10, -16, -28, 1, -43, -46, 15, 39, 12, 21, -35, -16, -68, 36, 45, 12, 28, -50, 16, 22, -24, 32, 22, 53, -5, -4, 6, -30, 64, -15, -25, 3, 37, 31, -15, 18, -14, -80, 10, -6, -23, -29, 10, 31, 10, -20, -2, 27, 15, -37, 20, 10, -62, 37, 7, -50, -17, -20, 11, 7, 25, -17, -38, 8, -11, -8, 16, -19, 43, -37, -41, 0, 17, 34, 22]
6666B2Pm2mO1l1k9K6L2j3l5k4KkK3K2m9L2M0p2J5J1k1MpN7m1j2N7mJ6p6O3l2n
6700iJ%o1Q0Jk8m0L9M8o8mP8l7jL3l7m9K6J2j8JN1l0j4QJl1M7rJ3k1M1n6J6RR
6736A%rl0L1O1l7K3j4Ko6R4k2M3j11M4k2N1o8K7Jj3rO5n9KK4n8O1j1n2k8J02o8
6769d5K7QK4m3K6O0j00Q7r5M4J5n8P0Ll8P2on8nm7K3R1o4m8N5Pl1pM5m8RN1p2
6802d8O0p2L0J5J3m9Q5m1J0l2R4p8k8N9j8j1K7N0m8nomJ8m1k8N0j0PO7j07K0J2
6834iN1Ml8k3L1L1k9n8M7L1n7L1J0L1o0K0%j4L8n2K7J3l4K6L2q9J6N0j9J5jj1
6866A0K6k9l4NP1q4L2K7K5n3j7KM8l1J9l1M5q4N0k1J3rL0k6k3M3lrM2j5k4L5j3
6899A7j1J6l5L3l9J6L1M4n4l2J5l7N7j4J9j6J5m2lK8J9L1j01K9O3l5k5k6L8j5
$$ y = [22, 29, -13, -17, 44, 13, -16, 10, 42, 29, -6, -30, -28, -30, -7, 15, -34, -2, 38, -34, -19, -8, -29, -25, -32, 25, -16, -28, 29, 25, 41, -35, 28, -4, -9, -8, -8, -69, 11, 12, -16, -56, -17, 31, -37, -41, 37, 0, -1, 32, -5, -54, -28, -16, -34, -33, 18, -12, -26, -18, -17, -48, -1, -10, 3, -18, 23, -33, -17, -8, 1, 1, -8, -38, -7, 54, 17, 40, 26, 28, -38, 56, 34, 77, -34, 10, -12, 39, -29, -2, -1, -14, -23, 42, -17, -15, 9, -49, 12, 1, -51, -79, 23, -45, -18, -10, 14, -29, -3, 57, -43, 44, -51, -7, 8, -50, 20, 23, -15, 57, 51, -7, -12, -59, -36, 55, -9, -57, -2, 5, -26, -33, 12, -36, -27, 24, -48, 12, -60, -30, -15, -2, -51, 34, -7, 3, -29, 65, -13, -41, 18, 0, -11, 16, 66, 18, 13, 7, 3, 21, -20, -48, 2, -8, -1, 66, -41, -21, -9, 42, 46, 8, -15, 16, 47, 18, -40, 7, 38, -19, 12, 22, 53, -7, 13, 13, -1, 37, -15, 12, 25, -9, 17, 49, -40, -24, 26, 7, 22, 21, 10, 36, 7, -27, -22, 49, -35, -3, 24, 49, -4, -21, -19, 29, -2, 17, -14, 31, -53, -3, -24, -11, -20, 10, -16, -39, 4, 1, -8, 34, 19, -5, 30, 17, 6, 22, -13, 20, -19, -3, 28, 72, 18, -14, 1, -36, 21, 7, 26, 10, 25, -17, -20, 8, 27, 58, -43, -14, 49, 14, -11, -37, 1, -14]
6929a4L2J7l4j4m0O4j2n3O4%O8j22O4l1O1p0K1O3p3L2K7n4L1K4l1M1o2O8p8J4
6959Ck1L6K7n9JJ6j1RJ0Rl8MJ09j00j1m4N1j4P3Qq4M3k1l1k5N3M2j2qK0o5N7m3
6992a6K2J4l6L5l4N3Jn5N4m7K2J2l6M7p1K7K9o6RLRk7L7j3K8J9j5L0o7L3jj8p
7025b5K7qM8J6n0J6J7m5j1O1o4K6M0k7k1PRK9k9j4L8J7k3j4k4l0O1mm2K2m3PR8
7058F5o7L5r7R9k7KJ3l0qO5l2l1lK6Kn1M7K9n5KO2j1l1j4J2L6K4j9r8R0j3mLk7
7092fK1J3m2K8Mn2J8lJ4Nm2K9J7qj2J6rM6n4PL9mn3M9k5L0qK4l7oO3qp7qN4pn1
7129c5O2m5j6O9lo1PM1lJ4m1nJ7n4M6M0j31Q6NK5k7K1l2L2Ok8k2j2N2Nk7M5on2
7163b7N2j2k9j0L4jl6M1J6m9K8k0pJ5NJ3l0O2n1OK2l6J2%J0m5O3k5N4p3O1o1K5
$$ y = [-14, 18, 35, 1, -13, -53, 11, -1, -54, 10, 10, 78, -44, 20, -11, 50, -20, 1, 64, -9, 23, 50, -4, 27, 51, 20, 61, -1, 67, -11, 3, -18, 18, 45, -14, -13, 3, -8, 1, 11, 20, -18, -14, 95, -5, -16, -60, -9, -23, 50, 58, -26, 17, -4, -35, -60, -7, 35, 23, 15, 35, -30, 27, -16, 6, 20, -16, 19, -15, 38, 39, -16, 38, -9, 13, 25, -11, 36, -35, -8, 21, -45, -36, -33, -24, -51, -14, -27, 1, 20, 5, 35, -32, 1, 0, -18, -25, 2, -6, 42, 58, 8, 24, 41, -4, -15, 46, -18, 8, 48, 21, 0, 7, 16, 45, 16, 2, 40, 57, 34, 20, -4, -34, 27, 23, -19, 3, -40, -33, 65, -2, 33, -64, 35, 8, 10, 23, -7, -15, 50, 18, -13, -16, 10, 12, -39, 8, 37, -18, -16, 46, 35, 4, -10, 2, 38, 62, 43, -55, 35, 22, 18, 21, -6, 15, 28, -14, 14, 18, -34, -16, -19, -5, 0, -42, -13, 4, -4, -16, 0, -9, 37, -17, -10, 29, 25, -28, 21, -4, 26, 18, 42, 5, -1, 62, 54, -23, -31, 23, 16, -35, 27, -18, -34, 35, 32, -29, -22, 19, 16, 30, -11, -16, 1, -53, -7, 33, -98, -12, -7, 18, -9, 12, -20, 12, 18, -10, -32, -44, 8, 13, -14, 31, 25, -27, 25, 13, -16, -26, 8, 7, -29, 12, 28, -21, 7, -13, -20, -5, 0, 13, -17, 45, -6, 0, 22, -14, -2, -2, 8, -37, 26, 1, 55, -18, 43, -18, 7]
7196Gj4lL2k7M9L1q4J2j4O3m6oJ5l6M2lk6J1j5L4n5L7K6l1Pm8O9m9K0l0L4rk7
7229c4M8j5k7K8L5k9k5K1K0m6Ok8M8jJ1m8J5k7O9qm9O5l9RJ6m6k8P9m8j2P5l5
7261@Nj0M4q5J3K4Jl5P0j8K0pm6L9q9Q0j5k9M1M4m0K5Jo2O2k4rnM2l1KroJ2o1
7296e6J16n2mJ7Kp1N8kM1m8K6j0k1N9j16L1J0J3K0j4J0J5mj6o3J03n0J0L9Nl1
7327A7m6J2N0K7n9M2j0jmJ2q9L3j5RM1l2Qmj2Oqk3K5M9n9rk7QN9L4o2NN6o5M4
7362A2L8r5N4l0mpM8j0nM4k3k2k7O6k6MJ0m0M2k8O2q0N8n0m7J5K8K3l6K7J%k3
7395b1K3m2k3P3m2L0m9O4k0L1rk2k2Q3q5JJ50j29Q2m7j5m4J12o9LLJ2k7mL1m9
7426b1K5j5PMJ8k1J9k8LK7o1L1KN6o4K9pnj0M0Mk8l1M7Knp9J23m5k8R2q9N%PM
$$ y = [7, -7, -10, 22, -5, 44, 75, -9, 3, -11, 52, 6, 0, 15, -21, 21, 18, -8, 3, -12, 22, -33, 4, 30, -1, 6, -42, 27, -22, -2, -32, 2, -7, -34, 14, -1, -28, 0, 35, 6, -19, 2, 22, -24, -18, -46, 2, 1, 12, -36, -21, -48, 21, 13, -36, 29, -10, -1, 15, -31, -59, 20, -28, -40, 35, 0, 5, -5, 39, -46, -33, -9, -8, -43, 27, 9, 29, 22, -24, 15, -74, 6, -9, -38, 3, 47, 7, 32, 33, -29, 33, 9, 0, -5, 37, 6, 8, -1, -7, 5, -56, 60, 8, 4, 21, 23, -48, 10, 8, 49, 1, 27, 17, -4, 55, -61, -30, -20, -7, 13, -1, 9, 24, 20, 4, -59, 44, -6, 4, 43, 48, 17, -29, -17, 33, 60, 1, 43, 33, 32, 28, 40, -49, -16, -31, -22, 19, -13, -5, -9, -21, -15, -23, -46, -21, 28, -31, -40, -67, -59, 0, 34, -28, -23, 33, -32, 12, 50, -45, 9, -21, -25, -32, 16, 6, 1, 45, 22, 0, -27, 39, 13, 17, 27, -13, 29, 1, 63, -17, 41, -9, -56, -41, -13, 10, -26, 1, 2, 2, -21, 2, -40, -63, 10, -32, -2, -51, 13, -7, 24, 15, -7, -29, 54, -31, -30, 120, -9, 73, 26, 11, -33, 79, 10, 13, 16, 28, 1, -3, 28, -21, 4, -11, -4, 0, 18, -3, 16, -12, -9, 18, -43, -12, -10, 46, -18, 11, 4, -1, -11, 29, 33, 5, -26, 21, 23, 18, -61, 62, 17, -11, 81, -8, -3, -3, 4, 8]
7462Hk2MM3J2k4l1L4O8q5k8j1Qk4J6L3J1n7oK8N5n7OL5j1j9J3Om4K2N8l5k2L6
7495B0M2o5J8o3L6lK1K1qLrOk4RL1p1pM6m9L1L1k9J9k7J1K6Lk8K2k5j7J8J4k4
7529b1K9Rj0J2m3K5Nj7L6l5O7m8J6l5OL6n0O7r7P2q0O1L4K7n2Jj0K0k2j8K1ol7
7562c7M3nL2o1K3M8k6o2J7oN8pl2kKK2L3j6mk9%%j5K8KJ8j1j0M5j5L8o7k6O0p9
7597d1M6l4LL0o0N2pRN6l6K5q3j3N4qJ8m2J7j3L1K7n3N9J7k1Kn8J3L1jj4MM0k1
7631B9l0K4m3m4P4K7j4l1rj9O2O2p2J1j5Pn0O9j4nl2J1j1K5p3L2k3J4N5Jn1M6
7663A3M4m4o8P4nJ2k2n1LP0k5Ol1kK8PmNj8j5K9n9J9K1Lj5M5j2n0j6N9mj3m3K6
7698c3J8j7rJ3j1K4lM0n2L5n6O4oK3j2L6n4k9NN5K7k9j2j8J8k6k6K8l5N5k7rQ
$$ y = [8, -14, -10, 33, 45, 21, -10, 24, 92, 7, -21, -32, -24, -48, -32, 1, 12, -45, -51, -23, 32, -25, -19, 16, 5, -14, -1, 5, -39, -17, 41, 6, -16, 20, 62, -3, 15, -48, -12, -15, 6, 27, 19, 22, 13, 19, -5, 4, 35, -36, -43, 3, -46, -15, 16, -13, 6, -21, -10, 16, 19, -9, 13, -12, -29, -11, 3, -21, 8, 17, 7, 19, -24, 1, 6, -11, 25, -10, 57, 9, 25, -10, -4, 32, -18, 49, -48, 24, -56, 5, 39, 66, 14, 15, 5, 25, 3, -15, 6, 0, -37, 6, 1, 33, -28, -5, 43, 17, -45, -28, -34, 24, 17, -15, -17, -15, 7, 40, 24, 20, -9, -9, -9, -24, 4, 6, 24, 13, 3, 48, 33, 71, 4, -22, 38, -41, 5, -29, -26, 4, -56, -4, -11, -2, 54, 18, 43, -40, -53, 1, -7, 11, -31, -14, -27, 4, 31, -22, 37, 54, 33, 35, -23, -10, 21, 20, 6, 10, 50, 29, -1, 23, -20, -64, 10, 37, 23, -8, -17, -36, 26, 88, 16, 27, 12, 19, -31, 38, 24, 19, -13, -2, -13, 12, -61, -29, -52, -38, 17, 18, -33, 13, 57, 13, -55, 19, 14, 26, 4, -47, -44, 26, 1, 7, -24, -26, 2, 9, 5, 10, -8, -23, 6, -53, -34, -13, -10, -25, 20, 8, -42, -58, 1, -3, -16, -59, -33, -15, -32, -41, -28, -39, -15, -18, 22, -30, 5, -51, 13, 7, 30, 18, 54, 0, -29, -24, 31, 58, 29, 17, -1, 17, -9, -35, -7, -42, 13, -14, -23, -15]
7731a5lj0O7m6j1oRn2Q1k6%Jj8L7J6k2m8J8Q1k9J1n2K4oj3j5M2m2L5J1Lk5klk3
7766c1PJ5jN2l8k9k0n4J09l2m6K0Q8m6k9k8N0O2l0n5N8K3o3J3k8O1j1jpO3l8j2
7798B2k5K1j4L1j0Mrpm9oL1K5j7J3k3K2lo5P4k4KM1J6m2k9M8q8R7o0L1k6M6m8
7831b1K0l2J9M3k3L2o8QKK2L0l7M1n2j4N0m1M5K1j1n6J9nk5M9%o8J5K4lmlJ2j5
7865b6J8N6k6j6M7q4J1M9o5P1j5K0K2l0l5M3o9K3K0J0j4Rp4O0J2j3M1n7m5P4l8
7896b1O1k5l6kJ0k3J0M8n1N5nl3K1l5J27j15k8M2n5P2k0M0l3R7n3MNl4m3J04p4
7927A0Kk7m0Q6kn8j2M2K0j0qnJ7%J5n4L2J4l7OPN2n9J9pL3Oj4k6L1l0j7PL0rk
7963A2M9j30J11Pm4k7L1j4L0K3q3O4j5j4k4L8j1jk0j8j0J5L9o2K5j5M1M5l0n2
$$ y = [-15, -18, -28, 39, -7, -18, -24, -15, -67, 14, -12, -12, -11, -29, 8, 24, 2, -46, -28, 53, 24, 35, -17, 7, 1, -12, -27, 15, -27, 8, 19, 22, -3, -5, -8, -31, -24, -9, -10, 42, 4, -25, -45, -99, 10, -22, -68, -48, 40, -6, -35, -63, -13, 49, 19, -36, 22, 45, -18, -5, -33, 28, 17, 16, 9, 72, 34, 22, -3, 18, 4, 35, 25, 29, 20, 13, -36, -42, -11, 14, -3, 10, -13, 9, 6, -59, 15, -9, -7, 34, 50, 8, -21, 27, -61, 36, -24, 7, -19, 27, -21, -1, -33, -14, 29, 6, 38, -30, -22, -20, 2, 32, -5, 36, -16, -30, 20, -21, 24, 45, 34, -22, -3, -8, -33, 16, 16, -52, -37, -13, -16, -20, -23, -11, -26, -8, 48, 22, 6, 53, -31, -20, 29, -36, 35, 20, 40, 62, 32, -3, 40, -29, -6, 14, 24, 10, 19, -55, 5, 17, 4, 45, -12, -57, 17, -21, 40, 15, -21, -23, -13, -36, -26, 22, -29, 26, 21, -12, 9, -26, 101, -14, -42, 0, -55, 17, -3, 37, 4, 101, 48, 52, 57, 23, -20, 84, 10, 12, -15, -55, 31, 29, -29, -41, 1, 21, 11, 3, -2, 15, 15, 30, -24, 8, 22, -15, -9, -2, 50, -9, 10, 3, 36, 42, 28, 2, 33, 3, -14, -7, 23, 14, 12, 61, -69, 42, 49, 5, -22, 9, -5, 25, 48, -35, 29, 14, 0, -24, 14, 3, 2, -18, -36, -46, -31, 8, -54, -29, -44, -3, 42, 12, -40]
7993d0L6J1oo7O2%K2m2J8M9m7L8k0k8OJ8PK1j8l1%P8o6J5o5N7m8KJ3j6L5J3l8
8026c1JP8p7K0k5%K7P0p5n8Q9OK2m0p7J02l1M4m1L3k9L7l6n3L1j0J0N7j1k7j2
8057flON8m2k9j2K9j7J1pl0K8RKL7q6L1O2r3K5Q5k2j7l3j8K8P6p2j7K1Ko3L8M
8091a5J5m0L5m2N8k6k4J13p9j1K1Jlj5j8M3q0M6M0l4nN8jqJ0n7ON0k8k1J9j8k2
8124c2L5j4%O8j9k0j3K7j6J6k1J7n5jL2k6M3m9%PRmL2l5N8k7Lj7LK2n0j0P2rl8
8159a2j6N7l5l8K0R0r4M0j0J04j37N5qk5Q0p4k2L2j8RL3o4J0PL3k8J8k2l0P4m5
8190a6m3
$$ y = [-40, -4, 7, 1, -66, -4, -4, 18, -24, -6, 43, -4, 34, 14, -14, -8, 10, 17, 38, 20, -11, -11, 67, 1, 16, -49, 8, -40, -38, -25, -41, -6, 7, -31, -30, 48, -29, -9, -34, -34, -7, 63, -12, -70, 19, 25, 47, 7, -70, 32, 1, 45, 4, 37, 8, 45, 9, -44, -13, -23, -13, 44, 33, 6, -6, -9, -3, 55, 13, -16, -28, 1, -16, -5, -12, -42, -14, -5, -3, 34, -52, -21, 41, -52, -27, 58, 36, 19, -14, -32, -4, 72, 0, -17, 4, 6, -57, -19, -15, 0, -40, -5, -47, 11, -15, -39, 74, -5, -16, 5, 6, 3, -12, -30, 13, -67, -21, 19, -15, -20, 38, 37, 29, 39, -18, -12, 38, 10, -11, 8, -10, -32, 3, -11, -11, 57, 38, 18, 5, 32, 16, 32, 11, 28, -27, -28, 4, -22, 21, -28, -28, -21, -12, -16, 16, -19, 39, 12, 15, -2, 1, 23, -27, -37, 35, 26, -12, -28, 29, -6, -44, -24, 66, -28, 12, 2, 106, -31, 24, 16, -9, 71, -3, -25, 7, -11, -2, 31, -33, -23, -16, 17, -11, 7, -15, -45, 29, -16, -59]
8191e9
##END NTUPLES=NMR FID
##END=
