##TITLE=1H_DE-78H4_23
 200.13MHz, D2O,
 8 sc
 
 10.3.2025
##JCAMPDX= 6.0         $$ Bruker NMR JCAMP-DX V2.0
##DATA TYPE= NMR FID
##DATA CLASS= NTUPLES
##ORIGIN= UXNMR, Bruker Analytische Messtechnik GmbH
##OWNER= pz
$$ XWIN-NMR		Version 3.5
$$ Mon Mar 10 13:59:11 2025 Russian Standard Time (UT+4h)  she@DPX200
##.OBSERVE FREQUENCY= 200.1313
##.OBSERVE NUCLEUS= ^1H
##.DELAY= (6, 6)
##.ACQUISITION MODE= SIMULTANEOUS
##.ACQUISITION SCHEME= undefined
##.AVERAGES= 8
##.DIGITISER RES= 18
##SPECTROMETER/DATA SYSTEM= spect
##.PULSE SEQUENCE= zg30
##.SOLVENT NAME= CDCl3
##.SHIFT REFERENCE= (INTERNAL, CDCl3, 0, 14.3821)
##AUDIT TRAIL= $$ (NUMBER, WHEN, WHO, WHERE, WHAT)
$$ ##TITLE= Audit trail, XWIN-NMR		Version 3.5
$$ ##JCAMPDX= 5.01
$$ ##ORIGIN= Bruker BioSpin GmbH
$$ ##OWNER= she
$$ F:/spectra/data/she/nmr/H-C/1/audita.txt
$$ ##AUDIT TRAIL=  $$ (NUMBER, WHEN, WHO, WHERE, WHAT)
(   1,<2025-03-10 13:58:08.95 +0400>,<she>,<DPX200>,
      <created by zg, POWCHK disabled, PULCHK disabled
       configuration hash MD5:
       00 E9 B6 7A A2 85 ED C7 34 08 36 98 17 FE 4E 26
       data hash MD5: 16K
       85 57 FA 72 4D 6B 22 0A 1D B2 C1 31 DB 98 A1 2E>)
$$ ##END=
$$ 
$$ hash MD5
$$ C5 EC A9 B7 31 06 A8 D3 AE AD 8F 8F 28 1E 94 08
##$RELAX= 
##$RELAX= 
##$RELAX= 
##$RELAX= 
##$RELAX= 
##$RELAX= 
$$ Bruker specific parameters
$$ --------------------------
##$DU= <F:/spectra>
##$EXPNO= 1
##$NAME= <H-C>
##$PROCNO= 1
##$TYPE= <nmr>
##$USER= <she>
##$AMP= (0..31)
100 100 100 100 100 100 100 100 100 100 100 100 100 100 100 100 100 100 
100 100 100 100 100 100 100 100 100 100 100 100 100 100 
##$AQSEQ= 0
##$AQ_mod= 1
##$AUNM= <au_zg>
##$AUTOPOS= <>
##$BF1= 200.13
##$BF2= 200.13
##$BF3= 200.13
##$BF4= 200.13
##$BF5= 200.13
##$BF6= 200.13
##$BF7= 200.13
##$BF8= 200.13
##$BYTORDA= 1
##$CFDGTYP= 0
##$CFRGTYP= 5
##$CHEMSTR= <none>
##$CNST= (0..31)
1 1 145 1 1 1 1 1 1 1 1 1 1 1 1 1 1 1 1 1 1 1 1 1 1 1 1 1 1 1 1 1 
##$CPDPRG= <>
##$CPDPRG1= <>
##$CPDPRG2= <>
##$CPDPRG3= <>
##$CPDPRG4= <mlev>
##$CPDPRG5= <mlev>
##$CPDPRG6= <mlev>
##$CPDPRG7= <mlev>
##$CPDPRG8= <mlev>
##$CPDPRGB= <>
##$CPDPRGT= <>
##$D= (0..31)
0 0.7 0 0 0 0 0 0 0 0 0 0.03 0 0 0 0 0 0 0 0 0 0 0 0 0 0 0 0 0 0 0 0 
##$DATE= 1741600688
##$DBL= (0..7)
120 120 120 120 120 120 120 120 
##$DBP= (0..7)
150 150 150 150 150 150 150 150 
##$DBP07= 0
##$DBPNAM0= <>
##$DBPNAM1= <>
##$DBPNAM2= <>
##$DBPNAM3= <>
##$DBPNAM4= <>
##$DBPNAM5= <>
##$DBPNAM6= <>
##$DBPNAM7= <>
##$DBPOAL= (0..7)
0.5 0.5 0.5 0.5 0.5 0.5 0.5 0.5 
##$DBPOFFS= (0..7)
0 0 0 0 0 0 0 0 
##$DE= 6
##$DECBNUC= <off>
##$DECIM= 32
##$DECNUC= <off>
##$DECSTAT= 4
##$DIGMOD= 1
##$DIGTYP= 9
##$DL= (0..7)
0 120 120 120 120 120 120 120 
##$DP= (0..7)
150 150 150 150 150 150 150 150 
##$DP07= 0
##$DPNAME0= <>
##$DPNAME1= <>
##$DPNAME2= <>
##$DPNAME3= <>
##$DPNAME4= <>
##$DPNAME5= <>
##$DPNAME6= <>
##$DPNAME7= <>
##$DPOAL= (0..7)
0.5 0.5 0.5 0.5 0.5 0.5 0.5 0.5 
##$DPOFFS= (0..7)
0 0 0 0 0 0 0 0 
##$DQDMODE= 0
##$DR= 18
##$DS= 0
##$DSLIST= <SSSSSSSSSSSSSSS>
$$ [...]
##$SUBNAM0= <"">
##$SUBNAM1= <"">
##$SUBNAM2= <"">
##$SUBNAM3= <"">
##$SUBNAM4= <"">
##$SUBNAM5= <"">
##$SUBNAM6= <"">
##$SUBNAM7= <"">
##$SUBNAM8= <"">
##$SUBNAM9= <"">
##$SW= 18.0517328524113
##$SWIBOX= (0..15)
0 0 2 0 0 0 0 0 0 0 0 0 0 0 0 0 
##$SW_h= 3612.71676300578
##$TD= 16384
##$TD0= 1
##$TE= 0
##$TE2= 300
##$TE3= 300
##$TEG= 300
##$TL= (0..7)
0 120 120 120 120 120 120 120 
##$TP= (0..7)
150 150 150 150 150 150 150 150 
##$TP07= 0
##$TPNAME0= <>
##$TPNAME1= <>
##$TPNAME2= <>
##$TPNAME3= <>
##$TPNAME4= <>
##$TPNAME5= <>
##$TPNAME6= <>
##$TPNAME7= <>
##$TPOAL= (0..7)
0.5 0.5 0.5 0.5 0.5 0.5 0.5 0.5 
##$TPOFFS= (0..7)
0 0 0 0 0 0 0 0 
##$TUNHIN= 0
##$TUNHOUT= 0
##$TUNXOUT= 0
##$USERA1= <user>
##$USERA2= <user>
##$USERA3= <user>
##$USERA4= <user>
##$USERA5= <user>
##$V9= 5
##$VALIST= <valist>
##$VCLIST= <CCCCCCCCCCCCCCC>
##$VD= 0
##$VDLIST= <DDDDDDDDDDDDDDD>
##$VPLIST= <PPPPPPPPPPPPPPP>
##$VTLIST= <TTTTTTTTTTTTTTT>
##$WBST= 1024
##$WBSW= 4
##$XGAIN= (0..3)
0 0 0 0 
##$XL= 0
##$YL= 0
##$YMAX_a= 207860
##$YMIN_a= -245548
##$ZGOPTNS= <>
##$ZL1= 120
##$ZL2= 120
##$ZL3= 120
##$ZL4= 120
##$ABSF1= 10
##$ABSF2= 0
##$ABSG= 5
##$ABSL= 3
##$ALPHA= 0
##$AQORDER= 0
##$ASSFAC= 0
##$ASSFACI= 0
##$ASSFACX= 0
##$ASSWID= 0
##$AUNMP= <proc_1d>
##$AZFE= 0.1
##$AZFW= 0.1
##$BCFW= 1
##$BC_mod= 2
##$BYTORDP= 1
##$COROFFS= 0
##$CY= -3
##$DATMOD= 1
##$DC= 2
##$DFILT= <>
##$DTYPP= 0
##$F1P= 0
##$F2P= 0
##$FCOR= 0.5
##$FTSIZE= 0
##$FT_mod= 4
##$GAMMA= 1
##$GB= 0.15
##$INTBC= 1
##$INTSCL= 1
##$ISEN= 128
##$LB= 0.25
##$LEV0= 0
##$LPBIN= 0
##$MAXI= 10000
##$MC2= 0
##$MEAN= 0
##$ME_mod= 0
##$MI= 1.114404
##$NCOEF= 0
##$NC_proc= 0
##$NLEV= 6
##$NOISF1= 3.799351
##$NOISF2= 2.8
##$NSP= 1
##$NTH_PI= 0
##$NZP= 0
##$OFFSET= 14.38212
##$PC= 1
##$PHC0= -467.6815
##$PHC1= 9.992219
##$PH_mod= 1
##$PKNL= yes
##$PPARMOD= 0
##$PSCAL= 0
##$PSIGN= 0
##$REVERSE= no
##$SF= 200.129724274929
##$SI= 16384
##$SIGF1= 3
##$SIGF2= 2
##$SINO= 400
##$SIOLD= 16384
##$SREGLST= <1H.CDCl3>
##$SSB= 0
##$STSI= 0
##$STSR= 0
##$SW_p= 3205.1282051282
##$SYMM= 0
##$S_DEV= 0
##$TDeff= 0
##$TDoff= 0
##$TI= <>
##$TILT= no
##$TM1= 0
##$TM2= 0
##$TOPLEV= 0
##$USERP1= <user>
##$USERP2= <user>
##$USERP3= <user>
##$USERP4= <user>
##$USERP5= <user>
##$WDW= 1
##$XDIM= 8192
##$YMAX_p= 0
##$YMIN_p= 0
$$ End of Bruker specific parameters
$$ ---------------------------------
##NTUPLES= NMR FID
##VAR_NAME=  TIME,          FID/REAL,        FID/IMAG
##SYMBOL=    X,             R,               I
##VAR_TYPE=  INDEPENDENT,   DEPENDENT,       DEPENDENT
##VAR_FORM=  AFFN,          ASDF,            ASDF
##VAR_DIM=   8192,          8192,            8192
##UNITS=     SECONDS,       ARBITRARY UNITS, ARBITRARY UNITS
##FACTOR=    0.0002768,     1,               1
##FIRST=     0,             0,               0
##LAST=      2.2672688,     0,               0
##MIN=       0,             -245548,         0
##MAX=       2.2672688,     207860,          0
$$ Real data points
##PAGE= N=1
##DATA TABLE= (X++(R..R)), XYDATA
0 0 0 0 0 0 0 0 0 0 0 0 0 0 0 0 0 0 0 0 8 -8 8 -8 8 -9 12 -16 16 -20 24 -24 28 -33 36 -44 46 -52 60 -68 76 -83
40 -83 93 -103 114 -125 138 -151 168 -186 204 -225 247 -273 300 -333 368 -410 456 -508 572 -648
60 -648 741 -860 1009 -1214 1508 -1958 2740 -4342 9027 -54087 -245548 -243277 -169991 -91413
74 -91413 29965 161300 199804 162649 86495 -15205 -116710 -169369 -154887 -77115 18822
85 18822 96078 143934 143229 73457 -22682 -93069 -124423 -113171 -60679 7373 70494 109749 103264
98 103264 56638 -2195 -62582 -101046 -88306 -41830 7760 53678 81315 73625 41225 -2937
110 -2937 -46853 -65044 -59963 -45038 -7167 44203 62889 49864 34754 5971 -34950 -53002
122 -53002 -46480 -31908 -2492 31126 42187 38076 28544 3531 -24246 -36175 -36382 -26593 -4821
135 -4821 17797 30076 33708 22839 2768 -15231 -29353 -32270 -18570 1293 15288 24796 24244
148 24244 11424 427 -5742 -14291 -18862 -15473 -8724 4129 20179 23074 15230 4402 -10048
161 -10048 -20568 -15815 -6831 -2268 5393 13749 12460 7979 3942 -2728 -9357 -11923 -11418 -4694 6179
176 6179 10042 10191 8720 1486 -6347 -6003 -5514 -8106 -4694 2335 5588 8386 9619 3154 -4053 -5897
192 -5897 -7485 -5796 -379 3462 3621 4584 4180 1279 -708 -3048 -5585 -5709 -3653 -641 3675 5731
208 5731 3398 1251 -469 -4296 -5054 -2198 -584 1024 3312 3879 2060 1405 3 -1955 -1913 -1588 -1862
225 -1862 -620 1463 2247 3083 2959 -17 -2869 -3138 -2806 -833 1823 2130 877 557 672 156 428 -68
243 -68 -2473 -1792 -248 869 1843 2775 1409 -928 -1774 -1348 -1138 489 465 -44 21 705 1337 1047 -159
262 -159 -1451 -1709 -1004 -44 1527 1350 477 -388 -578 -737 17 291 -859 -1458 -322 406 438 1034 593
281 593 -843 -1646 -523 79 361 606 646 256 -163 46 636 381 -384 -620 -377 -317 233 956 506 -82
301 -82 -641 -553 -374 -15 470 470 126 -192 -144 266 297 48 -87 -96 -533 -25 455 630 672 68 -494 -490 -305 83
325 83 516 173 -198 -607 43 232 588 391 -253 -844 -582 38 618 681 -66 -686 -492 314 -90 151 112
346 112 -396 -714 -109 494 514 5 -279 -675 -613 240 831 378 194 -138 -53 105 231 434 -77 -164 -340 -332
368 -332 291 405 388 -227 -415 -186 -344 354 226 64 -63 -222 -105 27 323 128 -124 -376 -39 143 393
389 393 3 -11 -171 -287 101 242 116 84 81 -44 -240 303 408 314 -93 -443 -242 -85 200 304 218 -204
411 -204 -330 -87 159 250 329 99 -187 -570 11 448 518 -87 -212 -353 -177 48 320 132 -144 -288 -102
432 -102 -86 315 400 -139 -164 -29 -32 9 189 163 -202 -150 -211 105 413 166 -1 -377 -69 -24 186 217 -160 -355
456 -355 -97 -121 85 3 373 -454 -1 -213 -207 66 163 -153 -97 15 -269 194 29 226 -262 -238 56 303 158
479 158 96 104 -33 -346 -134 22 -188 -364 65 -201 -300 -4 253 -88 -135 56 -114 -141 387 128 -280 304
501 304 -155 -75 307 324 -134 113 -201 -119 -115 330 96 33 -121 -394 -274 179 -6 -22 387 -100 -310 152 116
524 116 -21 33 103 -295 -61 115 409 -112 -66 -216 -417 35 -2 67 299 -271 -119 -44 -13 124 193 -35 -181
547 -181 153 85 -117 376 -58 -1 -126 272 139 -27 98 -189 -359 -108 241 -220 22 -288 -134 -308 150
568 150 111 -214 -232 82 -51 280 26 -72 395 10 -250 -25 288 56 79 -54 -170 -286 -37 70 -37 111
590 111 -7 -347 38 212 -311 -4 -183 76 -18 95 -90 191 -175 -198 -102 -200 -362 311 130 -151 -141 -109
612 -109 -250 -94 282 147 -99 146 40 70 -268 -62 -83 -134 -220 -134 79 164 157 -132 -167 -9 82 215 -13 41
636 41 -22 -17 139 237 -37 -143 -27 -99 30 69 -221 -93 339 -28 -214 147 -35 -30 23 -129 -263 77 51 49 128
661 128 -26 -165 -31 -39 35 -216 -214 -11 -317 74 454 178 68 -262 -147 -145 150 187 -159 -19 43 -54 -38 159
685 159 28 -59 -215 -47 -173 0 -170 102 -76 408 101 -22 -146 -88 -48 -90 -266 14 -138 -232 117 -112
707 -112 148 -112 -194 -27 30 14 0 -125 -32 132 280 14 -62 -215 -191 187 91 -31 -140 31 134 25 106
730 106 230 114 127 137 -157 0 182 86 72 -113 167 -93 233 -160 85 -120 -227 -218 180 -221 -27 187
752 187 -92 240 34 9 22 65 -33 298 202 128 151 37 -143 1 -38 -194 -48 -127 -293 -339 169 135 0 -53
776 -53 90 -162 -166 -65 55 -41 -218 -58 12 34 -52 23 -89 99 0 -223 127 138 -126 -89 31 -118 90 61
800 61 -59 438 -170 -41 -98 113 -45 -70 59 84 26 -88 -87 101 142 -43 190 -129 -111 219 100 74 137 -353
824 -353 42 -38 -149 -71 121 -52 -75 -63 -7 105 26 -8 50 -173 31 -128 -46 -119 30 214 -208 75 166 104
848 104 4 -115 -92 -90 61 -307 -53 44 -57 362 -45 -4 -358 20 -182 -86 40 29 -19 279 -139 171 -73
871 -73 -68 -128 119 -2 -199 -25 59 165 96 284 136 124 61 140 -158 -186 24 157 -68 118 157 94 219 51
895 51 84 -59 348 26 -5 -39 30 193 66 185 -64 -40 -230 -63 -164 -3 96 73 47 6 64 273 103 -109
919 -109 129 -181 84 216 116 36 -47 -11 -86 61 -57 67 102 -68 -47 -78 -18 308 -97 196 -230 -27 81
942 81 87 -55 28 -211 -49 161 -319 17 133 173 92 54 11 246 -102 117 0 -38 83 -91 25 -127 -280
965 -280 -50 42 65 117 76 154 100 -112 91 -24 -89 139 105 -19 46 51 -13 101 120 180 -17 173 286 215 -125
990 -125 -189 -103 43 -235 133 -12 76 -233 -84 54 -162 -108 83 256 -33 101 124 -5 -28 132 -81 -26 68
1013 68 19 28 236 286 -238 210 -54 -249 -114 -208 192 -77 -63 -6 13 -41 140 73 -186 309 -28 -280 -223 -170
1037 -170 130 -162 72 -172 202 -86 -31 -49 -300 -175 -110 2 -308 102 108 9 77 -181 40 115 121 118 -102 67
1061 67 -170 163 -53 -52 -213 -196 -82 40 189 -32 101 128 190 -178 -164 187 113 53 -246 56 110 -280 -227 -242
1085 -242 40 21 145 89 -172 132 125 -164 55 -250 -64 27 8 205 -188 -93 -132 88 -32 -73 -119 -292 71
1108 71 -116 209 -312 -217 -58 123 117 101 -3 -341 224 187 -31 8 -213 -45 -2 99 198 -63 44 -45 -12 61
1132 61 87 176 30 -154 -49 -157 15 -14 202 -33 -204 -281 -81 113 -188 -56 -216 95 -219 114 263 43
1154 43 288 332 -2 47 -163 -11 -30 -221 -234 122 -130 -63 21 -105 -186 -185 25 -21 70 169 265 80 34 -306 -174
1179 -174 -143 -10 56 149 291 -204 -65 194 -172 300 166 0 106 168 126 -190 -19 -37 -22 133 -211 -27
1201 -27 -133 -163 5 276 123 108 -10 -268 -118 -40 -17 202 -140 24 -85 43 -217 34 223 -286 194 99
1223 99 90 40 -29 17 -342 170 -57 -99 -89 79 112 -147 100 -203 -261 192 49 31 -9 140 -89 150 -91 122
1247 122 -76 -133 -96 92 33 -27 1 -64 -204 -179 40 -187 -62 17 -115 -108 320 -113 42 77 257 26 -72 28
1271 28 -5 84 345 -16 207 106 -75 136 135 -7 -58 -270 167 -304 -36 35 -57 74 -148 100 -146 -315 115
1294 115 -112 11 -31 -146 -135 199 -99 -104 -116 155 -92 -130 148 -97 87 -64 169 -15 -73 187 6 -68 101
1317 101 -77 -36 -100 82 -89 163 -264 129 340 -88 112 -48 58 122 -264 -266 -98 14 -92 -180 -201 96
1339 96 -71 -21 -4 156 -353 145 -92 -114 69 172 -236 286 -62 -35 285 -274 -52 -111 55 9 -135 64
1361 64 -32 68 -201 -43 212 -92 -166 23 -58 256 79 -53 112 -24 -86 -28 -18 22 -169 2 -65 150 -168
1384 -168 -4 -163 52 -349 -108 -270 -51 -52 -110 186 -212 175 -370 -94 -64 2 -63 -44 116 -77 144 -7
1406 -7 -122 197 111 -70 114 47 -194 133 -18 42 4 -95 69 -14 -96 -128 -75 -10 50 -83 142 -5 59 78 -23
1431 -23 38 -7 242 69 40 27 15 -83 20 160 218 -47 -154 11 69 -91 -68 -6 98 91 -88 -31 -20 -71 -10 -154
1457 -154 76 -33 -239 38 -15 108 -63 -318 252 -131 6 144 26 -96 178 -14 -133 -29 247 -108
1477 -108 -75 81 -166 9 40 81 72 285 51 -118 -8 -67 -123 -302 44 392 -49 -96 -211 -114 96 -115 47
1500 47 36 133 77 -263 9 166 69 16 12 67 68 199 -233 -13 8 -46 -204 133 -96 -82 106 103 -177 -56 59
1525 59 21 115 -62 -233 -197 35 -121 201 9 -235 -191 0 -234 194 -227 -120 246 246 169 -79 25 19 -132
1548 -132 -30 -63 32 33 134 -44 -99 -28 308 -13 -72 -66 -154 73 208 241 45 42 -60 148 17 144 149 -130 -34
1573 -34 84 17 -25 -79 -104 -110 -128 198 -154 32 -41 -253 74 -60 -51 52 -60 106 -28 54 -62 63 -12 211
1597 211 220 -367 -85 -84 -220 11 23 -40 69 -24 20 -55 -363 -135 -180 63 118 186 29 43 48 172 204 98 76 172
1623 172 -62 -89 124 -109 -20 -188 184 48 -210 -62 104 -185 200 38 -201 89 -95 -158 92 24 12 110
1645 110 -181 280 -254 128 -97 -208 -13 -50 234 -156 -25 78 -45 -77 -48 -33 -68 -65 -186 -26 -85 357 -23
1668 -23 -114 -49 -46 163 42 99 85 -173 2 -162 182 -216 44 53 38 94 -4 -137 49 150 296 15 138 -185
1692 -185 174 76 105 -221 432 277 152 -422 -206 78 217 -1 -147 2 52 151 -108 -37 -23 -161 78 -10
1714 -10 52 77 11 46 108 253 14 -4 -155 -17 -66 43 196 -115 153 -129 -16 93 -31 217 33 -172 40
1737 40 212 -102 149 -113 -184 -207 -38 -383 -28 -40 -101 36 93 -195 -191 219 183 -95 -192 -87 -100 29 -12 32
1761 32 71 38 55 -200 144 249 -219 110 73 -73 -139 -172 208 68 13 60 11 -72 -312 -81 150 202 -88 15
1785 15 -213 364 110 -72 -60 -251 -101 -84 -103 -322 -54 42 -265 108 188 99 78 -9 -48 -73 18 -182 -52 218
1809 218 94 -19 -112 92 -229 -75 25 21 -70 -78 186 46 -233 -155 -116 -5 -315 70 -58 19 76 -24 -242
1832 -242 -348 -377 57 -44 -151 -85 183 31 -21 -110 14 114 -20 -73 -99 -266 -228 -23 69 -47 47 25 -277
1855 -277 -154 128 -73 -2 -217 183 -23 312 -84 25 264 -112 127 335 74 11 -20 17 269 -60 -63 -217
1877 -217 82 123 -144 -49 42 -81 -2 158 0 -27 84 45 0 60 126 -45 -135 5 -202 188 -89 241 -323
1900 -323 -89 251 -141 86 -6 65 -123 -82 -149 198 102 -141 -14 -144 67 -113 -52 49 242 74 73 19 16 89
1924 89 97 -70 163 80 -73 -118 -284 46 221 -99 -216 -170 209 113 174 -92 193 45 -136 -221 67 -64 56
1947 56 -242 -223 17 -277 -109 33 140 -257 26 -8 75 37 439 14 -81 -78 91 -242 -90 -34 70 -15 141
1970 141 -139 -23 73 -54 -100 15 -290 -108 -156 20 -93 123 -109 144 99 38 -132 -6 295 21 216 248
1992 248 -92 -161 67 -124 86 -123 -105 -114 -195 70 50 -54 124 -96 63 179 6 172 351 245 -66 41
2014 41 128 149 -211 -108 -85 -121 307 81 -71 -118 -1 -110 -126 29 -203 225 -226 -7 62 -182 -77 75 102
2037 102 7 -9 -219 -219 -10 177 -17 19 -141 101 -383 40 -101 219 74 -143 103 -47 100 -281 427 -109
2059 -109 95 -246 23 78 64 31 -252 88 -102 65 -250 -53 -68 37 -105 -70 153 -246 34 -317 -210 -35
2081 -35 -80 -33 -388 -94 63 -124 54 24 31 -58 -70 196 157 202 84 76 148 -72 -81 -289 146 59 288 285 170 -84
2107 -84 -11 -48 51 -89 -80 -76 9 126 37 -323 -176 117 -32 117 -151 -247 -59 -81 -20 -10 -169 245 -102 -28 -139
2132 -139 127 103 116 225 -1 95 -34 -47 30 -116 -310 -229 -209 -77 103 1 142 -158 -183 108 -51 -77 -41
2155 -41 -55 22 124 -97 -357 -93 27 -79 -125 -97 -243 108 156 -158 -8 -62 71 -114 -81 73 287 22 -66
2178 -66 -96 -83 189 4 4 -91 67 -180 -47 53 214 65 254 -156 17 -199 102 109 -46 -60 -350 62 -41
2201 -41 87 -360 49 6 136 -105 -220 70 140 69 -191 -73 109 -123 -297 366 232 -45 -66 -105 -176 124
2223 124 94 -250 -13 -9 -99 -55 175 -171 116 72 -145 169 -80 48 159 13 46 -10 61 -50 54 78 -154
2246 -154 183 -163 -214 150 -276 -100 4 114 125 -261 206 15 87 -236 130 -60 -130 171 90 -197 -289 -233
2268 -233 241 32 -216 96 87 -155 32 -46 68 -395 -24 152 181 353 -73 135 -188 -290 45 -62 221
2289 221 104 90 -84 -8 -91 149 -3 107 -340 -143 -108 60 46 -71 -124 -79 56 200 193 54 -284 -56 -127
2312 -127 -52 43 -146 -104 -270 -39 -224 141 -96 -192 -38 -362 40 21 -277 26 143 149 -121 -24 -177 -102 -45
2335 -45 -183 -257 -28 -44 -243 -33 -78 36 -55 -219 30 40 369 5 254 61 -220 96 61 -80 -310 142
2357 142 -270 201 -177 215 15 -41 -66 -159 24 63 -50 56 10 243 -170 -49 -1 39 -47 -243 -33 76 42
2380 42 29 268 -107 -86 114 -134 50 -210 304 167 44 112 -22 34 71 -224 -208 76 102 165 188 -39 -186
2403 -186 122 124 -14 -104 162 -89 1 -137 -225 106 -19 0 -59 -153 -82 259 191 -101 -197 -39 19 174 144 227 286
2428 286 -150 -36 9 -92 61 -185 166 -85 -234 -253 139 -13 263 -52 -24 122 149 18 -129 53 -29 -10
2450 -10 -31 47 -202 156 131 187 -44 202 -109 171 -32 -292 26 46 138 -64 172 68 28 -171 24 103 -13
2473 -13 -62 -74 160 -134 -46 -169 -213 234 10 77 -155 -163 27 -25 -69 -107 -58 65 213 -83 -65 44 -166 -132 -249
2498 -249 -12 -165 245 36 -129 18 41 -48 23 170 76 -73 -49 -1 226 78 -151 -19 139 -153 108 -156
2520 -156 -29 176 159 -308 305 -208 -43 345 -63 110 57 -91 -65 78 -70 397 39 160 -60 36 -241
2541 -241 -55 493 -126 -9 7 77 -20 57 -77 57 90 -56 219 -67 -218 -23 67 -28 122 -163 63 -126
2563 -126 -155 -126 -87 -220 -28 46 37 -122 -180 195 211 114 21 170 6 -31 -132 -61 206 -119 6 273 -78 -15
2587 -15 -10 427 -54 -280 -33 17 -62 -116 68 -96 -118 -66 12 -143 -37 -178 89 48 -17 -231 130 117 -263 -89
2611 -89 -316 -159 -66 -76 138 -189 78 -75 36 -33 -52 11 -59 41 78 159 67 109 45 -11 67 173 193 -223 28
2636 28 -13 -109 109 -80 -5 -71 91 38 33 31 -227 -95 -307 -57 16 -147 132 -26 11 123 182 294 99 -204
2660 -204 81 -134 -49 -125 -15 -159 180 34 91 -32 57 40 -122 -11 -43 170 127 229 -50 -15 60 -227 -238
2683 -238 -88 44 -33 -88 26 1 -34 -65 158 -382 -228 33 47 174 -87 -7 -55 164 41 -158 20 182 68
2706 68 -58 -66 195 162 47 -8 119 201 119 245 -114 -210 105 233 -126 -166 22 68 -127 -22 103 -88 53
2729 53 10 226 -72 -61 113 61 36 187 17 -3 93 -34 -227 190 213 -105 18 79 -37 -133 65 82 -266 -15
2753 -15 -140 -236 -66 114 367 -158 127 14 222 -197 -110 70 -61 -200 -283 -61 -194 -181 -12 170 53 -107
2775 -107 -202 -89 61 -47 200 -31 100 -89 74 64 -121 205 -166 52 -32 62 32 -31 -5 225 -23 -87 59
2798 59 -124 117 -12 -11 -196 -337 78 203 -58 25 68 316 197 -15 175 -59 221 123 -173 63 158 159 -115
2821 -115 -96 206 -67 -136 -125 213 -219 89 98 -65 -18 -112 105 149 -130 45 -213 149 107 -35 127 -211 -187
2844 -187 208 -179 -19 -43 102 83 396 -217 105 -190 114 -3 -10 38 -83 -147 -198 64 -169 102 -195 278
2866 278 198 46 -87 83 254 120 -35 -102 -167 -68 -216 239 82 220 124 -8 85 195 -43 -134 -36 -33 -205
2889 -205 -45 51 109 149 79 145 85 31 47 203 107 -8 -134 -208 -64 364 114 40 -19 -216 43 43 -366 237 -17
2914 -17 73 -122 -79 -13 204 124 89 83 -69 49 166 -61 233 -2 58 -30 -250 -211 -29 -160 -213 -50 108 32
2938 32 -150 -108 -91 -52 -47 233 -160 -22 -85 -75 109 -65 -112 274 -157 -89 342 -91 12 -124 186 28 -245
2961 -245 12 205 130 98 -205 106 -111 -154 81 -327 -112 -96 -206 -48 -174 127 51 167 79 168 -167 40
2983 40 195 179 91 278 0 -157 70 45 52 -50 347 -23 58 -101 127 -86 -53 67 96 263 60 77 156 17
3007 17 -18 -121 133 -265 87 62 -139 156 -10 -25 -34 54 -147 163 -114 180 -52 -49 89 56 128 111 -76 -47
3031 -47 -46 163 100 -84 -12 -63 62 109 103 215 42 438 -248 90 100 63 -181 -159 261 -81 34 61 -102 88
3055 88 63 -3 -44 -68 -59 -24 -19 86 0 -70 158 87 85 -20 187 -168 14 60 -126 26 209 -149 7 266 111
3080 111 -67 -81 -148 -217 100 -109 124 128 -160 35 -49 -178 18 41 359 -48 -146 207 -218 -43 -170 42 11
3103 11 -25 97 -161 -147 139 -24 256 -214 -6 30 -133 345 115 73 -130 -157 181 -35 -35 -75 30 -79 63
3126 63 -180 -35 50 -102 -170 -139 -35 -22 -82 26 -34 45 24 154 -114 134 -188 259 -138 -9 137 -8 -53
3149 -53 78 -87 37 159 19 -92 104 -47 -62 170 154 93 -92 82 -143 54 -272 73 90 74 -183 -222
3171 -222 56 257 30 -77 103 -71 -70 -6 131 12 235 -257 -143 100 153 23 -286 -81 -2 146 -252 116
3193 116 -48 -164 -75 223 -131 -132 34 -12 -141 -9 -29 31 134 84 -95 216 -196 -108 110 45 -9 0 74 190
3217 190 -29 -53 -67 -44 243 69 294 164 -52 -149 142 191 98 -56 -76 -19 -177 188 299 48 28 12 -32 -225
3241 -225 -102 -224 26 -117 -64 176 175 -135 -51 -114 326 57 16 -169 121 -2 39 109 116 189 -91 -50 40 -87
3265 -87 -60 84 -84 19 150 104 -222 152 -114 -118 -60 -91 209 -15 37 -9 260 67 93 -88 22 -71 -14 48
3289 48 -139 -286 -166 -123 12 -123 275 -209 -254 -74 64 109 -2 -198 34 -137 7 100 55 -184 51 -39
3311 -39 4 -45 -14 109 -132 -127 84 99 -186 89 168 -392 35 -220 177 211 204 -130 -149 94 -89 78 -337 -55
3335 -55 -24 -30 -33 2 -87 234 -170 -116 92 -7 -152 160 -81 -14 -66 67 333 8 -8 60 -134 88 -184 -30 119
3360 119 -93 -206 58 235 101 156 -164 -109 69 -91 55 -53 -289 214 -281 -240 -105 -23 141 -76 244
3381 244 -155 -208 229 -211 197 243 -189 -228 140 -12 -103 -2 -12 -83 215 -87 -76 -77 194 56 89 130 -278 -85
3405 -85 20 -83 -103 156 -37 -163 114 -140 -326 -236 -80 32 -226 -170 -55 -220 -40 218 -180 -42 10 -81
3427 -81 66 326 -2 -118 -50 -49 188 149 -135 34 112 63 30 111 -143 -210 172 88 -83 124 47 -109 21 92
3451 92 78 -72 0 -72 -99 -52 -60 96 -61 1 -15 -8 2 83 11 -170 -93 -10 -178 -222 54 -49 246 9 174 -194
3477 -194 -554 -152 106 -138 96 46 -173 34 48 230 198 88 233 -4 105 111 -13 -95 56 -63 22 -9 -31
3500 -31 -9 171 -177 230 152 -107 -176 78 43 -175 86 4 37 134 -82 -208 47 221 36 47 -152 158 -36
3523 -36 -141 36 125 216 149 -216 -242 -153 -374 182 -34 -225 -14 -84 -164 -74 -35 -57 93 -76 -78 109 -28 -39 75
3548 75 -157 -52 51 39 -68 73 -49 -38 -61 -59 -71 303 -46 -58 -363 -136 -104 -89 139 -3 20 3 -183 13
3572 13 -106 -200 61 154 143 95 109 78 203 -167 33 20 178 99 -304 23 54 182 46 43 230 -46 -39 -276 -302
3597 -302 161 174 -231 33 170 -83 -21 -60 -221 308 -61 48 -44 109 152 -204 75 186 337 -73 -66 -68 -50
3620 -50 247 5 22 11 -54 46 -242 108 21 239 12 47 5 48 39 -40 -14 91 173 -24 16 190 -105 27 240
3645 240 -180 -84 -46 -148 -64 -101 31 87 34 -82 95 -136 45 216 -192 -145 10 -144 74 -139 -141 87 -197
3668 -197 -101 114 19 -95 135 180 -18 184 102 129 72 -208 86 198 180 298 17 -62 162 -166 -8 90 -4
3691 -4 86 -123 4 -167 -54 -62 7 -2 29 -217 7 104 -118 27 205 -114 -69 -68 33 -56 -273 40 -134 18 140
3716 140 47 145 -25 308 7 -61 -84 49 -86 -38 -9 -117 -160 -150 84 24 -234 -41 171 48 -62 42 -257
3739 -257 -5 -173 46 133 5 -71 137 167 -27 66 -109 75 -34 -224 150 72 -83 289 -61 68 -92 -27
3761 -27 -160 -43 43 5 192 -336 1 13 30 58 -145 62 -113 -378 83 -36 186 -108 -22 166 29 -192
3783 -192 -330 52 40 192 -3 -160 210 -188 78 1 -125 8 155 -26 100 116 209 262 -39 234 -280 -159
3805 -159 174 -28 22 -20 110 159 -101 -306 8 -72 -177 -133 -63 -62 214 62 -94 -127 171 40 -44 50 -80 3
3829 3 -21 -161 97 -197 55 166 -102 -19 105 -149 75 219 10 37 -85 -120 -116 -203 103 54 112 -41 234 184
3853 184 -24 -137 -5 129 67 -216 -144 112 17 -155 -68 156 35 -63 58 -105 0 82 290 323 191 -46
3875 -46 262 -72 -75 192 -123 17 -250 65 177 152 149 97 44 228 -63 37 225 107 -184 4 -122 148 -238
3898 -238 189 25 -193 71 -94 -80 83 33 -116 125 108 -53 -59 -52 -91 -177 52 -203 28 2 -117 -109 -59 -165
3922 -165 26 -97 -226 -240 105 -46 -15 140 255 -227 16 -76 -90 -290 -182 187 162 -171 -188 86 -105 -248
3944 -248 -186 213 65 251 -212 121 348 -21 -20 114 102 29 246 -5 24 -167 -55 -176 -104 269 -106 -74 88
3967 88 -1 144 90 -78 73 -55 40 -48 229 216 0 52 82 -39 183 24 165 -265 -120 -209 121 67 90 -153
3991 -153 11 -306 -44 137 125 -26 -135 -49 6 -441 18 -16 -256 -84 340 -282 70 156 32 -61 -99 237
4013 237 43 -35 -4 41 18 63 -221 72 -76 191 7 58 203 -24 -10 44 -308 -134 295 -122 -45 -13 -57 234
4037 234 17 -93 -155 -12 -70 -198 -20 66 11 10 122 114 183 -271 141 -75 -35 67 177 -60 -15 9 -20 255
4061 255 -171 27 -94 23 -154 -168 104 -213 282 63 -127 -125 177 -117 60 -141 84 -127 395 -32 14
4082 14 16 15 307 -80 -192 -205 58 -158 223 -275 58 -19 22 -65 -39 -176 -64 -242 3 240 -21 -122 -309
4105 -309 -176 37 -282 56 -46 -221 -133 57 177 10 -56 59 195 111 14 -181 -4 -173 -107 68 53 -195
4127 -195 -134 -69 -25 3 -223 191 45 205 -51 -108 72 -71 -242 -61 155 -41 -38 -257 193 -4 -216 -20
4149 -20 -92 56 -8 -123 20 -71 106 261 21 73 105 86 279 140 78 -75 36 30 61 75 -24 80 52 93 267
4174 267 317 41 -205 388 -48 205 52 -54 -134 29 -97 144 -284 428 -178 198 218 -205 -57 89 206
4195 206 -81 79 152 -307 59 222 1 374 -105 -126 181 266 -3 199 -229 -107 -74 -166 224 267 159 -154
4217 -154 -112 268 222 -184 -98 -1 -194 64 23 -85 -18 255 -222 221 -2 -201 35 -408 2 127 156 -120
4239 -120 17 58 52 -51 199 -251 80 -98 140 216 35 94 40 -68 171 -90 -117 241 -183 196 -150 -131 -168
4262 -168 88 298 -237 35 -55 58 28 19 -218 -70 0 31 256 155 -33 -5 12 73 95 81 65 156 -269 -19
4286 -19 -26 -20 -43 -71 68 -214 -66 -17 -10 -46 59 -39 199 114 -192 101 26 -261 -121 13 300 170 11 -17 -21 -222
4312 -222 -129 167 -102 319 -140 16 52 190 -211 80 -300 8 302 -246 -38 243 -200 -363 56 -52 46
4333 46 -24 208 -26 -177 156 -86 116 173 -4 25 -25 149 27 -262 177 -105 -108 59 -107 -21 7 141 -110
4356 -110 1 -55 -136 258 109 136 -87 -62 186 103 100 -61 73 -5 -123 101 275 97 48 151 137 312 2
4379 2 -92 30 -38 13 -39 116 69 -3 -49 -58 155 -121 248 -134 211 -112 -160 -196 -99 55 -21 -19 224 -16 -33 10
4405 10 -14 123 77 188 -20 -2 98 38 -235 -128 -114 -61 -38 -168 -255 275 -154 -42 84 -57 129 92 325
4428 325 -74 199 249 66 48 39 93 -68 107 -4 76 -22 7 -98 -94 -48 -48 199 -20 -23 -94 184 -216 56 -153
4453 -153 -22 155 125 -35 -63 81 -23 261 87 127 118 -228 232 96 132 78 120 -32 -166 34 -138 -180 32
4476 32 -217 236 94 128 -41 -95 37 -180 54 -42 -30 -100 204 -123 -72 -125 46 26 7 -291 9 -116 77
4499 77 76 -25 -3 -176 184 126 144 -171 -155 -80 -67 -97 -4 8 -104 117 -108 -15 22 -74 -42 132 111 262 126 -38
4525 -38 65 236 29 313 33 -72 15 -119 38 -11 -8 -98 -113 -346 6 -47 -41 236 -44 46 -37 169 225 -62
4549 -62 -157 -195 17 -67 324 39 155 -238 -169 -44 -148 -92 -38 281 -73 -85 -77 105 -170 -37 -368 321 18
4572 18 147 -114 -97 -257 -100 110 -103 -21 125 -123 -142 -137 -10 141 -183 -101 48 105 226 -32 -95 -95 -105 -143
4596 -143 -44 44 119 110 -170 260 138 141 147 100 -148 23 156 372 -76 154 -37 -164 -100 -150 -185 -80 -4 -133 124
4621 124 113 -4 -213 -129 143 -187 259 -27 -33 88 152 -8 124 164 -168 -33 141 -163 44 -125 30 -23
4643 -23 -64 297 9 240 -225 81 -80 268 -58 -116 -183 -113 -109 -12 -44 -87 167 -106 -86 55 -137 251 98 196
4667 196 11 23 -79 -31 191 -64 270 7 -44 -10 -137 -107 -146 208 -106 -170 205 27 -194 37 71 34 -68
4690 -68 121 136 -28 7 -61 -80 111 -122 -56 -221 -199 -95 -87 -121 -368 20 -133 43 -83 59 432 -111 92
4713 92 -112 -61 -53 -246 -29 171 105 36 5 -167 -422 -117 119 -84 -160 -73 -7 218 92 432 52 -19 -52 -161
4737 -161 28 -28 44 -148 -160 121 215 -163 155 -117 -228 7 149 -7 231 45 -279 26 64 -68 -38 195
4759 195 -243 -200 354 159 -16 49 275 303 438 172 108 -31 -173 -61 147 183 -73 51 79 -116 -88 142
4781 142 -82 -126 17 -168 7 301 125 116 0 76 56 -86 -51 143 -177 -28 -186 91 19 -295 43 75 -21
4804 -21 -126 153 199 -189 -6 -132 -96 -11 -60 -19 -204 -2 -74 158 172 15 -124 -25 -133 -35 -77 -185 80 -168
4828 -168 -38 149 117 -93 112 65 -50 173 -48 -6 -112 3 -159 -280 -41 163 -83 -143 180 -31 -45 148
4850 148 -152 -223 -24 221 -12 113 16 -26 46 -91 -92 -18 10 227 -73 -157 86 354 -206 0 53 -7 -95 -91 -16
4875 -16 75 98 9 -158 230 111 -58 64 -191 -93 -144 120 22 207 -58 222 54 248 43 -112 51 52 267
4898 267 167 362 -4 31 -265 71 37 -124 19 390 -146 139 -256 -36 157 -65 -82 133 -120 40 -52
4919 -52 241 20 49 -73 149 -333 49 -167 25 -3 217 238 4 126 -51 195 -178 -53 150 15 -20 440
4941 440 -52 88 -195 -83 -129 -69 -130 24 -91 -48 106 -16 -154 252 -72 90 -175 162 103 -284 -16 77
4963 77 123 -16 174 -26 1 81 -67 -101 272 -76 176 -127 -219 19 -132 119 -3 104 -73 14 -103 -418
4985 -418 -259 -202 -107 -179 -98 -89 1 124 308 295 245 -215 209 132 -4 4 -253 110 18 96 -32 252 -68 69 -53
5010 -53 86 258 221 66 147 -4 -121 213 -69 93 -78 173 41 -98 96 -30 -271 15 139 -286 -131
5031 -131 -16 -90 -163 102 -288 98 200 8 -70 -129 -297 -139 95 96 5 -198 36 -164 151 187 -94 122 138
5054 138 15 166 -265 -208 267 -7 -188 -67 -161 -47 53 -170 118 -346 60 186 -59 -41 57 -23 -91 -184
5076 -184 -45 -86 15 73 269 -48 111 89 -203 117 0 -56 -121 20 56 215 -213 -17 206 -55 113 -134
5098 -134 228 290 -136 212 102 -58 24 185 -208 3 168 -191 300 140 -141 68 -8 8 28 -244 -36 13
5120 13 -97 -116 2 -143 150 -5 -92 14 113 38 -159 143 -140 -86 80 83 -113 288 105 182 -120 47 -102
5143 -102 75 46 75 208 29 66 12 157 128 141 66 89 -64 35 -309 -162 45 -233 -102 -209 -119 -81 -178 73
5167 73 126 56 97 -97 -129 -191 76 -156 -26 -293 95 129 -94 -245 -16 78 -66 -8 -30 -155 -181 5 158 51
5191 51 62 204 -252 -311 50 -291 92 44 -190 -45 129 -10 -140 153 17 16 -145 -148 -183 165 97 199 251 29
5215 29 235 -4 287 270 -68 239 105 25 122 -244 -432 -72 191 146 194 -146 -137 -168 13 -42 159 186 -223 -296
5239 -296 -93 -93 232 220 -170 141 20 -235 -20 -157 17 -13 -135 188 -104 130 259 166 -148 29 -49 -174
5261 -174 -268 -101 -69 -234 280 -102 -114 103 10 48 36 410 -103 46 204 104 151 -179 9 64 -171 6 -58
5284 -58 202 -334 -69 -31 100 -161 147 -67 -33 -36 -241 -192 10 -215 83 231 -126 64 -19 -82 157 107 243
5307 243 185 234 -129 -180 35 30 -31 -82 74 112 -189 -83 214 -60 -220 -174 246 255 -262 17 125 -61 -64 -239
5331 -239 49 159 -169 -128 -5 -79 7 79 -26 148 229 8 104 -161 171 -105 109 270 5 317 -17 138
5353 138 -134 -180 48 94 137 -116 -99 96 84 -256 -233 100 -112 -210 24 169 164 -153 -108 -10 224 -94 -76 -50
5377 -50 -114 -101 166 90 155 -3 -166 157 -173 126 -76 -156 -26 140 80 102 -206 126 -33 -239 9 150 -142
5400 -142 -112 -321 -105 -267 -321 -35 -45 118 -141 -24 -170 -211 247 137 163 -134 -34 42 82 144 -245 125 24
5423 24 106 -15 -26 127 -235 225 29 62 -8 -264 -303 -59 202 142 48 -255 -22 -81 37 -66 93 158 13
5446 13 181 197 -312 -88 -246 -95 14 35 249 201 30 -56 -36 -305 -195 -168 -27 -50 -75 -15 35 -205 -235 -203
5470 -203 180 -161 -145 -14 -38 -13 76 -187 -60 -113 -23 43 -14 -125 -144 -71 76 37 -51 77 7 -198 84 -24
5494 -24 -92 99 203 12 -326 1 -109 -41 246 -197 -15 -277 -34 74 21 211 78 201 164 316 174 98
5516 98 220 291 -25 -359 263 131 43 -127 -50 -215 23 9 294 -82 227 -118 -23 178 87 46 2 -126 -172
5539 -172 66 -46 471 -266 -113 64 -138 -211 -49 -274 57 132 -127 -68 75 7 -27 -51 -346 -148 -137 -24
5561 -24 -62 -1 96 -24 100 -40 -74 173 161 218 -122 -24 123 30 -192 200 29 44 159 221 190 51 -227 272
5585 272 -9 -269 -19 -45 -105 -140 -50 -93 -89 143 -238 -154 106 146 25 -177 75 -57 78 272 18 367 -62
5608 -62 97 112 77 -108 121 103 111 -60 406 -47 -55 7 -25 79 -40 73 -110 157 -15 70 -67 224 120 -231
5632 -231 -97 193 10 95 -261 153 -107 -30 12 -248 144 56 -122 50 121 107 127 -389 -4 -24 -117 -66 -7 47
5656 47 -149 -111 399 88 -36 -107 166 -67 32 279 -360 -91 -174 127 26 -240 98 -40 -1 88 68 -260 105
5679 105 -55 87 226 155 81 281 94 -53 -37 57 -136 26 -132 169 -49 -127 16 76 139 -118 149 141 30
5702 30 -86 -113 -92 73 -59 143 10 -143 -40 44 -67 -222 -63 52 -142 24 -96 30 3 -143 -90 -83 217
5725 217 -180 217 -163 186 -324 -66 99 -122 198 26 94 119 -78 2 121 24 119 -45 -79 -149 -5 24 127
5748 127 83 -245 -55 44 -104 -7 145 -125 -140 -20 215 226 142 280 11 34 -39 -134 163 -263 -51 -150 -25
5771 -25 8 -78 114 55 7 113 -4 22 -90 -217 -102 13 -41 -109 -117 86 3 -22 -246 133 165 -24 -129 -53 21
5796 21 61 -117 272 22 -99 156 175 8 0 -58 20 -32 164 -91 -9 -112 -19 284 135 -121 130 -292 38
5819 38 -52 -88 5 -262 53 -78 -312 -1 0 56 -154 79 -275 92 6 -304 332 -246 70 -181 342 125 117
5842 117 121 -107 -152 -150 10 60 -14 204 -48 -31 136 10 201 -371 317 -89 -13 -276 38 84 -211 44 121 125
5866 125 -54 164 87 -77 122 56 -164 184 -13 43 47 28 -12 -18 -188 154 251 -242 -253 -81 86 44 -76 -24
5890 -24 -7 -175 66 -38 232 -97 323 184 35 49 2 -97 -22 -256 -191 188 62 46 -252 -164 97 -65 -46
5913 -46 90 -67 -299 158 51 125 216 61 -48 -78 30 39 150 63 220 75 -8 157 -72 18 166 -25 -93
5936 -93 -156 46 -93 32 -199 -321 -55 -245 -160 -87 38 210 -4 295 58 -100 -105 138 10 62 -100 128
5958 128 -24 259 190 39 39 -70 96 -27 259 -99 -142 108 113 38 255 -63 -15 -56 -237 172 -21 -2 6 -204
5982 -204 -114 50 200 -58 -159 222 -155 88 173 -205 -243 128 -65 170 -13 -217 10 -197 -104 -124 186 48
6004 48 59 -49 -153 -40 -182 103 86 -31 12 70 256 196 -164 -27 423 104 -72 97 125 -112 60 -106
6026 -106 -45 123 265 96 302 34 2 -287 -8 172 24 35 -136 103 -203 -143 -71 76 -182 -67 -120 45
6048 45 -241 206 205 -123 125 65 15 -132 4 -67 32 -206 -46 -60 11 21 75 -37 6 -99 46 101 -251 96
6072 96 240 32 34 14 25 184 228 89 95 -43 -138 232 -165 42 -21 54 86 -63 -161 145 -80 -226 -104 -23 44
6097 44 -96 -240 -18 -147 -6 157 128 -67 -87 130 -121 -88 -1 27 25 252 -76 159 -57 -95 104 86 -73
6120 -73 -23 27 -239 -274 -1 66 27 109 -106 135 77 98 -80 -197 -185 -82 157 30 -198 71 9 -21 62 302
6144 302 133 110 251 -44 -106 -120 31 -78 206 -244 262 -24 145 217 -5 74 98 -183 62 176 -157 112
6166 112 56 76 47 76 50 -140 -185 111 130 122 -354 -127 -41 54 -321 47 189 207 55 -132 130 -208 -32 -53
6190 -53 -34 -31 -184 -192 65 165 180 -332 97 -179 139 -167 -24 129 -64 99 66 -85 -290 -116 20 -19 -155
6213 -155 -117 364 -273 -173 22 -211 -90 26 272 143 -103 0 102 -85 -221 66 249 -203 -166 104 43
6234 43 -111 0 -9 31 -76 93 -391 -15 614 129 123 195 -23 -47 200 -81 105 -149 -28 172 124 -79 109
6257 109 -10 100 232 148 -149 252 22 -140 290 -48 -119 -98 -285 -8 67 35 371 143 200 167 -51 84
6279 84 49 201 148 -65 188 -12 51 -130 -342 -44 32 161 -28 176 17 163 32 -103 -45 226 -249 -28
6301 -28 -25 38 -135 26 276 -236 0 170 15 2 99 -47 -22 -196 244 1 190 100 -62 162 -241 35 285
6324 285 19 110 91 -177 185 -224 199 -144 -155 114 -176 -172 185 129 73 -333 -164 -11 -19 -145 37 292 -136
6347 -136 24 -164 107 12 30 48 130 148 16 -25 -170 14 23 95 123 -222 284 254 -142 -14 -222 36 75 97
6371 97 27 256 191 211 -56 -82 22 31 -165 -65 -20 -171 23 74 -73 -19 -151 156 -128 -79 -84 -227 51 95 -31
6396 -31 -54 -45 92 -98 -122 -202 40 -154 22 73 43 64 414 158 -113 -1 -81 21 -74 127 -74 184 135 -81
6420 -81 239 -103 236 -174 -84 -17 -157 118 16 -60 7 257 -56 41 -345 -45 -228 32 -81 157 269 63
6442 63 114 45 146 90 -205 -159 36 -94 -61 149 -208 -45 -222 -67 -107 -46 -54 55 -9 15 -48 190 31 39 57
6467 57 -172 148 -97 -16 -35 -51 217 -32 187 235 145 -25 -80 2 -189 -212 -124 208 -59 22 -2 223 41 -99
6491 -99 14 -99 184 118 -30 -43 -35 9 -130 -65 46 -162 362 67 -117 -15 77 -41 -37 -50 -34 -81 -119 -12 -37
6516 -37 24 284 52 94 16 -111 128 -9 38 -112 87 -156 75 91 82 -6 333 -56 -56 34 -119 -141 -48 -154 -242
6541 -242 -181 -201 -42 -35 44 109 -179 77 62 -23 -232 -325 60 -221 17 10 -199 269 -133 -165 -149 -236 -154 12 -156
6566 -156 178 -314 11 -28 -126 353 226 68 116 2 -98 -57 28 90 -171 -35 -202 -122 -130 -157 135 -122 -125 19
6590 19 112 233 -137 -255 -170 -52 48 -3 9 -82 -86 50 -135 74 -172 8 149 -212 151 84 34 -48 6 9 169
6615 169 256 123 220 39 -187 54 17 -102 -24 291 321 -140 89 58 120 105 -58 20 -92 159 -32 174 262
6638 262 6 5 111 -86 10 111 38 52 -11 122 -55 64 331 43 -1 37 58 309 23 -129 -110 203 -375
6661 -375 44 -176 -205 70 -6 -101 -104 30 -54 102 -199 -216 -99 114 107 85 56 -175 73 -76 -122 54 128 86 -42
6686 -42 -96 220 -104 55 -116 -298 -38 -222 0 77 -105 327 34 -226 -163 -298 19 29 -240 -72 -129 155
6708 155 152 -119 -157 -112 -20 -18 37 92 33 28 -28 36 248 -18 216 131 288 -77 173 248 -98 467 23 -178 43
6733 43 -68 56 256 -68 -108 -175 32 33 250 40 -91 -228 -128 101 2 -101 228 -13 99 -38 216 -94
6755 -94 17 -69 56 114 296 -110 58 -97 -75 -14 113 1 -178 254 14 74 -91 -175 -1 -132 -77 -11 -30
6778 -30 65 146 -144 137 20 49 130 56 -20 -241 113 -174 -21 48 82 -190 -255 145 -205 -87 -5 141 -34 -55
6802 -55 61 31 -276 3 -119 -75 123 -128 163 -1 -206 -191 -15 119 92 285 -258 66 -224 -112 -37 -8
6824 -8 163 25 147 26 -161 -57 85 -237 141 -171 94 -84 -45 -213 161 -20 80 228 63 101 -27
6845 -27 -97 55 129 -115 378 -197 247 -197 -266 -89 -144 -91 -322 -206 64 -85 -106 23 45 -354 291 200 146
6868 146 -48 -181 -296 17 314 -14 8 152 -99 94 -136 -106 -439 -9 181 -18 181 36 -62 71 84
6889 84 289 88 -68 58 247 75 -298 155 -164 -195 231 164 -114 279 98 64 194 -143 -60 56 -72 -33
6911 -33 -35 43 324 227 227 15 228 301 172 176 -129 -16 20 10 130 -339 132 -101 171 192 74 290 48 368
6935 368 23 -35 12 -80 128 354 131 13 -56 -32 -48 -162 26 116 162 -56 189 182 -98 120 -29 90 87 -104
6959 -104 -205 30 -105 195 150 199 61 -26 199 77 147 94 -193 -55 -57 145 -176 -288 -26 46 59 -156 -61
6982 -61 2 183 -70 -111 -282 7 39 -123 233 131 86 -269 49 -100 68 100 91 -119 -104 216 51 155 -49
7005 -49 -70 23 140 119 -73 219 89 -26 169 267 16 -295 -67 -66 -275 235 48 -15 -191 -214 82 45 159
7028 159 -100 -69 21 170 82 -231 -214 94 200 -202 -148 50 119 -129 -100 3 -170 334 154 220 120 72 30
7051 30 -19 -93 -16 -100 -168 59 -119 -198 215 19 -26 -12 320 76 -71 -169 -91 -4 145 -46 -157 131 22 -134
7075 -134 49 -389 -78 -260 75 122 -154 52 -76 142 25 137 -250 231 -230 257 15 101 -202 8 19
7096 19 112 108 254 105 -37 -314 -182 -168 75 0 -230 126 242 166 29 125 136 2 78 107 -49 228 104 52
7120 52 181 26 126 -32 -41 -84 132 74 -81 296 -45 101 107 -103 -299 176 -191 -34 58 -66 7 37 73 164
7144 164 338 197 -52 13 -26 -5 -42 -178 0 39 -86 39 -248 -144 -314 97 -41 248 -5 -23 113 111 47
7167 47 -17 263 -159 84 -10 -238 -111 -132 27 255 51 -12 -26 28 -97 -395 -89 -191 14 210 -213 305
7189 305 88 -37 100 -21 22 129 -6 -132 16 -11 27 160 84 -130 174 -272 333 -179 -64 213 -66
7210 -66 94 -109 80 234 202 -67 -73 -182 -181 142 107 170 -18 26 -138 138 -1 -297 -3 -136 196 88 111
7233 111 187 -73 -94 281 91 321 78 119 357 279 -60 -119 -127 -29 -74 295 1 -49 29 -239 125 123 -56 -321
7257 -321 92 -178 108 -305 -18 -104 30 45 -25 70 -79 51 -70 -48 220 193 -41 137 158 -33 -98 46 -191
7280 -191 94 3 -11 -31 -176 -58 147 -90 -255 129 -206 6 -82 32 -107 31 68 211 61 -76 40 107
7302 107 -127 -32 -309 -208 183 -77 -88 117 3 -70 94 -33 6 -44 285 173 -175 39 52 -35 88 61 11
7325 11 -70 -3 111 167 110 -106 8 -217 73 -186 38 11 -46 115 69 -130 -212 -385 -37 327 -119 198 26
7348 26 -133 95 -83 21 234 -89 24 1 9 59 250 17 -32 -172 -93 -87 -25 244 15 39 50 -125 10 52
7372 52 0 -103 301 -98 -67 -291 -33 9 139 -41 -1 292 6 -110 -91 72 32 92 144 -179 -17 260 -204
7395 -204 -195 94 445 -91 -222 338 -78 -98 160 -183 20 -300 71 49 -260 -115 184 2 -97 204 45 -78
7417 -78 -422 -110 308 63 -14 206 -103 34 -255 48 136 -59 241 -87 239 2 59 58 343 -73 92 111
7439 111 -21 97 174 197 -292 -172 -12 -172 20 221 -29 -41 114 84 58 2 116 226 -135 5 67 16 150
7462 150 46 212 -143 -206 -82 86 -86 -210 44 47 -192 38 56 -42 18 -116 -179 -5 -30 52 -153 30 -279
7485 -279 -19 104 -106 160 -8 106 -180 111 103 -78 210 -216 -111 -61 -185 -72 -160 126 305 -83 -27 227
7507 227 -37 -176 58 -25 -175 41 -69 -28 -144 148 54 -28 -48 157 -6 -88 -110 14 92 120 -147 -170 -309
7530 -309 17 -177 -197 13 -111 112 -205 299 -254 5 -74 159 65 -147 -64 -31 63 6 -194 78 69 58 -189
7553 -189 -76 -169 -23 179 -367 -127 -70 -4 2 -62 24 119 -20 -86 110 -88 129 51 -217 171 -85 -207 35
7576 35 163 -127 176 97 -75 -101 289 86 133 -202 7 250 -53 -237 -53 163 -88 -30 277 157 149 169 94
7599 94 -290 -48 60 -121 136 -82 -113 -2 -141 67 -14 -8 -65 -227 -20 206 214 -97 -147 98 -118 46 -40
7622 -40 112 -71 268 40 268 -204 -23 -182 -34 -95 -183 213 320 130 -47 83 282 2 120 -84 257
7643 257 174 -133 -104 225 -49 -40 179 128 -22 -183 138 121 -26 -50 39 -85 67 -45 355 170 -203 281 -14
7666 -14 -40 80 16 -43 157 -95 -267 52 56 -137 108 -260 74 -178 -167 -80 -125 -63 -100 -334 44 35 172 33
7690 33 117 336 -202 144 -17 61 -24 -13 -123 -120 65 156 122 143 64 -143 31 252 37 28 -101 -298 167 95 -27
7715 -27 47 -14 -282 19 65 131 -112 215 -542 -40 -245 -195 135 60 110 -44 -201 226 -144 -9 151 -2 130
7738 130 195 167 71 -82 89 -122 -131 -32 -193 -212 -206 108 -144 171 -10 55 -26 287 -101 35 183 -382 174 7
7762 7 -4 122 -42 130 171 -168 59 -250 -33 45 -3 -34 200 -150 28 -65 78 -191 -401 290 -117 13 -15
7785 -15 -204 283 136 -195 -30 116 -118 -39 -13 -10 154 213 9 187 -67 9 113 -42 182 -375 -193 -90
7807 -90 196 11 -184 -317 68 47 34 68 -50 165 235 -367 43 -8 -26 179 10 -166 -161 28 5 101 169 69
7831 69 205 37 170 59 -153 -283 -304 19 124 -310 -208 -283 -67 152 -4 164 166 -106 50 -157 -142 -22
7853 -22 25 51 279 -182 -7 -38 -221 -261 -71 -76 -168 9 -53 -154 173 8 106 -55 139 -146 -82 -104 -283 23
7877 23 -96 53 149 94 55 -10 67 -178 -9 -204 -171 50 39 -89 97 307 -86 381 -179 173 -248 -111 84
7900 84 -41 -54 -37 -53 -4 72 255 89 -71 317 15 -75 175 224 171 -144 -126 299 -64 65 -400 35 -70
7923 -70 -91 222 -281 -66 87 57 210 -145 76 48 -4 31 12 -143 -40 -45 82 65 152 81 50 -56 88 -11 -178
7948 -178 -102 -202 -174 44 65 83 56 191 -45 46 -320 234 -71 -95 310 -1 -199 127 -240 -124 126 32 55
7971 55 101 133 -1 -50 -41 -52 113 74 94 25 126 -104 175 -152 192 204 160 571 287 66 -184 -58 -121 -255
7995 -255 -70 222 255 -139 164 -78 385 -14 -62 178 -110 -42 -44 55 45 122 62 -139 -88 51 278 -42 -142
8018 -142 -52 37 152 18 -143 -59 58 -5 121 73 115 62 144 218 121 -62 -160 -172 -24 -44 185 13 70 41 -99
8043 -99 23 -69 22 11 189 -157 -432 265 -204 -133 173 15 214 -155 -191 -167 31 -63 130 17 105 1 64
8066 64 -67 -45 -78 -186 70 92 320 -91 -172 -73 240 -72 -249 -29 -240 24 -209 63 -104 28 -137 -116
8088 -116 199 47 -106 -82 -167 143 181 117 -140 86 280 -143 211 102 -126 216 -17 -5 55 14 190 -159
8110 -159 366 -52 132 -14 -198 7 119 -75 272 13 74 -225 -125 -386 1 -101 325 -120 -181 -12 -147
8131 -147 -37 -87 -6 -328 248 -293 27 247 111 -136 280 -117 347 -70 139 -10 -140 -229 147 -132 78
8152 78 -99 -159 105 -137 77 -81 32 108 -9 -117 -143 67 -22 -14 7 -145 -69 -228 -202 -7 125 106 -161 163
8176 163 68 -135 40 -61 -55 41 -100 -171 101 87 -41 6 65 -8 -232
8191b32
$$ Imaginary data points
##PAGE= N=2
##DATA TABLE= (X++(I..I)), XYDATA
0 0 0 0 0 0 0 0 0 0 0 0 0 -8 8 -8 8 -8 16 -16 24 -24 32 -40 48 -56 64 -72 87 -96 112 -128 147 -168 192
33 192 -217 245 -275 309 -347 388 -432 481 -534 594 -658 728 -802 888 -977 1077 -1186 1308
51 1308 -1440 1589 -1753 1937 -2143 2381 -2653 2968 -3339 3788 -4337 5028 -5935 7175 -8986
66 -8986 11898 -17355 31229 -150413 -213998 31421 102079 189522 207860 153565 13389 -83127
78 -83127 -158441 -172815 -134490 -32524 70305 147548 152298 115696 40223 -54214 -133381 -138741
90 -138741 -95238 -24362 48224 101826 112449 88867 28806 -41427 -89753 -102219 -83657 -24612
102 -24612 42604 79646 84893 66706 21055 -29150 -62934 -73856 -55465 -15678 17876 47933
114 47933 72072 57590 11699 -20738 -40783 -58635 -49312 -13734 15736 37965 52254 39386
126 39386 11268 -10162 -30499 -43236 -34213 -12697 7693 27446 37313 30181 13927 -6264 -25998
139 -25998 -33301 -28390 -15263 6298 24765 27392 20632 8331 -8752 -18904 -17227 -15518 -10937
152 -10937 -169 10268 18280 22909 14650 -2937 -14678 -20177 -19641 -6594 8238 11213 12324 13565
166 13565 6668 -3143 -7519 -10342 -11687 -7360 -990 6865 13897 12404 4747 -570 -6816 -11391 -7513
181 -7513 -1766 -1089 2253 8378 8507 5303 2335 -4356 -9976 -7266 -3186 138 5617 7355 4551 2725
197 2725 904 -2331 -4211 -3697 -3715 -1814 1867 3931 5617 4509 -139 -3504 -4824 -5465 -4276 261
213 261 2292 2363 3042 2208 -753 -1964 -1896 -2767 -1748 -186 616 1441 2988 2620 1645 -21 -2337 -3652
231 -3652 -2248 -85 1584 2997 2213 -273 -916 -723 -922 -482 -714 -1553 -1006 1294 2206 1916 1565 -162
249 -162 -2459 -1966 -707 418 1002 1232 243 112 745 648 1 -1073 -1699 -965 258 1578 2034 769
267 769 -120 -760 -330 -549 329 464 -347 -606 87 1088 787 273 -492 -1585 -1815 -341 616 545 122 -233
287 -233 -393 -377 -47 314 150 -314 -654 25 284 636 719 291 -790 -1035 -560 43 506 702 406 -160 -131
308 -131 -291 64 254 -357 -252 -334 -195 247 568 429 214 -338 -757 -478 91 574 386 29 -512 -131 417
329 417 438 431 -517 -496 -646 33 345 598 302 -432 -423 -173 64 361 274 -153 -266 -375 82 595 389 -297 -759
352 -759 -697 6 84 536 263 -292 -356 -117 -103 240 332 27 -329 -492 -18 604 584 130 -343 -743 0 351
374 351 492 204 50 -42 -234 380 172 92 -30 -356 -383 -16 417 313 24 -28 -358 -82 181 121 219 23
396 23 -10 -345 -166 214 403 290 -196 -523 -407 124 103 438 250 -537 -738 4 324 167 51 -297 -309 -324
418 -324 259 189 19 46 -485 -539 -123 33 381 21 -566 -463 36 79 206 318 -54 -508 48 248 -41 367
440 367 3 -533 -545 73 84 3 198 -328 -207 -13 161 108 358 -199 -609 -37 -26 -120 250 -41 -287 -134
462 -134 79 181 -10 530 220 -465 -259 49 82 77 94 -228 -101 30 -63 104 -151 -95 108 -9 213 325
484 325 220 33 -109 23 -111 -166 242 -64 49 27 -163 -154 332 301 -251 43 99 -111 241 441 -67 -148 -83
507 -83 -40 196 29 -59 -25 1 88 -14 201 -65 -259 -58 -263 -444 159 575 29 20 -21 -312 17 214 312 -40
531 -40 -31 -63 -226 232 17 100 105 -35 -289 116 21 26 158 5 -263 -160 211 178 277 122 -181 -300 93 1 -29
556 -29 -160 -7 -192 14 137 -295 -5 114 -57 57 178 79 -160 -99 -185 -28 45 -183 -133 12 79 -258 59
579 59 310 95 109 25 -197 -351 105 253 67 -43 -254 93 3 298 -18 9 -117 -447 189 -252 262 -142
601 -142 216 -61 -60 80 36 -27 22 -189 -423 89 215 71 271 -98 -290 324 330 -128 -36 368 -82 -240 -123
624 -123 56 23 115 85 -423 -207 -146 -244 170 -136 -267 -109 232 31 245 31 -108 15 -29 88 255 -25
646 -25 -30 -283 -206 -225 41 73 -166 252 151 -257 174 397 -8 -156 22 91 392 -88 -477 45 148 42 -5
669 -5 -316 -63 75 -164 -380 143 185 217 -8 138 27 1 233 5 302 -113 -123 -125 99 -59 -185 -126 158
692 158 77 -14 350 182 219 12 -91 105 -395 -98 -179 8 166 -142 -155 -92 142 -54 179 -133 183 -97
714 -97 -25 130 152 80 116 -84 140 3 36 254 104 -215 121 85 -68 -38 5 -30 -114 103 -150 25 5 -68 136
739 136 -103 -88 62 70 157 -64 58 10 52 221 -76 -120 23 -73 273 29 -120 -66 -58 89 -105 5 271 -69
763 -69 43 4 283 -2 -347 -1 48 -35 -173 51 242 -264 101 1 -36 -146 191 -30 -9 -50 8 167 246
786 246 -135 -144 -159 4 88 101 -318 219 179 -11 270 -18 -31 242 -65 -81 -138 423 123 -85 -158 19 -312 -4
810 -4 180 -36 298 85 -12 56 -8 101 265 199 10 88 107 -44 -99 -106 243 -2 -190 -68 -93 182 -2 -251
834 -251 128 -50 -36 146 -52 -112 -111 264 -31 168 -257 -253 -153 -247 165 235 56 136 -182 141 -131 -185 59 185
858 185 -112 -119 -79 35 -42 -93 -95 -116 -32 163 497 118 133 91 -125 -292 8 -3 156 228 -367 -21 -90 74 10
883 10 34 8 14 198 378 163 -174 -44 108 -115 30 49 418 -18 190 114 95 -153 -84 -241 -84 -116 11 -119
907 -119 112 36 50 -34 -65 99 -15 169 -53 198 198 191 65 330 -64 -158 -127 89 -36 -79 182 -100 -81 -55 -362
932 -362 -34 -133 -231 60 -51 -166 -41 43 0 0 -297 18 142 -36 -247 -158 133 235 -1 -18 203 -117 402
955 402 341 -230 -209 -52 191 -150 25 75 188 -67 16 -115 213 124 244 50 92 -84 -101 -322 162 224 -111
978 -111 228 189 -120 -73 8 98 -86 -255 -90 48 -103 1 -126 -11 9 75 -198 60 15 -139 85 37 24
1001 24 -137 -47 -152 20 -17 -95 50 180 71 -122 150 -89 120 -74 8 -117 159 -100 108 -46 66 -53
1023 -53 115 115 -115 71 -90 -246 220 -109 -137 -122 -55 -95 -72 -111 -267 -140 80 -15 -175 0 -2 -153 -292 -64
1047 -64 -70 153 34 -57 -446 49 73 21 58 -39 -2 12 -110 2 -2 -252 167 -81 -93 -219 -17 20 101 -34 56
1072 56 -89 184 -148 -160 -8 123 -188 -129 16 -12 120 131 -111 41 -171 159 -145 149 284 -53 187 45
1094 45 -32 -57 14 5 -80 -226 232 89 168 121 -86 160 -73 -43 -51 -58 -306 32 -24 -210 2 -338 -136 281 -220
1119 -220 -10 149 35 -122 -111 96 87 -239 -89 40 145 -165 -146 -59 -85 -176 75 -54 -69 -155 74 57 -204
1142 -204 -107 225 -45 -44 100 -165 174 232 208 -156 -181 77 -128 87 100 41 47 21 387 100 -81 139 -26 -226
1166 -226 -84 97 -34 122 339 -18 -26 27 -63 -116 18 -59 -7 -228 115 29 -106 -15 -38 -47 40 171 243 88 -96
1191 -96 178 59 -103 -19 -28 41 43 109 -21 95 -68 222 -108 2 1 -111 -113 -156 124 -24 -173 -55 45 -89
1215 -89 18 209 57 -202 99 33 50 173 -63 -42 9 181 41 -86 -12 214 43 -164 -194 196 -301 -83
1237 -83 -298 -67 -44 3 158 49 -126 44 -260 96 84 232 105 -148 37 -13 111 -32 194 21 176 -117
1259 -117 -74 -34 -68 268 100 -134 -57 -286 -57 -157 138 -20 104 63 62 97 50 -6 -286 157 -128 59 174
1282 174 157 -120 64 1 123 -140 -54 -249 -25 -70 -81 176 -52 -53 137 -26 -77 26 -171 7 -150 107 131
1305 131 148 16 90 75 42 -115 -204 -144 91 0 147 -9 -59 20 -154 -20 -147 39 93 -251 -86 -47 -56 155
1329 155 -60 5 77 4 103 -73 30 -170 189 -126 25 251 -6 -21 121 146 -197 112 136 -25 35 75 -61
1352 -61 86 83 209 284 -53 -116 90 -20 -44 -205 159 -186 103 -17 -10 -31 211 201 -180 261 -193 -28 -30 -173
1376 -173 108 196 -64 -185 -63 -114 -187 -185 -56 329 -24 -52 31 112 -185 58 -5 -59 47 -1 161 111 122 150 245
1401 245 -64 3 117 -99 113 107 -64 -264 138 70 92 -2 263 50 -78 261 28 49 286 92 115 -192 -75
1424 -75 -27 190 68 109 130 -168 80 -17 11 -5 15 -30 -35 -161 -268 108 271 126 62 -119 -66 38 27 59 62 -209
1450 -209 -41 4 -10 -292 -83 -250 14 146 39 181 -62 -219 -59 263 -163 -9 -68 -115 145 42 -143
1471 -143 141 47 275 189 64 140 82 88 -168 18 -159 -43 110 -42 -261 107 186 -16 -51 106 32 12 -199
1494 -199 70 53 -88 -203 229 -22 -70 104 -47 158 -75 11 -100 99 21 -67 25 -2 38 -92 -122 -121 -45 -14
1518 -14 48 141 100 132 -49 42 13 141 -356 57 129 88 106 12 -39 -81 122 -21 93 -51 1 -87 -101 -14 36 115
1544 115 -209 -30 -221 -38 321 -27 -25 -244 -4 83 -14 -42 -60 4 -194 159 19 -33 -86 -69 141 -58 49
1567 49 -35 -28 -238 70 -264 -28 173 -117 -340 -229 -327 -272 107 65 -86 20 1 -172 -216 208 -27 -136 110
1590 110 11 -12 183 74 106 130 233 361 -35 -245 38 128 -6 -158 48 -100 -248 143 -150 -157 0 111
1612 111 -19 84 116 73 91 258 -113 -62 100 29 -104 -174 -359 130 28 18 -141 -143 -70 115 -169 11 -252
1635 -252 -258 60 -16 81 348 105 99 -22 156 -243 88 -108 311 88 155 -104 175 -197 -50 -56 79 34 -533
1658 -533 65 -27 92 57 -108 -92 -45 158 57 20 -54 -31 187 -144 -432 -133 -57 -73 -92 -436 -110 -210 131
1681 131 14 194 -10 103 -26 111 -49 -95 -67 23 159 113 18 -384 -80 -56 170 -33 -315 -106 115 40
1703 40 28 130 -65 170 24 -112 -36 263 62 -90 -186 118 74 135 -189 -127 152 2 117 200 168 95 -71
1726 -71 9 -337 -83 219 239 333 59 123 159 138 -175 15 110 -64 133 -86 251 6 107 -154 116 -65 64
1749 64 162 -107 70 -23 47 -44 -104 57 80 320 94 -55 -167 -193 -193 -197 142 55 -73 130 193 -102 -16 18 -63 146
1775 146 -42 2 59 102 31 174 127 86 -37 -59 -1 4 150 -22 -151 163 -23 -116 130 243 -92 -329 -172 34
1799 34 -99 152 -89 -50 81 -48 163 91 -122 127 200 12 4 61 6 37 252 -14 -62 -125 -41 -31 -44 -63 -4
1824 -4 -165 82 -127 299 125 -63 55 -96 -8 215 124 51 -28 102 -56 60 19 -105 75 -196 -81 31
1846 31 -20 -112 158 242 34 100 56 -225 97 -18 237 -59 -154 6 85 -105 -43 -60 43 17 114 3 115 9
1870 9 297 26 -10 -61 -120 -160 218 56 -17 161 34 65 -199 322 -23 -129 -101 263 23 -38 -190 -179 102 -39
1894 -39 4 215 118 -79 259 49 264 82 -136 -119 25 -195 -110 218 24 -69 -254 42 -221 49 114 67 -270
1917 -270 -84 26 182 5 -50 -117 -75 123 -116 -288 29 -206 -188 -138 -60 116 -5 337 -12 -106 -5 157
1939 157 -193 14 72 -178 -81 18 -118 211 77 -121 -121 96 -189 -167 -204 -22 -89 -52 -59 -60 289 -124 -273 29
1963 29 4 23 16 -234 63 -134 -48 -338 64 -91 158 -83 -143 -202 -178 85 36 176 -142 229 54 -146 -69 116
1987 116 63 -16 133 73 -276 -55 -54 -46 -63 165 108 77 -84 -256 -25 74 95 -14 -17 176 63 -32 -291 54 113
2012 113 242 -202 87 403 190 271 137 7 66 185 82 -18 90 246 320 -85 34 -232 -172 56 20 15
2034 15 -215 10 -89 63 6 -159 65 -31 145 145 -235 146 95 -108 -34 222 -43 239 -21 -122 131 188 102
2057 102 -49 174 85 60 80 -131 62 -18 -108 147 -42 116 -144 -235 8 -102 -1 -300 42 35 -56 314 43
2080 43 -43 -69 202 -152 105 63 -19 -109 141 -119 -24 -122 -47 106 56 -84 193 -13 -154 -62 -136 145 125 275
2104 275 -30 75 -40 36 41 31 0 -203 51 41 37 -129 -42 53 -178 174 160 37 -4 -34 -62 -24 -20 -135 -342 226
2130 226 -79 148 -60 130 65 90 -105 132 -45 175 179 -225 233 154 -42 4 8 2 50 -293 262 -252 119 -25
2154 -25 166 202 -47 -160 13 167 67 196 -19 -143 -74 -37 62 42 96 -271 358 195 71 -128 -31 -44 -141
2177 -141 -32 -53 67 -17 28 -236 -34 206 14 -50 -103 36 -74 -120 -99 41 143 7 205 48 192 19
2199 19 39 81 95 251 115 110 97 -75 -67 -254 20 101 -409 56 -233 -8 -42 -30 -34 79 233 239 158 176 -43 9
2225 9 -36 -160 -36 -102 -222 -72 -86 -38 -46 -184 22 114 130 114 74 121 -142 23 -17 -19 -26 26 -12 -137 71 -110 32
2252 32 245 133 134 5 -21 -210 22 118 -5 -89 30 92 -154 -97 -219 160 -44 -109 76 -34 33 36 131 -7
2276 -7 -153 -39 -233 60 100 -39 -72 17 -100 161 152 204 -32 -135 -9 8 164 -9 15 5 7 -103 6 -30 -124
2301 -124 -136 17 -161 -17 -160 65 -96 138 -54 228 -71 -49 41 -84 53 235 5 -81 120 -259 -80
2322 -80 -42 62 79 95 37 1 -46 -146 159 -196 -17 40 41 -231 172 -133 71 65 -253 375 -24 53 -160 -106 115
2347 115 98 -38 -146 113 135 -134 232 -89 281 -92 75 -215 -266 207 183 -85 -266 -163 52 26 105 43
2369 43 128 56 -87 -84 -50 -39 -212 9 -175 -160 -86 -111 161 -19 -2 0 19 -59 -174 3 32 -93 413 20 -32 -133
2395 -133 -117 -11 107 205 -148 -129 29 -121 -154 -56 -88 126 -29 -198 62 247 -44 -102 -113 -117 -239 40 30 -158
2419 -158 -97 182 29 76 43 -13 -240 -171 -37 279 208 91 -53 11 -41 -74 -94 -6 6 139 -96 -112 163 190 -193
2444 -193 -269 -12 -12 83 -198 54 -165 -84 -73 176 1 -132 117 45 -57 -214 -55 -190 82 -186 -246 -77 87
2467 87 34 -39 222 -177 -62 302 236 -81 248 -68 -135 -132 -229 235 -16 -179 -166 66 -153 81 -13 51 -8 -120
2491 -120 -109 110 -310 246 131 335 279 162 6 -7 155 -57 -45 -30 116 -147 72 -56 -138 79 258 -2
2513 -2 250 96 -141 29 100 77 -121 207 17 88 34 -194 -61 197 24 -5 11 173 2 16 133 -49 54
2536 54 58 -288 -27 135 1 52 -40 -141 32 -94 42 178 180 -151 -335 192 136 -252 -40 79 -88 61 78
2559 78 -62 135 127 271 -101 50 -87 263 194 -126 -11 -111 141 156 -207 228 183 84 107 -83 97 -248 -117
2582 -117 139 -46 -91 -43 -178 209 -142 32 93 30 216 106 93 -168 -140 1 56 124 -234 273 -232 -334 -24
2605 -24 110 -15 110 201 -169 105 -175 -145 -19 -193 -118 -138 61 151 169 -58 -90 84 -266 125 -4 -216 -174
2628 -174 -323 -91 91 23 58 107 44 -247 1 -74 -153 64 -235 14 3 -120 -150 -251 -237 155 29 43 212
2651 212 63 -181 -84 -59 -3 -3 127 -21 -10 -82 50 -272 -131 148 172 -185 148 40 251 -123 38 -41 -20
2674 -20 124 -52 177 43 -54 -132 52 -31 -65 56 -269 45 -98 3 233 142 -121 -103 -17 -218 -25 -104 -126
2697 -126 336 -163 -133 189 -37 -149 -278 143 210 51 185 21 330 -81 -116 101 -223 -101 328 -239 51
2718 51 150 24 262 -47 -50 208 13 -25 -90 9 -95 265 195 77 -54 -6 220 -10 -31 -71 79 -61 48 -88
2742 -88 -11 -223 -269 12 -26 -82 -255 103 -139 -119 -29 97 -36 -3 149 126 -157 159 -142 -211 -72 108 -72
2765 -72 150 -119 146 56 -16 117 -31 75 -235 52 -87 -32 118 -138 -128 52 8 -172 228 -65 -221 214
2787 214 -84 11 255 -149 136 14 -208 137 215 13 -51 85 -21 -28 27 141 -269 -98 26 32 -9 113 -58
2810 -58 -133 -38 -172 122 99 145 91 248 -12 -64 47 247 74 97 -102 -153 -120 -43 241 -120 -46 47 121 19 -80
2835 -80 -67 189 294 143 184 -124 75 -28 70 -15 -310 -64 -270 -14 110 148 162 225 -164 101 -175 -243 161
2858 161 172 38 28 27 0 -123 141 -108 66 50 104 8 -145 -146 86 23 208 -81 -247 -124 126 66 -247 -195
2882 -195 155 -24 -17 -115 204 78 151 -164 -84 -135 35 16 -73 239 5 -180 14 97 93 131 37 -22 23 -145 64
2907 64 186 75 111 -268 192 -178 65 177 64 -337 37 67 -160 -35 -196 -74 47 86 165 -176 -179 -93 -120
2930 -120 133 91 248 -37 77 167 -271 277 123 95 75 -65 77 36 -3 -143 -149 221 -221 -47 62 31 -267
2953 -267 -6 242 -41 -3 -106 132 208 -205 -146 -213 -210 -15 -109 158 -41 -131 71 -133 107 2 45 62 -78
2976 -78 -20 -200 -97 -229 42 -142 -152 -15 -116 -16 -96 67 130 -193 -91 104 89 -93 37 277 95 123
2998 123 124 172 130 -117 -23 -292 -78 -122 -289 51 67 -93 16 193 -65 -24 -33 -11 7 -55 2 177 85 -71 33
3023 33 178 19 -55 -103 -153 268 93 -29 -128 30 -52 -73 110 -14 -137 -124 -96 195 179 72 -337 -80 -95 34
3047 34 11 -172 -46 46 33 -195 -180 -46 23 193 -47 15 -66 218 133 -263 -41 -113 -155 8 272 70 -52 -286
3071 -286 -99 -319 94 -261 214 -46 51 218 34 88 4 14 -171 -96 -184 -204 394 115 149 -115 -88 227 243
3094 243 -50 -154 13 40 180 -185 68 182 -9 102 35 1 -128 -171 307 35 27 -183 64 -48 -40 14 -141
3117 -141 105 -102 148 332 38 -41 -65 169 -40 251 72 -126 -20 -257 26 -283 200 94 -37 148 -192
3138 -192 -53 -272 165 -83 3 -290 -200 78 -25 37 8 14 44 97 -19 -308 -107 -13 128 -84 -60 -181 -40
3161 -40 -21 96 -170 -8 108 9 -185 -107 22 138 -12 160 -53 -76 376 29 135 97 -19 -143 34 11
3183 11 -156 -317 -119 25 111 -243 -177 -106 -42 98 75 38 -1 72 216 12 -312 141 -18 -107 -35 270 -81 160
3207 160 154 98 -115 5 119 -25 -210 -205 86 132 45 -36 66 166 171 -90 -37 -51 -95 177 -128 -63 219 124 40
3232 40 323 89 -186 54 36 106 -45 146 -310 257 -34 39 -8 70 -52 157 -266 -46 -59 -78 88 -33 -21
3255 -21 -162 -156 -85 128 -166 -121 -24 132 170 106 -216 84 141 -4 -55 -310 225 -47 -41 155 175 42 194 244 -86
3280 -86 11 343 -86 3 220 154 -87 31 18 -179 67 -35 -199 270 176 -55 -152 -75 9 -47 157 -25 139
3303 139 -279 308 -124 74 157 -125 80 52 -75 -1 38 -109 155 -172 -74 62 239 -103 238 -349 -93 275
3325 275 -36 -1 -79 -130 121 223 132 143 107 172 276 71 49 -55 341 34 150 218 0 -69 -124 -39 -18 22 44
3350 44 -109 -306 -53 10 185 37 77 65 99 220 219 -142 90 -167 -69 -146 -113 113 -133 85 97 108 -95 -189
3374 -189 -100 18 -51 -292 38 -131 -85 -130 -69 224 72 18 -143 17 -12 -299 75 345 100 49 86 -117 137
3397 137 -50 138 92 -103 4 -158 -217 108 -8 -34 90 60 190 325 -120 -177 -84 69 132 7 14 310 59
3420 59 172 77 68 -269 8 214 -127 -33 73 221 206 -133 51 251 -160 179 -126 -103 60 -85 87 196
3442 196 42 65 22 -82 151 26 44 100 336 -315 -351 132 135 -73 -39 -140 121 142 -79 133 -41 -9 -6 -12 276
3467 276 -40 -67 14 79 23 28 -53 -349 150 242 -9 -99 128 90 141 34 -51 16 120 -305 175 -104 33 203
3491 203 51 86 -40 -204 -192 -128 -54 -6 -274 217 -86 -319 -23 -66 -85 -206 -131 108 -270 -47 -107 216 -156
3514 -156 -6 -15 -166 240 121 -183 261 36 238 -54 -89 23 -322 -44 -50 216 322 249 66 -299 -114 -28
3536 -28 147 -66 94 181 89 23 -79 170 -43 -15 -131 56 84 -144 58 -132 -121 -91 -137 -94 -160 -279 82 -143
3560 -143 -82 -35 70 -162 -56 -4 -135 -73 -155 -21 150 -162 17 -185 -131 60 -92 129 -67 -11 119 69 -299
3583 -299 -245 20 -40 126 47 35 -151 -15 150 -68 -24 101 -91 -33 88 56 110 22 123 -28 49 -3 -185 72
3607 72 86 -29 -110 -122 -220 133 325 -17 323 169 163 -7 101 -49 -54 293 24 40 162 -176 -93 154 27 80
3631 80 76 1 -98 -201 -289 -155 -76 119 120 -95 -51 -27 122 93 30 102 -181 -105 100 -88 110 -173 -347 71 44
3656 44 -120 -176 -52 -40 165 0 1 360 -145 207 -136 35 50 -71 39 126 222 -123 -9 27 17 84 -277 105
3680 105 123 -8 -46 -87 -117 -299 -179 338 -78 -120 -163 65 -21 7 -299 186 79 -173 266 -84 -60 -81 -8 185
3704 185 312 -116 -112 87 206 -242 69 -134 -12 0 -59 -147 44 -237 288 -86 0 -129 52 -51 -89 33
3726 33 76 234 216 46 -76 218 82 -29 174 -140 -360 17 416 -195 -345 -177 -127 219 218 -6 36 -318
3748 -318 50 -86 69 49 -14 -220 185 45 101 116 16 -70 282 166 -104 103 87 -89 26 220 18 -280
3770 -280 33 -92 0 -77 -66 166 134 -143 -182 22 -19 -67 -39 -127 -400 28 9 -75 -139 -179 -162 -108 -66 26 22 20 -115
3797 -115 -154 136 66 290 82 -292 206 -202 218 -183 84 -152 -21 236 -139 -285 -107 56 -155 -99 -105 108
3819 108 -148 -108 136 -201 119 150 -34 -82 -121 -22 -210 39 -167 -29 46 -164 211 -189 -326 55 -206 203
3841 203 -40 -37 17 -4 -70 75 -144 -177 22 -200 59 73 -180 -55 144 -46 -34 186 -106 195 -158 134 -6
3864 -6 222 52 20 52 202 200 0 -76 -164 -32 -61 70 -35 -3 351 -138 15 -274 -13 187 -179 38 34 -55
3888 -55 63 199 -200 18 76 144 -57 192 77 210 -2 37 28 -33 -70 86 174 82 -116 242 -154 111 -40
3911 -40 -303 -173 -90 -164 5 144 207 -250 -307 18 33 -5 -139 117 43 -40 59 166 27 -48 -42 -139 -93 -47 -133 -161
3937 -161 149 -204 100 -265 -318 58 -278 -16 10 243 -178 126 290 122 240 -149 262 -118 -77 -3 31 49
3959 49 9 80 -282 -6 -24 6 99 -175 8 166 -240 -70 128 7 61 -89 -6 -213 200 -297 -108 12 187
3982 187 13 -71 12 120 108 1 0 -233 94 213 122 -156 -147 160 113 17 161 -98 131 -6 24 -113 -231 251
4006 251 136 207 3 -123 -78 -30 -159 -403 -19 -38 196 266 122 315 -62 -107 60 72 100 -125 113 40 -316
4029 -316 -66 163 41 -275 4 -105 -101 -83 -124 -112 100 -42 -192 -18 -67 -45 66 -134 -77 -3 -13 128 43 148
4053 148 71 -110 185 -10 -280 95 -28 47 -110 199 -55 -240 22 128 -14 325 -11 -78 49 67 24 -79
4075 -79 146 17 50 -69 389 282 105 -4 131 -17 -227 160 -65 60 -139 84 -99 -55 -23 -68 94 -20
4097 -20 33 49 -93 -127 -104 162 44 -75 -120 -34 13 -49 -147 17 -59 -193 22 -102 89 -223 -106 17 90 193
4121 193 -32 189 -76 -62 100 36 91 -34 -22 -94 -139 -116 -262 -245 -53 -214 -63 -126 -48 -45 80 25 112 -207 -133
4146 -133 37 17 -246 -76 110 -55 268 -150 64 -51 76 -103 -80 -90 -100 35 -85 -129 173 129 169 -107
4168 -107 -59 45 116 115 -120 131 253 -201 -132 -15 1 121 -153 300 -141 -289 308 -61 163 155 -23 -388 193
4191 193 -42 -190 -248 338 105 79 -100 5 164 201 64 65 -93 -72 -47 70 3 -37 42 -18 161 183 131 6
4215 6 -162 220 59 95 12 -304 -133 137 -85 302 -122 62 -10 238 9 -65 -172 -93 223 -123 -76 -120 -113 -204
4239 -204 97 -18 -59 -41 -145 -122 -77 -37 136 23 -21 144 145 219 31 -36 109 182 -142 177 3 10 0 -299 -78
4264 -78 -67 74 -179 197 13 211 239 330 -82 4 207 62 -336 129 -84 31 11 -65 -44 -123 -358 -267 140
4287 140 -251 15 -17 -202 40 81 8 153 -121 -52 50 2 45 -282 225 42 182 157 -119 38 -8 88 -79
4310 -79 55 -33 -234 -40 134 -250 61 -188 -76 121 -66 -160 -168 91 -25 51 -237 303 -137 -171 83 -113
4332 -113 -81 85 19 -44 -156 107 104 -105 12 -22 29 58 103 -8 -183 87 -194 -11 289 -351 26 -224 -128
4355 -128 62 80 7 69 -87 -139 -31 -319 -67 -1 -218 -96 -20 -257 -81 355 -39 -27 132 -125 -130 159 -174
4378 -174 -84 44 11 75 80 -270 105 249 -195 123 222 186 196 218 180 -38 211 48 -1 -19 -10 135 -46 138 -137
4403 -137 -288 -156 101 -57 -16 16 59 -51 125 132 7 33 239 182 17 -114 56 109 3 168 -164 47 -68
4426 -68 153 21 -109 -17 -104 -73 72 -276 289 -158 162 -124 -20 -80 134 -45 -194 221 86 -91 -52 -39
4448 -39 -74 147 -207 53 -86 -233 -146 -129 62 109 -245 68 -80 337 -55 -60 83 112 53 73 -316 -32 -57 -90
4472 -90 -140 147 129 110 -38 256 10 13 23 154 61 -115 302 167 -125 -35 91 -116 -116 -183 188 -87 208 102
4496 102 -143 -18 -57 -195 2 14 11 -103 38 15 -181 94 292 -26 96 -205 142 217 41 30 -174 5
4518 5 11 93 21 -26 133 124 54 141 161 176 23 156 -61 2 87 44 127 82 107 50 -167 -50 30 -86 92 52 -143
4545 -143 -66 -143 182 -102 31 -27 7 26 125 -263 274 -63 -181 -30 -113 117 -185 -331 -180 -50 -8 -73 -189
4568 -189 -200 55 -25 27 -31 -102 -30 212 -79 -72 22 -57 20 -291 -71 -90 56 257 -139 -196 141 129 119 184 38
4593 38 234 97 133 22 213 215 122 13 -53 -165 9 24 329 99 13 261 -150 34 194 108 -135 296 -23
4616 -23 272 -103 90 -101 -160 -13 -92 200 -244 181 3 -122 0 -113 41 18 189 -97 212 -47 -52 44
4638 44 -210 -165 153 48 163 -137 -109 -166 88 84 -221 -114 363 140 161 -169 127 -195 85 -75 118 96 20
4661 20 -159 33 271 -60 -176 -223 -104 -172 0 90 -180 -170 180 -111 13 -28 110 -34 -5 116 -22 26 69
4684 69 -100 4 107 -118 -268 53 225 -437 -12 -140 -4 -199 29 -76 139 234 107 146 -230 -307 -11
4705 -11 100 110 -18 83 -9 355 149 103 323 -391 107 81 -98 -159 80 185 -237 129 -251 132 -154 -58
4727 -58 -354 -89 -75 230 -71 -113 166 44 -95 -31 -199 -195 -265 23 3 -111 258 193 -70 94 29 -3 21 -37
4751 -37 26 -148 155 -43 287 -65 59 106 -320 7 49 -39 -38 17 152 41 28 -55 -86 106 -179 -43 147 187
4775 187 -85 -28 15 30 -253 107 128 113 -139 -223 242 -99 160 -103 70 -428 103 -82 221 107 -7 184
4797 184 166 38 77 36 -332 -185 -114 -64 -59 59 175 100 170 -108 -24 -3 -78 114 -66 88 9 -462 42 -126
4821 -126 84 234 4 -102 12 12 -232 283 -181 10 92 -319 -119 21 -42 297 67 234 218 -31 187 217
4843 217 34 -35 130 -155 137 80 -62 24 70 -10 53 -66 57 -58 -50 64 -357 20 201 -146 97 161 184
4866 184 -198 48 172 -95 62 -22 -85 131 135 81 -83 -9 -209 236 160 -29 -68 -3 -42 -179 9 169 148 190
4890 190 113 -22 -100 16 -168 135 -114 -28 7 -10 106 -113 -49 27 -180 -356 -239 -56 17 1 217 -250 117
4913 117 16 132 78 182 -212 125 16 -47 284 -254 30 15 -18 157 71 -5 -143 -61 124 44 74 -288 86
4936 86 -81 52 -104 111 87 -154 -58 47 -33 -325 59 116 57 -213 -75 31 -206 227 83 -133 -166 -159 40
4959 40 4 -67 -73 -61 143 171 -192 181 -121 -98 22 -49 68 25 252 39 -225 -77 10 1 198 -31 -186 22
4983 22 135 29 -221 -290 -122 -149 35 46 -110 -33 157 99 179 -63 -69 -5 -151 -156 5 -59 138 -96 -270 -31
5007 -31 108 -276 214 -81 77 -268 28 76 -156 8 -52 -71 50 320 -116 101 -87 -200 -165 6 -55 191
5029 191 192 -157 -52 212 -42 -173 -72 60 -86 179 -158 -61 -78 -33 103 85 -150 -174 17 205 -138 -246
5051 -246 -162 -114 -133 119 36 -263 -44 -182 -14 -152 195 24 91 -168 -137 -366 -275 -269 269 -299 -130 -261 80
5074 80 393 -100 324 -205 -359 -57 54 37 -174 73 -108 -132 138 -113 47 119 -24 126 -50 -178 168
5095 168 -166 52 -53 -193 216 -77 73 -122 130 35 65 14 274 -108 197 -88 128 -129 166 38 -128
5116 -128 -43 -83 -73 2 127 -401 -1 179 -89 73 -36 -74 -15 -183 248 -114 48 -71 68 225 200 155 -181
5139 -181 -80 119 16 -64 57 -94 -12 -25 -294 134 -19 -102 -3 -10 73 -3 -73 55 36 -167 130 -114 233 -40
5163 -40 -131 -96 -138 -55 -9 -68 13 65 103 -139 -32 72 -221 -129 -268 -109 -29 -25 -124 -122 -26 -380 223 211 -202 54
5189 54 -17 -21 -249 -2 108 -37 -53 149 -107 275 135 36 55 -53 -10 153 42 30 -32 152 121 -156 -63 3
5213 3 -221 -64 -85 -165 -261 186 3 233 153 -55 -63 -184 25 144 138 62 29 108 60 -95 -42 85 151 303 143
5238 143 -63 -101 125 -203 -108 35 51 -34 -210 171 66 -1 4 -187 -26 -133 -77 411 73 225 70 212 -17
5261 -17 80 -64 24 203 137 45 -212 -6 -172 37 -84 -268 -240 74 -28 -34 -39 -40 -102 71 -102 -89 -42 -85 -22 74
5287 74 54 -26 -370 185 10 -307 22 107 -8 1 48 48 -88 -139 90 -74 179 -45 101 -237 132 404 55
5310 55 -106 51 12 70 -85 19 110 68 164 -151 -26 53 -106 -103 -97 147 -303 -81 -193 -122 54 -141 -86 126
5334 126 -260 -58 -14 48 -13 153 86 2 -171 -315 421 -74 106 -207 60 61 -113 118 -49 -38 -242 -151 56
5357 56 -77 -221 -25 -288 15 342 164 35 -16 -41 264 150 78 41 262 68 -63 98 63 261 105 -175
5379 -175 -240 -13 -274 109 -87 -71 -281 19 -209 -237 -58 -161 -235 -201 12 -27 -201 -173 28 111 131 -81 75
5402 75 28 -8 76 54 -39 47 69 317 -120 -31 34 -13 132 147 -65 -209 104 1 -79 178 103 -6 -111 -40 5
5427 5 -126 104 -43 -140 -136 139 -81 80 33 204 104 45 47 -21 -6 11 103 207 -45 -222 -11 -41 88 70 93
5452 93 -51 88 51 -32 186 -381 -247 146 -104 88 -69 86 21 168 9 -173 185 135 115 54 -79 -8 -12
5475 -12 183 45 27 127 163 24 78 -117 -201 -32 243 -14 -130 -120 204 47 169 189 173 29 79 29 116 199
5499 199 -59 16 -3 -47 -175 -61 76 -71 184 -187 -31 -329 72 183 36 34 34 95 50 -194 51 51 -105 77
5523 77 66 -179 204 129 -183 -68 14 -53 255 132 -7 135 33 -5 -265 112 -161 196 346 -232 44 200
5545 200 34 230 -133 83 -1 -84 111 -112 -58 12 39 179 -11 194 -67 -146 160 -15 -38 151 115 -289 286
5568 286 -80 -180 74 -76 -319 141 -67 134 193 110 60 4 187 -93 -82 -101 -160 67 -26 17 -141 10 -3
5591 -3 52 -200 -48 19 83 -31 -89 47 80 -145 -241 22 54 203 -199 188 -155 -437 -59 53 -256 -242 -223 -233
5615 -233 -99 5 -36 -123 288 113 -25 201 -198 -73 189 -198 -78 -318 -191 21 47 39 -74 157 5 -175
5637 -175 176 234 4 -79 -95 87 -126 132 -2 -37 -10 -55 -48 -207 235 21 4 -203 -229 8 156 -12 129
5660 129 242 74 104 -82 76 159 153 143 -100 -76 188 -72 -108 125 -51 129 102 -210 33 -60 -178 133 247
5683 247 134 -113 213 -21 -32 -36 111 117 118 226 -57 124 -35 56 57 125 -67 11 216 167 263 112 -115 -130 240
5708 240 -88 66 32 -233 30 30 -16 88 81 50 -135 78 116 -80 103 15 -119 -275 47 76 -453 -95 -195
5731 -195 16 63 -239 -26 86 -213 -234 -24 -64 107 -5 33 -8 -218 153 11 185 104 -114 -179 76 222
5753 222 -254 99 -302 4 -32 -22 172 40 219 191 60 -189 53 -231 -200 55 4 -108 76 235 -144 201
5775 201 -225 52 38 326 201 -8 17 -175 202 62 -167 -122 67 -148 -97 153 -275 -149 29 217 -25
5796 -25 162 -24 -90 106 410 117 104 164 338 46 126 -15 88 245 126 -290 -51 129 -16 -128 243 -139
5818 -139 147 136 -143 -28 57 -174 16 -33 150 -105 -177 25 1 97 -180 -92 -73 237 93 -49 240 -260 244
5841 244 161 -89 73 17 -66 -131 85 -59 139 -151 -28 -50 -152 -75 156 -30 298 220 -52 167 17 53 16
5864 16 19 162 63 -243 -255 12 -20 282 -79 20 -168 -45 171 297 -48 92 246 -2 63 214 127 42 123 -82
5888 -82 -127 -34 -223 43 9 195 -55 413 -280 129 -70 139 1 -40 6 27 275 244 -172 -38 -41 -121 -109 62
5912 62 -24 -133 -69 -252 4 29 -4 0 68 -16 -65 -224 -171 -146 14 3 162 -173 -127 -369 19 -229 79 -51 127
5937 127 -23 -188 22 -20 -99 6 4 -39 -54 -87 103 12 -89 76 209 167 -341 125 106 -29 -238 -50 89
5960 89 -51 194 -151 105 -242 -68 44 -82 73 -19 -398 -76 90 -142 -291 -55 35 -22 -95 -39 -181 -169
5982 -169 177 -47 -58 -156 71 -153 71 -64 -91 73 -261 117 91 116 94 -108 -342 1 9 5 93 -106 -127 28
6006 28 187 19 185 -8 4 33 -105 90 -77 -375 -202 244 -101 15 -211 63 270 -204 -77 -163 -262 119
6028 119 -4 6 149 -18 120 -186 -44 -40 156 189 -13 -13 -69 61 85 102 166 -201 -201 149 -11 -2 -10 40 -16 115
6054 115 70 95 276 -171 176 -78 -48 -183 147 177 -50 -236 234 -223 -195 247 52 -327 -51 47 184 -136
6076 -136 -151 66 30 -132 79 -226 -38 209 237 13 -92 -38 -179 16 -97 273 69 -160 -223 -96 -115 118
6098 118 -155 -51 -301 -41 139 104 -79 21 115 -47 -138 37 268 79 -159 -133 -6 -131 34 120 -4 98
6120 98 14 38 139 -45 29 -149 58 77 69 40 106 122 -229 -120 -76 -66 -62 39 -238 58 34 -21 8 -94 45 374
6146 374 5 36 9 150 -87 -11 -370 -41 1 89 51 126 -77 50 -121 -20 58 -39 10 112 -18 -243 87
6169 87 -126 -199 -157 -40 109 -54 114 -30 38 93 90 75 28 45 -37 5 15 39 -228 172 -378 272 153 -65 -78
6194 -78 -152 -185 -10 -124 -13 49 221 -193 -152 -50 294 -226 -169 -24 -16 16 -13 -101 240 -98 -66 34 81 14 -21
6219 -21 -29 108 137 -36 267 -71 -213 -256 -86 194 11 57 -25 94 -415 122 -39 -106 291 -59 -110 251 -16
6242 -16 270 183 145 269 -101 348 314 204 -64 123 -11 -130 -67 181 191 -218 -36 64 -22 -47 155 112 74
6265 74 -33 -48 -75 2 -58 -184 -191 -276 -128 115 -147 -43 174 7 -195 129 233 36 -18 77 14 -19 -42 175
6289 175 59 -19 -126 56 -156 64 -1 62 -127 -233 149 126 -93 119 185 109 208 31 91 68 10 -112 -44 -167
6313 -167 82 0 -72 3 -185 -94 49 166 -140 -80 -16 177 -88 99 44 -60 -101 77 20 12 -168 -140 135 -23
6337 -23 -103 223 126 -21 151 -64 278 -174 -100 149 2 307 -97 153 83 -136 82 -46 192 -47 -71 -91
6359 -91 -223 -48 391 153 -258 92 -251 94 -96 -247 168 -152 208 119 159 -3 -64 -86 29 111 -163 -26
6381 -26 126 154 90 208 -1 -147 275 -97 -14 -68 -297 -75 87 45 29 177 -286 105 -234 -294 -113 46 26
6404 26 -176 -147 -115 -11 -11 -47 268 168 -83 53 -287 -203 -118 195 -243 43 91 -198 -5 -147 121 -74 -137
6427 -137 -115 -71 86 -82 219 -200 123 -117 -186 305 -116 -62 -283 -41 -92 81 108 48 29 250 165 -23 60
6450 60 30 -148 -27 4 -19 43 -62 106 -125 -170 -99 29 57 -25 65 184 -129 43 92 -4 1 -97 -43 -255 119
6475 119 -5 297 -1 126 37 0 78 157 58 -19 136 121 129 80 -5 -178 -19 82 245 -111 178 -80 258 -266
6499 -266 0 -4 292 5 -94 -224 3 2 38 -53 207 144 154 71 -107 123 30 -222 -188 -27 74 24 144 -112
6523 -112 8 156 70 67 -12 -235 -194 162 46 -44 -104 33 -44 -90 -199 75 -112 -76 -257 -44 -42 -89 181 200 -159
6548 -159 190 -48 67 -24 214 -177 289 -27 -64 40 -30 130 -31 -175 174 98 198 144 -192 97 -222 -86
6570 -86 20 -98 0 4 1 44 72 68 18 74 58 -9 34 -120 -27 -164 15 -19 -230 -202 -42 -202 333 34 -9 186
6596 186 -261 86 25 -140 150 -16 -349 -68 -219 248 -157 41 -114 -172 -267 -93 75 137 -51 91 -3 -39
6618 -39 31 90 90 0 -79 -133 -8 213 2 -80 -111 158 215 -182 -194 -126 -4 -193 -71 95 -123 -234 156 -189
6642 -189 95 -210 103 -203 62 -116 -183 -113 -85 92 -38 -334 -24 40 -69 10 -3 150 -17 59 -59 136
6664 136 -344 -154 -11 122 45 21 94 49 -101 -80 0 145 129 78 -99 -148 47 56 -415 -184 -7 -129 -284 178
6688 178 -138 -101 -192 -63 78 191 -241 88 150 61 298 -38 56 -21 104 -161 -183 183 -1 -55 -43 -134 90
6711 90 268 -21 59 -59 9 -109 -173 187 22 -140 -43 -82 58 -207 201 -156 -92 30 -9 -117 -74 57 -15
6734 -15 317 -192 88 177 -100 280 93 -163 87 -1 -88 -67 158 185 7 50 148 -57 282 245 152 -140 -14
6757 -14 -10 -256 -211 156 89 -212 -23 -133 218 -44 -8 -143 -99 170 36 -19 142 85 -40 76 115 21 -148 190
6781 190 -106 206 221 -61 -235 -93 -39 -180 -113 168 -78 193 116 47 -26 313 97 -184 -291 255 -99 -176
6803 -176 -224 81 37 257 -260 -68 25 187 77 115 18 98 4 1 88 -129 107 40 -11 -96 -122 -84 92 -192 20
6828 20 -128 168 25 -84 -88 90 -76 -242 -4 167 162 1 131 -267 89 77 -150 226 84 32 -58 -163 251
6851 251 -72 28 116 -92 -8 -10 95 -224 -370 -105 -291 -182 253 -104 -116 -167 -25 -259 -27 -141 161 -25
6873 -25 11 301 -207 287 -60 -168 -245 -325 -18 -4 -128 -95 23 -86 80 423 87 -91 -204 -18 101 -237
6895 -237 -119 69 -164 -46 -143 84 -82 242 -47 132 -274 -32 154 356 199 194 342 -31 88 45 14 -29
6917 -29 96 62 -129 -128 -370 -109 -178 -192 94 -64 -99 50 -105 35 -15 34 70 102 -75 -83 175 -211 -254 38 93
6942 93 -106 110 201 -187 46 176 52 45 256 17 -163 137 -52 43 -57 121 -116 211 -34 97 131 -26
6964 -26 -121 -279 -27 83 98 79 51 41 -74 15 -70 77 -157 73 -335 -156 178 -48 112 -135 167 -104 3
6987 3 11 154 -148 -139 -42 -28 10 91 139 14 22 170 194 66 -2 52 2 268 243 80 -124 -23 142 167 -232 7
7013 7 -66 20 141 -32 35 -26 99 146 -93 -40 179 -164 21 -130 -164 68 286 145 139 -21 20 -15 -343 89
7037 89 -56 1 -80 -262 201 46 -71 75 -267 80 238 29 -13 36 -351 147 21 -128 -5 128 -205 -242
7059 -242 32 47 -44 154 -22 -291 -81 236 -55 309 -5 -240 258 256 -1 4 69 123 -144 14 -135 -81 153
7082 153 208 363 159 42 107 110 -139 76 303 153 -72 47 -47 -157 -62 -81 -134 16 5 -21 -113 219 -126 0
7106 0 -140 65 254 173 -190 -138 -362 -53 -13 -124 62 -152 -2 3 -113 91 97 177 45 208 -24 91 -116
7129 -116 -104 -152 65 157 169 -252 -227 120 130 137 127 136 -186 -104 129 22 98 194 -49 -373 120 -319 -281 -142 0
7154 0 181 -191 54 95 -221 -49 -124 -114 12 -118 -131 -24 -31 -151 -31 148 -176 107 -12 75 333 -128 59
7177 59 127 38 -268 108 53 -65 41 -123 88 221 49 6 176 -118 150 193 14 -93 -7 55 -210 127 -36
7200 -36 11 88 -33 -169 -101 82 139 -114 -93 -332 57 160 342 -157 93 13 -315 76 63 89 -223 -84 32
7223 32 -149 102 29 164 -146 56 -163 442 -173 -127 193 76 -30 132 163 -226 -168 68 281 183 68 -10
7245 -10 -166 -51 -128 61 107 -257 -6 255 331 -97 -102 -42 208 -156 -40 -219 -264 -174 15 -109 -353 -198 -139
7268 -139 23 19 -111 -14 -3 67 -64 3 -144 70 252 -94 135 43 78 256 167 68 152 -167 3 134 20 -272
7292 -272 -331 213 234 -169 -58 81 181 -129 270 -46 88 264 -101 -28 84 -91 159 -155 78 73 248 78
7314 78 -37 185 176 172 17 151 100 -50 -62 -253 -136 75 -152 154 49 18 133 29 45 59 -31 -56 309 111
7338 111 -26 8 87 -4 -52 -47 249 273 -117 82 -45 -58 115 304 12 233 64 161 -124 -19 71 -110 338
7361 338 54 185 117 70 44 195 36 409 178 183 302 40 173 12 -101 333 356 84 -84 -228 -327 306
7383 306 -118 22 49 58 20 -104 -197 -65 44 -12 -1 26 -24 58 155 -47 -169 66 58 73 55 -58 229 106 -143
7408 -143 228 -22 -92 181 118 -60 63 -161 -253 47 128 69 -155 -94 -239 -57 -233 315 -34 138 -89 -96 -58
7431 -58 82 102 -218 165 131 -18 146 77 -135 19 -202 -216 24 -23 -36 184 72 264 129 -74 -98 1 15
7454 15 200 -139 -281 34 -158 -39 -185 -226 -50 3 128 118 -12 -103 106 -115 -85 -29 -72 124 -109 141 103
7477 103 170 43 70 -66 40 22 59 -22 -58 74 -175 49 137 54 -91 166 -97 -39 106 24 -69 -148 -86 -65 -386
7502 -386 -58 -161 132 -19 -15 -116 -96 -21 -73 109 54 213 100 -100 18 89 -61 -32 142 220 -117 -169 -113 211
7526 211 -103 -39 189 -22 39 333 48 -75 166 -94 147 90 -200 72 -11 18 -61 -159 65 -178 -49 -68 -150
7549 -150 220 137 9 186 -104 -36 -13 7 -80 -94 -9 79 49 -172 277 -115 101 -314 -45 -153 -315 26 -101
7572 -101 30 52 -21 -93 -179 -20 -201 -74 106 -85 289 70 -54 -203 208 -237 19 -280 -53 -9 -132 84
7594 84 -68 -149 105 57 -36 -233 -149 -12 307 62 -223 173 -12 40 474 119 139 67 -175 37 -3 -261 187
7617 187 24 -19 68 -228 42 -38 -121 -177 111 216 -6 -331 -283 -2 -159 41 232 85 -73 -99 -71 12 -184
7640 -184 -55 316 106 -201 -51 42 -22 23 223 33 190 110 -20 179 -159 -8 -70 288 -294 33 -325 -9
7662 -9 -149 -181 13 -264 71 153 -37 -159 119 -50 53 35 305 -2 136 -247 128 -81 18 7 -223 -185 -213
7685 -213 29 143 -96 -112 -191 88 260 305 -38 43 -7 -70 -278 -280 6 278 -153 180 114 -201 47 2 313
7708 313 160 -175 109 -112 -344 -68 -87 127 -47 -13 155 -117 15 -416 46 -12 84 9 -45 78 -172 -61
7730 -61 -276 -62 -127 81 26 -43 85 103 -260 8 -117 -30 -105 -110 213 -60 -48 -83 30 -24 -262 74 -75 -36
7754 -36 -370 8 64 76 -143 184 6 407 -23 21 -110 102 90 -133 66 -179 74 -127 -129 101 147 19 104
7777 104 -24 -119 223 -13 12 91 128 -91 -19 211 -69 6 275 19 -73 96 190 -32 175 -35 98 -14 -16
7800 -16 240 -152 -29 69 -122 -111 54 -134 -35 2 -113 147 287 -295 290 -77 -113 -185 -499 -57 -74 -129 110
7823 110 -6 180 6 -69 -109 116 -136 -73 -215 199 32 70 115 67 213 -23 29 -94 221 -12 239 -245
7845 -245 135 204 3 97 190 299 151 206 -171 -196 98 146 -116 -77 36 83 47 59 -54 -209 -174 371 -140 -140
7869 -140 117 -109 -34 201 -7 -22 -259 88 91 -88 -230 -23 51 170 167 37 -115 -142 -33 -145 41 45 311
7892 311 49 -64 82 -64 109 8 -189 -34 164 -95 -108 150 -291 289 129 349 77 97 39 111 9
7913 9 80 -54 165 -70 67 64 171 -109 -76 294 34 59 -81 8 -232 38 -55 61 -163 107 66 139 102 -145
7937 -145 -2 275 -409 167 142 46 100 -136 357 -217 82 -151 76 92 -127 152 103 -211 274 148 118 -37
7959 -37 149 -221 -11 -203 -136 -55 151 -47 114 129 81 -25 -158 -158 468 -218 140 64 -308 38 93 55 104 -186
7983 -186 -187 -212 40 -71 -236 33 -182 -171 87 167 -93 -23 -134 -31 -149 2 203 13 -146 -102 76 -187
8005 -187 61 20 -214 -207 95 12 34 -241 180 -71 376 76 109 151 -290 -100 -100 97 -13 -170 -222 -64 -204
8028 -204 277 -37 18 -146 317 -16 -41 33 93 55 174 -34 -81 330 28 -45 183 -60 -82 174 -53 97 78
8051 78 -14 -213 168 -87 -15 201 26 -35 -65 -137 96 3 126 35 64 14 171 79 -132 -135 159 -60 45 -154
8075 -154 280 -214 116 134 73 164 12 -396 24 -25 94 347 -120 -155 -55 -49 -112 33 -95 -89 17 290 -62
8098 -62 253 -262 -123 -218 -164 6 -115 54 -124 1 -127 -71 49 -135 -57 -71 -7 -192 43 -209 -9 -14 66
8121 66 -48 47 204 -242 -179 -64 -4 12 11 -270 91 9 285 -79 78 -173 184 -102 17 144 149 -35 176
8144 176 61 172 7 67 276 -181 -2 -33 257 208 -285 50 -20 6 -88 155 70 194 -13 -197 -88 117
8166 117 -12 9 85 -124 -185 -65 -171 250 -138 -86 45 25 47 65 11 238 -117 279 30 44 144 27 -184
8189 -184 30 -240
8191b40
##END NTUPLES=NMR FID
##END=
