##TITLE=1H_DE-78H4
 200.13MHz, D2O,
 8 sc
 
 14.2.2025
##JCAMPDX= 6.0         $$ Bruker NMR JCAMP-DX V2.0
##DATA TYPE= NMR FID
##DATA CLASS= NTUPLES
##ORIGIN= UXNMR, Bruker Analytische Messtechnik GmbH
##OWNER= pz
$$ XWIN-NMR		Version 3.5
$$ Fri Feb 14 14:20:42 2025 Russian Standard Time (UT+4h)  she@DPX200
##.OBSERVE FREQUENCY= 200.1313
##.OBSERVE NUCLEUS= ^1H
##.DELAY= (6, 6)
##.ACQUISITION MODE= SIMULTANEOUS
##.ACQUISITION SCHEME= undefined
##.AVERAGES= 8
##.DIGITISER RES= 18
##SPECTROMETER/DATA SYSTEM= spect
##.PULSE SEQUENCE= zg30
##.SOLVENT NAME= D2O
##.SHIFT REFERENCE= (INTERNAL, D2O, 0, 14.3821)
##AUDIT TRAIL= $$ (NUMBER, WHEN, WHO, WHERE, WHAT)
$$ ##TITLE= Audit trail, XWIN-NMR		Version 3.5
$$ ##JCAMPDX= 5.01
$$ ##ORIGIN= Bruker BioSpin GmbH
$$ ##OWNER= she
$$ F:/spectra/data/she/nmr/H-C/1/audita.txt
$$ ##AUDIT TRAIL=  $$ (NUMBER, WHEN, WHO, WHERE, WHAT)
(   1,<2025-02-14 14:19:26.70 +0400>,<she>,<DPX200>,
      <created by zg, POWCHK disabled, PULCHK disabled
       configuration hash MD5:
       00 E9 B6 7A A2 85 ED C7 34 08 36 98 17 FE 4E 26
       data hash MD5: 16K
       28 1A 50 5F AB C4 2F 09 D5 73 95 2C 3E 24 3E 75>)
$$ ##END=
$$ 
$$ hash MD5
$$ 26 FF B2 D2 F2 30 15 E4 C5 4A 93 B3 9A DA FB 59
##$RELAX= 
##$RELAX= 
##$RELAX= 
##$RELAX= 
##$RELAX= 
##$RELAX= 
$$ Bruker specific parameters
$$ --------------------------
##$DU= <F:/spectra>
##$EXPNO= 1
##$NAME= <H-C>
##$PROCNO= 1
##$TYPE= <nmr>
##$USER= <she>
##$AMP= (0..31)
100 100 100 100 100 100 100 100 100 100 100 100 100 100 100 100 100 100 
100 100 100 100 100 100 100 100 100 100 100 100 100 100 
##$AQSEQ= 0
##$AQ_mod= 1
##$AUNM= <au_zg>
##$AUTOPOS= <>
##$BF1= 200.13
##$BF2= 200.13
##$BF3= 200.13
##$BF4= 200.13
##$BF5= 200.13
##$BF6= 200.13
##$BF7= 200.13
##$BF8= 200.13
##$BYTORDA= 1
##$CFDGTYP= 0
##$CFRGTYP= 5
##$CHEMSTR= <none>
##$CNST= (0..31)
1 1 145 1 1 1 1 1 1 1 1 1 1 1 1 1 1 1 1 1 1 1 1 1 1 1 1 1 1 1 1 1 
##$CPDPRG= <>
##$CPDPRG1= <>
##$CPDPRG2= <>
##$CPDPRG3= <>
##$CPDPRG4= <mlev>
##$CPDPRG5= <mlev>
##$CPDPRG6= <mlev>
##$CPDPRG7= <mlev>
##$CPDPRG8= <mlev>
##$CPDPRGB= <>
##$CPDPRGT= <>
##$D= (0..31)
0 0.7 0 0 0 0 0 0 0 0 0 0.03 0 0 0 0 0 0 0 0 0 0 0 0 0 0 0 0 0 0 0 0 
##$DATE= 1739528366
##$DBL= (0..7)
120 120 120 120 120 120 120 120 
##$DBP= (0..7)
150 150 150 150 150 150 150 150 
##$DBP07= 0
##$DBPNAM0= <>
##$DBPNAM1= <>
##$DBPNAM2= <>
##$DBPNAM3= <>
##$DBPNAM4= <>
##$DBPNAM5= <>
##$DBPNAM6= <>
##$DBPNAM7= <>
##$DBPOAL= (0..7)
0.5 0.5 0.5 0.5 0.5 0.5 0.5 0.5 
##$DBPOFFS= (0..7)
0 0 0 0 0 0 0 0 
##$DE= 6
##$DECBNUC= <off>
##$DECIM= 32
##$DECNUC= <off>
##$DECSTAT= 4
##$DIGMOD= 1
##$DIGTYP= 9
##$DL= (0..7)
0 120 120 120 120 120 120 120 
##$DP= (0..7)
150 150 150 150 150 150 150 150 
##$DP07= 0
##$DPNAME0= <>
##$DPNAME1= <>
##$DPNAME2= <>
##$DPNAME3= <>
##$DPNAME4= <>
##$DPNAME5= <>
##$DPNAME6= <>
##$DPNAME7= <>
##$DPOAL= (0..7)
0.5 0.5 0.5 0.5 0.5 0.5 0.5 0.5 
##$DPOFFS= (0..7)
0 0 0 0 0 0 0 0 
##$DQDMODE= 0
##$DR= 18
##$DS= 0
##$DSLIST= <SSSSSSSSSSSSSSS>
##$DSPFIRM= 0
$$ [...]
##$SUBNAM0= <"">
##$SUBNAM1= <"">
##$SUBNAM2= <"">
##$SUBNAM3= <"">
##$SUBNAM4= <"">
##$SUBNAM5= <"">
##$SUBNAM6= <"">
##$SUBNAM7= <"">
##$SUBNAM8= <"">
##$SUBNAM9= <"">
##$SW= 18.0517328524113
##$SWIBOX= (0..15)
0 0 2 0 0 0 0 0 0 0 0 0 0 0 0 0 
##$SW_h= 3612.71676300578
##$TD= 16384
##$TD0= 1
##$TE= 0
##$TE2= 300
##$TE3= 300
##$TEG= 300
##$TL= (0..7)
0 120 120 120 120 120 120 120 
##$TP= (0..7)
150 150 150 150 150 150 150 150 
##$TP07= 0
##$TPNAME0= <>
##$TPNAME1= <>
##$TPNAME2= <>
##$TPNAME3= <>
##$TPNAME4= <>
##$TPNAME5= <>
##$TPNAME6= <>
##$TPNAME7= <>
##$TPOAL= (0..7)
0.5 0.5 0.5 0.5 0.5 0.5 0.5 0.5 
##$TPOFFS= (0..7)
0 0 0 0 0 0 0 0 
##$TUNHIN= 0
##$TUNHOUT= 0
##$TUNXOUT= 0
##$USERA1= <user>
##$USERA2= <user>
##$USERA3= <user>
##$USERA4= <user>
##$USERA5= <user>
##$V9= 5
##$VALIST= <valist>
##$VCLIST= <CCCCCCCCCCCCCCC>
##$VD= 0
##$VDLIST= <DDDDDDDDDDDDDDD>
##$VPLIST= <PPPPPPPPPPPPPPP>
##$VTLIST= <TTTTTTTTTTTTTTT>
##$WBST= 1024
##$WBSW= 4
##$XGAIN= (0..3)
0 0 0 0 
##$XL= 0
##$YL= 0
##$YMAX_a= 493555
##$YMIN_a= -646016
##$ZGOPTNS= <>
##$ZL1= 120
##$ZL2= 120
##$ZL3= 120
##$ZL4= 120
##$ABSF1= 10
##$ABSF2= 0
##$ABSG= 5
##$ABSL= 3
##$ALPHA= 0
##$AQORDER= 0
##$ASSFAC= 0
##$ASSFACI= 0
##$ASSFACX= 0
##$ASSWID= 0
##$AUNMP= <proc_1d>
##$AZFE= 0.1
##$AZFW= 0.1
##$BCFW= 1
##$BC_mod= 2
##$BYTORDP= 1
##$COROFFS= 0
##$CY= -3
##$DATMOD= 1
##$DC= 2
##$DFILT= <>
##$DTYPP= 0
##$F1P= 0
##$F2P= 0
##$FCOR= 0.5
##$FTSIZE= 0
##$FT_mod= 4
##$GAMMA= 1
##$GB= 0.15
##$INTBC= 1
##$INTSCL= 1
##$ISEN= 128
##$LB= 0.25
##$LEV0= 0
##$LPBIN= 0
##$MAXI= 10000
##$MC2= 0
##$MEAN= 0
##$ME_mod= 0
##$MI= 1.114404
##$NCOEF= 0
##$NC_proc= 0
##$NLEV= 6
##$NOISF1= 3.799351
##$NOISF2= 2.8
##$NSP= 1
##$NTH_PI= 0
##$NZP= 0
##$OFFSET= 14.38212
##$PC= 1
##$PHC0= -472.0858
##$PHC1= 12.39221
##$PH_mod= 1
##$PKNL= yes
##$PPARMOD= 0
##$PSCAL= 0
##$PSIGN= 0
##$REVERSE= no
##$SF= 200.129724274929
##$SI= 16384
##$SIGF1= 3
##$SIGF2= 2
##$SINO= 400
##$SIOLD= 16384
##$SREGLST= <1H.CDCl3>
##$SSB= 0
##$STSI= 0
##$STSR= 0
##$SW_p= 3205.1282051282
##$SYMM= 0
##$S_DEV= 0
##$TDeff= 0
##$TDoff= 0
##$TI= <>
##$TILT= no
##$TM1= 0
##$TM2= 0
##$TOPLEV= 0
##$USERP1= <user>
##$USERP2= <user>
##$USERP3= <user>
##$USERP4= <user>
##$USERP5= <user>
##$WDW= 1
##$XDIM= 8192
##$YMAX_p= 0
##$YMIN_p= 0
$$ End of Bruker specific parameters
$$ ---------------------------------
##NTUPLES= NMR FID
##VAR_NAME=  TIME,          FID/REAL,        FID/IMAG
##SYMBOL=    X,             R,               I
##VAR_TYPE=  INDEPENDENT,   DEPENDENT,       DEPENDENT
##VAR_FORM=  AFFN,          ASDF,            ASDF
##VAR_DIM=   8192,          8192,            8192
##UNITS=     SECONDS,       ARBITRARY UNITS, ARBITRARY UNITS
##FACTOR=    0.0002768,     1,               1
##FIRST=     0,             0,               0
##LAST=      2.2672688,     0,               0
##MIN=       0,             -646016,         0
##MAX=       2.2672688,     493555,          0
$$ Real data points
##PAGE= N=1
##DATA TABLE= (X++(R..R)), XYDATA
$$ [...]
1872G6j16k3K07O7l52M02j7m34L23k09Q6J10J06l04L5J10j36R5N1N8M7m28J20
1895a26Q2K26J52m89P2Q6j29J22J6j01K36k88m6J22N2k24K72l1Qm8J23j5j32Q8
1919B8o7P6k73J69K46j70L6k16K43L7l69q6K16P9J40k0R6k13q2K95k87M6k3L6
1943f3O2rr2p0K4J40l7j03J25J39j24P2j58J94k39O0L42o5k09OJ44L0k43o7K20
1968G9j89J32J28n8k54J72k87J02K22r2P2J07J51l07K3j29mK07J59k98p8L07p9
1991H6oq0j15J14O7j53J47J55k83J82k23M20n16K40J57j70M9m59N23J12j38k37
2013a28L18j6l15Q7p7K06l79M13j80J96N0k78K46k27J56k17k3K0N20k26p1P8p9
2036G4j59K18k40q9K67j27J61j54J5j24J55o8Q1J47k64J93j85Q6k2p6K8J7Q2k07
$$ y = [76, -40, -63, 144, 211, -141, 261, 244, -190, 133, -76, 10, 120, 226, -78, -43, 67, -69, 26, 77, 135, 182, -246, -126, -44, 182, 334, -155, -83, 3, -126, -4, 12, -89, 147, -141, -187, -65, -13, -237, 35, 4, 12, -36, 87, 72, -60, 28, -39, 37, -236, -67, 179, 9, 45, -171, 72, 109, -260, -346, -130, -51, 89, 69, 165, -48, -130, 165, -122, -76, -99, -63, -1, -10, -102, -172, -148, -8, -45, -148, -23, 116, -8, 64, -94, 100, -139, -79, 263, 198, -11, -5, 139, 169, -74, -141, 79, -110, 22, 150, 92, -162, 10, -277, -175, 47, -45, 27, 134, 285, -22, 1, -128, -132, 75, 234, -64, -142, 165, 86, 80, 0, -115, -1, 66, -87, 60, 215, -68, 114, -109, 311, -205, 35, 192, 22, 71, -388, 135, 247, 109, -128, 190, 174, -141, -54, -131, 75, -304, 109, -71, 125, 175, -103, 143, -84, 72, -145, -168, -148, 372, 146, 75, 153, 74, -85, 133, -107, -196, 71, -56, 105, -49, -34, -158, -3, -71, 10, 157, -107, 86, -99, -13, -35, -111, -83, -66, 16, -191]
2060a91K63J63l18O8k5Q6j0n7J62J56l08J53K8l50K78k56J10L7R7k44L7q9K24
2083A4j46L14k19J83j79p8M00l79K23j05r7J82k92K08m24N49J54m5k55M9o9R3
2105H1J0j67P2k1l8q5J80k20J07J35M9j41R2L37l86R1m5k53P4K5o9K59k07N3J18
2130E1j09K24k9k0j30R6p8J9J00j61J33J47k60p3q0n7J32L64j97j55L20j16j8
2153A03K12l42r2J58J90j17j93j26K31Q6l20K06k46L02j05K19J63m38M6Q5K20
2174B42p3J78m61jJ07N8%J19k33l7K8J56J07k67K7L04l55L7p1R6k07N10k13k13
2198a62J78L7r9K38k49J03l3R5j73Q5O9m86N32l10J64rR5K53m97K28m85M31mj94
2222a93j09N74l73M4Om1K46q8Q7l22J47J7K55k34L1j06p5n4L26l17L28k07k9J40
$$ y = [-191, 72, 235, -83, -15, -40, 46, 36, -21, 141, 297, -11, 142, 170, -180, 98, -158, -48, -11, 86, -158, -121, -210, 14, -132, 182, -37, 146, -33, -111, 289, -90, 133, 28, -69, 113, -179, 29, -395, 154, 308, 263, 8, 57, -12, 81, 91, -76, -4, -25, -63, -148, 32, -188, -81, 54, 103, -38, 54, 391, 5, 96, 51, -202, -128, -103, -172, 87, -120, -67, 51, -58, 166, 137, 117, -13, 83, 5, 24, 124, -37, 96, 243, -17, -90, -170, -227, -95, 269, 72, -83, 237, 121, 103, 315, -27, -119, 39, 229, 112, -81, -207, 24, 110, -210, -4, -250, 52, -53, 166, 329, -109, -63, 22, 242, 169, 347, -114, -115, -8, 50, 50, 169, -64, -101, -73, 83, 190, -77, -50, 254, -101, -64, -135, -39, -246, 264, 51, -162, 16, 53, -46, 192, -57, 46, 13, 108, -65, 20, 89, -397, 135, -175, -11, -20, 75, 328, -169, 59, -426, 5, 1, -193, -302, 272, -101, -57, -51, -92, 154, 66, 153, -169, -22, -5, 250, 16, 47, -59, -134, -188, 138, -179, 149, -58, -87, 53]
2246E3J15l53K51q8q4j12N7R4mj07L22k03L19n45J68J93j58K44l15J38J50k34
2268i9J52J80n9j44j10Rj20K47J62k91K5o5p8k4O2j7L88p0q0r9j31J07n8J10j6
2293a9R0j94K81j69j49K70p6q5K59l89J45K91k85K28l49p5K38J86j23p8o6L68
2315B99k24j02m7K73n0l0k31O9KJ42n6L32l44j68R0O3j03K0N5M1J2j61k7K19N7
2340A31l1k08M0J91k26R0N5q7J33k4j32P9k14j12L48j01K15q2l19q0J90L16j50
2363B2J54q3Q7k52J56n9J48o9n3J20j5L3l56N11l47q7J54Q6k37J99R4j95j00J26
2387C7j05k36LK65J86k13J70k67l3L04k0j08j68J17K69O1l63K32j97mk02K09L09
2410B46m33L32k72k3J60J02k22L1K31j19k13K11Q3r0p4P5j29K79j0l03K66J11
$$ y = [53, 168, -185, 66, -22, -106, -218, -161, -67, -71, -178, 144, -59, 260, -285, -117, 76, -82, 162, -153, -15, 135, -99, 53, 233, 174, 30, -80, -71, -191, 56, 218, -73, -48, -113, -191, -215, -153, -170, 218, 148, 68, -31, -162, -55, -113, -3, -19, 71, -123, 158, -11, -160, 110, 34, -51, 208, -181, -36, 255, -30, 198, -151, -226, 12, 198, 75, -3, -69, 299, 75, -27, -74, 199, 149, 119, -112, -43, -41, 101, 45, 377, 33, -135, -45, 18, -85, -65, -10, 31, 43, -118, -145, 74, 131, 100, -108, -68, 123, -103, -13, 42, -45, 88, 64, -68, 11, -203, -315, 33, -68, 147, 65, -254, -334, -144, 172, 22, 176, 93, 180, -72, 84, 25, 173, 104, 51, 171, 156, 189, -167, 344, -3, -90, 64, 150, -87, 112, 206, 11, -89, 37, -68, -304, -301, -36, 150, -63, 107, -160, -193, 111, 91, -17, -185, -68, 201, 262, -101, 131, -66, -70, -272, -63, 246, -187, 145, -127, -150, 10, 112, -110, -79, 152, 33, -180, 31, 114, 24, -50, 25, -104, 175, 165, -138, 128, 239]
2432B39j39k25M58k19j77L50k43k49K39P9j63m5J09J39j22J9j38K66j01m8R0k77
2454a58L15k80R9J4O1pl3K76l15J02j2k30K69q2k47R9J03K03l87J03K56k54L2
2477g3L5K41qj79l6L5p3r1J71j85N3q6J45R2m6M32p27K68j27L47j5L0j91j66L59
2502B05r5j67K81k30J04k10k66M65k14P0j91M13O1j14M3k48Qn5K10N6k48J81l8
2525B1k92L10J3O7k76M36k47k04j31N22J14m43K71l22R6r2mJ80J17j01K08J5k96
2548c8J61j16K46o7k61J82l79K49L2l45O00m22J87o6J88j71J07l14K81P8Jk74
2570a41K77k27m6J40K10k60J91k4J3k7m7r0j1M1j7l76O05j4j80j17K22r9M3j65
2594i9j15M50m33o9j1L47k05P5p0K35j29K41j60P8j18o7J77n0m58R0K65k0K3M5
$$ y = [239, 100, -125, 333, 114, -63, 287, 44, -205, 34, 113, -50, -95, 14, 153, 31, 50, -88, 178, 77, 29, 119, -158, 157, -123, -24, -10, 51, 44, 11, 287, -28, 74, 62, -168, 101, 19, -228, -129, -26, 177, -210, -107, 149, -105, -73, -38, 203, 195, 16, -20, 15, -58, -149, 22, -163, -110, -196, -51, 41, -5, 427, -300, -32, -159, 188, 173, 203, 12, -154, 205, 110, -57, 224, -6, 98, -112, -378, 87, -127, -57, -248, 165, 226, 112, 155, -93, -85, -140, 70, 126, -122, 59, 21, -271, 39, 52, 119, -157, 279, 32, -172, -303, 219, 333, -110, 161, -161, -65, -157, -161, 19, 136, 35, 243, 258, -38, 123, 7, 253, 186, -75, 107, -272, -23, 9, -336, 264, -158, 29, -37, 151, -20, 87, -227, 54, 132, 133, -141, 136, -91, -137, 3, 213, -47, 144, 120, 133, 106, 59, -31, -42, -1, -18, -394, 211, 197, 17, -100, 122, 23, 66, -99, -214, 236, -197, -266, -277, 70, -135, -60, -130, 105, -24, 217, 57, 135, 17, -50, 127, 77, -381, -291, -26, -46, -23, 22]
2618B2j01J07k32L25j26j2K37n00J25L11%j48k08J10O9j05M55j23k94k7J7l7J10
2641b5j43J08J03J55j85n3K03j60j99K88j90l8J01K3J77m17K75j42K33o5l7l2
2663b0N6j82K88q9pO6j96L5J32j65j52L82j35Q3j4l02J57KKK11j87R6k46J72j24
2688a37j63R3J19K52l82K86j54M1J55r6J68k59R1Q9k27J88J92l53kM06l28Lj97
2711b15L43l05K41k46O1K58M5l11k9K53j26m8K7J66jj28n2J70j16L78l76J47J09
2734B45k49k1J67M2j8n8j75K05m02O8M50J6l50R2j13M11l36r5Pj65Q5J41j35L38
2758A50K4L2m66L02r5J27R1j20L7L9k06k63O38n70K58Q2J09k13k06J95j46K27
2780B6J45r7j72O3K06L7l41R2R3q5Q9K75l23l35L95j14J68m48K97o8K20j56PK09
$$ y = [22, -79, 28, -204, 121, -5, -17, 220, -280, -155, 156, 156, 8, -200, -90, -21, -126, 329, 206, -88, -115, -98, -135, -25, -168, -60, 43, 198, 13, -40, 163, 3, -196, 92, -98, -136, -35, -12, 165, -252, 23, -119, 114, 49, 12, -20, 36, -146, 142, 53, 46, 112, -84, -49, 83, -82, -234, 148, 13, 96, 82, -220, -63, -61, -59, 152, -35, 61, -185, -13, -137, -300, -207, -88, 164, -218, 68, -86, -45, 110, 14, 182, -77, 14, 103, -124, 64, 256, -97, -99, 307, -21, -18, -215, 128, -177, 64, -182, -121, 137, 182, -129, -158, 95, -31, -79, -52, 114, 113, -15, -67, 103, -13, 365, -11, 136, 245, -4, -25, 142, 184, 166, 108, -67, 138, -264, -196, 254, 270, -80, 12, -101, 310, -26, -121, -114, -279, -194, -53, -188, 150, 174, 206, -260, 42, -53, 74, 165, 45, 82, 121, -85, -348, 290, -280, -22, 60, 169, -44, -250, -55, -201, 26, 171, 74, -98, -35, 171, 208, -133, -41, 52, -33, 56, 331, 8, -327, 68, -46, 122, -326, -29, -97, 123, -33, -26, 183]
2804A83k13J24n0l33J90J68O5j21Q1k25L36j86L0r5K13M6k03r8K82j27n8O1K30
2827C00l86p9N7J46j19J14J11j73p6M0n4L70m26L0O6Q5r9j53p3M34r9P5q4j24
2851a17K51m48M34M6j31j65K42j93L5N3K2J95k88r9K45m20K74j21m3M43k72K6
2873c1K4j71J36r2P0L06k70K24j25j68J43Q4m99K31J68L6j51K24k7l34N9K32M8
2896A17k04j18L41j94K66K05l15j10j41J86J27M6j55J44k90J3J02J52k34j95L31
2917G4l6n5J16k70J39p2N2J63MoK2k83J02J08j49j64M73L0j00j80p0nq1q1K30
2942c9K13k6j82K1O9n9r5K45r7j31K14j00k95K00j7Q0Q6j35N1j99K09l55L1L78
2966F7j36j87M56n7k49n2K3j76K28q2j09K25K51k67J27k12K0j00J37k0N34k14
$$ y = [183, -30, 94, 44, -289, -99, 69, 134, 13, 94, -131, 205, 19, 49, -46, 167, 213, 10, -88, 194, 67, 9, 70, 300, -86, -165, -108, 38, -81, 33, 144, -29, -105, -65, -119, 251, -175, -145, -79, 6, -93, -246, -319, 115, 16, 91, 7, -117, 134, -314, 120, 166, 35, -130, 112, -81, -46, 7, 29, 224, -64, -163, 82, -338, -64, -185, -228, 215, -57, -31, -7, -178, -42, -134, -64, 242, -28, 196, 71, -97, 46, 130, -369, -138, 30, 66, -85, 139, 112, -222, -163, 69, 117, -87, -205, 136, -58, 208, 413, 98, -12, -153, 33, 160, 206, 51, 195, -95, -82, 20, 172, -62, -257, 74, 38, -17, 99, -171, -32, -104, -52, 111, 115, 109, 131, -152, -50, 58, -91, -255, 218, 248, 148, -32, -102, -107, -188, -269, -39, 174, 148, -34, -13, 56, -3, -98, 147, 50, -81, 133, 33, -262, -62, -79, 1, 87, -48, 3, -196, 13, -342, -311, 67, -69, -256, 200, 143, -106, -158, -135, -311, -83, -165, -274, -49, 202, -65, 62, -150, -130, -230, -93, -113, 421, 207]
2988B07j21j89j6J72J22j15j61N6k22Q6M67j86k83n6J82O1j97L69r7j29L5JL7
3011B3O6k55L56m53L15J88q0k73J8N71n58K48j21K59j90N4l14M01l12J31J00O8
3033B42m51R5J93j49J90k33R5J0j33J3J53j29j20L40K3Mj98m9J49k33K00m4J12
3056H0j13N7p2Q4j56K38n4J6P1j10K2M8k89L20j41l67M43M0o8P1n6k56R6PK52
3081A63j17j97J45K2r2K19oj50L5M1k28L22R2j84l67ON27l79K45j14m2J64J16
3104B21K5n38M14rJ1l02K52j54L52l17j27J24L1J14K6j46J91m6k62L0K69k36m
3127h1Q5J53j27k38J11J17K82m23M30j80l99Q7J17j50J42J91K26l60L73j42k8
3148A86lj01j0m1nq3M9J8k07K8k5L44j67J5J34q3P7j85q3L9k11M57p0r1n1J07
$$ y = [207, 86, -103, -119, 53, 175, 60, -101, -45, -267, -181, 286, 100, -183, -239, -57, 4, -193, 176, 79, -50, -15, -14, 23, 89, -166, 190, -263, 52, 240, 160, -113, -95, 476, -82, 166, 45, 304, 114, 168, -146, 255, -57, 74, 174, 242, -209, -114, 79, -70, 120, -113, -18, -8, -141, -128, 25, -104, -224, 116, 139, 143, -55, -104, 45, -188, 12, -32, 80, -33, 24, -48, 36, -120, 118, 64, 80, 151, 41, 63, 111, -178, 142, 1, -366, 77, 117, 49, 120, 64, -192, -96, -89, 163, 46, -151, -6, 16, -76, 143, 137, -13, 22, 63, -165, 157, 249, 65, -302, -296, 231, -148, 97, -17, -59, 105, 221, 246, -292, 122, 113, 124, -178, 74, -80, 272, -45, -172, -48, -17, 97, 123, -23, 168, 122, -140, -110, 159, -77, -81, 4, 157, 30, -208, -97, 20, 302, -121, 309, 129, -270, -183, -66, -216, -74, 117, 343, -17, 356, 214, 186, 183, 82, 72, 31, 26, -57, -8, 10, -197, -169, -194, 150, -17, -2, 132, 49, 126, -59, -142, -103, -314, 143, 73, -18, -69, 38]
3174C8k9P6P9l09O4P5R9j17L1j48J76j36O6o5o3J37k9L11m2l8q0K27m94K16p8
3199c3o9kj76K65kj46J64J8k1j16J35Q2L3j0j38p7n3L54l73P5j47K47m51M76j4
3224B1j44l7J56L02k92Q7l5j58j44K88Qj80K05L0j75j2L4j16J14K48l59J53J87
3247A81j04j27J83r8J42j40j84L57p4j68l1K40j63m1K25m84N36l26J79p2p5N3
3269IrJ2o3k5L98j90k62N5j72K58l65N72j72j74J80k10N6J67n0N8j25MP6p2j26
3294a70O2J55j47J14q6K97k11K0J61j97K49q8k4j81j29K73k8J7k75L73k01L01
3316B85n96N2M74k11J50L0k96K55j70J61L3k62ql8J20P6o0J15k42O6O5j35p7J53
3340f0j29Q0O7k4K54j74k7o2J89mk31j8K98L4k11K78l21L20l99L18j24N5L9k98
$$ y = [38, 9, 85, 164, -145, -81, -6, 93, -24, 7, -141, 35, -101, -35, -100, -163, -26, -55, 256, 214, 176, 96, 323, -171, 45, -33, -102, -104, -280, -15, -17, -163, 1, 19, -2, -118, 17, 99, 132, 122, -16, -93, -146, 208, -165, -90, -237, 10, -441, 35, 21, -123, -160, -4, 298, 6, 93, 58, -100, -244, 44, 52, -128, 77, 107, -68, -80, -46, -162, -48, 200, -159, -6, 181, 77, -50, 133, 35, 177, 37, -147, 210, 136, -32, -63, 177, 14, -27, 198, -286, 250, -76, 103, 31, -44, 9, 0, 12, -51, -76, 322, 132, -130, -75, -247, 11, -354, 218, 46, -128, 52, -158, -102, 65, 15, 73, -52, -48, 28, -44, -170, -108, 47, -100, 14, -72, 225, 14, 34, 195, -2, 247, 159, 135, -46, -175, 98, 70, 87, -188, 185, -16, 285, -311, -259, 215, 4, 154, 184, -112, 143, -27, 134, 167, -95, -103, -141, -21, 55, -5, 110, -132, -66, -1, -136, -213, -60, -189, -109, -42, -66, 188, 14, -13, -75, 114, 110, -121, -139, 159, 193, -18, 260, -61, 259, -140, 178, 54, 109, 148, -150]
3364a50j09L36j56K03j88L18k34j02L68l96k08M38l1p8J57k07P2j41J88p8Q7j74
3386h5m5L97j0l97O6J27J60k42mJ0J43q2J65k69J74Nm8j90J18K36k53L8r6M0O7
3411B5R1l5q8L21l25n9MJ57K9m1o9qM6k54J04Mo3N0J15j29J24j45J44J44m2n6
3437D4k7%j3N4r8J70m40J94J16pk6J24j8j05R6j24K31k23R2l66N16k10q2J92k27
3462a37J5J40k29N9J22k1j48j16K47J9J28j82k06L44K38k49k20M93k49oN3j72
3484g7J20m6j3JJ22m59M66j19N4j4l0Q9k13J40K8l05R8K01J15j87J27jk08J82
3508G1k96J44J52J24j73j95O4J87K2j35P8k0l69K95J21k05M0J66J08l19J15j89
3530b14J69n7J05j23K02N5k68M14l41L9J89j9j28J03j46l50M53j35r1K09j70m4
$$ y = [-150, -259, 77, -79, 124, -64, 254, 20, -82, 286, -110, -318, 120, 89, 11, 168, -39, 33, -108, 80, 2, 89, -85, -130, 267, 257, -140, -74, 53, 213, -29, -33, -23, 120, 38, 203, -66, 108, 113, 65, -125, -7, 229, -24, 14, -82, -42, 25, 116, 81, -7, 314, -11, -70, -66, 91, 120, 79, 10, 2, 48, -206, -102, -98, -161, -111, 4, -125, -1, -146, -2, 142, 100, 44, 17, 17, 4, 58, -40, 130, -310, -116, 0, -7, -33, 91, 73, -32, 64, -60, 171, -52, 40, -326, 190, -20, -102, 90, -137, -122, 18, -211, -152, -30, -51, -199, -315, -68, -49, 79, -103, -309, 35, 273, 24, -196, 297, 48, 42, 95, -77, 43, -3, -16, -15, 107, -352, 114, -5, 49, 35, 5, 94, -119, 21, 49, -256, -158, 43, 158, -29, 98, 97, -111, 71, -225, -81, 71, 195, 22, -173, -109, 78, 100, -35, 43, 23, -346, -51, 70, -135, -95, 71, 179, -140, -25, -214, -45, -102, 3, -120, 82, 137, -131, 283, -58, -19, 170, 151, 23, 126, -20, -370, 83, -52, -143, 66, -104, -148]
3552a48O8m8J43Q0r9j8k22K44R3k37M6M8m1k32K47M2k05O3P9L16j64jr4R7j96
3577a39J83J3J01%k71K76r4J02K07l05K04k45J25j93n3P2pJ30k92K06l2j38J37
3600a3M8J5l52L56j43J77L8k05J66k74M06k90O3j62n8J18M1N5J23p7MR6k31j5
3624a14J40k6k44L26k0q4m8K32Jr4q3m14P39k09k31K35p3j6l1N5j61j05J15J06
3648dJ79p2k31N03k01k38r1J51Lk27J57R0N3N7K8j42j2l1K06l02J76m3j61K75
3672A23j54J45l12O8j34K21k0K44j38J2q2l1K34m75J69K3K53j72J61K16k64j20
3694c3K15mk45j06J47J13J64m01p8K04q4J51j71M56m63K33l39J55K17j12l6j70
3716a87K94M1kk22l5J71j97j14L17%K42J13l57k9M4j66j42K94n9m4n9k8N2mKQ6
$$ y = [-148, -80, -128, 15, 95, -4, -22, -244, 0, 93, -144, -98, -50, -91, -323, -76, -34, -239, -176, -97, 219, 55, 54, -40, 57, -139, 44, 57, 158, 158, -113, 163, 69, 171, 378, 73, 277, 32, 157, -36, -89, -17, -24, 106, -186, 20, -12, -150, -13, 35, 50, -302, 54, -89, 88, 126, -79, 87, -187, 219, -71, -8, -170, -228, -110, -69, -14, 109, 32, 36, 132, -99, -114, 26, 0, -244, 82, 62, -22, -70, 162, 163, 69, -14, -428, 311, 102, -129, 106, 33, 17, -14, 41, -120, -225, -110, -4, 175, 103, -128, 375, 174, -64, -155, -4, -1, -228, -71, 19, 72, 129, 157, 15, 3, -28, 178, -124, 52, 9, -152, 123, -31, 114, -198, -130, -264, -43, -63, 181, 43, 55, -27, -58, 176, -299, -130, -107, 146, -26, 135, 351, 87, -33, 182, 178, -67, -173, -26, 87, 251, -150, -228, -24, -108, 43, -128, 328, -135, 98, -241, -86, 131, 19, -17, -187, 107, 148, 146, -76, -111, 60, -137, -251, 66, 66, 308, 421, 64, 35, 79, -87, -229, 65, 6, -38, -97, -125, -73, -77, -75, 11]
3742A1L64n50M9J99k51J42J86m16M50k04l8j01J23M1j9l4J42l9l38J14N0m2J77
3765A6J30k7k74Q5J6J95j75M2m1J23j9j31J84l28K17k20J94J79r3k58J37j14J91
3788B9M5J67j22Oo6k39K13k30K00j28n9L66m40K85nj57M9q0L69l29J95k15J80
3811C4J26j32k37J83R6l7j48J11N6R1O7k29J37k8k5j34j39J84o4JQ7O9N5j33j20
3836a29N7J01N3k05q1J31j16K0J27K28K21l01j96K86J01m84O9L07l16J64oj42
3858a11l97M43Q4j60k0K41j77Q5J80m07L94J79o44M19J37l13J75k38J06n8Q7K7
3880C2k27L11K2k69j16K54r7R2n5J06j34k04L99j27J03l26j08N11k1j9j49M9K7
3903E4N4N1j33j2M9j00j04J51l7J05j37j26j8J09L09k03j94K30k26L00l27j7L03
$$ y = [11, 375, -175, -126, 73, -178, -36, 150, -266, 184, -20, -58, -159, -36, 5, -14, -48, 94, 55, -283, -169, -119, -161, 16, 146, 119, -155, -70, -54, 141, -34, 8, -33, 90, 71, -60, 124, -204, 13, -207, -13, 166, 73, -185, -48, -162, 29, 74, 241, 119, 125, 59, -180, 33, -197, 3, -125, -184, 182, -258, 27, 22, -135, -86, -166, 203, -126, 69, -146, 34, 160, 28, -209, -26, 70, 33, -115, -4, 52, 143, 210, -19, 118, 90, 65, -69, -208, -24, -88, -87, 0, 69, 124, -9, -129, -72, 29, 82, -123, -204, -73, -189, -169, -42, 186, 407, 106, -90, 196, 297, -187, -118, 189, -127, 37, 31, -111, -508, -65, 19, -141, -161, 80, -97, -12, 168, -239, 155, 334, -310, 109, 246, -67, 108, -130, -24, -82, 5, 32, -195, 116, 138, -131, -247, 7, -90, 2, -53, 53, -81, -285, 114, -13, 90, -236, -344, 167, 146, 127, -22, 27, 54, 108, 159, 26, 14, 63, -37, -141, 10, -27, 78, -59, -185, -203, -94, 215, 12, -182, 48, -178, 122, -205, -222, 81]
3926H1j16K37j00r3M5j67J18l7kK58k88k7n0J75J14j16N9n7k74J57J27k2K90j80
3950A32j47O7j80l48N48K73m22k1J59J93j77K23l59J93oj51J52k27M16k33O3j29
3972A9j01j8o2R0j45m6Q7K7J79J13q8l9O6k04J5J44j90J86j19K3r4L14m16K93
3996C4l39J71K15j7j38J89j8l08M44k75R6qL6p6M9j39J31j82J72j17J01J86k86
4019g9K18l6k84L48l67J21r5L46j36K1k4j09K15N7j21k54L79p6j61j84K40j69
4041a50J21j08m1R8L93l22j03l0LO4lPO4N2r5j82L1j65J50J49m1k0L93j97k97
4066b29M56j45l0k09L52j17l1K1M4j36J9j94J30n9r7K33P3r7R6p7J88N2n94O14
4090B63l24N8j15J45p4L8j73P4P2j34K40j66J73k85M2L22j76K1R7j5m7r8N74m97
$$ y = [81, -35, 202, 102, 9, 54, -113, 5, -32, -34, 224, -64, -91, -141, 34, 148, 32, 91, 34, -240, -83, 44, 22, 312, 132, -15, 52, -128, -476, 72, 345, -77, -98, 61, 254, 77, 300, -59, 134, 128, -23, 129, -98, 318, 85, 148, 19, -82, -100, -162, -72, -217, -263, -176, -149, 30, 143, 55, 16, 82, -122, -107, 37, -153, 33, -86, -63, -157, 157, -259, 34, -305, -134, 81, 64, -74, 115, 97, -211, 233, -42, 54, 46, 82, 6, 55, -84, 47, -135, 37, -80, 21, 207, -79, 139, 103, -181, 167, -200, -79, -174, 172, 36, 57, 33, -76, 139, 196, 75, -179, 200, 124, -37, -221, 19, -150, -29, -137, -178, -80, 313, -9, -112, -142, -139, -75, -78, -71, -7, 45, -50, -232, -201, -366, -216, -67, -108, -128, 265, 68, -229, 227, 82, 52, -157, 195, 78, 47, 68, 112, -24, -5, -199, -69, -128, -225, 8, 81, -16, 80, 3, 191, 243, -351, 263, -61, -3, -118, 27, -47, -9, -182, -108, -36, -170, 70, -96, 77, -208, -166, 156, -20, 1, 98, 83, 36, -62, 512, 15]
4114A5J77l6j02M6k47J43N9j51K53l81L96j80L12k86M6j12p4J09o6J4j7K45L3
4137A96j09r8o5l9J67jl31j1P13n02R1o8K51l31M07m64K81J44k13J39j66K39k88
4160e8j06J58N1k0j1J2L5j29J39M6O5m46K66J78k97K72m00J21J77p8k56K63j51
4183a69K06k1K97j93j16R6k87J52k0J55k82Q2j60K05r4o3L61n6k37K56k25r9J27
4206h5j07J30J85J07j76J90m40L62k60J9k37L88j07qM3q4K06k73J43j78L76l51
4228a57K43q0J96l10M83p03L99j95L21Mj58R7k97L73m71K17P8m46L96n7k9K17
4250A21k05K28j5j47N0k08L74n8k22N5J77J00k46Q9j48J6pJ68l2r4p4j59L26j00
4274a1j98M04j77K23r6j29r1J85l1q6l3j13R9R6j90J35K14j89J85j17OQ5rl40
$$ y = [15, 192, 156, 54, 100, -147, -4, 55, -96, 157, -224, 172, -8, 304, 18, 64, -48, -122, -13, -79, -65, -82, 163, 196, 87, -11, -76, -115, 52, 51, -280, -291, 422, -80, 11, -57, 194, -137, 270, -194, 87, 231, 18, 157, -9, 230, -58, -164, -6, 45, 25, 14, 26, 61, -68, 71, 117, 182, -264, 2, 180, -117, 155, -245, -124, 53, -25, -281, -18, -169, 37, 16, 313, 120, 4, 100, -187, -35, -55, 100, -182, -100, -260, -55, -149, -212, 149, 93, -144, 112, -113, -212, -85, -192, -62, 123, 230, 54, 244, -196, 166, -94, -75, -312, 76, -31, -39, 4, -80, 126, -147, -4, -182, 194, -157, 86, 6, 202, -108, 375, -328, 71, -124, 197, 201, 43, 140, -157, 216, -255, -38, 40, -406, -10, -67, -96, 121, -84, 144, 129, -18, 32, -176, 198, 140, -82, -27, 150, 250, 4, 93, -55, -39, -46, 122, 90, -4, -78, -237, 89, -11, -209, 195, 18, 241, 145, 16, -75, 110, 79, -7, -40, -153, -54, 42, -148, -13, 201, 12, 197, 80, 86, 171, 162, -178]
4298a78L14j5j03p7o5o3O8O5p8oJ93Q5q3k72J54K8J40k27L3j17K98j08K47k16
4322A7l3n0j6L0k82O00k52J48j25k15R8J19k28J38K0j04J3O8J87j39j72RJ54o8
4346h3K8m3p0M9K32n1j95L16J51m70K42j11K79l57J25j28L29l13L67k47k1r6L1
4369c6j98k2M44k24J67m3K0m5j20M43l33k03K40k09J47j26L74l44J28o3j36N6
4391h3k56M33L5k43K17k40K16rP0j72jmRJ70lk10K8o4J1J08R4j66J23j54n3M77
4417C33m37J12j8k61L86k15J76l43L14j05J76l24L06K7l31J04J49K3j42j36K01
4438eM03l72j62m7N0J22N2J40n9k83j35K50K9M9p0K81m00J92l65L66j47j73L02
4461A8J0j29k88N60k22Jk1K24J9l14K52m22M45j14l01L34l05L47o1l36K81j40
$$ y = [-178, 136, 121, 18, -59, -124, -187, -119, -54, -132, -138, 55, 140, 57, -215, -61, -33, 107, -120, -87, -204, 94, -14, 233, 17, -16, -66, -82, -52, -334, 266, 14, 162, 37, -178, -80, 39, -189, -51, -31, -135, -122, -54, 133, -6, -178, -169, -15, -83, -55, -98, -168, -119, 113, 62, -133, 183, 334, -136, 106, -5, 274, -83, 42, -86, 243, -70, 297, 50, 29, -67, -36, -234, -256, 188, -36, 131, 88, 108, 63, -57, 386, 53, -150, 90, -119, 28, -98, 276, -68, 60, -3, -139, -83, -339, 94, 129, -114, 103, -137, 79, 70, 140, -32, -33, -37, -28, 142, 139, -71, -43, -107, -96, 12, 106, -60, 63, -91, -144, 333, -104, 8, -10, -271, 115, -100, 76, -267, 47, -58, 118, -206, 100, 127, -204, -100, 49, 72, -70, -206, -5, 398, 26, -136, -183, -133, -11, 41, 181, 122, -161, -296, -46, -17, 32, -38, 243, -157, 35, -330, 36, -111, -284, 18, 28, -101, -389, 171, -51, -50, -71, 153, 172, -142, 110, -312, 133, 19, -282, 52, -253, 94, 33, -303, -22, -162]
4483a62K01J22j80PJ56j49Q5o3j31J8J95Lj35KR6j32J08mO2K00l15K5J23j11o2
4508d1P4l08J96q5J15o8J52j4r0j52J80N0r6K2K03k6r1r5L9k23Q3N1L08j43NJ00
4534A46N0k34P5j4k06J55J6m4R6J10r7p1j57J49L6l7R9j7j19Q1j35j76M07k69
4558a56P8j51J09J11K39l75J84k7j30K17j16Q8l8K16j46j25O7j00J43k26K80m1
4580A01lp2j81R4P8o0l9o2L8K01r3J8j16J58l13M1N8J01p8L6J66p9j70J48j60
4605a88O25l20q8J86k98j9N6J44j55J55j52J68K8l53K90m8K30m15OL67M0q4k28
4628e3r9N2J70P9K8r3j89K37j79o2K20l56K09N8O3j00R1m4R9j29l3j8K71k57j40
4653a75K13K46k70k11M62k32r3j2J86k7j95J86K27l13n8J32j85p3L11j5k8k13
$$ y = [-162, 39, 161, -19, -12, 144, -5, 80, 17, -114, -96, 99, 102, -33, -31, 65, -67, 41, 37, 99, 299, -16, 9, 132, 21, -41, 33, -275, -79, -164, -49, -117, 35, 21, -69, -221, -41, 9, -87, -65, 138, 112, 21, -74, -35, -258, -175, -124, 184, 41, 46, 146, 196, -38, 37, 23, -183, -28, -12, -56, 40, 150, 53, -18, -175, -26, 10, -27, 72, 55, -64, 17, -118, -294, 113, -156, -78, -229, -120, -9, 230, -145, 39, 12, -118, 99, -17, 71, 33, 249, 103, -22, 45, -55, 88, -138, 142, 101, 98, 26, -155, -61, 17, -43, -82, -144, -106, 95, 2, 20, -96, 62, -251, -210, -152, -51, -129, -93, 73, -6, -176, -28, -188, 437, 117, 29, 215, -83, -102, -46, 98, -57, 98, -54, 114, 142, -211, 79, 31, 261, -154, -148, 219, 259, 175, -53, -152, -100, 70, 149, 177, 84, -105, 132, -47, -109, 111, -245, -36, 22, 85, -15, 76, 32, 131, 2, -31, -49, 222, -35, -175, 38, 284, 14, -197, 265, 33, -60, -72, 114, 87, -108, 78, 305, -8, -66, 66, -119, -192, 119, 104, 76, -137]
4675a37J22j2j41J30L01n8j57k9N6m03K90R6rl22K86j22J80j07L4R3L9n4j28L17
4699B65l22J89Q1r2j63J41j6l0k02L75q5l35J70J14k57J90o9o0J00p8K52l35q1
4722b48n5K66J20k00j1m8K78k03J74j85K36j0k47J85l3K29l2k71J73j79R2K26
4744B57m53K9L25m76J67J19O7k81K05K07m54O74l87J21l18M13p0k38L4J6J40p5
4766B2l1K14j73M9L2Q7l64K91j4r1R6N0k09J67J37l21j4J5J81j90K15m5k53J30
4790a9j37L16k87J93j11k24K76K14j80K97l62N3Lj43L29o3r2l87M18k6o0k3O3
4813D8j23j71K87J64l14L02J87p27N35k22pJ5o5q0l4J25K66k01O9m6K9j14K12
4836A35M0l18M09l44j53J51j28M23l28R4K69l34P7k37J6l0L97k36M1m6j3J38k03
$$ y = [-137, -15, -27, -168, -38, 263, 205, 48, 19, 75, -328, -38, 58, 49, -273, 13, -109, 71, -36, -2, 91, 130, 76, -52, 265, -57, 132, 213, 121, -42, 99, 83, 53, -149, 226, 141, -194, -24, 90, -167, 23, -46, -106, -6, -84, 168, -167, -248, -303, -37, 83, -117, -128, -176, 102, -101, 73, -112, 124, 114, -133, 52, 19, 248, 216, -55, 118, -61, 31, 257, -196, -167, 158, -318, -151, -32, 35, -246, -41, 166, -288, 386, -1, 120, -198, 215, 145, -93, -59, -43, 97, 22, -9, 205, 32, 81, 113, 200, -164, 127, 113, 22, 118, 168, -41, 126, 263, -58, -72, -57, 124, -66, 149, 104, -149, -19, -156, 160, -127, 66, -45, -269, 7, 221, 41, 338, -24, 29, 32, -111, 218, 155, 63, -324, 94, 68, 8, -15, 48, -75, -246, 41, 205, -109, 193, 380, -347, 188, -34, -41, -26, -91, -171, -205, -80, 186, -15, 54, 8, 37, -77, 135, 175, -143, 266, -78, -231, -80, -208, 215, -113, -19, 250, -84, -7, -244, -228, -258, 139, -97, -56, -102, -115, 23, -180]
4859a80p8L14j96L86k30j15k0o8J59J89l23J18J02n5Q6o7L34o85L42j06j9n6M12
4882B44j70o0L3nj52L00J31m51R4L03l14J90j65j12K12m7M8j05j3j21p7L18j7
4905F4j04K2k8k76L55n5m6j21j07L74j21k05L66N2l01J88M1k5j87jJ04j34L2K26
4929A13j29n5r4Pk4j3K01K7j71O84o90J88k9J8l2Q5j96oK26j44j42k2K83l30L98
4954A53j89L02l87J80j03o9J44J08k83J74j34R2j88J91J06l01M27l46L7Q8Q2k12
4976a28K6J24q8k04N12k84J16J06m43K95j61K85q9r6j44K79k80K98k31k5J63J43
4998A74Kk37o5J82j0j78O7J54k47q4J85m8K9k0L1j02KM89m09k41K45L91k03j12
5022eJ95l92L04K7k54J39j08L9N1J95k57J80j57J65k17k88J85M69l10N0n7K28
$$ y = [-180, -258, 56, -140, 246, 16, -99, -119, -187, -28, 161, -162, -44, 58, 3, 89, 22, 356, -329, 13, -93, -112, -168, 244, 74, 14, 47, 42, -110, 190, 321, -130, -36, 267, -47, 143, -22, -134, 78, 31, 79, -26, -39, -160, -237, 81, 64, -40, -18, -46, -322, 33, -22, -68, -189, -296, 78, -43, -248, 118, 170, -131, 57, 98, 73, -114, -115, -11, -145, -113, 113, -16, -71, -165, -158, -182, -195, 6, 33, -138, 546, -144, 44, 15, 33, 1, 86, -110, -116, 110, -34, -176, -198, 85, -245, 153, -36, 266, -121, 59, -44, -113, 31, 139, -144, 30, -104, -12, -200, -9, 97, -204, 223, -123, -86, 2, 84, -128, -102, 22, -66, -270, 242, -42, 74, 180, -263, 32, -129, 156, 67, -29, -173, 106, -174, 124, -107, -132, 31, 174, 176, -61, -126, 56, 46, -132, -65, 89, -158, -242, -57, -105, -76, -96, -65, -167, -165, 324, -85, -326, -81, 310, 107, -5, 190, -202, 102, 129, -125, 14, -94, -55, -4, 191, -66, 114, -43, 122, -95, -383, -198, 271, -39, 11, -46, 182]
5044A82k38pn3K2K79j73J87k29J25j30lK00n47L04J42m6k67J49L3n1K69r4j51
5067i7K22k80N6J92q5Nj01K52n10K69j7p6N19k80k47L64k33k77L31J8O5MO9k05
5091d2J13k08L89j06k56J65R4l07K31j38k08L96j01p4j97J91m9L11k79J34j8k
5113C9j74L61j31l7r4j04n8P1Q9qJ20n8J32j13j33K0j08K29j40K15k91N4M2J5
5137f2R3O2k53O6jK62L2j42j09J72k07R0Pm3R6j5r1j07J31k66L62j04PK7K83l24
5163c4J85j24m3j7J10m9j43K66j0K95m18J67j15j15J00m1o7K05l09N9K46m3o5
5186D0j38J79L67k47r4n7l45J82N0K3J62k01j20N01l1k31l58J62O9J4M2%n6J66
5210G9J98k39P8k86J46lJ43k39J00NO6j86L53o9j92j20p4L40l24K81n5M9o5M8
$$ y = [182, -56, -63, -116, -94, 185, 12, 199, -30, 95, -35, -38, 162, -385, -81, 61, 15, -252, -103, -70, -121, 148, 54, -97, 125, -155, -99, 93, 8, 13, -88, 164, -346, -77, -94, -170, 349, 69, -178, 186, -47, -324, 7, 25, 90, 94, 163, -42, 71, -137, 252, 146, -110, 55, 149, -158, 73, -65, -273, 123, 22, -52, -249, -58, -107, 204, -75, 59, 41, 39, -135, 226, 95, 58, -36, -140, -198, -127, -38, -46, 74, 16, 148, 35, -98, -78, -186, 43, -97, 118, -173, -119, -77, -62, 31, 93, -160, -94, -95, 167, 199, 57, -52, 120, -87, 3, 10, -33, 63, 48, -43, -150, -19, -285, 77, -27, -20, 7, 290, -34, 151, 27, -16, -33, 77, 28, -115, 151, 141, 436, 18, 185, 70, -45, 55, 14, -53, 152, -157, -98, 148, 105, 40, -98, 81, 448, 201, 107, 50, -295, -113, -63, -40, 122, -79, -199, 302, 271, 40, -318, -156, -87, -73, -31, -31, -87, 79, 277, 38, 116, -170, -24, -27, 116, -123, -23, -18, 48, -138, 215, 146, -46, -166, -240, 100, -224, 57, 2, 51, -14, 34]
5234C4J48K6Oj48J59n10J02N28m90J77Q5K48k67k26K03N2O0n28K11q7M89l52l
5257h3K48k1o5j58L4K77m87P3L82q2n4l19J43J51n5Q1q1lr0O3j33K27q2j18J43
5282inj52K11k98K96O8j34P1J08k21o2J42K04l38K46nk41J91K50m18K61k03K00
5305A62o6l23L55k68J02nM46m94P7j07k9p2J54K08l60J02J62K14m07J7L4L09k08
5328CJ48j86k10J18L4J27J29N3j42M4k09J73k12L20j92r9J04n2J5J42j53j14L19
5351A60l30J89n9r4K60o62O16k43R6J14M6q9k96L12k16J36j53O4L21q8j30K2o3
5374h7k9L88m42J34N9k74K85j10K17o5m67L02N2K18j39J2O3n2Q6k72j51K52L19
5397B99o6l17J60P1kj35O3j09k6K26j60j36Rj32K70l3J09o7Oj26n7K71Pl8k79
$$ y = [34, 182, 208, 214, 66, 225, -285, -183, 345, -145, 32, 117, 365, 98, -128, 75, 127, 187, -341, -130, -217, 272, -80, -83, 165, 144, 79, -79, -45, 232, -255, -182, 200, 118, 64, -255, -112, 39, -16, 65, -16, -19, -109, -46, -179, 48, -34, -152, -9, -14, -166, 45, -253, 43, 111, -23, 48, 156, -65, -127, 15, 219, -119, 127, 122, -119, 72, 322, -96, 165, -38, 162, 96, -227, 128, -140, -38, -43, 403, -91, -14, -121, -150, -222, -68, 140, -220, -118, 44, 258, -149, -132, -98, 211, 3, 151, -35, -245, -127, -93, 34, 163, 216, 74, 118, -91, 82, -130, 190, -2, -101, 3, -49, -34, 108, -45, -159, 160, -170, 19, -40, -134, 126, -536, 80, -163, -67, 47, 93, 4, -292, 20, -196, -60, -213, -149, 172, 84, -46, -24, -87, -116, 272, -170, -36, 23, -251, 34, -76, 141, 76, -391, -89, -37, 181, 42, 54, 117, 65, 151, -121, -272, -20, 299, 233, -84, 76, 147, 145, 10, 73, -36, -62, 164, 4, -132, -123, -255, 15, -18, 91, 24, 30, -96, -153, 118, 125, 87, -192]
5422a92K72q9o3L3l5n3J0Q1p5J03k7j51K36L7j11P4q3O8r4J58qk34K3K44m02m5
5448c23K23J5R2k32K91J10R2m13K01J23K65k88k06n6O4J25n4p6K90j04k22O1Q8
5471F6k9k03O0J19J25k24k9m3Q7j98N2L36j26M9O9k6j50K44r6k25j10L32O7l52
5495b05J34p1l8K72j7j59J42q4K7K70m26K24o3n8P0Q4K8k17N4J28j45j34K10o7
5519d1Nr8p5K87r3M0J85J4q3R0j93J41m9j94j59L88j00j51K57n8L8l91L03l32
5543b69K47k28M07k34Q6k35K16k4j58N2mK04j69r4J67J13l57J44L99l12J50m0
5565F1j45L43k53j01l0R0L9k43R2j91L83n8j21K09k04J63j58K35N6j66J80j97
5587a6K8J5n8J33l49K43n8j82L54j87O0nP4n2l9j23M22j33p0r6j26L99p5k65m3
$$ y = [-192, 80, -9, -72, -39, -74, -127, -117, -36, -111, -8, -35, -186, 50, 87, -24, 50, -33, 35, -59, 99, 91, -143, -120, 124, -278, -323, -100, -85, 7, -225, 66, 176, 268, -145, 56, 179, 444, 156, -50, -106, -42, 83, 29, -47, 243, 139, -83, -22, 66, 37, -166, -106, 13, 138, -86, -115, -158, -71, -269, -217, 119, -7, 42, 111, 85, -65, 179, 83, -142, -252, 80, 147, -205, -71, -142, -180, 92, 75, -84, 58, -26, 1, 271, -155, 69, 6, -52, 18, 102, 130, -87, -33, 95, -50, -184, 26, -41, -36, -134, -209, 78, -15, 25, 210, 224, 141, 231, 38, 179, 130, -64, -223, 165, 65, -86, 171, 113, 151, -240, 63, -269, -22, -250, 157, -77, 9, -226, -10, -34, -192, -140, -144, 60, -109, -203, -36, 77, -280, -136, 263, -49, 101, 61, -84, 259, 6, -95, -125, -35, 4, -239, -147, -338, 45, -13, -134, 75, -129, 34, -124, 111, 167, 1, 181, -16, 12, 27, -31, 102, -247, -4, -62, -244, 110, -77, -17, -22, 52, 0, -39, -162, 260, 127, 57, -39, -165, 234, 159, -106, -149]
5612a49J4J41j58K9o8J19L60l20J67J02j31K0j89m7J53k63L0K29N0p0Q2K14m55
5635a40K94o4j77NK78j89j46J85k47L73m0k48M93m84k3l7J78R5l4k27M02l02J68
5658A13k15J25j9p2L15J56l35k54qR5J44l35J37J86L5r8K15l67K72m96O64j79
5680G9QR6k3k62l0J30o1j45K42J78l12O3K57j61Q2j09m2R7j75qJ55p0m2L4l6k0
5706g5J0J17q8n0J37o5j73L26j77Q9j18k0n3j61M58m17K03K52n4k08L17j56j26
5729c2K8K32m13l1M19k03L07k40j49J68k17J31j32P6r4O3J06J1p1k0jK62k00L
5753CK32l14L4J05p7p6j01K17l6o3j4N4r0J33J64j54k02J61m7k6P7k6p9K10m3
5778D2j54J90j26J23j28QJ69m13M14l4k18L18j71j9K32l28n0K24j50L9p2J0m7
$$ y = [-149, -135, 6, -152, -123, -191, -72, 288, -32, 135, 237, 106, 126, -63, -110, 43, -220, -190, 39, 89, 19, 101, 315, -140, 154, 90, -87, -82, 196, 7, -139, 46, -201, 172, 132, -116, 377, -107, -130, -167, 11, 106, 72, -155, 247, -55, 113, -102, 23, 4, -68, 247, 403, 68, -186, -194, -99, 45, -290, -153, 33, 68, -30, 185, -182, 90, -406, 258, 79, 87, 183, 160, -102, -132, -2, -63, -208, 34, 212, -100, -37, 220, 59, 141, 32, -10, 87, -88, -96, 59, -11, -53, -19, -55, -75, -65, 52, -36, -86, 51, -14, -187, 139, -38, 51, -67, -87, -140, -301, 157, -260, -57, 195, 141, -67, 250, 94, -32, -4, 228, -185, -216, 203, 0, 307, 67, -82, 86, -131, 0, -132, -56, -150, -87, 19, 30, -41, -61, -62, 200, 0, 3, 235, -79, -45, 60, -17, -93, -194, 23, -13, -76, -90, -36, -126, 7, 171, 17, -185, -24, -71, -97, -20, -46, -125, 85, 42, -112, 78, -48, 75, -53, -45, 124, -289, 125, 91, -127, 191, 20, 1, 233, -95, -145, 79, -71, -32, -104, -94, -141]
5801a41L19m33K8K98m0JL6k82j8K59p6k7M3k51J97p1K97j49k00J30K85l28J48
5824B5K87L0l51P2j18K12O0K6Rr5J18j07j17j8j60J64K1l9l6k16k8K48N1J4OJ34
5850A92j03j84J23Pl87K76LK7L18k63j23J33j38J08M9l0P9j53L9K6o2O8l23O6
5874b52M01k37L06m11L97j26j54n0n0K82q5J74n7j80J76k64J69j02J56j01j04
5895a12L28m54L28r1j85K35k56M6L64j17o0j06N4o5J10j91L85k48l0J2J51j80
5917h2j49N55p2j98j64j83J46L4J87j00J3J49m48N12k24j6L86k62j4n5k85K66
5939dp3J12P6j36P1k32J59J01r8K2K7j46K64l00K17M2o0P0n3k3J07j99J36j18
5963c8P6k75K71k45L44j31n3J1j52J77Q2j90Q4o6P2K06m6k45r9K67Nj80L0L63
$$ y = [-141, 178, -255, -227, 71, 31, 32, 68, -214, -232, 27, -49, -76, -33, -284, -87, -158, 139, -10, -210, -80, 205, -123, 25, 312, 342, -9, 63, -55, 157, 217, 243, 252, 157, 275, 168, 51, 33, -127, 37, 58, 19, -17, -233, -261, -13, 38, 52, 58, 192, 89, -95, 28, 35, -352, -76, -73, -46, 272, 9, -114, 19, -119, -11, 38, 8, 87, -66, -27, -1, -63, 5, -318, -252, 149, -88, 218, -193, 204, 78, -76, -126, -176, 106, 21, 195, 138, -42, 134, -130, 39, -63, 93, -8, -112, 216, -238, 90, -1, -186, 49, -207, -161, 203, 86, 26, -80, -26, -91, 19, -172, 213, -35, -65, -53, 98, -82, -231, 324, 252, 54, -110, -293, -147, -113, 74, -26, -13, 136, -312, 200, -24, -40, 346, 84, 70, 15, -270, -4, -77, 35, 111, -25, 46, -186, -27, 74, -24, -2, 25, -121, 143, -157, 60, 102, 42, 112, 59, 36, 143, -56, 80, -38, 38, -237, 34, -211, 133, 2, -51, -40, -192, -15, 67, -123, -39, -105, -33, 173, 127, -118, -217, 50, 55, -125, -95, 268]
5987B68k01j19N9J29J69l19R5j35J95m9q0l6J26j30m5J03Q9j89P3k2j23Q9Q5k32
6011b00j57L37j03J12R4k05j59K99j36J10K34k29k11K42J44o3j25J47k55K63j1
6032A28k1R5k73K57J16l19J73p0mK10l80M98n43J44p7j18K47k1K73m62J28Q5k6
6055D0k32K43j67J51Pj37M0o4K01j10p1r7Q6K3K99l14N2j74L16P6j49l38J97k
6079a24K54Ql2l13R1J11j9L5l0j05N3o1K21j33K4K62j94J40k02k34L40j94j3j52
6103b67J03M72j65k16J52m0n8k70J98J27L43l50J94j95J25k99Q5k6K0j41J47l69
6125d30N01J55k0J2k01k00l7K37lR3m39M08j41J53j49j07R6L9J22P6N7k12o5K34
6149A79k29K6J03P7l5l0k18j39K74o7j7o5K25j70j61J51j55K05J24n1J7p9q7K78
$$ y = [268, 67, -52, 7, 136, 305, -14, 81, -54, 141, 92, 12, -24, 102, -28, -73, 30, 119, -70, 3, -19, -142, -53, 32, -200, -357, -20, -123, -11, 83, -122, -281, 18, -118, -8, 226, -3, -214, 28, 172, 109, -16, 131, -124, 139, 128, 107, 202, -71, 186, 302, -17, 156, 86, 82, 292, -88, 410, -133, 11, -66, -184, 63, 42, 315, -147, -19, 66, 40, -192, 51, -116, 35, 42, -95, -55, -119, 82, -28, -99, -196, -110, -87, 212, -102, -50, -224, 92, 168, 19, -319, -122, -124, 130, 138, 106, -207, -116, -5, -24, 11, -19, -124, -71, -132, 89, -44, -20, 242, 48, 188, -14, -248, 92, -102, -115, -267, -164, 308, 143, -73, 79, 39, -19, -289, -91, 36, 379, 29, 223, 28, 153, -146, -61, -87, -67, -208, -61, -430, 71, 226, 206, 218, 17, -183, -220, 17, 14, 107, -332, 76, -65, 88, -61, -168, -72, -33, 89, 165, 222, 10, -55, 179, -50, -24, 79, 156, 121, 91, -127, -266, 8, -59, -76, -141, 84, -86, -247, -96, -251, -46, 78, 27, 44, -35, -122, 156]
6173A56l11Q2J60j91K0J16O0J21l41L22r0j52J23K5r4k0p5J80j66oj62L67l13
6196a89P9J19j71J29l29N52j54j26J85J01l4P2r6n5M6P7j27k29P0P9J65j27K73
6219C10l57P6O1rl54K45J26k26J15m2J20K8j37o2J03J42N9l08Q7j24J63k09J97
6242DP3j73L3J76j96O0n3L6m0P0Q9k28L31k92K46k52J67R7L9l44Q9J07M3k45N0
6267a13J31J31k03KJ97J38m24J89k06N4K21k66J86k65L65l47J32K98l09PO0m3
6289f5M0K73m64K69Mm05J55N21k65J6j00k48L22J38k39L81m24K38k69l7L27j42
6311B6Q5m6j94J11j86J46m7J11r1N7J08l46L24k49M46l05N8N02k25j37n6j41j17
6334a66L79l35K86k48R6J57m5m2P8n2j6j71J09j62J49j36K53Jj29P3j33J17r9
$$ y = [156, -155, -73, 87, -104, -84, 32, 92, 213, -128, 194, 104, -48, 75, 100, 6, -14, -89, 91, -75, -81, -243, 124, -189, -110, 9, -162, -33, -362, 190, 36, -90, 95, 196, 162, 234, 138, 83, 129, 206, 79, -150, -80, -1, 164, 37, 310, -47, 29, 90, 81, -273, -28, 98, -128, -13, -55, 65, 93, -44, -106, -3, 139, 198, -110, -23, -147, 16, -193, 4, 77, -96, -63, 113, -83, -23, -76, -40, -80, -10, 79, -149, 182, -110, 136, -116, 51, 148, 187, -157, -68, 39, 82, -163, -113, 18, 149, -54, -52, 145, 283, -141, 48, -158, -104, 117, -149, 37, -228, 137, -210, -78, 220, -89, -82, -22, -65, -25, 248, -216, 53, 57, -348, -193, 328, 63, 79, -21, -269, 53, 191, -48, 333, -91, 147, -122, -159, 168, 26, 111, 65, -129, -18, -204, -58, -105, 6, -85, -28, 80, -266, 58, -191, 255, -50, 8, 510, 285, 148, 92, -49, -166, 213, -122, 164, -84, 12, 169, 124, 82, 160, 108, 92, -79, 30, -132, 17, -119, 134, 135, 6, 79, -54, 63, -36]
6357c6O2j78K10k79J49L05j85o9J50Q9o1j84J97k49L90l91R9q4p3J68M4K21k9
6380B66l09j82J38o3K64l72L67l80L40n2P8j12m6P7J30k9j88P6J85m65K55L33
6402C11j65L2M2k91O4O4m9j42qP9K53k02K31r1l58L25k46L10j77j66K67k19P6
6425f0K43l60K99j69J49J3K13n0l31mRJ09m0j21jj09K02q0NJ4J23n8K91l29L1
6450a1j44L37j57L2l6P0r2K56k43M8N2o0O2o7k6K7p0P0k37O8K68l2L0j85M41j42
6476B59l76J88j35K03l98J82K44j18j06K93q8j77k9J50k22M40j24m56L66k75J02
6497g7J36L61m39o5nj2n8J61q2J17L36l19l2k48K98j00l24M82j83p7K33j28o4
6520h9K87k51j52L17j55o1M4j45J93P9M1j44O4K23m90J53J28q7K53l82J99r8J37
$$ y = [-36, 26, -152, 58, -221, -72, 233, 48, -21, 129, 218, 157, -27, 170, -79, 311, -80, 19, -65, -138, 30, 74, 295, 266, -43, -225, -87, -150, 114, -258, 109, -271, 69, 17, 95, -17, -63, 14, 144, 115, -73, 3, 188, -277, -22, 311, 146, 178, 220, -71, -7, 57, 8, -134, -142, -63, 190, -12, 219, 128, -230, 95, -151, 159, -18, -184, 83, -136, -60, 183, -177, 122, -47, 102, 115, 328, 278, -53, -57, -48, 61, 21, -100, -101, -210, -8, -88, -83, -69, 54, -4, 287, -42, -11, -155, 182, 25, 57, 21, 91, -1, 255, 12, 60, 112, 52, 114, 47, 21, 48, -22, 48, -189, -121, 147, 115, 145, -40, 401, 259, -117, 71, -64, 139, -259, -77, 167, 49, -57, 236, 148, -29, -58, 92, -130, 310, 186, -270, 96, -179, -77, 59, 420, -19, -84, -89, -101, -159, 2, -80, 37, 373, 54, 22, -226, 72, -28, -352, 130, -53, -130, 103, -25, -89, 198, -53, -205, 112, -43, -104, -60, -205, -12, 67, 108, -36, 28, 251, -239, -86, 42, -45, 208, -174, 25, -73, 64]
6543F4Q4j71l20N23r1j18j3j61J67j08J76k55J88KK51k87k21M15j2k05l6J77j92
6566a43k3K72j83j92P0L58j94k14J94R7J31l70K49q6nq6N9P7j45P5P7J53m51K35
6590d5l1Q5r2nJ63j21L20l72m5P9K01p9P9k77L76k11k24J66M6k02K83Q0j10j52
6614h8P9J23n2q9P0j58J09j07J18n0PJ70j54K15k21R2M9m7k7k17K91O5k53J19
6638D4r1j3J6J66j40J14Rr6p4K50r8j95J68J54k13k18k4N6J93j48K94j62J7J22
6662A31j65r2J82k44J79R3r0J40N6l5J84n58k9J77nJ60n1k7J94k94j6J48l1L05
6686C12n19K65m4j26P2k63K20J92l63M1L5L03l47J60n1K46l61K75P2k50k9N5K26
6709A21l70O9L48j90K18k95J92j3J1J28M8j9m97J38J89k65K07K21j64m3J40m10
$$ y = [64, 148, -23, -343, 180, 89, -29, -42, -203, -36, -144, 32, -223, -35, -33, 218, -69, -290, 125, 113, -92, -128, 49, -143, -166, 106, -77, -269, -199, 159, -35, -249, -55, 42, 173, -197, 52, -34, -39, -125, -66, 11, -134, -59, 18, 171, -280, -45, -76, 9, -83, -88, 75, -46, 274, -98, -143, -64, 137, 58, 137, -140, 236, 25, -199, -33, 13, -189, 94, 174, 64, -88, -9, 114, 62, -27, 43, -115, -6, -113, 5, -45, -38, 132, -22, 193, -28, 64, 113, 66, 39, -178, 113, 178, -75, 44, -47, -60, -44, 122, -18, 96, 105, 9, -65, 185, 87, -108, 60, 214, 1, -217, -241, -185, 8, -140, 154, -8, 9, 131, -34, -126, 56, -188, -9, 84, -6, 134, 190, 155, 339, -219, -248, -71, -76, 84, 33, 6, 200, -94, -110, 38, 7, 312, -207, 58, 14, -112, -40, -303, -83, 109, -254, -213, -178, 125, -222, -62, -113, 133, -228, 47, 119, -131, -160, -105, 121, -249, -180, 168, -22, 196, -99, 93, 80, 91, 219, 267, 248, -249, -111, 78, -187, 20, 241, 77, 34, 174, -236]
6731b36Q8R9p4R7p9J18k70L05n5q6J46j26n1j17M5J16o9L02k76j8K47l49M5Q8
6755a10J50J41L9k11N5p9o2L26j60j66m1J61R8L0n1k89L33p5J93l36K6n1r9K11
6779C3p3j12K20K18l00l61K32K30j65K35k0k02NK47k97K16l3O0k02j83L06R2j13
6802C3k00L7K51o5j48K42j21O4j59L3k69L41jo5J80l81R0K47J39j38j6J79l13
6825d0M73n48M85j46j17l05J68o0M5M5m1j56q2K45j61M90m25J4J67r2K03l18L13
6848A57l01j12n2M75l39j26j57L70K20l14k8L68N8k33N2l6J15j12o5K00j02k10
6870a72K56j28Q7J8j9k45K60k42J40L87k16k9M4j72K22l59J28J1k30J34j03L61
6892A33j11M8k31J88j04O7l8L01j95j29O3p6L7k54L69j79M60l82P2j58K42Q3k52
$$ y = [-236, -148, -49, -123, -26, -105, 13, -257, 48, -7, -93, 53, -73, -124, -241, -196, -80, -149, 153, -123, -141, 106, -243, -198, -110, 40, 181, 220, 9, 64, -15, -77, 249, 89, -77, -118, 43, 141, 171, 120, -169, 164, 89, 282, -54, -28, -79, -178, 33, -40, -152, 68, 286, -14, -375, -143, 87, -78, 157, 137, -65, -60, 187, -110, 106, 73, 133, -69, -252, 54, 146, 33, -167, -130, 121, 56, -92, 150, 29, 93, -66, -33, -302, 39, 38, -27, 153, -228, -138, 109, 248, 110, 94, 273, -40, 433, -115, 370, 224, 107, -198, -30, -90, -45, 0, -41, -197, -279, -34, -195, 295, -130, -116, 51, -41, 162, -156, 157, -144, -256, -308, 167, -172, -298, -455, -85, 135, -179, -207, 161, 219, -14, 38, 2, 117, 5, -60, 140, 38, -172, 84, -44, 43, 61, 42, -203, 57, -185, -45, 342, 126, 97, 141, -31, 191, -168, -40, -29, -259, -125, -228, 133, 22, 70, -161, 27, -77, -10, -48, 253, 58, -71, -8, -84, -47, -301, 68, -111, 349, -33, 39, -119, 123, 206, -46]
6915d6K02j04L8k38j0n8M47K2j67J6o5j35j38j6J25J56o7L9k8m6m0J16j28N0l8
6940a13p2J46J62l41O7J65o6j38m1K27l2J72L2R0m1n28L72j44K38k7l73K96j54
6963a03K39J20n48L45l3j5PK54j49l16P7K99l06J25l22K22M98m23o4N7R2jJ55
6986B10k12L7J4o9n2j46K28j08J9j20K97o0o8P6l07M18M0k72J7J36j8k63K55K3
7010G5r2L4J24q5j49l9K18M5m0k35K00l06J25K0n1j11L60N2k02J58k20j12K28
7033cJ27l33J06k03K15M11l05o3J62Mj98k4R2N4O0j85j08R5J25J37j42J84k4l49
7057a65K91j94N5R6j05J73m77J82J55O8j11J1J42j65J90j21j68J58P0k37J70J80
7079A98k55k5J53q9k6nN2L26k57Q2k14q8qL12l77J23J12q8J67l9j37J19j5O9l53
$$ y = [-46, 156, 52, 90, -148, -158, -216, 231, 253, 86, 102, 37, -98, -236, -252, -127, 29, -38, 1, -27, -73, -113, 3, -125, -75, -113, -185, -39, 123, -218, -151, 14, -52, -190, -231, -4, -36, 136, 168, 258, 217, -311, 61, -83, 155, 128, -245, 51, -103, 136, 256, -292, 53, 20, 5, 12, 266, 117, -199, -122, 177, -129, -4, -326, -104, 394, -29, -93, -36, 56, 55, 210, -2, 35, 49, -20, -72, -218, 10, -98, -79, -199, 98, 38, -30, 46, -261, 157, 197, -75, -58, 78, 60, -203, 52, 75, -17, 17, 141, 56, -93, -132, 86, 131, 91, -144, 56, -250, -125, -105, -156, -267, 93, 145, -57, 101, -119, -231, -3, 124, -209, -103, -306, -91, 320, 15, -48, 114, 118, -80, -104, -12, 42, 102, -83, -191, -96, 29, 166, 24, 208, 184, -165, 126, -68, -13, 83, -22, 151, -326, -144, 11, 79, -32, -21, 121, -44, 146, 25, -143, 15, 85, -152, 18, 198, -57, -82, 71, -18, -44, -49, 3, 329, 72, 154, -60, -148, -156, 156, -221, -98, 14, -74, 93, 54, -83, 36, 21, 90, -263]
7104b63P2J75JP0J26J8m15J27J63j82L74l70N9J36j88L67m15K31j56j10J40P1
7126C1J20l73J41R0k57J68j50K53Q0p1l1k2L24n32K55j94J99JPk14m1L9J16J4
7150d7o4K55j76J16j89J23q4k0J26J10R4l0k69J75n8Q1m32J03K67r3OJ68j89N2
7174B5J28j09j07k0J46Q8m2p8K5r1J86k31j02K21r8L05m93R7J6r3J58J5M7j82
7198a89J46pP3j01J24j30R6j51K33j66K79k46k85QL57n8L67m32l5%l50N69M4j63
7222a7P5k55J39K97k71KK52m02J55J95k73K47R1k35N5n7M7k92K26M02l51R3j19
7245DpO1k48k8P5K59k90J30Q1k5Q2o2j10J71k07K59k98K8J43J09j42j43K8j98
7269c28K27J45k01J39l9Q4J46j61K11j68j7j09L40j48j9n6j9K12k7j97j82N7k4
$$ y = [-263, -191, -16, -15, 55, 181, 199, -216, -89, 74, -108, 266, -104, -45, 91, -97, 270, -145, 86, -70, -180, -40, 31, 151, -222, -81, 9, -248, -80, -230, 23, 103, 32, 1, -21, 303, -229, 26, -168, 31, 32, 39, -175, -216, -177, -61, -47, -111, 144, -32, 84, -105, 18, -66, -86, 40, 150, 244, 214, -55, 120, 62, 143, -289, -186, 81, -12, -6, 162, -27, 25, 153, 44, -63, -83, 63, 151, 109, 31, 56, -35, 151, -80, -182, 39, -59, 246, -247, -150, -134, -227, -69, -54, -7, -189, -43, -50, 23, -78, 46, -84, 12, -139, 94, -72, 207, -39, -324, -316, 41, -17, 350, -82, -117, -117, -467, 102, 146, -17, 58, -197, -58, 239, -32, -30, 222, -180, -25, 170, -103, 144, 235, 0, 55, -2, 45, -247, -21, 381, 30, 123, 4, -3, 58, -190, -218, -143, 116, -174, -44, 37, 12, 94, 32, -78, 93, -114, 145, -153, -125, 18, 127, -15, -158, -130, -328, -101, 44, -157, -18, -57, 27, 173, 12, 223, 55, 38, -71, 269, 121, 102, 46, 27, 239, 212, 15, -167, -110, -134]
7292a34RL24k54K6J56j61J24o2rL6O6m4m4k26J79L7k93KL30l63L19K82l35m5J90
7317A10l46M02J04m67J64Q8J53k85j6l11P41m73J13N6p5K5J35m16M42m0J16Rl53
7340a24J94j82Q8j5P5j47O8j7j61J48J91l32K43l5j82J76j12K44j57P0j00l8K05
7363A00N1k34J47k34K61K0J05p4j67R3j17J43k22K17p8k22J42K4Q5Ql24M57m09
7386b28K04j02o8L55j53j16J70j77L29m32J55K75k04J81l64O7J1k11J33M0K91
7407A56m6j54l61K01J69J58l32R7j30J14K47q9j11k7L3O2J64j7o0J5q2J10J4O3
7431A94k66J02N6j40L06l50J72k32N7J00k2j60j36K70k6J49m40K73K00l05J57
7452d1j2J50lLk6j68k5JL89n17M27J14l77J34j02J49oj1nj52J38l6K01m84K42
$$ y = [-134, -125, 199, -55, -29, 127, -34, 90, 28, 19, 55, 121, 77, 33, -193, -14, 23, -270, -268, 62, -301, 18, 300, -35, -80, 110, -236, 166, 270, -197, -33, 55, 208, -77, -93, -404, 337, -136, -23, 33, -42, -17, 118, -298, 144, 104, 220, 229, -124, 70, -112, -24, -39, 36, -111, -43, -60, -221, -73, 118, -214, 29, -6, -188, -12, -124, 120, -37, 33, -67, -105, 100, 151, -83, 64, -170, 91, 111, 216, 142, -25, 68, -49, 94, -128, 89, 11, -211, -69, -45, 40, 48, -276, 181, -228, -24, -126, -194, 161, 8, -108, 62, -115, 214, -218, -63, 212, 8, 189, -175, -108, -97, -308, -175, -135, 156, 110, -44, -405, -204, -35, 123, -209, -112, -242, -128, 119, 30, -81, -108, -75, -13, 151, 134, 74, 89, 7, 117, 131, 194, -72, 30, 86, -54, 252, -98, 74, -158, -101, -1, -23, -183, -319, -49, -75, 74, -366, -93, 107, -198, -41, -53, 97, 94, 97, 71, -97, -122, -121, 268, -249, 178, 292, -85, 49, -53, 96, 90, 79, 74, -78, 60, 24, 225, -259, -17]
7477a7J6K41l87J63o5m7L5M4J4J00p0j35J88l50r2N68j29K5r5j4m6j84K08J83
7501A54j51k1J1j7r7K03l38J61J25J07j79rQ1K23l11K9R5n3K9q1M6r9%P1j4r4
7527a29L36K8k32N1Q1j21L9R5k27J47PP0O3k41j18K45j98K57K36m49J48j7j32
7550f1ol2Q8K18j89j19k3J73j34J75j38m9L11j77l53L72K23l36j53N50n42k45
7572d47L56J4J78j37l1k5K05k83J74J23k59K57J23l18P6K20q1l77L15j62O3L3
7594A7n7J12o4J01j91k1J90K7j53K06j81P9j11M5n4p7N4J28J61j03K12m26M79
7617C73m16K13j42r6l2J99m28K42K45K1j66n1P3l05J71L04K3l60J27p3O0r6K06
7640I2j83j35K32l48N55k77M1M3%rJ08j72q0K08l39L42j73M53k17l81J95N8K05
$$ y = [-17, -1, 240, -147, 16, -49, -96, -61, -17, -3, 97, 27, -108, 80, -270, -362, 206, 77, 102, 7, -7, -53, -237, -29, 154, 3, -18, -7, -24, -121, 82, -256, -95, 30, 137, -42, -51, 30, 253, -58, -29, 66, 13, 42, -39, 7, -92, -92, -21, -35, -129, 207, 235, 3, 54, 135, 14, 53, 148, -79, 68, 75, 145, 208, -33, -151, 94, -104, 153, 389, -60, 88, 71, -61, -67, -99, -11, 207, 18, -101, -124, 49, -85, 90, -48, -97, 214, 37, -316, 56, 279, -57, -210, 340, -202, -447, -91, -77, 101, -36, -67, -92, 113, -170, 4, 127, -132, 125, 248, -70, 6, 226, 145, -232, 83, -79, -16, 17, -40, 72, 8, 109, -82, -103, 87, 114, -39, 167, -14, 65, -46, -1, -55, -132, -78, 50, 211, 108, 320, -106, 373, -43, 170, 28, -68, -100, 99, -329, -87, 158, 179, 13, -38, 35, -270, -99, 205, 228, -132, -5, -78, -18, -114, 92, -91, -226, 6, -342, 213, -64, -23, 20, 20, 11, 119, -53, -133, 75, -264, 78, -95, 358, 141, -240, -45, 13, 218]
7663B18k24k74N11j42l5k61J29j83J87J2K85l48M1J01J97k84L0J17k2o1k48K04
7685e0P0J37k04n8m3J2k7J20L64l31n8L97l75L21l80o0L89l38J46k27K58j23J28
7708F8J3J17k72r2L06k88K93k87J34N6j21pj33L0M21k72K46n14M27j73M7J32l60
7731b29K06j35J38j68L07j02l5j52L67m7q2Q0j57P0k29L99r3lq2jm6K84l13K16
7755A93j68O4p5J25J41m09J26J3j30P4Q3j52K47j66p1m9RJ86L7p5q7J37P3l18
7779a92Q9K90k22P6l16R0O2N2J92m26M00j09nL51k18j99J30J67k72j45L09j34
7801c0K8J10J53k19k5R3j76n2j9L37k55J69j59J07J85k36K93k82k71J09J11K84
7823B55j6n21K54q4l3J11J37j09J74M1o6k55j34J30R8j43K54l62J73J30N9k6l53
$$ y = [218, -6, -280, 231, 89, 54, -207, -78, -261, -74, -62, 223, -125, -84, 17, 214, -70, -40, 77, 55, -6, -254, -50, 20, 157, -47, -105, -148, -136, -163, -43, 321, -10, -68, 329, -46, 275, -105, -165, 224, -114, 32, -195, 63, -60, 68, 81, 198, -74, -166, 140, -148, 145, -142, -8, 48, -73, -80, -213, -183, 238, -34, 212, -302, 125, -48, -1, 131, -229, -23, -158, -20, -188, 119, 17, -18, -170, 197, 150, 68, 148, -9, 61, -168, 231, 138, 135, 53, 52, 6, 290, -23, 193, 25, 89, 14, 139, 280, -129, -3, 10, -120, -46, 37, -115, 132, -34, -105, -154, -145, 41, 78, 3, -84, 53, 126, -192, -103, 187, -35, 41, -275, -185, -123, -71, 121, -305, 95, -14, -19, 332, 114, -85, 45, 212, -60, -205, 104, -30, -2, 108, 261, 42, 17, 110, -66, -118, -137, 200, -55, 114, -45, 62, 247, 11, 304, 22, -249, -140, -29, 255, 239, -282, -28, -112, -145, -34, 103, -6, 168, 209, 143, -112, -246, -116, -18, -161, 93, -269, -96, 34, 93, 67, -286]
7846b86J92k37M70j27J36j48J99j38k21L93l30pk1nJ95j77J92j08L8o0lK68j83
7869C2l46J87J80J16r4j59Or2J19J44M7J08N3n21L74k39p3K80n4K5k03j60L04
7892C4P9l89K87k33L08Nj52J36j80J9M39l09o2J31j43o4J04q5M5p1L34l31J89
7915I1Q3l45L31j31J34k9J41l52K46k38J21k35M40l06k6LM8m4P7J15j41J72j20
7938C5J59l61J88n5J29rk7k86k9J53L40j31k83L21k40J35R2k80O9o8Q6k7L2j9
7962g6L4P6j48J46M1N9j84n2k76L43Q6N8M0k87L41m51L45Pk10Kqj25J84r5K04
7987E4Q3j08Mj96K24J40k28J1o1j06P7K31j17j70M61j83j26J49j05P5J91k79p2
8010e1J06o3k23J71N1p9L73l40J43j44j40K18l56L98j97O5J93j79J01m7L17j06
$$ y = [-286, -94, -331, 139, 12, 148, 0, 199, 61, -160, 233, -97, -104, -125, -130, 65, -112, 80, -28, 10, -50, -53, 215, 32, -314, -127, 53, 169, 75, -84, -78, -170, -51, 93, 140, 248, 301, -220, 154, -85, -158, 122, 68, 93, -110, -270, 34, 113, -276, 11, -222, 86, 91, -61, 75, -105, -86, 353, 44, -18, 113, -30, -94, 10, -75, -30, -101, 233, -98, 91, 174, -171, 160, 29, 163, 134, 275, -77, 169, -69, 52, -183, 257, -49, -75, -72, -24, -68, 9, 124, -17, 155, 35, 194, -167, 21, -34, 95, 86, 59, -227, -256, -103, 237, 106, -177, 144, -96, 39, 131, -149, -80, -148, -62, -89, -57, -76, -42, 34, -114, 32, 73, 132, -52, -104, -380, -37, 49, 107, 147, -140, 201, -250, 95, 102, -108, -106, -114, -239, -55, -150, 54, 137, 29, 33, -163, 61, 201, -27, -16, -77, -183, -106, 125, 8, -162, 299, 116, -10, 139, 34, 109, 300, 21, -51, 55, -8, -231, -60, -9, -88, 285, -55, 88, -56, -196, 22, -334, 64, -133, -68, 125, -54, 47, 0, 317, 211]
8032B11m31K80n1R5j96K43l54J97K72k88j35j93L04m2J69j34J73j50q1K61j80
8053c0J6M0k22O7n5N6P6K16k15q3K95n07L11J65p5j90J23j76P6J50k18J0J86j69
8077a53j13J95Q7K27n1K1k67K1l05L21k32J34OjK80k03J86r5j57J59o5j82M0K80
8101A33q0P0k03k7l5n0P9L9M72m58l6N7o0K74l34K98j64K90l52q0M1K32j80M6
8125b8j0L65o20M11j86Q2lM3L9m05L16j4p6J05j7m23L05J52K4J61L4m7m61K16
8149c7J96j36k5LJ78k68K50k17o4K79k35J02l9N9j35O5J6J39r3rJ81m04K97m9
8173E4m5o6o6J86Q3l31N4J71nK77m51P6J20J47N2l51k8L36
$$ y = [211, -220, 60, 9, 104, -92, 151, -203, -6, 266, -22, -157, -350, -46, -88, 81, -53, 120, -30, -111, 150, -30, -14, 26, -196, -129, -184, -128, -52, 164, -51, -134, 161, -346, -35, 130, 55, -135, -12, -188, -112, 38, -180, -170, 16, -153, -266, -71, 16, 243, 192, 213, -54, -33, -338, -17, -249, -115, -109, -110, 170, -33, 153, 58, -99, 60, -5, -187, -147, 133, 53, 123, -80, -107, -142, -192, -113, -74, 398, -60, -96, -39, -99, 175, -159, 139, -25, 265, -87, -167, -126, 106, -74, -28, -38, 327, -293, 118, -68, 14, 11, 54, 93, -312, 4, -10, -86, 19, 2, -421, -116, 36, 60, 221, 255, 208, -253, -37, 159, 23, -2, 1, 179, -89, 161, -56, -120, 159, -76, 26, -13, 46, -89, -24, -8, 131, 38, 29, 210, -194, 103, 54, 9, -57, -123, 63, 146, -185, -131, 40, 35, 312, -139, -63, 57, 204, 256, -95, -123, 213]
8191B13
$$ Imaginary data points
##PAGE= N=2
##DATA TABLE= (X++(I..I)), XYDATA
0@%%%%%%%%%qJ6j6K4l2M0m8N6p2Q8j12J36j60J92k24K64l12L62m18M83n57O39
31C41p30Q31r41J063j199J348j513J693j889K105k341K598k881L190l526L893
47B042m292M731n214N744o328O974p691Q494r398J0420j1589J2942j4529J6419
61H725j8719K1584k5274L0238l7307M8266o7751J13037m22120k23587N68770K73473
73B69335K24220k6770j21596k91239k39614j64307K8796J09076J76942J45415
83A10258J17238J793o9416j23771j06814q3353L03N3182Q4107O0984M5756Q730
95I8997k0837n7990n9084l7559K323K2208L8694L7846K6413o69j7649k8400k3627
108a9334j1208N708J1357J0928J0176J1637N868n746j6009j1667l021p65n32O497
$$ y = [0, 0, 0, 0, 0, 0, 0, 0, 0, 0, -8, 8, -8, 16, -16, 24, -24, 32, -40, 48, -64, 72, -88, 104, -120, 144, -168, 194, -224, 259, -298, 341, -389, 442, -499, 564, -635, 713, -800, 893, -996, 1109, -1232, 1366, -1515, 1675, -1851, 2042, -2250, 2481, -2733, 3011, -3317, 3657, -4034, 4460, -4938, 5482, -6107, 6835, -7694, 8725, -9994, 11590, -13684, 16554, -20753, 27513, -40238, 72799, -349321, -572908, -4138, 269335, 493555, 466785, 345189, 53950, -185664, -349971, -321175, -212099, -35157, 110258, 227496, 229289, 159873, 36102, -70712, -154065, -153762, -100580, -16473, 44511, 90267, 98997, 78160, 20170, -38914, -76473, -74150, -51942, -13248, 24598, 51011, 50342, 32693, 4293, -19334, -30542, -24834, -13477, -2549, 7627, 19264, 25132, 19386, 3377, -8290, -11311, -12076, -12608, -6111]
122f111J0494N032k756l140j051k946n391l307K648N723M613K727K200n55n254
137B926m172o56K218J451N11O7k61j020j074k46p22j569j052O50R67j7R36Q66
155a97N86n10j060M51P79N1r28O74J265M89m47p28j099j35L31O26l22M14J33r67
175e94l02K78N17K76L19j669j56R00N17o85J65K66q5k19L19J25j29J96k23j02
195b86K99P2k33k10j22k20J71P2M9m13J35L79K19KJ14M27K54J98l30N3N04k12
217I22o4j52j25j47J85M7q02j3K44j05k08n1J8J59O06n96J11K75mMp2J1n0j59
241C4J44k71j5J30j27k21L30J50k63K65J36k76J31L40k46n0K58j12l36K54l83
262a28n9L18l60N3j18J07q4O8J49R3l43L3L09k45J45k47l9L36k30j56k7K29q4
$$ y = [-6111, 4383, 9415, 6659, 3519, 2468, -478, -5869, -9176, -6528, -805, 3808, 6535, 8735, 8180, 2926, -1246, -1902, 316, 1767, 2278, 2345, 2084, 1064, -10, -256, -978, -2547, -3599, -2949, -1982, -1999, -1063, -197, 389, -121, -1181, -730, 49, 100, -828, -154, 1111, 1600, 1153, 425, -674, -809, -478, 148, -174, 240, 373, -594, -896, -618, -101, 175, 494, -1175, -1331, -431, 86, -599, -434, -168, -253, -472, -153, -28, -157, 39, -184, -286, 13, 85, -148, -358, -480, -700, -529, -457, -408, -821, -686, -307, -88, -86, 28, 455, 709, 907, 577, 630, 1134, 922, 858, 706, 581, 434, 619, 666, -136, -149, 95, -10, -218, -269, -251, -92, 514, -82, 29, 304, 300, 304, 232, 243, 193, 34, 178, -93, -108, 22, -105, -326, 4, 154, -109, 156, 292, 16, 147, 487, 241, 191, 449, 337, 1, 255, -128, -187, 131, -229, -176, -294, -187, -271, -203, -54, 39, -304, -271, 38, -207, -62, -309, -348, -12, -242, -398, -425, -196, -280]
285b80k64L41r5k0K36q1R6pJ64j99J91J52j4k95K29j84p9mj11J78L0M77k67j92
309Bl8L51Rl57O8K64k39k23r4K30p7n4j15K04j41KJ28J59N3oq0J67K79j66J61
334D87p9j37K0j98P9j35J92l85J24k14L77l10o1J03N7L26j79nq4L1K70j94j45
357f0j8J90k84K79q3j48qp8l3J43j8L87l40KJ62qrL4r1k16K63k66J13j17J98J93
383A87k17R1l14J69L35r0L4q5j65L65l86M0j68oo9J59%J44l53L19n3J79k30K42
407A28K06k33j35J36J42q2L9j87qk15o4K42J27l13K24l8m3l1J00k2K96k13j9J76
431B13o2M7j6J05k85J4L7J7l75O04l71j85K34O5m6k94L31j00m1k7O32m72K1k47
455b01K29K71l38J71M9l49Jq7l9L09K05k51J67O9k74J50j19j56J70N1j72L92n66
$$ y = [-280, -544, -203, -298, -318, -82, -163, -67, -74, 90, -109, 82, 234, 220, -75, 154, -30, -109, -113, -224, -46, -16, 461, 194, 2, -36, 315, 324, -33, 35, 299, 60, -163, -257, -27, -104, -158, -273, -69, -210, -208, -80, 79, 132, 126, 46, 213, 492, 326, 487, 408, 271, 291, 93, 172, 37, 229, -156, -32, -246, 131, -179, -240, -137, -80, 246, 67, 62, -22, 9, 279, 85, -60, -78, 112, -172, 107, 24, -124, -132, -210, -243, -100, -118, 269, -71, -69, 93, 85, 76, 110, 19, -197, 66, -200, -87, -204, -6, 187, -30, 61, -253, -84, 251, 161, 195, 110, -55, 310, -76, -36, -204, -210, -279, -120, -120, 24, -329, -10, -63, 116, -114, 128, 334, 101, -34, 102, 244, 162, 201, 14, 6, -209, -273, -31, 96, -217, 7, -31, -74, -105, -5, -27, 269, 56, 37, 213, 151, 198, 182, 287, 2, 16, 53, 70, -305, 299, -72, -257, -23, 42, -4, -298, 33, -67, -108, -135, 497, 25, 46, -201, 28, 299, -39, 132, 181, -168, -167, -254, -293, 16, 221, -30, 137, 206, -68, 82, -37, -193, -23, 28, -144, 248, -318]
478c18M11o6l1j51K06p4l1r9L6L19j18l0j7M5qL8J78k53l9J21l15l3K66j70K41
503A08R3M9k16j35K79j53J20k30P2j86m8J66L6k19L19j82kK41N7j19o1J87L5m31
527b20M36m53J53J24j10J28k41K31p2N3l48L89j75r1L6J30l4k7n5J9P1R3k55M24
551B06j70J17k19L5J92k74L4J83r7k05K18K6o6j81J06j6K51k75K11P8K9k27Jp7
575a20K13l7J81l43J02L7o2M5j21J92k35j49N37j37k97M50o0l2j63j3p4l5L0m1
599a32L65l80J86j52K6K58j04l41M36n03M49k09L11oj05l24L83p8k35K73m31M21
621A08K6r4l1J05k39K06j6q7p0K79j69k1J6R1j60P6P0j65J97N2J28k65J89k88
645f2K46k14j34K1L6K77l45L32k07J04k68K09k18J92L43k84j9j21J10K3K6n4P0
$$ y = [-318, 93, 27, -4, -155, 51, -23, -54, -153, -117, 202, 84, 54, 37, 82, 74, 112, 290, 37, -2, 119, -196, -229, 37, -133, 108, 201, 250, 34, -101, 178, 25, 145, -85, -13, -199, -247, -81, -45, -264, 55, -127, -129, 112, 169, 50, -11, 176, 211, -220, 216, -237, -84, 40, -70, 58, -183, 48, -24, 29, -319, 70, -105, -196, -160, -30, -64, -91, -146, -127, -56, 37, -218, 206, 36, 153, -66, -31, 161, -113, -79, 104, 7, -198, 20, 46, -20, -201, -95, -111, 140, -135, 76, 154, 183, -44, -43, -120, 93, 56, 237, -106, -4, 33, -29, 16, -105, 87, -148, -297, 240, 103, -194, 256, 196, 164, 1, -12, -86, -121, -91, -132, 233, -147, 39, -113, -87, 171, 67, -274, 162, -341, 108, -101, 210, 204, 99, -225, 158, 80, -155, 118, -313, 108, 134, 40, 9, 114, -125, 81, 65, -22, -92, 187, 18, -3, 13, 104, -56, 20, 90, -75, 122, 174, 302, 37, 226, -62, 184, -30, -164, -143, -107, 170, -175, 157, -50, 54, -214, -5, -223, -31, 312, 28, 9, -112, -2, 21, 47, -7, 63]
668F3j36K74k23r2J25o8j48J19r5O8q2Jr3M18m03J73L81m53K34n4J2O2j46j94
692b57K95j96Q9J8j28J35K49j96j90J54kQ1LJ11p3n34N84l63J17l07K86P2k0j8
716i0Q8j98J23o0k41N09j10K19l77o2K68P7k38j20J56k61M02q8J26k52j14O2M10
739B29j58l01L51q0J29j72J45J7l11R1Lm1L35k38R6j92J78jk41J40j00J13j29
762a37J12J23m05O94l54m3M1j90J64J01j70j12J5K68R9k22K65m5k54j18J70K03
784B05Pq7k70K18k6J8j14j2l3J30p9M3QK0j14j06J59r1N1K63n14N50l10j03J5
809a72M7K09O2O6j78J2J7K44mj32k58j91K12J98p4m01L40k6q6M69m38j6P1J39
833A10l25J87N7P3q2o6l2J4l0j64O3J16j0nK8j43KK82r7r2N8L8pn0k4R3J82J9
$$ y = [63, -73, 201, -22, -114, 11, -57, -205, -86, -181, -113, -195, -194, -287, 131, -272, -99, 282, -171, 63, 9, 21, 83, -63, -257, 38, -158, -69, -51, -179, -44, 205, 9, -181, -27, -29, 52, 55, 166, 93, -441, 143, -220, -103, -410, -124, -52, -72, -90, -2, -200, -77, -137, -378, 131, 21, 240, -137, -199, 69, 146, -92, -212, -56, -317, 85, -3, 123, -129, -243, -181, 229, 71, -230, 121, 41, 170, -2, 143, 160, -151, -60, -57, -98, 237, -1, 95, -97, 81, 80, -161, -21, -121, -8, -137, -25, 98, -307, 387, 33, -10, 31, -159, 5, 106, -64, -176, -161, 107, 206, -16, 249, 204, -50, -168, 2, 205, 212, 125, -145, 73, 47, 65, -49, -61, -94, 36, -43, 0, 8, 28, -86, -192, -33, -124, -73, 190, -324, 226, -84, -187, -172, -125, 84, 146, 212, 34, 46, 63, 307, 303, 171, -87, -278, -66, 132, 58, -343, -3, -29, -115, 354, -84, -100, -29, 110, -215, -28, 29, 102, 20, -46, -78, -64, -94, -258, -195, -79, -89, -94, -66, -209, -207, 75, -22, -114, -56, -18, -25, -75, -99, -6, 176, 195]
861A95l09K22J24j43j59J56j71J76jk75K68k23K61j80j6Q6j55j1L66l76L16j74
883b3%K21l23K23l7J88k76l9J29k47l1L69k33J1J13P2o3r9LM0j56P6M8j72N3J12
909d1n7pj1J37j26J87k86J25L29m94K38K05l13Q4k35L29P4K8j38j31R6R0J34l40
933a23l1Q3L0K07n8j04j6J26K3q0M7N1k87P3N8J34o8j36P9J60l13L43k18P5j64
958a09K94j19k2J75j81J5j02K23k07r6M21j71j49J57k08R1j19K3J16p0J05o7Q2
981H2q1P0l22O9L44p1j68k1K47r3m7l08K99k16K34L23j20l28J34J78o1qNm42J20
1006a81L26j07J4J26k72J75r3j07J53k53L64k08P5o4j69r4Q18m73j42K5J27K76
1028C16l57K22k74P0J32j77J92k89J94j49J31j05J98k44K21k8j87J90j68M7K4
$$ y = [195, -114, 108, 232, 89, -70, 86, -85, 91, 90, -185, 83, -140, 121, -59, -75, 11, -144, -155, 211, -165, 151, -23, -23, 198, -125, 98, 61, 249, -27, -66, 63, -184, -215, 154, -79, -68, 45, 117, 54, -45, -42, -2, -158, -82, -34, -206, -153, -41, -98, -105, -116, 21, -105, 82, -204, -79, 250, -244, -6, 199, -114, -30, -265, 64, 138, 166, 28, -103, -7, 83, 217, -123, -154, -71, -41, 166, 108, 4, -12, 114, 137, 57, 104, 155, -132, -59, -1, 133, 65, -71, 8, 168, -145, 198, -20, 55, -109, 185, 66, 44, 219, 38, 53, -49, 174, -33, -129, 292, 121, -28, 129, -79, 12, -107, -84, 32, -38, 67, 0, 82, 1, 71, -251, -182, 162, 91, -77, -98, 149, 56, 9, -299, 0, -216, 18, 341, 221, -107, 27, 205, 144, 136, 141, -301, -181, 145, 38, 52, 178, -94, 81, -12, -119, 34, -219, 145, -63, 12, -52, -221, -315, 503, 30, -112, -87, 40, 316, -41, 181, -93, -23, 109, -68, 124, -165, 29, -120, 11, -94, 104, -140, 81, 53, -134, 56, -112, -65, -41]
1049d1O3j50Nn0L44k81J93Mr2L7Q9j90l9L4K9K03r2o3K02l83L0K49m56L45L5o0
1075c5J01Q1j64J50k39L10m42Q1L7K0K7J13J36j04j87M2J08l26j1J94K11l14K44
1098C3J07j66Q8k97J47K35j20Q0r8K0r3M27l10r6P7j04O6k3rj11m5Q7P8n2K0M1
1124a8%l2j40K92j72J61j63K31N9k42Mk88L37K05k14J67j70M3N8P4j56k22K44
1147E8K43j63l39K29J12o2P9KN4j12k67K8J24j59L15J20j36j51j3K23j49j57K32
1170A11J00l51M3L5J72k21K29j23j28L82l42Rq9Q8J89J9k40J47p7J99j90J49l64
1193b53R5Q3k1L8K23k88q3K45k38M35j23L5K9j94k54K76K5R5k7J73l32j75j01
1216c37M01j08q2J54o3L35N5r7j65k6j82N8j4m9P2n9J29M7J45j85j23l48L51r5
$$ y = [-41, 22, -128, -123, -173, 171, -110, 83, 87, -5, 32, 121, -69, -108, -74, -45, 158, 66, 3, 205, -178, -148, 101, -355, -10, 25, -35, 66, 147, -17, 133, -106, 204, -238, -157, -120, -100, -73, 40, 176, 72, -115, -73, 35, -291, -302, -108, 103, -211, 33, 140, -26, 62, -235, -88, 147, 27, 107, 9, 29, -64, 363, 53, -43, 34, -70, -4, -27, -36, -147, -192, -105, -27, -79, -59, -18, -18, -50, -190, 102, -70, 91, -72, 159, 218, -24, -20, -308, 29, 234, 20, 187, 17, 60, 118, 192, 36, -186, 58, 301, 138, -201, 28, 140, 78, 157, 159, 213, 101, -166, -138, -14, -173, 142, 262, 126, -25, -38, 185, 36, -121, 111, 211, -140, -97, -62, 110, -111, 118, -5, -133, 249, -93, -84, -173, -85, 104, 123, -117, 30, -47, 152, -38, 111, -253, -158, -75, -96, -58, 165, -123, -206, 39, -199, 236, 113, 148, 177, -17, -271, 5, 30, 125, 98, 271, -61, -236, -337, 64, -44, -126, 28, -35, 300, 355, 258, 93, 67, -115, -57, -71, -120, -48, -107, 22, 69, 214, 29, -94, -442, -91, -186]
1240a86J58k8j68Q7O2J04J89j62J26m8j10n1K7j04K20K3j71R1l4J01l38J66L1
1263a5j59K45Q9p2M0n9n1J91k91K02k91O6j09P7K63J33j71l32M47k05l9q3K28
1286A04l48J46K72j81L9k23J50P8K8j79J12J38j44Q1j76n5K65l7j0j14K46k64
1308g2m7n4J55L1J7l0O2k45Q5J58k7j47K2K2K48r4J13o91K53K66R9J82j66l06
1332a66P3j4J30J37Kj77l4k9M11l32R3j83N2n0k51K55J65O1l57K95j91J46k09
1355a73K32r8j02p5L75l17L3L10p2M9l6o7j6j44K90o5k22O3J14j73J81K18k48
1378E7J96l70m7k5n4J87Q2L4J66j84J36l77M6L3k02N13J51m06K04n2k41L0j2j18
1402b53L56j34K12k39QJ16J33m83M9J70N8k36K80j6k60K06J60j9k60L4L72m00
$$ y = [-186, -28, -56, -224, -137, -75, 29, 218, 56, 182, 134, 24, -27, 0, -104, 116, 139, -32, 59, 25, 126, -212, -46, -15, -174, 71, 160, 88, 128, 69, 18, 209, -82, 120, -171, -105, -214, -137, 126, 259, 88, -244, 203, -2, -41, -124, 104, -244, -98, 174, -7, 32, -191, -41, 37, 65, -114, -2, 136, -8, 73, -103, -158, 107, 70, 60, -54, 192, -72, -119, -173, -18, 13, 30, 0, 62, -183, -98, 60, 33, -114, -92, -70, 178, 84, 197, -494, -241, 25, 124, 306, 140, -166, -93, -107, 23, 160, 162, -15, -49, -78, 333, 1, 94, -89, -37, -87, -338, -83, 82, 143, -214, 81, -110, 36, -173, 59, -39, -141, -216, 159, -158, -125, 185, 113, 162, 126, 59, 43, -101, 189, 124, -98, -35, 79, -94, 87, 305, 57, 253, -117, -164, -189, -243, -56, 26, 60, 226, 42, 178, -199, -153, -120, -322, 191, 342, -64, 140, 88, -153, -123, -135, -253, 103, -31, 181, -58, -50, 66, 199, -284, -235, -65, -7, -243, 37, 21, -239, -33, 127, 108, -152, -118, 254, -146]
1424a46P0M6P7N0J6l69M66k28K58l36L6J11k70J75O6K71l09j85L44k35j04L43
1446A47j58j15LJ35k55L41j1k08O0J83J2j15j75K67k13K79j68mK8J14J8j20j31
1469h6N2K27k19R0l93K51M1J46k94K37K78l94Q6J06M7j7j88J2M34m02P7r2K28
1492B27j93k01M64m69K93j69K1r9l8J00j58L21j04j54k45N75k49k4K43q4p0n3
1514f6J80P3j75N3R3K0k78K9mK39j92j3m5J4J33o6j26L01j82j34L49k74K7J94
1538A50N9l75K50J51j40k02K97k92J7J2L78r2k03k67M36j52j37L8l13O10k38J09
1560I6j04P8k59K38j3q6l0P2J05j1r9j47L9J76k36K68k80P2K93k97K30j06j31
1583a32j61O9n5L07k2R0j37R4J40q6o0k39K57j48K05j85J32k35j4J92K8K31m25
$$ y = [-146, -76, -30, 47, 97, 113, -256, 210, -18, 240, -96, -60, 51, -219, -44, 22, 293, -16, -201, 143, -92, -196, 147, -11, -126, -123, 12, -243, 98, 87, -121, -61, 122, 134, 19, -156, 111, -102, 177, 9, 5, 33, 147, 165, 45, -86, -34, 193, -26, 64, -329, -78, -37, 109, -185, 52, 330, -64, 22, 128, 175, 158, -30, -18, 416, 14, 91, -1, 227, 34, -167, 297, -172, 121, -48, -27, -126, -164, -64, -222, 99, -5, -159, -404, 171, -78, -102, 141, 57, -13, -66, 114, 187, 12, 65, 158, 178, -100, -71, -75, 164, -28, -41, -86, -72, 61, -5, -131, 170, -12, -146, 203, -71, -44, 150, 209, -166, 84, 235, 95, -107, 190, -102, -85, -73, 305, 213, 10, -257, 179, 27, -110, -72, -385, 225, -13, 96, -8, 70, -189, 49, 36, -50, -80, -8, 97, 86, -13, -160, -121, 55, -181, 87, -193, -121, 172, -125, 105, -1, -132, -293, -224, -279, 28, 6, 96, -41, 53, 193, 107, 47, -192, 65, -83, 122, -63, 69, -166, -180, 12, 40, 271, -154]
1606a54L39k46J2N1P1l73J48oJ53j5J80k73J42j18j32K79k31J95r1j28J00J82
1628H5J6l6k01K0p2K16q5r8J46J40rK9l05Q5R1o0O8l0m5n8L54k04l72J56J57r9
1654a11K04k98oK62j62Q2j68J10J62oj56J65J16k95J16q7K00M5l76K72Kk8nk6
1678A2o2L29k29ML04n90J6L07j72m2J07P1o8k98M09k03K95k58M4j08L93j7k33
1701A1n8m2j6K04J64j89k63L05j77O6j16k16N40l53K18k5j25K36l3k93L11k34
1723h5j86M98k79l8K79k87K66n0k28J2K7N2J04l7r7M7J84Q0l75K01m1k79O25l66
1747B7J98n07K46m9L20j93k75N10k77l0J64j53Nk21L69j55j63R8K66O9k70K30
1769B09l83J83J54k39J63J26l37p7K58m3P7k06N1J8R5Q6j44k11Lj31J47L81l71
$$ y = [-154, 185, -61, -49, 2, 73, -300, -152, -158, -5, -20, 160, -113, 29, -89, -221, 58, -173, 22, -69, -197, -97, 85, 101, 65, -136, -116, -188, 28, -57, -155, -9, 131, 122, 151, -154, -69, 22, -38, 30, 0, -45, -103, 251, 47, -325, -169, -12, -111, 93, -205, -211, 51, -111, -29, -197, -87, 75, 69, -87, 78, 194, -101, 15, -72, 128, 173, -203, 69, 71, 43, 38, 12, -50, 279, 50, 54, 358, -232, -216, 91, -81, -123, -16, 55, -13, -311, 98, -105, 190, -68, -24, -132, 261, 244, 11, -47, -89, -105, 99, 263, 74, -189, 116, -61, 5, -111, -327, 213, -140, 78, 53, -72, 164, 131, -162, 149, -85, -271, 227, -52, -90, 189, -98, 168, 118, -110, -98, -71, -19, 85, 48, -49, -2, 182, 262, -113, 88, 47, -232, 393, 27, 225, -282, -36, -85, 235, 42, -233, 277, 0, -30, 134, -19, -14, -235, 134, -21, -184, -86, 180, 249, -21, 209, -174, 9, 163, -76, 87, 213, -124, -201, 57, 14, 91, -115, -64, -46, 49, 135, -9, -220, -217, -348, -201, 180, -191]
1792a91M54j89l11K28J54j82Q0p1J75k13j93L77j2j52J57j66K08k02k2Q9l05L94
1814A07l10M44l52oM3o4J49j44l1M6K51R5M9k62k24M45m38J10o7K52J13k52k90
1837c36M06Q2j41J9j53J13K0j05J69k4P4m28K44j04M26k05L9k79J97m3r0N4J23
1860E8l6j43M5Q5p4J11J87k50J29j48p3J36R2m4J17j12k31L6R0k32M95k03l5K0
1884B0N2J18k77K11J66m53J73r2j0K62m3OL1l33K0P6J13N4j50J77L1k17r4L4n0
1909a75P4l4R0J35k11O7j1k27L04j04j4N1K71j58O8j66L6r8R5l32M75Mk38J27
1933B9j15K06L6j77J67p8J02l67J45M1L8j91J75J0l32K92L1K3q2J8L18k85N4l29
1957b71M39l59L35j94l74M62L9K43l70J70n9J7R7k78r0J07j40L64k71J80K44p4
$$ y = [-191, 263, 74, -237, -9, 145, -37, 43, -28, 147, -66, -259, 118, 106, -46, 111, -55, 153, -49, -71, 18, -287, 107, -203, 241, -111, -117, -74, -138, 11, -133, -164, -118, 133, 228, 277, 15, -209, 236, -202, -92, -159, 93, 206, -46, -336, 70, 152, 11, 30, -123, -10, 10, -95, 74, 50, 124, -304, -60, -164, 262, 57, 96, -183, 14, -29, -119, -65, 58, 22, -121, -76, 9, -65, 46, 233, -17, 112, -36, -109, 27, 119, 75, 192, 80, -151, -115, -25, -257, 238, 35, 0, 20, 72, 190, -87, 124, 290, -163, 10, -82, -92, 170, 127, 133, 164, -169, -149, -73, 40, 94, -56, 121, 152, -65, -159, -125, -175, -101, -135, -45, 90, -121, -54, -65, -292, 12, -92, -106, -55, 216, 58, 126, -40, -4, -102, -7, -339, 136, 140, -98, 29, -86, 120, 156, -21, 146, 68, 170, -197, -52, -11, 27, -164, 11, 21, -311, -19, 12, 35, -47, -29, 289, 4, 58, -271, 168, -191, 144, -50, -424, 38, 77, 320, -50, 120, 61, 78, 175, -103, -193, -86, -226, 138, -133, 47, 291, 217]
1979B17k39j33J61m9j65L53q1j09L37J37l25K9J3j01N8l29L14l2Q0j91j0M0J87
2002A62p7o9j76J61K40l09P2L0k45K24p8r2J80J16k58M5K20m15L60M5j17O1j33
2025e3K56j55k72L36j84k2L4J96l09L10o4j73K53p4r1K54j56k0L5k23K27p2J48
2048A81j62L0j57L28M9n5L5k57j16m0K23q3R5j47K65l51Q4L64k15J1k26J72Nk24
2072a91J50K24k47L5J60j43K16j83j32Q0J72l72K65l3J51r3K04l55J87l5M8O5
2094A73l90M91l44J94j12j70J91K8j17l9j24K27j47Q4N7O2L5l9Q3k6l34J31J38
2117E2oK37l60M7k10J12l5J03K51K3q5k15J58N6j98K3ml7N3K05j72j72J57l35
2141c52K49R7R0j34L4J57l40K73k90K59l0J03l33R2j50N05l47J03j06j11M66o30
$$ y = [217, -22, -155, 6, -43, -208, 145, 64, -45, 292, 429, 104, 133, 146, 45, 103, -226, 88, 56, 136, -55, -65, -25, 162, 85, 16, -160, 1, 241, -68, 4, 34, -211, 13, -65, -157, 23, 139, -119, -74, 146, -269, 91, 136, 19, 80, -53, 203, 48, -224, 112, -72, -94, -60, 136, -173, 137, 73, -100, 153, 79, -12, 242, 86, 66, 101, -122, 105, 33, 181, 19, 49, -108, 220, 269, 214, 249, -8, -124, -164, 59, -24, 71, -76, 189, -162, -78, 286, 71, 82, -144, 28, 33, -191, -41, 183, -64, -29, 131, -12, 204, 21, -111, -31, 141, -231, 34, 1, 152, 59, 263, -92, 95, 60, 108, 173, -217, 274, -70, 124, 12, -158, 33, 61, -56, -95, -219, 8, -139, -55, 2, 64, 99, 60, 143, 117, -217, -86, 52, 46, 283, -77, -30, -240, -128, -163, -60, 191, 214, 129, -86, 72, 128, -70, -47, -51, -88, -35, 170, -2, -174, -17, -352, -103, -6, 84, -50, -16, 141, -199, 74, -216, 43, 13, 116, -217, -125, -275, 230, -117, -14, -120, -231, 235, -395]
2163c95L32J05P8j82J97j26k68J57K2K81p4J8j64K2j67J04J46m13J53K27J6n0
2185A9J66j06J74Ll12j31L48l15J2L45r4M4l54Q4J75j1j10rO8J98j31k22J77J58
2209A76j28j9J0o4j10J03K78k55o4K15j78O3l93L07K48L6k62M4M3P9J7p4j18K62
2233B16j25j78j33N31j01j46J38o1l39J05M20k58q1N2j16K0J26j0lk38K99l13
2255a95L41j17K19m8k84K17J7j00l7j64o8M39k33M5j29K47k24J23j52J48Kk07
2277a60J27%K55j69P4O6k25K61k89O4o0k4J64q7J94k71l0L41j53k41J51J79j25
2300D2J25L2j59Nj08J5q1Q7Q9q4q0r4M35k18OJ7k99L04k00J93j05J98m16M07J44
2325B55k64n9J01K47l48J57j44K2J26j04J23k01K15j35rOj18M29k53R0j99J25
$$ y = [-395, -63, 42, 120, -62, 135, 9, -259, -102, -80, 201, 127, 145, -19, 3, -164, -60, 86, -327, -174, 53, 69, 19, 185, 79, 253, 256, -56, -187, 161, -154, -142, 203, 109, 153, -201, -117, 58, 47, -63, -72, -4, 194, 63, -159, 18, 176, 48, 29, 39, -25, -135, -32, 246, -9, -73, 142, -36, 27, -366, -59, 189, 225, -37, 7, 50, 129, 146, 72, -46, 216, 91, -87, -220, 311, 210, 64, 202, 141, -198, -93, 327, 69, -12, 40, -76, -56, 70, 60, 57, -181, 118, -195, 146, 29, 248, 200, -84, 133, 150, 50, 13, -151, -219, 220, -13, 32, -97, 150, -74, 49, -103, 45, 47, -160, -33, -33, 222, 53, 127, 193, -32, 229, -60, 4, -56, -80, 84, -3, 191, -80, -110, 231, 78, -163, -12, 167, 42, 167, 199, 40, 45, -63, -48, -129, -42, 47, -37, -117, -211, 224, 6, 12, 29, -270, 34, -166, 27, -78, 120, -296, 111, 255, -9, -68, 33, 280, -68, 89, -55, -33, 93, -11, 112, -89, 126, -9, -18, -12, -130, 299, 46, 136, -63, 62]
2347F2O0l30J59n2J07o2Q2k52Q4L35k50O6J40j45j19M6L90l30Q2M6j24j20J95
2370G0l25K49M3J02j07qN4mL3k32k88L20K6N3p7P3J80l5j52n0oj49N4L11kl5j67
2397f9J0R8j32L33o52N59Km14J25K98j70M2k74J77K67M8k52j28M0K18k20L9j29
2420a84K49k76O2R8J25p8K6k26K76P6j48j17K16k34K81k44nL9K1j9L1K53l77J87
2444C2o3K54k55J95M2K4m08J96o6K48j68j20J95K9l57M3Q2J60j43M25k50n3Jj65
2468a22mK37j02P7J3k17J65k14K34L6j37K48j80j09K97l51K31n1j22KK77k64j16
2491a72L24j96p6M0K31j36k74L87j32O9n1nQ8j05n0K39J8l85N0J36K73k26Q4n2
2515G9k58J34J37k25K12m3q3j1q1J32m3K06p6o7j79K16j17K23j20n8K51m19M06
$$ y = [62, 122, -208, -49, -101, 6, -56, 26, -226, -142, 193, -57, 9, 149, 4, -115, -69, 321, -9, 73, 119, -5, -125, 70, -255, -6, 37, 139, 32, 24, 78, 74, 107, -125, -413, -93, -67, -14, -91, -18, 162, 127, -25, -75, -81, -230, -176, 135, 133, 98, -69, -59, 39, -93, 240, -412, 147, 149, -265, -140, 158, -12, 30, -244, -67, 200, 248, -4, -132, -92, 126, -94, -55, -184, 65, -211, -149, -51, 74, -4, 22, -204, 72, 148, 0, -117, 99, -135, 146, -98, -103, -64, -43, -62, -31, 222, -155, 32, -31, 223, -32, 163, 205, 229, -179, 17, -49, 199, 31, -89, 106, 135, -222, -179, -97, 63, -80, 345, 95, 42, 43, -122, -126, 111, 9, 86, 99, -118, 47, -167, 67, 103, -34, 214, 34, -75, 222, -129, 102, 51, -71, -69, 208, -56, -172, 152, -44, -120, -80, 151, 15, -259, 128, -4, 65, 14, 9, 97, -8, -58, 181, 199, -186, -136, 0, 273, 47, 131, 79, -179, -45, 92, -133, 79, 36, -47, -58, -139, -7, -50, 156, 80, 13, -166, 50, -67, 156, 36, -22, 229, -190, 216]
2538B16k93J36j66n8J85N4j53J74k15J68j38K40oj31K3J27j14n9M4j18K91j54
2560E3O3q7l12K00J86R0k83Q2J46n3k72K47o1O6Q8j87k8K55k43lJ18j16N7L0j00
2585f4L5N5r9j0lj3R3p9J79o4nj97J22j96M5L0K7j41K26n2l0m0J53RJ30K3j18
2612A6oJ21Qr0q5K97l56J87j26j29K92l12L77rj26L8k24j0L17m06J87J79k09K10
2636A41J48l85mJ20j66j4L5M00j16l83L58p1J81k52l5Q2k57M24M1l75J29O8k59
2659a90Q6L47k53r1OJ10k28M22l25K55l87L37l5k37L63l06j06k4L55j03K32m83
2681b55J25P9K03q1j59J37p0O1O1j33K42p7k08J72j22J32p8r6Qk3N0o0kK01pj01
2707aj89K04r0K43K8l62J51o3J19r6K60m64K25K17L5j88J79k42j29L06j99L7J10
$$ y = [216, -77, 59, -107, -165, 20, 74, -79, 95, -120, 48, -90, 150, 144, 13, 36, 163, 49, -10, 34, -84, 207, 53, 116, 29, -283, -83, 103, 193, -90, -8, 138, 85, -187, 60, -1, 65, 153, -34, -62, 193, -50, -53, 65, -51, 6, 36, -64, -29, 26, -73, -83, -86, -99, -6, -85, 94, 30, 25, -172, -50, -246, -201, -171, -144, -285, -59, -111, -141, -181, -28, -19, 111, 134, 16, 10, 131, 139, 49, -36, 261, -95, 92, -34, -163, 129, -183, 194, 185, 59, 97, -127, -137, 180, -226, -39, 140, -69, 141, 289, -96, -100, 20, -146, -160, -125, 275, 159, -224, 134, 63, 244, -8, -43, 39, -218, 206, 247, -128, 1, 69, -190, -104, 243, -10, -101, -95, 15, -213, 209, -116, 139, -248, 89, 54, -183, 180, -126, -232, -256, 99, -4, 228, -255, -130, -51, 152, 71, -88, 49, -21, 40, 101, -32, 210, 133, -75, 97, -25, 107, 29, -67, -59, -82, -32, -92, -94, 107, 100, -1, -190, 14, -76, 167, 195, -167, -16, -79, 40, -56, 204, -260, -35, 182, 217, 29, 208, -34, -163, 143, -56, -19, 91]
2730I1j16K45M7k15j47j13K21j51R3P5k3l81J72N14l71M7P1r5K18p8M6l21J2J18
2754d1L12k74L01m6k09k9J31k87J78P5j36J17oNj96R2J02j31L47k08j00j02l16
2777d21R4L50M2k06J69R4m27K80O4l9k03J26J46r4k0J68j04l1K08j38k41L26l33
2800a90L80r4O8l44K60P6k29p8O1K45q4j44l02L00m35N25kj32N8J34j13Q8k07
2823a59M13k29k77K02K59r9k53J71Q3J3j54r5J10k3r6K31j75JJ27k13J28J28q6
2846GJ9K75m29n6k4M5K60J24j07k05J95o4r6j26P5O2k6K4P6J71K0o6l69K69j28
2871g4j68n4K68%J64j65k22Q7L18k60j01R0J5J64j49O8J54k19J26J5k16j66J61
2894a64q2L72j22J03q5L3j29j50M72j5j87m0Q7k85R1J36J46j66j11L2j47K93M7
$$ y = [91, -25, 220, 267, 52, -95, -208, 13, -138, -45, 30, 7, -374, -202, 312, -59, -12, 59, -36, 182, 104, 150, -171, -159, -41, 271, -3, 298, 252, 43, 14, 145, -142, 36, 111, -25, 92, 86, 91, -105, -13, 89, -42, 305, 97, -3, -105, -421, -327, 23, 65, -141, 28, 122, -305, -25, 39, 0, -203, -77, 69, -25, -45, 123, 19, -12, 196, 58, -183, 143, -190, 190, 96, 164, -180, 80, 156, -73, -151, -90, 155, 71, -73, -375, -75, -510, 15, 13, -119, -61, 73, -40, 48, -159, 254, 25, -252, -50, 209, 110, -143, 28, 111, 124, -30, -125, -15, -38, -134, 97, -78, -77, 50, -163, -35, 93, 7, 26, 301, -128, -184, -208, -163, 97, 221, 114, -91, 104, 40, -56, -182, -107, -45, -71, -47, 29, 200, 220, 154, -215, 54, -74, -242, -296, -28, -28, 136, -29, -251, -164, 154, -106, -207, -117, -102, 62, -87, -19, 135, -84, 42, 57, -159, -325, -164, -246, 126, 4, 107, 22, 55, -74, -224, 248, 233, 46, 6, 93, -192, -101, 35, 181, 15, -96, -64, -211, 82, 129]
2917A29k2l56M45L2k87q4m4K72j89J26O0o9o3J59K80n68o3M03j09M7j96J52j26
2940g1L43j76J35l20J64j26%m6J27m5k8R5k05M31k76K30k62m4J2J66J29l29O7
2963b9K45l77L26j93N7Q0j57q5J20j67K86p4j06r8k20N89m12K81p9L8J91k18J07
2986A05j75o1J09O9J43l35J47m1K10k36r4P1n5J31P0j58P3j79J12J64K05j73N
3009A07Oj59K4k36J0K2N38l59J78k90m0K23O5o0P9l7k00L17m2j1o0m1J7j48k8
3034a25m6J57J43j74p7j88M08K4k92L26m00K70J9k00o0r1J35K68j32k93L65k2
3056A5J68k29N0J72l24R2K32k11M1L2J0k27j37J48K14r2O2K00k09l41M7K72M20
3079D05l39R7o7q9Q6j47J50k34J21j13J16k89M89j34j67L19j90O3qj48K2J46q5
$$ y = [129, 107, -249, 196, 228, -59, -143, -187, 85, -104, 22, 82, 13, -50, 109, 389, -179, -242, 161, 52, 99, -97, 55, -71, 272, 96, 231, -89, 75, -51, -51, -97, 30, -15, -43, 52, -153, 278, 2, 232, -30, -74, -62, 104, 233, -96, -29, 216, -161, 165, -28, 29, 109, -48, -133, -13, -180, 106, 32, -74, -172, -392, 197, -215, 66, -13, 25, 216, -2, 105, -70, -131, -22, 47, 190, -145, 2, -39, 171, -65, -159, -88, -143, -12, 58, -100, -27, -206, -94, 70, 275, 102, 107, 113, -46, -22, -258, -248, -226, 312, -47, 131, -159, -199, 24, 89, 29, 108, 71, -129, 188, 146, 135, 75, 34, 51, -97, -125, -171, -14, 129, -45, -122, -310, 98, 122, -170, 156, -244, 26, 45, -155, -215, -306, -171, 97, -35, -328, 37, 15, 183, -46, 4, 176, -148, -56, 176, -35, 6, 38, 48, -179, -316, -168, 46, -46, 16, 216, 7, -334, -287, -15, 405, 66, 163, 96, 7, 93, -54, 96, -138, -17, -130, -14, -303, 186, 52, -115, 204, 14, 77, 69, -79, -57, 89, 4]
3102DJ3J78k27j57J86jq6R0Q7J89j42j80K38rk76n2L34o2j9R3j14j23J83n2j88
3127i3M3l4k2m3J59Q9r1P9k01k59L30K5Q0J5j26p7J0P5j6j23K99J0j37O1J08k53
3153i2J41j0k20K47rl80K57j59%K04r3K2J5Q2J42o0j45m8m5K59k54J30p2K44k20
3178f4J60L9J12j27k39l5pP2J67m9j89K09Q0Oq6j25J19J2p4l7q2P8j10O7J95j53
3204f1m5K59l27pJ21J86j67K45r8k2P1j15P1l55N86l38R6j01j01j2K54j13j74
3227a47L92l06J21Q2p1K5o5J91l69r3K85N8n8o7j18J53j0k2k05L31J0m1k03J52
3251B5M0Qk29Q7K05N0j87k34kK76q3J26k28O4J13j30K7J1J63j32P6p8P9R4q1r1
3277c1p0k2J43j43M2N0j91L06j67P8J74j60K8j55q6L99l62o1J41J55j6k4l6K3
$$ y = [4, 17, 195, -32, -189, -3, -4, -90, 0, 87, 276, 134, -46, 192, 183, -93, -145, 189, 127, 108, 201, 87, -36, 147, 95, -93, -50, -84, -106, -149, 10, 99, 8, 87, -114, -373, -43, -18, 62, 77, -49, -126, -116, -41, -57, -180, 119, 129, -8, 53, 161, -92, 49, 39, -181, 66, 57, -323, -66, -225, -225, -21, -114, -92, -77, 5, 147, 87, -58, -106, -151, 108, -146, -16, -88, 156, -64, 96, 135, 247, 120, -119, -154, -161, -89, 78, 29, -160, 49, 129, 135, 49, -76, 43, 55, -19, -56, -138, -60, -170, -103, 92, -61, -106, 153, -174, -181, -60, 126, -41, 204, 106, 84, 155, 40, 111, -244, 342, 4, 100, -1, -102, -114, 140, 27, -147, 245, -61, 60, 142, 71, 96, 31, 222, -147, -240, 45, 103, 45, -22, -140, 13, 3, -19, -224, 107, 117, 76, -127, 25, 65, 73, -156, -69, 136, 186, -1, -235, -237, 39, -44, 82, -146, -82, 31, -99, -72, -61, 102, -30, 46, -32, 47, 141, 60, -31, -101, -123, 20, -123, -81, -31, -222, 84, -83, -5, 169, 9, 37, -118, -204, 195, -167, -228, -87, 68, 52, 28, -8, 15]
3301A5M1j97q8L80j95J05j04pK07J96l86N3N83o71J76k83K20j90M13j93k39J88
3323B4k51L36l64N04k69j90L56l89K47k08L05J1n7k37q9M5o3L10m6j10L9J12p8
3346f2K74l12J32Q1k41R0Q9J19l50J76L99l37n9J0j60L07n0j60O3k04M38k60j02
3369a19R4k85L84KK8j07J14j4j65Kr7l1K44O7k55k01L75p8J63K7o8j80l4J04K
3394b8j5M6j7j33L77k05k42J90lJ11O6j39J18j27j12K66K4j40j40P8%K33j4k26
3418c2kK09L3m2l87K44j5J02l3Q8j04p3J25J43k18k6RL00l01K33j97k39K74p7
3442A4q3P2k4K90m07m8L26j30Q7l6J51j21k05M20j02k24k9K02j68J1j2p4J45J3
3466F8j3k69J1L54p3l08K11K08m26J43l2M48l55J19m1j41K29j39N7mm0K7k19M60
$$ y = [15, 56, -141, -229, 151, -44, 61, -43, -50, 157, 353, -33, 20, 603, -68, 108, -175, 45, -145, 268, 75, -164, 24, -227, 109, -255, 249, -20, -210, 146, -243, 4, -204, 101, 112, 55, -182, -271, -226, -289, 21, -25, -135, -96, 16, -62, 212, -100, 32, 113, -128, -38, 51, 170, -180, -4, 395, 58, -1, 9, -151, 156, 106, -54, 9, -195, 243, -17, -119, -25, -310, 74, 76, 104, -3, 111, 97, -68, -66, -163, -194, 50, 117, -138, -339, 36, -42, 121, 148, 80, -100, -134, -30, -28, -43, 3, -14, -147, 230, 25, -217, -27, -30, 81, 147, 8, 126, -1, -113, 153, 177, 37, -103, -25, -25, 208, 194, -32, -34, 175, 208, 166, -221, 23, 8, 110, 77, 165, 61, -12, 113, 256, 38, 12, 21, 321, 20, 253, 56, -183, 91, 14, -69, 3, -21, 269, -138, -186, 140, 10, 97, 61, 212, 91, -114, 306, 204, -20, -49, 153, -15, -4, -16, -90, 55, 68, 55, -214, -203, 151, 78, -230, -19, 189, -237, -94, -126, 322, -33, 86, 45, -96, 133, -6, 51, 47, 7, 34, -185, 275]
3490B75l38j70J99j19M09l01Q8J34j55j3l5qM7l55N69l15K74J20l57m3N1K86l19
3513g6M81l26j34J85p4j25J22j00M8J18j73j42L66j85K7J85p8K8m1k02J6L4J55
3536A09j10lRJ63k34J20k34K03j45l11L62J32m1J92k99L9O0j51J52j83J47K46
3558B23n24L41j11K52l61J00nJ41j98P3J14P2k54L17J69k78l13L31Q5J4l47J9
3580a40J21K43k68J43n1J39k47j69K64j26K44j12J35q8l0l4N4j59l04M90k29j29
3602b53K64O9m3k10J76j84J81M5j7o6k95L47j06K87L0k78J08Kr3J53j92J67om58
3626c72K93j14J54L81k76JJ07j13n5J90j57m5J9L34k00j6m24K88J06q2j11j26
3648b18p5J83j54J57J43l8Or0kK41J52l13J71Pk24L2J16P5j27j20J11j42o6J87
$$ y = [275, -63, -233, -34, -153, 256, -45, 43, 177, 22, 9, -26, -34, 13, -342, 227, -88, 186, 306, -51, -94, -43, 243, -76, 405, 79, -55, 130, 56, -69, 53, -47, 1, 119, -54, -196, 170, -15, 12, 197, 119, 147, 106, -96, -80, -46, 109, -1, -4, 5, 168, -66, 54, -180, 23, -122, -433, -71, 61, 20, 212, -87, -48, 12, -139, 13, -170, -23, 223, -301, 40, -71, 181, -180, -80, -85, 56, -142, -69, 45, 117, -137, 180, 349, 71, -242, 89, 174, 188, -159, -140, -19, 224, -44, 99, 48, 187, -60, -229, 35, -91, 153, 41, 176, 88, 58, 24, 78, -81, -385, 105, -124, -253, 11, 80, 37, -173, 3, -181, 0, 45, 28, -38, -333, 14, -92, 195, 225, -53, 55, 57, -36, 117, -75, 92, 86, -372, -79, -193, -39, 342, 66, 67, 174, 61, 6, 196, 39, -6, 13, 347, 147, 131, -293, -5, 101, 19, -92, -218, -293, -110, -264, -107, 36, -2, 4, -86, -88, 153, 305, -8, 163, 170, -54, -22, 94, 169, 42, -78, 33, -109, -175, 12]
3672A2mj21j95J27LM16j32j69J36l19L70P0k25k24J27J76m3J33l42K8m9M00l22
3695a47K18J54q2j42p2J37j28N9r2J43p8L31m79J82M4m66L09J97k03J01L4r0Q0
3718A0q2mJ7OR0n9k00M25m72l4K36O8j15qL02M9k25l29K85n0j01Q4L1Q8j16J33
3744B9J78m29K67JJ60l10P0j58L01j36MJ6J01j70k24L09l21L37j55M4j69J50J01
3767dp9O9J91k43O6J42kr8p8J19p3j82K09k9l09L78Jj93J11M4j69K68l63K53j82
3792a53J21O2Q5or2n5j27N4K5K4K75l45J06M92o32L69k3k24j1J18J46j40k23K30
3816G6L1r8ok08K23J13P8m05N6O3o0O7j3M7K05m7k31K57j05j49K55k06L74m33
3840a16j5K0J66j21m4j19L08j99j09M28k83M6N5J03QL4m9p2n1J74p8oj23pO4n09
$$ y = [12, 8, -113, -308, -181, -178, 238, 106, -63, 73, -246, 124, 194, -31, -255, -128, 48, 5, 138, -204, -176, -225, 175, -147, 71, 225, 143, 1, -71, 66, -62, -3, -95, 48, -30, 301, -178, 4, 48, -418, -109, 88, -115, -14, 20, -70, 10, -72, -76, -59, -53, 37, -22, -222, 203, -269, -303, -67, 1, -114, -122, 180, 229, 4, -325, -40, -90, -191, -107, -76, 12, -104, 29, 207, -222, 45, 46, 206, -104, -34, -192, 109, -27, -23, -7, 94, -76, -300, 9, -312, 25, -130, -86, -255, -105, -4, -83, -14, 177, -66, 0, 142, 140, 42, -36, 83, 10, -172, 37, 8, -301, 77, 78, -115, -4, 40, -129, 139, -224, 29, -153, -32, 30, 115, 109, 17, -38, -165, -111, -86, -62, 213, -132, -26, 466, -166, 203, 180, -44, -55, 63, 209, 69, -154, 76, 107, 9, 3, -205, 18, 131, 209, -196, -140, -77, -137, -70, -83, -36, 169, 122, -109, 148, 43, -106, 149, -57, 317, -116, -131, -111, 55, -66, -110, -229, 79, -120, -229, 199, -84, -38, 17, 120, 128, 162, 113, 41, -10, 164, 86, 80, -43, -50, 14, -495]
3866d95L25K02j6J41k32k92L79J32p0N0o6j06j29J04R8L11l52R5j51J76j2n6j70
3889a34qj94M83l00J32J49j16l12K65J74M0k34J2J02j08J54l15J13R9j11K28j82
3911f3R2q9n2K7m9J58l00K60j20K08m5kJ38j89k22K46k67J77K10j95oJ21j3j22
3935i7Q6J67k31K73k29K6L92l71l10N26l74L36n8o3P1k0J3p7j76j38L40L7l7k45
3959a59K34k25j55L92j48J28l01M73j81k70J57K98k81J86j03N2Q3k08j47K45r0
3980b0L2J51k54J73j80L2q0P1J5K60k43J22p8j74P3n6k2L70k80K39m8J05r8j13
4004cn3J37o8k43K38k45O7K86m00K60K3NJ33m6j25K06l17l1L86l75N8R0k54L13
4028D2j7J46Q8k76l4K58k44J45l8q0j32L43j13J22P7j4l03J70p0J79j17l51L14
$$ y = [-495, -170, 32, 16, 157, -75, -367, 12, 144, 74, 124, 58, -48, -177, -73, 25, 336, -16, 79, -72, 104, 92, 36, -134, -142, -336, 147, -153, -21, 128, 12, -300, -35, 139, 179, -55, -43, 59, -49, 105, -210, -97, 2, -109, 119, -63, 29, -60, -112, -85, -134, 24, -276, -16, -136, 72, 27, 25, 163, -26, -248, -2, -269, -92, 118, -77, -83, 38, 25, -97, -11, 156, -75, 198, -31, -5, 387, 16, -294, 232, -142, 194, 136, 73, 144, 124, 137, 60, -116, -254, 86, 123, 86, -159, 75, -150, -305, 87, -61, 67, -234, 239, 58, -212, -55, 243, -38, 148, 45, 97, 180, -28, -175, 70, -20, 12, 163, -91, 82, -98, -66, -146, -75, -60, 200, -43, 79, 1, -173, -100, -156, -178, 192, -88, 151, 103, 208, 110, -3, -56, 81, 13, -230, 8, -237, -170, 116, -284, -24, -1, 4, 137, 91, -34, 172, -145, -176, 210, -165, -107, -17, -271, 42, 25, 171, 259, -17, -51, 207, -37, 108, 70, -10, -142, 201, 88, 210, 287, 273, -30, 140, 70, 249, 132, -219, 95]
4051I5n18L33K30n2j97l6J51%J35O9j49j63J65l48J84J52N5l3k31L55l40j15J50
4074a08Q6J27q5j63J48M1k78KO6L70l51J55O8j56K98k49p6K08l55P3K03O6J3r5
4098Hm6K42N7j86l7J44j62M4K10N1j61j0O5J38m06O0L7r7L34l80K74k91K78j56
4122A0k46K88l4k3R4k60J29K05k21J61Nj19k67L29j46J44p8P7N3k19p1K25J70
4145B06j00j58K24p2o4J36k64J6K35kj09L9o1jl5J3P4o8l95L61P6k42j67M23j6
4170D9q6L16l79M4K52k44m1Q6J79l27J66r5K60p1l58J7L65k31p7J7K57k58L83
4193B24m88M45j41n7r0Rmp3N07o77M35l28L36j3k70L70j46k80N6M23m92L45k40
4216a49L12N9j22Q0L2m33N8K29k03k4L52l2o8m16L10k82L30J74j82J18j12k58
$$ y = [95, -423, -90, 140, 88, -109, -145, 6, 6, 141, 210, 61, -102, 63, -285, -101, 51, 106, 73, -158, 197, -143, -258, -108, -22, 105, 20, -143, 5, 46, -232, -230, -164, 206, -145, 10, 78, -78, 220, -29, -105, 103, -252, -179, 24, 90, 103, 8, -38, 204, 261, 75, 38, 182, 20, 64, 274, 325, 164, 154, 219, 357, -49, 11, 48, -49, 285, -95, 179, -112, 166, 10, -236, 52, 18, -5, 89, -171, -42, 163, -58, 103, 108, -11, -278, 51, -95, 49, -29, 48, 101, -118, -189, 36, 206, 106, -52, 172, 100, 36, 172, -92, -76, 159, 157, 48, 87, 26, 25, -10, 3, 77, 9, -386, -25, 51, -191, -358, 65, 49, -37, 279, -100, -56, 196, -48, -89, -3, 176, -151, 15, -80, 180, 109, -249, -232, 133, -98, -175, -158, 99, -159, 224, -264, 181, 40, -17, -107, -98, -102, -175, 332, -345, 90, -238, 98, 85, -185, 185, 39, -241, -185, 238, -254, 91, -149, 163, 222, 100, 180, 212, -221, -163, 66, -137, -161, 191, 159, 91, -325, -15, -297, 33, 207, 25, 143, 31, -227]
4238b27K9J61K1o4J09j50K03m0n3K61l50L49m81M69m13K59J81k98j43L34k43J52
4260F6k4k70K53k0k4J22k61J56J28k01L1k4J46j10J80j45l5J96j93p5j20J57N0
4283a7p9K68k69L7J25l76K71J81k33m2J57N5j8J77l36J75r0j78J52P1j20n1j11
4306b51K19L22l36J3J89j79J7j58J28j61R2K27m00R3J87q9K05l07J07q7K02J02
4328A35j62k2JJ20k20J05nK0M8K26j77o7q8J56K50j74l07L8K5P6R3N3k63L93k17
4353C7k07K22j19j58n7L48j08J02j55K97k11k5J87m0k38K77m33L42j44K61n9o3
4375E6J23j64o9J03J11k01q6R1N3K8Q8j25o0M0k4R8j63R0n4M8J5K3J47j4N0K9
4401B33m39K29n4J43r7J63j50P3k28K64l28L9K81j03m5K07n9k45K67k07O1L6J6
$$ y = [-227, -198, -37, -16, -80, 29, -121, 82, 42, -11, 250, -100, 249, -232, 237, -176, 83, 264, -34, -177, 157, -86, 66, 42, -228, 25, 5, -19, 103, -158, -2, 126, -75, -44, -68, 78, -32, 148, 3, -32, 164, -29, -104, -224, -67, -17, -96, 172, -97, -60, 65, -311, -40, 141, -92, -134, 23, 78, 60, 237, -99, 76, -14, -192, -40, 31, -89, -140, -251, -32, 290, -46, -33, 156, -23, -6, -164, -36, -197, -105, 122, -278, -185, 2, -87, 118, -189, -82, -169, 33, 135, -27, -49, -48, 72, -148, -43, -48, -28, 20, 246, 69, 2, -86, 70, 320, 146, -161, -123, -98, -22, 71, 124, -139, 254, 37, -170, 52, -67, -225, -282, 66, -42, 60, -95, 202, -9, -34, 153, 113, -125, 152, -281, 61, -83, 178, 119, 56, 179, 15, -54, 49, 160, -41, -127, -36, 17, 45, 133, 8, -52, -12, -36, 62, -101, -11, -65, -17, -2, 21, 168, 154, 204, 233, -206, 23, -31, 112, 15, 178, 28, 101, -127, 137, -191, -152, 129, 26, -19, 188, 129, -116, 151, -56, 5, 41, 57]
4424E7q1J0p5L2j12l7L17k30J36K8K01l46q8K7k01J43R4O3k79O06k87QL7rj50
4449a36R7k00j25K43J14q6n0J31j56o5Q3Q3R1J61k29q9p3K90j65l9L49j85O4k39
4473a31l1rJ59q5o6p2M37Mj96l05J86j88L76n3o7J06NJ56o82N84r4K0k16N7k8
4498a33K51j4j45J44j73K44j52N8J4r7K40k07J15k34R2m2K46l18j57O5J19K05
4520A21j13K77j84jj31q8J52O3rl93K25MJ45J58Kk41O4k64k9L02k03K03j5J71
4544B16m34J22L0J67o2j9j98J67O5j16Q2k68J89J09ok37M47m01K29o8J6J99j36
4567I3k43J44M1J02k48J47l34L35J1J38l22j7J04J85o2k37L24P8l11k87N73k39
4589b5J70q2J55k64J22l0J23k25K60l38J18Q7K1M9j01J48k46J27j33j14O0J87
$$ y = [57, -24, -14, -89, -57, -169, -206, 111, -119, 17, 45, 246, -100, -188, -161, -362, -219, -125, -62, -341, 265, -22, -14, 23, 14, -136, -39, -239, -364, -121, -7, -93, -143, -12, -168, -233, -150, -67, 24, 185, -44, -133, -206, 84, -81, -120, 229, 44, 108, -131, -162, -171, -12, -97, -163, -235, 202, 206, 10, -295, -109, -297, 79, 26, -41, 65, 70, 226, -456, 128, 34, 54, -162, -105, -133, 118, 104, -41, 103, -70, 174, 22, 80, 94, -3, 237, 30, 145, -89, 3, -39, 207, -111, -268, -203, -84, 121, 8, 285, 101, 100, -31, -119, 33, 96, 87, -306, -81, -77, 68, 226, 228, -13, 51, -213, -242, 60, -143, 60, 45, 216, -218, -96, -66, 101, 39, 20, -178, -11, 54, -62, 20, -248, -59, 50, 44, -193, 254, -147, 82, 14, 30, 229, 93, -150, -6, 35, 137, -111, 36, -298, 37, 48, 186, -136, -153, -49, 136, 74, -163, 161, 239, -72, -359, 214, -25, 145, 63, 218, -46, 76, 46, 169, -56, 204, -134, -16, 71, 92, 141, 40, 188, -58, 69, -64, -178, -118, 69]
4611F9J79l58q1L43n2P7l01Lq9J93N5J46R0m67J90O8M8l31j3L46k00j7K05j92
4635h9J97j85K59l16K90o7q4J29J06l11P4k33J14l9PP1j29J79j63K58m00J61j4
4658a85P0J35k15n8O08l06R8m4L2j60q2K4J02O0J43j62RR2j77OR4J38j12k40J35
4683Eq3L21l81J78k50j83M12q6J21j59j51J45l28P10n52N31j52r2q3o6K25p0R
4706B1k25K05k45J58M28j67k66K04K0j75J13k0j21K39l9n16K82J28r6R1j2l38
4728c31N21l30K09J05j66k13M93k81j33J24J86k98J16R0p2k49J28K11k91K14r4
4749f1K94l49M38l19j8pK61k11k31J97J32k89K13k56K04k1J21l34O4J91J44k50
4771h7Q1R9j38l01M33j36k9m9j87M08o5M1j09j15J06L6pn2J0j31K71K04k77q8
$$ y = [69, 248, -110, -191, 152, 100, 177, -124, -121, -210, -17, 38, 184, 274, -193, -3, 65, 113, -218, -231, 115, -85, -102, 103, -89, 108, -77, 182, -134, 156, 89, 5, 134, 240, -71, 3, -230, -116, -155, -148, -77, -206, -27, -190, 68, -332, -171, -185, -115, 20, -195, -253, 355, 49, 147, 103, 135, -25, -107, -83, 19, 79, 222, 60, 69, 161, -16, -10, 84, 222, 110, -130, 5, -78, 243, -138, 40, -210, -393, 19, -67, 54, -105, -256, -111, -439, 271, -281, 250, 98, 6, -77, -143, 82, 12, 21, -204, 1, -244, -86, 342, 175, -91, 113, 133, -42, 71, 51, -70, 169, 130, -386, -104, 24, -72, 19, 7, -331, 190, -140, 69, 174, 8, -205, 288, 7, -126, -2, 184, -114, 2, 92, 20, -229, -101, 110, -181, 33, -61, 233, -116, 322, 3, -15, -22, 239, 28, -203, -6, 126, -163, 50, -206, -2, -23, 98, -236, -172, 19, 163, -87, -6, 93, -45, -346, 87, -49, -78, -127, -314, 94, 29, 70, -39, -154, -48, -12, -19, -71, -61, -192, 79, 283, 6, -82]
4795h2mJ68j4l4p3l6L8j03K59j27k73J16K35M8R9k10k11O4l0L40L4j95q7L24O3
4820C09l35J9j11Q5jj53J13L6K28j94o5j48P3J79q1J58l99K21j0J99o7R8J9K0
4844A93m69L53k91K34k64O4L47j38r9L1K23l49J91r4l01M77o3o9L8k9L49k33j1
4867I0M9j5o5J9j13J07q3r7Mj90M28j20j24L13k13j52L06k7k65L6r7R1J70p0q2
4892a00J41j33K82l01J97k07J66P1l94L14k10K22O6K6l78K51P0r2J13K55k95j
4914F3k07p1P8J15j81K26R4j36K4J5k9J76j25K9P1q9j54J31N3m4O2j76J0J25n3
4939GJ7m2J70j76p1N7L2k10N26j81l5k58P7j02M08n2j39J0R8n7j93J09J0J34r4
4964D5j06m1j03M2n8K44j4j08J7M2n4o2p2K79P0o6m0n7l3K77l19j08M30j71j19
$$ y = [-82, -86, 82, 68, 34, -39, -75, -37, -140, 119, -8, -281, -165, 70, 118, 217, 7, -204, -140, -170, 170, 204, 9, -78, 246, 309, -26, -7, -118, -33, -34, -187, -74, -38, 190, -4, -69, -217, -144, 35, -46, 112, -287, -66, -76, 123, 56, 154, 173, 193, -276, 77, -214, 20, -244, -180, 167, 29, -70, -39, 184, -165, 26, -68, -369, 108, 45, -24, 14, -15, 334, 101, 90, 139, 124, 59, 78, -35, 72, -11, -108, -104, -294, 134, 14, -110, 203, -10, -162, 144, 117, -148, -112, -209, -118, 52, -18, -100, 41, -92, 190, -111, 86, -121, 45, 116, -278, 36, -174, 48, 114, 140, -238, 13, 83, -9, 104, 359, 64, 63, -144, -215, -137, -22, -203, 23, 117, -19, 5, 20, -9, 167, 42, 71, 142, 53, -101, 30, 83, 39, 101, -75, -65, 60, 7, 24, -18, 152, -24, -95, -38, -6, -216, 310, 129, 94, -164, -87, -189, 219, 167, 28, 38, 136, 79, -114, -5, 5, 139, 45, -61, -102, -205, -163, -221, 23, 9, -99, -82, -40, -94, -156, -228, 51, 121, 55, 15, -42, -75, 202, -117, -225, 205, 34, -85]
4989h5Jj78J67L1o1LL15k68j49J79J33J67j61J86j21q9k16K94l84J84K85k90p7
5012a34L15j66p0oQ3K06l44M1K30n2k03m8P4L85k36k71K57l15M01k86J3J28o9
5035f7K33l80J5L07O1k26J98k87K74k26K13j79j73Q0P6O8L13k50k89M17k98j7
5057a37L70k2k01O1r3J40l79N11j59K55l65r1J9j53L38K03k41j6j92O8K94j03
5079A07o2O2K5k53J73r0O7K0J37n34J82R4J46j55J67rj89J50k7M6k2L7J5L9k43
5104a17j88J39R4L6L00j17j95j89K11j28K64j34L69k85O8R3j83J21j21QR1Mj65
5127b4Q8m5k35L20Kn9J07q1k06K66k09M3J88j11J74m78L05k84J55P6nqk24J40
5151a05J0l4N67k29k69K70m56L44k57K05j96P7Q8J98k70K2J13m8L0K4k11J81q9
$$ y = [-85, -84, -262, -95, -64, -125, -122, 193, -75, -224, -45, 88, 255, 94, 280, 159, 70, -146, 148, -236, -52, 233, -57, -134, 181, 15, -55, -61, 22, 228, -116, -75, 155, 103, -100, -148, -74, 311, 75, -196, 61, -254, 147, -139, -126, 2, -67, 166, -214, -199, 108, 169, -57, 141, -146, 128, -98, 115, -64, -237, -157, -81, -13, 300, 50, -239, 178, -120, -137, 233, 211, 10, 71, -22, 118, -261, 250, 91, 346, -19, -110, -91, -244, 94, 297, 56, 40, -152, -84, 210, 107, 45, 107, 132, -121, 52, -38, 29, 49, 186, -348, -166, -72, 74, -81, 86, 77, -112, 38, 11, 57, 35, 72, 87, 126, -117, -305, -166, -72, -36, 264, 147, -48, -237, -26, -154, 110, -24, 345, 60, 128, 221, 38, 159, 38, 46, 137, 141, -24, 64, 19, -216, 104, 106, 47, 154, 73, -133, 133, -76, -33, 155, 44, 218, -260, 45, -239, -84, -8, -13, -21, -245, -105, -95, -129, 438, 209, -60, 210, -246, 98, -159, 46, -150, -73, 15, 213, -57, -35, 78, 30, 60, 84, -127, 54, -35]
5174c5J34j83l3K30k1j20P1k56L35k64L28J95m20JK38m37L00J01j37Q1j45p7J01
5197a3k03J21Q5q8k90M59J55n22J30Q0J18p3rj51K30K33l36j05K63RM0l09J24
5220e2J4O5r3J86L4k08J67p6r7q1r9L17k14k0K18j17J25K70n14K8R6L7j25J57
5244A8j83J33kO4K7p9j06K9j46M58o38K40K19q4j19J85O9J18l96N9K33j81J09
5267B7J1n3j09j64J78K15J87n19L72k31L7J66J52r7j29R5j27j15P5J77j95K04
5289A57n3j46j79J40N8o8Q3j8R6J19J13l79P7k41L54m2O8j47k1Qn7K36J7L4l27
5314a18M9q0J26l2k14J49k6J72p6j7k15K97m5J66j36l8J26Qm3l71P3M4K30J37
5338A66j51q9J66L8j65L16k88k6J65k28K09L4l6k00N17n95J08JJ71n4l02J57j26
$$ y = [-35, 99, -84, -117, 113, 92, -28, 43, -213, 122, -142, 186, 381, -39, -38, 200, -237, 63, 164, 27, 108, -37, -114, -13, -216, -95, -10, -98, -388, 71, 226, -296, -166, -86, 32, -41, -50, -201, 29, 262, -74, -179, 84, 93, 133, -176, -52, -38, 27, -66, 120, 154, -54, 113, 37, -60, -141, -240, 77, -137, -157, 61, -56, 69, 339, -175, -147, -51, -14, -139, 18, -165, -32, -34, 30, 57, -22, -128, -99, -245, 213, -425, -185, 34, -50, -169, 16, 85, 203, -193, -134, 99, -82, 27, 38, -15, -124, -288, -110, 105, 292, -227, 145, -86, -49, 117, 269, 172, 43, 138, 11, -104, -29, 148, -47, 157, 104, -42, -221, -81, -23, -91, -8, -26, 70, 189, 302, -77, 0, -241, 113, 71, 139, -8, -29, -21, -78, 158, 175, 209, -118, -69, -149, -23, -55, -269, -120, -146, 26, -50, -67, -282, 15, -30, 136, 0, -38, 88, 96, 53, -318, -245, -201, 29, 166, 15, -74, 92, 130, -35, 281, -7, -33, 132, -96, 113, 147, 111, -89, 428, -167, -59, -58, 113, 59, -243, -86, -212]
5361b12L15n9J52j50K6n4J50l30K05k36K81Q5k07j14J70l22K04J28j25J6J94k56
5383a39M45l02J77M6j15j89j13J34k00L73m1o7o3J32j46J62k7k36J50J13q9K38
5405B43k79K50j00j52Rn4K01K12l77k03J77L0M6j00J14N9l58K02Pj19K12j12J77
5428H5J10m4n2m2Nj35Q5Q8q2k02K16K05k56Q5k52L0J66Q8j00N6j69N0o2k4J59
5453HP3j73J90k40J47J41q7J73m09K01J73k23O5O3m14K69M3j52J36j75q0L14m3
5476@o1p4rJ52O6J01k37n8J77R0r9l26J86K03j34j16K4J9j14J32J46M7l59K67
5500B3J28j33n5J85o5J50j60j59J04rk54L00j06j63J79m0O0m7j00J45j93R6K2
5523i2J26k6r6N0j36J98M0l7L7j97O5j54L58ll40K70J85k16j31J62l04M18k9l48
$$ y = [-212, 103, 44, 196, 46, 72, 18, 168, -162, 43, -193, 88, 173, -34, -148, 22, -300, -96, 32, -93, -77, 117, -139, 306, 4, 181, 227, 112, -77, -190, -56, -256, 117, 76, 9, -54, 78, -68, 94, 67, -169, -19, 94, 5, 243, -36, 214, 114, -38, -29, -83, 118, 330, -47, -250, -73, -43, 3, -97, 17, 76, -282, -80, -73, -192, 20, -92, 85, 195, 151, 99, 57, 62, -73, 12, 100, 18, -184, 32, 237, -19, 66, -186, -156, 10, 98, -2, 54, -115, -65, -127, -151, 8, 81, -92, 98, -142, 5, 146, 59, 232, -177, 24, 197, -26, 39, 102, -312, -43, 0, -152, -16, -191, -271, 43, 0, -61, -135, -144, 8, 74, 175, -62, -120, 57, 147, 48, -278, -92, 111, -23, -139, -115, -96, -210, -78, 68, 115, -244, 23, 151, 18, -37, 148, 83, 233, 73, -86, 18, 9, -245, 55, -51, -214, -35, -75, -15, -62, -162, -17, -210, -114, -92, 34, 8, -88, -38, -174, 24, 64, 27, 64, -133, -68, -222, 136, 133, -207, 63, 248, 32, -99, 63, -241, 177, 148, -200]
5547b00J44O3o1O9K04k36J21J88l63P1J22k72J43lJ48n2l21Q0K83n9k68K35j13
5570g7rJ76j22M2k54M98m17J52k25J58K60j71j45K27qJ59k78j04J15J4J29q3j63
5593a26PL4J26k31M3K30j33J22K8k65K44OM3p1j72M64n90R9J02j98o5L79k57k8
5617b09J41J52P6j64o7J28k51J5mL29j8j52M5J85o1j03pn1J51L11m69j0j76L48
5641A39M1r0l2k9j45P8L07l27l8O1J58l30K37qk73M54l72K36J43m27M53l07K10
5664A39k08j22K58q1k41L28k24o7J14J72O5k95L39l7l52L20j56k22K77k05J54
5685d4O4q9K59l66l7J9K30r9K8nJ33r9o2O1J80j08Ml5k19K62r5K42j30l09J34
5710h1J37k04O6K24j25Q4M4k61L7P9K4j90J09J25k0l41K12J56l3j94j2J59N5p8
$$ y = [-200, -56, 7, -54, 15, 219, -17, 104, 292, -71, 0, 122, -150, -7, -10, 138, 86, -235, -155, 128, 69, -199, 36, -77, -86, 90, -32, 10, -244, 254, -163, -11, -236, -78, 182, 11, -134, 93, 85, 244, -34, -138, -23, -9, 120, 37, -126, -119, -85, 41, -190, -147, 83, -50, 72, 100, -165, 79, 85, 128, 57, -115, 349, -241, -142, -40, -238, -303, 76, -181, -209, -68, 84, 160, -4, -71, 57, -194, -179, -183, 146, 128, -24, 21, 206, 145, 42, 35, -16, 135, 446, -23, -33, -209, 139, 180, 90, 58, 29, -116, -38, 269, -58, -96, -35, 123, -207, 30, 22, -251, 203, -169, 67, 210, -217, 236, -71, 139, -69, -191, 67, -14, -255, 73, -151, -218, -104, 68, 133, -162, 177, 140, -212, 108, -48, -270, 7, -198, -44, 20, -69, 190, -176, -213, -194, 36, -63, -35, -40, 93, -6, -68, -7, 173, 65, 69, 34, -185, 77, -18, 224, 94, -215, -81, 56, -148, -82, 142, 17, 101, 145, -116, -79, 0, 24, -166, -57, 68, 48, -293, -81, 75, 42, -152, -164, -5, 50, -28]
5734b8L64l84j75rJ44J51K4j10J79k09j80J59q8K57j70qj21K99J19l19o0m7J24
5757h8rO3k15J39J3K6j12J97mn5O7l33L83j24M5M0L3m5k77J79R4j74M36j01m05
5782b27J87O4k5J47j44l8K57o51O46o9n4k53L88ql5k55L08j66l73K31j81J11P0
5805g0P6O1j04p7L37j68q2oQ0n4K8k75J64J98k26K91m62N03j88km3r5J36j07r6
5830a81K22j46k48M67Rn0j40R1l3K90l39O3N8K30k66q6R6N4j71R5k2L07m69L42
5854A73j06k9O7k79J88J70l12j71L15M3l1k39L72l8J15k86J51j5q5J05k87%KL24
5878A47l6k7J67j80P6k0o8j84K40K0m36J53K02N4j95J74m4l51Q7M01l44N1L27
5901B14l78L7L7j27N6K23j41J00l8M1k55L78j62O1O1j69R8L0q2Mr2J46J05o2k13
$$ y = [-28, 336, -48, -223, -232, -88, 63, 87, -23, 156, -53, -233, -74, -162, 95, -75, -83, -204, 95, 214, -105, -165, -212, -88, -97, -34, -249, -110, -97, -71, -183, 14, 10, -45, 22, -311, 72, -52, -7, 33, 66, 21, -256, -77, 17, -157, 279, 178, -227, -40, 24, -1, 146, 2, -36, 221, -430, 216, 147, 93, -160, 228, 220, 185, -70, 238, 72, -301, -70, -251, -140, -70, 6, 67, -37, -114, 223, 55, -27, -33, 47, -7, 21, -254, -90, 108, -118, 173, -289, 214, 26, 24, -19, -114, 22, -85, -181, 41, -105, -353, 114, 123, 73, -67, 24, -9, 281, -58, 5, 63, 293, 27, -59, 37, 91, -80, 15, -7, 300, -169, 173, 67, 38, 105, -174, 14, 184, -128, -299, 16, 59, 28, -211, 161, 123, 238, -48, 103, 88, 3, 108, -179, -179, -177, 147, 111, 84, 251, 71, 147, 127, 59, -125, 115, 135, -301, -148, 54, 108, -87, 87, 43, -308, -221, 180, -164, -113, 214, -164, -127, -90, -217, -161, 62, -79, 21, -17, 24, -231, 147, -15, 46, 107, -62, 36, 66, -16, -12, -104, 42, 147, 85, -128]
5926a28L1J4K8m4P5K12k03j33K40n8j84Q7J43L9j55q1J33o8m62P82j25k21J9J73
5950A14l2j24Q4j38K22l51J43L95l05j81M69o08L18M2k4n2k7kj54J49J5N9k34
5973b22K22n1j11K99j53r9p9R7J35p2J50k15l9o6L5L61j71M1l4l04K6K89J57j68
5997B8n8n3J93O5j35o2J75Q7j67m38M10j54L68k57O7kj14j79K85j0j08lk99M22
6021F1l89M93k99K30l48L17j14j50K86r5j6O9J1k58K13j50K66m3P3l43J48k8K82
6044B16j36k66J73k33M44o2r7j5k66N7K65m7J31l64L59m19L38M0p8o9J5l0J88
6067A44P0m01J23o6M0J05j98K28n0r8J85j37o3l03L81j9k20K32K37j9j49l4n1
6090f3j55J45J3J61n1j63P7O2j6j59K57j04r9M6J85j14k38o2L13L51l47j00J03
$$ y = [-128, -97, -83, -55, -99, -24, 188, -15, -148, 92, 34, -150, -63, 80, 119, -36, -117, 16, -52, -514, 268, 143, -78, -59, 114, 82, -42, 42, -96, 126, -225, -82, 313, 8, -173, 296, -312, 6, 48, 24, -28, -55, -57, -211, -62, -47, 12, -222, 0, -51, -162, 137, -16, -115, -194, -97, 38, -34, 116, -99, -138, -204, -169, 192, 21, 62, 28, -276, -250, 39, 196, 28, -30, -83, 110, 175, 40, -22, 153, 240, 73, -365, 45, -109, 259, 2, 69, 67, -47, -226, 59, 49, -59, -62, -361, 61, -328, 165, -134, 96, -252, 65, -49, -199, 87, -8, -24, 45, 56, -202, 11, -139, 127, 84, 157, -186, -38, -66, 216, 80, -186, -13, -246, 198, 136, 39, 24, -242, -185, 80, 33, 164, -200, 159, -260, 78, 118, 40, -29, -14, -44, 144, 214, -187, -64, -130, -90, 15, -183, 45, -5, -103, 82, -55, -118, -421, -40, -59, -279, -47, 190, 171, 22, -12, -63, -218, -73, -60, 101, 50, -113, -36, 26, 10, -149, 108, 4, -95, -49, 136, 22, -216, -278, 35, 386, 39, -61, 42]
6113D2k88K79J35l21J35K63k60j65K33P2l44K29Q6k39K65l44M57j18J1j57l3k16
6135b78L68M9j32lj0k3lj6k57K62J81l20J00j4m8L32n7p5j64k2J3M0j7l4K2J03
6161cM4L36n57K48J2j12q7j71M42R4k28n2O1J82M3j92M8k9rK1Jj56j8L4J29j77
6187i6j04J64p8M2L63k59j89oo1N7L50k36j62L37J15l01k91O27P1m21q1J5K15
6210G1O0k08J50oM7O7j49o4n1J52k1j38J83j34K14Nk28R2l1j63J23j59L62j67
6234GK04l19q6J89N1R7l13k6j45K82l0R6Kj84j34J96R2J1j03o9k33K02J45j50
6258b18J23J79l22L35P1k87K39j22po9L51k7j06j64P0k47P5L08L00m19O3J6J0
6281A52L6k18m3J8K37m06K75m4K5L0n5o7k72O36m65O1J42O8k61L75j19j07j35
$$ y = [42, -246, 33, 168, -153, -18, 245, -15, -180, 53, 125, -219, 10, 96, -143, 122, -222, 235, 117, 128, -29, -62, -278, 90, 139, 7, 4, -6, -29, -32, -48, -305, -43, 138, -182, -82, -96, -144, 188, 131, 56, -108, -130, -117, -77, -94, -128, -106, -3, 41, 377, -180, 68, 80, -32, -119, -290, 152, 246, 18, -34, 27, 209, 252, 60, 108, 79, 70, 91, 92, -64, -82, -48, 81, -96, -200, -36, -114, -72, 291, 32, -157, -163, -224, -167, 183, -53, -215, 122, 237, -64, -355, 272, 343, -78, -159, -144, 71, 131, -77, 73, 67, 114, 181, 32, -32, -83, 69, 48, -90, 93, -41, 173, 178, -50, 42, 11, -152, -29, -188, 174, 7, 211, -108, -194, -5, 46, 143, -170, -196, -341, -59, -89, 7, 9, -175, -309, -113, -21, -10, -113, -182, -415, -213, -68, -218, -95, 84, -238, 97, 168, -119, 120, -2, -9, -78, 273, 246, 140, -24, 46, -201, -126, 182, 482, 63, 126, 142, 152, 188, -30, -73, -55, 182, -224, 51, 7, 32, 62, 7, -60, -332, 304, -161, -100, 42, 110, -151, 224, 105, -2, -137]
6304a37J60L8J41M5k00P7l8k96K80j67K97r3k7Jo3q0N1Q0k75L10n3j7J17l18J5
6329a52j07J70L72k51J94m17K22j14j22L08l4j41j85L29q9j94J75j31Q4p8J99
6350C8K24k91K4j09j27J03J59j31K9K88j93J03k81%L22R6j42j9k03O2K71k59K7
6373iQ1K31j57M7l07J02K1j27M75k87j93n0K20Q7K3r2l41L71k31J68J18kk34P
6397g9K76l88R0J33j52K65l3k94K98n11L23K04n4l0j44J71N8r8j16J44j81K55
6419A37k25N2j2J64j0J05k24o9L8k33Q3m6M89m13L01K32m62n2K93j54O2l3J02
6442A25K21n32J44L7M8P6J4j75q5M88n74R5j40J80L03q7k55J84m61M37R8p1J21
6465A91j48j81J19K12l59N18k73p3NQ9j33L0m1J44j42J65n8m49K76j33L42j69
$$ y = [-137, 23, 61, 202, 247, 47, 124, 86, -210, 70, -97, 200, 107, 80, 81, 18, -62, -11, 69, -206, 104, 51, 34, 151, -167, -152, -259, -89, 283, 32, 226, -191, 31, -83, -205, 103, 69, -72, -257, 72, -17, -211, -36, -167, -83, -161, 38, 262, -29, -5, -114, -241, -138, 21, -110, -81, 207, 14, 117, -164, -164, 158, 254, 112, 93, -110, -48, 223, -36, -9, 72, 303, 146, 193, -114, -12, 9, -118, 357, 70, -123, -173, 47, 134, 157, 65, -276, 95, -136, 32, 150, 148, -86, -79, 197, -191, -101, 32, -120, 145, 112, -182, 116, -395, -72, 132, 78, 48, -96, 75, 133, 35, -81, 63, -118, 137, -88, -36, -48, 116, 106, 211, -13, -82, -44, -277, -194, -240, 249, -164, 137, 369, -93, -145, 148, -6, 56, 23, 125, 346, -186, -42, -5, 43, 119, 133, -42, -127, 361, -213, -118, -258, -78, 225, 138, -117, 67, -394, 43, 141, 70, 191, 43, -138, -19, 193, -166, 352, 79, 6, 11, 100, -33, -3, -44, 100, -42, 123, 65, -384, -108, -241, 101, -68]
6487f8j48K85J22j87Rj19J66J8Jj32J00J12l39J63j37O6l7R1J49kk29m1J86J06
6511A35Q5j25J88l96J20J1m8q8l6j0J81JN4k16K9J70q6Q0o2p1j51L0K40K4j32
6536g3J59m1j00J70o2Q2j59Q8j09j32M59j42K0j37QQ3J4m00K06L2j02L79k96k7
6560h0n7K9r8J67K3J01k31j44J36l3K17J7n1k72K01p9K58N8l10L00k07J58k73
6583a70n6K27l6R7J18r1k8J15m00J20m7L69J0l67M7K60j96j54L25k78K27N3j39
$$ y = [-68, -216, 69, 191, 4, 13, -106, 60, 78, 79, -53, 47, 159, -180, -17, -154, -88, -125, -34, 115, 113, -116, -157, 29, 135, 220, 95, 283, -113, 7, 18, -30, -118, -154, -164, 17, 18, 72, -144, -115, 55, -31, 49, -13, -84, -235, -205, 35, 59, -73, 86, 45, -55, 115, 53, 135, -24, 64, -45, -177, 282, 140, 160, 23, 31, 114, 128, -272, -66, -34, -136, 243, -53, -80, -137, -108, -206, -39, -16, 85, -146, -290, -154, -187, 30, 47, -4, -276, -75, -154, 104, 162, -148, 152, -55, 103, -170, -226, 1, -35, 62, 180, 89, 61, 176, -224, -104, -151, 218, 228, -139, -92, 168, -28, -182, 143, -135, 92, 145, 6]
$$ [...]
8191B59
##END NTUPLES=NMR FID
##END=
