##TITLE=1H_DE-78H3
 200.13MHz, D2O,
 8 sc
 
 31.1.2025
##JCAMPDX= 6.0         $$ Bruker NMR JCAMP-DX V2.0
##DATA TYPE= NMR FID
##DATA CLASS= NTUPLES
##ORIGIN= UXNMR, Bruker Analytische Messtechnik GmbH
##OWNER= pz
$$ XWIN-NMR		Version 3.5
$$ Fri Jan 31 14:17:41 2025 Russian Standard Time (UT+4h)  she@DPX200
##.OBSERVE FREQUENCY= 200.1313
##.OBSERVE NUCLEUS= ^1H
##.DELAY= (6, 6)
##.ACQUISITION MODE= SIMULTANEOUS
##.ACQUISITION SCHEME= undefined
##.AVERAGES= 8
##.DIGITISER RES= 18
##SPECTROMETER/DATA SYSTEM= spect
##.PULSE SEQUENCE= zg30
##.SOLVENT NAME= D2O
##.SHIFT REFERENCE= (INTERNAL, D2O, 0, 14.3821)
##AUDIT TRAIL= $$ (NUMBER, WHEN, WHO, WHERE, WHAT)
$$ ##TITLE= Audit trail, XWIN-NMR		Version 3.5
$$ ##JCAMPDX= 5.01
$$ ##ORIGIN= Bruker BioSpin GmbH
$$ ##OWNER= she
$$ F:/spectra/data/she/nmr/H-C/1/audita.txt
$$ ##AUDIT TRAIL=  $$ (NUMBER, WHEN, WHO, WHERE, WHAT)
(   1,<2025-01-31 14:15:22.04 +0400>,<she>,<DPX200>,
      <created by zg, POWCHK disabled, PULCHK disabled
       configuration hash MD5:
       00 E9 B6 7A A2 85 ED C7 34 08 36 98 17 FE 4E 26
       data hash MD5: 16K
       5D A9 65 49 99 D7 A8 5A 3D E9 3B F0 1A 58 9F DF>)
$$ ##END=
$$ 
$$ hash MD5
$$ 51 0A 38 B2 10 90 0B 79 76 0F 5B 56 8A 81 60 9A
##$RELAX= 
##$RELAX= 
##$RELAX= 
##$RELAX= 
##$RELAX= 
##$RELAX= 
$$ Bruker specific parameters
$$ --------------------------
##$DU= <F:/spectra>
##$EXPNO= 1
##$NAME= <H-C>
##$PROCNO= 1
##$TYPE= <nmr>
##$USER= <she>
##$AMP= (0..31)
100 100 100 100 100 100 100 100 100 100 100 100 100 100 100 100 100 100 
100 100 100 100 100 100 100 100 100 100 100 100 100 100 
##$AQSEQ= 0
##$AQ_mod= 1
##$AUNM= <au_zg>
##$AUTOPOS= <>
##$BF1= 200.13
##$BF2= 200.13
##$BF3= 200.13
##$BF4= 200.13
##$BF5= 200.13
##$BF6= 200.13
##$BF7= 200.13
##$BF8= 200.13
##$BYTORDA= 1
##$CFDGTYP= 0
##$CFRGTYP= 5
##$CHEMSTR= <none>
##$CNST= (0..31)
1 1 145 1 1 1 1 1 1 1 1 1 1 1 1 1 1 1 1 1 1 1 1 1 1 1 1 1 1 1 1 1 
##$CPDPRG= <>
##$CPDPRG1= <>
##$CPDPRG2= <>
##$CPDPRG3= <>
##$CPDPRG4= <mlev>
##$CPDPRG5= <mlev>
##$CPDPRG6= <mlev>
##$CPDPRG7= <mlev>
##$CPDPRG8= <mlev>
##$CPDPRGB= <>
##$CPDPRGT= <>
##$D= (0..31)
0 0.7 0 0 0 0 0 0 0 0 0 0.03 0 0 0 0 0 0 0 0 0 0 0 0 0 0 0 0 0 0 0 0 
##$DATE= 1738318521
##$DBL= (0..7)
120 120 120 120 120 120 120 120 
##$DBP= (0..7)
150 150 150 150 150 150 150 150 
##$DBP07= 0
##$DBPNAM0= <>
##$DBPNAM1= <>
##$DBPNAM2= <>
##$DBPNAM3= <>
##$DBPNAM4= <>
##$DBPNAM5= <>
##$DBPNAM6= <>
##$DBPNAM7= <>
##$DBPOAL= (0..7)
0.5 0.5 0.5 0.5 0.5 0.5 0.5 0.5 
##$DBPOFFS= (0..7)
0 0 0 0 0 0 0 0 
##$DE= 6
##$DECBNUC= <off>
##$DECIM= 32
##$DECNUC= <off>
##$DECSTAT= 4
##$DIGMOD= 1
##$DIGTYP= 9
##$DL= (0..7)
0 120 120 120 120 120 120 120 
##$DP= (0..7)
150 150 150 150 150 150 150 150 
##$DP07= 0
##$DPNAME0= <>
##$DPNAME1= <>
##$DPNAME2= <>
##$DPNAME3= <>
##$DPNAME4= <>
##$DPNAME5= <>
##$DPNAME6= <>
##$DPNAME7= <>
##$DPOAL= (0..7)
0.5 0.5 0.5 0.5 0.5 0.5 0.5 0.5 
##$DPOFFS= (0..7)
0 0 0 0 0 0 0 0 
##$DQDMODE= 0
##$DR= 18
##$DS= 0
##$DSLIST= <SSSSSSSSSSSSSSS>
##$DSPFIRM= 0
$$ [...]
##$SUBNAM0= <"">
##$SUBNAM1= <"">
##$SUBNAM2= <"">
##$SUBNAM3= <"">
##$SUBNAM4= <"">
##$SUBNAM5= <"">
##$SUBNAM6= <"">
##$SUBNAM7= <"">
##$SUBNAM8= <"">
##$SUBNAM9= <"">
##$SW= 18.0517328524113
##$SWIBOX= (0..15)
0 0 2 0 0 0 0 0 0 0 0 0 0 0 0 0 
##$SW_h= 3612.71676300578
##$TD= 16384
##$TD0= 1
##$TE= 0
##$TE2= 300
##$TE3= 300
##$TEG= 300
##$TL= (0..7)
0 120 120 120 120 120 120 120 
##$TP= (0..7)
150 150 150 150 150 150 150 150 
##$TP07= 0
##$TPNAME0= <>
##$TPNAME1= <>
##$TPNAME2= <>
##$TPNAME3= <>
##$TPNAME4= <>
##$TPNAME5= <>
##$TPNAME6= <>
##$TPNAME7= <>
##$TPOAL= (0..7)
0.5 0.5 0.5 0.5 0.5 0.5 0.5 0.5 
##$TPOFFS= (0..7)
0 0 0 0 0 0 0 0 
##$TUNHIN= 0
##$TUNHOUT= 0
##$TUNXOUT= 0
##$USERA1= <user>
##$USERA2= <user>
##$USERA3= <user>
##$USERA4= <user>
##$USERA5= <user>
##$V9= 5
##$VALIST= <valist>
##$VCLIST= <CCCCCCCCCCCCCCC>
##$VD= 0
##$VDLIST= <DDDDDDDDDDDDDDD>
##$VPLIST= <PPPPPPPPPPPPPPP>
##$VTLIST= <TTTTTTTTTTTTTTT>
##$WBST= 1024
##$WBSW= 4
##$XGAIN= (0..3)
0 0 0 0 
##$XL= 0
##$YL= 0
##$YMAX_a= 519281
##$YMIN_a= -663505
##$ZGOPTNS= <>
##$ZL1= 120
##$ZL2= 120
##$ZL3= 120
##$ZL4= 120
##$ABSF1= 10
##$ABSF2= 0
##$ABSG= 5
##$ABSL= 3
##$ALPHA= 0
##$AQORDER= 0
##$ASSFAC= 0
##$ASSFACI= 0
##$ASSFACX= 0
##$ASSWID= 0
##$AUNMP= <proc_1d>
##$AZFE= 0.1
##$AZFW= 0.1
##$BCFW= 1
##$BC_mod= 2
##$BYTORDP= 1
##$COROFFS= 0
##$CY= -3
##$DATMOD= 1
##$DC= 2
##$DFILT= <>
##$DTYPP= 0
##$F1P= 0
##$F2P= 0
##$FCOR= 0.5
##$FTSIZE= 0
##$FT_mod= 4
##$GAMMA= 1
##$GB= 0.15
##$INTBC= 1
##$INTSCL= 1
##$ISEN= 128
##$LB= 0.25
##$LEV0= 0
##$LPBIN= 0
##$MAXI= 10000
##$MC2= 0
##$MEAN= 0
##$ME_mod= 0
##$MI= 1.114404
##$NCOEF= 0
##$NC_proc= 0
##$NLEV= 6
##$NOISF1= 3.799351
##$NOISF2= 2.8
##$NSP= 1
##$NTH_PI= 0
##$NZP= 0
##$OFFSET= 14.38212
##$PC= 1
##$PHC0= 240.9584
##$PHC1= 19.99223
##$PH_mod= 1
##$PKNL= yes
##$PPARMOD= 0
##$PSCAL= 0
##$PSIGN= 0
##$REVERSE= no
##$SF= 200.129724274929
##$SI= 16384
##$SIGF1= 3
##$SIGF2= 2
##$SINO= 400
##$SIOLD= 16384
##$SREGLST= <1H.CDCl3>
##$SSB= 0
##$STSI= 0
##$STSR= 0
##$SW_p= 3205.1282051282
##$SYMM= 0
##$S_DEV= 0
##$TDeff= 0
##$TDoff= 0
##$TI= <>
##$TILT= no
##$TM1= 0
##$TM2= 0
##$TOPLEV= 0
##$USERP1= <user>
##$USERP2= <user>
##$USERP3= <user>
##$USERP4= <user>
##$USERP5= <user>
##$WDW= 1
##$XDIM= 8192
##$YMAX_p= 0
##$YMIN_p= 0
$$ End of Bruker specific parameters
$$ ---------------------------------
##NTUPLES= NMR FID
##VAR_NAME=  TIME,          FID/REAL,        FID/IMAG
##SYMBOL=    X,             R,               I
##VAR_TYPE=  INDEPENDENT,   DEPENDENT,       DEPENDENT
##VAR_FORM=  AFFN,          ASDF,            ASDF
##VAR_DIM=   8192,          8192,            8192
##UNITS=     SECONDS,       ARBITRARY UNITS, ARBITRARY UNITS
##FACTOR=    0.0002768,     1,               1
##FIRST=     0,             0,               0
##LAST=      2.2672688,     0,               0
##MIN=       0,             -663505,         0
##MAX=       2.2672688,     519281,          0
$$ Real data points
##PAGE= N=1
##DATA TABLE= (X++(R..R)), XYDATA
$$ [...]
$$ plain form
1885 86 -184 21 -37 6 168 -1 220 -11 -38 139 -48 -217 -144 14 157 -249 71 -403 -156 64 161 380
1907 380 106 79 -206 -222 -53 -167 286 -70 107 37 70 -316 29 -22 -238 151 -405 -118 172 1 -45 137
1929 137 86 -104 252 83 -118 98 68 -55 281 6 -10 -101 247 14 -48 344 -173 -41 -4 58 177 15
1951 15 -225 -173 -146 59 -154 87 -143 138 105 -33 45 -176 213 89 -30 -33 196 -261 -152 -79 -169 -169 104 367
1975 367 132 177 -218 57 -429 -124 16 31 29 38 -48 191 -3 20 88 -92 177 82 -53 27 -53 -231 -128 -295
1999 -295 -286 187 71 61 -109 37 -282 57 167 44 -175 170 -184 2 140 -93 3 -140 -26 -212 -11
2020 -11 104 14 57 -94 -22 -107 203 -135 39 68 -140 -59 -97 243 -302 -341 112 -75 -98 55 -102 100 166 -73
2044 -73 -63 37 -106 65 56 -73 45 279 12 319 47 -54 169 88 9 55 43 82 18 56 13 73 214 -261
$$ packed form
1885H6k70K05n8M3J62j69K21k31k7J77j87j69P3J58J43m06L20m74K47K20R7K19
1907C80k74k7k85j6J69j14M53l56J77p0L3l86L45n1k16L89n56K87K90j71m6J82
1929A37n1j90L56j69k01K16l0j23L36k75j6r1L48k33o2L92n17J32L7O2J19j62
1951A5k40N2K7K05k13K41k30K81l3j38P8k21L89j24j19lK29m57J09P3r0%K73K63
1975C67k35M5l95K75m86L05J40J5kRq6K39j94K3O8j80K69r5j35Q0q0j78J03j67
1999b95RM73j16j0j70J46l19L39J10j23k19L45l54J86J38k33R6j43J14j86K01
2020a1J15r0M3j51P2q5L10l38J74K9k08Q1l8L40n45l9M53j87k3J53j57K02O6k39
2044g3J0J00j43J71rj29J18K34k67L07k72j01K23q1p9M6j2L9o4L8m3O0J41m75
$$ plain form
2068 -261 -218 18 -137 54 56 -106 99 -99 -227 270 -69 3 -90 20 -79 409 106 -4 84 -239 88 -37
2090 -37 164 139 283 59 100 103 -257 130 90 -297 137 -62 -8 20 49 -89 11 -143 -56 76 -98 75 -32
2113 -32 18 -19 -119 222 68 153 26 39 -98 -104 -347 -12 -84 -98 -81 -107 -87 43 110 155 -137 104 161 128 164 38
2139 38 3 23 48 250 -78 -12 132 -97 89 200 -13 -284 -62 82 -93 -27 172 49 -12 -227 -125 167
2161 167 -193 -64 25 -44 -96 63 -108 231 -121 15 80 8 143 -220 12 198 340 -6 129 17 41 -238
2183 -238 -71 -67 21 103 -13 389 -96 -205 -109 100 -143 -102 43 33 248 7 103 -193 -97 123 -121 60 -129
2206 -129 -87 -37 -178 71 -139 182 159 -6 -219 113 -20 62 237 -135 17 -342 -193 148 248 -8 248
2227 248 106 -71 121 -55 -96 0 216 9 -33 8 -212 -38 25 -57 47 -125 124 -28 130 -44 328 241
$$ packed form
2068b61M3K36j55J91Kj62K05j98j28M97l39P2r3J10r9M88l03j10Q8l23L27j25
2090c7K01k5J44k24M1Ll60L87m0l87M34j99N4K8K9j38J00j54Q7J32j74J73j07
2113c2N0l7j00L41j54Q5j27J3j37ok43L35p2j4J7k6K0J30O7M5k92K41N7l3L6j26
2139C8l5K0K5K02l28O6J44k29J86J11k13k71K22J44j75O6J99j23o1k15J02K92
2161A67l60J29Q9o9n2J59j71L39l52J36O5p2J35l63K32J86J42l46J35j12K4k79
2183b38J67MQ8Q2j16M02m85j09R6K09k43M1J45j0K15k41R6k96R6K20k44J81j89
2206a29M2N0j41K49k10L21k3j65k13L32j33Q2J75l72J52l59J49L41J00k56K56
2227B48j42j77J92j76m1R6K16k07m2M1k20J74O3q2J04j72K49j52J58j74L72q7
$$ plain form
2249 241 -183 52 -86 -132 -317 -159 17 14 -116 79 -7 21 146 -45 11 -153 143 -84 255 140 12 -129
2271 -129 17 -42 28 -31 -26 273 52 -134 94 -84 218 139 -33 -50 -260 51 -56 126 -266 186 235 0 -35
2294 -35 68 100 -136 139 -310 8 -48 -7 -4 -22 -164 -19 148 93 -1 -191 44 32 223 172 10 27 -51 17 -175
2319 -175 141 78 98 218 -110 78 102 -231 -18 -90 87 -16 -22 137 208 -81 -329 201 -77 -257 92 25 13
2342 13 280 -150 -41 -133 -286 162 -219 47 207 -77 114 32 -51 -142 214 -128 -194 -55 51 11 -341 400
2364 400 -26 -93 -100 -37 -304 132 90 -77 134 -3 46 235 -109 -68 81 82 131 251 234 -254 -85 -58 65 -164
2388 -164 83 -185 -137 -64 189 -8 -70 114 165 20 -81 53 123 11 308 190 39 -239 60 -323 -51 -167
2410 -167 -474 271 111 50 -252 -16 -3 -66 18 58 85 9 20 35 182 -5 -138 1 -94 7 -170 39 -16 118
$$ packed form
2249B41m24K35j38m6j85J58J76lj30J95q6K8J25j91N6j64K96k27L39j15j28j41
2271a29J46n9P0n9NK99k21j86K28j78L02p9j72j7k10L11j07J82l92M52M9k35l5
2294c5J03L2k36K75m49L18n6M1Lj8j42J45J67n5r4j90K35j2J91n1j62J7p8O8j92
2319a75L16o3K0J20l28J88K4l33K13p2J77j03oJ59P1k89k48N30k78j80L49o7j2
2342A3K67m30J09r2j53M48l81K66J60k84J91q2q3r1L56l42o6J39J06m0l52P41
2364D00m26o7pO3k67M36m2j67K11j37M9J89l44M1J49JM9J20j7m88J69K7J23k29
2388a64K47k68M8P3K53j97o2J84N1j45j01J34P0j12K97j18j51k78K99l83K72j16
2410a67l07P45j60o1l02K36J3o3Q4M0K7p6J1J5J47j87j33J39r5J01j77K09n5J34
$$ plain form
2434 118 -78 -187 -107 262 80 -112 -184 12 -81 27 107 29 152 -24 -261 -333 -3 -306 -98 147 362 -462
2456 -462 -14 -164 -73 1 -89 78 82 -114 -46 24 71 48 128 -265 -198 -53 -92 94 -35 -37 171 -112 -72 -47 -187
2481 -187 149 142 62 -77 -247 -15 -127 -12 -249 146 -108 239 129 114 158 23 9 4 54 -91 -284 58 -151
2504 -151 -118 -2 -76 89 -64 36 137 84 -244 63 41 38 176 177 -127 35 -29 -83 181 -26 -42 22 51 -116
2528 -116 -124 4 -55 9 142 168 44 208 151 35 241 -7 202 -198 -92 -155 244 86 -189 27 151 287
2550 287 108 73 -263 -164 6 40 229 92 305 60 -120 164 220 64 -51 -20 71 44 67 -97 49 -153 10
2573 10 -18 -88 2 -280 231 48 -153 -18 248 54 55 -198 -132 18 -157 124 265 -349 220 116 45 177 221
2596 221 -159 -100 -6 -1 -185 150 -26 -52 -19 -28 -112 -111 400 23 -44 -95 120 -166 15 -32 -157 137 119 -279 -190
$$ packed form
2434A18j96j09Q0L69j82j92p2J96r3J08Q0p8J23j76k37p2L30l03K08K45K15q24
2456d62M48j50R1P4r0J67Mj96O8P0M7k3Q0l93O7J45l9J86j29kK08k83M0K5j40
2481a87L36pq0j39j70K32j12J15k37L95k54L47j10j5M4j35j4nN0j45j93L42k09
2504a51L3J16p4J65j53J00J01n3l28L07k2lJ38Jl04J62o4n4K64k07j6O4K9j67
2528a16qJ28n9O4J33K6j24J64n7j16K06k48K09m00J06o3L99j58k75K16J24J36
2550B87j79l5l36R9J70L4J89j37K13k45j80K84N6j56j15L1R1k7K3j64J46k02J63
2573A0k8p0R0k82N11j83k01J35K66j94Jk53O6J50j75K81J41o14N69j04p1J32M4
2596B21l80N9R4Nj84L35j76k6L3rq4JN11l77o7n1K15k86J81m7j25K94j8l98Q9
$$ plain form
2621 -190 -153 21 -121 -38 13 165 143 275 130 -35 -223 80 243 39 0 147 -23 -142 134 7 -39 36
2643 36 -71 30 167 -18 5 29 77 -8 -182 105 -271 -233 -213 192 -60 78 90 -89 -176 113 78 105 -19 -15
2667 -15 -123 230 88 -95 64 110 372 36 237 -210 -84 -159 102 -100 61 -159 -46 106 82 -187 -150 131
2689 131 -164 -219 -171 152 -94 18 -113 -28 -26 48 180 -5 47 37 3 68 -154 28 -4 97 -76 -90 -185 -220 434
2714 434 -212 -330 -132 115 20 -253 86 34 -101 -107 144 142 -30 -40 -132 255 -13 205 -20 -75 -275 -101 -127
2737 -127 111 8 223 28 -11 -45 -252 102 -45 94 -341 12 -90 66 -182 10 -79 -151 -133 -6 -114 116
2759 116 -102 -69 12 -10 45 -113 36 -93 45 -244 -76 -248 -61 392 277 104 -239 -225 -98 257 -372 -139
2781 -139 130 -38 -119 -50 133 112 61 14 -193 -89 180 -88 -88 -124 14 -4 -53 242 -104 90 -96 -41 86 -140
$$ packed form
2621a90L7J74j42Q3N1J52k2J32j45j65j88L03J63k04l9J47j70j19K76j27m6P5
2643C6j07J01J37j85K3K4M8q5j74K87l76L8K0M05k52J38J2j79q7K89l5K7j24M
2667a5j08L53j42j83J59M6K62l36K01m47J26p5K61k02J61k20J13J52k4k69L7K81
2689A31k95n5M8L23k46J12j31Q5KP4J32j85N2j0l4O5k22J82l2J01j73j4r5l5O54
2714D34o46j18J98K47r5k73L39n2j35oK51kj72j0r2L87k68K18k25n5k00J74k6
2737a27K38j03K15j95l9l4k07L54j47J39m35L53j02J56k48J92q9p2J8J27j08K30
2759A16k18L3Q1k2N5j58J49j29J38k89J68j72J87M53j15j73l43J4J27L55o29K33
2781a39K69j68q1O9J83k1n1m7k07J04K69k68%l6J38j8m9K95l46J94j86N5J27k26
$$ plain form
2805 -140 28 46 -27 39 -2 129 204 -46 -193 -180 358 88 21 134 226 -51 37 102 93 -141 23 -152 208 18
2829 18 71 -19 -89 -81 124 -4 -12 18 175 30 89 -249 -52 227 265 218 73 -21 16 -51 -102 -168 196 -123 278 -263
2855 -263 169 58 -115 -279 93 74 75 105 -40 110 -96 41 -165 -97 -40 -99 29 -132 -439 -60 -114 -78 171
2878 171 198 200 -3 93 300 -52 -65 -160 -205 145 174 234 120 -126 150 -88 -91 148 -185 -9 150 -250 41 -107
2902 -107 243 -77 -151 164 -81 17 -186 267 -161 -160 -113 -29 -245 191 40 -127 -105 92 82 125 -11 3 36 -56
2926 -56 72 102 1 155 -82 307 130 -32 -195 166 -99 -168 143 -117 -160 -35 27 285 -220 -163 -219 -72
2948 -72 31 -254 -51 -175 325 176 213 -221 -131 67 -20 129 5 73 110 7 23 87 -96 84 174 42 -11
2971 -11 120 59 314 114 254 137 30 -6 15 119 154 -232 -156 -52 172 -53 -6 326 -84 -158 59 108 -69
$$ packed form
2805a40J68J8p3O6m1J31P5k50j47J3N38k70o7J13R2k77Q8O5rk34J64j75L60j90
2829A8N3r0p0QK05j28qL0J57j45N9l38J97K79L8m7j45r4L7o7n1o6L64l19M01n41
2855b63M32j11j73j64L72j9JL0j45J50k06J37k06O8N7n9J28j61l07L79n4L6K49
2878A71K7Kk03R6K07l52j3r5m5L50K9O0j14k46K76k38lK39l33J76J59m00K91j48
2902a07L50l20p4L15k45R8k03M53m28JM7Q4k16M36j51j67K2J97j0M3j36J4L3r2
2926e6J28L0j01J54k37L89j77j62j63L61k65o9L11k60m3J25O2K58n05N7n6J47
2948g2J03k85K03j24N00j49L7m34R0J98q7J49j24O8L7j03J6O4j83J80R0j32n3
2971a1J31o1K55k00J40j17j07l6K1J04L5l86P6J04K24k25M7L32m10p4K17M9j77
$$ plain form
2994 -69 52 68 101 -114 9 -63 58 -13 -179 196 -43 10 -122 -212 124 36 -20 -93 229 -162 55 -182 91
3017 91 20 71 24 -11 -230 76 63 150 25 -21 -194 9 42 -417 76 34 -58 -110 56 57 117 -80 -238 9 -87
3042 -87 -138 -343 -97 127 -195 -45 74 118 131 252 285 -34 -65 61 9 -115 189 -278 99 94 -174 162 -73
3065 -73 158 -13 -143 97 -206 61 -415 -10 -61 -126 -121 -179 255 158 -136 21 154 70 148 414 -83 -38 -15 97
3089 97 28 38 113 106 44 -86 -94 -150 -14 53 -202 40 -137 -89 -7 -155 263 6 -212 312 -164 51 58 125 -110
3114 -110 174 -36 109 -173 179 -23 -61 22 -161 140 127 304 -68 -112 -205 -38 -65 -130 209 159 -287 -23 -141
3137 -141 49 -89 45 185 114 -43 316 24 -45 -39 -47 91 13 -91 -97 79 -36 -1 -111 -197 354 260 -88 -206
3161 -206 -77 18 373 -155 49 -14 -38 -169 267 -171 34 -46 93 90 50 173 0 56 -100 103 324 -6 47
$$ packed form
2994f9J21J6L3k15J23p2J21p1j66L75k39N3j32r0L36q8n6p3L22l91K17k37K73
3017I1p1N1m7l5k19L06j3Q7j25m6j73K03L3m59M93m2r2n2J66JO0j97j58K47r6
3042h7n1k05K46K24l22J50J19M4J3J21L3l19l1J26n2j24L04m67L77nk68L36k35
3065g3K31j71j30K40l03K67m76M05n1o5Nn8M34r7k94J57J33q4P8K66m97M5K3J12
3089I7o9J0P5po2j30qn6J36O7k55K42j77M8Q2j48M18k57k18N24m76K15PO7k35
3114a10K84k10J45k82L52k02l8Q3j83L01j3J77l72m4r3J67k7o5L39n0m46K64j18
3137a41J90j38J34J40p1j57L59k92o9OqJ38p8j04oJ76j15L5j10q6N51r4l48j18
3161b06J29R5L55n28K04o3k4j31M36m38K05q0J39lm0J23j73N6j56K03K21l30N3
$$ plain form
3184 47 -87 -174 171 -59 -155 63 133 61 -102 298 -65 -188 -14 -137 114 -234 -170 -22 10 8 75 -184 16
3207 16 450 20 -145 46 89 -30 -5 -276 -63 201 88 -5 383 137 -5 -194 -113 8 -55 86 85 -263 -8
3230 -8 158 135 162 -35 -21 -80 -34 -108 94 102 -27 -163 -14 143 234 -97 251 -38 -46 -190 52 -74 -41 100 67
3255 67 89 -46 90 146 89 138 140 97 -41 -6 133 -58 303 23 239 -9 -95 -66 -137 -59 39 204 -217 56 37
3280 37 93 -85 -70 -99 -160 -159 -124 53 -174 -53 101 15 -399 75 72 107 10 48 -280 -90 38 -122 -75 83 -192
3305 -192 -250 224 -40 82 -127 -32 -124 -4 72 113 -84 89 19 -66 -33 74 -34 -160 -4 107 -77 -50 29
3328 29 -48 -11 267 126 77 -139 72 62 -64 139 -105 253 118 402 -175 -108 -148 -12 71 -10 -127 -189 21
3351 21 39 -267 227 33 126 202 -158 223 182 -65 -24 208 -62 -361 -206 -212 -68 -36 22 -68 -129 197 95 -265
$$ packed form
3184D7j34q7L45k30r6K18P0p2j63M00l63j23J74j23K51l48O4J48L2kO7k59K00
3207A6M34m30j65J91M3j19K5k71K13K64j13r3L88k46j42j89Q1J21o3J41jl48K55
3230hJ66k3K7j97J4n9M6p4K02Qj29j36J49J57R1l31L48k89qj44K42j26L3J41l3
3255F7K2j35J36N6n7M9Km3j38L5J39j91L61k80K16k48q6K9p1P8R8J65m21K73j9
3280C7N6j78J5k9o1JL5J77k27J21J54q6m14M74lL5r7L8l28J90J28j60M7J58k75
3305a92n8M74k64J22k09R5r2J20P6M1j97J73p0q5L3J07j08j26J56J11j84K7P9
3328B9p7L7K78j41m9k16K11j0j26K03k44L58j35K84n77O7m0J36Q3q1j17o2K10
3351B1J8l06M94j94R3P6l60L81m1k47M1K32k70k99J55oJ44L2N8r0o1L26j02l60
$$ plain form
3375 -265 -31 202 93 216 -180 -9 -196 -51 17 17 141 35 -157 -76 -123 176 144 -36 229 -152 -22 -7
3397 -7 -93 99 -130 139 -97 -169 -103 327 79 67 101 76 31 -68 11 -39 74 61 -78 109 -206 -78 105 274
3421 274 128 10 50 -51 -63 -156 41 112 -370 67 -123 -89 -29 5 -331 -94 -382 230 18 388 153 25
3443 25 -1 -241 -143 89 -11 -17 104 251 335 3 -163 229 49 -183 -74 -360 145 -149 -210 23 -150 -168 -97
3466 -97 63 -176 -68 -64 -90 82 74 -7 137 124 44 289 168 145 78 38 -261 41 -275 120 296 183 14 -273
3490 -273 -17 -21 -9 75 -142 -19 33 207 115 -90 -495 -287 -186 -34 -116 67 79 0 30 -204 -89 1 127 122
3514 122 10 99 133 -6 190 -114 -82 0 -79 60 -1 12 -229 268 -188 -119 4 -15 131 108 47 -123 117 142
3538 142 18 26 -7 -168 141 87 12 113 176 53 52 129 -151 -53 -88 -154 136 -259 -350 -4 -200 -48 -112 -34 -25 -99
$$ packed form
3375b65K34K33j09J23l96J71j87J45O8%J24j06j92Q1m7K99l2j80K65l81J30J5
3397gq6J92k29K69k36p2O6M30k48j2L4k5m5r9P9n0J13j3j39J87l15J28J83J69
3421B74j46j18M0j01j2r3J97P1m82M37j90L4O0L4l36K37k88O12k12L70k35j28
3443B5k6k40R8K32j00oJ21J47Q4l32j66L92j80k32J09k86N05k94o1K33j73j8P1
3466i7J60k39J08Mk6J72qq1J44j3q0K45j21k3o7m0k99L02l16L95J76j13j69k87
3490b73K56mJ2Q4k17J23N2J74r2k05m05K08J01J52q2J83J2p9L0k34J15R0J26n
3514A22j12Q9L4j39J96l04L2Q2p9J39o1J3k41M97m56O9J23j9J46k3o1j70K40K5
3538A42j24Ql3j61L09n4p5J01O3j23jP7k80R8l5o6K90l95r1L46j96J52o4P8Rp4
$$ plain form
3564 -99 -83 -186 11 359 -359 -14 -124 114 -25 6 157 -182 -176 -59 -123 28 24 -165 -201 86 120 -114 44
3587 44 -124 97 160 2 -43 0 -67 -84 82 286 20 -252 237 59 -63 168 -164 -37 -137 -155 -51 63
3609 63 -177 131 -73 82 -72 7 20 424 122 235 280 -88 107 174 203 -181 118 78 70 0 -27 49 -220 133
3633 133 277 147 59 -33 -80 60 138 55 178 186 -263 -117 -88 281 32 136 135 35 -203 -99 278 -204 24
3656 24 126 168 15 3 -98 238 152 66 86 -21 -181 176 -112 -2 -150 179 142 102 -108 -201 -71 -58 -266
3679 -266 -155 42 -151 214 25 -359 211 66 -54 27 -136 -228 -223 37 -32 200 67 -171 147 16 126 128
3701 128 -25 -23 31 -117 404 -70 -220 94 -101 -200 63 -100 -34 150 -5 154 337 31 0 -113 210 24
3723 24 -39 89 171 -6 -3 36 -129 192 -334 46 69 -71 124 272 -169 -123 212 -32 98 -133 20 -57 -56 228
$$ packed form
3564i9J6j03J97L48p18L45j10K38j39L1J51l39OJ17o4J51mj89l6K87L4k34J58
3587D4j68K21O3j58m5M3o7j7J66K04k66k72M89j78j22K31l32J27j00j8J04J14
3609F3k40L08k04J55j54P9J3M04l02J13M5l68J95O7K9l84K99m0qp0k7P6k69L53
3633A33J44j30q8r2m7J40P8q3J23Qm49J46K9L69k49J04jj00k38J04L77m82K28
3656B4J02M2j53j2j01L36q6q6K0j07j60L57k88J10j48L29l7m0k10r3J30J3k08
3679b66J11J97j93L65j89l84N70j45j20Q1j63r2NK60o9K32j33k38L18j31J10K
3701A28j53KN4j48N21m74j50L14j95r9K63j63O6J84j55J59J83l06l1j13L23j86
3723B4o3J28Q2j77LL9j65L21n26L80K3j40J95J48m41M6L35k44J30k31J53p7JK84
$$ plain form
3747 228 -10 16 276 27 135 135 76 9 -202 8 -180 -237 209 -58 -9 -25 -32 196 -129 84 22 167 104 -35
3771 -35 -24 175 302 -57 160 23 247 -209 -122 -86 244 -4 11 -151 -101 162 233 68 85 -48 30 84 -157
3794 -157 -162 -126 133 12 -27 -43 -43 -252 118 -240 -83 -46 -20 -216 -201 -132 20 -36 -68 162 43 31 -131 -19 151
3819 151 -46 131 -75 89 198 -2 -193 89 2 93 224 216 -28 -300 -32 -19 123 -209 61 203 52 -136
3841 -136 308 57 -120 -115 83 -64 -60 79 94 325 -126 -202 -133 -223 -38 -34 83 -149 91 60 -172 -90 -52 -102 126
3866 126 188 123 -148 -175 7 -210 -38 -85 72 -251 -87 -55 37 -22 153 -45 215 462 198 -56 -257 -50
3888 -50 5 155 -61 -106 130 171 247 317 139 93 -204 -2 78 -227 123 -390 114 -157 -37 29 -89 28 38
3911 38 3 -37 -93 -29 95 -214 165 124 -114 37 -8 -139 75 -208 26 106 243 105 -134 -17 20 -69 91
$$ packed form
3747B28k38K6K60k49J08%n9o7k11K10j88n7M46k67M9j6pK28l25K13o2J45o3j39
3771c5J1J99J27l59K17j37K24m56Q7L6L30k48J5j62N0K63P1j65J7j33P8N4k41
3794a57nL6K59j21l9j6%k09L70l58J57L7K6j96J5O9J52n6l2K30j19j2j62J12J70
3819A51j97J77k06J64J09k00j91K82q7R1J31qk44k72K68J3J42l32K70J42j51j88
3841a36M44k51j77NJ98j47MJ39J5K31m51p6O9r0J85MJ17k32K40l1k32Q2L8n0K28
3866A26O2o5k71k7J82k17J72m7J57l23J64L2R2n9J75j98K60K47k64k54k01K07
3888e0N5J50k16m5K36M1P6P0j78m6k97K02Q0l05L50n13N04k71J20O6j18J17J0
3911C8l5m0n6O4J24l09L79m1k38J51m5j31K14k83K34Q0J37j38k39J17L7q9J60
$$ plain form
3934 91 -84 -197 -22 -49 -283 83 397 322 17 472 76 20 -1 14 117 274 41 -286 95 90 297 -140 -124
3957 -124 -123 -174 142 -107 -145 0 113 85 63 -157 -202 -153 71 122 -60 -287 157 -39 96 3 181 126 -53 83
3981 83 63 -50 -32 100 195 111 -255 -55 -14 117 -39 82 99 145 -137 306 -78 -144 216 -69 -39 229 33
4004 33 -176 164 -94 213 29 -117 61 -9 279 86 -32 -54 -90 134 -4 26 -268 -88 86 -41 -124 141
4026 141 -48 175 37 14 65 -75 -26 -3 68 112 28 -183 -65 151 90 78 -163 -194 -204 -155 143 38 121 227
4050 227 45 64 -90 -43 32 -254 -197 -318 -113 121 283 -170 -313 -9 -142 -51 98 33 -337 23 -4 176
4072 176 48 -35 175 -3 -11 -229 85 -28 226 -350 199 368 -128 138 -13 -261 -1 -8 -177 107 158 -87
4094 -87 -184 -120 -167 -244 -185 42 -37 28 84 -55 -75 146 40 73 -33 -114 117 -202 -118 169 35 62 -243 32 116
$$ packed form
3934I1j75j13J75k7k34L66L14p5l05M55l96n6k1J5J03J57k33l27L81nK07m37J6
3957a24Jn1L16k49l8J45J13k8k2k20m5M9K24N1j82k27M44j96J35r3J78n5j79J36
3981H3k0j13J8J32R5q4l66K00M1J31j56J21J7M6k82M43l84o6L60k85L0K68j96
4004C3k09L40k58L07j84j46J78p0K88j93j18k2l6K24j38L0k94J80J74j27q3K65
4026A41j89K23j38k3N1j40M9K3P1M4q4k11J18K16o1j2k41l1j0M9K98j05Q3J06
4050B27j82J9j54M7P5k86N7j21K05K34J62m53j43L04j33R1J49o5l70L60k7J80
4072A76j28q3K10j78qk18L14j13K54n76N49J69m96K66j51k48K60pj69K84N1k45
4094h7r7O4m7p7N9K27p9O5N6j39k0K21j06L3j06q1K31l19Q4K87j34K7l05K75Q4
$$ plain form
4119 116 -118 -127 -71 18 19 -114 44 15 122 -29 -201 306 10 -167 185 -108 106 -229 -27 79 -80 -135 109
4142 109 -63 67 -59 70 -131 4 131 -7 40 -120 220 -242 34 -231 1 -367 106 -127 228 -133
4162 -133 1 50 -156 -25 -112 89 -133 -192 -3 101 -192 143 -41 -27 26 -148 -8 -81 154 -107 150 16
4184 16 -44 -44 -109 -59 -356 -139 -14 80 247 132 221 125 -18 301 227 -198 5 81 321 217 -179 42 -19 117
4208 117 30 41 -169 -71 209 127 115 -154 -47 161 39 -108 244 -114 82 -43 46 81 -17 167 4 74 -196
4231 -196 167 123 136 -59 -130 96 231 -165 203 -192 -234 38 53 160 72 28 178 220 -1 -169 69 -168 86
4254 86 206 37 124 31 -68 -35 263 -71 46 71 92 304 55 -260 -284 -288 104 31 -159 -22 73 332 108 217
4278 217 -51 -143 -47 41 126 222 82 -150 -85 -139 -74 -31 86 14 -222 -113 222 -139 -67 -40 -17 -7 8 164 37
$$ packed form
4119A16k34rN6Q9Jj33J58k9J07j51j72N07k96j77L52k93K14l35K02J06j59n5K44
4142A09j72J30j26J29k01J35J27j38M7j60L40m62K76k65K32l68M73k33L55l61
4162a33J34M9k06J31q7K01k22n9J89J04k93L35j84J4N3j74J40p3K35k61K57j34
4184A6o0%o5N0k97K17J25R4J67j15Q9r6j43L19p4m25K03P6K40j04l96K21o1J36
4208A17q7J1k10R8K80q2j2k69J07K08j22j47L52l58J96j25Q9L5r8J84j63P0k70
4231a96L63m4J3j95p1K26J35l96L68l95m2K72J5J07q8m4J50M2k21j68K38k37K54
4254H6J20j69Q7r3r9L3K98l34J17K5K1K12k49l15k4mL92p3j90J37R5K59k24J09
4278B17k68r2R6Q8Q5R6j40k32O5n4O5M3J17p2k36J09L35l61P2K7K3J0J5J56j27
$$ plain form
4303 37 -291 254 49 -6 -48 -217 -59 101 0 96 -151 171 -20 70 0 -6 -11 -132 -62 97 -65 11 -6 -188
4327 -188 -106 -286 162 -37 10 -84 -199 65 193 -70 -18 29 92 83 -169 -56 -156 262 -244 159 -303 -14 -233
4350 -233 -121 -16 218 5 -128 98 -193 188 -132 58 -4 256 -180 -5 -41 43 212 -304 -76 -215 -147
4371 -147 117 -28 -191 152 -43 132 144 -136 170 70 95 -16 -139 61 150 43 -50 -308 -277 367 158 122
4393 122 -60 -40 207 316 14 -266 120 24 -51 153 191 -165 -14 73 -357 -67 -212 180 -182 -5 178 -73
4415 -73 106 77 4 -229 -32 86 -81 -38 70 232 -121 -63 47 -47 60 -79 176 57 72 -45 -239 -113
4437 -113 -48 -33 56 48 133 149 79 0 -81 30 -183 126 10 31 -263 3 -92 41 -39 -118 -22 58 300 173 148 37
4463 37 -40 144 -20 -67 -155 -28 25 131 81 -10 151 131 -388 -17 157 159 266 167 -17 -126 -51 -53 72 -76 -126
$$ packed form
4303C7l28N45k05n5m2j69J58J60j01R6k47L22j91R0p0onj21P0J59j62P6j7j82
4327a88Q2j80M48j99M7r4j15K64J28k63N2M7O3rk52J13j00M18n06M03m62K89k19
4350b33J12J05K34k13j33K26k91L81l20J90o2K60m36J75l6Q4J69n16K28j39O8
4371a47K64j45j63L43j95J75J2k80L06j00K5j11j23K00Q9j07r3k58L1O44k09l6
4393A22j82K0K47J09l02k80L86r6p5K04L8l56J51Q7m30K90j45L92l62J77J83k51
4415g3J79k9p3k33J97J18j67M3J08J62l53N8J10r4J07j39K55j19J5j17j94J26
4437a13O5J5Q9qQ5J6p0p9q1J11k13L09j16K1k94K66r5J33q0p9R6Q0K42j27k5j11
4463C7p7J84j64m7q8J27N3J06n0r1J61k0n19L71J74KJ07r9j84j09P5kJ25j48n0
$$ plain form
4488 -126 -46 28 157 55 261 -75 -224 -186 -112 157 -154 -251 -164 301 -72 173 -12 -78 -206 -172 -39 102 163
4511 163 303 -27 414 17 117 400 -83 -95 260 93 -92 71 41 -23 -3 66 -52 34 132 258 183 94 79
4534 79 -254 -312 -31 -53 -322 59 46 -69 -75 184 95 116 -11 -71 -188 4 88 123 439 -83 -133 -53 289 124
4558 124 198 134 -90 -70 -44 51 91 24 168 -221 97 108 187 132 88 227 -203 -116 138 -50 -174 -231 -54 182
4582 182 -147 -40 -262 -2 79 193 -213 -117 -21 -84 -148 -15 -151 -23 94 216 -82 126 206 92 227 -65
4604 -65 40 -306 -14 78 -277 23 -23 1 0 120 -58 215 74 -17 -177 86 20 31 5 0 77 -7 291 -86 -10
4629 -10 122 -160 -130 -354 38 -105 -73 -39 167 35 -54 217 137 173 -41 -281 373 -41 -224 -326 -106 194
4651 194 288 -167 -223 -91 48 52 -281 41 -127 -69 1 -68 97 -145 28 -5 -239 25 -6 -53 151 -112 85
$$ packed form
4488a26Q0P4J29j02K06l36j49L8P4K69l11r7Q7M65l73K45j85o6j28L4J33J41O1
4511A63J40l30M41l97J00K83m83j2L55j67j85J63l0o4K0O9j18Q6R8J26p5q9j5
4534G9l33n8K81k2k69L81j3j15oK59q9K1j27o0j17J92Q4L5L16n22n0Q0L42j65
4558A24P4o4k24K0K6R5M0o7J44l89L18J1P9n5m4J39m30Q7K54j88j24n7J77K36
4582A82l29J07k22K60Q1J14m06R6R6o3o4J33j36J28J17J22k98K08Q0j14J35k92
4604f5J05l46K92R2l55L00m6K4jJ20j78K73j41r1j60K63o6J1k6nP7q4K98l77P6
4629a0J32k82L0k24L92j43L2L4K06j32q9K71q0L6k14k40O54m14j83j02K20L00
4651A94R4m55n6J32J39Ml33L22j68N8P0o9J65k42J73l3k34K64l1m7K04k63J97
$$ plain form
4674 85 -88 121 172 -55 101 41 -316 -37 -49 -215 48 270 -78 -92 40 41 -119 -99 152 41 135 59 -114
4697 -114 -53 -91 -116 -91 -331 31 -13 -25 30 181 160 -33 95 170 -65 -79 -21 -70 118 -210 -97 -92 113 -61 -14
4722 -14 -8 113 -220 -39 142 34 368 74 163 154 122 -272 99 -305 2 101 37 -22 -58 133 18 294 109 52
4746 52 -9 -1 -68 -49 -162 -49 5 -94 -57 -49 -21 -80 177 -318 -292 60 -17 152 59 -177 148 157 -21 -91 1 47 112
4773 112 78 17 120 -261 -120 -111 72 39 162 77 34 237 177 68 -59 -251 -48 146 41 -165 -296 -23 -156
4796 -156 74 -9 -233 -64 -126 -165 -272 24 -41 -153 -19 -220 -38 54 -117 251 39 251 -138 102 -13 121
4818 121 222 -158 184 -191 51 -168 3 185 4 -174 -118 -19 -142 -40 -205 -248 216 -78 -25 162 -104
4839 -104 3 148 -18 -88 -177 -67 -157 175 121 -46 129 29 179 -5 267 85 199 486 -36 33 109 9
$$ packed form
4674H5j73K09N1k27J56o0l57K79j2j66K63K22l48j4J32Jj60K0K51j11R4p6j73
4697a14O1l8k5K5k40L62m4j2N5J51k1j93J28P5k35j4N8m9J88l28J13NK05j74M7
4722a4OJ21l33J81J81j08L34k94Q9rl2l94L71m04L07R9o4n9l6J91j15K76j85n7
4746E2o1Qo7J9j13J13N4r9L7QK8n9K57m95K6L52p7J69r3k36L25Rj78p0R2M6O5
4773A12l4o1J03l81J41RJ83l3J23q5m3K03o0j09j27j92K03J94j05k06j31K73j33
4796a56K30q3k24J69o2l9j07K96o5j12J34k01J82R2j71L68k12K12l89K40j15J34
4818A21J01l80L42l75K42k19J71J82j81j78N6R9j23J02j65m3M64k94N3J87k66
4839a04J07J45j66p0q9J10r0L32n4j67J75j00J50j84K72j82J14K87n22O9P6j00
$$ plain form
4861 9 -61 67 -56 115 235 205 -79 95 -42 257 -2 146 13 137 151 130 76 12 -102 -1 -469 -117 2
4884 2 73 -129 -141 -96 29 100 -30 -44 165 -275 -18 115 99 -105 -160 85 -27 234 178 95 96 -55 28 -19 151
4909 151 15 74 -135 -3 54 238 246 32 56 -275 131 -43 -233 -130 178 47 96 -212 119 121 -145 76 124
4932 124 -83 153 78 78 61 29 -10 -172 56 179 73 -139 -241 146 53 -72 224 206 -256 74 -93 -27 -159
4955 -159 99 -144 -86 -158 51 -11 14 334 -122 177 127 99 -216 -105 -50 82 7 -125 -363 -151 -173 -3 -199
4978 -199 140 307 -124 -283 -35 131 156 -182 -30 19 81 -309 -70 190 -18 -75 -129 -93 147 -46 -10 39 -23
5001 -23 55 -71 -307 -64 248 47 -4 -129 -83 -16 81 -24 -105 105 -76 -86 57 -52 -105 -204 1 -178 25
5024 25 -22 -19 -5 -38 73 123 127 152 78 75 -115 108 -68 -176 -258 -264 80 -196 46 -57 -27 213 200 88 189 220
$$ packed form
4861Ip0J28j23J71J20l0k84J74j37K99k59J48j33J24J4k1n4o4j14J01m68L52J19
4884BP1k02j2M5J25P1j30j4K09m40K57J33j6k04n5K45j12K61n6q3Jj51Q3m7J70
4909A51j36N9k09J32N7J84Qk14K4l31M06j74j90J03L08j31M9l08L31Kk66K21M8
4932A24k07K36p5%j7l2l9j62K28J23j06k12j02L87r3j25K96j8m62L30j67O6j32
4955a59K58k43N8p2K09o2K5L20m56K99n0k8l15J11N5J32p5j32k38K12k2J70j96
4978a99L39J67m31j59K48J66K5l38J52M9O2l90K39K60k08n7n4L6K40j93L6M9o2
5001b3P8j26k36K43L12k01n1j25M6O7R7j05q1K10j81j0J43j09n3r9K05j79K03
5024B5m7LJ4l3J11N0MK5p4lj90K23j76j08q2oL44k76K42j03L0K40j3j12J01L1
$$ plain form
5050 220 19 8 -127 -1 49 -132 136 -121 -38 236 -231 -14 83 240 121 246 35 147 94 -174 -23 -177
5072 -177 175 -29 -159 45 -349 88 282 254 -257 172 291 -25 -46 -132 236 -33 -250 141 -29 123 -3
5093 -3 -18 32 -64 6 0 153 -98 162 205 40 267 -158 -2 -166 29 -55 69 150 304 -58 -111 2 229 83
5117 83 -170 -84 -255 274 207 7 100 -429 144 16 -12 20 195 394 213 214 -173 364 -152 -266 295 -77 149
5140 149 319 86 351 -12 -11 -35 11 -104 -134 -54 -102 51 50 17 -104 -81 5 -139 -77 -175 221 46 -156 -110 -101 7
5166 7 219 -116 -110 -107 15 56 -57 -33 31 121 -63 23 -36 -22 50 -15 -88 306 67 155 -70 -217 -122 -61 -115 68 -25
5193 -25 -191 76 -316 -35 -146 5 -24 68 7 109 136 -91 242 -79 -208 127 75 -7 -116 -274 -272 -258 -83
5216 -83 98 2 75 -171 335 117 227 48 -29 105 17 -6 -74 -24 -229 12 -16 101 -66 -117 100 91 22 -16 -180
$$ packed form
5050B20k01j1j35J26N0j81K68k57Q3K74m67K17R7J57j19J25k11J12n3k68J51j54
5072a77L52k04j30K04l94M37J94k8n11M29J19l16k1q6L68k69k17L91j70J52j26
5093cj5N0r6P0oJ53k51K60M3j65K27m25J56j64J95q4J24Q1J54l62n3J13K27j46
5117H3k53Q6j71N29o7k00R3n29N73j28k8L2J75J99j81Jl87N37n16j14N61l72K26
5140A49J70k33K65l63Jk4M6j15l0Q0m8J53jl3j21K3Q6j44O2r8L96j75k02M6RJ08
5166GK12l35OLJ22M1j13K4O4R0j84Q6n9J4P2o5p3L94k39Q8k25j47R5O1n4J83r3
5193b5j66K67l92K81j11J51k9R2o1J02K7k27L33l21j29L35n2q2j09j58KJ4J75
5216h3J81r6P3k46N06k18J10j79p7J34q8k3o8N0k05K41k8J17j67n1K17ro9l8j64
$$ plain form
5241 -180 -158 -282 -13 132 -18 50 113 137 13 161 -33 -149 62 54 -210 -5 -177 68 -102 51 -61 37
5263 37 118 -56 159 -81 247 59 -292 131 311 -73 -149 -71 143 122 -178 202 -70 80 113 92 110 51 -165
5286 -165 279 85 -110 86 220 -5 -77 -28 79 -41 -64 -25 -261 262 -40 57 222 65 107 -81 -65 74
5308 74 -41 -13 -84 102 -232 -179 -60 148 31 -70 158 143 149 339 163 243 -54 200 29 39 40 -157 23 41
5332 41 63 -204 276 22 91 -112 -32 -77 -104 5 235 -143 -173 -313 -44 32 105 -177 75 129 133 229 -84 -299
5356 -299 -149 -150 -91 -58 48 30 -69 -148 183 -96 -13 20 -36 151 26 140 55 -47 -194 20 9 -92 -37 -147
5380 -147 -105 151 -184 -16 73 -372 -201 -14 132 -312 174 145 133 239 -1 227 88 117 8 69 -32 58
5402 58 -137 2 127 15 -146 242 -51 199 261 -88 -118 -158 7 -198 217 -68 125 42 146 40 -369 -117
$$ packed form
5241a80K2j24K69J45j50O8O3K4j24J48j94j16K11qk64K05j72K45j70J53j12R8
5263C7Q1j74K15k40L28j88l51M23J80l84p6P8K14k1l00L80k72J50L3k1J8n9k16
5286a65M44j94j95J96J34k25p2M9J07j20k3L9k36N23l02R7J65j57M2j88J6J39
5308G4j15K8p1J86l34N3J19K08j17j01K28j5OJ90j76Q0k97K54j71J0Jj97J80J8
5332D1K2k67M80k54O9k03Q0m5k7J09K30l78l0j40K69P6P3k82K52N4MR6l13k15
5356b99J50jN9L3J06j8r9p9L31k79Q3L3n6J87j25J14q5j02j47K14j1j01N5j10
5380a47M2K56l35J68Q9m45J71J87J46m44M86k9j2J06k40K28j39K9j09O1j01R0
5402E8j95J39J25j12j61L88k93K50O2l49l0m0J65k05M15k85J93q3J04j06m09K52
$$ plain form
5424 -117 39 -197 34 154 159 67 166 93 128 -35 -44 -51 72 140 5 -36 307 9 -253 -280 -11 110 191 -236 -68
5449 -68 204 -60 46 37 -233 -172 -170 0 33 -87 -50 197 11 -57 214 243 153 -105 53 -142 118 318 -58 55
5473 55 69 -343 -113 214 55 -53 -208 167 0 41 -90 88 -3 213 34 -40 63 -34 109 208 450 42
5495 42 172 -229 -49 26 -202 34 208 -78 66 306 122 224 35 -21 -97 -2 201 -139 52 314 46 7
5517 7 10 -257 43 -53 225 233 16 142 -127 -219 -200 78 55 -83 38 3 -260 -19 -198 -22 61 114 -178 110
5541 110 18 171 -29 -7 110 124 227 -262 76 -47 12 -106 88 -125 14 -282 -191 13 79 -133 -19 -49
5563 -49 186 403 142 -37 -6 176 175 -32 98 -57 -173 -88 -35 -385 153 224 175 -71 -258 52 -170 -2 147
5586 147 -8 -307 -103 -179 -163 294 -13 -8 -11 -136 78 -80 -42 -241 233 -41 34 81 -45 18 -184 311 53
$$ packed form
5424a17J56k36K31J20Nr2R9p3L5j63rpJ23O8j35m1L43k98k62k7K69J21Q1m27J68
5449f8K72k64J06rk70O1KJ70L3j20L7K47j86o8K71K9r0k58J58j95K60K00l76J13
5473E5J4m12K30L27j59j08j55L75j67M1j31J78r1K16j79p4J03r7J43R9K42m08
5495D2J30m01J80P5k28K36J74k86J44K40j84J02j89n6p6R5K03l40J91K62k68l9
5517GLk67L00r6K78Qk17J26k69r2J9K78k3j38J21l5k63K41j79J76Q3N3k92K88
5541A10r2J53k00K2J17J4J03m89L38j23N9j18J94k13J39k96R1K04O6k12J14l0
5563d9K35K17k61j79L1J82jk07J30j55j16Q5N3l50N38P1m9k46j87L10k22J68J49
5586A47j55k99K04p6J6M57l07Nlj25K14j58L8j99M74k74P5M7j26O3k02M95k58
$$ plain form
5609 53 -57 -33 -177 -178 -39 22 2 142 -85 -313 -161 -67 -37 -47 54 -54 30 -447 130 40 26 -57 42 51 -48 -168
5635 -168 18 52 2 -228 124 -168 -131 -39 -91 -56 -120 164 -54 19 -144 -259 -55 -111 190 128 -5 3 -51 -40 226
5660 226 81 138 130 123 -46 -285 -126 63 276 -230 -264 62 -178 5 -167 -209 115 9 273 -14 3 -10 -26
5683 -26 -186 -307 78 -18 -159 -79 -117 77 -153 57 -330 -43 57 -64 356 392 -184 -210 88 -157 312 6
5705 6 75 108 -90 84 109 -16 127 28 -193 -62 52 -202 23 -14 -92 234 147 90 -1 140 -177 150 174 -103
5729 -103 219 -411 279 130 -40 -112 -85 164 20 61 -230 120 -158 99 382 86 -38 98 -222 18 27 175
5751 175 -39 -25 149 -265 115 175 232 159 -115 -172 -67 70 117 -87 -186 -82 -213 34 141 -135 -119 -39 -193
5774 -193 48 221 -71 54 83 71 -148 -126 197 156 163 -107 -337 -139 -212 16 119 332 -136 -36 -346 -47
$$ packed form
5609E3j10K4j44jJ39O1k0J40k27k28J52R4L0j0J01j08Q4m77N77r0j4q3R9Rr9j20
5635a68J86L4n0k30L52k92L7R2n2L5o4K84k18P3j63j15K04n6L01o2j33Qn4J1K66
5660B26j45N7qpj69k39J59J89K13n06l4L26k40J83j72m2L24j06K64k87J7j3j6
5683b6j60j21L85r6j41Q0l8J94k30K10l87K87J00j21M20L6n76k6K98k45M69l06
5705FO9L3j98J74K5j25J43r9k21J31J14k54K25l7p8L26q7n7r1J41l17L27K4k77
5729a03L22o30O90j49j70p2K7K49j44M1k91L50k78K57K83k96j24J36l20K40RJ48
5751A75k14J4J74m14L80O0N7p3k74n7J05J37M7k04r9J04j31K47J07k76J6Q0j54
5774a93K41J73k92J25K9j2k19K2L23m1Pk70k30J98p3K28J03K13m68J00l10K99
$$ plain form
5796 -47 -193 -79 -38 56 -164 -86 -86 -69 -238 -157 239 -97 49 228 67 74 -117 -86 370 -158 -111 109 -146 -247
5820 -247 3 173 -18 205 -118 -67 -83 -251 31 73 -173 18 63 -35 133 96 155 140 94 211 -88 -229 -135
5843 -135 4 239 129 124 66 -68 33 -35 22 -24 170 26 65 -424 109 1 -55 22 115 -102 253 144 147 -72
5867 -72 -22 -220 117 -63 121 80 208 -221 -186 -259 82 -72 -173 201 -149 -260 138 151 70 -196 -291 -20 215
5890 215 -109 -9 -169 -209 135 -213 49 -253 210 -183 31 123 39 276 -85 -207 -90 -98 -26 137 7 -26
5912 -26 -39 20 19 -17 16 341 173 -122 -3 139 -144 -81 12 -17 -35 57 -13 -183 27 -2 -25 90 -87 141 247
5937 247 -133 172 -286 -13 224 -208 45 34 15 152 -65 -202 -46 120 -25 12 -367 -148 -80 -222 19
5958 19 -186 -219 -90 299 -40 -67 -44 150 -82 -69 -103 -31 -3 -371 27 108 -47 131 90 82 -47 -54 107 48 39 29
$$ packed form
5796d7j46J14M1R4k20P8%J7j69Q1L96l36J46J79j61Pj91L1M56n28M7K20k55j01
5820b47K50J70j91K23l23N1j6j68K82M2k46J91M5r8J68l7N9j5m6J17k99j41R4
5843a35J39K35j10nn8j34J01o8N7m6J94j44L9m89N33j08n6P7R3k17L55j09Lk19
5867g2N0j98L37j80J84m1J28m29L5p3L41j54j01L74l50j11L98J3q1k66r5K71K35
5890B15l24J00j60m0L44l48K62l02M63l93K14R2q4K37l61j22J17qP2J63j30l3
5912b6j3N9jl6L3L25j68k95J19J42k83O3R3k9j8R2p0j70K10k9k3J15j77K28J06
5937B47l80L05m58K73K37m32K53j1j9J37k17j37J56J66j45L7l79K19O8j42K41
5958A9k05l3J29L89l39k7K3J94k32J3l4P2K8l68L98Q1j55J78m1qj29pJ61n9rj0
$$ plain form
5984 29 -51 9 308 80 -105 -69 0 171 18 66 193 -228 65 33 -115 34 -24 162 181 -89 5 283 -264
6007 -264 1 170 305 9 -76 -203 -211 2 -228 128 -21 -99 -117 75 182 27 109 -49 -106 193 9 -11 128
6030 128 -106 146 28 -150 -460 2 124 -69 168 -20 215 19 -168 240 -246 95 94 -114 -89 41 47 -148
6052 -148 59 120 178 25 30 -55 144 -104 -20 123 63 134 22 20 141 -131 45 176 106 202 4 114 -228 -136
6076 -136 215 120 -69 77 69 356 -48 -52 41 -65 -9 -201 -122 -134 245 32 -55 -150 108 -75 21 -3 101 -304
6100 -304 127 87 -304 103 165 178 -39 270 -125 399 -281 -102 301 -72 -51 76 -120 -16 -45 -120 -32 -128 -236
6123 -236 194 -65 -219 103 -32 95 -5 -17 396 190 -2 -127 -165 -81 105 89 -176 -164 24 -24 174 52
6145 52 -184 -133 117 111 138 -141 -70 -37 166 27 30 -131 -303 -226 77 -110 55 -140 -148 -53 -48 180 125 195 125 -42
$$ packed form
5984B9q0O0K99k28j85L6O9J71j53M8J27m21K93l2j48J49n8J86J9k70R4K78n47
6007b64K65J69J35k96q5j27qK13k30L56j49p8j8J92J07j55Q2j58n7K99j84k0J39
6030A28k34K52j18j78l10M62J22j93K37j88K35j96j87M08m86L41jk08K5J30Oj95
6052a48K07O1N8j53Nq5J99k48Q4J43o0P1j12kJ21k72J76J31p0R6j98J10l42R2
6076a36L51r5j89J46qK87m04mR3j06N6j92P9j2L79k13q7r5K58j83R6k4J04m05
6100c04M31m0l91M07O2J3k17L09l95N24o80J79M03l73K1J27j96J04k9p5Q8r6j08
6123b36M30k59j54L22j35J27j00j2M13k06j92j25l8Q4J86j6k65J2J88m8J98j22
6145E2k36N1K50oK7k79P1L3K03j39Lj61j72P7L03j87J65j95qR5NK28n5P0p0j67
$$ plain form
6171 -42 44 -33 -263 144 299 -223 193 55 -30 127 -90 -191 210 -217 118 150 -63 -86 -95 23 -59 -197 108
6194 108 -78 144 163 -4 -174 33 -58 65 17 -155 163 -19 -15 -107 -175 -82 -12 75 100 -9 -169 139 -100 -169
6218 -169 38 32 13 51 -63 -65 142 -184 -249 -86 183 353 -36 -223 -24 -68 98 -43 58 206 -241 -104 -138
6241 -138 67 -70 -19 -138 -43 162 80 103 -96 69 34 254 -194 126 -128 122 -203 -75 310 11 68 -98
6263 -98 -248 -99 201 105 -3 169 -1 88 -3 -31 -193 100 -21 -62 183 190 -94 64 47 -128 241 27 -143
6286 -143 149 55 70 -59 188 -232 -27 -179 -198 -75 -173 -22 86 213 325 -60 45 58 -290 -165 10 -78
6308 -78 -73 -194 -253 -17 113 -108 -58 31 23 -80 -84 71 -27 -179 -199 -7 -27 143 109 -76 59 -81 -312 70 149
6333 149 79 -138 -78 -52 92 -17 83 59 -72 -8 57 67 -38 80 -162 -13 119 176 -58 393 -147 141 -138
$$ packed form
6171d2Q6p7k30M07J55n22M16j38q5J57k17j01M01m27L35L2k13k3rJ18q2j38L05
6194A08j86K22J9j67j70K07r1J23m8j72L18j82Mr2o8R3P0Q7K5j09j60L08k39o9
6218a69K07oj9L8j14kK07l26o5J63K69J70l89j87J99m4J66j41J01J48m47J37l4
6241a38K05j37N1j19R5K05q2K3j99J65l5K20m48L20k54K50l25J28L85k99N7j66
6263i8j50J49L00r6j08J72j70Q9r1k8j62K93j21m1K45Pk84J58j7j75L69k14j70
6286a43K92r4J5j29K47m20K05j52j9J23r8J51J08J27J12l85J05J3l48J25J75q8
6308g8Nj21n9K36J30k21N0Q9qj03mJ55r8j52k0J92k0J70l4j85J35j40k31L82P9
6333A49p0k17O0K6J44j09J00k4j31O4O5J0j05J18k42J49J32N7k34M51n40K88k79
$$ plain form
6356 -138 -208 -28 97 192 -48 181 -118 -41 264 -62 -1 -95 101 -68 -2 90 -79 120 84 -198 213 -25 194
6379 194 -97 -278 63 -16 97 163 103 -64 -11 -24 14 -81 66 -182 -134 91 -130 -110 -89 109 171 12 52 157
6403 157 -192 -107 -20 -36 -92 395 195 58 165 310 -38 -46 148 -345 282 -195 -215 24 36 26 -387 -215 -195
6426 -195 140 -136 -92 88 -12 83 62 257 55 -155 155 -165 125 -25 84 153 146 65 54 -189 -72 36 15
6449 15 2 85 83 -104 187 -64 -123 -38 73 -111 -15 -33 267 28 138 21 106 260 -86 -158 -23 -182 161 48
6473 48 -106 95 32 98 -247 12 147 -58 -329 97 -73 -194 109 184 327 -132 26 -134 -80 -12 134 -42
6495 -42 0 30 93 -61 -162 -122 23 -166 27 -208 -183 197 -196 52 -280 -84 176 160 68 147 436 147 453
6518 453 -333 58 -128 280 184 -76 -41 286 -561 26 72 -256 129 234 -147 -121 63 -342 -143 -41 5 -46
$$ packed form
6356a38p0J80J25R5k40K29k99P7L05l26O1r4J96j69O6R2j69J99l6k82M11k38K19
6379A94k91j81L41p9J13O6o0j67N3j3L8r5J47k48M8K25k21K0K1J98O2j59M0J05
6403A57l49Q5Q7j6n6M87k00j37J07J45l48qJ94m93O27m77k0K39J2j0m13J72K0
6426a95L35k76M4J80j00R5k1J95k02k10L10l20K90j50J09O9pq1j1k43J17J08k1
6449A5j3Q3kj87K91k51n9Q5J11j84R6j8L00k39J10j17Q5J54l46p2J35j59L43j13
6473D8j54K01o3O6l45K59J35k05k71M26j70j21L03P5J43m59J58j60N4O8J46j76
6495d2M2L0O3j54j01M0J45j89J93k35K5L80l93K48l32J96K60j6r2P9K89k89L06
6518D53p86L91j86M08r6k60L5L27q47N87M6l28L85J05l81K6J84m05J99J02M6n1
$$ plain form
6540 -46 197 -5 -77 -174 237 35 35 394 -66 63 -232 -26 -123 116 -87 7 -58 -140 65 86 4 -241 -52 64
6564 64 123 174 -37 106 -164 240 -174 -106 61 104 58 -64 -126 114 315 -137 346 -5 -111 96 -256 -172 122
6587 122 -119 66 0 -127 56 -42 -230 208 -133 164 -22 -23 137 -48 122 -129 -186 -74 133 60 -51 -170
6609 -170 127 -91 -221 38 -177 48 83 -43 283 -282 -19 -105 -73 90 -254 -311 55 226 29 -129 62
6630 62 -62 -123 146 -23 292 219 -80 -252 -67 -95 -123 -245 50 -157 -221 -189 55 140 153 -107 -179 -89 -303 -104
6654 -104 -48 -140 4 -218 -133 -54 293 131 25 -49 74 280 -101 -254 105 -273 -28 146 100 93 -123 -56 123
6677 123 71 -209 219 79 22 36 118 40 78 -75 217 227 26 -294 -7 164 -165 127 2 30 -267 29 161
6700 161 104 25 -142 132 356 97 -121 -42 -262 -64 83 -26 225 -194 -94 52 -293 -74 114 -259 139
$$ packed form
6540d6K43k02p2r7M11k02%L59m60J29k95K06r7K39k03R4o5q2K05K1q2k45J89J16
6564F4N9N1k11J43k70M04m14O8J67M3m6j22o2K40K01m52M83l51j06K07l52Q4K94
6587A22k41J85o6j27J83r8j88M38l41K97j86jJ60j85J70k51n7J12K07p3j11j19
6609a70K97k18j30K59k15K25L5j26L26n65K63q6L2J63l44n7L66J71j97j58J91
6630F2j24o1K69j69L15p3k99j72J85k8k8j22K95k07o4L2K44Q5J3k60p2R0k14J99
6654a04N6r2J44k22Q5P9L47j62j06p4J23K06l81j53L59l78K45J74m6pk16O7J79
6677A23n2k80M28j40n7J4Q2p8L8j53K92J0k01l20K87J71l29K92j25K8k97K96J32
6700A61n7p9j67K74K24k59k18P9k20J98J47j09K51m19J00J46l45K19J88l73L98
$$ plain form
6721 139 -257 -153 -113 -11 71 24 46 21 -15 -76 45 -284 -22 -175 215 0 -159 -29 69 -52 153 35 11
6744 11 -91 9 103 9 42 70 119 133 -102 -18 185 -179 27 -73 -158 341 274 -232 217 -162 -56 84 10 126
6768 126 72 75 -101 -287 -93 188 -158 239 -11 -32 208 126 -110 -212 -178 100 195 218 13 184 141 269 13
6791 13 145 -18 -270 261 21 86 -49 8 -230 416 -182 -326 86 -193 -166 -127 -35 192 151 315 -130 -34 38
6814 38 12 51 32 -257 -78 9 -274 -18 222 -127 160 147 29 185 -107 178 -124 115 -14 2 162 -7
6836 -7 55 121 168 85 -93 243 210 -59 13 -46 -34 16 142 -109 -256 233 32 168 -54 269 116 -212 11 85
6860 85 262 -403 101 -97 22 142 -191 -29 36 32 -94 31 49 -145 -62 -53 97 -148 -148 -57 -61 125 -28 58 -190
6885 -190 -166 174 -9 171 94 -316 -112 135 -53 -61 119 202 -57 76 -172 -5 -25 132 23 344 -5 -227
$$ packed form
6721A39l96J04M0J02Q2m7K2k5l6o1J21l29K62j53L90k15j59J30R8j21K05j18k4
6744A1j02J00R4r4L3K8M9J4k35Q4K03l64K06j00q5M99o7n06M49l79J06J40p4J16
6768A26n4Lj76j86J94K81l46L97k50k1K40q2k36j02L4K78R5K3k05J71m3J28k56
6791A3J32j63k52N31k40O5j35N7k38O46n98j44M12k79K7L9R2K27m1J64m45R6P2
6814C8k6L9j9k89J79Q7k83K56K40l49K87j3j18J56k92K85l02K39j29J6J60j69
6836gO2O6M7q3j78L36l3k69P2n9J2N0J26k51j47M89k01J36k22L23j53l28K23P4
6860H5J77o65N04j98J19J20l33J62O5mj26J25J8j94Q3RJ50k45%R1mJ86j53Q6k48
6885a90K4L40j83J80p7m10K04K47j88qJ80Q3k59J33k48J67k0J57j09L21l49k22
$$ plain form
6907 -227 298 -91 178 149 -96 -274 103 -131 109 18 156 -44 -80 85 144 156 -39 -113 -56 26 5 -145 -26
6930 -26 -76 7 -66 -116 -164 20 97 44 -203 -49 -62 -18 -315 -16 31 -138 183 -36 87 -84 -290 -29 139 52
6954 52 -6 54 81 -12 61 -24 44 48 -159 -12 -71 50 69 -170 105 -80 -284 14 -11 21 -144 91 84 -464 80
6979 80 -72 -188 -162 158 260 -115 287 -228 -136 -247 -102 -7 -31 29 76 102 2 88 -236 65 121 183 172 221
7003 221 149 173 112 -45 -226 -13 -76 21 66 95 187 115 -235 -153 -109 -213 27 -67 288 -261 -89 -34 22 -208 139
7028 139 -43 31 17 -121 188 257 -161 77 90 -139 -9 -178 75 70 -63 -170 -2 -47 -152 -103 -87 -190 -57
7051 -57 -84 151 38 61 529 211 136 22 6 -120 -1 -127 -125 -23 45 -32 -23 62 41 -134 -153 103 -95 12 21
7076 21 83 -200 -149 -123 -146 9 -82 27 -98 -220 -21 1 190 282 5 -107 147 129 -117 70 46 106 9 -19
$$ packed form
6907b27N25l89K69k9k45j78L77k34K40r1J38k00l6J65N9J2j95p4N7Q2k1j50J19
6930b6n0Q3p3n0m8J84P7n3k47J54j3M4k97K99M7j69L21k19J23j71k06K61J68q7
6954E2n8O0K7r3P3q5O8Mk07J47n9J21J9k39K75j85k04K98k5L2j65K35pn48N44
6979H0j52j16K6L20J02l75M02n15R2j11J45R5k4O0M7K6j00Q6l24L01N6O2j1M9
7003B21p2K4o1j57j81K13o3R7M5K9R2p2l50Q2M4j04K40r4L55n49J72N5N6k30L47
7028A39j82P4j4j38L09O9m18K38J3k29J30j69K53nj33j07J68m5j05M9J6j03J33
7051e7k7K35j13K3M68l18p5j14j6j26J19j26KJ02O8p7RQ5k1j75j9K56j98J07R
7076B1O2k83N1K6k3J55r1J09j25j22J99K2J89R2k77j12K54j8k46J87k4O0r7k8
$$ plain form
7100 -19 103 -213 -279 -267 -30 41 76 92 -85 69 -66 174 -126 -180 17 -44 -2 20 -196 155 66 22 -36 -283
7124 -283 -156 119 -226 15 -219 -143 -79 -85 154 -9 104 -32 -165 -67 145 61 -257 100 -120 328 -279 -207
7146 -207 27 145 263 -18 -263 82 -89 64 -239 -131 -171 -263 10 -175 -41 -31 76 273 182 -75 28
7167 28 -1 -216 -116 -129 116 40 225 -193 12 -39 -18 -115 -121 154 24 76 62 53 -76 0 -218 -146 -88 15 118
7192 118 85 105 -80 -116 -38 -19 97 99 7 54 136 -166 118 -109 75 211 319 -382 -248 -186 13 53 -462 -207
7216 -207 68 -221 24 93 118 206 115 53 8 -185 -53 158 -170 -421 -175 -167 -252 14 21 98 -84 -27 -27 96 -116
7241 -116 51 122 -94 -261 192 -34 -117 -85 12 -276 183 -125 -82 63 212 55 -80 -196 -67 -12 40 73 -18
7264 -18 -24 145 -151 -157 -19 22 -291 -66 -66 55 225 38 13 155 41 13 -109 -296 85 -174 -321 67 126 159
$$ packed form
7100a9J22l16o6J2K37P1L5J6j77J54j35K40l00n4J97o1M2K2k16L51q9m4n8k47
7124b83J27K75l45K41k34P6O4oK39j63J13j36j33R8K12q4l18L57k20M48o07P2
7146b07K34J18J18k81k45L45j71J53l03J08m0r2K73j85J34J0J07J97r1k57J03
7167B8k9k15J00j3K45p6J85m18K05n1K1r7oK75j30N2j4rj29P6k18P2N8J03J03
7192A18l3K0j85l6P8J9J16Kr2M7Q2l02K84k27J84J36J08p01J34O2J99M0n15K55
7216b07K75k89K45O9K5Q8r1o2m5j93J32K11l28k51K46Qq5K66PP7j82N7%J23k12
7241a16J67P1k16j67M53k26q3L2R7k88M59l08M3J45J49j57j35j16J29N5N2L3r1
7264a8oJ69k96oJ38M1l13K25%J21J70j87k5J42j14k8j22j87L81k59j47L88N9L3
$$ plain form
7288 159 60 -88 -81 59 -11 128 131 -94 7 14 -73 -27 -189 -195 -97 15 22 167 -158 -193 -141 -195 -99 -79 169 -78 186
7315 186 55 81 13 75 -90 -89 -64 182 112 -8 -53 224 -29 -169 27 178 -241 -28 72 -21 211 101 -2
7338 -2 -21 -4 -232 340 292 109 100 79 157 43 -178 253 98 -101 -197 16 -285 -15 -91 11 -140 -134 31 9 -92
7363 -92 -26 23 93 51 135 159 -4 -183 -252 74 211 -60 104 92 162 -136 -189 189 47 93 -89 94 -177 -95
7387 -95 -283 102 107 81 132 128 -257 -56 -60 -5 194 255 3 35 50 142 82 58 -183 -120 74 -121 128 -141 -108 -94
7413 -94 326 -124 -16 -121 106 51 -169 -114 -13 -62 103 -74 -61 -99 5 -394 -34 198 132 -201 28 362
7435 362 -239 85 -269 -5 -91 -189 80 -92 144 -210 -255 -278 30 85 118 270 -50 38 19 148 75 148 -123
7458 -123 -65 410 -339 26 111 22 -95 149 -474 178 -93 233 -68 180 133 222 251 -262 19 -278 -378 -427
$$ packed form
7288A59r9j48PJ40p0J39Lk25J01Pq7M6j62oR8J12PJ45l25l5N2n4R6K0K48k47K64
7315A86j31K6o8O2j65JK5K46p0j20m5K77k53j40J96J51m19K13J00r3K32j10j03
7338bj9J7k28N72m8j83rk1P8j14k21M31j55j99r6K13l01K70p6J02j51OJ65k2j01
7363i2O6M9P0m2Q4K4j63j79o9L26J37k71J64j2P0k98n3L78j42M6j82J83k71Q2
7387i5j88L85Nk6N1ml85K01mN5J99O1k52L2J5R2o0k4k41O3J94j95K49k69L3J4
7413i4M20m50J08j05K27n5k20N5J01m9J65j77J3l8J04l99L60K32o6l33K29L34
7435C62o01L24l54K64q6r8K69j72K36l54m5k3L08N5L3J52l20Q8j9J29p3P3k71
7458a23N8M75p49L65Q5q9j17K44o23O52k71L26l01K48m7Q9K9n13K81k97j00m9
$$ plain form
7480 -427 89 48 59 -153 -28 -197 50 102 271 -85 -9 -122 -100 -60 131 254 48 -248 -144 40 -244 -357
7502 -357 97 4 -71 88 -352 141 93 189 -36 52 -175 172 237 127 -218 4 60 73 37 262 -91 -331 23
7525 23 63 -248 -129 211 201 -45 -220 -63 35 142 -339 -37 -147 -56 -286 105 243 -115 24 -135 101 -219
7547 -219 50 -198 -4 184 -104 -62 -299 14 -229 3 -123 6 -121 44 -232 282 107 47 93 159 239 -281
7569 -281 -155 304 164 56 126 -97 -2 -168 -276 -88 -84 117 -143 128 64 -299 -29 167 -9 247 41 280
7591 280 102 6 14 -93 -160 -48 -28 36 39 -309 -96 159 207 0 135 191 222 181 157 201 -35 -76 217 -156 -246
7616 -246 -85 -131 -62 38 -263 57 -22 -236 62 116 -55 -24 192 35 -122 -306 -10 -304 119 -96 -207 342
7638 342 -19 -372 -118 110 -219 -71 -85 175 -164 33 -220 26 8 4 -72 -103 -55 -229 -225 -49 73 -383 159
$$ packed form
7480d27N16m1J1k12J25j69K47N2J69l56P6j13K2M0J91J23k06k96J04J84k84j13
7502c57M54r3p5J59m40M93m8R6k25Q8k27L47O5j10l45K22N6J3l6K25l53k40L54
7525B3M0l11J19L40j0k46j75J57R8J07m81L02j10R1k30L91J38l58J39j59K36l20
7547b19K69k48J94J88k88M2k37L13k43K32j26J29j27J65k76N14j75o0M6O6Q0n20
7569b81J26M59j40j08P0k23R5j66j08J88MK01k60K71o4l63K70J96j76K56k06K39
7591B80j78r6Qj07o7J12K0O4Ll48K13K55M8k07J35N6L1m1k4M4k36m1K93l73r0
7616b46J61m6O9J00l01L20p9k14K98N4j71L1K16j57j57j84K96k94M23k15j11N49
7638C42l61l53K54K28l29J48j4K60l39J97k53K46j8mp6l1M8j74MJ76J22m56N42
$$ plain form
7661 159 145 46 -128 153 -220 147 32 -8 -26 -68 201 379 313 49 55 38 52 47 -62 23 170 -98 -73 -301 -3
7686 -3 266 8 -276 55 196 -38 -14 11 -107 55 -120 -100 41 204 147 -29 -106 -233 -63 24 -29 -185 -37
7709 -37 282 152 -85 -273 120 -24 106 53 -1 -18 -3 22 6 183 -177 341 -26 -106 -126 -98 78 296 101
7732 101 -173 -220 -19 150 156 132 -219 220 -30 -298 -17 -166 291 108 -210 -64 251 -189 -110 4 -4 39 -301
7755 -301 96 71 -185 -269 50 319 216 -129 -7 54 -97 79 105 165 219 -260 -71 -30 -39 -97 85 -7 189 -282
7779 -282 112 -148 -64 234 129 69 -58 -13 19 -51 61 -47 51 -238 -99 56 66 -166 -43 -21 89 305 13
7802 13 255 -214 70 -108 -111 -84 -83 42 177 -26 -223 -1 -77 86 144 0 -59 -21 223 -435 43 125 8 232
7826 232 21 -48 -123 -33 -282 264 78 -68 268 -102 -131 164 -251 125 5 -15 182 166 -159 -89 -134 -99 -21
$$ packed form
7661A59j4r9j74K81l73L67j15m0j8m2K69J78o6k64Oj7J4nj09Q5J47k68K5k28K98
7686cK69k58k84L31J41k34K4K5j18J62j75K0J41J63n7j76p7j27J70Q7n3j56J48
7709c7L19j30k37j88L93j44J30n3n4j7J5K5j6J77l60N18l67q0k0K8J76K18j95
7732A01k74m7K01J69Ok4l51M39k50k68K81j49M57j83l18J46L15m40P9J14qM3l40
7755c01L97k5k56q4L19K69j03l45J22O1j51J76K6O0N4m79J89M1rn8J82r2J96m71
7779b82L94k60Q4K98j05o0j27M5L2p0J12j08R8k89J39J55J0k32J23K2J10K16k92
7802A3K42m69K84j78lK7JJ25J35k03j97K22p6J63N8j44n9L8K44o58M78Q2j17K24
7826B32k11o9p5R0k49N46j86j46L36l70k9K95m15L76j20k0J97j6l25P0m5L5P8
$$ plain form
7849 -21 194 54 -49 134 -280 -2 148 107 -11 138 177 -225 175 428 296 -19 -81 36 213 67 106 -142
7871 -142 -269 139 89 -16 210 15 -119 -11 409 241 240 81 139 -32 -208 9 90 -335 -38 281 22 -357
7893 -357 -110 47 -10 -17 210 -49 -64 17 182 59 127 384 -45 284 -45 66 -127 -179 275 -42 0 18 226
7916 226 54 65 -5 22 232 -108 43 18 -90 -52 166 7 21 -354 165 -148 -123 -89 -132 10 -46 -57 -129 71
7940 71 66 48 197 -44 10 -188 -216 -81 48 -116 135 49 -262 -175 191 103 -190 316 306 -42 -31 -87 107 39
7964 39 36 -170 76 87 22 109 -49 35 -68 -142 23 113 105 -128 -51 210 -60 -260 22 -40 99 -146 -159 -38 66
7989 66 165 21 -143 -172 -161 11 232 10 167 -54 43 -70 -8 -168 -414 -56 70 -104 -107 -186 94 -13 -351
8012 -351 16 185 122 -147 227 119 86 59 209 74 192 12 -132 125 -91 -247 -188 120 -209 -192 49 -243
$$ packed form
7849b1K15j40j03J83m14K78J50m1j18J49L9m02M00K53j32l15o2J17J77j46L9k48
7871a42j27M08n0j05K26j95j34J08M20j68jj59N8j71j76K17Q1m25K97L19k59l79
7893c57K47J57n7pK27k59j5Q1J65j23O8K57m29L29l29J11j93n2M54l17M2J8K08
7916B26j72J1p0K7K10l40J51k5j08L8K18j59J4l75N19l13K5L4m3J42n6j1p2K00
7940G1nj8J49k41N4j98k8J35J29j64K51q6l11Q7L66q8k93N06j0l48J1n6J94o8
7964C9lk06K46J1o5Q7j58Q4j03p4J65R0qk33P7K61k70k00K82o2J39k45j3J21J04
7989F6R9j44j64k9J1J72K21k22J57k21R7j13O2j60k46L58J26j74lp9K80j07l38
8012c51L67J69o3k69L74j08l3k7J50j35J18j80j44K57k16j56N9L08l29J7K41k92
$$ plain form
8034 -243 291 265 121 58 49 10 127 -116 -91 -366 206 148 27 142 90 68 -204 -91 -202 -65 -84 -149 -135 -191
8058 -191 55 137 -38 -49 293 -209 -117 -88 -7 108 -70 -5 108 91 305 31 -104 323 105 -17 139 164 -97
8081 -97 -381 -40 -5 -267 -47 -161 64 -277 -4 -85 134 -77 -64 -47 90 -96 319 -147 -70 -247 260 -200
8103 -200 57 -157 -139 -203 154 -25 20 347 -211 -78 -1 -209 103 267 15 31 -207 -45 69 -79 186 40
8125 40 -115 61 -163 -11 51 80 87 -163 290 38 32 162 -16 126 24 45 139 187 13 210 152 59 388 -214
8149 -214 -61 -253 153 -23 114 168 -158 120 7 17 47 19 66 -119 46 84 186 -44 -157 21 13 46 162
8172 162 -178 101 -101 157 37 -72 104 -177 202 93 -292 58 -121 126 66 84 -62 113 11
$$ packed form
8034b43N34k6j44o3rl9J17k43K5k75N72n8j21J15n2k2k72J13j11J37j9o5J4n6
8058a91K46Q2j75j1L42n02R2K9Q1J15j78O5J13j7K14k74j35M27k18j22J56K5k61
8081i7k84L41L5k62K20j14K25l41K73q1K19k11J3J7J37j86M15m66P7j77N07m60
8103b00K57k14J8o4L57j79M5L27n58J33P7k08L12J64k52J6k38J62J14j48K65j46
8125D0j55J76k24J52O2K9Pk50M53k52oJ30j78J42j02K1R4M8j74J97n8r3L29o02
8149b14J53j92M06j76J37N4l26K78j13J0L0k8M7j85J65L8J02k30j13J78qL3J16
8172A62l40K79k02K58j20j09J76k81L79j09l85L50j79K47o0J8j46J75j02
8191A1
$$ Imaginary data points
##PAGE= N=2
##DATA TABLE= (X++(I..I)), XYDATA
$$ plain form
0 0 0 0 0 0 0 0 0 0 0 -8 8 -8 16 -16 24 -24 32 -40 48 -64 72 -88 104 -124 144 -168 199 -229 264 -303 345
31 345 -394 447 -506 572 -644 723 -810 906 -1011 1125 -1251 1386 -1536 1699 -1877 2072
47 2072 -2283 2517 -2773 3053 -3366 3710 -4095 4526 -5011 5564 -6198 6935 -7806 8851
61 8851 -10136 11758 -13878 16784 -21039 27883 -40756 73642 -352450 -566928 13246 289395
73 289395 519281 488737 353568 48843 -198932 -370298 -344184 -229384 -39056 119798
83 119798 246016 248918 174154 39567 -78615 -171800 -174487 -115603 -21974 51257 107528 118107
95 118107 90377 24484 -41086 -86312 -87022 -61385 -16983 27086 59260 60816 42508 10594 -20177
108 -20177 -39172 -35746 -23117 -7576 8714 24805 30519 23497 6766 -9000 -17778 -19874 -16636
$$ packed form
0@%%%%%%%%%qJ6j6K4l2M0m8N6p2Q8j12J36j60J92k28K68l12L67m28M93n67O48
31C45p39Q41r53J078j216J367j533J716j917K136k376K637k922L235l576L949
47B072m355M800n290N826o419P076p805Q621r537J0575j1762J3133j4741J6657
61H851j8987K1894k5636L0662l7823M8922o8639J14398m26092k14478N80174K76149
73B89395K29886l0544j35169l04725k47775j71366K6114J14800J90328J58854
83A19798J26218K902p4764j34587j18182r3185k687N8884R3629P3231N6271J0579
95A18107k7730o5893o5570m5226p10K5637M4402M4069L2174J556j8308l1914l0771
108b0177j8995L426J2629J5541J6290J6091N714p022j6731j5766q778k096L238
$$ plain form
121 -16636 -7017 5759 13509 12984 9421 4553 -1923 -8425 -10672 -7785 -2438 3687 7529 8694 7756
136 7756 3074 -2395 -5474 -4246 -1914 -630 1158 2205 2628 1664 759 -884 -2419 -3559 -3132 -1568
152 -1568 -54 877 1460 1646 525 -751 -1802 -910 -314 -561 -293 1086 1844 842 163 -473 -816 -850
170 -850 -484 -172 298 336 168 -36 -15 -173 -158 -197 -517 -731 67 677 79 127 299 -277 -479 -188 -137 -190 -221
193 -221 -248 -40 221 -64 -73 11 -78 -215 -321 437 453 -27 204 149 0 374 479 300 -1 31 383 -71 367
216 367 187 196 23 53 147 93 170 -237 -239 -62 202 -93 -150 -96 167 -57 297 -92 92 -117 -13 91 -84 233
240 233 1 440 97 -38 -139 83 205 -104 -82 215 29 126 194 160 -18 -26 -241 -146 186 -169 -169 -213 159 -231
264 -231 167 -75 -155 53 74 -149 -28 -156 -151 -2 -26 -20 59 34 128 61 -48 30 1 -30 115 45 -84 18 50 -73
$$ packed form
121a6636R619J2776P750n25l563m868o476o502k247K887N347O125L842J165r38
136G756m682n469l079J228K332J284J788J047M23r64r05j643j535j140M27J564
152a568J514R31N83J86j121j276j051Q92N96k47K68J379P58j002o79o36l43l4
170h50L66L12M70L8j68k04K1j58J5l9l20k14P98O10n98M8J72n76k02K91N1n3l1
193b21k7K08K61k85rQ4q9j37j06P58J6m80K31n5j49L74J05j79l01L2L52m54M38
216C67j80Rj73L0R4n4P7m07kJ77K64k95n7N4K63k24L54l89J84k09J04J04j75L17
240B33k32M39l43j35j01K22J22l09K2K97j86R7O8l4j78qk15R5L32l55%m4L72l90
264b31L98k42q0K08K1k23J21j28NJ49k4OP9k5R4o7j09P8k9l1J45p0j29J02L2j23
$$ plain form
290 -73 -37 -32 -87 121 -29 129 129 -118 93 -1 296 119 -285 60 33 307 99 13 69 57 -35 -82 -83 -25 -109 -186 184
317 184 -247 59 66 -198 0 36 184 -244 245 -69 -7 -106 8 -363 -160 -11 -184 45 -350 -88 -8 -45 -17
340 -17 40 -45 -200 59 -271 -205 169 -150 29 -223 49 74 -51 120 -180 -195 47 258 117 6 82 121 -234
363 -234 -202 -91 53 -141 280 32 -271 -103 -142 62 111 190 -94 -10 53 72 -41 -229 -122 234 -420 71 -16
386 -16 40 155 -47 128 -148 127 128 210 -27 -78 -95 -117 -193 111 -78 -416 -102 121 -90 -83 -154 -147 -64 102 0
411 0 22 106 -47 86 62 -37 67 39 -161 -26 -181 27 187 -119 114 -13 -34 -206 -157 -191 -121 174 -191 -184 -1
436 -1 155 61 22 54 -65 -6 -76 -182 66 66 -3 -112 -58 12 -179 -35 84 -195 89 -203 -115 145 -14 57 -4
461 -4 -327 -346 -126 -213 -49 80 122 -13 284 158 96 293 -55 162 -348 -173 17 92 36 -22 66 -37 13 -120
$$ packed form
290g3L6Nn5K08j50J58%k47K11r4K97j77m04L45k7K74k08q6N6j2r2m7jN8q4p7L70
317A84m31L06Pk64J98L6J48m28M89l14O2r9J14l71K03J49j73K29l95K62Q0l7K8
340a7N7q5j55K59l30O6L74l19J79k52K72K5j25J71l00j5K42K11j41j11P6L9l55
363b34L2J11J44j94M21k48l03J68l9K04M9P9k84Q4O3J9j13j88J07L56o54M91q7
386a6N6J15k02J75k76K75JQ2k37n1j7k2p6L04j89l38L14K23k11Pp1PQ3J66j02
411@K2Q4j53J33k4r9J04k8k00J35j55K08J60l06K33j27k1j72M9l4P0K95l65PJ83
436aJ56r4l9L2j19N9p0j06K48%o9j09N4P0j91J44J19k79K84k92Q8K60j59P1o1
461dl23j9K20q7J64J29M2j35K97j26o2J97l48K17n10J75J90P5n6n8Q8j03N0j33
$$ plain form
485 -120 128 -56 89 68 114 -199 -101 38 -114 -60 97 173 4 151 163 169 -167 -206 -25 -81 28 -137 207 -11
509 -11 -171 -90 245 22 59 -208 -144 132 56 -240 -91 -148 17 -203 -298 -91 -67 -143 -19 -116 287 27 -38 36
533 36 -316 21 56 -72 -35 101 -19 -4 353 387 -6 -84 -108 -151 231 -273 -13 98 74 236 163 19 -105 211
557 211 -155 -120 -102 60 136 -36 -116 -129 53 -139 153 -99 -25 246 -151 35 -101 44 -48 52 97 144 -57
580 -57 -106 -55 -228 190 86 80 148 4 71 128 -62 -47 201 -197 168 -152 -34 -325 55 40 -107 46 223 19
604 19 53 -197 185 -41 -24 178 -176 -139 -111 -67 213 -207 257 -76 -224 -271 -100 -59 -163 297 -163 159 125
627 125 -266 -72 -28 58 125 36 -253 -35 416 -90 -71 24 267 -162 -366 -57 -126 391 -189 -61 -61 -11 -47 -154
651 -154 62 39 68 -73 20 -49 -57 -228 37 3 315 -128 243 -38 -124 -260 238 -5 94 80 64 -52 -259 82
$$ packed form
485a20K48j84J45k1M6l13R8J39j52N4J57P6j69J47J2Ol36l9J81n6J09j65L44k18
509a1j60Q1L35k23L7k67O4K76p6k96J49n7J65k20r5K07K4p6J24r7M03k60o5P4
533C6l52L37L5j28L7J36j20J5L57L4l93p8k4m3L82n04K60J11k4J62p3j44j24L16
557B11l66L5J8J62P6j72q0j3J82j92K92k52P4K71l97J86j36J45r2J00M5M7k01
580e7m9N1j73M18j04oO8j44O7N7j90J5K48l98L65l20J18k91L80j5j47J53J77k04
604A9L4k50L82k26J7K02l54L7K8M4K80m20M64l33j48m7J71M1j04M60m60L22l4
627A25l91J94M4Q6O7q9k89K18M51n06J9R5K43m29k04L09o9N17n80J28%N0l6j07
651a54K16k3K9j41R3o9qj71K65l4L12m43L71k81q6j36M98k43R9j4j6j16k07L41
$$ plain form
675 82 -46 89 92 48 -10 189 77 -19 229 -105 121 -180 -189 -135 -58 221 258 -47 -90 -19 236 -20 231 8 -146
700 -146 -201 -113 -196 336 207 145 283 -73 77 148 -42 -92 -102 41 187 369 121 29 99 64 -232 -262 -143 -112
724 -112 -45 100 -55 -76 49 -222 10 -279 172 -148 -114 38 -48 89 -7 23 -223 -3 -1 162 10 9 126 -72
748 -72 14 -257 -326 146 -34 -16 328 229 -100 -76 104 242 -152 5 18 -34 153 17 118 -128 88 -108 -162
771 -162 257 70 95 -100 25 -77 -48 92 135 -25 97 -155 -248 150 -183 -221 24 -176 41 -253 -27 180
793 180 -163 -38 -63 -116 -3 -25 -198 43 -101 82 -58 -106 13 74 60 -85 100 74 174 -10 -213 -220 -158 -84
817 -84 -147 -109 14 272 204 10 -103 5 13 -59 -14 -114 88 -142 -93 183 129 -66 -170 92 -175 -23 -217 181
841 181 -70 90 164 14 155 61 133 7 -137 -183 44 84 89 117 -228 -33 -44 92 -154 3 85 -23 -51 -279
$$ packed form
675H2j28J35Lm4n8J99j12r6K48l34K26l01rN4P7K79L7l05m3P1K55k56K51k23j54
700a46n5Q8q3N32j29o2J38l56J50P1j90n0j0J43J46J82k48r2P0l5k96l0J19L1
724a12O7J45j55k1J25k71K32k89M51l20L4J52q6J37r6L0k46K20KJ63j52jJ17j98
748g2Q6k71o9M72j80J8L44r9l29K4J80J38l94J57J3n2J87j36J01k46K16j96n4
771a62M19j87K5j95J25j02K9J40M3j60J22k52r3L98l33l8K45k00K17k94K26K07
793A80l43J25k5n3J13k2j73K41j44J83j40m8J19O1j4j45J85k6J00j84k03pO2P4
817h4o3L8J23K58o8j94j13J08Qp2M5j00K02k30M9K76n4j95j04K62k67J52j94L98
841A81k51J60P4j50J41r4P2j26j44m6K27M0NK8l45J95j1J36k46J57Q2j08k8k28
$$ plain form
865 -279 -108 38 1 58 7 -156 -229 -55 297 192 -47 97 -346 -217 -15 95 66 -129 99 -117 16 -141
887 -141 113 51 141 -138 142 -12 -172 -77 84 66 -224 -206 -143 -7 -36 144 146 -145 210 23 38 -9 -53 -212
911 -212 -138 138 -80 75 23 -37 -121 78 164 184 -207 209 -52 -301 304 -237 195 162 129 -54 -33 -173 45
934 45 -82 -159 -141 -12 155 114 31 -203 75 -128 202 -84 -74 -11 -258 84 -36 -45 44 277 -153 -91 -71 -107 -86
959 -86 100 43 -253 -2 94 24 297 156 -66 -75 -119 -126 -40 94 71 106 -64 -142 -119 -19 177 18 24 33 81 240 -205
986 -205 -132 -95 150 54 194 109 -68 -4 218 35 -139 -5 236 -12 48 -145 272 9 -9 -39 -14 -169 -29
1009 -29 293 17 290 -156 123 170 -184 -174 64 -11 -95 -292 -77 -148 -264 -262 79 -266 348 100 -184 16 -93
1032 -93 -148 -26 -52 -81 -154 -78 60 -115 -126 37 118 -188 -296 260 40 266 101 36 40 -20 328 28 -116 124
$$ packed form
865b79J71J46l7N7n1j63p3J74L52j05k39J44m43J29K02J10k9j95K28k16J33j57
887a41K54o2R0k79K80j54j60R5J61j8k90J8O3J36k9J80Kk91L55j87J5m7m4j59
911b12P4K76k18J55n2o0q4J99Q6K0l91M16k61k49O05n41M32l3l3j83K1j40K18
934D5j27p7J8J29J67m1q3k34K78k03L30k86J0O3k47L42j20rQ9K33m30O2K0l6K1
959h6J86n7k96K51R6p0K73j41k22rm4pQ6J34k3L5j70p8K3J00J96j59ORM8J59m45
986b05P3L7K45r6J40q5j77O4K22j83j74J34K41k48O0j93M17k63j8l0K5j55J40
1009b9L22k76K73m46K79M7l54J0K38p5q4j97K15p1j16KL41l45O14k48k84K00j09
1032i3n5J22k6k9p3P6J38j75j1J63Q1l06j08N56k20K26j65o5Mo0L48l00j44K40
$$ plain form
1056 124 11 163 10 238 270 79 -152 95 -16 -101 -118 -118 19 169 -95 165 -5 -12 253 -17 -243 -77
1078 -77 164 12 -223 53 130 -30 228 30 -37 -70 24 72 -51 -213 75 -223 195 184 163 102 23 -26 -211 175
1102 175 -10 -167 25 -232 253 184 145 -183 -88 99 -46 -31 187 -7 -137 -18 158 40 58 -37 -249 -150
1124 -150 -40 -250 -60 -9 -139 -217 243 -111 141 101 -175 314 -50 -39 -6 -209 -37 130 -64 -57 -230 -50
1146 -50 -105 -11 -197 77 81 -25 161 140 7 -140 172 141 -53 -110 131 -341 80 35 178 20 2 13 -27 -57
1170 -57 -140 151 -245 5 -70 353 -90 -35 -89 31 206 24 64 -46 19 -135 220 -119 36 69 -21 -151 -138
1193 -138 -73 196 -44 116 241 2 52 48 127 176 10 15 19 -8 207 -43 -27 -148 90 140 115 96 -158 347 -13
1218 -13 49 196 96 -167 45 -192 136 133 -23 -83 -100 83 -95 27 -162 -114 105 72 267 -47 -227 54 336
$$ packed form
1056A24j13J52j53K28L2j91k31K47j11q5j7%J37J50k64K60j70pK65k70k26J66
1078g7K41j52k35K76P7j60K58j98o7l3R4M8j23j62K88k98M18j1k1o1p9m9j85L86
1102A75j85j57J92k57M85o9l9l28R5J87j45J5K18j94j30J19J76j18J8r5k12R9
1124a50J10k10J90N1j30p8M60l54K52m0k76M89l64J1L3k03J72J67j94Pj73J80
1146e0n5R4j86K74Mj06J86k1j33j47L12l1j94n7K41m72M21m5J43j58j8J1m0l0
1170e7q3K91l96K50p5M23m43N5n4J20J75j82M0j10O5j54L55l39J55L3r0j30J3
1193a38O5K69k40J60J25k39N0mP9M9j66NMk7K15k50J6j21K38N0k5j9k54N05l60
1218a3O2J47j00k63K12k37L28lj56o0j7J83j78J22j89M8K19l3J95l14j80K81K82
$$ plain form
1241 336 121 70 66 102 -300 5 114 -46 124 -113 -329 113 -84 -17 -7 -47 134 -156 -15 -193 27 332
1263 332 -73 -11 23 123 109 99 -170 2 89 113 -282 -270 159 -24 -78 133 77 61 113 66 53 -69 79 9 468
1288 468 172 31 24 17 -98 98 23 122 -109 67 11 121 -147 237 -90 35 -117 -62 207 -187 170 -86 44
1311 44 -238 18 93 -68 -34 161 8 155 -181 17 -331 -114 -162 -19 26 232 183 -31 -315 -1 109 42
1333 42 -91 175 349 269 -76 -18 -197 248 60 0 109 -163 -21 213 266 120 171 193 -43 81 -207 -19
1355 -19 215 -71 189 -160 -10 15 -2 -133 213 -107 81 -15 20 -211 -221 134 -48 62 240 172 238 242 -334
1378 -334 -90 -15 47 17 -61 -130 270 10 238 175 -92 31 211 -235 269 283 -39 266 -192 -7 -88 79 -66
1401 -66 -136 57 29 311 -37 117 104 -167 -104 -105 -136 -55 -140 -116 -48 115 78 59 29 79 -204 -15 -6 129 -157 -243
$$ packed form
1241C36k15n1mL6m02L05J09j60J70k37k16M42j97O7J0m0J81k90J41j78K20L05
1263C32m05O2L4J00j4j0k69J72Q7K4l95J2M29j83n4K11n6j6N2m7j3j22J48p0M59
1288D68k96j41ppj15J96p5R9k31J76n6J10k68L84l27J25j52N5K69l94L57k56J30
1311D4k82K56P5j61L4J95j53J47l36J98l48K17m8J43M5K06m9k14k84L14J10o7
1333D2j33K66J74q0l45N8j79M45j88o0J09k72J42K34N3j46N1K2k36J24k88J88
1355a9K34k86K60l49J50K5j7j31L46l20J88r6L5k31j0L55j82J10J78o8O6Mn76
1378c34K44P5O2l0p8o9M00k60K28o3k67J23J80m46N04J4l22L05m58J85q1J67j45
1401f6p0J93k8K82l48J54j3k71O3jl1Q1q5K4O8J63l7j9l0N0k83J89RJ35k86q6
$$ plain form
1427 -243 -58 -74 -38 124 -11 -173 -161 -175 -41 135 64 -25 32 92 86 79 194 -219 -108 125 -133 -355 -202 23
1451 23 -131 190 -62 -63 -118 -47 -15 165 188 -128 -131 -171 -2 -31 -161 -105 -104 66 22 47 20 -124 -64 -53 118 53 -51
1478 -51 -156 -170 235 -181 -177 177 -72 75 160 -72 -156 213 41 -79 -376 -141 -17 -88 11 -71 99 -34 36
1501 36 86 100 37 -273 34 100 87 258 -309 -247 -20 6 -93 113 249 126 241 76 32 37 -16 -47 212 -206 32
1526 32 -164 -85 -130 139 16 16 44 73 7 5 -113 112 -328 137 -137 -131 40 -253 -160 -193 237 -149 82 -315 96
1551 96 124 -49 259 1 49 -40 -129 35 184 219 -26 144 13 24 -74 60 38 -1 38 -62 102 11 -106 -156
1575 -156 11 -61 218 33 1 -13 20 -22 -237 200 -123 101 14 -17 -3 157 342 -131 -40 -55 -212 -93 -261
1598 -261 129 175 195 -67 -195 81 -223 16 78 20 264 29 -12 -271 13 112 22 -26 -144 52 -38 55 105 -262
$$ packed form
1427b43J85j6L6J62j35j62J2j4J34J76p1q9N7O0opJ15m13J11K33k58k22J53K25
1451B3j54L21k52jn5P1L2J80K3l16lm0J69k9j30N6JJ70m4K5k7j44O0J1J71o5j04
1478e1j05j4M05m16ML54k49J47Q5k32q4L69j72j20k97K35J24p1R9q2J70j33P0
1501C6N0J4o3l10L07O6j3J71n67O2K27K6r9K06J36j23J15j65m4Nn3l1K59m18K38
1526C2j96P9m5K69j23%K8K9o6kj18K25m40M65k74OJ71k93R3l3M30l86K31l97M11
1551I6K8j73L08k58M8q9q9J64J49L5k45J70j31J1r8J34k2l9L9j00J64r1j17n0
1575a56J67p2K79j85l2j4L3m2k15M37l23K24q7l1J4J60J85m73R1j5j57J19j68
1598b61L90M6K0k62j28K76l04K39O2n8K44k35m1k59K84R9r0m8j18J96r0R3N0l67
$$ plain form
1622 -262 -23 -106 -81 -111 210 -143 32 59 -32 -23 -120 47 248 -101 55 -128 76 -156 -13 -72 223 3 -97
1645 -97 191 142 170 0 131 107 -31 183 -126 -22 -29 -196 123 -67 -33 195 92 -36 153 206 157 -24 24
1668 24 -243 150 264 -97 -61 123 54 112 112 203 33 91 282 -305 208 -50 29 113 81 58 -113 20 -29 158
1692 158 -121 9 121 175 -5 34 -35 -153 190 -143 -35 -26 210 14 -230 111 -49 6 153 191 30 -76
1714 -76 102 91 -105 22 -190 -56 -220 131 -287 -50 54 197 120 -5 -156 -185 -54 -10 451 -147 140 61
1736 61 -52 222 1 225 -209 45 183 -34 -132 -196 -75 49 -21 -46 101 76 118 -16 99 39 -91 -117 -290
1759 -290 205 120 233 -116 -138 171 -4 -17 98 190 160 -323 -67 82 -12 234 -340 30 -111 -219 -48 -13
1781 -13 -51 148 240 78 -19 17 221 -75 313 204 -142 -120 -46 -113 87 -109 -50 208 128 -18 -10 -68 95 5 0
$$ packed form
1622b62K39q3K5l0L21l53J75K7r1Rr7J67K01l49J56j83K04k32J43n9K95k20j00
1645i7K88m9K8j70J31k4j38K14l09J04pj67L19j90L4K28j03j28J89N3m9j81M8
1668B4k67L93J14l61L6J84o9N8%R1j70N8J91n87N13k58P9Q4l2k3j71J33m9J87
1692A58k79J30J12N4j80L9o9j18L43l33J08RK36j96k44L41j60N5J47L8j61j06
1714g6J78j1j96J27k12J34j64L51m18K37J04J43p7j25j51k9J31M4M61n98K87p9
1736F1j13K74k21K24m34K54J38k17r8o4J21J24p0k5J47k5M2j34J15o0j30k6j73
1759b90M95q5J13l49k2L09j75j3J15R2l0m83K56J49r4K46n74L70j41j08J71L5
1781a3l8J99R2j62r7L6K04k96L88j09l46K2P4o7K00j96N9K58q0j46Qn8J63r0n
$$ plain form
1806 0 10 -200 188 87 163 -110 10 -116 -34 -229 -154 11 281 93 -58 -8 -311 -306 -188 147 89 9 78 -26
1830 -26 -233 -78 -123 148 -90 110 141 89 -200 -77 117 22 -10 -41 -100 -74 -214 61 122 18 -135 -343 169
1853 169 27 7 -64 -341 144 -23 186 -18 238 31 -69 -268 53 -139 -13 -134 -100 79 -147 -152 -49 -1
1875 -1 -201 84 136 54 89 -45 21 35 45 179 27 32 -56 -95 122 34 85 -124 -37 -17 -153 -73 -154 -180 240 -118
1901 -118 -179 -4 -214 338 -96 -94 -2 -169 -234 -54 -26 115 113 -92 -245 85 -19 -263 -87 35 319 -16 -70
1924 -70 66 198 0 14 275 53 -128 115 -83 -60 43 -198 109 -172 -169 -299 252 132 -110 49 -189 279
1946 279 46 -51 -396 -6 -399 -4 -141 42 57 -24 92 11 31 50 -66 67 60 -168 51 161 43 159 88
1969 88 -11 -129 104 -104 -75 11 342 255 -242 -64 -166 -130 -26 -154 10 -3 -93 169 -49 -186 40 -1 -18
$$ packed form
1806@J0k10L88j01P6k73J20j26Q2j95P5J65K70j88j51N0l03NJ18L35n8q0O9j04
1830b6k07J55m5K71k38K00L1n2k89J23J94r5l2l1n9K6j40K75O1j04j53k08N12
1853A69j42k0p1k77M85j67K09k04K56k07j00j99L21j92J26j21L4J79k26nJ03M8
1875ak00K85N2q2L5j34O6J4J0J34j52Nq8l9K17q8N1k09Q7K0j36Q0q1k6M20l58
1901a18o1J75k10N52m34KR2j67o5J80K8J41kk05j53L30j04k44J76J22K84l35n4
1924g0J36J32j98J4K61k22j81K43j98K3J03k41L07k81Lj30N51j20k42J59k38M68
1946B79k33r7l45L90l93L95j37J83J5q1J16q1K0J9j16J33pk28K19J10j18J16p1
1969H8r9j18K33k08K9Q6L31q7m97J78j02L6J04j28J64j3r0K62k18j37K26m1j7
$$ plain form
1992 -18 -70 -226 -146 142 -62 202 92 -17 -43 -31 -228 322 -175 -180 -153 142 117 105 -39 59 -75 -334 18 -142
2016 -142 107 67 150 -131 -6 -92 -250 -20 51 -205 15 -107 45 -73 237 99 -205 137 -310 44 4 406
2038 406 131 3 90 202 -50 -54 -31 105 12 -36 -82 125 165 254 102 -33 -186 22 82 -42 -78 -242 27 -48
2062 -48 22 -23 17 -70 246 37 21 -143 -89 -4 106 -49 -190 -123 -242 -189 -318 -117 -24 -218 72 227 308 125
2086 125 -136 -181 -36 -46 -94 -106 328 -274 203 167 132 -1 64 17 104 -131 59 -21 -65 25 -37 151 58 -211 160
2111 160 -61 193 89 29 305 0 1 -116 379 103 185 -20 176 40 69 -43 40 -106 38 -10 43 56 -41
2134 -41 -14 -11 -232 147 5 35 156 -82 9 152 79 -176 69 -308 200 -28 240 79 -65 -64 -303 23 -61
2157 -61 35 -5 43 74 -242 167 -14 19 24 -96 -70 25 3 102 -249 179 32 -64 -123 -282 99 -253 155 -201 66
$$ packed form
1992a8n2j56Q0K88k04K64j10j09k6J2j97N50m97nK7K95k5j2j44R8j34k59L52j60
2016a42K49m0Q3k81J25q6j58K30P1k56K20j22J52j18L10j38l04L42m47L54m0M02
2038D06k75j28Q7J12k52mK3J36r3m8m6K07M0Q9j52j35j53K08O0j24l6j64K69p5
2062d8P0m5M0q7L16k09j6j64N4Q5J10j55j41O7j19N3j29K01R3j94K90J55Q1j83
2086A25k61m5J45j0m8j2M34o02M77l6l5j33O5m7Q7k35J90q0m4R0o2J88r3k69L71
2111A60k21K54j04o0K76l05Jj17M95k76Q2k05J96j36K9j12Q3j46J44m8N3J3r7
2134d1K7Lk21L79j42L0J21k38R1J43p3k55K45l77N08k28K68j61j44Jk39L26q4
2157f1R6m0M8L1l16M09j81L3Nj20K6R5k2R9l51M28j47r6n9j59L81l52M08l56K67
$$ plain form
2182 66 -43 -187 146 124 83 163 -22 -131 -43 50 -53 -93 66 -174 152 12 -144 -53 -10 -3 -62 -26 -214 -146 -95
2207 -95 -7 194 14 103 60 30 109 -15 -103 -17 -155 -149 47 5 47 148 -7 -59 82 34 -5 -91 114 -132 -173 -216
2233 -216 247 -355 -164 -191 179 97 -132 -8 -143 8 -24 -230 131 174 -3 31 83 -88 41 211 -33 -124
2255 -124 160 -62 -32 244 -107 150 -331 24 56 -227 26 150 -162 -240 68 -56 -211 52 -127 -18 199
2276 199 -211 65 218 -71 170 -214 240 -130 -314 209 2 -12 -8 -52 27 -71 -44 -159 3 9 -113 241 -80
2299 -80 -61 91 167 262 -9 270 -119 -110 -213 -7 108 -8 -23 -212 -263 37 88 -12 193 -159 49 -137 119
2322 119 58 -172 40 -172 -3 -12 28 -261 25 -105 -174 -224 40 -331 71 468 82 -80 229 259 451 -17
2344 -17 35 -40 -74 -141 -83 -137 28 363 -36 -168 38 -209 -269 -19 110 96 213 -20 -21 83 -248 70 -7 67
$$ packed form
2182F6j09j44L33k2m1Q0j85j09Q8R3j03m0J59k40L26j40j56R1M3Pn9L6j88O8N1
2207i5Q8K01j80Q9m3l0P9j24q8Q6j38OJ96m2M2J01j55n2J41m8l9q6K05k46m1m3
2233b16M63o02J91k7L70q2k29J24j35J51l2k06L61M3j77L4N2j71J29J70k44r1
2255a24K84k22L0K76l51K57m81L55L2k83K53J24l12p8L08j24j55K63j79J09K17
2276A99m10K76J53k89K41l84M54l70j84N23k07j4Mm4P9r8K7j15J62Oj22L54l21
2299h0J9J52P6R5k71K79l89Rj03K06J15j16j5j89n1L00N1j00K05l52K08j86K56
2322A19o1k30K12k12J69rM0k89K86j30o9n0K64l71M02L97l86j62L09L0J92m68
2344a7N2p5l4o7N8n4J65L35l99j32K06k47o0K50J29j4J17k33jJ04l31L18p7P4
$$ plain form
2368 67 -95 253 154 -146 -20 -47 42 252 -80 79 -36 -68 -74 -123 -69 -100 -168 -16 -189 -133 -2 -10 -152 -186 94
2393 94 89 -143 121 -258 81 -131 -43 -24 49 -220 -109 185 1 -117 70 30 279 128 89 -6 -144 -124 -189 -105
2417 -105 49 -293 132 26 129 -44 -108 -184 94 256 61 -47 142 -160 120 -84 -178 38 -213 -91 -17
2438 -17 -198 110 135 23 -113 -133 -152 -28 -6 -95 -128 1 119 -20 -119 -21 -105 256 51 -44 154 -262 74 65
2462 65 213 117 130 -148 -58 -167 74 -117 309 163 105 -131 -127 67 25 -152 325 139 -23 55 -218 -101 196
2485 196 -83 56 24 -29 10 178 3 -66 -203 167 -287 -152 -194 -90 -58 -85 -184 -58 104 50 218 -21 -73
2508 -73 -122 -43 3 -80 -10 -92 328 -91 -464 110 -227 59 118 -51 -14 45 290 253 87 -79 -50 -100 106 -15
2532 -15 -173 -178 -97 -47 13 251 24 -109 -225 100 100 -15 -106 -164 16 -125 37 82 27 288 -42 138 -296 62
$$ packed form
2368F7j62L48r9l00J26k7Q9K10l32J59j15l2om9N4l1o8J52j73N6J31qj42l4K80
2393I4nk32K64l79L39k12Q8J9P3k69J11K94j84j18J87m0K49j51l9r5j38K0o5Q4
2417a05J54l42M25j06J03j73o4p6K78J62j95j08J89l02K80k04r4K16k51J22P4
2438a7j81L08K5j12j36k0j9J24K2q9l3J29J18j39r9R8q4L61k05r5J98m16L36r
2462F5J48r6J3k78R0j09K41j91M26j46n8k36MJ94m2j77M77j86j62P8k73J17K97
2485A96k79J39l2n3L9J68j75o9j37L70m54J35m2J04L2k7r9J26J62n4J68k39n2
2508g3m9P9M6q3P0q2M20m19l73N74l37K86N9j69L7N9K45l7j66j66K9n0K06j21
2532a5j58nQ1N0O0K38k27j33j16L25%j15r1n8J80j41J62M5n5K61l30J80m34L58
$$ plain form
2556 62 -55 -56 -17 -13 -386 -188 -62 -100 -51 428 66 -225 -74 33 218 -47 64 -55 -103 -35 113 -84 -86 -295
2580 -295 282 -37 -285 -121 56 150 -230 158 70 299 36 71 43 -113 55 39 -195 29 188 163 176 199 36
2603 36 234 162 -103 84 190 256 -283 -208 32 308 -155 -41 -33 83 25 -72 144 -135 226 263 -120 91 18
2626 18 83 -142 -29 242 88 103 -70 181 22 136 -285 -77 -69 -336 98 -28 429 147 240 130 52 -278
2648 -278 4 -37 -118 -189 -212 -315 152 -251 187 57 -142 -61 74 152 -155 113 -78 -141 12 -8 59 187 102
2671 102 54 -100 -75 -131 -8 -37 32 208 316 -249 -84 122 -179 141 -227 119 90 101 45 -105 -33 133 211
2694 211 10 53 24 -23 53 11 167 -86 283 -212 105 131 75 202 -177 270 -105 -103 91 -167 87 88 -110 87
2718 87 -30 -249 478 -200 109 95 37 78 -79 133 -151 -169 -44 383 -96 -178 -20 178 244 402 71 90 -81
$$ packed form
2556F2j17jL9Ml73J98J26l8M9M79l62k91J51J07J85k65J11j19m8O8J48j97kk09
2580b95N77l19k48J64J77R4l80L88q8K29k63L5k8j56J68j6k34K24J59k5J3K3j63
2603C6J98p2k65J87J06O6n39P5K40K76m63J14QJ16n8r7K16k79L61L7l83K11p3
2626A8O5k25J13K71j54J5j73K51j59J14m21K08Qk67M34j26M57k82R3j10p8l30
2648b78K82m1q1p1k3j03M67m03M38j30j99Q1J35P8l07K68j91o3J53k0O7J28q5
2671A02m8j54K5n6J23k9O9J76J08n65J65K06l01L20l68L46k9J1n6j50P2J66P8
2694B11k01M3k9m7P6m2J56k53L69m95L17K6n6J27l79M47l75KJ94k58K54Jj98J97
2718H7j17k19P27o78L09j4n8M1j57K12k84j8J25M27m79q2J58J98O6J58l31J9j71
$$ plain form
2741 -81 -118 -8 64 37 -52 -267 -126 241 291 95 116 105 -124 -66 -97 -179 25 304 53 -45 43 295 151 -64
2765 -64 45 72 -18 121 -71 66 75 -246 173 203 126 -39 -6 165 7 -4 147 -149 114 53 -97 -55 -5 -585
2789 -585 -155 -260 -61 203 -21 112 -196 158 9 -240 -43 -366 -20 150 12 -58 -74 -125 161 -375 -41
2810 -41 -141 -176 172 132 160 -109 6 -57 -111 44 33 -125 36 39 -168 76 -104 266 268 -180 140 4 339 -15
2834 -15 -118 -40 208 -292 336 99 105 -268 7 -14 -47 -336 -305 65 -252 183 76 -25 97 -167 -118 -147 -149 -14
2858 -14 -33 -53 51 -176 90 34 112 -51 7 -268 10 74 -111 -22 11 -116 263 5 -182 -65 12 91 -149 93
2882 93 208 -192 -73 21 -51 33 -9 43 98 -169 -27 -6 114 -152 -115 158 -89 -55 46 32 262 46 -11 -109
2906 -109 -200 -56 -77 -119 183 151 23 16 -261 31 21 -221 127 -164 228 90 132 13 84 34 121 111 -279 30
$$ packed form
2741h1l7J10P2k7q9k15J41L67N0j96K1j1k29N8l1q2K04K79k51r8Q8K52j44k15
2765f4J09K7r0J39j92J37Rl21M19L0p7j65L3J71j58j1J51k96K63o1j50M2N0n80
2789e85M30j05J99K64k24J33l08L54j49k49J97l23L46J70j38p0j6n1K86n36L34
2810d1j00l5L48m0K8k69J15o3n4J55j1j58J61Lk07K44j80L70Km48L20j36L35l54
2834a5j03P8K48n00O28k37Ol73K75k1l3k89L1L70l17M35j07j01J22k64M9k9kJ35
2858a4j9k0J04k27K66n6P8j63N8k75K78O4j85Q9L3j27L79k58j87J17P7P9k40K42
2882I3J15m00J19R4p2Q4m2N2N5k67J42K1J20k66L7K73k47L4J01j4K30k16n7r8
2906a09r1J44k1m2L02l2j28pk77K92j0k42L48k91L92j38M2j19P1n0Q7j0l90L09
$$ plain form
2930 30 -42 -126 123 19 131 138 -231 67 -194 -40 -202 151 221 163 -41 -110 -5 -154 -55 -42 -112 -179 210 -440
2954 -440 94 20 -349 -330 -168 -147 270 -315 -149 -68 3 -118 -284 -159 -219 -97 -203 185 -1 62 -36 170 112
2977 112 -62 -230 -171 274 -363 -3 -217 27 19 -83 16 170 99 -56 82 14 39 25 -196 -36 73 -205 28
3000 28 -187 97 -92 -58 -52 213 -18 -33 -55 -124 -103 125 -127 -200 140 91 225 -61 -111 -43 109 -53 123 -173
3024 -173 61 -187 85 -79 -207 -85 22 48 136 -39 -239 -30 134 214 -63 143 73 12 -280 -130 155 -97
3046 -97 -130 223 118 56 217 91 105 -40 -132 -91 -90 -48 -92 179 -291 57 11 -141 -195 -80 -130 14 5 267 -7
3071 -7 98 -15 -14 27 -249 16 -15 35 28 -235 108 8 -25 4 119 62 57 32 87 214 -12 100 120 145 -157 146
3097 146 -187 51 -49 -40 91 -162 112 181 44 211 95 55 71 95 128 -60 14 99 97 -144 0 -75 233 -72
$$ packed form
2930C0p2q4K49j04J12Pl69K98k61J54j62L53P0n8k04o9J05j49R9J3p0o7L89o50
2954d40N34p4l69J9J62K1M17n85J66Q1P1j21j66J25o0J22j06L88j86O3r8K06n8
2977A12j74j68N9M45o37L60k14K44qj02R9J54p1j55J38o8K5j4k21J60J09k78K33
3000B8k15K84j89L4OK65k31j5k2o9K1K28k52p3L40m9J34k86n0O8J52j62J76k96
3024a73K34k48K72j64j28J22J07K6Q8j75k00K09J64Q0k77K06p0o1k92J50K85k52
3046i7l3L53j05o2J61j26J4j45r2M1JM2m4K71m70L48m6j52n4J15n0J44rK62k74
3071gJ05j13JM1k76K65l1N0pk63L43j00l3K9J15n7nk5N5J27k26J12K0K5l02L03
3097A46l33K38j00RJ31k53K74O9j37J67j16m0J6K4L3j88P4Q5kk41J44p5L08l05
$$ plain form
3121 -72 139 113 53 90 -294 -10 76 -44 -264 75 184 91 -213 128 156 65 -44 -151 -330 -336 -22 -11 30 -202
3145 -202 211 -44 104 23 349 81 81 251 244 55 5 53 158 -139 71 -90 -226 -90 -169 157 -123 213 -87
3168 -87 80 -57 -125 18 168 -208 72 28 -19 -15 -170 -294 297 142 -234 -57 2 17 -74 113 113 -197 119 -71
3192 -71 139 -82 5 -30 263 -194 -366 -155 -137 -124 -7 195 -6 -54 111 -78 9 51 139 -188 -89 -46 -186 -141
3216 -141 -161 351 43 -284 5 111 -42 -230 -57 -2 146 -69 -138 28 227 -112 -77 -19 2 62 134 -182 27
3239 27 -115 -379 -3 241 124 225 180 54 -53 -73 41 -127 -143 122 -151 -21 -338 -22 31 -216 -108 -12
3261 -12 259 -44 -108 -87 -171 -9 -126 -1 220 -49 -48 42 -115 -41 -28 47 -79 1 -189 -298 -17 -119 -104 -9
3285 -9 94 -69 186 281 52 202 96 184 -284 148 106 34 128 -95 -39 251 -42 86 -69 211 -54 -46 -12 -90
$$ packed form
3121g2K11k6o0L7l84K84Q6j20k20L39J09r3l04L41K8r1j09j07j79oL14J1M1k32
3145b02M13k55J48q1L26k68%J70pj89n0M8J05k97K10j61j36J36p9L26k80L36l00
3168h7J67j37o8J43J50l76K80m4m7Mj55j24N91j55l76J77N9J5r1J87%l10L16j90
3192g1K10k21Q7l5K93m57j72K11J8J3J17K02k01m8J65j89Q7M2Q8l27R9M3j40M5
3216a41k0N12l08l27K89J06j53j88J73N5J48k15o9J66J99l39L5N8K1O0P2l16K09
3239B7j42k64L76K44j17J01m5j26j07k0J14j68j6K65k73J30l17L16N3k47J08R6
3261a2K71l03o4K1q4J62j17J25K21k69JR0j57P4J3P5j26Q0j90j09K81j02J5R5
3285iJ03j63K55R5k29J50j06Q8m68M32m2p2R4k23N6K90k93J28j55K80k65QL4p8
$$ plain form
3309 -90 115 -36 -35 76 32 -85 232 -192 -108 -154 42 204 241 280 -170 44 -3 192 173 45 -58 -61 -84 263
3333 263 57 147 218 -10 185 19 6 -41 17 -48 -26 -187 -35 24 -196 33 -168 -29 154 -118 -13 240 40
3356 40 119 144 168 181 -128 157 144 6 -90 -44 -23 -98 130 -105 85 327 60 28 -72 82 -10 200 -55 174
3380 174 83 -40 -165 -251 -285 98 85 -105 92 172 12 21 -138 57 -179 -185 168 -81 -46 -135 89 93 -156 235
3404 235 -22 107 236 228 -138 157 -350 -7 185 -24 1 10 -59 336 251 98 -242 88 297 96 16 78 113
3427 113 277 159 -6 155 80 173 7 -30 33 226 -178 -50 -156 -175 -102 -178 -22 -43 -261 -117 31 98 84
3450 84 -8 -130 -79 58 -120 16 114 -128 99 51 73 18 -201 -36 6 -238 -88 34 -385 -118 125 -17 190
3473 190 -187 -108 6 154 157 -10 131 -109 -17 106 70 -102 -60 -115 -86 160 -32 -50 73 100 -123 143 -53
$$ packed form
3309i0K05j51JJ11m4j17L17m24Q4m6J96J62L7L9m50K14m7J95j9j28j03lk3L47
3333B63k06R0P1k28J95j66j3m7N8o5K2j61J52N9k20K29k01J39J83k72J05K53k00
3356D0P9K5K4J3l09K85j3j38r6M6K1p5K28k35J90K42k67l2j00J54r2K10k55K29
3380A74r1j23j25q6l4L83j3j90J97Q0j60Rj59J95k36oL53k49L5q9K24Mk49L91
3404B35k57J29J29ql66K95n07L43J92k09K5Ro9L95q5j53l40L30K09k01q0O2L5
3427A13J64j18j65J61p5R3j66l7O3J93m04J28j06j9P3p6J56k1k18J44J48O7j4
3450H4r2j22N1J37j78J36R8k42K27m8K2n5k19J65M2k44J50J22m19K67K43j42K07
3473A90l77P9J14J48Lj67J41k40R2J23l6j72M2n5K9K46j92j8J23K7k23K66j96
$$ plain form
3496 -53 105 302 -41 70 -95 -27 -165 93 102 -88 12 99 -22 282 -15 63 138 20 11 171 -394 218 -32
3519 -32 29 -333 102 -50 49 -199 133 83 37 52 -91 188 203 107 -34 12 -67 -71 164 90 72 -19 -112 18 -63 162
3545 162 -34 -156 31 23 -166 -155 175 221 -73 -173 21 181 -407 -128 47 81 26 1 89 -64 116 92 -303
3568 -303 54 -88 -19 -204 179 130 101 132 85 -26 53 -13 -307 170 -9 -251 -184 112 -162 -96 101 26 -214
3591 -214 -75 -52 -41 -54 -81 -225 40 68 143 -28 -50 142 -118 -35 197 127 96 -69 94 -529 -51 -173 -147 -158
3615 -158 -241 30 32 152 329 84 187 -212 -1 70 -434 -11 60 105 -81 136 139 -25 -30 80 203 -86 86
3638 86 -87 -123 -149 -60 -166 64 118 -64 55 -144 -182 48 4 102 -157 -140 39 -131 -222 3 9 26 414 -212
3662 -212 127 -35 -182 23 -167 -208 -117 357 86 -14 2 148 238 76 -74 161 97 228 82 278 176 9
$$ packed form
3496e3J58J97l43J11j65O8j38K58Rj90J00Q7j21L04k97P8P5j18rJ60n65O12k50
3519c2O1l62M35j52R9k48L32n0m6J5j43K79J5r6j41M6p9mK35p4j8r1r3J30q1K25
3545A62j96j22J87qj89J1L30M6k94j00J94J60n88K79J75L4n5k5Q8j53J80k4l95
3568c03L57j42O9j85L83m9k9L1m7j11P9o6k94M77j79k42O7K96k74O6J97p5k40
3591b14J39K3J1j3k7j44K65K8P5j71k2J92k60Q3K32p0l1j65J63o23M78j22K6j1
3615a58q3K71KJ20J77k45J03l99K11P1n04M23P1M5j86K17Lj64nJ10J23k89J72
3638H6j73l6k6Q9j06K30N4j82J19j99l8K30m4R8k59J7J79j70r1K25OJ7L88o26
3662b12L39j62j47K05j90m1R1M74k71j00J6J46R0j62j50K35o4J31j46J96j02j67
$$ plain form
3684 9 36 58 12 8 -212 77 215 154 53 -36 -184 136 -86 207 -78 -56 -202 308 55 -31 42 -95 -70 -214
3708 -214 -42 -198 -289 107 92 60 -19 49 -201 -106 -116 102 72 105 -146 40 -77 147 -308 -191 20 -103 38
3731 38 -51 407 188 76 56 104 -30 -137 -96 165 -28 -284 -98 90 -131 -44 -37 179 343 101 27 -28 90
3754 90 -32 77 -49 229 -14 -89 -66 112 -57 0 -153 -223 -2 12 96 -159 22 -7 296 168 -199 -177 -63
3777 -63 187 -349 -35 -151 -108 -74 -55 -238 -98 44 300 46 23 13 366 166 -120 -102 -15 90 40 133 20
3800 20 95 -184 -66 63 13 -134 139 21 295 38 76 -56 -104 -88 -237 42 -214 8 65 268 335 -118 162
3823 162 -7 28 -208 128 -112 17 16 -79 -60 107 100 -17 -3 -163 120 41 115 97 13 -40 68 -141 118 143 -61
3848 -61 -137 -62 275 -291 167 -232 124 171 69 -192 174 -137 40 -47 -87 320 -345 -14 -99 -131 79 124 -217
$$ packed form
3684IK7K2m6mk20K89J38o1j01q9j48L20k22K93k85K2j46N10k53q6P3j37K5j44
3708b14J72j56r1L96j5l2p9O8k50R5j0K18l0L3k51J86j17K24m55J17K11j23J41
3731C8q9M58k19j12k0M8j34j07M1K61j93k56J86J88k21Q7PK16J64k42p4n5J18
3754I0j22J09j26K78k43p5K3J78j69N7j53p0K21J4Q4k55J81k9L03j28l67K2J14
3777f3K50n36L14j16M3L4J9j83J40J42K56k54k3j0L53k00k86J8Q7J05n0R3j13
3800B0P5k79J18J29n0j47K73j18K74k57L8j32m8J6j49K79k56K22N7K03O7m53K80
3823A62j69L5k36L36k40J29jr5J9J67pj17J4j60K83p9P4j8q4n3J08k09K59K5k04
3848f1p6P5L37n66M58l99L56M7j02k61L66l11J77q7m0M07o65L31q5l2K10M5l41
$$ plain form
3871 -217 -12 119 -50 -48 28 -138 65 -89 107 -89 9 -234 -85 222 284 -8 315 186 -200 117 -152 -78
3893 -78 -456 296 24 -119 51 -165 -100 124 252 52 -9 102 -56 185 9 105 48 -135 -123 108 -79 -50
3915 -50 62 99 -147 49 -197 21 -261 -186 78 45 -3 89 183 -15 148 219 -10 27 120 164 -141 127 -103 -95
3939 -95 -14 23 13 -150 -184 -85 115 53 112 -60 256 -225 -56 177 99 -64 23 -173 -6 192 227 101 -87 187
3963 187 -24 -105 240 -77 -131 49 158 -460 66 -286 -114 -2 60 156 255 -117 9 -21 -229 -88 218 18
3985 18 -140 -21 43 3 -114 -111 139 4 143 -87 -92 -190 -135 -35 -36 -170 -66 240 -56 -44 -220 -300 16 252
4009 252 -93 72 100 46 210 20 49 23 -289 132 22 -45 94 101 48 243 -28 15 30 21 88 48 -111 276 136
4034 136 123 -192 -13 -199 -62 -152 65 166 137 159 -41 -156 26 -126 -149 -70 395 90 -147 174 -33 195
$$ packed form
3871b17K05J31j69KP6j66K03j54J96j96R8k43J49L07O2k92L23j29l86L17k69P4
3893g8l78P52k72j43J70k16O5K24J28k00o1J11j58K41j76R6n7j83J2K31j87K9
3915e0J12L7k46J96k46K18k82P5K64l3m8R2R4j98J63P1k29L7R3M4l05K68k30Q
3939i5Q1L7j0j63l4R9K00o2N9j72L16m81J69K33p8j63Q7j96J67J98L5j26j88K74
3963A87k11q1L45l17n4J80J09o18N26l52J72J12O2R6R9l72J26l0k08J41L06k00
3985A8j58J19O4m0j17LK50j35J39k30nr8N5J00jj34J04L06k96J2j76q0L16K36
4009B52l45J65K8n4J64j90K9k6l12M21j10o7J39Pn3J95k71M3J5rO7m0j59L87j40
4034A36j3l15J79j86J37r0K17J01k9K2k00j15J82j52k3P9M65l05k37L21k07K28
$$ plain form
4056 195 52 -182 -35 137 112 4 116 -17 60 122 -33 14 -48 158 198 95 117 91 -166 70 -32 54 -115
4079 -115 -31 -150 17 -60 79 -97 -146 122 61 195 113 -146 121 -31 -249 -160 -78 -232 136 124 -111 149 -248
4102 -248 -27 117 -105 -255 -192 66 -29 -125 125 100 -221 -92 -31 38 -28 63 128 -21 48 -24 60 69 16 166 -57
4127 -57 77 -61 515 -113 65 -11 4 37 -89 185 -59 -94 32 154 28 -18 -207 64 82 95 -23 316 -54
4150 -54 44 -39 -72 47 92 -54 84 -35 -192 -95 302 150 -2 -122 30 -166 -73 -147 113 -146 70 -22 -181
4173 -181 41 -462 -168 -64 204 25 74 -2 56 -21 -37 -65 -16 -23 76 197 -147 -200 24 -196 92 15 -197 45
4197 45 117 166 -182 -16 -175 161 21 90 -170 -5 -5 57 -203 87 -100 59 -71 -50 73 -92 -127 -128 148 199
4221 199 94 114 -171 -341 -48 39 -74 25 -38 177 207 -133 282 -19 183 121 48 -46 226 78 228 -94 -21
$$ packed form
4056A95j43k34J47J72k5j08J12j33P7O2j55M7o2K06M0j03K2k6k57K36j02Q6j69
4079a15Q4j19J67p7J39j76m9K68o1J34q2k59K67j52k18Q9Q2j54L68j2k35K60l97
4102b48K21J44k22j50O3K58r5r6K50k5l21J29O1O9o6R1O5j49O9p2Q4Rn3J50k23
4127e7J34j38N76o28J78p6J5L3j26K74k44l5J26J22j26m6j89K71J8J3j18L39l70
4150e4R8q3l3J19M5j46J38j19j57R7L97j52j52j20J52j96R3p4K60k59K16r2j59
4173a81K22n03K94J04K68j79M9p6N8p7j6k8M9pR9J21l44n3K24k20K88p7k12K42
4197D5P2M9l48J66j59L36j40O9k60J65%O2k60K90j87J59j30K1J23j65l5jK76N1
4221A99j05K0k85j70K93Q7j13R9o3K15L0l40M15l01K02o2p3r4K72j48J50l22P3
$$ plain form
4244 -21 205 -108 -180 -11 249 -96 -21 220 148 -88 122 20 36 71 -309 113 311 -244 78 10 -247 -98
4266 -98 80 133 209 5 212 92 35 -93 -188 185 -107 -48 1 130 -102 -51 -27 28 233 -9 49 10 277 150
4290 150 285 58 41 -93 47 107 284 67 257 81 -12 -76 -67 194 -62 31 -191 196 156 72 55 -92 121
4313 121 194 21 -135 -56 -33 89 -73 -128 -32 142 -30 210 -70 -130 25 101 67 -127 -238 223 -149 70 314
4336 314 -97 206 -31 -8 11 78 18 -201 87 40 110 239 138 -85 208 290 -241 -342 -310 92 -1 -99 187
4359 187 179 -153 98 105 -310 -241 17 -47 86 104 -134 108 174 46 -52 245 -13 193 -145 142 -240 -29 -2
4382 -2 339 198 158 137 -29 73 58 109 13 180 129 18 -212 -237 -98 -98 59 223 -109 -24 172 -347 -49 -172
4406 -172 53 159 47 73 -14 -81 208 102 -3 -179 -98 -114 -18 97 -57 -176 86 134 33 221 -64 21 -319
$$ packed form
4244b1K26l13p2J69K60l45P5K41p2k36K10j02J6L5l80M22J98n55L22o8k57J49
4266i8J78N3P6k04K07j20n7j28r5L73k92N9M9J29k32N1K4N5K05k42N8l9K67j27
4290A50J35k27j7j34J40O0J77k17J90j76r3o4RK61k56R3k22L87m0q4j7j47K13
4313A21P3j73j56P9K3J22j62n5R6J74j72K40k80o0J55P6l4j94j11M61l72K19K44
4336C14m11L03k37K3J9O7o0k19K88m7P0J29j01k23K93Q2n31j01L2M02r3r8K86
4359A87ql32K51Pm15O9K58o4J33J8k38K42O6j28r8K97k58K06l38K87l82K11K7
4382bL41j41m0k1j66J02j5N1r6J67n1j11k30k5J39%J57J64l32Q5J96n19K98j23
4406a72K25J06j12K6q7o7K89j06j05j76Q1j6R6J15j54j19K62M8j01J88k85Q5l40
$$ plain form
4429 -319 -42 -82 -46 45 76 -159 41 -297 -264 60 -47 -42 -33 56 171 -157 -146 11 149 409 51 28 60 59 -22
4454 -22 290 123 -45 -39 44 30 168 -271 137 221 -155 116 104 144 -64 75 -330 181 -163 -10 271 70 144
4477 144 -147 -69 -206 156 -5 194 12 -48 -145 141 -47 -7 -160 -14 28 -186 46 -139 -231 342 -43 303
4499 303 -13 12 -88 208 136 -114 -59 79 -7 47 -119 -1 -112 -131 130 115 -87 32 -5 76 158 -18 -111 38
4523 38 108 66 83 178 60 -224 119 63 202 -93 -99 101 -89 -139 11 -306 183 -35 68 -105 273 10 -142
4546 -142 170 -66 -85 -173 -247 -218 118 92 -126 -103 19 139 93 -92 18 -118 97 -98 28 -27 49 -56 -60 120
4570 120 -81 4 99 -190 -2 -6 -192 64 -13 -70 -25 81 -154 -82 -52 -185 171 -51 -46 -207 -43 -175 -239 -427
4594 -427 31 -234 -300 10 34 108 31 29 -115 127 17 58 -152 217 36 20 -260 -128 -164 -20 222 -74 -72 77
$$ packed form
4429c19K77m0L6R1L1k35K00l38L3L24j07NRQ9J15l28J1J57J38K60l58k3L2jq1
4454b2L12j67j68OQ3j4J38m39M08Q4l76K71j2M0k08J39m05N11l44J53K81k01P4
4477A44k91P8j37L62j61J99j82o0r7K86j88M0j53J46M2k14K32j85r2N73l85L46
4499C03l16K5j00K96p2k50N5J38q6N4j66J18j11j9K61j5k02J19l7Q1Q2j76r3J49
4523C8P0m2J7R5j18k84L43n6J39k95oK00j90n0J50l17M89k18J03j73L78k63j52
4546a42L12k36j9q8p4K9L36k6k18K3J22J20m6j85J10j36K15j95J26n5P6j05mJ80
4570A20k01Q5R5k89J88mj86K56p7n7M5J06k35P2L0j33L56k22Nj61J64j32o4j88
4594d27M58k65o6L10K4P4p7kj44K42j10M1k10L69j81j6k80J32l6J44K42k96KJ49
$$ plain form
4618 77 -40 182 -234 132 -62 156 20 129 -137 -116 92 88 -34 163 -44 50 117 -149 -157 111 36 73 143 -184
4642 -184 46 110 412 -269 -82 104 -8 29 -172 116 85 167 110 -38 29 139 -58 50 135 -288 -208 -138 -2
4665 -2 358 -222 -150 -18 -84 -140 -113 -49 -131 -106 299 -246 -141 169 55 111 -5 207 78 20 -112 134 133 66 -143
4690 -143 49 -268 235 195 -36 -109 107 -203 -139 -215 -87 -67 241 127 83 125 -81 -2 -129 -49 41 65 -381 -39
4714 -39 -169 -63 -134 7 -74 355 61 -25 237 -49 -44 232 -312 128 -155 28 280 -23 140 -38 98 180
4736 180 -93 -7 116 24 -47 -70 -44 119 -99 26 42 239 -38 41 -94 137 -249 150 -141 27 201 71
4758 71 11 -6 -129 47 -198 -138 170 -185 111 -160 93 -111 -52 -48 76 -115 -42 -13 61 118 -211 128 -34 344
4782 344 52 -74 194 -99 22 -368 -67 153 120 166 173 276 114 34 -14 -173 -50 -87 -6 178 112 252 -263
$$ packed form
4618G7j17K22m16L66j94K18j36J09k66K1K08mj22J97k07R4O7k66qK68p5L7P0l27
4642a84K30O4L02o81J87J86j12L7k01K88l1Q2n7j48O7J10j97J08Q5m23Q0P0J36
4665bL60n80P2J32o6n6K7O4q2K5M05n45J05L10j14N6j16K12j29n8j32K46jo7k09
4690a43J92l17N03m0k31p3K16l10O4p6J28K0L08j14m4M2k06P9j27Q0R0K4m46L42
4714c9j30J06p1J41q1M29k94q6K62k86NK76n44M40k83J83K52l03J63j78J36Q2
4736A80k73Q6J23r2p1k3K6J63k18J25J6J97k77P9j35K31l86L99k91J68J74j30
4758G1o0j7j23J76k45O0L08l55K96k71K53k04N9MJ24j91P3K9P4N7l29L39j62L78
4782C44k92j26K68k93J21l90L01K20l3M6PJ03j62q0m8j59J23l7Q1J84o6J40n15
$$ plain form
4805 -263 231 -4 -95 -23 -2 108 -39 73 207 50 -57 -30 83 -13 -311 165 -128 132 47 -59 107 229
4827 229 117 -1 -11 -332 -100 146 254 -153 -117 -208 19 -346 -183 -106 279 94 -20 -21 -133 -18 -176 53
4849 53 74 136 -143 -5 -11 99 -199 -103 -71 74 -24 -52 208 37 91 101 146 205 -93 243 203 12 186 36 276
4874 276 5 171 -198 132 3 -77 -100 -160 -255 40 89 -77 -179 80 26 -16 75 -172 21 201 224 49 -223
4897 -223 8 307 -191 -106 -79 -86 -114 12 -83 -148 205 26 -191 183 32 3 -141 64 129 -233 -141 -60 -150 115
4921 115 96 226 109 314 81 310 -9 147 56 -241 25 353 -37 45 254 266 -87 -16 5 31 25 133 -221
4944 -221 -78 -150 7 -169 74 189 -129 153 37 66 -54 110 20 -58 -9 -58 54 -224 -26 158 -231 -44
4966 -44 -118 -67 -112 -166 177 -44 66 -134 -23 -2 -126 -165 78 63 63 70 -153 58 -53 370 249 -130 -112 -29 -83
$$ packed form
4805b63M94k35r1P2K1J10j47J12J34j57j07K7J13r6k98M76k93K60q5j06J66J22
4827B29j12j18j0l21K32K46J08m07L6r1K27l65J63P7L85j85j14jj12J15j58K29
4849E3K1O2k79J38oJ10k98R6L2J45r8k8K60j71N4J0M5N9k98L36m0j91J74j50K40
4874B76k71J66l69L30j29q0k3o0r5K95M9j66j02K59n4m2R1k47J93J80K3j75k72
4897b23K31K99m98Q5K7pk8J26r5o5L53j79k17L74j51k9j44K05O5l62R2Q1r0K65
4921A15j9J30j17K05k33K29l19J56r1k97K66L28l90Q2K09J2l53P1K1K6oJ08l54
4944b21J43p2J57j76K43J15l18K82j16K9j20J64r0p8M9m9J12k78J98J84l89J87
4966d4p4N1m5n4L43k21J10k00J11K1j24l9K43j5%Pk23K11j11M23j21l79J8Q3n4
$$ plain form
4991 -83 166 24 -71 -166 -32 59 351 46 49 67 226 59 -83 -21 86 -10 158 112 -44 -206 -293 105 -179 33
5015 33 225 69 -123 110 -69 24 -21 -274 -238 67 2 208 105 -275 182 -15 -251 167 -60 -259 -145 -219
5037 -219 87 -59 65 319 -104 68 158 -58 -161 90 -69 32 -209 -194 -46 26 38 -5 163 119 39 2 -253
5060 -253 70 -118 167 -100 -147 -281 -32 46 -51 -37 175 -42 89 248 4 -333 -54 -142 70 -17 -150 0
5082 0 -65 -140 111 -29 -203 -73 -196 -91 84 -232 89 227 -37 23 -20 -34 -7 -198 75 -71 134 131 -1
5105 -1 -52 -150 -188 -142 87 -37 200 -407 -18 62 188 -62 46 223 -79 -129 -108 -144 -135 27 -164 -346 12 -174
5129 -174 12 46 116 -217 -34 102 -57 159 -173 -88 -75 -16 50 35 -90 -109 -84 -228 77 -142 -42 -55 -6 120
5153 120 -158 182 408 -214 -259 -83 -228 45 236 302 129 -202 158 -9 78 111 -153 126 144 -91 -133 20
$$ packed form
4991h3K49j42r5r5J34R1K92l05LJ8J59j67j42O2J07r6J68m6j56j62q7L98k84K12
5015C3J92j56j92K33j79R3m5k53L6L05o5K06j03l80M57j97k36M18k27j99J14p4
5037b19L06j46J24K54m23J72R0k16j03K51j59J01k41J5J48P2J2m3J68m4q0l7k55
5060b53L23j88K85k67m7j34K49P8r7J4K12k17J31J59k44l37K79q8K12q7j33J50
5082@o5p5K51j40j74J30j23J05J75l16L21J38k64O0m3j4K7j91K73j46K05lj32
5105an1r8l8M6K29j24K37o07L89Q0J26k50J08J77l02n0K1l6RJ62j91j82L58j86
5129a74J86L4P0l33J83J36j59K16l32Q5J3N9O6j5j25j9K5j44L05k19J00j3M9J26
5153A20k78L40K26o22m5J76j45K73J91O6j73l31L60j67Q7L3k64K79J8k35m2J53
$$ plain form
5175 20 -123 -87 -181 -139 -131 16 119 -84 148 -99 25 -167 177 119 -100 -7 -170 -30 199 45 -88 -173 88
5198 88 -129 115 126 186 283 6 -33 -6 -78 51 4 43 109 -57 21 -268 -36 96 168 94 -91 -96 65 -29 210
5223 210 -158 130 156 -5 -181 191 222 197 216 -183 126 -24 -92 -97 -39 -136 -187 185 148 -75 -94 -80 0 15 16 37
5249 37 22 60 82 -188 162 -204 -61 15 -136 -308 -105 76 123 -82 -8 -175 86 202 -154 -64 48 100 90
5272 90 -22 -14 -174 144 185 53 -63 98 189 -137 140 -198 -217 -200 -58 172 -16 240 53 -129 -243 -115
5294 -115 -5 71 -65 -129 48 -15 9 -46 142 120 -121 -15 138 -18 60 93 322 101 31 -66 -62 -33 -193 -87
5318 -87 -127 -30 -98 4 212 110 -114 -182 33 -91 229 -55 20 12 124 -53 -167 -162 -50 -146 212 338 -186 -36
5342 -36 -136 155 -84 -98 -188 -82 -119 4 52 -168 -71 -32 -180 17 157 -207 186 4 91 62 -28 143 252
$$ packed form
5175B0j43L6r4M2QJ47J03k03K32k47J24j92L44n8k19R3j63J40K29j54j33q5K61
5198H8k17K44J1O0R7k77l9K7p2J29m7L9O6j66P8k89K32J32P2p4j85nJ61r4K39
5223B10l68K88K6j61j76L72L1k5J9l99L09j50o8nN8r7n1L72l7k23j9J4Q0J5JK1
5249C7j5L8K2k70L50l66J43P6j51j72K03J81M7k05P4j67K61J16l56R0J12N2j0
5272I0j12Qj60L18M1j32j16J61R1l26K77l38j9J7J42K30j88K56j87j82j14J28
5294a15J10P6j36o4J77o3K4n5J88k2k41J06J53j56P8L3K29k21p0r7MK9j60J06
5318h7m0R7o8J02K08j02k24o8K15j24L20k84P5qJ12j77j14NJ12r6L58J26n24J50
5342c6j00K91k39j4r0J06l7J23M8k20R7L9j48J97J40l64L93j82Q7k9r0J71J09
$$ plain form
5365 252 -26 -16 108 -145 193 -121 -194 78 107 213 -32 -226 150 80 6 184 58 -141 -124 -291 145 -60
5387 -60 43 -232 -86 61 138 43 -43 -49 70 -56 23 152 34 -125 -55 85 -69 142 178 -63 18 192 41
5410 41 -222 -184 -24 75 -214 245 -61 220 302 -142 94 190 -85 -4 -144 292 67 371 -124 -45 130 -221
5432 -221 216 -102 -134 19 221 -339 -28 -57 127 -109 103 -64 -73 -114 76 -262 107 -5 -123 9 158 79
5454 79 -129 -207 -301 -12 -114 283 214 76 83 -81 -59 89 -153 522 77 146 243 -107 -192 101 -172 29 41 188
5478 188 105 -175 -3 -4 -84 67 -305 -177 -293 -77 -13 8 -67 -160 -229 -139 -69 -6 27 -145 -133 -89 127 -127 60
5503 60 -32 -167 -172 29 125 -154 -199 -173 -53 -208 -84 133 98 83 65 -124 -23 -60 168 237 133 125 -52 1 56
5528 56 144 170 103 90 -75 2 14 -79 84 82 8 -195 -73 31 -28 -193 30 -9 -181 -92 -130 74 -53 287 -2
$$ packed form
5365B52k78J0J24k53L38l14p3K72K9J06k45j94L76p0p4J78j26j99J7j67M36k05
5387f0J03k75J46J47P7r5q6oJ19j26P9J29j18j59P0J40j54K11L6k41Q1J74j51
5410D1k63L8J60R9k89M59l06K81Q2m44K36R6k75Q1j40M36k25L04m95P9J75l51
5432b21M37l18l2J53K02n60L11k9J84k36K12j67rm1J90l38L69j12j18J32J49p9
5454G9k08p8r4K89j02L97o9j38Pj64K2J48k42O75m45O9R7l50q5K93k73K01J2J47
5478A88q3k80J72jq0J51l72J28j16K16O4K1p5r3o9R0P0O3L3j72J2M4K16k54J87
5503F0r2j35nK01R6k79m5K6J20j55J24K17l5j5j8j89J01l7K28O9j04qj77N3N5
5528E6Q8K6o7j3j65P7J2r3J63kp4k03J22J04n9j65K23l9j72Q9l8K04j27L40k89
$$ plain form
5553 -2 -28 255 -33 130 -107 26 73 175 -23 -52 150 12 250 -121 -68 15 -50 26 -240 79 -88 324 -173
5576 -173 107 136 176 264 -74 168 -266 -14 -386 -107 31 -34 -238 116 115 45 211 178 -239 218 86 170 101
5599 101 -49 -107 -44 125 -91 -119 -125 8 41 187 -191 8 98 164 -15 64 96 -146 -47 201 47 198 -174 -93
5623 -93 58 53 -177 50 75 -141 168 134 198 104 209 106 81 -106 -34 18 20 -164 197 -101 139 38 36 -179 -126
5648 -126 -37 104 234 -115 430 -180 -235 74 72 161 12 24 -127 253 -236 -239 71 -18 177 -148 31 -133 83
5671 83 -80 22 -87 -8 94 -6 81 121 -3 33 54 13 -14 -79 148 -70 106 18 -59 -124 112 268 39 -78
5695 -78 -191 235 -70 -221 164 162 141 168 99 -125 -139 -32 -227 -173 43 -128 15 98 -32 -63 198 103 314 -149
5719 -149 24 237 -155 -136 -234 -115 -104 -125 -125 8 227 33 28 -112 57 95 36 79 187 -173 -83 221 222 200 40
$$ packed form
5553bk6K83k88J63k37J33M7J02j98k9K02j38K38l71N3Q3o5P6k66L19j67M12m97
5576a73K80K9M0Q8l38K42m34K52l72K79J38o5k04L54jp0J66l3m17M57j32Q4o9
5599A01j50n8O3J69k16k8oJ33L3J46l78J99R0O6j79P9L2k42R9K48j54J51l72Q1
5623i3J51nk30K27K5k16L09l4O4r4J05j03k5j87P2N2Kj84L61k98K40j01kk15N3
5648a26Q9J41J30l49N45o10n5L09kQ9j49J2j51L80m89lL10q9J95l25J79j64K16
5671H3j63J02j09P9J02j00Q7M0j24L6K1m1k7o5K27k18J76q8p7o5K36J56k29j17
5695g8j13M26l05j51L85kk1K7o9k24j4J07j95N4K16j71J43Q3j30l1K61r5K11m63
5719a49J73K13l92J9r8J19J1k1%J33K19j94nj40J69L8n9M3J08l60R0L04Jk2j60
$$ plain form
5744 40 93 -218 -27 79 -193 -236 -231 -19 1 -141 76 -33 -76 -19 7 -183 -15 144 83 -135 20 -256 127
5767 127 72 -388 -147 178 147 -209 54 -178 273 -25 164 249 -33 -147 47 -14 37 -10 1 10 196 -238 -261
5790 -261 -230 -66 116 -236 -118 85 81 -109 -297 -144 104 -140 -83 -8 -230 -170 4 -28 -99 38 152 -189 57
5813 57 6 3 139 74 27 -167 -187 -63 34 -34 -57 -81 -74 92 -161 -307 -70 81 90 -107 -76 -178 152 -183 -275 79
5839 79 41 171 2 188 93 -68 -11 194 207 -7 162 139 27 -90 -103 -29 -131 9 14 130 4 -254 -82
5862 -82 -133 -25 -138 7 136 107 -45 -19 -187 -228 10 233 225 -95 -207 -159 -6 -2 -128 51 51 73 -40 -40 259
5887 259 80 -23 -295 -54 106 -146 -45 122 -114 30 -333 28 -56 -43 135 -109 13 -29 355 -64 -238
5908 -238 40 106 -104 18 100 -135 -45 195 98 37 -157 229 -178 -268 169 4 98 -116 -81 -71 -133 34 85 -106
$$ packed form
5744D0N3l11J91J06k72m3NK12K0j42K17j09m3N7K6j90J68J59o1k18J55k76L83
5767A27n5m60K41L25l1l56K63k32M51k98J89Q5k82j14J94o1N1m7J1RJ86m34k3
5790b61L1J64J82l52J18K03mj90j88J53K48k44N7P5k22O0J74l2p1J37J14l41K46
5813E7n1lJ36o5m7j94k0J24R7o8k3k4PJ66k53j46K37J51Rj97L1j02L30l35r2L54
5839G9l8J30j69J86r5j61N7K05J3k14J69k3j12j17j3P4j02J40NJ16j26k58J72
5862h2n1J08j13J45J29k9j52K6j68m1K38K23ql20j12M8J53Mj26J79%K2j13%K99
5887B59j79j03k72K41J60k52J01J67k36J44l63L61q4J3J78k44J22m2L84m19j74
5908b38K78O6k10J22Q2k35R0K40r7o1j94L86m07r0M37j65R4k14L5J0o2J67N1j91
$$ plain form
5932 -106 201 82 -89 -53 -1 -64 148 58 -100 85 -325 146 -111 51 8 -101 47 146 -193 -32 -61 137
5954 137 -24 -40 -63 46 152 110 -71 -213 54 274 -121 337 262 154 5 -68 129 41 11 32 95 230 23
5977 23 -35 -44 -223 214 52 -48 -128 165 -141 18 161 199 214 105 54 189 252 277 107 -104 30 -40 4 -76
6001 -76 275 264 -50 -5 -86 -17 -51 -185 27 6 -147 -24 72 -4 -39 35 -248 156 82 81 -133 -276 -227 -23 -335
6026 -335 -38 14 144 -119 146 0 -162 274 32 164 179 132 -68 -119 -54 162 -34 -133 77 -74 18 183
6048 183 124 288 44 32 99 -189 -91 88 -229 -37 -83 66 7 -258 -28 118 25 -166 197 -137 -167 -38 -129
6071 -129 -4 -16 299 -57 -107 -351 -197 -204 18 116 -60 109 -146 146 -96 115 16 -121 -138 133 -44 -161
6093 -161 -264 -96 -100 106 154 -86 178 117 150 -203 -122 -28 -7 -188 -11 39 84 -8 317 -106 -84 30 48 -167
$$ packed form
5932a06L07j19j71L6N2o3K12r0j58J85m10M71k57J62m3j09J48R9l39J61k9J98
5954A37j61j6k3J09J06m2j81j42K67K20l95M58p5j08j49p3J97q8l0K1O3J35k07
5977B3n8rj79M37j62j00q0K93l06J59J43L8J5j09n1J35O3K5j70k11J34p0M4q0
6001g6L51j1l14M5q1O9l4j34K12k1j53J23R6p6l5P4k83M04p4jk14j43M9K04l12
6026c35K97N2J30k63K65j46j62M36k42J32J5m7k00n1O5K16j96r9K10j51R2J65
6048A83n9J64k44j2O7k88R8J79l17J92m6J49n9k65K30J46r3j91L63l34l0J29r1
6071a29J25j2L15l56n0k44J54pK22R8j76J69k55K92k42K11r9j37j7K71j77j17
6093a61j03J68mK06M8k40K64o1L3l53Q1R4K1j81J77N0M5r2L25m23K2J14J8k15
$$ plain form
6117 -167 183 214 -229 379 -264 -249 4 -78 289 8 58 -77 -57 110 127 66 -98 119 -6 -42 191 -155 147
6140 147 -166 55 186 -154 177 186 156 216 229 23 52 113 334 -82 138 -173 41 -274 -263 -106 -111 -209 -370 134
6164 134 40 -30 201 -173 -179 14 -212 -369 40 -239 -259 34 -159 -67 -349 147 -73 179 -167 -62 218 -184
6186 -184 -83 -72 190 -156 -64 -260 135 357 46 -204 103 11 266 63 41 254 177 -32 40 -29 -11 356 103
6209 103 79 -168 -52 -233 65 -64 378 274 179 100 -92 -191 -144 373 -21 -196 165 -155 -34 -74 132 -155
6231 -155 149 95 42 223 107 5 -157 -6 -212 -143 -78 -230 133 111 99 -259 119 62 187 -71 -12 -180 -222
6254 -222 -37 -270 127 -134 99 -29 -153 -43 40 -300 -201 132 92 -145 18 160 -357 140 -276 -116 174
6275 174 -22 170 -118 169 140 -85 -171 261 -27 -46 -55 137 92 -70 213 25 -130 -40 -207 -132 93 -60 -182
$$ packed form
6117a67L50L1m43O08o43J5K53q2L67k81N0j35K0J67J7o1j64K17j25l6K33l46L02
6140A47l13K21J31l40L31Rl0O0J3k06K9O1K21m16K20l11K14l15J1J57nr8j61N04
6164A34r4p0K31l74oJ93k26j57M09k79k0K93j93R2k82M96k20K52l46J05K80m02
6186a84J01J1K62l46R2j96L95K22l11k50L07r2K55k03k2K13p7k09P2o9J8L67k53
6209A03k4k47J16j81K98j29M42j04r5p9j92r9M7N17l94j75L61l20J21m0K06k87
6231a55L04n4n3J81j16j02j62J51k06O9O5j52L63k2j2l58L78n7J25k58N9j68m2
6254b22J85k33L97k61K33j28j24J10Q3l40R9L33m0k37J63J42n17M97m16J60K90
6275A74j96J92k88K87k9k25q6M32k88j9rJ92m5j62K83j88j55R0j67P5K25j53j22
$$ plain form
6298 -182 -196 -39 254 -44 -72 -211 -10 23 -300 -5 -96 136 12 -6 -60 -20 145 -285 -60 -153 -296 -4 -98
6321 -98 -110 28 30 -102 -74 -376 16 98 139 139 126 188 -55 269 248 34 7 -122 22 52 50 229 -75 -187 -88 64
6347 64 42 -73 -123 -65 -76 117 -69 -68 -26 -140 32 85 3 30 38 -92 97 161 -89 262 210 -257 -38 -20 -27 53
6373 53 -41 -57 271 269 258 -64 -168 41 124 -23 116 23 -138 -98 131 -286 141 34 73 28 -325 19 -121 172
6397 172 185 -40 -220 32 -166 -247 -35 -83 -266 -45 -303 36 -51 -247 -131 -65 -65 -358 317 -103 48 -255
6419 -255 56 54 8 97 3 -253 -173 -135 -22 4 40 -113 90 15 305 145 -126 -189 132 54 257 -115 7 -147
6443 -147 -158 150 67 -25 -8 -58 268 66 11 -168 27 -117 -81 -73 -127 -103 -228 352 123 6 58 182 -132 -63
6467 -63 58 -225 -172 16 -58 160 -278 -176 145 146 41 146 257 -120 -3 -154 -55 -64 -74 -190 158 76 12 -249
$$ packed form
6298a82j4J57K93k98k8j39K01L3l23K95r1K32j24j8n4M0J65m30K25r3j43K92r4
6321i8j2J38Kj32K8l02L92Q2M1%j3O2k43L24k1k14k7j29J44L0kJ79l04j12R9J52
6347F4k2j15n0N8j1J93j86JM2j14J72N3q2K7Qj30J89O4k50L51n2m67K19J8pQ0
6373E3r4j6L28kj1l22j04K09Q3j47J39r3j61M0K29m17M27j07L9m5l53L44j40K93
6397A72J3k25j80K52j98q1K12m8j83K21k58L39q7j96J16O6%k93O75m20J51l03
6419b55L11km6Q9r4k56Q0L8J13K6L6j53K03p5K90j60k71o3L21p8K03l72J22j54
6443a47j1L08q3r2J7n0L26k02n5j79J95j44L6Qn4K4j25N80k29j17N2J24l14O9
6467f3J21k83N3J88p4K18m38J02L21Jj05J05J11l77J17j51R9rj0j16L48q2o4k61
$$ plain form
6491 -249 -126 91 83 119 101 -58 -142 -153 -123 55 101 9 -158 17 -108 234 -12 -134 -22 112 -151 4 -135
6514 -135 95 -25 69 -238 108 -215 -103 184 -21 -72 161 313 -106 -79 -167 -149 196 43 1 -288 137 -29
6536 -29 -103 140 -165 126 -63 -170 -106 -255 -140 37 83 -425 85 87 33 3 -152 124 211 -43 472 115 -105
6559 -105 -187 -90 -72 16 234 64 -232 21 -245 -10 -39 49 -4 94 -165 194 91 191 -129 -290 -64 -100 259
6582 259 -386 35 75 40 268 25 53 154 24 128 123 63 95 -61 68 145 -151 -64 55 124 -83 118 66 200
$$ packed form
6491b49J23K17qL6j8j59q4j1L0J78M6r2j67J75j25L42k46j22J12J34k63J55j39
6514a35K30j20R4l07L46l23J12K87k05n1K33J52m19K7q8J8L45j53m2k89M25j66
6536b9p4K43l05K91j89j07O4j49J15J77M6n08N10Kn4l0j55K76Q7k54N15l57k20
6559a05q2R7J8Q8K18j70k96K53k66K35k9Q8n3R8k59L59j03J00l20j61K26l6L59
6582B59o45M21M0l5K28k43K8J01j30J04no0L2j56J29P7k96Q7J19O9k07K01n2J34
$$ [...]
8191B71
##END NTUPLES=NMR FID
##END=
