##TITLE=1H_DE-78H
 200.13MHz, D2O,
 8 sc
 
 28.1.2025
##JCAMPDX= 6.0         $$ Bruker NMR JCAMP-DX V2.0
##DATA TYPE= NMR FID
##DATA CLASS= NTUPLES
##ORIGIN= UXNMR, Bruker Analytische Messtechnik GmbH
##OWNER= pz
$$ XWIN-NMR		Version 3.5
$$ Tue Jan 28 14:20:28 2025 Russian Standard Time (UT+4h)  she@DPX200
##.OBSERVE FREQUENCY= 200.1313
##.OBSERVE NUCLEUS= ^1H
##.DELAY= (6, 6)
##.ACQUISITION MODE= SIMULTANEOUS
##.ACQUISITION SCHEME= undefined
##.AVERAGES= 8
##.DIGITISER RES= 18
##SPECTROMETER/DATA SYSTEM= spect
##.PULSE SEQUENCE= zg30
##.SOLVENT NAME= D2O
##.SHIFT REFERENCE= (INTERNAL, D2O, 0, 14.3821)
##AUDIT TRAIL= $$ (NUMBER, WHEN, WHO, WHERE, WHAT)
$$ ##TITLE= Audit trail, XWIN-NMR		Version 3.5
$$ ##JCAMPDX= 5.01
$$ ##ORIGIN= Bruker BioSpin GmbH
$$ ##OWNER= she
$$ F:/spectra/data/she/nmr/H-C/1/audita.txt
$$ ##AUDIT TRAIL=  $$ (NUMBER, WHEN, WHO, WHERE, WHAT)
(   1,<2025-01-28 14:19:50.17 +0400>,<she>,<DPX200>,
      <created by zg, POWCHK disabled, PULCHK disabled
       configuration hash MD5:
       00 E9 B6 7A A2 85 ED C7 34 08 36 98 17 FE 4E 26
       data hash MD5: 16K
       45 51 FC 94 CB 24 88 61 5A D5 30 07 AF 0E 32 1D>)
$$ ##END=
$$ 
$$ hash MD5
$$ E5 97 7A 4F 77 BA C1 D0 43 32 FB 66 82 06 44 DC
##$RELAX= 
##$RELAX= 
##$RELAX= 
##$RELAX= 
##$RELAX= 
##$RELAX= 
$$ Bruker specific parameters
$$ --------------------------
##$DU= <F:/spectra>
##$EXPNO= 1
##$NAME= <H-C>
##$PROCNO= 1
##$TYPE= <nmr>
##$USER= <she>
##$AMP= (0..31)
100 100 100 100 100 100 100 100 100 100 100 100 100 100 100 100 100 100 
100 100 100 100 100 100 100 100 100 100 100 100 100 100 
##$AQSEQ= 0
##$AQ_mod= 1
##$AUNM= <au_zg>
##$AUTOPOS= <>
##$BF1= 200.13
##$BF2= 200.13
##$BF3= 200.13
##$BF4= 200.13
##$BF5= 200.13
##$BF6= 200.13
##$BF7= 200.13
##$BF8= 200.13
##$BYTORDA= 1
##$CFDGTYP= 0
##$CFRGTYP= 5
##$CHEMSTR= <none>
##$CNST= (0..31)
1 1 145 1 1 1 1 1 1 1 1 1 1 1 1 1 1 1 1 1 1 1 1 1 1 1 1 1 1 1 1 1 
##$CPDPRG= <>
##$CPDPRG1= <>
##$CPDPRG2= <>
##$CPDPRG3= <>
##$CPDPRG4= <mlev>
##$CPDPRG5= <mlev>
##$CPDPRG6= <mlev>
##$CPDPRG7= <mlev>
##$CPDPRG8= <mlev>
##$CPDPRGB= <>
##$CPDPRGT= <>
##$D= (0..31)
0 0.7 0 0 0 0 0 0 0 0 0 0.03 0 0 0 0 0 0 0 0 0 0 0 0 0 0 0 0 0 0 0 0 
##$DATE= 1738059589
##$DBL= (0..7)
120 120 120 120 120 120 120 120 
##$DBP= (0..7)
150 150 150 150 150 150 150 150 
##$DBP07= 0
##$DBPNAM0= <>
##$DBPNAM1= <>
##$DBPNAM2= <>
##$DBPNAM3= <>
##$DBPNAM4= <>
##$DBPNAM5= <>
##$DBPNAM6= <>
##$DBPNAM7= <>
##$DBPOAL= (0..7)
0.5 0.5 0.5 0.5 0.5 0.5 0.5 0.5 
##$DBPOFFS= (0..7)
0 0 0 0 0 0 0 0 
##$DE= 6
##$DECBNUC= <off>
##$DECIM= 32
##$DECNUC= <off>
##$DECSTAT= 4
##$DIGMOD= 1
##$DIGTYP= 9
##$DL= (0..7)
0 120 120 120 120 120 120 120 
##$DP= (0..7)
150 150 150 150 150 150 150 150 
##$DP07= 0
##$DPNAME0= <>
##$DPNAME1= <>
##$DPNAME2= <>
##$DPNAME3= <>
##$DPNAME4= <>
##$DPNAME5= <>
##$DPNAME6= <>
##$DPNAME7= <>
##$DPOAL= (0..7)
0.5 0.5 0.5 0.5 0.5 0.5 0.5 0.5 
##$DPOFFS= (0..7)
0 0 0 0 0 0 0 0 
##$DQDMODE= 0
##$DR= 18
##$DS= 0
##$DSLIST= <SSSSSSSSSSSSSSS>
##$DSPFIRM= 0
$$ [...]
##$SUBNAM0= <"">
##$SUBNAM1= <"">
##$SUBNAM2= <"">
##$SUBNAM3= <"">
##$SUBNAM4= <"">
##$SUBNAM5= <"">
##$SUBNAM6= <"">
##$SUBNAM7= <"">
##$SUBNAM8= <"">
##$SUBNAM9= <"">
##$SW= 18.0517328524113
##$SWIBOX= (0..15)
0 0 2 0 0 0 0 0 0 0 0 0 0 0 0 0 
##$SW_h= 3612.71676300578
##$TD= 16384
##$TD0= 1
##$TE= 0
##$TE2= 300
##$TE3= 300
##$TEG= 300
##$TL= (0..7)
0 120 120 120 120 120 120 120 
##$TP= (0..7)
150 150 150 150 150 150 150 150 
##$TP07= 0
##$TPNAME0= <>
##$TPNAME1= <>
##$TPNAME2= <>
##$TPNAME3= <>
##$TPNAME4= <>
##$TPNAME5= <>
##$TPNAME6= <>
##$TPNAME7= <>
##$TPOAL= (0..7)
0.5 0.5 0.5 0.5 0.5 0.5 0.5 0.5 
##$TPOFFS= (0..7)
0 0 0 0 0 0 0 0 
##$TUNHIN= 0
##$TUNHOUT= 0
##$TUNXOUT= 0
##$USERA1= <user>
##$USERA2= <user>
##$USERA3= <user>
##$USERA4= <user>
##$USERA5= <user>
##$V9= 5
##$VALIST= <valist>
##$VCLIST= <CCCCCCCCCCCCCCC>
##$VD= 0
##$VDLIST= <DDDDDDDDDDDDDDD>
##$VPLIST= <PPPPPPPPPPPPPPP>
##$VTLIST= <TTTTTTTTTTTTTTT>
##$WBST= 1024
##$WBSW= 4
##$XGAIN= (0..3)
0 0 0 0 
##$XL= 0
##$YL= 0
##$YMAX_a= 736716
##$YMIN_a= -872395
##$ZGOPTNS= <>
##$ZL1= 120
##$ZL2= 120
##$ZL3= 120
##$ZL4= 120
##$ABSF1= 10
##$ABSF2= 0
##$ABSG= 5
##$ABSL= 3
##$ALPHA= 0
##$AQORDER= 0
##$ASSFAC= 0
##$ASSFACI= 0
##$ASSFACX= 0
##$ASSWID= 0
##$AUNMP= <proc_1d>
##$AZFE= 0.1
##$AZFW= 0.1
##$BCFW= 1
##$BC_mod= 2
##$BYTORDP= 1
##$COROFFS= 0
##$CY= -3
##$DATMOD= 1
##$DC= 2
##$DFILT= <>
##$DTYPP= 0
##$F1P= 0
##$F2P= 0
##$FCOR= 0.5
##$FTSIZE= 0
##$FT_mod= 4
##$GAMMA= 1
##$GB= 0.15
##$INTBC= 1
##$INTSCL= 1
##$ISEN= 128
##$LB= 0.25
##$LEV0= 0
##$LPBIN= 0
##$MAXI= 10000
##$MC2= 0
##$MEAN= 0
##$ME_mod= 0
##$MI= 1.114404
##$NCOEF= 0
##$NC_proc= 0
##$NLEV= 6
##$NOISF1= 3.799351
##$NOISF2= 2.8
##$NSP= 1
##$NTH_PI= 0
##$NZP= 0
##$OFFSET= 14.38212
##$PC= 1
##$PHC0= 235.7876
##$PHC1= 32.59222
##$PH_mod= 1
##$PKNL= yes
##$PPARMOD= 0
##$PSCAL= 0
##$PSIGN= 0
##$REVERSE= no
##$SF= 200.129724274929
##$SI= 16384
##$SIGF1= 3
##$SIGF2= 2
##$SINO= 400
##$SIOLD= 16384
##$SREGLST= <1H.CDCl3>
##$SSB= 0
##$STSI= 0
##$STSR= 0
##$SW_p= 3205.1282051282
##$SYMM= 0
##$S_DEV= 0
##$TDeff= 0
##$TDoff= 0
##$TI= <>
##$TILT= no
##$TM1= 0
##$TM2= 0
##$TOPLEV= 0
##$USERP1= <user>
##$USERP2= <user>
##$USERP3= <user>
##$USERP4= <user>
##$USERP5= <user>
##$WDW= 1
##$XDIM= 8192
##$YMAX_p= 0
##$YMIN_p= 0
$$ End of Bruker specific parameters
$$ ---------------------------------
##NTUPLES= NMR FID
##VAR_NAME=  TIME,          FID/REAL,        FID/IMAG
##SYMBOL=    X,             R,               I
##VAR_TYPE=  INDEPENDENT,   DEPENDENT,       DEPENDENT
##VAR_FORM=  AFFN,          ASDF,            ASDF
##VAR_DIM=   8192,          8192,            8192
##UNITS=     SECONDS,       ARBITRARY UNITS, ARBITRARY UNITS
##FACTOR=    0.0002768,     1,               1
##FIRST=     0,             0,               0
##LAST=      2.2672688,     0,               0
##MIN=       0,             -872395,         0
##MAX=       2.2672688,     736716,          0
$$ Real data points
##PAGE= N=1
##DATA TABLE= (X++(R..R)), XYDATA
0@%%%%%%%%%%%qQqJ6j6J6j6K4l2M0n2O0p2Q2r3J11j28J46j67J90k18K48k80L16
$$ 0 0 0 0 0 0 0 0 0 0 0 0 -8 0 -8 8 -8 8 -8 16 -16 24 -28 32 -40 42 -51 60 -68 78 -89 101 -117 131 -149 167
35A67l55M00m48N01n59O22o91P66q49R37j035J144j259J387j530J685j857K048
$$ 167 -188 212 -236 265 -294 328 -363 403 -446 491 -544 600 -659 728 -802 883 -974 1074
53A074k260K497k767L073l424L836m321M903n623O533p728R378j1804J5740k3222
$$ 1074 -1186 1311 -1456 1617 -1807 2029 -2292 2611 -3012 3521 -4207 5171 -6633 9107 -14115
68a4115M2532j91314n69084j40414J40275L80737M65087M08679J69768p6951l02933
$$ -14115 28417 -162897 -731981 -872395 -732120 -351383 113704 522383 692151 615200 312267
79C12267l95313l35352j46995M7732K40736L37564K87895J28468m0737k04470
$$ 312267 -83046 -418398 -565393 -517661 -276925 60639 348534 477002 436265 231795
89B31795k84249k34632j03389K8737J59183K32322K03804J00607k0343j40625
$$ 231795 -52454 -287086 -390475 -361738 -202555 29767 233571 334178 313835 173210
99A73210k00423j68328q3118J5546J16125J65714J39597P3986o265r5853j40136
$$ 173210 -27213 -195541 -278659 -263113 -146988 18726 158323 232309 226044 130191 -9945
110i945j19158o7612n91Q1085J23053J04228N6691l165o8319r8346q4701n2223
$$ -9945 -129103 -196715 -197306 -116221 6832 111060 167751 164586 96267 -2079 -86780 -139003
122a39003k347N6218Q2511P2261M9204N237m8814p2964o1648m0922l790M0313
$$ -139003 -141350 -85132 -2621 69640 118844 124081 75267 2303 -59345 -100267 -104057 -63744
134f3744N7986N2140L7149N457l3164m9049m5215l4044m611K9159M1637L8557
$$ -63744 -5758 46382 83531 88988 55824 6775 -38440 -72484 -77095 -47936 -6299 32258
146C2258K8862L370k3780l3254l1912k6033m813J9185K8161K8729K3697L626j7502
$$ 32258 61120 64490 40710 7456 -24456 -50489 -55302 -36117 -7956 20773 44470 48096 30594
159C0594k3623k4394j9211k851J3399J8542K1199J7628L062j0708j6078j8675
$$ 30594 6971 -17423 -36634 -39485 -26086 -7544 13655 31283 34345 23637 7559 -11116
171a1116j6108k584J0096J3324J5817J3247J339p091j0264j3571j1999k222N636
$$ -11116 -27224 -29808 -19712 -6388 9429 22676 24015 16924 6660 -6911 -18910 -21132 -15496
184a5496Q824J3098J0127J443n275p800j0158q162j041L198N873R121P711J537
$$ -15496 -6672 6426 16553 17996 12721 4921 -5237 -13399 -14440 -11242 -5369 3752 11463 13000
198A3000k595n450q718o520n59K048M378P277N037P34j235l350n966m974q58J200
$$ 13000 10405 4955 -3763 -10283 -10842 -8794 -4416 2861 7898 8632 7397 4047 -1919 -6893 -7751 -6551
214f551K682N817M036N57n27k561m447l498p34l47K614M029L028N74l5j974l865
$$ -6551 -3869 1948 5984 6541 6014 3453 -994 -4492 -5226 -5573 -2959 1070 4098 4672 4637 2663 -1202
231a202k187m23j69J905K856J964O17P9j328k495j462q91m16J380K539R26Q40
$$ -1202 -3389 -3812 -3981 -2076 780 2744 3361 3440 2112 -383 -1845 -2736 -3152 -1772 767 1693 2533
248B533K90j648j581r54q19l52J279J554P80O07J93m92j306r66o26q8P40R33P10
$$ 2533 2823 1175 -406 -1360 -2179 -2531 -1252 302 1082 1689 1882 1390 84 -882 -1508 -1596 -856 77 787
267G87N71ro04o42q15m27l44P85N82P53J50K59n19k83n62m90q1M45N60K19K65
$$ 787 1358 1349 745 103 -712 -1139 -1483 -698 -116 637 787 1046 527 244 -318 -808 -889 -444 116 335 600
288F00J81k55l26n72k09o9M96M22On6K45j77k41j03p6m49L31j13K72N74k45J28
$$ 600 781 526 200 -372 -581 -650 -154 268 274 218 463 286 45 -58 -134 -583 -252 -365 -93 481 236 364
310C64q4m65q6k24N5K69L4N57k12k03J13N3m97K7j5L79J01K02J75l79n9J15l04
$$ 364 280 -185 -271 -495 -440 -171 -137 420 208 5 118 171 -326 -299 -314 65 166 368 543 164 105 220 -84
333h4k4J4q8K80P4l00J98L9k51j5J30n5J87k46K52r1R4J1l27K36j27m4p9J26k9
$$ -84 -108 -94 -182 98 172 -128 70 109 -142 -157 -27 -82 105 -141 111 20 114 125 -202 34 -93 -137 -216 -90 -119
358a19J19J4M1k47K37k8l9j36J68pQ7j87o8K29q4j34O0L3J48q2j06K44k02L9R4
$$ -119 0 14 55 -192 45 17 -22 -158 10 3 90 -97 -165 64 -20 -154 -94 -61 87 5 -101 143 -59 -20 74
383G4J5j50O6K11l38j9K24n3j72K73k93J94J16m37M05k11K39n2j74J43j28Pm0
$$ 74 89 -61 5 216 -122 -141 83 30 -142 131 -162 32 148 -289 116 -95 144 92 -82 61 -67 -60 -100
406a00J53k29Q2rK28p7J21k74J18j6k17J77M02k90j35K44l16P8K90k07O3J83n6
$$ -100 53 -176 -94 -103 125 48 169 -105 13 -3 -220 -43 359 69 -66 178 -138 -60 230 23 86 269 213
429B13k46o0L56o16L1M9J96J34J3l4r5PP0ll2J08K2l58N8j42J93K37m57L79j06
$$ 213 -33 -93 263 -353 -322 -273 -77 57 70 36 -59 -52 18 15 -17 91 113 -245 -187 -329 -136 101 -356 23 -83
454h3L12Qp9j24K84m7m69R3K4M9p7j16K27J86rk54L04k24j09m4J46L75m82l6J41
$$ -83 229 237 158 34 318 271 -198 -105 -81 -32 -109 -225 2 188 179 -75 229 5 -104 -148 -2 373 -109 -145 -4
479dj04K6J20O3j85K14J9j02Q7O6k47o3J10j28J17M6r1M2j16J61k41L26k43J27
$$ -4 -108 -82 38 101 -84 130 149 47 134 200 -47 -110 0 -128 -11 35 -56 -14 -130 31 -210 116 -127 0
503@J33M9l24K43n8P0l83L23m20M81Q0j76j9L5J07p9j6J92j79k90K69r1k5J32
$$ 0 133 182 -142 101 43 113 -270 53 -367 114 194 18 -1 34 141 62 46 238 59 -231 38 -53 -78 54
527E4m57N42j98rK2r0J60J45o8K4l8m4JP8M0l20J06N8Q0j45j0J71j87M8K00j83
$$ 54 -403 139 -59 -68 -46 -136 24 169 101 125 87 43 44 122 162 -158 -52 6 86 -59 -69 102 -85 -37 163 -20
553b0j62K55L6k5l04K84r9P9k06L37j59j13M08k88q1K40j22j29p5Q4j9K46l74
$$ -20 -182 73 109 84 -220 64 -35 44 -162 175 16 -97 311 23 -58 182 60 -69 -144 -60 -79 167 -207
576b07M36m27K83q2k49L44KR0l71J71K49j9q8j59L80l17J35k38K43k7j06p3j95
$$ -207 229 -198 85 3 -246 98 100 190 -181 -10 239 220 132 -27 353 36 171 -67 176 149 43 -30 -225
599b25O7o6K35K19j92K18j65k55J75L4Pj04M8j1p8PK70j59LqJ41l42o0O5J04J43
$$ -225 -158 -224 11 230 38 256 91 -164 11 45 52 -52 -4 -15 -93 -86 184 25 28 20 161 -181 -241 -176 -72 71
625G1o1K4J92k05P7r5M9m87L00K29j73OK00J01j78K29k6k67l2J00K7q2o4M3l6
$$ 71 10 34 226 21 98 3 52 -435 -135 94 -79 -73 127 228 50 279 253 -14 -46 54 81 -1 -65 -22 -58
650e8J69j70m7J28K9J71j9j94o1q4J73p8J37j05j37J63n0q8K06J7%j15M7P1M1
$$ -58 111 -59 -106 22 51 222 203 9 -52 -136 37 -41 96 -9 -146 17 -33 -121 85 102 102 -13 34 105 146
675A46m01K59J01k05k3K45k04Q4N3j67q2l4K43j19M0K04m27J05J15K16j35N8j96
$$ 146 -255 4 105 -100 -123 122 -82 2 55 -112 -194 -228 15 -104 -64 140 -287 -182 -67 149 14 72 -124
698a24J28j83O4J6R6r4K80ql3l82J80j00L5N3j36J75lj80L12k2j92K16j42K63
$$ -124 4 -179 -115 -99 -3 -97 183 175 142 -240 -60 -160 -125 -72 -208 -33 -36 -216 96 74 -118 98 -44 219
722B19l75J73p8J66k75k54L31o4n6J78N1K13l17K9j33L30Qj38j22L45l25P3J5
$$ 219 -156 17 -61 105 -170 -424 -93 -157 -213 -35 16 229 -88 -59 -192 138 146 8 -114 231 -94 -21 -6
745fj3K4p8M70n26mK21r2J55m7j19K31j07j82PL32n41K03j68M2K16L6j31Q9l9
$$ -6 -19 5 -73 397 -129 -133 88 -4 151 104 -15 216 109 -73 -66 266 -275 -72 -240 -198 18 54 -77 12 -27
770b7J81k2p5J31q1j28k4M0K56k66K07M5m04K77M1j4j31j36M5M6K29p8l4j94J49
$$ -27 154 132 57 188 107 -21 -45 -5 251 -15 192 237 -167 110 151 137 6 -130 -85 -39 190 112 78 -116 33
795C3K37j52o3j11N4o9K16k10l8L0J9j00O2K09j92R2N2j0p8Q7J07l23Q6j19J90
$$ 33 270 118 55 -56 -2 -71 145 -65 -103 -73 -54 -154 -92 117 -75 17 69 59 -19 68 175 -148 -62 -181 9
820Io6K26l33J11q5K35l17K60q4J19K09k32k57M2N42o0j05k14M7p9J45j09O0j70
$$ 9 -57 169 -164 -53 -138 97 -220 40 -44 75 284 52 -205 -163 379 319 214 0 47 -32 113 4 64 -106
844a06p5N4k7L75k58L95l36j68J6K86p3j23k05K86L4J05l10J16j3p7K66j83j22
$$ -106 -181 -127 -154 221 -37 358 22 -146 -130 156 83 -40 -245 41 75 180 -130 -14 -27 -104 162 -21 -143
867a43o8K56O4N8m62L93J73j95k64L16o8ok00Q3J38Mq5j16L83m2j87n0K30j19
$$ -143 -211 45 109 167 -295 98 271 76 -188 128 60 54 -146 -63 75 79 -6 -122 261 219 32 -18 212 93
891I3j16R9j03j14J48j45L21K1L0k49k16L50j05O2l27L89l53M11O6k76P2L6J71
$$ 93 -23 76 -27 -141 7 -138 183 204 234 -15 -231 119 14 76 -251 138 -215 196 262 -14 58 94 265
914B65k78J19j59J54j88K9O3M0m1J6M7N5j42J0K88k24j71L3J17o6l82L60J73n5
$$ 265 -13 106 -53 101 -87 -58 5 45 4 20 67 122 -20 -10 278 54 -117 -84 33 -33 -415 -55 118 63
938F3K02m2l19j00k7K07o2M2L1r7j6K62j71m1J32j32L2N8l10M41k45Q2j92J89
$$ 63 265 223 -96 -196 -223 -16 -78 -36 -5 -102 -118 144 -27 -68 64 -68 -36 22 -288 153 -92 -10 -202 -13
962a3p8J1Kj41J93L8J34oL2l8k78K01J35l28q7L19k38P9k3J49k1m4n0k48K94N3
$$ -13 -91 -80 -78 -219 -26 12 146 140 172 134 -144 57 192 -136 -223 96 -142 -63 -86 63 42 -2 -52 -300 -6 47
988D7j20J22k01K47j27L4RQ5n7%L4o2N9k77M01q2j30q1M4Ok25J87q8K39n3j37
$$ 47 -73 49 -152 95 -32 2 11 96 39 39 73 11 70 -207 194 112 -18 -99 -55 -49 -274 -87 -175 64 11 -126
1014a26J83K29k30J80m3o1oo6m0o7j65k4N55l84k69N64p08O20k71K25r6j09r5
$$ -126 57 286 56 236 193 132 126 60 20 -47 -212 -236 319 -65 -334 230 -478 142 -129 96 0 -109 -204
1037b04K57j97K41j80j89J66J85l04O5K1L21k15n2K52O3k97L80l35J46n3j81J23
$$ -204 53 -144 97 -83 -272 -106 79 -225 -160 -139 182 -33 -85 167 230 -67 313 -22 124 71 -110 13
1059A3P8j81Q0J34j54j16J02M3J51j20J09k78n0M0J21P1O9K07l36J38J35k93J97
$$ 13 91 -90 -10 124 -30 -146 -44 -1 150 30 139 -139 -189 -149 -28 43 112 319 -17 121 256 -37 160
1082A60J8j13j17P6j0N8Ll5k34K97k99K97K97l66j94j37L43K12l44J4j22K55n
$$ 160 178 65 -52 24 14 72 75 40 -194 103 -196 101 398 32 -162 -299 44 256 -88 -74 -196 59 54
1105E4l4J12r5J21k51J96k29J13k20J24J58kq9O4j5k9k7JM3p0L7J83m54K46L65
$$ 54 20 132 37 158 -93 103 -126 -13 -233 -109 49 47 -42 22 7 -22 -49 -48 -5 -75 -38 145 -309 -63 302
1130C02m2j68j85k59M74k12K09l25K79k1k8j44J30j36Q2j79L0J38j78J74K04k07
$$ 302 260 92 -93 -352 122 -90 119 -206 73 52 24 -120 10 -126 -44 -223 -193 -55 -233 -59 145 -62
1152f2M27n80J64K74l24J4k22N18j74j1J57j27m3l7J18k03J45k31M79k94K20o7
$$ -62 365 -215 -51 223 -101 -87 -309 209 35 24 181 54 11 -26 92 -111 34 -197 282 -12 208 141
1174A41j83N3L04k40j45m6P1J12j62K3j53K56j97L88L0l02K06j03j0j0Q0j83K
$$ 141 -42 11 315 75 -70 -116 -45 67 -95 -72 -225 31 -166 222 252 -50 156 53 43 33 113 -70 -68
1197f8J62J2o8J8l19L05J93k83k15M62j86M6j14L31q5m19K67j28J12k0J18J14
$$ -68 94 106 38 56 -263 42 235 -48 -263 199 13 59 -55 276 191 -228 39 -89 23 3 121 235
1219B35j23k37Q2j5M9J14k30j08J81Pj25j45N05k62J27%J45j04J83n16L2J16k9
$$ 235 112 -125 -43 -58 -9 105 -125 -233 -52 -45 -170 -315 190 -72 55 55 200 96 279 -237 -205 -89 -118
1242a18K08j68K86j45j11q8k7J27j2M23m85Q9j18L48j64M6M5q4k25j6RL00N3o0
$$ -118 90 -78 208 63 -48 -136 -163 -36 -48 375 -110 -21 -139 209 45 91 136 52 -173 -189 -180 120 173 113
1266A13r6o9J40k34L15k11j76J32j7K18Kj89Q3n6R3M8K4j96K35p5l08R3L50k41
$$ 113 17 -52 88 -146 169 -42 -218 -86 -103 115 117 -72 11 -45 48 96 120 -76 159 84 -224 -131 219 -22
1290b2R6J65k77o4K20N6J99l09O8l00Q1J88j09k25L59k38J60J5j89L50k32P0k0
$$ -22 74 239 -38 -102 118 174 373 64 132 -168 -87 101 -8 -233 126 -112 48 63 -126 224 -8 62 42
1313D2R9j35n3J95j07J7k16p6M15O3n14O01m66J70J52k54lJ81J51k06Qk6l2j72
$$ 42 141 6 -47 148 41 58 -158 -234 181 244 -270 331 -135 35 187 -67 -70 111 262 56 64 38 6 -166
1337a66J16k15N65j59k41N1k62N39J00m71J24j00N72m77L07j06n14N12j29K8l47
$$ -166 -50 -265 300 141 -100 -49 -311 228 328 -143 -19 -119 453 -24 283 177 -337 175 46 74 -273
1358b73K54Q5M6q1j38J82j74J31k1j64K71k09n6P8Q8j06P0P2j39Q2j98J43J59
$$ -273 -19 66 112 31 -107 75 -99 32 11 -153 118 -91 -147 -69 19 -87 -17 55 -84 -2 -200 -57 102
1381A02m75N94j40Q4k33J73l93M61k36m8J17m0j30N9K97k10nj96J94k33K76o7
$$ 102 -373 221 81 165 -68 105 -288 173 -63 -111 6 -34 -164 -105 192 -18 -23 -219 -25 -258 18 -49
1403d9o5k65K87K13k48J0J28Q4q0O4j74j0L44m62K8J99J92k83K30j21j83N2o4
$$ -49 -114 -379 -92 121 -127 -117 11 95 15 79 -95 -105 239 -223 -195 4 196 -87 143 22 -161 -109 -173
1426a73j02K67j62n9L98j25j68K82p0j4o5j73L8M6M6N0J5k86J94j48J24j20K97
$$ -173 -275 -8 -170 -229 169 44 -124 158 88 74 9 -164 -126 -80 -34 16 31 -255 -61 -209 -85 -205 92
1449I2l18K92r6L74l03k29M17k9k08Oq7J63j98j49L80o1O3j9j06J8P5J05r2j0
$$ 92 -226 66 -30 344 41 -188 229 200 -8 -2 -89 74 -124 -273 107 46 109 90 -16 2 77 182 90 80
1473H0k21K54k27J50k11J91J00n6O0L8j05L2k61J94n7L79m50J08J0J04J11m23
$$ 80 -141 113 -114 36 -175 16 116 60 120 158 53 85 -176 18 -39 340 -110 -2 8 112 223 -200
1495b00K00Pj3J23j26P8lk5N4j71j37M85K2m99L48j03M0J18j40j74J83j48K30
$$ -200 0 7 -6 117 -9 69 66 41 95 -76 -213 272 294 -205 143 40 80 198 58 -116 67 -81 149
1518A49j28j42K81j63j24K07p7J8K85r5l75Q5NJ13P8N3k68M42m09K79k11m4O0
$$ 149 21 -121 160 -3 -127 80 3 21 306 211 -164 -79 -74 39 117 170 -98 344 -65 214 3 -41 19
1541A9j05J71J95j98J58j26l7j22nM9J82m83L61k28K71OK52m12J53j31k22L69
$$ 19 -86 85 280 82 240 114 77 -45 -50 -1 181 -302 59 -169 102 108 360 -52 101 -30 -252 117
1563A17k84L10k24J39J56p6K34m16M9J68j96K47j46j33L36o39J46L69j64K1j47
$$ 117 -167 143 -81 58 214 138 372 -44 5 173 -23 224 78 -55 281 -358 -212 157 -7 14 -133
1584a33K70j84n1J93m17L95Mj53J86K0k20N3K45k83R0L9k36M47m44L04K9k37J4
$$ -133 137 -47 -98 95 -322 73 77 -76 110 130 -90 -37 208 -75 15 54 -182 265 -179 125 154 -83 -69
1607f9J84k65J36L7K7N6j59O6k43J70j0K17j09j37K22j92j9j06J80j45R4P0M6
$$ -69 115 -150 -14 23 50 106 -53 13 -230 -60 -70 147 38 -99 123 -69 -88 -194 -14 -159 -65 5 51
1630E1k03J35K09j23O0l1j88L00j56%K00l06k15k36M10j51J01L90o0j97J60p5
$$ 51 -152 -17 192 69 129 98 -90 210 54 54 254 -52 -267 -503 -93 -244 -143 247 187 -10 150 75
1652G5j07J53j83L2kK23l16J82j34l24J75j17L96K32l26j31P1n0J60L3n1q2Q5
$$ 75 -32 121 -62 -30 -32 191 -125 57 -77 -401 -226 -343 53 285 -41 -172 -101 -151 9 42 -9 -91 -6
1675fJ72j82J40j74k6j15J09k62J54J17rr6K12N4j43R5K28m02K68j34K67k34j18
$$ -6 166 -16 124 -50 -76 -191 -82 -344 -190 -73 -82 -178 34 88 -55 40 268 -134 134 0 267 33 -85
1698h5k1J28j28q4J28j83L21j7j2J3P3l06J78m4L73m55N4J32j48J18l6M9k08J37
$$ -85 -106 22 -106 -190 -62 -245 76 59 47 60 133 -173 5 -39 334 -121 -67 65 -83 35 -1 48 -160 -23
1722b3K58l47R4l26L26K6j59J48J52p9k30R1M0K21l05K61j5j37R1O7j32k1l5k46
$$ -23 235 -112 -18 -344 -18 8 -151 -3 149 70 -160 -69 -29 192 -113 148 133 -4 87 154 22 1 -34 -280
1746b80J94M2K48m6j84p1j34K68k56M60o2l48J71k6N3J53j72j59K17j51q3Q3K80
$$ -280 -86 -44 204 158 -26 -97 -231 37 -219 241 179 -169 2 -24 29 182 10 -149 68 -83 -166 -83 197
1769A97k55J21K08M7n10M03j6m34K98J6r3l0O8O5P9q0j06j17J53N1j27n7J83j
$$ 197 -58 63 271 318 -192 211 195 -239 59 75 -18 -48 20 85 164 84 -22 -139 14 65 -62 -119 64 63
1793F3k97J30L40j17J34m67K27J93j54M2Q5k82l3j11J48J01n0J39k47j85L76j46
$$ 63 -234 -104 236 119 253 -214 13 206 52 94 179 -103 -136 -247 -99 2 -48 91 -156 -341 35 -111
1815a11J04R7J42m4l00J91j12J39k08L5LJ27j36K25j36j3O1Jj36j09L55l44M4
$$ -111 -7 90 232 188 -112 79 -33 106 -102 -67 -64 63 -73 152 16 3 64 65 -71 -180 175 -169 -125
1838a25r6K32l31K95l3o3L6Q5j02K15k54L82k39n3k94J50L8M97l24k07J72J46
$$ -125 -221 11 -320 -25 -58 -121 -85 0 -102 113 -141 241 2 -51 -345 -195 -157 340 16 -191 -19 127
1860A27n5K1k19N5J07q0L67m2j16j78L2lQ0N2l24L49j08k26Q5L76k44k71J03J01
$$ 127 72 93 -126 -71 36 -44 323 281 165 -13 19 16 96 148 -176 173 65 -161 -76 300 56 -215 -112 -11
1884a1j77K60M6J36m7m69J61K73m52K12%K84j39q8o1J98l0k34L70j8k15J7K31
$$ -11 -188 72 118 254 207 -262 -101 172 -280 -68 -68 216 77 -11 -72 126 96 -138 232 214 -1 16 247
1907B47k23p5rj05K5J80QJ51q9O4lj02j42J73K78l7r8l61J69j88mJ60k29K10O7
$$ 247 24 -51 -60 -165 -140 40 48 199 110 174 171 69 -73 100 378 341 243 -118 51 -137 -141 19 -210 0 67
1932F7m0R3k70K22n5M6l66L56J23l16j86M34k19J23J42j44j52J30p6L0R3j35K36
$$ 67 27 120 -150 72 17 63 -303 53 176 -140 -326 108 -111 12 154 10 -142 -12 -88 -58 35 -100 136
1955A36j35J40l4p4O7J20j88R7k71J3J78j38j00L1J09J39J27r7N2m05L79n0q4
$$ 136 1 141 107 33 100 220 32 129 -142 -129 49 -89 -189 -158 -49 90 217 120 172 -233 146 96 12
1978A2J3j14M39l55q4L50J78m35M5oj07Ok10K45j67L76j18j52K67m46L27o9J34
$$ 12 25 -89 350 -5 -89 261 439 4 49 43 -64 -58 -268 -23 -190 186 68 -84 183 -263 64 -5 129
2001A29j4M3k28J32rn5p7O2J23l6m4P4l82L35l4N3l93K39p2M24k73j1k14J22J47
$$ 129 115 158 -70 62 53 -2 -79 -17 106 70 26 100 -282 53 19 72 -321 -82 -154 270 -3 -14 -228 -106 41
2026D1J20n6k54J72J44k17r6mJ72Pk9K43n68M12Q9M7k51L2k42OK02R3J6n7j36
$$ 41 161 105 -149 23 167 -50 -146 -150 22 29 0 243 -325 87 176 223 -28 4 -238 -232 -30 63 79 22 -114
2051a14L39j17n7k21L46l01k6M31l26O5j74q4L08K4k30K89k2j76L11Qn01J83p2
$$ -114 225 108 51 -170 176 -125 -151 280 -46 19 -155 -239 69 93 -137 152 130 -46 265 273 -228 -45 -117
2074a17J99Mj75L83k62J03Kl2l2j49J53K35m39J43k81K30O7m7P5J46k87K59m11
$$ -117 82 86 -89 294 32 135 137 105 73 -76 77 312 -127 16 -265 -35 32 -15 60 206 -81 178 -233
2097b33J24K25Oj92N6J82k24K75O4k46j73o9n3M33q0j09o0K73L5k01N5j63J94
$$ -233 -109 116 122 -70 -14 168 -56 219 283 37 -136 -205 -258 175 95 -14 -74 199 234 33 88 -75 119
2120A19k99L31k09J25j64J91J5r3n0m0K02k97J97p9K13K5k56P3j35J88j06K75
$$ 119 -180 151 -58 67 -97 94 109 16 -34 -74 128 -169 28 -51 162 187 -69 4 -131 57 -49 226
2142B26j64j47J49k04l4J18mO7J01R0r4l4j20j03K85j80R9j7k87M17k3k22P8Q
$$ 226 62 -85 64 -140 -174 -56 -60 7 108 198 104 70 -50 -153 132 -48 51 34 -253 164 141 -81 -3 5
2166Ej16O2L25j39nm32K04m6J15J41r0K04m6Nj19J50l79L41k46K47j23j80J37
$$ 5 -111 -49 276 137 132 -300 -96 -142 -27 114 24 228 182 187 68 218 -161 180 -66 181 58 -122 15
2189A5j22K85j44n4p4K36l24k4L38J43k38p6P9k38M6qK58k75J83J01n8r5J76l0
$$ 15 -107 178 34 -20 -94 142 -182 -206 132 275 37 -39 40 -198 -152 -160 98 -177 6 107 49 -46 130 100
2213A00J73j65l70L59k78K48k98M12l59J62L88m78K66k94K72k82J93j17m0kp8
$$ 100 273 108 -262 97 -181 67 -231 181 -178 -16 372 -106 160 -134 138 -144 49 -68 -108 -110 -188
2234a88K77j7J71m83J46j71M05M6k20K34k92K55J52l19r0m4K81q1K5j44QM6J03
$$ -188 89 72 243 -240 -94 -265 140 186 -34 200 -92 163 315 -4 -94 -138 143 62 87 -57 -49 -3 100
2257A00m8q8k4R6k6j85K55j19k92J93K03j01J86j28J8n5R9J17l78M3k16J82R1
$$ 100 52 -36 -60 36 10 -175 80 -39 -331 -138 65 -36 150 22 40 -15 84 201 -177 -134 -350 -168 -77
2280g7j23K95l07M75j80N4k43M4j08M33l67k04M20k20J87n4l18L33m18L32L3j72
$$ -77 -200 95 -212 263 83 137 -106 -62 -170 263 -104 -308 112 -108 79 25 -293 40 -378 -46 -13 -185
2302a85Q6N5k4R4J38m14L13l3j8M3j53K33j64o9N2j2L34l02R4k0j18M9K03p2l19
$$ -185 -99 -44 -68 26 164 -250 63 30 12 55 -98 135 -29 -98 -46 -58 276 -26 68 48 -70 -21 182 110 -209
2327b09j61N12j64j9J3L26j02k38M4L6p5l2N6J46k36K31j00j30J86Rj48J61k09
$$ -209 -370 142 -22 -41 -28 298 196 -42 2 38 -37 -69 -13 133 -103 128 28 -102 84 93 -55 106 -103
2350a03J65J95l06J50p0K10m60K73J94k54K56k6l94O2k15L01L5N6j32R1j93K74
$$ -103 62 257 -49 101 31 241 -219 54 248 -6 250 224 -170 -108 -323 -22 13 69 -63 28 -165 109
2372A09k56J35M1QN9j56L8K13m04J18M28l53J56j40R4k64J1K81o8l87K93J2J27
$$ 109 -147 -12 29 37 96 -60 -22 191 -213 -95 333 -20 136 -4 90 -174 -163 118 50 -337 -44 -32 95
2395I5k6j13J70n4j3j29Pn8J75J14j78J4R2L8j86J81l06L4r6K00k34L25M4k85
$$ 95 69 -44 126 72 59 -70 -63 -121 54 168 -10 4 96 134 -52 129 -177 -143 -239 -39 -273 52 96 -189
2419a89M79m4j82Oj53J4J76L6j87R3k92J52L50j06k65K88k58p8k2O9p3K36j32
$$ -189 290 246 64 70 -83 -69 107 143 -44 49 -243 -91 259 153 -112 176 -82 -160 -182 -113 -186 50 -82
2442h2j58N4L99j15k10K19k76J25l0J34n5o0J7L3J01j46P9J15L75n68o4K23P5
$$ -82 -240 -186 213 98 -112 107 -169 -44 -74 60 5 -55 -38 -5 96 -50 29 144 519 -49 -113 110 185
2465A85k42O1K53m59K73j7j98K40l57J86O05m45N6q5O2j01Q1k13J8k9J41j34L02
$$ 185 -57 4 257 -202 71 54 -144 96 -261 -75 530 85 141 56 118 17 98 -115 -97 -126 15 -119 183
2488A83k10k22L23n11M58p9q8q0K63j67J86j62M69l64j98L68j39j81J36m16K44
$$ 183 -27 -249 74 -437 21 -58 -146 -226 37 -130 56 -106 363 -1 -199 169 30 -151 -15 -431 -187
2509a87n1K88k30Q8K6M66o32N1M00k15O0J69k97l0j81K67l72M62j3l39K24P3p0
$$ -187 -238 50 -180 -92 -66 400 -232 -181 219 4 64 233 -64 -94 -275 -8 -380 82 69 -270 -46 27 -43
2532d3l44M16k30K58j34N8K9J60n33N21j2j42QM6J01j8k04L60l59K77j6m7k89
$$ -43 -387 29 -201 57 -77 -19 10 170 -363 158 146 4 12 58 159 141 -63 297 -62 215 199 152 -137
2555a37P0q2p4K70o6k51L6M95m13J45j17J67J04k5k44J25l0j11N87l88j93L3j64
$$ -137 -67 -149 -223 47 -19 -270 -234 261 -152 -7 -124 43 147 122 -122 3 -27 -138 449 61 -132 -99 -263
2578b63K35J0p3l0R2l3k39L48j09J12rm32O28k77J37k24O4k7J59P6j40l02K42
$$ -263 -28 -18 -91 -121 -29 -62 -301 47 -62 50 41 -391 237 -40 97 -127 -63 -90 69 145 5 -297 -55
2601e5J44n04M74k45J77k3k89L18N3jo8K46j32J86k27N3k33j41K10Q1j34P8om1
$$ -55 89 -415 59 -186 -9 -32 -321 -3 50 49 -19 227 95 281 54 107 -126 -267 -57 24 -110 -32 -38 -79
2625g9K45j18l2K22m24O3R5o0j31M0L01n0j30J5j28K36j9o1J45k9k36K43j71J05
$$ -79 166 48 16 238 -186 -123 -28 -88 -219 -179 122 72 -58 -43 -171 65 46 -15 130 101 -135 108 -63 42
2649D2j14K20j91k7J65J10j51J89j81j19K22j45o3q1L06O8l72J7N3R1k6J90j86
$$ 42 -72 148 -43 -70 95 205 54 243 62 -57 165 20 -43 -124 182 250 -122 -105 -52 39 13 203 17
2672A7JK30l32L08k74K08j73J16l68K83k41J83M9k29K47k9k28J90M6p2J69j50
$$ 17 18 248 -84 224 -50 158 -15 101 -267 16 -225 -42 7 -222 25 -4 -232 -42 4 -68 101 -49
2694d9k69K78J34p1R5n2Q5k78J28R5j28L5J15L9m04M81m92L77N8p6l03K47j75
$$ -49 -318 -40 94 23 118 66 151 -127 1 96 -32 3 118 157 -247 234 -258 119 177 101 -202 45 -130
2717a30J14RM7J47l55N5L2P7j19K61N9l14k1J51k8j55K03k80J00K64r2l4p3O2
$$ -130 -16 -7 40 187 -168 -113 -81 -4 -123 138 197 -117 -138 13 -15 -170 33 -247 -147 117 25 -9 -82 -20
2741b0K36k39m4k64L06j7k45M58l72j9J37j57Q6R4J54O9l55K68j17mj67Q1J0J4
$$ -20 216 -23 -67 -331 -25 -42 -287 171 -201 -220 -83 -240 -154 -60 94 163 -192 76 -41 -45 -212 -131 -121 -107
2765a07J30l7M5J35j91L36k21j99M49k41l11J57O3k95L36k60N9RK23L15m28%M5
$$ -107 23 -14 31 166 -25 311 90 -109 340 99 -212 -55 8 -287 49 -211 -152 -143 80 395 -33 -33 12
2788A2J22k92L29L0j21k49J18j56K96j14J14L9j18j9k18K64K2k29N27l99mN3J63
$$ 12 134 -158 171 201 80 -169 -51 -207 89 -25 89 128 10 -9 -227 37 59 -170 357 -42 -46 7 170
2811A70ml43%K11J7K08K4k01J38l16K80l88M43m65J89mM8o0J40o0L63m02k14L80
$$ 170 166 -177 -177 34 51 259 283 82 220 -96 184 -204 239 -226 -37 -41 7 -53 87 27 390 -12 -226 154
2835A54l17K05j88N19j87j08J01r2Nj18P1j28M5j02l9L41k64or1L44J11m1j04
$$ 154 -163 42 -146 373 186 78 179 87 92 -26 45 -83 -38 -140 -179 162 -102 -108 -199 145 256 215 111
2858A11k4j04j35j48L16k46J76R9O0J30l60j47K80k06p5Q2J31q3j03M3M13m3l70
$$ 111 87 -17 -152 -300 16 -230 -54 45 105 235 -125 -272 8 -198 -273 -191 -60 -143 -246 -203 210 167 -203
2881b03O9J97j13J88j22j96K37k44L11k21n2L17l98K76k0L6p8r2L6J95l14n6L19
$$ -203 -134 63 -50 138 16 -180 57 -187 124 -97 -149 168 -230 46 26 62 -16 -108 -72 123 -191 -247 72
2904G2k54J75K17k23L26k10k87J42j07j52K28n3J34L41j44l84j35K88J88j41j49
$$ 72 -182 -7 210 -13 313 103 -184 -42 -149 -301 -73 -126 8 349 205 -179 -314 -26 162 21 -128
2925a28j9K8k50L07j3J62k39K18j36R0M16o37L41J59l71j69M75j09K0j28K53l51
$$ -128 -147 -119 -369 -62 -75 87 -152 66 -70 20 436 -201 140 299 -72 -241 234 125 145 17 270 -81
2947h1O6K07j35J21m94L78j71Q0L0j14K0J33j4j36K39k99L21l44J08R8r8J03j9
$$ -81 -15 192 57 178 -316 62 -109 -29 1 -113 -93 40 26 -110 129 -170 151 -193 -85 13 -85 18 -1
2970aj30M14l79q9K48j32K37Qm02L75j57q2J64p3j07J37J15n0k88K76m3k6Q3k2
$$ -1 -131 283 -96 -185 63 -69 168 176 -226 149 -8 -90 74 1 -106 31 146 96 -192 84 41 15 98 76
2994G6j9J3k13L43j24k6j71o3K94k18K67k74J15K13n0r5k32K74l18K47O6q1J61
$$ 76 57 70 -143 200 76 50 -121 -184 110 -108 159 -115 0 213 163 68 -164 110 -208 39 105 24 185
3017A85k90pK69k13K29J5q3M1q8q3n8J09r6r0J25J13J90l61O5O8N6k28K06K05
$$ 185 -105 -112 157 -56 173 188 105 146 58 -25 -83 26 -70 -160 -35 78 268 -93 -28 40 96 -132 74 279
3041B79l17p2J84j06j7k63M64p4J2k2j15J8J48k09J37m1M2R6N3q6O3P7k70K05
$$ 279 -38 -110 74 -32 -49 -312 152 78 90 68 -47 -29 119 -90 47 6 48 144 197 111 174 251 -19 186
3065A86j40K7k14J16N0J62k48j7lL4p3K45l05K53J92j12L28m58j17j21K67J75
$$ 186 46 73 -141 -25 25 187 -61 -78 -81 -47 -120 125 -180 73 265 153 481 23 -94 -215 52 227
3087B27m71J03M4j48L39N1k41p8Q9kQJ80p3nQ4q9M3j32K53Lj71Q6k48L17k78K06
$$ 227 -244 -141 -97 -245 94 145 -96 -174 -85 -87 -79 101 28 23 107 18 61 -71 182 185 14 100 -148 169 -109 97
3113I7o0o9k46L16J22k27K57O3l3k44O6NK13m26L50k32p2J53J05m12J88K39j14
$$ 97 37 -32 -278 38 160 -67 190 253 220 -24 42 47 260 -166 184 -48 -120 33 138 -274 -86 153 39
3136C9o3K25k98J75j11K6l71M44j94N7j22J84J30nj81K23q0Ol30J60j0J9K13o8
$$ 39 -24 201 -97 78 -33 -7 -378 66 -128 -71 -193 -9 121 116 -65 158 78 84 -246 -86 -96 -77 136 68
3160F8J4Q3j97L98l14k35oO6J25k60L26J33j74j96K09L1q5k46M20k10L56m39J88
$$ 68 82 165 -32 366 52 -183 -189 -123 2 -258 68 201 27 -169 40 71 -14 -260 160 -50 306 -133 55
3183E5N1J93j36r6j81p1l5N31j28j57K7o2p8j4K2q4K86k33L4P7J28l18m4r6K64
$$ 55 106 299 163 67 -114 -185 -220 311 183 26 53 -9 -87 -101 -79 -163 123 -110 -76 1 129 -189 -233 -329 -65
3208f5P3m2L8J09j7j17n8Q5R4p3o6k56J31K76k17K09m22L56j98M29k08k35J86
$$ -65 8 -34 4 113 96 -21 -79 6 100 27 -39 -295 -164 112 -105 104 -318 38 -160 269 61 -174 12
3231A2j08K57j86J30K5l36R6j20K95k31L85N0m96K98k08M15l63om7k0K80r9r6
$$ 12 -96 161 -25 105 130 -206 -110 -230 65 -166 219 269 -227 71 -137 278 -85 -91 -138 -158 122 23 -73
3254g3O7kj02J81J6j34q9J69J05j14l6j11K70Kk85L8P2J18q7m1L3k55J39J25n0
$$ -73 -6 -8 -110 71 87 -47 -136 33 138 24 -12 -123 147 149 -136 -98 -26 92 5 -36 -3 -258 -119 6 -44
3279d4j7m5J61K91j72Q0j20k48K6K0k4L62l58kN1Pml1m4K39j59j22Q5RN8n0Q1
$$ -44 -61 -106 55 346 174 254 134 -114 -88 -68 -92 270 -88 -90 -39 -32 -36 -67 -111 128 -31 -153 -68 -59 -1 -51 30
3306C0j81M28l03J99l96m2M13O6k52N9j18O1o7j50J83L47m43J06R4M9QO4j82r8
$$ 30 -151 277 -26 173 -223 -265 148 214 -38 21 -97 -36 -103 -253 -70 277 -166 -60 34 83 91 155 -27 -125
3330a25K53j32j7K2J07Q4l76R6K08J4Nj20l55M51j17O0R6j69o9J81J28m25J97
$$ -125 128 -4 -21 1 108 192 -184 -88 120 134 139 19 -336 115 -2 58 154 -15 -84 97 225 -200 -3
3353cK7O2j79J26J25J7j82J83m1j8Nk8o0N2Q2l4J43m49J42j63K43m7j92K77k6
$$ -3 24 86 -93 33 158 175 -7 176 135 117 122 94 34 86 168 134 277 -172 -30 -193 50 3 -189 88 62
3378F2j35j19K34k34j1K23K62j95j27R3l01J19m1L35j69K09j79j2J81k40mp8K37
$$ 62 -73 -192 42 -192 -203 20 282 87 -40 53 -248 -129 -170 165 -4 205 26 14 195 -45 -49 -127 110
3401A10n6j26K16qnj39J70k04M1J30j21j47J19m5N7J80j33J29k36K93k12p8J59
$$ 110 54 -72 144 136 131 -8 162 -42 -1 129 8 -139 -20 -65 -8 172 39 168 -68 225 13 -65 94
3424I4M0j66M4K94m32L83j04j30N5j84j21L9J07m2K14P6j52J21k24j80K69l3J61
$$ 94 134 -32 12 306 -126 257 153 23 78 -106 -227 -188 -81 -123 91 167 15 136 -88 -268 1 -32 129
3447A29l19K59m0j84N4j4L27l63J69J15j28R1o6J99l41J97J66l35J30k6Rj87R9
$$ 129 -190 69 29 -155 -101 -115 212 -151 18 133 5 96 30 229 -112 85 251 -84 46 20 29 -158 -59
3470e9L21M9j54k06j37L37l2k68K18L9k23L95k46J91j19o0j62J12K43l15P3J57
$$ -59 262 311 157 -49 -186 151 119 -149 69 108 -115 280 34 225 106 46 -116 -4 239 -76 -3 154
3492A54q4J0M5k35J72J93l53J18qO4j08j0q7J92j4k61J77L4Q9Q0j62j59K94j60
$$ 154 70 80 125 -110 62 255 -98 20 12 76 -32 -42 -129 63 49 -212 -35 -1 88 168 6 -153 141 -19
3516a9J7q3P3rQ5j23J44j32L59k58j5R4j02K43k94J65m1j41J8P8j21j93K64P9
$$ -19 -2 -85 -12 -21 64 -59 85 -47 312 54 39 133 31 274 -20 145 104 -37 -19 59 -62 -255 9 88
3540H8k39J86K0j71K48j60R5j70J10K59m32o2K17q7Q9q8j20K33j45L23j57K62
$$ 88 -151 35 55 -116 132 -28 67 -103 7 266 -166 -228 -11 -98 -9 -97 -217 16 -129 194 37 299
3562B99k90j09J23J05l65N12m28P8Mo1j13J63M09k53j48Q7R9j41K66j83j74K18
$$ 299 9 -100 23 128 -237 275 -153 -75 -71 -132 -245 -82 327 74 -74 13 112 -29 237 54 -120 98
3584I8J57J0l55J52j41N5J0J81j70l85L47J16N2j36o8j28K93K37k88j48J30P7
$$ 98 255 265 -90 62 -79 -24 -14 167 -3 -388 -41 75 127 -9 -77 -205 88 325 37 -111 19 96
3606I6j48j06K69k24K09j24m9K81j00k13K8J28M4j7j88M2R2K4k9l0J85p5k34K16
$$ 96 -52 -158 111 -113 96 -28 -77 204 104 -109 -81 47 91 74 -114 -72 20 44 15 -15 170 95 -139 77
3630G7k69K11M6K3k87J8L79m41L93J0m10K82N6j36n6k8O5m8J03r0J10o2J63R1
$$ 77 -192 19 65 88 -199 -181 198 -243 150 160 -250 32 88 -48 -104 -132 -67 -115 -12 -102 8 -54 109 200
3654B00o5k90j70K10M1R2R6j72K89j72j6j12L1J43j54k9J02o4r9J92j06J71jj36
$$ 200 135 -155 -325 -115 -74 18 114 -58 231 59 43 -69 -38 105 -49 -78 24 -40 -139 53 -53 118 117 -19
3678a9J97j93J5R6j03n0k9M75m76j42J49o1K8j47R5M04j93L2k88K08n2L7K8l1
$$ -19 178 -15 0 96 -7 -57 -86 389 -87 -229 -80 -141 -113 -260 -165 239 46 78 -210 -2 -54 -17 11 -20
3702b0j82J91Q3q8J38j66K58j39l17K11Pk38L24L9J36j43j59O3J77k70J52O0l7
$$ -20 -202 -11 72 -16 122 -44 214 75 -242 -31 -24 -262 62 101 237 94 -65 -2 175 -95 57 117 80
3725H0K19m72P1J46m8J90q9k82M36k38k4RnK5K66n29J79p0J45p8K35j61L63l39
$$ 80 299 -173 -102 44 -4 186 97 -185 251 13 -11 -2 -7 18 284 -245 -66 -136 9 -69 166 5 368 29
3749B9o8K40l73J71M0M3k35j20J97qJ83j3K29j24k64L23k75K31l26J67J73j33
$$ 29 -39 201 -172 -1 39 82 -153 -273 -76 -84 99 86 315 191 -73 250 -25 206 -120 47 220 87
3771H7M4j36j90J15M2J55k18R7J56J55l65pJ40l16K36J62l61M1M90l41J80j38
$$ 87 131 -5 -195 -80 -38 117 -101 -4 152 307 -58 -65 75 -241 -5 157 -204 -163 327 -14 166 28
3793B8j29l7O8K7J66L6J25l64j58K06O4%J8nK04k46Lm27O19k42n4K79j27L3l7
$$ 28 -101 -138 -70 -43 123 159 284 -80 -238 -32 32 32 50 45 249 3 6 -421 198 -44 -98 181 54 87 50
3818E0k17L14p5j24K66k07J34k43K36j37p8l8K54j64LJ68k36j13L67j26q5P1k40
$$ 50 -167 147 72 -52 214 7 141 -102 134 -3 -81 -119 135 -29 -26 142 -94 -207 160 34 -51 20 -220
3841b20K18Q4q2j07K84k26j19J38k14K83N0j02J13j92k3J34j66R3K74q7L8r8L1
$$ -220 -2 82 0 -107 177 -49 -168 -30 -244 39 89 -13 100 -92 -115 19 -147 -54 220 133 171 73 104
3864A04k16J24K39p4j43K32k74J84J20l71k61J60J65M1k6J0M15m91o1Q0j57K72
$$ 104 -112 12 251 177 34 266 -8 176 296 -75 -336 -176 -11 30 4 14 429 -62 -123 -43 -200 72
3886G2j52K60m43L95J19l40K57l05J57M5q5j4J99k74l31P53k67Ql2k89J93O6m4
$$ 72 -80 180 -263 132 251 -89 168 -137 20 65 -20 -34 165 -109 -440 313 46 54 22 -267 -74 -8 -52
3909e2q7j12K62L08k47j7j39p6j38L49J67l35J39k05J58J32p6N2j17lK58j85o4
$$ -52 -139 -251 11 319 72 55 -84 -160 -298 51 218 -117 22 -183 -25 107 31 83 -34 -37 221 36 -28
3932b8k00K11l2o2J35M1J27j76J24k87L18Nk41J03o3J90j80j71M02l01J1K99l30
$$ -28 -228 -17 -49 -111 24 65 192 16 140 -147 171 176 -65 38 -25 165 -15 -186 216 -85 -74 225 -105
3955a05J71j91K61k66O0J67o4L8K56m52J81l42M64N1k17J93j71Oj12n7l1J29r4
$$ -105 66 -125 136 -130 -70 97 33 71 327 -125 56 -286 178 229 12 205 34 40 -72 -129 -160 -31 -125
3978a25J23KPn1jj40R0M7q0J27J02j8l8j09K49l00L38k76L1q0R6l4M0j9PJ41j58
$$ -125 -2 0 7 -44 -45 -185 -95 -48 -128 -1 101 83 45 -64 185 -115 223 -53 -22 -102 -6 -40 0 -19 -12 129 -29
4005b9m9J26q0j58k33L07N3kk66K81L8j68K61n1k56J34J04J3%j7Q8K73k79P3j90
$$ -29 -78 48 -32 -190 -423 -116 -63 -65 -331 -50 -12 -180 81 30 -226 -92 12 25 25 8 96 369 90 163 -27
4030b7k10M50k61m2p9j11J58J41L4k61R3J64j56J79L4pk69K49k40J19J75k22J25
$$ -27 -237 213 -48 -90 -169 -280 -122 19 53 -208 -115 49 -107 72 106 99 -170 79 -161 -42 133 -89 36
4053C6Ok31K21Kl01L35q1J21j30K4K2j34J19m1p7J85k78j57J80K84n1lNk52L14
$$ 36 42 -189 32 34 -267 68 -13 108 -22 2 24 -110 9 -32 -109 76 -202 -359 -179 105 54 51 56 -196 118
4078A18k76Q3o7K02j08Kj9J50j09J42l7j88Rj83M11k61K31K23m30J92l17L24r3
$$ 118 -158 -75 -142 60 -48 -46 -65 85 -24 118 81 -107 -98 -281 130 -131 100 323 -107 85 -232 92 -1
4101aK1N6k02O8J5%j05L35k36K8J31r3J09l68P4L54j96j64L25j03QR0j51J60j37
$$ -1 20 76 -126 -58 -43 -43 -148 187 -49 -21 110 17 126 -242 -168 186 -10 -174 151 48 56 146 -5 155 18
4126A8L09l85N0J87j0r8J10j67l21M04k29J96J29M2q4m60M69j15rK62l47J2K47
$$ 18 327 -58 -8 179 169 71 181 14 -307 97 -132 64 193 235 151 -309 160 45 36 298 -49 -37 210
4149B10j68N9jk19K51J17j75J01n3R8k62L1J48n14N98k6JKk21m2k13L27J3k17
$$ 210 42 101 100 -119 132 249 74 175 122 220 -42 -11 137 -377 221 195 196 198 -23 -65 -278 49 62 -155
4173a55J43l0K3N6LK11m52O9r1J50j5L88m19r0K91j09l4O0Q7j33K70j21j43k1
$$ -155 -12 -42 -19 37 40 251 -201 -132 -223 -73 -88 300 -119 -209 82 -27 -61 -1 86 -47 223 102 -41 -62
4197f2K0J04m05M89l09L86k48l4J80k77J82k43lK63J00m23j24L01J87N2m07J77
$$ -62 -42 62 -343 146 -163 223 -25 -59 121 -156 26 -217 -220 43 143 -280 -404 -103 84 136 -271 -94
4219i4K36O2j41K64k99r0N8%p5K89k43J43J32k87J81j23q3K47j59J93J1j17j04
$$ -94 142 204 63 327 28 -62 -4 -4 -79 210 -33 110 242 -45 136 13 -70 177 18 211 222 105 1
4242ArP7L8o7N2R9q7m2k2j08l3L42j40j02L0Mj16O4r6L3K29P8j53k49L33k10j9
$$ 1 -8 69 107 40 92 191 104 62 40 -68 -101 241 101 -1 29 33 -83 -19 -115 -82 147 225 72 -177 156 -54 -73
4269g3J38k29J05Q8r2K66j14j42j11P3m3J51%L1k00J53q3NK78k7p3l05K74q7K18
$$ -73 65 -164 -59 29 -63 203 89 -53 -164 -91 -134 17 17 48 -152 1 -82 -77 201 174 101 -204 70 -17 201
4294B01k19l5K86j35O3k20J46j55k91K72O6K17j69O2j08L16k62nK1j62J55J93
$$ 201 -18 -53 233 98 161 -59 87 -68 -359 -87 -21 196 27 89 -19 297 35 30 51 -111 44 237
4316B37k44K86l09J49o4m3p0n2J14K95j75p5j46J70j60K30l6k08K56j58J08k21
$$ 237 -7 279 -30 119 55 12 -58 -110 4 299 124 49 -97 73 -87 143 107 -101 155 -3 105 -116
4338a16K17j91J14j54R7J29j39M1L3j10K03j29K7K6j93q0J91J73K86m58K67k81
$$ -116 101 -90 24 -130 -33 96 -43 -2 31 -79 124 -5 22 48 -145 -225 -34 139 425 -33 234 -47
4360d7L0J51j78L1L2R1j18j59J61j7P8j95L18j40l3L12k48J18k69k06q4N70j40
$$ -47 -17 134 -44 -13 19 110 -8 -167 -6 -23 55 -140 178 38 5 317 69 187 -82 -288 -372 198 58
4383E8N2k67J44k34J52L1L43m77K50l6l1j07rN3O1l8k89K58O8K88k37J2mk39K22
$$ 58 110 -157 -13 -247 -95 -64 279 -198 52 16 -15 -122 -131 -78 -17 -55 -344 -86 -18 270 33 45 41 -198 24
4408B4J39O2j26R5j60J16j54M6j33k0J82k65N1K95k08j51L36o5n2q0o0K09k1J51
$$ 24 163 225 99 194 34 150 -4 42 -91 -111 71 -194 -143 152 -56 -207 129 64 12 -68 -128 81 60 211
4432B11l48j7J61n0o0J08j34J24J6j31R5J91p5L51l15J88l62Q1k70K81j76k55
$$ 211 -137 -154 7 -43 -103 5 -129 -5 11 -120 -25 166 91 442 127 315 -47 34 -236 45 -131 -386
4454c86N92k86J35P0j37j26R1RK59l15n6J50N9k04L63j28L27l45j0R7k66q9M20
$$ -386 206 -80 55 125 -12 -138 -47 -38 221 -94 -150 0 59 -145 218 90 417 72 62 159 -107 -196 224
4477B24k10j24J95J49j76k37J33j9L7L05j89L6J72k05j28J94M3m20J26M1L4J96
$$ 224 14 -110 85 234 58 -179 -46 -65 -28 277 88 124 296 91 -37 157 200 -220 -94 -53 -19 177
4499A77l20K37o9l7m3m6L14k68J58j38L8K21q9k03L6K34Pm85K02K10j37J31k20
$$ 177 -143 94 25 -12 -55 -101 213 -55 103 -35 3 224 135 -68 -32 202 209 -276 -74 136 -1 130 -90
4522i0J55o6J69k01R0k34L00P1k27J20J91j11k27J64j76K20l06K56J03k07K6q1
$$ -90 65 -1 168 -33 57 -177 123 194 -33 87 278 167 -60 104 -72 148 -158 98 201 -6 20 -61
4544f1P2J33ol27K87n4%j81K98k60K53m59K74M0K53k79K0j50M6N0j36M1J65o0
$$ -61 11 144 138 -189 98 44 44 -137 161 -99 154 -305 -31 9 262 -17 3 -147 -101 -51 -187 -146 19 -41
4568d1n8J68M8k7N1k31R6N6o5K06k53j31L7J92j27j8j0K02m5j75O7qq4J00K24
$$ -41 -99 69 117 90 141 -90 6 62 -3 203 -50 -181 -144 48 -79 -97 -107 95 50 -125 -58 -66 -150 -50 174
4593A74N9l06L07l33L21k23P3l24M89j91J41K5p8k08K27k18K35j60n5K67j04N0
$$ 174 233 -73 234 -99 222 -1 72 -252 237 46 187 212 134 -74 153 -65 170 10 -45 222 118 168
4615A68m7k32K05p4R2l53N9L19l90O61m95K50ll43K83J04J11m24L58k66J37K6
$$ 168 121 -111 94 20 112 -241 -182 137 -253 408 -87 163 160 -183 100 204 315 -109 249 -17 120 146
4637A46lr5j06Q7j77J56j79K5M44q1j17k37o0P5J54lp0m7K10M8l92L86l25q1K11
$$ 146 143 48 -58 29 -148 8 -171 -146 298 217 100 -137 -197 -122 32 29 -41 -88 122 170 -222 164 -161 -242 -31
4662c1R7j73L81n80K25J16Q9M6k10lJ36N5k11l3K8J49l20K65n6r9K4K33J8j12
$$ -31 66 -107 274 -306 -81 35 124 170 -40 -43 93 148 -63 -96 -68 81 -239 26 -30 -129 -105 128 146 34
4686C4L6K6l08K80j94R1k00J76J69k34Q8K26l27P0J94l60J06P4m0j16J90j50K78
$$ 34 70 96 -212 68 -126 -35 -235 -59 110 -124 -36 190 -137 -67 127 -233 -127 -53 -93 -209 -19 -169 109
4709A09j72K8J92K5l08J75k86q3M90j59j4Nq4K17j15j33N4K04%m5k63K59m5M3
$$ 109 -63 -35 157 182 -126 49 -237 -320 170 11 -3 2 -82 135 20 -113 -59 145 145 100 -163 96 51 94
4733I4k15M00k89n6J60k24R9%J88k73J01j76J04L26m4l38M49l02k64J46L44m38
$$ 94 -121 279 -10 -66 94 -130 -31 -31 157 -116 -15 -191 -87 239 195 -143 306 4 -260 -114 230 -208
4755b08Q2K52K05m71L6L4J71k62L22l32Q3K48K89k89j29j37J5J42k53L52m5Q7
$$ -208 -126 126 331 -140 -104 -70 101 -161 161 -171 -88 160 449 160 31 -106 -91 51 -202 150 105 192
4777A92l26j73J94M99k31P0j53N3k45J71J5j6j37K73j45j91L36l27L10j5J46m49
$$ 192 -134 -307 -113 386 155 225 72 125 -120 51 66 50 -87 186 41 -150 186 -141 169 154 300 -149
4799a49K50L5j35j3M2k76L63l11L07k14p6L92k16j56K41j03o0q3J87K57l89K5
$$ -149 101 136 1 -12 30 -246 117 -194 113 -101 -177 215 -1 -157 84 -19 -79 -162 25 282 -107 -82
4821h2K01j1m4k88M91k53K00l21J87Q0m71N41jl17K20l22K67J92k75j25k98L46
$$ -82 119 108 64 -224 267 14 214 -107 80 160 -311 230 229 -88 132 -190 77 269 -6 -131 -429 -83
4843h3o9p0J67qR0J24p6O6J37j13J12j57j82j23M67k49j13J13J19O5l15N2J39
$$ -83 -152 -222 -55 -63 27 151 75 141 278 165 277 120 -62 -185 282 33 -80 33 152 217 -98 -46 93
4866I3J37l25K57k26K38k50o9K93k29L18l86j45J39j77M16j20J77j16J0LJ71m15
$$ 93 230 -95 162 -64 174 -76 -145 148 -81 237 -149 -294 -155 -332 84 -36 141 25 35 38 209 -206
4888b06J55O1Lk46K41o5J42K1l10M47m92M27Rj80K92k71q1OK5K51l52K17j69O5
$$ -206 -51 10 13 -233 8 -57 85 106 -204 243 -249 178 187 7 299 28 -53 -47 -22 229 -123 94 -75 -10
4912a0k20K27J24l06K09j6j34J40N3k68R8O8l7K3q0J10J48n0l9n7J03n8k27L91
$$ -10 -230 -3 121 -185 24 8 -126 14 67 -201 -103 -35 -72 -49 -129 -19 129 79 40 -17 86 28 -199 192
4936A92q5K5j50J75R1m84K09Q2j31K00j04J93j29j17J48N8k24J04Q4l76J34J06
$$ 192 107 132 -18 157 248 -236 -27 55 -76 124 20 213 84 -33 115 173 -51 53 137 -239 -105 1
4958Al16M86k07k23N4N9K42l38J42l9K80j11r6J03K18j98K08j03j77J41j25R9
$$ 1 -315 171 -36 -259 -205 -146 96 -242 -100 -139 141 30 -66 37 255 57 265 162 -15 126 1 100
4980A00J55j97K62m14k7J11o0K50J0q3J05l13j35J15L1o3J20j78K40J55l90Q4
$$ 100 255 58 320 -94 -121 -10 -70 180 190 107 212 -101 -236 -121 -90 -153 -33 -211 29 184 -206 -122
5002a22J80L4m17J99R9l6N4N9j34J12l6J67m72N49m74J51K35l6l02J06M0k01L27
$$ -122 58 92 -325 -126 -27 -63 -9 50 -84 28 -8 159 -313 236 -238 -87 148 112 -190 -84 -44 -245 82
5025H2J91l19j13N4J0K84j51K6k2K8Q7k33m1J80j46R4Q9j93J39m3K65j19j0K92
$$ 82 273 -46 -159 -105 -95 189 38 64 42 70 157 -76 -117 63 -83 11 100 -93 46 3 268 149 139 431
5049D31k82j73o4L80l19p4R1k4L48l63n3qK1K67k03P9O2Q8k53j9J53j29K86l08
$$ 431 149 -24 -88 292 -27 -101 -10 -34 314 -49 -102 -110 -89 178 -25 54 116 204 -49 -68 85 -44 242 -66
5073f6M03m27j08J87k32K62n5p0K41j18l7j69J65j12k74N44j81Q4j37L03l02R5
$$ -66 337 -90 -198 -11 -243 19 -36 -106 135 17 -20 -189 -24 -136 -410 134 -47 37 -100 203 -99 -4
5095dP2o9k45J94o7r2J86J3J13j09j69L22k16J53k31L05J29k85lJ75o5j2J23l53
$$ -4 68 -1 -246 -52 -119 -211 -25 -12 101 -8 -177 145 -71 82 -149 156 285 0 -3 172 107 95 218 -135
5119a35M21k95J4Q3p5L1k69L18j53J96k43K05o4l28K58o1J17o3O7j8K55j07J4
$$ -135 286 -9 5 88 13 44 -225 93 -60 136 -107 98 34 -294 -36 -97 20 -43 24 6 261 154 168
5142A68k88K73j63O9K43m13J86n1Q3j84L25k44L46m43K22j32l9P9k07p6J02J06
$$ 168 -120 153 -10 59 302 -111 75 24 107 -77 248 4 350 -93 129 -3 -42 37 -170 -246 -144 -38
5164c8Q4j81K11j98q3J71J37r4J18j52L78l95R0L2m2m9k6O3k59K69P4j30j62K85
$$ -38 46 -135 76 -122 -205 -34 103 9 127 -25 353 -42 48 80 38 -11 -37 26 -233 36 110 -20 -182 103
5188A03l1k4j00J04K15l62J77j32R0Q4j92J4jl0p2K72l4K14k10o8l32L11J02j75
$$ 103 72 48 -52 52 267 -95 82 -50 40 124 -68 -54 -55 -85 -157 115 81 295 85 17 -315 -4 98 -77
5212g7K25n5J76m78%l7L05k89L15J74k69j51J62Pj79J12N4J88j04l7o7M7j34P9
$$ -77 148 93 269 -209 -209 -246 59 -230 85 259 -10 -161 1 8 -171 -59 -5 183 79 42 -25 22 -112 -33
5236c3l5L40r3M6k39l48L61l09M11J45k52lk35J82j86M05j43K42j54NL8j14J91
$$ -33 -68 272 179 225 -14 -362 -1 -310 101 246 -6 -9 -244 -62 -248 157 14 256 102 107 145 31 222
5259B22k49k2j47L26k12j2q8K27J07k67J57j62J97O6J31j61p4j85j32N49l31L3
$$ 222 -27 -49 -196 130 -82 -94 -182 45 152 -115 42 -120 77 143 274 113 39 -146 -278 271 -60 -27
5281b7P2J18m96N13k22R4j69P3J07k2j53R8J0k6L4o6p0J52j8k1o2k4N3j51J20
$$ -27 45 163 -333 180 -42 52 -117 -44 63 41 -112 -14 -4 -30 4 -62 -132 20 2 -19 -81 -105 -52 -203 -83
5306h3R9K59n37K47K94k06m0o9LQ2j32j07QJ63N6R0l11K73J81n85N48j57J3J47
$$ -83 16 275 -262 -15 279 73 33 -36 -33 49 -83 -190 -182 -19 37 127 -184 89 270 -315 233 76 89 236
5330B36q5m78K76K00j90j73J05Q8K10k27j80K07j09R5L71k64N1k01J16k14L41
$$ 236 151 -327 -51 149 -41 -214 -109 -21 189 -38 -218 -11 -120 -25 346 82 133 -68 48 -166 175
5351A75n6jlj92J30j58K69r7K16l54R4O5L2O5j57j28J20J50J7K4k02K56p7j91
$$ 175 119 118 115 -77 53 -105 164 67 283 -71 23 88 120 185 28 -100 20 170 187 211 9 265 188 -3
5375cL73p39L21J58j18j98M16n0j52j6Q1l9j31L31j16j35j99K53Qk23j8J88M6
$$ -3 370 -369 -48 110 -8 -206 210 160 8 -8 73 34 -97 234 118 -17 -216 37 45 -178 -196 -8 38
5398C8k21J50J85l03k60L90k9K13k56M09j78K0k28j73K28L77m08K30l10l2L7n9
$$ 38 -183 -33 152 -151 -411 -21 -50 163 -93 316 138 158 -70 -243 -15 362 -46 184 -126 -158 -121 -180
5420a80L74p3l23m0M64j92j12K43j90qJ50k09K08j88K38k49o4n1L99n8o6N0j78
$$ -180 194 121 -202 -242 222 30 -82 161 -29 -37 113 -96 112 -76 162 -87 -151 -202 197 139 73 123 -55
5443e5j29P6L0L1l28J41N0M93o3k89K41l33M26k33l96L96L1Km25K86K15j98J7
$$ -55 -184 -108 -78 -47 -375 -234 -184 309 246 -43 198 -135 291 58 -338 58 89 91 -334 -48 167 -31 -14
5466a4qL7q1k79M49K4j1k17p9K46l2K33k06m8R2j4p2J39R0K3k17J13J29l51O9
$$ -14 -22 15 -66 -345 104 128 117 -100 -179 67 35 268 62 14 106 92 20 159 249 272 55 168 297 -54 15
5491A5n2pQ0j96Q6K81l85J55Nj15j39K69M1J9R4j04N3j67K53l31K41P6K07m49
$$ 15 -37 -44 36 -160 -74 207 -178 -23 -18 -133 -272 -3 38 57 151 47 100 -67 186 -145 96 172 379 -70
5515g0j97M64l47K35j82J02r1l3J94q5j68K66j23j48J37Rj9K68l23o1M83k69N6
$$ -70 -267 197 -150 85 -97 5 -86 -119 75 -10 -178 88 -35 -183 -46 -37 -56 212 -111 -172 311 42 98
5538I8j93j01J40q1K59Lj34L1l40K05lm0M54m4k36J75m31L88k32J95o4k75L34
$$ 98 -95 -196 -56 -137 122 125 -9 22 -318 -113 -116 -156 298 254 18 193 -238 150 -82 113 49 -226 108
5561A08m7m33N76l40L8J48k06J35n7q0K84m8l9j25R0j65J50L7m1P1k1l35K19J99
$$ 108 61 -372 204 -136 -98 50 -156 -21 -78 -158 126 78 39 -86 4 -161 -11 26 -15 56 35 -300 -81 118
5585A18J92k65Q8P3po1j67J81k19N4J90l61J14K82j38j63NM3n9J6J49k7m8l6M6
$$ 118 310 45 133 206 199 138 -29 152 -67 -13 177 -184 -70 212 74 -89 -84 -41 -100 -84 65 38 -10 -46 0
5610@J97K6k78j15K10o3l9J60l06K32M9j0r2P6r8L6r0p9J85j46J00K90j30j48
$$ 0 197 223 -55 -170 40 -23 -62 98 -208 24 73 63 -29 47 -51 -15 -105 -184 1 -145 -45 245 115 -33
5634c3J66K7r6M9j57J63J91o86L80M1k2lj42K93k10J69J01n4j13J09k07O9j64
$$ -33 133 160 64 113 -44 119 310 -376 4 45 23 20 -122 171 -39 130 231 177 64 173 -34 35 -129
5657a29J18J18j85K19l31N7K44k09J76j44J04k77L69j66P4j71J02j29Q8Q8j12
$$ -129 -11 107 -78 141 -190 -133 111 -98 78 -66 38 -239 130 -36 38 -133 -31 -160 -72 16 -96
5678i6K3j29K95j31l19J24O88n98L62l77K18K00k76J38K2rk29M2J73J91l46j11
$$ -96 -73 -202 93 -38 -357 -233 455 -143 219 -158 60 260 -16 122 144 135 -94 -52 121 312 -34 -145
5700a45o1J91J46j02J0K7pn6N0k9L73n01N6M1N9P9k7q7j49J52M1k3K00j05j61
$$ -145 -206 -15 131 29 39 66 59 3 53 24 397 -104 -48 -7 52 131 104 17 -132 20 61 38 238 133 -28
5725b8L69m40p9K31o4k3K05k25K10r9M8j66O5Q9j72J97k05Q7r5N4K36n7j92J59
$$ -28 341 -99 -178 53 -11 -34 171 -54 156 57 105 -61 4 93 -79 118 -87 0 -95 -41 195 138 -54 105
5749A05j67K58j14j46K44m55M98l70J59L9l58L23J20o1l8k06J81N3kM7j00n1j44
$$ 105 -62 196 82 -64 180 -275 223 -147 12 51 -307 16 136 75 37 -169 12 65 63 110 10 -41 -185
5772a85J53r1K6L4K16k88M2j82L20nO1k1j70o0L02k51K14j6l23N0N8J45k48J98
$$ -185 -32 -123 -97 -63 153 -135 -93 -275 45 40 101 80 -90 -150 152 -99 115 99 -224 -174 -116 29 -219 -21
5796b1l64N12j36p0K87k75n6j9j1L6l6L31l40q2M98k51j42K9K38Lq3R2p5J4K3
$$ -21 -385 127 -9 -79 208 -67 -123 -142 -153 -117 -153 178 -162 -244 254 3 -139 -110 128 131 48 140 65 79 102
5821A02k0L0l09M54m64P3j27N29n00Q9J06L4K13k03o1O8N1k88O06m39l5J4N6n1
$$ 102 82 112 -197 257 -207 -134 -261 268 -232 -143 -37 -3 210 7 -54 14 65 -223 383 -56 -91 -77 -21 -72
5845g2J27n5K4L19l84k21K07o3P2k8j10J78o1J18r2O4N1p5M0J7l9k12M31q8m40
$$ -72 55 0 24 343 -41 -262 -55 -118 -46 -74 -184 -6 -67 51 -41 23 74 -1 39 56 17 -195 236 148 -292
5870b92M36j20j15K15k98J18k3K76n14L30j54K86k57J77J20k04J5q4K85l5m04
$$ -292 144 24 -91 124 -174 -56 -79 197 -317 13 -141 145 -112 65 185 -19 -4 -88 197 162 -242
5891b42K79j9L07k13k38K68k08O5J09j54J01j18Q7P1j48j50M46p3j92J0Rj11K67
$$ -242 37 18 325 112 -126 142 -66 -1 108 -46 55 -63 24 95 -53 -203 243 170 -22 -12 -3 -114 153
5914A53k45K44j82k2OqR4l99N11j33J77j84J55j89lp1k5K21j14J57l15k03L83
$$ 153 -92 152 -30 -52 -46 -54 40 -359 152 19 196 12 167 -22 -25 -96 -121 100 -14 143 -172 -375 8
5937HJ29O8k59j71N3J60j57J64K5l2N7k37L13o4k31J37K36l71J41m4K97k57l3
$$ 8 137 205 -54 -225 -172 -12 -169 -5 20 -12 45 -192 121 57 -174 -37 199 -172 -31 -75 222 -35 -68
5960f8O6K08j71M9J5j56K07m04J31K17Qp0O4k4m8J2J45l62J09jP4k74J96m3J96
$$ -68 -2 206 35 84 99 -57 150 -254 -123 94 102 32 96 72 24 36 181 -181 -72 -73 1 -273 -77 -120 76
5985G6m0k42K36k14J02K02j88L9J60j67r1K66k58L50n19J50J77j15R9M2J6n2M9
$$ 76 36 -206 30 -184 -82 120 -68 -29 131 -36 -127 139 -119 231 -288 -138 39 -76 23 65 81 29 78
6008G8r5R9J91j70n4n5R9k52P8N5j71L17Q2k28j04P9n4L58k55K09k62m5Q8j65
$$ 78 -17 82 273 103 49 -6 93 -159 -81 -26 -197 120 202 -26 -130 -51 -105 253 -2 207 -55 -100 -12 -177
6032a77L52k50J14r9J9j03K7J68j22K17j04op7J8R5j89O1j09oJ65O9M2j36J01
$$ -177 175 -75 39 -60 -41 -144 -117 51 -71 146 42 36 -41 -23 72 -117 -56 -165 -171 -6 63 105 -31 70
6056G0r3R7M4j34P8J97j58j13j11J7L67k02j71J01Q5n9J4J14k84J58n0q3K03j43
$$ 70 -23 74 118 -16 62 259 101 -12 -123 -106 261 59 -112 -11 74 15 29 143 -141 17 -33 -116 87 -56
6080e6J44J58k78o9J51j24n8J41K79m10j67M28m05J3L37k41K81k7k66L91k02n0
$$ -56 88 246 -32 -101 50 -74 -132 9 288 -122 -289 139 -266 -253 84 -157 124 97 -169 222 20 -30
6102c0j87M27m36L58J14k18k4K51j48j56J96k37j98L92n2k52M79n28K50l2k47
$$ -30 -217 210 -226 132 246 28 4 255 107 -49 147 -90 -288 104 52 -200 279 -249 1 -31 -278
6123b78N56P2k90j9k6j6k55K25J49k02J13m3K73n26M10l20M59j69J57Qk32J59
$$ -278 278 350 60 41 15 -1 -256 -31 118 -84 29 -14 259 -267 143 -177 282 113 270 278 46 205
6145B05j22J15n02J33L11k33j0L0J10k1J01l1k60J99Oj8KM9L2P3q4j45j68J47
$$ 205 83 198 -304 -171 140 -93 -103 -73 37 16 117 86 -174 25 31 13 15 64 96 169 85 -60 -228 -81
6169h1K28j81P2r7q9O6K92k29k0J29j26Q3O7J57L5l05J15j12ko0j63J17L9L0q2
$$ -81 147 -34 38 -59 -148 -82 210 -19 -39 90 -36 47 114 271 306 1 116 4 2 -58 -221 -104 -65 -35 -117
6194a17J92J97l02j17L56ok71Q2M8N9Mj94J37j23j36J41O2j11K08j07kj12m8K23
$$ -117 75 272 -30 -147 209 203 -68 14 62 121 125 -69 68 -55 -191 -50 12 -99 109 2 0 -112 -160 63
6218F3N5m21K33o5K11P1k72J0K4L0J0J48n7j02J82mO1j02J70k90O1rQ6k7k9o5
$$ 63 118 -303 -70 -135 76 147 -125 -115 -91 -61 -51 97 40 -62 120 116 177 75 245 -45 16 7 93 66 37 -28
6244b8J20o4j70J50m4q2J50J53l45K41J33k10K40k64J94j79j1L91l52Pj02j37
$$ -28 92 28 -142 8 -36 -118 32 185 -160 81 214 4 244 -20 174 -5 -16 375 23 30 -72 -209
6266b09K16K43j24k67j71L61Q6j84K62j97j7k21K97n3J81l04K23k97L87J2k34
$$ -209 7 250 126 -141 -312 49 135 -49 213 16 -1 -222 75 22 203 -101 122 -175 212 224 -10
6287a0R1j21j40K00p1l8p5L15k22j50J42J42K75m85j05L21j04m8J82j14K06j07
$$ -10 81 -40 -180 20 -51 -89 -164 151 -71 -221 -79 63 338 -147 -252 69 -35 -83 99 -15 191 84
6309H4p7l45K67K33l61J61J12J4p0q4j48j64L50j95N8J49K26k53L02m1l75Q9j68
$$ 84 7 -338 -71 162 -199 -38 74 88 18 -66 -214 -378 -28 -223 -165 -16 210 -43 259 218 -157 -68 -236
6332b36m3K90j09M45l22m2P1m5j29K24j56j36J13j1J01j71J08L9j9q4j19j45L39
$$ -236 -279 11 -98 347 25 -17 54 9 -120 104 -52 -188 -75 -86 15 -156 -48 -9 -28 -112 -231 -376 -37
6355c7J05K57m67K88r8j87R7k00L74q5j6k24N60m75K87k80l14L19NJ98k24P9J87
$$ -37 68 325 -142 146 48 -139 -42 -242 132 47 31 -193 367 -108 179 -101 -415 -96 -91 107 -117 -38 149
6378A49j77j7N7k39M51l84J56j77J2J45K17M6j71K1j19K80m20M22k97J52q4k04
$$ 149 -28 -45 12 -227 224 -160 -4 -181 -169 -24 193 239 68 89 -30 250 -170 252 -45 107 23 -181
6400a81J38J08l31R4K5O4k63J11N3L08J4k41nJ96J80k49J02k63p4Q5M81n54P3
$$ -181 -43 65 -266 -172 -147 -83 -346 -235 -182 126 140 -101 -106 90 270 21 123 -140 -214 -129 352 -202 -129
6423a29J56m9j86K45j47M4k41L39l51K66j33L93l55J27k04J15P8L16m03J18Q6
$$ -129 27 -22 -208 37 -110 -66 -307 32 -319 -53 -186 207 -148 -21 -225 -110 -32 284 -119 -1 85
6444H5l59K36P2K50l76K7J17J29k36J33n4r2L44m71n9J66K34k72K41K8l62J93
$$ 85 -274 -38 34 284 -92 -65 52 181 -55 78 24 -68 276 -195 -254 -88 146 -126 115 143 -219 -26
6466b6k81K80R4k8n1J69q4l33J41K1N4L61l94J84n8J40k11l10M54j05Lj47K43
$$ -26 -307 -27 67 39 -12 157 73 -260 -119 -98 -44 317 -77 107 49 189 -22 -332 122 17 20 -127 116
6489A16l61L07j09Ol7K5J61j57O7l95O23l28PK53k39L5K20Jk20J88p4j75J27J25
$$ 116 -245 62 -47 -41 -78 -53 108 -49 18 -377 246 -82 -75 178 -61 -26 194 195 -25 163 89 -86 41 166
6513A66j15o2P5J76j83r0J75j40J31r5l50K41J30j23j5J56j49J65j41j1K29r3
$$ 166 51 -11 64 240 57 -33 142 2 133 38 -312 -71 59 -64 -79 77 -72 93 -48 -59 170 77
6535G7j67j8K72j90r7l7L20m24L92j25K31r6j58K27m03O5L44j96P5K74j87k23
$$ 77 -90 -108 164 -26 -123 -160 160 -264 128 3 234 138 -20 207 -196 -131 213 17 92 366 179 -44
6557d4j40M4J70J16j24o6n6J96k20j24J86j17L38m2k04K31j86j47P6K63l24K57
$$ -44 -184 -140 30 146 22 -44 -100 96 -124 -248 -62 -179 159 117 -87 144 -42 -189 -113 150 -174 83
6579H3K2p1k9J2o2r2L92l03k9J77q1j09N8n5L09m15M03p9j40K56j99r0j46M91
$$ 83 105 34 5 17 -45 -137 255 -48 -77 100 19 -90 -32 -87 222 -193 210 131 -9 247 48 -42 -188 303
6603C03m38K13j34J11k22N8Q5n3P6k7J77J04j43j61J59m8P8k27K96k68l4J8K14
$$ 303 -135 78 -56 55 -167 -109 -24 -77 -1 -28 149 253 110 -51 108 60 138 -89 207 -61 -95 -77 137
6626A37p7K4n5j79J62j87J41k57K29j01L89k88P7J22o8j10K16j25o3Q8q9J88r5
$$ 137 60 84 29 -150 12 -175 -34 -291 -62 -163 226 -62 15 137 69 -41 175 50 -13 75 -14 174 79
6649G9Q0J13k65k2p4N2J39K6j42J48k36O7n0J09k8J14k29J36j44J29j72K17p1
$$ 79 159 272 7 -15 -89 -37 102 128 -14 134 -102 -35 -85 24 -4 110 -119 17 -127 2 -170 47 -24
6672b4j99K95R0m8j25K20j63L5j33K55j53oJ28k72r1K85q2N4p2k11K2p1j82L94
$$ -24 -223 72 162 114 -11 209 46 81 -52 203 50 44 172 -100 -191 94 12 66 -6 -217 -195 -266 -448 -54
6696e4RJ45lk41Jj0N0K36l44O6J26p8J90J27l28l24K05L80r8P5k8k04nj44J42
$$ -54 -45 100 97 -144 -143 -153 -103 133 -211 -145 -19 -97 93 220 -108 -432 -227 153 55 130 102 -102 -107 -251 -109
6721a09M4K37J55l87J5n9K33k29l8J5Q0J68j29N3k54N00m30J72K61m04o0jm9O7
$$ -109 -65 172 327 -60 -45 -104 129 -100 -138 -123 -43 125 -4 49 -205 295 -135 37 298 -106 -166 -167 -216 -149
6745a49J82J98k65J22j1Q9q0k09K35l13J52L02m94K90m0l8j83J84J96J50l96R2
$$ -149 33 231 -34 88 77 166 86 -123 112 -201 -49 253 -241 49 9 -29 -212 -28 168 318 -78 14
6767A4k2n5k20M52J26l27m0K35k35K43K5j72Q3J2l39J77k53K63j53L57j00o4m5
$$ 14 -8 -63 -283 169 295 -32 -72 163 -72 171 196 24 107 119 -220 -43 -296 -33 -186 171 71 7 -38
6790c8J63Oj56P4k49P7J96j60J96k31M9J38Q5r2k24J86R0j38rK4r6L93m05m6J51
$$ -38 125 131 -25 49 -200 -123 73 -87 109 -122 -73 65 150 58 -166 20 110 -28 -37 -13 -109 284 -121 -167 -16
6815a6r8PJ26p4k78L18J66l92N29l03j51P6o6K26K66n56L77j43j85Q4K29J7l24
$$ -16 -114 -107 19 -55 -333 -15 151 -241 288 -15 -166 -90 -156 70 336 -220 157 14 -171 -87 142 159 -165
6838a65K60lq9n1j8K98k8k55J97j62P3N6J98k47k80M11k74J86j07j10M16l33j17
$$ -165 95 92 3 -48 -66 232 204 -51 146 -16 57 113 311 64 -216 195 -79 107 0 -110 306 -27 -144
6861a44K36j03J19P5l08q0N5J32j9J51j95j2k60K07J31q5K5K13k79j8K04J55q6
$$ -144 92 -11 108 183 -125 -205 -150 -18 -37 114 -81 -93 -353 -146 -15 -100 -75 138 -141 -159 45 200 114
6884A14m90M64k43K27k0k38L4K33n7j74M0Rk20K8O12n41M34k6m7p9jP5k27J74
$$ 114 -376 88 -155 72 52 -186 -152 81 24 -150 -110 -101 -321 -293 319 -222 212 186 139 60 59 134 -93 81
6908H1k65J53K89j49k8k77J03K3j17L92m0l27J21j06m8J23J50j30Q1k25L15J48
$$ 81 -184 -31 258 109 81 -196 -93 -70 -187 205 165 -162 -41 -147 -195 -72 78 -52 29 -196 119 267
6930B67r5J52l72L02k49k97M19p9n6j08J7r2l3K08J16n9m3J74o09K93QP9Q6q4
$$ 267 172 324 -48 254 5 -292 127 48 -8 -116 -99 -191 -224 -16 100 41 -2 172 -437 -144 -136 -57 29 -55
6954e5qK28r0Or0K3Q1k30m6K14k3J61k54j15L62p5kK28n73K92N3J08l49p5L65
$$ -55 -63 165 75 81 -9 14 95 -135 -181 33 10 171 -83 -198 164 89 87 315 -258 34 87 195 -154 -229 136
6979A36k86K49k99L87j9l27n4P6j43N53m82J12j63Q7J62j6K0k63N67k15j63j27
$$ 136 -150 99 -200 187 168 -159 -213 -137 -280 273 -209 -97 -260 -173 -11 -27 -7 -270 297 82 -81 -208
7001b08lM89n4q4k01J23k14P9j24L41R0j60k5k66M45L7l08K57l71M39l43Q1l3
$$ -208 -211 278 224 140 -61 62 -152 -73 -197 144 234 74 49 -217 228 265 -43 214 -157 282 -61 20 -13
7024a3M2j26j69N14j64J23k46J78k52J00O8k17J02k6k78L73L2l36K75P9R2j35
$$ -13 29 -97 -266 248 84 207 -39 139 -113 -13 55 -162 -60 -86 -364 9 41 -295 -20 59 151 16
7046A6O0k0K5j14J49k2j01j47K33j65j0J97k57O7N8j47K16k09K65J42k82l8J58
$$ 16 76 56 81 -33 116 94 -7 -154 79 -86 -96 101 -156 -89 -31 -178 38 -171 94 236 -46 -84 74
7069G4k92K49j65R0k2R1j02K12L4j08Q1k04M04n97L06oj5R8j1j41J28K2k18R3
$$ 74 -218 31 -134 -44 -66 25 -77 135 169 61 142 -62 342 -255 51 45 30 128 117 -24 104 126 -92 1
7093AK15n1j37K27m49LK95m8N4J04j73M9m36M92rJ42k81J50K49l31o1k47J73K55
$$ 1 216 165 28 255 -194 -191 104 56 110 214 41 90 -346 146 137 279 -2 148 397 66 5 -242 -69 186
7117A86l53L69j19k02J75n3pk9j52M94l41J31K4l08J86Q5o6J86k18l17L03J85
$$ 186 -167 202 83 -119 56 3 -4 -33 -185 309 -32 99 123 -185 1 86 20 206 -12 -329 -26 159
7139A59j7j58k3n8j30K92J87j94R3j88j17M9N7J08J0j07J58o07O28n9j77K23j66
$$ 159 142 -16 -39 -97 -227 65 252 58 151 -37 -154 -105 -48 60 70 -37 121 -486 142 83 -94 129 -37
7162c7L9j38j57N95l38r8M6P5O2m2q7j8O7R4J89l49K19k48K55O2j49m7j5O2m1
$$ -37 2 -136 -293 302 -36 -134 -88 -13 49 7 -80 -98 -31 63 252 -97 122 -126 129 191 42 -5 -20 42 1
7187AJ31j67OQ9K05j79Mj77kK15l0j86M16j14m08J97k3O8j88P7J71j35J49j36
$$ 1 132 -35 -29 60 265 86 90 -87 -89 126 96 -90 326 212 -196 1 -22 46 -142 -65 106 -29 120 -16
7211a6o4J80p6j65r4J23K0J92N7m2j26N1K2J36k59L1pk30K88J17K1k27r2M38k13
$$ -16 -80 100 24 -141 -235 -112 -92 100 157 115 -11 40 62 198 -61 -30 -37 -267 21 138 159 -68 -160 278 65
7236F5r4M1K8k03K08J17l19J31j41K54l41K9R8R8J32J9l7oj76Or5M62l50K1o6
$$ 65 -29 12 40 -163 45 162 -157 -26 -167 87 -254 -225 -127 -29 103 122 85 79 -97 -91 -186 276 -74 -53 -119
7261a19K86k12j60R6j92M15k22K21r7m18K92j69K14K47j35o2k4J90k22L2J77k22
$$ -119 167 -45 -205 -109 -301 114 -108 113 16 -402 -110 -279 -65 182 47 -15 -39 151 -71 -39 138 -84
7283h4J00k2M2mK05l01M7q0l26L12K26k26J45k16J71mJ27j66K4j44J85L62m94
$$ -84 16 -6 36 32 237 -64 -17 -97 -423 -111 115 -111 34 -182 -11 -15 112 -54 -30 -174 11 373 -121
7306a21L04k36Q2pJ31j21R1l5m8kJ04k04J84q6l15M28j46k2M1J1M4K25k97J11
$$ -121 183 -53 29 22 153 32 123 88 40 38 142 -62 122 36 -279 149 3 -19 22 33 77 302 5 116
7330A16k62j86K47K73j36J71n21L11M24m27n0q9J71j08q8J10j75L07j82NK48j78
$$ 116 -146 -332 -85 188 52 223 -298 13 437 10 -40 -129 42 -66 -154 -44 -219 88 -94 -89 159 -19
7352a9K9r6J45r8J58k94o1J53M27m69j67K92k30J65J73j78J08j28M01l03J45l20
$$ -19 10 -86 59 -39 119 -175 -236 -83 344 -125 -292 0 -230 -65 108 -70 38 -90 311 8 153 -167
7374a67K95p6Jk28K45j81J59J44l81K18P7K41l89N8r0O5L58p9j29L5j78L39k33
$$ -167 128 52 53 -175 70 -111 48 192 -189 29 106 347 -42 16 -74 -9 349 270 141 176 -2 337 104
7397A04R7k65j2O4M7k20J62J21k54J50L2j96J16j45J69J54k80J49K02j23l3j28
$$ 104 201 -64 -76 -12 35 -185 -23 98 -156 -6 26 -170 -54 -199 -30 124 -156 -7 195 72 39 -89
7419h9J48Q1J22k55j43J88k79J69M2j74J55J62m0J44k33rj1q5J90j98L23k89J90
$$ -89 59 140 262 7 -136 52 -227 -58 -16 -190 -35 127 87 231 -2 -11 -22 -107 83 -115 208 -81 109
7442A09j22M9M2q1Q2l4m7j77K07j8j25K79j32J13j00J54Qm9R1l27J81j62J32j02
$$ 109 -13 36 78 -3 79 45 -2 -179 28 10 -115 164 32 145 45 199 207 158 249 -78 103 -59 73 -29
7466b9J52j12p0nr1J76J77qj22p3P9N7n35K76J66j68K10J03j09k07L70jk39L1
$$ -29 123 11 -59 -64 -155 21 198 190 68 -5 74 131 -404 -128 38 -130 80 183 74 -133 237 236 -3 28
7490B8j7o3M2P2l3J69k40K66m26m2o5N02k68K56k08J29o4j51K99l10l0R7L27m7
$$ 28 11 -52 -10 62 29 198 -42 224 -202 -244 -309 193 -75 181 -27 102 38 -113 186 -124 -154 -57 270 223
7514B23j57j92J5L8j37M15j62j33Q7j57J41Kj40J11o7MK74j37k5j68K17l35M41
$$ 223 66 -126 -111 -73 -210 205 43 -90 -3 -160 -19 -17 -157 -46 -113 -109 165 28 3 -165 52 -283 158
7537A58n0k7k70J89o2K68r1l0r4k9l7K72j91k01P3K65l58L17p2k15J71K09k04
$$ 158 108 81 -189 0 -62 206 115 85 -9 -38 -75 197 6 -195 -122 143 -215 102 30 -185 -14 195 -9
7560ij01R1R8mj54J07r8j36K09j7M6M05l61k33L83l33m9M77m17L3N3o1J21k36
$$ -9 -110 -19 79 75 -79 28 -70 -206 3 -14 32 437 76 -157 226 -107 -156 321 -96 -63 -10 -71 50 -186
7584a86L61l42J94N1k70Q6N2K14j08l21K73k6M7k3J51k15Kn0Q6pP5J96j67l04
$$ -186 175 -167 27 78 -192 -106 -54 160 52 -269 4 -22 25 2 153 -62 -60 -110 -24 -31 44 240 73 -231
7608b31K37J2N0J35j68r8Q7j69J68J65J52l75J55J32k97l1j15K55l13M51m05R6
$$ -231 6 18 68 203 35 -63 24 -145 23 188 340 -35 120 252 -45 -76 -191 64 -249 202 -203 -107
7630a07L23k39K08l37M7R4p7q9L73k61Rj32K24l15M40K1j31k06J34p8q1L35Q9
$$ -107 216 -23 185 -152 -105 -11 -88 -177 196 -65 -56 -188 36 -279 161 182 51 -155 -21 -99 -180 155 244
7653B44l52K36p8m5p0j00K93m54L06j11J03K45k99m9M2J11k99K86J52p8j94K63
$$ 244 -108 128 50 5 -65 -165 128 -326 -20 -131 -28 217 -82 -131 -89 22 -277 9 161 83 -111 152
7675A52k72o4M5K14k98J91K00j28J88j45q2K5l2j63J69k7k30J53L43j93L58k37
$$ 152 -120 -184 -139 75 -223 -32 168 40 228 83 1 26 -6 -169 0 -27 -257 -104 239 46 404 167
7697A67q9l68P1j68L24K2K34k73L56l64lj37K89n6n9J22j79r9K00q8k6K78k93
$$ 167 78 -290 -219 -387 -63 -41 193 -80 276 -88 -91 -228 61 5 -54 68 -111 -210 -10 -98 -124 154 -139
7720a39L44j66j8r1J63q1k55R0L69j62o7j00J17k9J03m8J52P3l55%o0K57n4j73
$$ -139 205 39 21 -70 93 12 -243 -153 216 54 -13 -113 4 -25 78 30 182 255 -100 -100 -160 97 43 -130
7744a30J94R0l84P09n11j47L0K39l44J37J40J77L6m3j72J1k40R1M0M1k20M29k15
$$ -130 64 154 -230 479 -32 -179 -149 90 -254 -117 23 200 236 193 21 32 -208 -117 -77 -36 -256 173 -42
7767d2L24l26J9K9J11lk30L13ok21L6m7K8j29J89l39N70l06k29J28L34j16k97
$$ -42 282 -44 -25 4 115 112 -118 195 189 -32 4 -43 -15 -144 45 -294 276 -30 -259 -131 203 87 -210
7790b10J02R6j41L14q7j30K9K2j02J17O3O7j82n8P5J72n2Or9K0o6j15J35p3J59
$$ -210 -108 -12 -153 161 74 -56 -27 -5 -107 10 73 140 -42 -100 -25 147 95 101 2 22 -44 -159 -24 -97 62
7815F2k76L64r7J40l21J9p0J08K01K0j39j87j03L23j63j25M11j63K31m8j82N4
$$ 62 -214 150 53 193 -128 -109 -179 -71 130 150 11 -176 -279 44 -119 -244 167 4 235 187 5 59
7837E9J69j87m18N44k15J85j19j2J97l04n6J36L07k18p4P2q0K68k67P5J76l28
$$ 59 228 41 -377 167 -48 137 18 6 203 -101 -157 -21 286 68 -6 66 -14 254 -13 62 238 -90
7859i0n7J40O5p9Q3R4q2j39L0j02j01J05J41k11J26r8K40k48R4J62n7L2L4J16
$$ -90 -147 -7 58 -21 62 156 74 -65 -35 -137 -238 -133 8 -203 -77 -175 65 -183 -89 73 16 48 82 198
7883A98p0pK74n05P4l6L41k81j14L72o02L88K44j06q1j0l07M02j52K15k06J11
$$ 198 128 121 395 -110 -36 -72 269 -12 -126 246 -356 32 276 170 89 79 -228 174 22 237 31 142
7905A42m5j38Noj98L29J32l08J58n7k47K28k27L96k45N8J46m69J49K50q8k88M98
$$ 142 97 -41 -36 -42 -240 89 221 -87 71 14 -233 -5 -232 164 -81 -23 123 -346 -197 53 -35 -323 175
7928A75k79O9j51N6J46K2j81J41j96J38r0K30j22J68k50P7J07j24K2k49M62j09
$$ 175 -104 -35 -186 -130 16 38 -143 -2 -198 -60 -150 80 -42 126 -124 -47 60 -64 -42 -291 171 62
7950F2l61LL68j39Q6j96M8J02j4k11J92P4j38j21N00l18j22L6N7r7M85k41m8J86
$$ 62 -299 -296 72 -67 19 -177 -129 -27 -41 -252 -60 14 -124 -245 255 -63 -185 -149 -92 -189 296 55 7 193
7974A93k47k1K79j90l87L32K01J1pl6P1m10N0K57P7j3j45N9J27r4J03K90l51j40
$$ 193 -54 -75 204 14 -373 -41 160 171 164 128 199 -211 -161 96 173 160 15 74 201 107 210 500 149 9
7998IL2k7P4k54J89J7l2l47N72n08M16j74P1n8k38L46J86j62l80M43M2M6j48k49
$$ 9 41 14 88 -166 23 40 8 -339 233 -275 141 -33 38 -20 -258 88 274 112 -268 175 217 263 115 -134
8022a34L76l84j0L46k01L24j16j21q0r2o0R8L3j58L66L0j03l38M76j88J6j23o4
$$ -134 242 -142 -152 194 -7 317 201 80 0 -92 -152 -54 -21 -179 187 217 114 -224 252 64 80 -43 -107
8045a07J21j04J08O5J9j99n7L16j31J20k00j06K39M4j29jJ63l67K77mo5o7L3L3
$$ -107 14 -90 18 83 102 -97 -154 162 31 151 -49 -155 84 128 -1 -2 161 -206 71 67 2 -65 -32 1
8069AOJ2L7kmJ46k63n1K70k17K49r8n5kL02n41M53j84j36J55j09J60k60K70r1
$$ 1 7 19 56 54 50 196 -67 -118 152 -65 184 86 31 29 331 -210 243 59 -77 78 -31 129 -131 139 48
8094D8j61m5o7J48J1J71l39K75Q7o6r5K62j59j24J96l49K44K45j59j80P8Q8j38
$$ 48 -113 -158 -225 -77 -66 105 -234 41 128 62 -33 229 70 -54 142 -207 37 282 123 -57 21 109 -29
8117b9j48L57L8j39j78M62n73N25m49J28O9k79M46m43R6J83k8p9j12J76K5k53
$$ -29 -177 180 218 79 -99 363 -210 315 -134 -6 63 -216 230 -213 -117 66 38 -41 -153 23 48 -205
8139b05M82k52j37k9K81l14J97Jm54N69K0k76M0J63J12J13k44m2j02o9QNP5K34
$$ -205 277 25 -112 -141 140 -174 23 24 -430 139 159 -117 -77 86 198 311 67 25 -77 -146 -138 -133 -58 176
8163A76m49M29j67m5j11J60r3m5K27j12J18j03K03n11J91K67J19l72l9J18J01
$$ 176 -273 156 -11 -56 -167 -7 -100 -145 82 -30 88 -15 188 -323 -132 135 254 -118 -157 -39 62
8184F2n6J52j13n1j79q2L41
$$ 62 6 158 45 -6 -185 -267 74
8191G4
$$ Imaginary data points
##PAGE= N=2
##DATA TABLE= (X++(I..I)), XYDATA
0@%%%%%%QqQj6J6k4L2m0N5o3P2q8J12j44J68k00K40k80L28l84M48n20O00o88P90
$$ 0 0 0 0 0 0 0 8 0 8 -8 8 -16 16 -24 31 -32 40 -48 64 -80 88 -112 128 -152 176 -208 240 -280 320 -368 422
31D22r03J028j166J319j486J670j873K096k342K606k899L220l566L948m365M821
$$ 422 -481 547 -619 700 -786 884 -989 1107 -1235 1371 -1528 1692 -1874 2074 -2291 2530
47B530n318N862o460P114p839Q641r528J0522j1641J2908j4358J6033j7997K0342
$$ 2530 -2788 3074 -3386 3728 -4111 4530 -4998 5524 -6117 6791 -7567 8466 -9531 10811
61A0811k3192K6743l1317L7467m6233N9838q4049J40387n22924l11683O98700
$$ 10811 -12381 14362 -16955 20512 -25721 34117 -49932 90455 -432469 -744152 -45452
72d5452M04270L74317L581j95898m37111l85853l07749k8904J72890L40408L25869
$$ -45452 358818 733135 736716 540818 103707 -282146 -589895 -618799 -445909 -105501 220368
83B20368K64612M2176j47868k84062k80834k19562l3887J27643K28965K27950
$$ 220368 484980 527156 379288 95226 -185608 -405170 -439057 -311414 -82449 145501
93A45501J82834M1141r7141j91307k03956j58467l1591Q5273J57624J71287J32104
$$ 145501 328335 369476 272335 81028 -122928 -281395 -312986 -227713 -70089 101198 233302
104B33302K7846o7352j26171j45812j15989k7400N3346J03806J27050J03505K6268
$$ 233302 261148 193796 67625 -78187 -194176 -221576 -168230 -64424 62626 166131 192399
115A92399m7772r0964j07072q3518k0981L4463P1995R1829P3061K0388k5441n8988
$$ 192399 144627 53663 -53409 -136927 -157908 -123445 -51450 40379 113440 133828 108387 49399
127D9399q1630o5402j7125K3112N0476O7467N3594J5431j5941m1293n7921m6828
$$ 49399 -32231 -97633 -114758 -91646 -41170 26297 79891 95322 79381 38088 -19833 -66661
139f6661j5246J1707L5362N1455L9945J2197r711k9940m2983l2064j0925N861
$$ -66661 -81907 -70200 -34838 16617 56562 68759 59048 29108 -13875 -45939 -56864 -51003
151e1003K3878L6755K8753J1624m477k1503l2664k4330q757L444J8447K6426J9702
$$ -51003 -27125 9630 38383 50007 45530 24027 -8637 -32967 -41724 -38280 -19833 6593 26295
164B6295Q100j231j4671k2933j7353q282K22J3835K0175J4655O777n22j1711j6017
$$ 26295 34395 33164 18493 -4440 -21793 -30075 -29853 -16018 4157 18812 25589 25067 13356 -2661
178b661j1546o594j126R710J3845J0217O708Q31q833j2356q323n722l44P335R782
$$ -2661 -14207 -20801 -21927 -12217 1628 11845 18553 19384 10551 -1805 -10128 -15850 -16194 -8859 923
193I23O867N545J402o084q475o595n529p34N813P108N433M213M65m667n296m349
$$ 923 7790 13335 14737 8653 178 -6417 -11946 -12680 -6867 241 5674 9887 10352 5685 389 -3960
209c960m494p33L802M555M080L893P38l515l786l808l023j75K786K577L170L343
$$ -3960 -8454 -9187 -5385 -830 3250 7143 7881 4366 580 -3228 -6251 -6426 -3640 -1063 2107 5450
225E450L44k357k221l195k828k11J824K230K645K176M1j536j388j978k220m52
$$ 5450 5794 3437 1216 -1979 -4807 -5018 -3194 -964 1681 3857 3898 2362 974 -1004 -3224 -3676
241c676J356J235K006K034K77j246j103j774j347n5O90P95J404J166L03j87r68
$$ -3676 -2320 -1085 921 2955 3232 1986 883 -891 -2238 -2293 -1603 -808 596 1762 2065 1878 910
258I10j501j105O9L57Q18Q40R48L47l95m67j070r30j42M21K95Q89O33K05l44l3
$$ 910 -591 -1696 -1627 -1270 -452 388 1336 1683 1288 821 -249 -1179 -1321 -900 -605 284 917 1122 778 745
278G45r69r50K33j63J003L29M41J16k8k70l01p42J8m7J54N64M56K04j01l76m25
$$ 745 -224 -1174 -941 -1104 -101 228 669 785 757 487 186 -556 -538 -585 -431 133 589 793 692 316 -109
299a09k12j93N8L1N73K36m8k88L14l19k54k42L5M90L3L96k1m20lj03P1k91p6K67
$$ -109 -321 -514 -456 -425 148 384 336 48 362 43 -211 -453 -418 72 105 501 480 60 57 -46 25 -266 -342 -75
323g5M2K76j86J02k3j28m35J33K08J74r5J25J82l0q8j21k66j04K10M1K08k9m3
$$ -75 -33 243 57 159 136 8 -427 -294 -86 88 -7 118 300 270 182 61 -205 -309 -99 -58 150 121 78
346G8K7l15J87M9l5k58J90N2m4j59K10K29r0Q6m50J25K36j15K13j7l1K4k8k25
$$ 78 105 -210 -23 26 -9 -267 -77 -25 -69 -228 -18 211 121 207 -243 -118 118 3 216 199 168 192 164 -61
370f1Kj65K27N9k41M32J38n07O8K71k51q3k44M76Nq0j29L42k45lOl7O6k49J45
$$ -61 -59 -224 3 62 -179 253 391 -116 -48 223 -28 -111 -355 121 126 46 -83 259 14 11 17 -20 46 -203 -58
395e8M8J31k85J89n4OK31Q6k60p1L1J05l28L32l54J49K34r7J64j85J06k65p6K53
$$ -58 -10 121 -164 25 -29 -23 208 294 34 -37 -6 99 -229 103 -251 -102 132 35 199 14 120 -145 -221 32
419C2j51J50P9j55j34J63l6J09K48l01n5k38K96m0q7P4n3R5p0M9R5l35L01l10
$$ 32 -119 31 110 -45 -179 -16 -52 57 305 4 -51 -289 7 -33 -120 -46 -99 -4 -74 -25 70 -265 36 -274
443b74l3M37j69J05k7j25K86m29Q4J3L45j09j34j83L84m7r3J56j7O8m91J93J31
$$ -274 -307 130 -39 66 39 -86 200 -229 -145 -132 213 104 -30 -213 171 124 31 187 170 238 -253 -60 71
466G1j30m0L55l57J81k43N4K94J61j45k51R0q7K83q0j46k20M37l38J74k22L8Q7
$$ 71 -59 -99 256 -101 80 -163 -109 185 346 201 -50 40 -47 236 156 10 -210 227 -111 63 -159 -121 -34
489c4k53L48J13P6k02Q0l44L74k45J26JJ4l8n9J04K73j77k37K30r1k13J41j34
$$ -34 -287 61 174 250 48 128 -216 158 -87 39 40 54 16 -43 61 334 157 -80 150 59 -154 -13 -147
512a47K42Oj88j07o3K01jK28N6l01K10n5k40K42j3j02J64o4l5J27k62K59k88m9
$$ -147 95 101 -87 -194 -257 -56 -57 171 227 -74 136 81 -159 83 70 -32 132 68 33 160 -102 157 -131 -180
536a80L96k47M0K76j7o11O15km70p6J55K02l8l11R0M38k48j5mM4K61l11R2K8j44
$$ -180 216 -31 9 285 268 -343 272 270 -200 -276 -121 81 43 -268 -178 260 12 -3 -7 37 298 -13 79 107 -37
561c7K37k49o5K72J23l62j7rJ66l8m9rJ50k98R5l27L38j09K5P2J72n8N7K44l03
$$ -37 200 -49 -114 158 281 -81 -98 -107 59 21 -28 -37 113 -185 -90 -417 -79 -188 -163 -91 81 23 80 324 21
586B1J46J2j44k55K82l63M78m1k6j03j14M2J95l24J43K27o9j3l52N5J11J6k3K09
$$ 21 167 179 35 -220 62 -301 177 136 110 7 -107 -65 130 -194 -51 176 107 94 -258 -203 -92 -76 -99 110
610A10j78J79N6j33q4n1j70Q2K14K65l25J73l06L60m38K56j31JL8K26J16k76q
$$ 110 -68 111 167 34 -50 -101 -271 -189 25 290 -35 138 -168 192 -246 10 -121 -120 -82 144 260 -16 -24
633b4k58J68j40Q7J41p3J2O1J80q3J16k7k26k02K5J42j10p8J82J01J06q3K89k56
$$ -24 -282 -114 -254 -167 -26 -99 -87 -26 154 71 187 160 -66 -268 -243 -101 -211 -289 -107 -6 100 17 306 50
657E0R2k69j6K61K7j96n7R0J8o5j0P5N0k06j4p3K51k51J79K40j78L7m2k05J03
$$ 50 142 -127 -143 118 145 -51 -108 -18 0 -65 -75 0 50 -156 -170 -243 8 -243 -64 176 -2 35 -7 -212 -109
682a09K05k26qJ14K2n7j7Q6j53K07K87k19J67j90m01L77m2p5l33K78j24K27j0
$$ -109 96 -130 -138 -24 -2 -59 -76 10 -143 64 351 132 299 109 -292 85 43 -32 -365 -87 -211 16 6
705FP1j79l6N67l77k34J07o1K39J9j95K51j93q5N3P4j1o9P8LK08j26J49j35q5
$$ 6 77 -102 -138 429 52 -182 -75 -136 103 122 -73 178 -15 -100 -47 27 16 -53 25 28 236 110 259 124 39
730C9J24k72M19m63K48j56o1l7J27K6j7k89J56L60k67p5K35j83o8L51k46p1J83
$$ 39 163 -109 310 -153 95 -61 -122 -159 -32 -6 -23 -312 -156 204 -63 -138 97 -86 -154 197 -49 -120 63
753F3k09L11j78P7j39P7N8jl13K14P5M9m5l22L43j83M72k50l13L14J2Q9nk18J34
$$ 63 -146 165 -13 64 -75 2 60 59 -254 -40 35 84 39 -283 60 -123 349 99 -214 100 112 201 196 -22 112
778A12jk81Qj1N3J06k1p2J16oL34k22j36l4K89l13K0p4J60r4n9K87k39J32j11
$$ 112 111 -170 -162 -173 -120 -14 -35 -107 9 3 337 115 -21 -55 234 -79 -59 -133 27 -67 -126 161 -78 54 -57
803e7L6K18k12p1R3q5J17K09j30r3Q8j97K73o04N52Q8j75J18j81mk58J53L13j2
$$ -57 -21 197 -15 -86 7 -78 39 248 118 25 113 -84 189 -415 137 225 50 168 -13 -17 -275 -122 191 179
827A79p8o2K10j12k55K70j36M8l27K91m5M5J56k45J84J09j84%K1n2J1k69J16J60
$$ 179 101 39 249 137 -118 152 16 64 -263 28 -17 28 184 -61 123 232 48 48 69 17 28 -241 -125 35
851C5J3J1k54L32kk50J77l6j43K22k61j09L87l19M3K57p5PpJ81n3j55K07j70J82
$$ 35 48 59 -195 137 135 -115 62 26 -117 105 -156 -265 122 -197 -154 103 28 35 28 209 156 1 208 38 220
876B20j75j70K50n7j12R4k28J41J72m6N2l27J47K40j42J71k83Lj8k43N01Q1l21
$$ 220 45 -125 125 68 -44 50 -178 -37 135 89 141 -186 -39 201 59 230 -53 -50 -68 -311 190 271 -50
899e0J42M4j8k63K53J3k89K34jj78J64j91K03q7K9j08J02L5J37r1k32L8J4%J49
$$ -50 92 136 118 -145 108 121 -168 66 65 -113 51 -140 63 -24 5 -103 -1 34 171 80 -152 -114 -100 -100 49
924D9j34r9l3N01l95J81j42K42l6l3R5k63p6p4O5J83O4m4j46L88k21j64N0o0J79
$$ 49 -85 -184 -217 284 -111 70 -72 170 134 101 196 -67 -143 -217 -152 31 95 51 -95 293 72 -92 -42 -102 77
949G7j42J63k69J06j43J84r4K83k93L71l28J5K37m0j53J53J0k98L77m50J09J84
$$ 77 -65 98 -171 -65 -208 -24 -118 165 -128 243 -85 -70 167 127 -26 127 137 -161 216 -234 -125 59
971E9K3K3j86M48k64j54R4k58J56J44j11j65L0k2J36J70l1r6k0r4J65M7J88k19
$$ 59 82 105 -81 367 103 -51 43 -215 -59 85 -26 -191 -161 -183 -47 123 92 -4 -24 -118 47 94 282 63
995F3j47K14l02L43m83L3J07J8J51p3r3o5K46L7pp9J18J2k32K16RJ31k57n3J89
$$ 63 -84 130 -172 171 -312 -279 -172 -154 -3 -76 -169 -234 12 49 42 -37 81 93 -139 77 86 217 -40 -93 96
1020I6n5p2j94J46K04q1k55J41K31j62R4j31ro6Q3j03J13p1j62K20J34O7l27K57
$$ 96 41 -31 -225 -79 125 44 -211 -70 161 -1 93 -38 -47 -113 -30 -133 -20 -91 -253 -33 101 168 -159 98
1044I8JJ26l20j2J4j4J72o5L2L6O5k91K60k07j15j7L72q0R3l37J50J51l02J77
$$ 98 99 225 -95 -107 -93 -107 65 0 32 68 133 -158 102 -105 -220 -237 135 55 148 -189 -39 112 -190 -13
1068a3j04J76N7j82OR1r3p8j44M38Jl85L76o9k01K21J8k53J03K97r2j67K9j20
$$ -13 -117 59 116 -66 -60 31 -62 -140 -284 154 155 -230 146 77 -124 97 115 -138 -35 262 170 3 32 -88
1092h8K25m28K02L01j96J8J30l08P5L4o0J9NL24m9k71O3j35J97l3p1Rj85J79j74
$$ -88 137 -291 -89 212 16 34 164 -144 -69 -35 -95 -76 -71 253 204 -67 -4 -139 58 25 -46 -37 -222 -43 -217
1117b17K50J81l57L68m48J55K1r9K72mk0j62K0j06Pj21J85j47L08k78P5R7J25
$$ -217 33 214 -143 225 -223 -68 -47 -146 126 122 102 -60 -40 -146 -139 -260 -75 -222 86 -192 -117 -20 105
1140A05j34P1J04J49q1k25mj51Q2L30l2m90K53n0j38L54k13N2o0j63K27k02J05
$$ 105 -29 42 146 295 214 -11 -15 -166 -84 246 214 -276 -23 -73 -211 143 -70 -18 -78 -241 -14 -216 -111
1163a11M8l3K38q8J61l63p2J91P8J4N7J01P2k95J61j35k30N27m40J02m7P5j98
$$ -111 -63 -96 142 54 215 -148 -220 -29 49 63 120 221 293 -2 159 24 -206 321 -119 -17 -64 11 -187
1186a87J15j32J79r4R5k30J95K86k66J40L0k05p9pP4J38j18J76q1k6j25J76m6
$$ -187 -72 -204 -25 -119 -24 -254 -59 227 -39 101 131 -74 -153 -160 -86 52 -66 110 29 3 -122 54 8
1209Hl08M49J9k31J0M4j59j00L77m1k96K89k72L79j81K05k4m2j92q1K22j17p6
$$ 8 -300 149 168 -63 -53 -9 -168 -268 109 68 -228 61 -211 168 -13 192 168 126 -66 -147 75 -42 -118
1232a18Q1J2R5jj52K27k24N7P6m8j01j6L35m01K27K24m37P5K04l32J59K4J47j90
$$ -118 -37 -25 70 69 -83 144 -80 -23 53 5 -96 -112 223 -178 49 273 -164 -89 115 -217 -58 -34 113 -77
1256g7j89K39J43j53NJ50Oj98J45J14j4m6n0J12l87J73J28k58J94j17qj94J84
$$ -77 -266 -27 116 -37 -32 118 124 -74 71 185 171 125 75 187 -200 -27 101 -157 37 -80 -88 -282 -98
1279i8O6m7K1M4K73m41L73n9j6J06r2j65k31J85p5J04Nj15J80l6j7k66O61n06
$$ -98 -32 -79 -58 -14 259 -182 191 132 116 222 130 -35 -266 -81 -156 -52 -47 -162 18 -18 -35 -301 360 -146
1303a46J47Q2N4k84K4m4j73L8J18J93J2m1rO8n5L7k24K35l18M17l43r0M29k15
$$ -146 1 83 137 -147 -123 -167 -340 -302 -184 9 21 -20 -29 39 -16 21 -203 32 -286 131 -212 -302 127 -88
1327h8J44j0O8k80N7R9m6J23j83J3J13J94l58J5M6m0L10l55o0K31J49l35K60J7
$$ -88 56 46 114 -166 -109 -10 -56 67 -116 -103 10 204 -154 -139 -93 -133 177 -178 -238 -7 142 -193 67 84
1351H4p8j18l7J79j34K3O7j07K43k4O0j72J01j88l82N53m7R7k30L24j89J16j4
$$ 84 6 -112 -149 30 -104 -81 -14 -121 122 98 158 -14 87 -101 -483 70 23 120 -110 214 25 141 127
1374A27L3l41Q6J24p6L04k25R1O9N5j28k92RK18l9r9j12K37j17J65Q1k92j6L4
$$ 127 160 -181 -95 29 -47 257 32 123 192 247 119 -173 -164 54 15 -84 -196 41 -76 89 170 -122 -138 -104
1398a04J45j35J94j82n2K77l01L91j61J0j24j32L10L1j99P9m1m7L41o0Lk55K51
$$ -104 41 -94 100 -82 -134 143 -158 233 72 82 -42 -174 136 167 -32 47 6 -41 300 240 243 -12 239
1421B39J01l18j69Q2J80l02L37k90O7L83j13n7k46N2J2j79R2M1J18%k54L63k8
$$ 239 340 22 -147 -65 115 -187 150 -140 -73 310 197 140 -106 -54 -42 -221 -129 -88 30 30 -224 139 111
1444A11m35N27k48J60o1J94j53k01j2R5m9J30J11k49l2n5K38p8J29k81J60J2j19
$$ 111 -324 203 -45 115 54 248 95 -106 -118 -23 -72 58 169 -80 -112 -167 71 -7 122 -159 1 13 -106
1467a06Q6q3J53j90rK08K9L9k50L49j86q6K36k58N2k15J95o6K12l3K13k42m5J14
$$ -106 -20 -103 50 -140 -149 59 88 127 -123 226 40 -46 190 -68 -16 -231 -36 -102 110 77 290 48 3 117
1491A17j9J48r2j11J49N3k54l9j50J57k57K22K29n0l00o0K16J65j49j72K48Q9
$$ 117 98 246 154 43 192 245 -9 -48 -198 -41 -298 -76 153 103 -197 -257 -41 124 -25 -197 51 140
1513A40l67L96j51O9k31J44J52n9j96K58J75j17k04j98J80L83m83k20N00k98L04
$$ 140 -227 169 18 87 -144 0 152 93 -103 155 330 213 9 -189 -9 374 -109 -329 171 -127 177
1534A77q4j70K3J01J83l94O9K89k94M05m23L2k08K43L9Q3j88K08m2M2k3nl0j30
$$ 177 93 -77 -54 47 230 -164 -95 194 -100 305 -118 -86 -294 -51 -12 71 -117 91 49 91 68 63 33 -97
1558i7K65j96J71j31n9j14L84j3k91J79j54K41k00j98J49K8O9L10R5l72m01N9
$$ -97 168 -28 143 12 -47 -161 223 210 -81 98 -56 185 -15 -213 -64 -36 33 343 438 66 -335 -276
1580b76K38k29J00P1J98j54J61k23O8J35m8Jp8K2J15P9k61O9j63r0L29j09j79
$$ -276 -38 -267 -167 -96 102 -52 109 -114 -46 89 41 42 -36 -14 101 180 -81 -12 -175 -265 64 -45 -224
1603b24J06J07Q2k52m5L09j86l1L05k34M0P8k02K72j29k10K70L3o2k06N4j2J98
$$ -224 -118 -11 71 -181 -226 83 -103 -134 171 -63 -23 55 -147 125 -4 -214 56 89 27 -179 -125 -137 61
1626F1l08K28J10l11L01q8K56p8J08j71L9k87J57L08n08M17k24j89J5k2J40o0
$$ 61 -247 -19 91 -220 81 -7 249 171 279 108 147 -140 17 325 -183 234 10 -179 -164 -186 -46 -106
1648a06q6M25k61J94j34p4J85r7m8j32K48k92M0K29j14J0K60n16L01J47l44J20
$$ -106 -192 233 -28 166 32 -42 143 46 -2 -134 114 -178 -138 91 -23 -13 247 -269 32 179 -165 -45
1670d5J0J99j29j65k3p0M03l74J78o1j4K86l73K82j56l9L1o6Q4J70j04j65K86
$$ -45 -35 164 35 -130 -153 -223 180 -194 -16 -77 -91 195 -178 104 -52 -91 -60 -126 -42 128 24 -141 145
1693A45j26n2j7q7K18N5J6j49N0N5lj63j60J5K82k82K70j51o4R0l3j26J19J58
$$ 145 19 -33 -50 -137 81 136 152 3 53 108 105 -58 -218 -203 79 -203 67 -84 -148 -58 -91 -217 -98 60
1717F0jl6L33n61K74k41J82K8k1R6j29j09Q1K1k95N82n03L31Jp8p8r6N8Q8j39
$$ 60 59 23 356 -205 69 -172 10 38 17 113 -16 -125 -44 -23 -318 264 -239 92 93 15 -63 -159 -101 -13 -152
1742a52K30J29m09K65J81l14K13j60M8Q1l44J54J62j94N8N2N1K15j99r1j4j2K38
$$ -152 78 207 -202 63 244 -70 143 -17 31 112 -232 -78 84 -110 -52 0 51 266 67 -24 -38 -50 188
1765A88m6J0m88K40J33K18m06J84j30P3r4l5J26j42J1J90N7k52K72j23l66M52
$$ 188 142 152 -336 -96 37 255 -151 33 -97 -24 -118 -153 -27 -169 -158 32 89 -163 109 -14 -380 72
1787G2P9k11J5J99J43l37k8L1J4N8J41k94K55k97J13K59k47o2J60J39k13N6r2
$$ 72 151 -60 -45 154 297 -40 -68 -37 -23 35 176 -118 137 -160 -47 212 -35 -97 63 202 -11 45 -47
1810d7J61j85J55j44P6K46j37Q9m9j70R6j80J60k4M7j21p4j90K01J29q3j29O2
$$ -47 114 -71 84 -60 16 262 125 214 165 -5 91 -89 71 47 94 -27 -101 -291 -90 39 -44 -173 -111
1833a11K09k62K01J0mj07J78qj60K6q2J86O4k12J7l7M7O2k8p9j11M04l57J97k27
$$ -111 98 -164 37 47 43 -64 114 106 -54 -28 -110 76 140 -72 -55 -92 -45 17 -11 -90 -201 203 -154 43 -184
1858a84J98k7p7K72j88p2m4O0J99j31j19O3K96o8j53m5j5M75k83k46M0j1J81j46
$$ -184 14 -13 -90 182 -6 -78 -122 -62 137 6 -113 -50 246 178 25 -20 -35 440 157 -89 -49 -60 121 -25
1882b5q1J81j29j39r6J70K42j28k5MK85l78J71l4j33R0j4l07K60K53j10N1R2k50
$$ -25 -106 75 -54 -193 -289 -119 123 -5 -30 -26 259 -119 52 18 -115 -25 -39 -346 -86 167 57 108 200 -50
1906e0j8K57j85oN5OPj33M25o44K87j30J72k84K08K32p0j87K22m15j18N02p7k25
$$ -50 -68 189 4 -2 53 59 66 -67 358 -286 1 -129 43 -241 -33 199 129 -58 164 -251 -369 133 56 -169
1930a69K10K09m49O8M8M62n16J85k01P3K2pJ27p5o6j28P3K56K6m9r5j77J94j55
$$ -169 41 250 -199 -131 -83 379 -137 48 -153 -80 -58 -65 62 -13 -79 -207 -134 122 148 99 4 -173 21 -134
1954a34l0J28j78K85j68K64l53K07n7p2J61j0m2p9j12P9L31k66J28l9N6j06r1
$$ -134 -164 -36 -214 71 -97 167 -186 21 -36 -108 53 43 1 -78 -190 -111 220 -46 82 43 99 -7 -98
1977i8J59k10L80L8k54R2k97K15q3J50j68L57l80m8J21j23J16j06L41j75J51k59
$$ -98 61 -149 231 269 15 107 -190 25 -58 92 -76 281 -99 -147 -26 -149 -33 -139 202 27 178 -81
1999h1M9n6J54l0jJ45k85L24l57O5%L3K67m67K97j29J07j22J81l78l1L90R8j54
$$ -81 -32 -88 66 36 35 180 -105 219 -138 -73 -73 -40 227 -240 57 -72 35 -87 94 -284 -315 75 173 19
2023A9j24P2P7J49l36l7J46M6j96L81N5k01n48O47j21K9J25J6r9j42J03P4O8j92
$$ 19 -105 -33 44 193 -143 -180 -34 12 -184 197 252 51 -497 150 29 58 183 199 100 -42 61 135 203 11
2047A1j20Q7J89j57j14L79k01p1p3q5K72j97J09J64j2j81K69k9j73m2R5j60J51
$$ 11 -109 -22 167 10 -104 275 74 3 -70 -155 117 -80 29 193 181 0 269 240 67 25 120 -40 111
2070A11l75K11L38l43K75j90N5L8J40j60J27m54J32J84j36l3R3M6l11J17J35j78
$$ 111 -264 -53 285 -58 217 27 82 120 260 100 227 -227 -95 89 -47 -80 13 59 -252 -135 0 -178
2092a78J60j18L31k15J34j81J28J94M3k82K27l79J74k3M3k15J47R0j68k04K50
$$ -178 -18 -136 195 -20 114 -67 61 255 298 16 243 -136 38 15 58 -157 -10 80 -88 -292 -42
2113d2O0o6P2P0K02k65l05L54m63L79j62L2K27k53K66k02J81m9m40L68K07l28
$$ -42 18 -48 24 94 296 31 -274 80 -383 -4 -166 -134 93 -160 106 -96 85 36 -404 -36 171 -157
2135a57o5J52n2L44l72J58J36j46J40k01J51k4j69J79m3r1rq3q4M05k98L69m62
$$ -157 -222 -70 -122 222 -150 8 144 -2 138 -63 88 64 -105 74 31 -60 -69 -152 -236 169 -129 240 -222
2158b22J48j33K41O0k20P9J8L35n86L12k25L30l3k56M48n51L45j03J5j05J85p6
$$ -222 -74 -207 34 94 -126 -47 -29 306 -280 32 -193 137 104 -152 296 -255 90 -13 2 -103 82 6
2180Fm6J42k65J43m5j7J39k70J45q6L9Q1k30pL34J51l32L33j80k23J4J01j2J95
$$ 6 -40 102 -163 -20 -65 -82 57 -213 -68 -154 -115 -34 -264 -271 63 214 -118 215 35 -188 -174 -73 -85 110
2204A10P4l10K25q0j49K55j43R7j31J00j62J63P7l8l32M40l49N4J60Q9l11q6L20
$$ 110 184 -126 99 19 -130 125 -18 79 -52 48 -114 49 126 88 -244 196 -153 -99 61 150 -161 -247 73
2227G3j68K0j37K18J02j28J9J40k05K08l11K96j72J71K24l28j1L21l17jj23l5
$$ 73 -95 -75 -212 6 108 -20 -1 139 -66 142 -169 127 -45 126 350 22 11 332 15 14 -109 -144
2249a44p3K01j24P1L2R9j32o7J68j40K46j83RJ45O1n9q3K04p6J4j96N2j42R4J18
$$ -144 -217 -16 -140 -69 -37 62 -70 -137 31 -109 137 -46 -37 108 169 110 27 231 155 169 -27 25 -117 -23 95
2274I5k87K70Q7k69L72l82J51M9j76Q3K4L4N7j38k52K0N21n1k15J48j72K30k40
$$ 95 -192 78 165 -104 268 -114 37 86 -90 -7 17 51 108 -30 -282 -262 259 208 -7 141 -31 199 -41
2297d1J60j54j32J02J45j29p0P8J16k98J96J38J20m29L49k64RK80j81J24j15K58
$$ -41 119 -35 -167 -65 80 -49 -119 -41 75 -223 -27 111 231 -198 151 -113 -104 176 -5 119 4 262
2319B62l83L6J10j47K27j8r2k49L14J27l18R5J62J36k48J55k03K76n2m75M64J89
$$ 262 -121 -85 25 -122 105 87 -5 -254 60 187 -131 -36 126 262 14 169 -34 242 190 -285 179 368
2341C68k78%j99K44j53K2J10%j20o4j06o5J32K45k78M07k25j81L47l37K43j52
$$ 368 90 90 -109 135 -18 4 114 114 -6 -70 -176 -241 -109 136 -142 265 40 -141 206 -131 112 -40
2363d0J15Q8k67N4J30o1m8R8j58nR1k27K7J77J80Q3l94Q3j0P8J09J0J00Nl44r4
$$ -40 75 163 -104 -50 80 19 -29 69 -89 -94 -3 -230 -203 -26 154 237 -157 -74 -84 -6 103 113 213 218 -126 -220
2389b20J79J04k70K92J40j48Ok6k7N1m2q3J18r6j37J77P0j24k59R5K08k5J63j44
$$ -220 -41 63 -207 85 225 77 83 57 30 81 39 -44 74 -22 -159 18 88 -36 -295 -200 8 -17 146 2
2413BJ35m58L62O4l2p6j1mL7l6j4j5J85j41k55J78P3J96m15K63k8J35m23K87J49
$$ 2 137 -321 41 105 73 -3 -14 -18 19 -17 -31 -46 139 -2 -257 -79 -6 190 -225 38 10 145 -278 9 158
2438A58n3m0K7l8r0K39j34P5p0r1J0k5o8K82j67j18j02L18j89K80q1q5M5k24n4
$$ 158 105 65 92 54 -36 203 69 144 74 -17 -7 -32 -100 182 15 -103 -205 113 -76 204 123 38 83 -141 -195
2463a95Q8q9n8J85J09q9M5k30K27P8J4q8L1j36r6J62J54n5j40L57m65k9K63k47
$$ -195 -107 -196 -254 -69 40 -49 -4 -234 -7 71 85 -3 28 -108 -204 -42 112 57 -83 274 -191 -220 43 -204
2487b04J57J88M4j13Oj75j21K63j50m0L31k12N7q6O9j99M07l83j36N21l75L1L2
$$ -204 -47 141 185 72 78 -97 -218 45 -105 -145 186 -26 31 -55 14 -185 222 -161 -297 224 -151 -120 -88
2510h8K68k22Q3R0j15O6PoQ8l18J11P2k13J15k0J09j75j5J59m0K75k42k30K07
$$ -88 180 -42 41 131 16 82 89 83 171 -147 -36 36 -177 -62 -82 27 -148 -163 -4 -44 231 -11 -241 -34
2534c4k9K00k45k06j0K25L5J99j77N0n8J33j92L47l69P6Mj31M28k93q4J93j52
$$ -34 -63 137 -108 -314 -324 -99 -64 135 -42 8 -50 83 -109 238 -131 -55 -51 -182 246 -47 -131 62 -90
2557i0L3J39L3j32J55j2j76N5p6l16L40j66K71k1J3l07L79L43l94N2j62mj8jj26
$$ -90 -57 82 115 -17 138 126 -50 5 -71 -387 -47 -213 58 37 50 -257 122 465 71 123 -39 -43 -61 -62 -188
2582a88L11k19O0J80Q5k54q9J16o6k17J97Kq0K12j74n3K71j06k11K55M5J93j56
$$ -188 123 -96 -36 144 229 -25 -114 2 -64 -281 -84 -82 -162 50 -124 -177 94 -12 -223 32 77 270 114
2605A14j18j76J92j34PJ95q5L9m3Q0R4j7k20K94l64L57n06K48L2k60J80p3R9K11
$$ 114 -4 -180 12 -122 -115 80 -5 34 -9 71 165 148 -72 222 -142 215 -291 -43 -11 -271 -91 -164 -65 146
2629A46k84K02P1j62J22k31k1K65j20m7N5Q7kj66K16j83J05k01K23j8r1M11k11
$$ 146 -138 64 135 -27 95 -136 -157 108 -12 -59 -4 83 81 -85 131 -52 53 -148 75 57 -34 377 166
2652A66l16K71m01L24k70K76k50K34k99M74k18J99j33o4j55RJ3J8K3J48Q9j05
$$ 166 -150 121 -280 44 -226 50 -200 34 -265 209 -9 190 57 -7 -162 -153 -140 -122 -99 49 138 33
2674C3l8J63l6j59J94k00J23N0R9k60p4j18L27k34L40l54j33L57k39Q7J42o0j48
$$ 33 -5 158 122 -37 157 -43 80 130 229 -31 -105 -223 104 -130 210 -144 -277 80 -159 -72 70 10 -138
2697a38K95j20l61J86n9M36j84r1p7J06j06K42r6K8LJ71k59k9k35N5L09J6l54
$$ -138 157 37 -324 -138 -197 239 55 -36 -113 -7 -113 129 33 61 64 235 -24 -53 -288 -233 76 92 -262
2720b62M40m8k74J36k25L81r0L3k55K98l09K74j82R6ql0l9J71n3j35O5j33J44
$$ -262 178 130 -144 -8 -233 148 58 91 -164 134 -175 99 -83 13 5 -25 -64 107 54 -81 -16 -149 -5
2743ej66K34j76J24k19J30m5J80j18Q5J23j01k29K39R2Jj33l26K71K59k29k15
$$ -5 -171 63 -113 11 -208 -78 -123 57 -61 24 147 46 -183 56 148 149 16 -310 -39 220 -9 -224
2765b24K07K87k13P3k93K86J40k20nKj69K09j46J21M4o8p9OL4k0o2J71P6j41k55
$$ -224 -17 270 57 130 -163 123 263 43 38 40 -129 80 -66 55 99 31 -48 -42 -8 -28 -90 81 157 16 -239
2790b39J88j76J98j34K12K8k32K08k00K27k42K9J10P5J60j16j76K23l12M26j26
$$ -239 -51 -227 -29 -163 49 77 -155 53 -147 80 -162 -133 -23 52 212 96 -80 143 -169 257 131
2811A31p3n6K28Q1n47L89j69K29j00k5j43J80j34j33J06N6jn0j1J73l02J84O1
$$ 131 58 2 230 311 -236 153 -16 213 113 88 -55 125 -9 -142 -36 20 19 -31 -42 131 -171 13 74
2834G4j37q5j29K49J91n8k13nj49K15J5j63K74O5j45Q6k52L84j99o5O9p8K24p6
$$ 74 -63 -148 -277 -28 163 105 -108 -113 -262 -47 -32 -195 79 144 -1 85 -167 217 18 -47 22 -56 168 92
2858I2j84J95k35K93O4k36p0L06n3k80K77l04N8O6j56J69J54k73P1J7l2J32k36
$$ 92 -92 103 -132 161 225 -11 -81 225 172 -108 169 -135 -77 -11 -167 2 156 -117 -46 -29 -61 71 -165
2881a65m0K87r5k2j35K04Qk72L51k36K58l12L68j34j55K81l30N62o39J49j46K61
$$ -165 -205 82 -13 -35 -170 34 42 -230 121 -115 143 -169 199 65 -90 191 -139 423 -216 -67 -213 48
2903D8K06l00j4K20k92Q6p7j9K77R7k73k69J76P2K18j06L08m10k4M7j13K29j38
$$ 48 254 -46 -60 160 -132 -46 -123 -142 135 232 -41 -310 -134 -62 156 50 358 -52 -76 -29 -142 87 -51
2926e1l8jN9R5j77J83J84k99j21L22k43K48q9l69J27J37o9J99J03j11q6J78m49
$$ -51 -89 -90 -31 64 -113 70 254 -45 -166 156 -87 161 72 -297 -170 -33 -102 97 200 89 3 181 -268
2949b68K96M1k74M70m67J67K9n7R4j40lk1o0R0j80J20K62P6j97K36l66K20o8j53
$$ -268 28 69 -205 265 -202 -35 -6 -63 31 -109 -112 -133 -193 -103 -283 -163 99 175 -22 214 -152 68 0 -153
2973a53O93o26J87j20j58K91k82K40R2l83K78QJ89l37Q1qN0j40O9n6J02L0r6K83
$$ -153 540 -86 101 -19 -177 114 -168 72 164 -219 59 67 256 -81 0 -8 42 -98 -29 -85 17 47 -49 234
2997B34m4M8l54K31j19J82l29J69k78J39k12K85k59K96K66k99j89K0N4J09J97
$$ 234 190 238 -116 115 -4 178 -151 18 -260 -121 -333 -48 -307 -11 255 -44 -233 -213 -159 -50 147
3018A47j76M0P9q1j95M19P3j8o51M1K32J14J00l99K95r9jj37Q0o1J28J68L5q8
$$ 147 -29 11 90 9 -186 233 306 288 -363 -322 -90 24 124 -275 20 -79 -80 -217 -137 -198 -70 98 133 45
3042D5j30M3N3k19L88r8k01J39j80N8nK28k04l8J7J28K87l32J64k57J38j12J47
$$ 45 -85 -42 11 -208 180 82 -119 20 -160 -102 -107 121 -83 -121 -104 24 311 -21 143 -114 24 -88 59
3065E9P2j93K08l08P0L2j72K20n4Q8J18o5lJ9n14L76k10Q9M3J98k85J84P6R6j9
$$ 59 131 -62 146 -162 -92 -60 -232 -12 -66 22 140 75 72 91 -423 -47 -257 -168 -125 73 -212 -28 48 144 125
3090A25q9j72R5j53J11K71J1p1j06m4oR0J66m75J56r1j48K50J43J8j9l18K06j31
$$ 125 36 -136 -41 -194 -83 188 199 128 22 -22 -28 62 228 -247 -91 -182 -330 -80 63 81 62 -256 -50 -181
3114a81J06m2J41K1ok0J42k61J7J66Qj41j54K76k77J73P6J32j5l37K32K9j79J49
$$ -181 -75 -117 24 45 39 19 161 -100 -83 83 91 -50 -204 72 -205 -32 44 176 161 -176 56 85 -94 55
3138E5k11K86k59J92J93l40j1J8J69k31M85m62K53j00j23R6j62l8J31J09J86k38
$$ 55 -156 130 -129 63 256 -84 -95 -77 92 -139 346 -116 137 37 -86 10 -152 -190 -59 50 236 -2
3160bj98K21J48l01Q2N8K24q7k28j36M3Q8j2k6M0k7L94k89q6R0L8Rk23n2M29o3
$$ -2 -200 21 169 -132 -50 8 232 145 -83 -219 -176 -88 -100 -126 -86 -113 281 -8 -94 -4 34 43 -180 -232 197 134
3186A34k64R7k3J66q5j58J07K6o0l2kL03k48j72kK78j83J67k2r8j24K04J37j69
$$ 134 -130 -33 -56 110 25 -133 -26 0 -60 -92 -94 209 -39 -211 -213 65 -118 49 27 -71 -195 9 146 -23
3210b3Q7m0J15p5M6j49L04k99j07R4O5nO2k13J20j2q8K16M4j08j10J89m6J00n5
$$ -23 64 24 139 64 110 -39 265 -34 -141 -47 18 13 75 -138 -18 -30 -118 98 142 34 -76 113 67 167 112
3235A12j99l12L13L38p6k79J23j53K88kj83J59o5k63K15J34k57J64L7j65Lj37
$$ 112 -87 -399 -86 252 176 -103 20 -133 155 153 -30 129 64 -199 16 150 -107 57 94 -71 -68 -205
3257b05Q8L27k63K33l07K33j22L35l02J9k92J47J01q8L81j08n6p4Q8k82K12jj30
$$ -205 -117 210 -53 180 -127 106 -16 319 17 36 -256 -109 -8 -96 285 177 121 47 135 -147 65 64 -66
3280f6J50j47j51M12Q4j77l1j09R8j8J18l44J71Pj16J89n90M34J59j54L14l82
$$ -66 84 -63 -214 198 282 105 74 -35 63 45 163 -181 -10 -3 -119 70 -520 -86 73 -81 233 -149
3302a49q3K15K00J7k09nJ17j98K62k11J46p8j46J64l1Q1j60q0J73N2M3j79J85
$$ -149 -232 -17 183 200 -9 -14 103 -95 167 -44 102 24 -122 42 11 92 -68 -148 25 77 120 -59 126
3325A26j31j57K02l07K97m7q3rK28j34j47R7p4j4K38j5k18J34J20k39P7R7LJ68
$$ 126 -5 -162 40 -267 30 -17 -100 -109 119 -15 -162 -65 -139 -153 85 70 -148 -14 106 -133 -56 41 44 212
3349B12j04M8j42j98M41k39j85J19j27k0J94j33L45k98r9K61j64j14L24Q0j64
$$ 212 108 156 14 -184 257 18 -167 -48 -175 -195 -1 -134 211 -87 -186 75 -89 -203 121 201 37
3370C7m19K71J56r4qR2L5n8k33N59m14N1Q1k27o1L45k94pJ30J62J01j2l47O3J01
$$ 37 -382 -111 45 -49 -57 35 70 12 -221 338 -76 -25 56 -171 -232 113 -181 -188 -58 104 205 193 -154 -91 10
3395A0J07P4k11M4j47P9K84J4j38Mj70j10L84k80J78j94n9P7J04J21k65l8l8J
$$ 10 117 191 -20 24 -123 -44 240 254 116 120 -50 -160 224 -56 122 -72 -131 -54 50 171 -94 -132 -170 -169
3419a69K90o1j41L9M5j4k38K84j27j75K44J09k05J5J12m02M07r9J81Q6k13J7Q6
$$ -169 121 60 -81 -42 3 -11 -249 35 -92 -267 -23 86 -119 -104 8 -394 13 -86 95 181 -32 -15 71
3442G1l39L64Q3l8j54j60L08k44K81k19J48j45k36J40M25j46R5j98L5k33k7K71
$$ 71 -268 96 179 141 -13 -173 135 -109 172 -47 101 -44 -280 -140 285 139 234 36 71 -162 -189 82
3464H2j90J71J94n21L66m8j6j70J23n4L65l50n8L50m06L70r1l03M1K4K07R3k02
$$ 82 -108 63 257 -264 102 54 38 -132 -9 -63 302 -48 -106 244 -162 208 117 -186 -145 -121 86 179 -23
3487b3K05k26k10K25l01M84l89P6O9l2NP9K3j95L98k08PK05l16J55k32j24L95
$$ -23 182 -44 -254 -29 -330 154 -235 -159 -90 -122 -117 -38 -15 -210 188 -20 -13 192 -124 31 -201 -325 70
3510G0k0NQ3L9j61KL3jJ55j15j42j7p4N36l54O6LO8k42k16N71l38J86j56k47K20
$$ 70 50 55 138 177 16 18 51 50 205 90 -52 -69 -143 393 39 105 108 176 -66 -282 289 -49 137 -19 -266 -46
3536d6LM1K46j18n8k36N9j58J26L06n9L1n4J28l2k08J64j53j56j2P1K22q4n9k7
$$ -46 -43 -2 244 126 68 -168 -109 -267 -141 165 106 137 83 211 179 -29 135 -18 -174 -186 -115 107 23 -36 -63
3561f3L7j60L0J11j6p4k1L7K40j02P7j41o2L55o5l14l3J84o3q1L64k06n3J35J05
$$ -63 -26 -186 -156 -45 -61 -135 -156 -119 121 19 96 -45 -107 248 183 -131 -164 20 -43 -124 240 34 -19 116 221
3586B21M4l01Q9l43K92q0m8j10J94J3m7O1j41K01j47O1R7O8l45K54j47K75m09
$$ 221 265 -36 53 -290 2 -78 -126 -236 -42 -29 -76 -15 -156 45 -102 -41 56 124 -221 33 -114 161 -248
3609b48J60J25j68J06O8O6k02L14p3k16o2K4J7K10j58M7m9N6J08q5K2l2L4M6k7
$$ -248 -88 37 -131 -25 43 109 -93 221 148 -68 -130 -106 -89 121 -37 10 -39 17 125 40 62 30 64 110 83
3634H3j98QJ88k89J32J43k20K64k3j79o7M82l41j05K46k52K8J27K6j50J72J3J60
$$ 83 -115 -107 81 -208 -76 67 -153 111 88 -91 -158 324 -17 -122 124 -128 -100 27 53 -97 75 88 248
3657B48m13Rq5K91j07n9k22K77J58j17J68r3p8n5J87k97K27j33K07N8j94K13k66
$$ 248 -165 -156 -241 50 -57 -116 -338 -61 97 -20 148 55 -23 -78 109 -188 39 -94 113 171 -23 190 -76
3680g6LO9j48K06j11J8J47k73j4R9J65j61P1P4l4o8J42K76n58J98J22J98l86J02
$$ -76 -73 -4 -152 54 -57 -39 108 -165 -179 -80 85 -76 -5 69 35 -33 109 385 -173 25 147 345 -41 61
3704F1J56o42K93K18j98J86J40n09M84l13RJ0j3k19K99j04QL02J14k80nj75K29
$$ 61 217 -425 -132 86 -112 74 214 -295 189 -124 -115 -105 -118 -337 -38 -142 -134 168 282 2 -3 -178 51
3727E1R4j97R5K27l02J63j50p4N1K85m2j81J42j67k2J05n5L8m1l1Q8L4j23J72
$$ 51 145 -52 43 270 -32 131 -19 -93 -42 243 201 20 162 -5 -27 78 23 61 20 -11 77 111 -12 160
3751A60m77M13j70L4l9r8K13j59j1l1LJ56O4q4N4l98M13p1m1K9K2J30o5j15J56
$$ 160 -317 96 -74 -40 -79 -177 36 -123 -134 -165 -162 -6 58 -26 28 -370 43 -28 -69 -40 -18 112 47 -68 88
3776H8j24J22Nn4j83M6J8M83l78m0K0Q4L8q9j67K59M2qq4pJ57m68L86m06K73l7
$$ 88 -36 86 91 37 -146 -100 -82 401 23 -17 3 87 125 36 -131 128 170 162 78 71 228 -240 146 -260 13 -24
3802b4R7M0j57k07K03Q7K7j35M6N7J83n44M45j11P2P0l1j76O2K1r1K22k15j12
$$ -24 73 113 -44 -251 -48 39 66 -69 -23 34 217 -327 118 7 79 149 118 -58 4 25 -66 156 -59 -171
3826a71K76j41O0J4m66N06Ro8K85k92k84L24j06m4P4K00k6k67Q1J08k6j56J65
$$ -171 105 -36 24 38 -428 78 87 19 304 12 -272 52 -54 -98 -24 176 150 -117 -36 72 46 -110 55
3849E5j30K07r2j72L60k1m24J09L4m4J69j05J95k69K98l29q9K19k43K72j78K88
$$ 55 -75 132 40 -132 228 207 -217 -108 -74 -118 51 -54 141 -128 170 -159 -248 -29 -272 0 -178 110
3871A10j12p9R7j00J81R3l6k4j55K00m19L08m8J52k06L8K56l36j01M4L99j70k4
$$ 110 -2 -81 16 -84 97 190 154 130 -25 175 -244 64 16 168 -38 0 256 -80 -181 -137 262 92 68
3894F8N2m39M56k78J05J99k73J10j35P5J03q2J19oj01r9J61N4j22l7J43j01J5
$$ 68 120 -319 137 -141 -36 163 -110 0 -135 -60 43 -39 80 74 -27 -126 35 89 -33 -70 73 -28 -13
3917a3K0k9K65m18j5K27K06l15M47m76K52p7k17L36k06j54l9RL18j03k82%J21
$$ -13 7 -22 243 -175 -190 37 243 -72 375 -101 151 74 -143 193 -13 -167 -206 -197 121 18 -264 -264 -143
3940a43K9N9l3N0LJ31j79K47J3l29J29L71k80o6J98k67J22P9j27n8K12L2k18J8
$$ -143 -114 -55 -88 -38 -35 96 -83 164 177 -152 -23 348 68 2 200 -67 55 134 7 -51 161 193 -25 -7
3964gk05M64l68K1P0j36qJ23J64j30N6k21R3j08M02l51MJ2O6%O2o4J69q5j53j73
$$ -7 -212 252 -116 -95 -25 -161 -169 -46 118 -12 44 -177 -84 -192 210 -141 -137 -125 -59 -59 3 -61 108 23 -130 -303
3990c03K56j00J84j27j06m7K61r5J61j55M8j38L18k59J34k14J54N0j33JK21J68
$$ -303 -47 -147 37 -90 -196 -243 18 -77 84 -71 -23 -161 157 -102 32 -182 -28 22 -111 -110 111 279
4012B79m46M91k88p7J47k86K54j55R1m1J29K25k42Qrj85J17K41j42m05M91j40
$$ 279 -167 324 36 -41 106 -180 74 -81 10 -31 98 323 81 89 80 -105 12 253 111 -294 197 57
4034E7q2K22n72J15L51L60n19p0Q1o7K7J21L8k83L00j25KL04k84K12J16l36J33
$$ 57 -25 197 -375 -260 91 451 -68 -138 -57 -124 -97 24 62 -221 79 -46 -44 260 -24 188 304 -32 101
4057A01k09k49N89n2K4o6k64J57l7m9m7n3J35r8j13J40J89j30J84m7k65K81q5
$$ 101 -108 -357 232 180 204 138 -126 31 -6 -55 -102 -155 -20 -118 -231 -91 98 -32 152 105 -160 121 36
4080C6k2K6j81j36L32LR4o6r8j21K80j79J34j45MM1q0Q1J16l79K1K78r2j11L22
$$ 36 14 40 -141 -277 55 58 152 86 -12 -133 147 -32 102 -43 -39 2 -78 3 119 -260 -239 39 -53 -164 158
4105A58k17L19k46J31j45P4j31J27q4j55P3M25k23j56k9L7o4Q0L01k46J23o6j35
$$ 158 -59 260 14 145 0 74 -57 70 -14 -169 -96 329 106 -50 -79 -42 -106 -26 275 29 152 86 -49
4128d9k58JK40J01K2j87j51L40j52J9K30k17p9K50j85K01j89oK62j51Pl51L49
$$ -49 -307 -306 -66 35 57 -130 -281 59 -93 -74 156 -61 -140 110 -75 126 -63 -69 193 42 49 -302 47
4151D7J43j87j46L86k10j83K5L9K64q8k7k33K50m0m7K08J34k65R3l33K92l9o4
$$ 47 190 3 -143 243 33 -150 -125 -86 178 90 63 -170 80 40 -7 201 335 70 163 -170 122 83 19
4174A9p4K06L8j97J08K10k90R1p0M8Pl03L76M1l37P8j28K81j13p3j60K52N0n9
$$ 19 -55 151 189 -8 100 310 20 111 41 89 96 -207 169 210 -127 -49 -177 104 -9 -82 -242 10 60 1
4198AJ23m12M76l41K00j27O0Q8K1k61k3j09M93j46j34j26J4K47k24L36o1j0j95
$$ 1 124 -288 188 -153 47 -80 -20 68 89 -172 -195 -304 189 43 -91 -217 -203 44 -180 156 95 85 -110
4221a10k68K74J26J79j69q2j36J72n4m1M15j94l58J66o7J06J86l79K15L26j33
$$ -110 -378 -104 22 201 32 -50 -186 -14 -68 -109 306 112 -246 -80 -147 -41 145 -234 -19 307 174
4242A74l8k13L7J43k05jl7J50L36k99o9K6k54M46l09J83N9r4p1j19Q7J22J59n6
$$ 174 136 -77 -40 103 -102 -103 -140 10 346 47 -22 4 -250 196 -113 70 129 35 -36 -155 -68 54 213 157
4266A57l11L66l05J22J19k13K41k63J39J75j35j52J03J37k69L1J22m3n6M9m0J25
$$ 157 -154 212 -93 29 148 -65 176 -87 52 227 92 -60 43 180 -89 -58 64 21 -35 14 -26 99
4288I9J5k77M32l65k4Q6J41n3mj94J48j68J78K05j39j7j98M78n8J2m40K55j78
$$ 99 114 -163 269 -96 -120 -34 107 54 50 -144 4 -164 14 219 80 63 -135 343 285 297 -143 112 -66
4311f6mJ97k14M52o12K64K8M3Q1p7k35L30J21m96K54N8j18n0J08j32L1j14L02
$$ -66 -70 127 -87 365 -247 17 45 88 169 92 -143 187 308 -188 66 124 6 -44 64 -68 -37 -151 151
4334A51j25j06M2j9J6J81Q1l2J03n35J62K70j83o3j2J38j23m5O0lj9r4K99l00
$$ 151 26 -80 -38 -57 -41 140 221 189 292 -243 -81 189 6 -57 -69 69 -54 -99 -39 -42 -61 -155 144 -156
4358a56K24k48J6J63j51k34L21K13l2Q5o6k04J44J77m7k81K9O0n8j95M6M18k26
$$ -156 68 -180 -164 -1 -152 -386 -65 148 116 201 135 -69 75 252 205 -76 -47 13 -45 -240 -194 224 -2
4381bk4m4K01N5j00L1r3j2j20K23m9J3j23J90m79L86Q6m11K94k46J09K85J3k92
$$ -2 -26 -70 131 186 86 117 24 12 -108 115 66 79 -44 146 -333 53 139 -272 22 -224 -115 170 183 -109
4405a09j12K69j1l95L46n4L0r5l6j6O7K34k70L29m04K05PP8Q7k44O1J37r4k5J52
$$ -109 -221 48 37 -358 -12 -66 -36 -131 -167 -183 -116 118 -152 177 -227 -22 -15 63 150 -94 -33 104 10 -15 137
4430A37%m89L79j69j96L45pK72m05R2O4k1J57j89J05K0j98K01K63m67P7Q9k02
$$ 137 137 -352 27 -142 -338 7 0 272 -133 -41 23 2 159 -30 75 95 -103 98 361 -106 -29 60 -142
4453a42Q3J11m1j0l5M65m88k10L76j05k29K15j00QK00j65K7j08L53k68P3o9J57
$$ -142 -59 52 11 1 -34 431 -57 -267 109 4 -225 -10 -110 -102 98 -67 -40 -148 205 -63 10 -59 98
4476I8k61K57j67P4m6MO9p1p2K44q9j92J71J2M0j98Q5J35P3l40N1R5p6K19l16
$$ 98 -163 94 -73 1 -45 -41 28 -43 -115 129 40 -152 19 31 71 -127 -42 93 166 -174 -123 -28 -104 115 -201
4501b01K25j02j91K69j02N16l95Jk5k94N4P5K69l15L91m16K82O2J62P1m12o9K84
$$ -201 24 -78 -269 0 -102 414 19 20 -5 -299 -245 -170 99 -216 175 -241 41 103 265 336 -76 -145 139
$$ [...]
8191E4
##END NTUPLES=NMR FID
##END=
