##TITLE=1H_DE-77ORG_d6AW2
 aceton-d6
 8 sc, 
 27.11.2024
##JCAMPDX= 6.0         $$ Bruker NMR JCAMP-DX V2.0
##DATA TYPE= NMR FID
##DATA CLASS= NTUPLES
##ORIGIN= UXNMR, Bruker Analytische Messtechnik GmbH
##OWNER= root
$$ XWIN-NMR		Version 3.5
$$ Wed Nov 27 16:27:00 2024 Russian Standard Time (UT+4h)  she@DPX200
##.OBSERVE FREQUENCY= 200.1315
##.OBSERVE NUCLEUS= ^1H
##.DELAY= (6, 6)
##.ACQUISITION MODE= SIMULTANEOUS
##.ACQUISITION SCHEME= undefined
##.AVERAGES= 8
##.DIGITISER RES= 18
##SPECTROMETER/DATA SYSTEM= spect
##.PULSE SEQUENCE= zg30
##.SOLVENT NAME= CDCl3
##.SHIFT REFERENCE= (INTERNAL, CDCl3, 0, 15.7039)
##AUDIT TRAIL= $$ (NUMBER, WHEN, WHO, WHERE, WHAT)
$$ ##TITLE= Audit trail, XWIN-NMR		Version 3.5
$$ ##JCAMPDX= 5.01
$$ ##ORIGIN= Bruker BioSpin GmbH
$$ ##OWNER= she
$$ F:/spectra/data/she/nmr/H-F/1/audita.txt
$$ ##AUDIT TRAIL=  $$ (NUMBER, WHEN, WHO, WHERE, WHAT)
(   1,<2024-11-27 16:25:52.53 +0400>,<she>,<DPX200>,
      <created by zg, POWCHK disabled, PULCHK disabled
       configuration hash MD5:
       00 E9 B6 7A A2 85 ED C7 34 08 36 98 17 FE 4E 26
       data hash MD5: 16K
       21 88 16 DA FC CC 43 97 2C 58 63 76 02 2B 19 5C>)
$$ ##END=
$$ 
$$ hash MD5
$$ 6C 49 D0 FC 98 1C 7D 56 17 E9 8B 8F 92 2D 94 91
##$RELAX= 
##$RELAX= 
##$RELAX= 
##$RELAX= 
##$RELAX= 
##$RELAX= 
$$ Bruker specific parameters
$$ --------------------------
##$DU= <F:/spectra>
##$EXPNO= 1
##$NAME= <H-F>
##$PROCNO= 1
##$TYPE= <nmr>
##$USER= <she>
##$AMP= (0..31)
100 100 100 100 100 100 100 100 100 100 100 100 100 100 100 100 100 100 
100 100 100 100 100 100 100 100 100 100 100 100 100 100 
##$AQSEQ= 0
##$AQ_mod= 1
##$AUNM= <au_zg>
##$AUTOPOS= <>
##$BF1= 200.13
##$BF2= 200.13
##$BF3= 200.13
##$BF4= 200.13
##$BF5= 200.13
##$BF6= 200.13
##$BF7= 200.13
##$BF8= 200.13
##$BYTORDA= 1
##$CFDGTYP= 0
##$CFRGTYP= 5
##$CHEMSTR= <none>
##$CNST= (0..31)
1 1 145 1 1 1 1 1 1 1 1 1 1 1 1 1 1 1 1 1 1 1 1 1 1 1 1 1 1 1 1 1 
##$CPDPRG= <>
##$CPDPRG1= <>
##$CPDPRG2= <>
##$CPDPRG3= <>
##$CPDPRG4= <mlev>
##$CPDPRG5= <mlev>
##$CPDPRG6= <mlev>
##$CPDPRG7= <mlev>
##$CPDPRG8= <mlev>
##$CPDPRGB= <>
##$CPDPRGT= <>
##$D= (0..31)
0 1.2 0 0 0 0 0 0 0 0.06 0 0.03 0 0 0 0 0.0002 0 0 0 0 0 0 0 0 0 0 0 0 
0 0 0 
##$DATE= 1732710351
##$DBL= (0..7)
120 120 120 120 120 120 120 120 
##$DBP= (0..7)
150 150 150 150 150 150 150 150 
##$DBP07= 0
##$DBPNAM0= <>
##$DBPNAM1= <>
##$DBPNAM2= <>
##$DBPNAM3= <>
##$DBPNAM4= <>
##$DBPNAM5= <>
##$DBPNAM6= <>
##$DBPNAM7= <>
##$DBPOAL= (0..7)
0.5 0.5 0.5 0.5 0.5 0.5 0.5 0.5 
##$DBPOFFS= (0..7)
0 0 0 0 0 0 0 0 
##$DE= 6
##$DECBNUC= <off>
##$DECIM= 24
##$DECNUC= <off>
##$DECSTAT= 4
##$DIGMOD= 1
##$DIGTYP= 9
##$DL= (0..7)
0 120 120 120 120 120 120 120 
##$DP= (0..7)
150 150 150 150 150 150 150 150 
##$DP07= 0
##$DPNAME0= <>
##$DPNAME1= <>
##$DPNAME2= <>
##$DPNAME3= <>
##$DPNAME4= <>
##$DPNAME5= <>
##$DPNAME6= <>
##$DPNAME7= <>
##$DPOAL= (0..7)
0.5 0.5 0.5 0.5 0.5 0.5 0.5 0.5 
##$DPOFFS= (0..7)
0 0 0 0 0 0 0 0 
##$DQDMODE= 0
##$DR= 18
##$DS= 0
$$ [...]
##$SUBNAM2= <"">
##$SUBNAM3= <"">
##$SUBNAM4= <"">
##$SUBNAM5= <"">
##$SUBNAM6= <"">
##$SUBNAM7= <"">
##$SUBNAM8= <"">
##$SUBNAM9= <"">
##$SW= 24.0689530833862
##$SWIBOX= (0..15)
0 0 2 0 0 0 0 0 0 0 0 0 0 0 0 0 
##$SW_h= 4816.95568400771
##$TD= 16384
##$TD0= 1
##$TE= 0
##$TE2= 300
##$TE3= 300
##$TEG= 300
##$TL= (0..7)
0 120 120 120 120 120 120 120 
##$TP= (0..7)
150 150 150 150 150 150 150 150 
##$TP07= 0
##$TPNAME0= <>
##$TPNAME1= <>
##$TPNAME2= <>
##$TPNAME3= <>
##$TPNAME4= <>
##$TPNAME5= <>
##$TPNAME6= <>
##$TPNAME7= <>
##$TPOAL= (0..7)
0.5 0.5 0.5 0.5 0.5 0.5 0.5 0.5 
##$TPOFFS= (0..7)
0 0 0 0 0 0 0 0 
##$TUNHIN= 0
##$TUNHOUT= 0
##$TUNXOUT= 0
##$USERA1= <user>
##$USERA2= <user>
##$USERA3= <user>
##$USERA4= <user>
##$USERA5= <user>
##$V9= 5
##$VALIST= <valist>
##$VCLIST= <CCCCCCCCCCCCCCC>
##$VD= 0
##$VDLIST= <DDDDDDDDDDDDDDD>
##$VPLIST= <PPPPPPPPPPPPPPP>
##$VTLIST= <TTTTTTTTTTTTTTT>
##$WBST= 1024
##$WBSW= 4
##$XGAIN= (0..3)
0 0 0 0 
##$XL= 0
##$YL= 0
##$YMAX_a= 153916
##$YMIN_a= -142773
##$ZGOPTNS= <>
##$ZL1= 120
##$ZL2= 120
##$ZL3= 120
##$ZL4= 120
##$ABSF1= 10
##$ABSF2= 0
##$ABSG= 5
##$ABSL= 3
##$ALPHA= 0
##$AQORDER= 0
##$ASSFAC= 0
##$ASSFACI= 0
##$ASSFACX= 0
##$ASSWID= 0
##$AUNMP= <proc_1d>
##$AZFE= 0.1
##$AZFW= 0.1
##$BCFW= 1
##$BC_mod= 2
##$BYTORDP= 1
##$COROFFS= 0
##$CY= 11.3945322036743
##$DATMOD= 1
##$DC= 2
##$DFILT= <>
##$DTYPP= 0
##$F1P= 15.6554695791079
##$F2P= 12.8336369535428
##$FCOR= 0.5
##$FTSIZE= 0
##$FT_mod= 4
##$GAMMA= 1
##$GB= 0.15
##$INTBC= 1
##$INTSCL= 1
##$ISEN= 128
##$LB= 0.24
##$LEV0= 0
##$LPBIN= 0
##$MAXI= 10000
##$MC2= 0
##$MEAN= 0
##$ME_mod= 0
##$MI= 1.114404
##$NCOEF= 0
##$NC_proc= 0
##$NLEV= 6
##$NOISF1= 3.799351
##$NOISF2= 2.8
##$NSP= 1
##$NTH_PI= 0
##$NZP= 0
##$OFFSET= 15.70392
##$PC= 1
##$PHC0= -26719.15
##$PHC1= 11.58745
##$PH_mod= 1
##$PKNL= yes
##$PPARMOD= 0
##$PSCAL= 0
##$PSIGN= 0
##$REVERSE= no
##$SF= 200.130013532006
##$SI= 16384
##$SIGF1= 3
##$SIGF2= 2
##$SINO= 400
##$SIOLD= 16384
##$SREGLST= <1H.CDCl3>
##$SSB= 0
##$STSI= 0
##$STSR= 0
##$SW_p= 3612.71676300578
##$SYMM= 0
##$S_DEV= 0
##$TDeff= 0
##$TDoff= 0
##$TI= <>
##$TILT= no
##$TM1= 0
##$TM2= 0
##$TOPLEV= 0
##$USERP1= <user>
##$USERP2= <user>
##$USERP3= <user>
##$USERP4= <user>
##$USERP5= <user>
##$WDW= 1
##$XDIM= 8192
##$YMAX_p= 0
##$YMIN_p= 0
$$ End of Bruker specific parameters
$$ ---------------------------------
##NTUPLES= NMR FID
##VAR_NAME=  TIME,          FID/REAL,        FID/IMAG
##SYMBOL=    X,             R,               I
##VAR_TYPE=  INDEPENDENT,   DEPENDENT,       DEPENDENT
##VAR_FORM=  AFFN,          ASDF,            ASDF
##VAR_DIM=   8192,          8192,            8192
##UNITS=     SECONDS,       ARBITRARY UNITS, ARBITRARY UNITS
##FACTOR=    0.0002076,     1,               1
##FIRST=     0,             0,               0
##LAST=      1.7004516,     0,               0
##MIN=       0,             -142773,         0
##MAX=       1.7004516,     153916,          0
$$ Real data points
##PAGE= N=1
##DATA TABLE= (X++(R..R)), XYDATA
0 0 0 0 0 0 0 0 0 0 0 0 0 8 -8 8 -8 11 -16 16 -20 24 -31 33 -40 47 -54 61 -71 80 -92 105 -118 132 -149 170
34 170 -188 210 -234 263 -291 323 -359 396 -441 486 -538 595 -659 731 -810 902 -1009 1130
52 1130 -1272 1441 -1646 1900 -2215 2613 -3078 3331 -4341 153916 -11460 -76423 50571 -33955
66 -33955 35303 44012 -84981 -12225 63014 -5121 -28762 -17663 29140 16281 -19712 2853
78 2853 -14342 9409 46681 -52533 -28168 66379 -16702 -32008 25016 -20856 12976 37615
90 37615 -48437 -11009 54558 -13789 -26701 10518 -6919 6243 14858 -23883 -10652 29621
102 29621 11606 -24125 -7071 18591 -808 -6537 162 -18867 13006 29793 -34347 -12315
114 -12315 39353 -9298 -11437 10062 -18937 14409 21723 -38053 -6361 33537 -4842 -15691
126 -15691 1139 4599 9926 3785 -15254 -10243 20922 10817 -29034 -5846 21917 -1164 -2123
139 -2123 -2655 -12437 21066 13996 -32410 -4659 25519 -4812 -11909 711 -1953 10369 9263 -18208
153 -18208 -5038 21746 -979 -15781 2333 3219 1037 4670 -9713 -7040 17495 6019 -17848
166 -17848 -959 14016 -1466 -5389 -2232 -5794 9280 7785 -18066 -2169 19259 -2916 -8200
179 -8200 3355 -2381 4689 5496 -14019 -3567 15610 -263 -10955 1905 6573 1183 294 -5335
193 -5335 -4746 10526 3347 -14889 -552 11814 -2850 -2917 527 -4054 7929 5814 -13860 -1959
207 -1959 13267 -3130 -7670 1846 191 3348 3870 -7786 -2312 11173 -68 -9466 616 4555
221 4555 -464 291 -3475 -4051 9223 3803 -11421 -66 9757 -2585 -3655 -152 -2823 5380 3194
236 3194 -9803 -421 10054 -1427 -4944 1417 691 1849 1763 -6210 -2435 7855 181 -8156 1630
251 1630 5023 -832 0 -1847 -2089 6165 1131 -8627 1150 6654 -2235 -2141 795 -590 3760 1688
267 1688 -6740 -314 6752 -1889 -5044 1275 1467 747 831 -3786 -661 6225 -682 -5506 1179 2646
283 2646 -1232 -173 -1323 -1372 4398 853 -6043 1131 4575 -1952 -2089 -95 -704 2331 915 -4616
299 -4616 665 4921 -1252 -2547 1192 763 941 126 -2830 -445 4059 -568 -4281 1268 2886 -495
315 -495 -339 -1211 -210 2935 -85 -3487 1205 3014 -1390 -1219 298 -19 1547 192 -3068 54
331 54 2993 -1130 -2560 216 1085 76 -117 -1164 124 3128 -614 -2987 787 1870 -544 -849
347 -849 -616 79 2059 413 -2811 848 2397 -855 -1216 283 381 1042 -200 -2185 534 2243 -164
364 -164 -1477 406 444 257 -184 -1298 -29 1876 -235 -1733 934 1270 -419 -468 -222 -93 1046 -375
382 -375 -2053 27 1591 -790 -1016 355 520 600 234 -1112 166 1639 -390 -1400 74 563 54
399 54 -451 -795 236 1259 -292 -1400 480 1098 -613 -624 -6 71 530 121 -1267 86 1334 -244
417 -244 -914 -160 503 536 -608 -822 185 955 -271 -842 539 360 176 -479 -97 241 946 78 -1079
436 -1079 173 1010 102 -419 -210 363 869 -298 -910 4 707 -220 -546 334 73 127 -66 -745 206 869
456 869 -388 -700 114 330 -276 -683 -133 338 912 -270 -902 42 256 -229 -584 143 143 379 -215 -621
476 -621 365 509 -87 -584 -109 791 -154 -467 -506 163 321 -125 -363 330 429 -284 -499 95 -65 314 -72
497 -72 -602 128 298 -278 23 199 -50 268 -74 -42 387 -2 -158 -456 103 158 188 -137 -103 162 221 -460
519 -460 -473 55 210 -94 29 274 97 363 -169 -336 -110 373 -161 -244 34 50 199 -123 -125 352 282 -25
541 -25 -271 115 327 450 -272 -330 -105 307 -125 -355 -60 -126 -304 84 -232 -60 -148 -95 -448 -52 35 -334
563 -334 -178 -115 165 -43 -175 -61 50 -32 -272 -64 115 -102 3 146 -97 110 136 -205 -65 162 106 -84
585 -84 -210 -4 -158 141 -268 -446 31 22 -181 -445 78 172 -164 -286 -34 -251 -102 -87 -16 8 172 96 -117
608 -117 -226 28 146 -287 -365 -167 66 72 -201 237 76 -83 -82 -50 -59 140 -115 -185 -138 -108 -106 -377 -430 281 453
633 453 -32 -149 -69 -132 -318 223 169 179 -142 119 49 85 27 -83 -171 32 39 -122 -187 -270 -83 158 27 -261
657 -261 75 138 -100 -217 91 -81 -7 -112 -164 6 -99 -155 -2 -189 -149 -29 9 -264 -34 -1 -79 211 14
680 14 -241 -28 -130 -148 210 -53 -141 -197 -158 -14 -83 71 -39 294 -246 -55 265 209 14 96 -244 95 32
703 32 10 -15 -81 -33 -201 -207 -409 98 -170 99 -104 141 42 395 -247 -16 -143 124 227 147 100 181 111 198 82
728 82 -171 156 -15 -324 20 -97 -90 -100 22 26 -213 96 -162 -231 -31 -122 -371 257 -281 49 467 -338 153
751 153 87 -4 -286 101 -89 86 -48 150 -374 76 24 -293 214 -276 -160 43 62 43 304 -57 323 -40
773 -40 34 391 -194 -70 40 141 -148 74 -150 492 12 -193 -84 -192 -359 -222 -33 124 -84 115 -118
794 -118 214 -6 -314 -5 76 -217 234 -199 -100 -239 -121 -10 70 128 128 184 -202 -91 121 330 -127 -63 -60 -96
818 -96 271 -128 -172 -149 -105 -46 -233 61 -42 58 -105 -93 -147 148 10 -253 218 -507 11 73 -8 96 153 -39
842 -39 137 -16 166 125 121 -160 81 -57 259 -271 -196 -201 204 247 -400 189 -27 228 8 336 60 227 -274
865 -274 -40 214 84 37 45 65 222 -119 123 -89 -74 60 -39 -29 77 -35 101 -229 8 265 105 -25 -40
888 -40 133 -1 297 -315 120 73 149 115 -161 -6 -126 -53 -15 -332 260 178 -223 -299 -125 102 -83 -15 70 374
912 374 -129 -133 -176 65 -55 382 27 -140 320 -116 -9 -115 -171 -86 -69 243 -127 316 -71 -66 40 252 -50
935 -50 -138 102 130 -126 -12 344 -52 -131 -14 -167 -56 -176 129 264 89 -43 -114 7 104 93 -98 118 26
958 26 -279 78 385 -305 -100 246 -55 200 360 -217 -80 215 1 -96 67 95 35 -238 171 -150 -124 -67
980 -67 4 -292 55 74 240 -251 33 -316 287 -10 114 91 -39 198 -273 -89 -49 203 -37 -54 -155 -163 292
1003 292 -147 40 -519 202 -179 -112 -37 -84 25 -218 88 -32 25 -332 -111 -183 -16 -86 197 176 276 57
1025 57 -13 -37 166 316 -40 152 215 -50 -215 -77 190 -37 -99 300 -82 120 179 45 -334 97 347 -270
1047 -270 -213 350 58 47 40 -65 -103 -49 117 -60 151 -29 -4 -191 -96 -174 237 -46 -132 267 -22 -21 -176 -107
1071 -107 27 -146 122 -24 -121 132 262 -133 397 -211 -40 -292 -477 -122 180 33 -58 146 1 218 -235
1092 -235 -108 113 74 -103 48 283 127 -263 113 -62 -107 188 39 308 -127 44 -180 0 -1 -15 53 133
1114 133 -132 -92 -136 -43 107 120 120 72 -51 130 -415 -188 29 -174 -128 -257 161 -156 29 -14 -166 46 132
1137 132 305 -6 2 25 38 -103 -127 140 16 -148 106 170 -243 -83 79 -163 81 269 -12 306 -255 106
1159 106 14 67 -187 -150 57 370 -524 -106 380 -23 -115 -95 75 -76 -434 -112 11 279 31 222 158 22
1181 22 196 -65 49 -204 -12 -17 52 17 -202 -67 -230 -64 32 28 186 -74 165 -16 -38 -260 276 -215 -185
1204 -185 217 50 -20 -110 -11 178 -39 124 -286 454 -83 41 -24 102 94 531 -402 -12 159 101 -204 -255 -299
1227 -299 -28 51 -196 -53 -82 52 47 36 -12 -98 -28 254 -18 -20 -19 28 -112 254 151 375 -104 -76 -225 -176 219
1252 219 70 -9 131 145 1 144 -78 -191 80 -38 176 126 -346 -283 24 -235 -122 197 -139 22 204
1273 204 -327 73 403 -72 -175 72 -160 194 301 61 16 4 1 -83 -2 221 -19 31 -195 100 24 57 -50
1296 -50 132 -15 221 -208 -148 149 237 -168 -168 -126 82 -280 138 79 -168 -38 78 142 -149 54 432 -45 70
1319 70 -29 234 192 31 243 113 75 6 157 -224 -4 252 -118 21 60 -224 112 -172 241 137 194 -390
1341 -390 -126 9 -280 308 192 117 117 -292 -180 -43 -50 116 118 -103 179 197 -45 -235 -280 80 171 343 -134
1364 -134 -154 -20 -156 74 -234 303 -55 287 244 -148 22 -10 -136 8 197 -17 15 60 136 18 67 233
1386 233 138 -160 6 128 -52 -59 238 436 -200 118 65 93 105 68 -160 226 -407 -138 -37 -99 358 26 -246
1409 -246 -154 -99 -5 -89 -136 -52 31 -45 -89 108 -349 216 -209 69 -133 -55 -91 81 214 109 1 235 102 -49
1433 -49 13 49 37 431 -352 -137 -4 -169 305 110 -104 -6 81 -277 148 -132 170 113 392 101 106 9 94 -68
1457 -68 53 13 150 72 230 -273 -117 61 133 -11 107 74 81 -76 -100 -49 142 -80 85 -189 136 -157 34
1480 34 -150 88 -136 -151 -249 10 4 -87 83 122 -287 129 186 -384 90 -209 33 275 80 186 16 -125 3
1503 3 -93 -29 -220 200 -37 -129 -27 -178 -80 -55 370 141 -105 -125 69 386 -83 92 186 -310 -282 64 -85
1526 -85 -86 -108 -159 76 -133 -161 -41 210 -83 -53 233 -315 -105 -224 -67 -353 105 -94 66 1 -38 -11 -199
1549 -199 43 40 -100 28 141 -139 74 -129 -246 -193 -293 -202 -52 83 -103 208 61 -126 -237 35 97 -211
1571 -211 -195 -66 229 401 63 57 -136 -130 238 91 121 -124 -270 -64 132 -275 81 23 -476 -175 195 -109
1593 -109 22 250 105 97 -108 -76 129 154 -22 114 -32 -151 211 -336 218 -390 299 -81 109 -30 123
1614 123 -189 171 -381 -191 68 -263 113 69 6 -4 72 -263 18 11 6 32 45 -13 144 -46 -114 105 122 10
1638 10 -8 89 -232 -21 94 23 -148 97 162 -125 6 -36 -96 -54 108 -337 -172 119 48 36 -167 -261 -136 162
1662 162 213 20 98 -74 265 -84 -352 12 9 -228 70 22 -106 -80 -208 82 38 -427 315 212 -101 97
1684 97 -9 -188 -17 7 262 -244 -23 -181 -96 111 57 84 -27 74 174 -125 -135 -54 90 -195 23 151
1706 151 -38 -25 -160 -69 40 -21 239 413 137 -183 4 301 271 -41 -51 136 106 163 102 -162 -101 -250 64
1729 64 -61 -194 -110 95 56 -192 -110 -167 46 190 -244 12 -326 -150 -263 131 -273 88 -335 -41 407 65
1751 65 -197 -80 266 -164 -114 134 380 -28 159 -49 241 -159 13 44 -94 111 -105 19 -211 -110 -84
1772 -84 31 -285 179 -18 34 -76 -163 113 295 -90 -138 351 410 1 497 -198 -26 12 -48 147 302 142
1794 142 -122 272 -17 -359 49 -69 -80 229 -41 252 -120 -155 -159 8 -120 -229 7 65 -200 -38 66 -137
1816 -137 -126 -93 -300 -110 106 0 -185 -77 -225 -90 1 216 -27 147 122 -148 -66 -151 30 -267 -168 -209 25
1839 25 -24 9 -186 -266 -92 -306 119 101 12 25 -73 203 152 185 -17 -145 -27 -102 347 209 -345 -168 -233 266
1863 266 176 -125 307 -196 -204 -73 62 -41 133 51 74 194 228 -268 201 33 40 142 -82 -40 69 -180 -7
1886 -7 130 -87 -176 -54 6 270 -127 473 216 34 228 287 28 183 -107 -7 -90 -34 -153 16 -154 -16
1908 -16 -116 -312 19 17 -193 -166 138 149 165 21 42 -16 -119 41 -255 17 -170 106 -213 -63 284 101 308
1931 308 -102 61 16 83 -302 -18 -145 29 -99 -279 -19 34 -28 225 197 -102 177 320 -172 234 1 238
1953 238 -91 -194 39 -5 202 -420 199 131 21 -217 -40 38 -100 -272 139 6 -243 -157 -298 -50 -29 42
1975 42 9 67 112 -127 -380 46 -55 23 -37 272 -20 141 3 -139 -18 -312 91 52 -48 -74 55 99 80
1998 80 11 -293 0 107 23 -53 168 147 183 -135 251 360 -292 -163 261 137 237 -177 82 240 43 -216
2020 -216 62 14 29 78 291 72 79 18 -336 -65 50 90 -284 -12 -125 -237 -57 38 200 44 -87 377 -221
2043 -221 86 116 -87 7 131 180 -21 -165 20 -20 269 -51 132 39 -24 -289 155 -177 47 -42 -57 213 -70
2066 -70 138 -28 357 297 277 175 -25 -465 -37 -11 39 -100 180 53 -29 -81 -154 230 -126 24 -119 65 55
2089 55 313 -115 153 -331 118 154 -326 -61 -50 145 -25 76 -44 -67 236 -271 -9 -75 -146 -92 -122 149 -86
2112 -86 -74 191 162 80 224 -318 -2 -119 130 22 -17 35 -123 123 -198 63 -121 -6 75 -53 58 68 140
2135 140 -169 444 -107 140 -74 -236 144 -304 -409 -215 -9 -62 -11 -95 158 106 128 113 131 102 -8 -385 21
2158 21 -28 -160 21 44 5 -92 -195 -130 -247 101 190 -484 403 367 -122 73 -125 -321 -80 -16 77 31 27 42 115
2183 115 96 19 3 118 35 27 106 -31 81 109 503 246 57 77 103 -27 23 101 38 261 37 -53 -291 -162 267
2208 267 85 170 -109 92 213 -198 4 201 98 -86 181 -1 24 102 138 16 52 49 183 84 -51 184 198
2231 198 207 103 182 -4 -106 29 13 -114 339 116 14 18 -322 297 -163 95 -242 220 -17 -15 33 20 320
2254 320 34 204 20 -220 -105 158 -179 -437 107 -106 67 -146 -16 37 -200 -225 222 380 -110 173 25
2275 25 -59 -113 -106 531 83 368 17 220 369 399 -106 -10 18 144 36 217 223 19 -82 -89 -96 -171 -277 -242 -17
2300 -17 139 347 -155 179 43 159 49 115 152 -134 -56 181 -96 -50 -7 187 97 44 -69 -108 -51 21 179 141
2324 141 67 -233 -58 15 294 149 366 205 -223 -126 18 1 -24 86 183 -235 38 178 -21 268 99 -17
2346 -17 -293 -171 -49 -81 -72 -32 62 -209 93 167 -95 -3 -124 -62 -31 10 168 80 78 -106 189 54 -239 -296 18
2371 18 -178 14 200 -77 -143 -103 47 -248 -151 -12 243 -39 210 -100 143 -22 -118 -261 -15 -126 489 -97
2393 -97 167 352 -270 -92 16 -50 -131 -36 145 1 138 110 -121 -144 153 -42 -143 119 24 -118 6 5 132
2416 132 -227 -98 -41 -29 110 -147 228 -24 74 -29 25 -88 12 -297 -292 -307 -176 -124 254 -8 -141 41 48
2439 48 30 -84 160 -70 -64 -162 68 -52 -28 145 154 -248 297 108 -17 -50 -29 -208 246 236 362 43 -123 85
2463 85 133 103 -64 175 -23 310 143 -98 -172 -104 -130 -194 -262 -107 -23 -58 -146 -60 161 -140 -45 37 75 -37 -322
2488 -322 -82 264 36 0 -132 -226 -89 -28 46 -157 -68 -89 -130 78 95 89 -12 118 21 46 220 15 203 95
2512 95 20 356 -96 -82 -417 -122 -77 113 -236 -193 -55 94 152 74 95 -80 -3 -29 -255 -138 83 -149 -35
2535 -35 -69 304 110 -201 -179 176 91 189 -46 322 37 -277 31 -280 -363 65 -1 -273 27 -123 19 220
2557 220 -73 -47 216 31 -24 -107 131 -134 263 371 -217 138 -22 36 -87 -158 271 168 92 -47 84 -48
2579 -48 229 23 -24 -80 46 93 152 90 -55 232 3 -148 218 51 112 27 24 84 -207 506 258 -37 -64 85
2603 85 76 -47 189 -256 -65 -66 -57 -11 218 260 -114 1 445 -240 103 -223 78 63 -158 -9 -125 -27 338 24
2627 24 -112 -175 436 245 77 120 45 -41 38 -348 -19 269 -265 35 171 -31 -80 266 90 -302 33 243
2649 243 -103 -158 246 -220 0 102 217 152 160 -92 -117 19 -395 299 72 217 133 -9 -222 -34 57 -24 -137
2672 -137 20 21 -221 111 -153 -140 -114 -168 -59 -59 -177 -229 -305 211 112 135 57 95 130 -31 -80 457 -92 -201 167
2697 167 107 -121 47 -48 -206 71 100 53 102 -43 -347 217 146 92 -128 15 76 -232 73 -117 -121 307 -61
2720 -61 -227 17 227 164 -29 -181 -7 178 204 -113 -26 -167 268 -113 12 200 140 267 204 -29 321 41
2742 41 -214 129 -79 13 -204 7 123 101 206 -242 10 -143 100 21 306 61 -295 -4 -236 -58 46
2763 46 -220 273 53 -180 -410 -236 -199 -297 137 -80 16 0 276 -59 65 -8 -150 156 187 -122 277 -163
2785 -163 22 -53 285 190 22 -18 145 61 110 -148 11 -175 33 166 73 -10 -120 146 69 71 -498 171 32
2808 32 68 -33 -273 96 -95 -33 -47 112 225 30 -375 102 -201 226 -45 -156 -3 160 -221 -39 -69 -209
2830 -209 29 -17 -203 -70 -93 341 293 -294 264 -258 -45 -105 -123 153 59 -68 -206 -222 95 178 65 0 -28
2853 -28 109 217 261 335 49 4 44 0 94 -243 60 74 113 -9 -301 -200 150 -36 104 -217 134 -52 -26
2876 -26 165 -199 -95 -175 -489 68 40 -315 -231 -179 -73 99 -120 -272 -414 106 284 288 -180 -400 -49 -94 -58
2899 -58 -197 238 51 69 83 -267 -23 -29 82 -200 97 -3 -280 -78 132 -215 -170 150 35 -71 28 -181
2921 -181 145 -46 -140 34 -125 44 151 72 -163 0 -158 -59 49 -30 -83 27 -298 -304 137 -307 262 -79
2943 -79 88 191 6 -104 -7 288 84 21 -27 -124 -115 331 90 -151 -17 56 -303 114 -135 163 273 -74 -148
2966 -148 460 -83 -118 -270 -321 161 -161 -227 -317 264 -203 69 28 -95 -30 141 -51 -4 21 32 379 256 -71
2989 -71 -128 14 -126 133 135 12 -4 39 17 376 -119 28 -112 -52 28 -443 -149 -23 16 284 -27 -87 -43 162
3013 162 -41 -250 -119 25 -43 -303 215 232 -46 -3 97 226 -14 104 89 -9 287 -34 -331 -55 46 131
3035 131 325 -88 -280 -242 -65 -9 76 -166 -170 -7 -5 -129 175 261 13 -76 -140 27 -268 405 146 -33 197
3058 197 -10 42 146 146 228 151 -91 -31 107 -223 124 -89 -230 317 -80 73 220 426 20 131 25 86
3080 86 232 259 -4 54 432 24 -106 -74 85 -123 373 -18 27 311 -236 47 -136 -56 202 -228 -13 38
3102 38 134 52 -66 -6 221 -178 -306 305 -58 -176 -3 78 96 93 -177 52 28 -290 -123 -65 -80 152 -54 -170
3126 -170 61 165 352 4 195 -3 -162 -257 -57 16 -37 119 39 -234 103 58 -401 -134 152 -46 -43 181
3148 181 271 -259 -332 -57 45 -28 101 56 -136 -55 50 17 -310 127 -130 -64 -422 -206 302 205 -311 77 -57
3171 -57 275 -52 132 -90 -30 118 -64 251 -39 -140 4 -145 424 26 -161 -381 25 -360 41 98 50
3192 50 66 470 -6 -45 -178 349 315 -262 -66 300 -19 -189 164 271 88 -123 -7 -251 314 150 11
3213 11 -20 234 -164 0 -68 287 -319 -137 -153 275 64 325 46 138 123 -56 99 -37 -162 -52 -24 -245
3235 -245 -214 -262 -100 20 178 -12 85 61 48 -236 -125 1 -248 -76 -77 104 -31 173 -9 -80 -83 44 58 -255
3259 -255 230 127 342 330 -170 46 354 56 41 82 191 -1 -14 211 228 131 -54 -4 -393 194 246 -163 250
3282 250 30 -81 -51 -163 191 -38 310 -20 -272 -49 -120 198 100 -179 51 -71 74 -99 -4 -3 78 -401
3304 -401 -114 139 17 -43 -206 155 -9 13 53 76 252 277 -56 26 -129 430 -40 6 -61 167 -31 153 -127
3327 -127 43 263 -229 151 -78 253 -74 -94 -271 -245 -188 105 -356 132 -27 -125 41 -47 9 69 183 -107
3349 -107 44 90 -55 -200 -66 -72 -118 -180 0 -152 108 -38 -389 133 -116 -138 -162 -36 266 153 -227 200
3371 200 -152 44 11 34 -262 -247 63 19 -1 88 52 173 107 212 104 -229 -80 138 54 59 -119 -126 96 -226
3395 -226 -28 121 81 59 56 -15 120 202 -65 128 -534 248 -61 -223 -72 -358 -261 -78 -42 -160 -193 -272 -87
3418 -87 -32 -295 -129 -203 116 -67 147 -59 158 -166 72 -40 -221 187 -226 118 -164 289 -7 -333 -20
3439 -20 47 23 -102 115 -123 -70 -115 136 -214 228 66 -36 -269 45 39 95 -100 371 -220 193 -203 78 -172
3462 -172 -171 -26 10 -175 101 277 -261 107 -10 -95 -178 135 -109 -198 263 238 -86 -176 -162 -98 68 -82 127
3485 127 -164 -58 390 -93 252 24 -20 38 106 84 -449 138 161 15 -271 -132 -19 2 142 83 -62 90
3507 90 -93 -110 -69 -81 175 -31 92 37 28 223 242 144 316 -11 171 321 105 33 -70 194 94 -67 -134 55
3531 55 -263 -51 32 81 -310 223 -47 -64 -113 -188 -26 -178 -98 157 69 336 -55 35 -67 -133 148 -99 -12 120
3555 120 20 -104 9 -152 78 -103 29 -160 225 125 29 84 -185 0 42 -107 -109 -358 45 300 131 -171
3577 -171 258 -321 46 49 -275 50 58 27 -146 204 29 39 -202 227 118 -151 34 76 -203 123 -14 84 -299
3600 -299 -160 201 -117 -110 -43 -6 -294 19 131 304 353 184 -23 99 -215 -420 -123 -327 39 197 -337 -51
3622 -51 29 -165 -104 151 11 -329 160 7 200 54 -41 -24 187 -9 253 76 79 138 265 67 -160 144 -62
3645 -62 49 312 317 -41 261 119 4 -8 141 215 136 45 60 -31 -1 46 207 -129 104 -165 -30 -97 -76 0 30
3670 30 154 -279 96 253 364 196 74 -49 320 -334 29 137 263 -41 329 -44 -63 -101 31 117 -10
3691 -10 -162 25 112 -18 86 -130 -134 -12 -108 -113 -97 -152 385 43 20 -153 67 -119 30 -80 325 149 -210
3714 -210 -167 284 -18 -74 120 136 162 118 121 113 11 226 21 -115 18 -201 220 -14 113 220 152 181 -66 -58
3738 -58 -119 205 -103 154 -220 117 105 177 -259 160 14 96 -54 475 -112 -28 324 -163 241 3 258 308
3760 308 -240 46 -250 25 39 -77 -75 96 266 -46 -182 -35 -51 -166 -287 -341 -13 -46 -45 -133 -12 -67 -43 -241
3784 -241 -69 284 -13 347 84 -126 -29 89 -226 -66 -19 6 -231 -83 -5 172 -250 58 54 -175 -366 -20
3806 -20 -231 -101 114 42 112 -64 281 23 55 25 46 258 179 191 -54 171 120 -77 -167 -339 136 197 11 109
3830 109 -206 10 138 -5 192 75 -108 89 -18 -203 -142 156 111 -281 -48 77 -71 -400 -217 -199 190
3851 190 -65 -99 50 -265 131 -245 115 -205 111 14 59 188 211 232 -110 -375 104 -76 -95 -70 97 297
3873 297 139 -14 145 312 319 -125 133 422 -54 -18 -31 8 117 -38 351 -47 -111 91 311 97 -93 -78
3895 -78 165 -245 -150 -6 187 26 -132 -61 65 148 58 -111 471 12 150 261 208 116 -166 33 177 -41
3917 -41 139 63 98 42 -129 165 74 198 -372 -175 73 -40 -309 8 45 277 8 -5 -242 11 31 144 -45
3940 -45 -201 241 -105 83 -31 -138 -32 24 -130 110 94 -227 -109 -47 222 -186 84 49 -244 -81 -199 6
3962 6 -206 -293 18 327 186 -185 -40 -132 -245 -25 69 329 -114 279 132 -124 233 23 45 -35 -204 -154 9
3985 9 -74 21 234 33 93 279 -241 -227 -229 127 229 142 -288 -70 316 -372 28 160 22 62 96 -122 -139 -153
4009 -153 45 134 -278 -449 -150 328 3 -263 65 174 8 25 -99 2 52 9 158 -305 65 82 -127 -112
4031 -112 -35 -232 63 16 213 80 -341 -4 -78 183 110 18 -119 -1 46 440 381 89 98 102 144 -106 -19 -20 153
4056 153 -66 42 -19 64 287 -31 307 -56 -206 58 -129 119 -446 -115 -358 61 -57 108 -10 70 -224
4077 -224 115 446 -223 51 225 68 -63 -7 -17 77 -99 -181 -89 -19 -129 112 -14 62 135 51 195 -134 -82
4100 -82 86 -265 3 -49 183 316 -18 -76 -166 -65 212 -170 35 -123 259 -248 -145 87 -219 13 -14 328
4122 328 309 34 -45 -34 240 -45 -260 -347 -53 -345 161 64 220 -6 -272 13 138 202 -104 -451 -257 107
4144 107 191 75 -193 199 -60 399 280 191 410 -90 -37 -164 -50 274 -68 33 22 -257 253 -23 -180
4165 -180 -289 -116 -79 -169 41 -233 126 -21 302 -254 264 3 291 -80 -216 -56 -283 -57 232 -308 -327
4186 -327 -267 28 -187 -66 36 19 272 92 -145 -118 -41 105 1 -218 -59 -29 -111 91 81 -177 160 -191
4208 -191 210 -55 141 -117 -52 -347 -340 100 414 -135 -73 194 35 219 1 93 213 -90 -338 -120 61 -286
4230 -286 -66 163 -41 -114 -53 -77 -171 135 21 103 99 -8 112 -61 -48 15 -177 136 -228 -376 76 143 217 24
4254 24 150 279 251 -61 -252 161 239 -189 -31 46 -17 -253 -273 98 -72 -96 -80 -393 270 232 -162 292 93
4277 93 -53 69 -68 -18 193 15 34 -69 148 -102 -155 -24 -5 130 66 141 -32 62 149 219 -186 -62 102
4300 102 -64 30 84 68 71 15 192 91 -111 -10 234 -450 -425 91 32 -125 123 128 65 30 -358 102 -129 187
4324 187 228 -109 237 -34 -221 -27 9 -44 -247 2 -109 74 274 -119 -80 236 -491 -157 38 193 76
4345 76 -236 -317 271 315 13 231 103 37 -167 156 -285 56 -148 36 37 272 262 186 76 -334 106 -17 -160
4368 -160 -106 242 286 -157 74 181 55 32 -350 68 -282 32 100 76 -147 216 86 138 357 63 -6 -95 267
4391 267 -42 -134 -143 -47 34 -42 240 -78 265 20 -266 31 -28 -2 -43 35 -386 -162 -28 159 -8 -165 -199 -185
4415 -185 287 -126 121 17 121 56 230 -37 23 141 -53 -246 224 64 -168 -96 -292 8 -128 19 -54
4436 -54 251 263 106 -106 -284 53 61 266 28 -108 -266 363 -47 89 -88 251 138 -87 -31 62 -23 46 -71
4459 -71 99 66 -107 172 -39 90 -77 -64 1 96 -21 -62 -127 -82 -229 69 -100 176 63 217 -144 -273 -17
4482 -17 65 -83 -222 241 -69 113 45 239 -119 113 -186 141 42 -107 3 90 -68 123 95 -101 -31 216
4504 216 -245 231 197 334 -55 19 -137 -282 -181 -259 174 -104 37 210 156 -67 -318 167 276 -40 96
4525 96 124 251 29 -335 148 -139 75 113 -138 -246 161 142 -218 179 -8 -157 128 272 256 26 -86 205
4547 205 35 -38 -106 98 -18 172 274 -38 -202 -184 -2 -50 99 2 52 60 -98 0 -345 118 -87 -125 142
4570 142 -52 379 -49 -62 433 -176 -88 -76 551 36 -84 -12 378 -150 -125 -124 -110 -7 117 278 17 175 34
4593 34 -58 -137 456 -93 -68 278 133 65 65 -92 382 -139 72 -87 144 110 -319 -241 -49 239 -23 -177 248
4616 248 -55 42 -111 -172 34 -32 64 60 363 -324 -6 -158 -248 25 174 107 6 183 159 -202 289 -94 -58
4639 -58 -5 159 61 57 20 -127 336 -117 -46 -16 166 177 3 -321 -71 108 -138 208 -45 133 -45 -86 207
4662 207 88 -428 97 160 1 254 -10 -90 107 -121 -117 237 135 146 -70 -448 -18 172 -38 112 -149 -42
4684 -42 -194 76 101 -458 16 230 -33 -36 -232 166 158 -77 -44 392 -27 41 159 83 -33 -67 382 24 -170
4707 -170 178 30 -53 24 -131 -69 -46 48 -153 60 -176 106 -28 -92 339 496 -52 -213 -231 194 81 -270
4729 -270 68 264 -149 -67 -47 -23 22 104 73 -19 -331 92 4 -24 305 -183 10 127 190 161 -20 20 167 -112
4753 -112 -161 71 179 -110 -406 75 33 -21 -127 113 -235 -116 11 165 273 47 79 -121 74 163 310 -71
4775 -71 -278 -466 -2 -165 -42 121 -54 -190 39 -104 -134 69 10 -101 -36 206 237 -98 -163 131 4 -306
4797 -306 29 -56 -154 22 -93 -230 205 194 -46 -2 -1 -147 149 -20 -110 141 -211 268 -332 50 -7 -88 160
4820 160 -202 74 47 -22 -7 38 28 -64 187 -67 34 -2 -236 219 8 -159 -387 -78 -280 88 265 -280
4842 -280 236 260 20 -27 -133 70 -40 -93 106 14 -212 -341 -147 156 -311 244 6 -8 35 -437 -40 14
4864 14 -227 113 -11 -171 -31 220 -292 101 246 104 -217 3 199 240 -224 140 -54 131 281 -209 -71
4885 -71 202 173 -21 279 -38 -35 -241 -51 82 182 186 287 -44 -82 -50 -60 145 95 -182 -109 -44 -86 103 -34
4909 -34 22 -264 19 0 146 119 -103 148 -286 -134 -189 273 -148 -154 -444 37 377 -142 -150 95 191 -219 241
4932 241 72 -134 107 33 103 -94 -262 -50 143 337 -20 151 -219 149 500 41 171 -120 -88 45 238
4953 238 122 -189 163 39 -62 519 -29 304 161 39 48 -111 235 186 -109 162 18 -298 23 -210 102
4974 102 -333 102 312 58 -254 -123 -131 277 -331 49 -18 34 374 102 164 -135 -58 62 388 45 -150 -2
4996 -2 -105 98 203 211 120 -454 -135 -223 -16 151 -80 -82 -84 56 -213 138 -140 207 105 -194 253 -156 43
5019 43 -113 17 -13 -88 130 -138 -22 -274 -483 3 116 16 102 208 -299 -48 -31 -324 23 -363 78 -214
5041 -214 -57 -92 -487 -138 -290 112 -143 29 282 175 121 -45 133 284 -148 -183 -30 -231 75 -122 176
5062 176 -335 338 45 -99 292 280 -169 81 -119 -106 327 70 -58 -147 -70 7 -27 2 -152 203 70 104 -108
5085 -108 -229 -49 29 -123 58 301 -71 -132 58 90 128 -47 -373 -44 -215 50 184 277 -9 21 121 80
5107 80 -32 96 -121 -196 3 -146 23 204 -97 -211 -425 -117 464 -205 -47 -69 155 13 153 -30 -291
5128 -291 169 -70 112 -252 -52 337 24 -112 -52 -102 90 196 -87 278 160 158 69 -45 252 -75 -176 -14
5150 -14 164 65 436 -14 96 -247 -32 -43 154 -256 5 -74 -14 -77 9 -12 -102 -31 62 -6 -31 72 -141 -19
5174 -19 272 -48 -96 -1 209 -40 -290 -60 2 125 32 -237 56 -90 187 56 54 204 -418 52 -207 -30
5196 -30 49 27 125 24 -25 8 -171 78 193 295 50 -163 -151 -284 -279 -239 -188 -64 -130 -127 -12 -105 -185 173 -71
5221 -71 -196 -97 60 44 326 -138 88 178 126 81 -6 35 -219 61 -26 316 -149 -17 -181 -75 48 116 49 251
5245 251 -149 -55 101 -295 -148 189 83 23 -127 -118 119 -250 2 295 -12 -50 32 315 -49 -281 255 -147
5267 -147 -32 28 -56 -159 -75 13 24 301 -92 85 -56 193 -246 129 39 -116 94 -128 142 117 -40 -40 60
5290 60 -136 -72 -17 -91 -59 172 100 97 94 3 -27 -73 -86 -126 -196 139 -137 -52 314 -104 -152 23 218 -98 -194 -86
5316 -86 312 -85 204 73 95 238 65 9 247 10 9 -94 312 360 -136 -77 -72 153 247 -58 -164 285 137
5339 137 241 -24 295 224 -224 37 -147 54 -262 5 391 89 -255 47 -137 292 -234 -200 -261 175 -43
5360 -43 -278 220 -100 -191 0 -191 -168 -287 -89 22 -280 6 -123 58 -13 -48 45 -88 -202 -329 -507 -2
5382 -2 -219 39 16 -213 122 -15 -224 84 -31 -16 -312 106 192 -115 -302 -81 255 125 -181 147 52 124
5404 124 -17 -35 -55 -259 234 -254 -46 -22 -288 -283 -175 8 -233 -107 81 -20 -136 40 105 230 -210 33
5426 33 97 -237 208 279 100 83 1 142 -267 -28 57 -162 -141 -113 199 81 292 12 440 -163 134 35 -66
5449 -66 69 -114 161 -212 -239 -380 190 66 -331 113 8 7 91 152 327 193 -226 -202 159 59 13 234 -199
5472 -199 0 -522 -29 -12 68 21 -32 -157 -63 -142 51 154 2 -408 121 131 -270 189 -128 41 130 162 -6
5495 -6 -78 215 -291 47 182 440 108 -46 -166 147 -14 -35 -77 -160 130 221 -45 -55 -90 73 177 -366 76
5518 76 -80 143 183 -273 -3 391 37 43 -82 -80 -16 63 45 211 142 -151 17 -1 -204 66 -18 38 -251 -3
5542 -3 279 -31 148 -60 -165 11 109 239 -62 310 89 -116 -146 80 3 -53 -216 -137 295 32 177 8
5564 8 21 -2 -307 15 126 -133 -175 -138 106 -2 14 24 -358 129 269 5 -19 350 330 -85 -178 26 -268 55
5588 55 276 -69 -218 7 -73 128 47 -33 -89 -68 -115 -33 -137 -119 84 190 -89 -310 -195 -258 -153 93 -16
5611 -16 -179 -132 -246 87 -70 341 109 53 -248 -231 -94 -25 -187 -79 84 221 -202 -119 -272 230 -114 64
5633 64 -7 196 -34 -92 45 -80 265 -49 468 -113 -29 -177 -154 -205 300 -121 94 -180 161 -10 -234 -28
5655 -28 398 38 -131 71 78 98 -114 16 -76 83 -8 -6 -6 38 -267 -161 -162 -126 178 119 165 96 61 135 27 -353
5681 -353 245 242 18 54 -2 -347 -430 98 -150 -159 -20 -12 -159 -63 208 -91 -238 -22 95 352 24 -27 50 -292
5705 -292 87 12 60 -71 2 27 -358 43 -205 -228 161 -349 -142 84 234 -83 -121 -167 73 -167 7 14 46
5728 46 60 6 20 -102 14 -125 -90 157 344 92 31 -166 213 -572 -34 -51 -336 29 -256 225 -15 -109 304
5751 304 -116 62 -123 62 118 155 79 275 2 -22 -125 -41 17 -182 -54 263 -56 -71 3 183 132 82 -37
5774 -37 259 4 110 149 113 -93 127 -303 -39 -270 2 -114 -62 -15 254 -96 161 66 -104 126 244 63
5796 63 -30 -219 188 23 -82 197 86 72 2 95 221 5 102 -19 -452 -8 70 -6 9 117 77 -149 -14
5819 -14 81 -293 -149 -67 -36 -279 -32 -27 79 -100 -272 240 -135 318 195 -70 130 -339 21 -296 -107 160
5841 160 346 308 -2 -55 105 270 -148 48 106 -208 -153 -170 -110 -271 -236 258 -179 31 330 544 -259 -34
5863 -34 -357 86 119 274 44 24 114 -95 -293 -8 -164 61 475 -249 -286 -51 -204 -97 -218 197 -247 43
5885 43 -329 -199 -36 -142 164 -62 100 -175 202 321 -146 60 346 22 -9 145 -4 323 138 134 131 -223
5907 -223 -80 251 71 55 148 -116 -103 61 -17 -242 24 292 -135 -139 130 -143 463 79 -186 -138 205 -74
5929 -74 -121 -77 -289 29 -164 95 51 191 176 234 -161 6 -85 -7 -7 -284 330 -103 -201 -109 19 -56 -185 -130 269
5954 269 218 -89 -223 74 -138 -117 347 51 31 -313 45 193 322 -82 -82 241 -85 0 224 -9 -212 -15
5976 -15 150 -11 -48 5 16 -309 86 65 229 -45 -43 -24 162 -13 -230 -8 268 -138 -52 308 252 24 -208
5999 -208 -404 379 21 81 -23 -18 323 -18 -109 -443 81 284 94 115 -398 -186 -100 107 197 349 -377 -202
6021 -202 18 17 -122 -2 299 -50 -63 -177 45 131 217 -41 -14 -28 -189 -118 141 -42 -143 309 -168 16 196
6044 196 255 163 156 -283 213 -37 -191 93 144 1 26 -97 -80 101 -102 -202 131 1 -268 81 -154 209
6066 209 -140 191 53 193 -130 150 -292 354 90 108 326 -125 -60 75 128 247 168 255 142 -76 17 -122
6088 -122 -62 -260 57 -162 282 209 74 93 57 377 292 -133 -215 -103 -125 -1 -66 21 -16 -301 25 20 -71 26 218
6113 218 35 -70 73 37 -86 -202 9 129 32 -159 -122 55 112 371 -37 93 113 195 -206 79 -254 -85
6135 -85 97 216 92 -264 265 -81 3 137 199 -82 209 4 -27 19 -37 167 -8 -271 141 222 73 25 -140
6158 -140 -150 172 137 93 144 -228 -202 22 201 75 -27 43 138 -112 194 -13 191 -94 31 -194 -66 140
6180 140 -41 116 10 251 50 104 -235 250 340 -49 -209 -233 2 74 18 -3 -294 102 -73 227 -109 -60
6202 -60 -74 -190 -109 88 -114 59 -106 -261 -169 -127 144 31 253 143 296 6 -81 66 238 119 95 -251
6224 -251 -53 -34 -72 -286 461 -193 4 -385 -261 375 -4 57 -216 -33 -81 28 -148 51 -99 159 88 25
6246 25 -122 97 0 25 -18 -39 84 213 17 329 -40 -163 204 209 -33 -224 119 -161 -10 27 -113 -16 44
6269 44 10 237 -49 197 -318 -145 72 -150 20 60 322 122 -295 -139 199 195 -96 184 104 149 -319 -129
6291 -129 -82 173 -60 -141 -180 -38 53 -292 25 -370 153 312 87 54 27 182 219 -207 270 16 241 -291
6313 -291 -127 -135 205 -95 -93 -25 132 -92 -135 160 300 32 -134 293 101 -155 -184 -389 1 192 23 -14 -317
6336 -317 -62 61 -126 -85 -119 45 -45 55 108 -16 -43 -12 -16 81 6 -152 143 114 -19 -28 -351 235 9 38 -8
6361 -8 -8 -40 -174 -53 -77 -99 129 148 195 -82 -85 -105 7 -455 38 302 -211 371 214 -18 183 34 -89 30
6385 30 -392 2 -102 334 102 -303 -120 34 29 68 -8 -115 174 -141 182 -164 -400 92 47 -48 -165 -173 4
6408 4 -165 200 -131 -29 19 36 -116 -46 130 -77 36 -4 -15 301 80 -213 39 42 82 -151 -65 162 -279 -330
6432 -330 -106 79 -104 97 -497 -108 87 -204 249 84 262 176 12 -424 -120 -150 61 -116 61 -42 -333
6453 -333 -25 128 184 174 35 -18 -300 -117 -227 -3 -254 -11 136 238 142 386 -1 -83 -50 251 -209 202
6475 202 -59 -287 -254 14 -82 -53 -204 49 -296 118 -172 -101 16 50 289 -91 50 -139 -55 70 208 -86
6497 -86 234 87 -75 -91 63 -218 -17 39 199 79 267 243 -162 104 227 -77 -112 573 138 -85 -160 -153 -58
6520 -58 -143 -93 125 -151 60 -359 373 356 138 144 29 135 -141 -20 -342 248 10 -8 111 -80 3 108 102
6543 102 -219 48 164 -104 96 267 47 71 -325 -99 124 -130 213 -49 -177 -122 105 -207 -168 53 432
6564 432 58 -104 -269 -67 -115 128 262 -64 100 101 3 -119 44 98 -16 -449 -187 53 -37 -54 350 56
6586 56 -12 -115 -119 -200 -206 55 24 -81 92 198 -153 82 -28 -362 254 204 351 218 146 84 57 -57 -242 -89
6610 -89 82 -191 225 -156 63 -163 -121 -36 11 91 53 -26 -232 -84 163 -40 -9 229 -247 -104 -159 64 38
6633 38 -297 -257 -13 -113 -279 -100 -153 -98 -89 -11 260 236 -329 -204 42 -32 106 -185 -27 62 144 52 -134 291
6657 291 -87 98 -221 -246 401 -184 236 140 -132 -45 -35 -386 253 -1 113 199 -119 -140 -26 163 -341 226
6679 226 33 -105 201 -36 34 -12 -81 -190 170 76 100 110 -17 84 -140 28 -4 -131 118 24 -71 225 -143
6702 -143 41 -127 262 46 85 80 -61 -113 9 98 109 -255 -89 -193 -55 -49 412 260 34 124 55 -45 -206
6725 -206 -102 15 174 -13 -39 -569 89 208 11 -164 -2 -20 -120 -158 -72 227 -248 188 31 266 21
6746 21 -78 -350 57 185 275 115 -230 -70 131 93 17 18 -409 -209 -29 -114 191 179 -188 7 175 63 -120
6769 -120 -140 78 -61 -111 -251 185 239 139 -13 98 260 119 29 108 -60 -38 -26 351 138 -354 189 112 -113
6792 -113 -181 -80 -69 108 -195 132 -165 -21 -102 118 -2 240 -111 -156 198 -306 14 67 -198 150 58 78
6814 78 -348 -135 -118 218 127 305 259 -118 314 -203 -55 -176 215 146 -113 -458 207 -173 -129 -111 49 142 38
6837 38 -194 -59 -107 -60 227 -67 -203 -80 -178 42 85 103 -118 131 -43 -182 -16 61 113 -2 -31 -36 -284 -183
6861 -183 250 -57 -100 -110 -40 125 -10 -250 100 92 -257 -109 28 -66 -279 -282 353 -51 -158 -406 -136 -8 9
6884 9 173 -144 250 189 -40 -71 283 0 -227 -281 -12 120 199 -132 134 111 90 262 185 -20 -382 -318 444
6907 444 226 340 70 -345 -71 -191 361 -5 68 54 78 90 -57 -137 -255 -315 62 -69 -361 -15 -35 169
6929 169 31 27 -154 80 237 300 -160 -393 -273 5 45 -43 -30 28 -62 -233 213 107 -265 276 -115 5 311
6952 311 -163 -243 -164 -214 84 12 -100 -316 294 -137 442 -371 -102 -207 4 154 -102 -153 131 38 282 170
6974 170 112 -79 19 -199 -99 -189 -236 -127 -105 136 -72 -85 98 -34 174 35 146 127 -54 -48 -24 -131 -22
6997 -22 11 9 -193 94 -57 -73 467 47 -20 101 -51 -104 7 47 120 307 39 -16 153 97 -155 86 -22 203
7021 203 38 -11 46 60 0 -94 157 90 220 -158 24 36 181 146 -270 45 200 32 -298 -1 205 -124 -260
7044 -260 139 -93 48 30 7 177 -18 -165 -57 216 151 133 50 290 255 -77 108 -163 35 -72 -168 13
7066 13 156 59 -184 122 79 -5 20 -179 72 132 -35 94 120 -76 -112 -46 64 182 340 -36 106 103 302 17
7090 17 -40 -290 167 35 -18 -194 -125 -15 -102 -123 -164 26 -261 53 178 4 -280 -27 68 44 207 -89 15
7113 15 -302 -357 168 -32 -113 -203 170 -156 -102 -208 -54 177 288 17 117 -114 -100 -250 -67 -100 -86 -54 217
7136 217 244 -134 102 -349 -36 275 -24 -235 13 -427 221 349 -255 74 9 54 -125 79 321 159 -118
7157 -118 -90 155 319 150 -64 -165 -339 84 207 164 37 115 0 -129 188 -270 122 15 -44 47 -152 -177
7179 -177 105 -177 -37 37 9 -190 -196 99 -80 -283 346 122 -226 274 226 56 -130 80 232 -224 -239 -95
7201 -95 -143 46 -2 22 -56 -18 136 -79 266 -148 52 -39 -7 -1 -51 8 73 -46 79 251 72 231 -64 -137 -110
7226 -110 -143 -32 -36 82 -21 -73 -417 145 -53 -41 -291 140 142 -127 82 -132 74 119 18 -31 224 250 -47
7249 -47 32 -26 258 134 -174 74 64 -216 122 -87 -194 151 -76 -137 -12 -60 342 11 -23 -484 -326 -28
7271 -28 -26 97 -25 -146 -186 -57 -39 212 90 -428 192 -29 7 -257 -134 251 -269 9 -8 175 92 6 197
7294 197 166 109 420 -421 64 189 -138 -167 -48 48 -14 -1 -74 341 98 132 90 -91 -30 121 208 -10 177 -130
7318 -130 -75 -78 112 -87 156 -6 168 -65 -132 116 -147 103 -61 236 97 -65 132 110 85 123 -98 164
7340 164 273 258 24 177 -22 124 -265 -137 -194 -311 4 226 81 132 68 -245 -56 -365 -153 -526 -208
7361 -208 212 -253 102 -117 44 198 225 140 81 22 -19 136 -103 -267 378 151 172 19 197 -93 -310 221
7383 221 241 -52 101 170 89 186 274 -253 -38 -83 -34 -271 207 112 26 -8 -113 243 86 110 -142 355 -54 255
7407 255 186 178 139 -275 337 359 201 115 98 45 -220 177 -224 46 -109 93 -176 -103 406 -94 -35 58 -164 -37
7431 -37 -107 -32 103 78 -167 443 -188 -232 193 -226 -23 106 -80 -139 -199 -238 207 418 42 84 -48 -66 -22 -99
7455 -99 180 -79 -50 -87 -182 19 -163 62 153 -187 19 122 -68 -185 463 185 -56 64 -1 -175 143 -151
7477 -151 -75 -145 -153 38 104 -71 58 114 117 -345 52 93 328 321 36 218 -108 55 104 163 -87 -184 -49 -198 -128
7502 -128 318 37 277 191 294 -15 113 221 -163 121 185 -142 -1 292 -217 -17 439 -47 189 -410 -101
7523 -101 144 59 200 -70 -102 -14 273 -16 -81 -13 -20 136 -298 178 -141 145 -357 80 12 -169 -271 50 -96
7546 -96 -234 -30 -210 85 -505 290 -175 5 184 -83 81 251 -32 -225 59 122 48 203 -209 -95 182
7567 182 44 -61 -44 97 -211 109 122 101 -310 -142 134 112 -24 -140 -64 -191 -202 109 201 99 99 45 535
7590 535 27 99 239 -193 1 -101 -9 -1 386 -208 -85 278 -375 -378 90 173 -18 105 103 -245 334 -87 -56
7613 -56 -139 -284 49 -80 161 -101 134 -409 -160 222 -19 53 150 18 14 201 -139 -79 -139 -166 111 18 87 -43
7637 -43 49 -172 181 209 -67 74 -19 159 -157 160 696 -139 42 -24 -204 175 132 170 -39 -1 13 80 -4 -165
7661 -165 258 -255 7 -311 -278 54 -158 182 -95 -8 -19 -78 108 -51 -2 -57 117 -90 -352 76 -44 -438
7683 -438 131 -344 -133 -223 -106 229 -199 -151 180 60 -211 49 -13 228 130 269 -6 -73 -242 -32 -35 86
7705 86 -82 63 -45 -85 -55 -130 34 0 224 183 -304 55 -148 -2 -189 48 -122 52 -127 329 -13 -29
7727 -29 59 175 84 38 -69 206 398 -298 54 278 -304 210 29 179 22 200 180 -86 17 130 1 -134
7749 -134 106 38 -187 -82 147 -48 176 322 119 144 -237 222 226 89 19 -13 20 58 78 105 112 23 331 -32
7773 -32 -22 56 -11 12 -85 -262 59 205 30 185 -348 126 243 -54 97 -138 -387 14 -88 143 307 -107
7795 -107 -486 59 -169 123 52 -53 105 196 -252 -196 -46 -98 -188 -296 14 117 152 -391 93 -46 -42 17 97
7818 97 -94 101 94 -185 37 104 -82 -72 7 70 328 -96 -105 211 1 -12 -176 114 -249 -141 -309 -84 -125 -19
7842 -19 -131 -77 352 -98 234 86 -175 140 -137 15 -189 -58 155 -89 -219 -271 -46 -117 -185 25 -232 101
7864 101 -333 -211 328 -79 76 -118 98 46 124 181 -18 114 261 300 -68 -71 -219 148 -68 59 -80 -19
7886 -19 114 -22 90 -130 -114 -13 100 -209 -228 318 -188 -183 -104 97 -33 18 -180 -44 -198 -157 33 -242 -387
7909 -387 -27 44 23 -73 -210 16 262 -122 -74 132 99 -156 -157 -200 34 112 241 70 -189 115 -115 -227 -464
7932 -464 12 74 17 -227 -361 -59 -174 122 15 0 133 -22 166 221 -102 -296 136 -178 32 176 -146
7953 -146 -61 -17 -117 -277 29 -85 -192 49 -72 -166 -84 -88 -185 -30 -131 -81 -102 48 54 -62 155 -79 -43 15
7977 15 -239 158 -91 173 -87 179 -70 92 23 -28 176 111 7 -1 -54 -126 205 -152 85 259 156 -59 74
8000 74 -73 92 -395 -160 -11 10 -5 267 -8 -75 -117 12 34 -295 -76 144 103 -51 166 -93 13 -329
8022 -329 43 82 252 -133 -128 316 125 -164 244 146 -121 -61 -217 -186 198 289 -290 169 -189 358 57 -496
8044 -496 87 422 -123 -74 -125 -68 102 -67 24 -76 122 -43 -138 345 -143 -347 -127 -181 -129 -138 326 -59 -11
8067 -11 208 189 -78 -225 -273 -171 96 -579 10 -171 -23 -127 52 31 194 303 -85 -271 97 -74 -311
8088 -311 -106 -17 22 -31 -92 115 -7 127 359 107 100 -309 -14 -354 -418 58 62 -144 26 -299 96 77 43 -17
8112 -17 7 64 77 181 -23 -180 133 -134 241 -155 -189 93 3 -179 97 -324 79 126 -96 -99 -68 -74 16 51 259
8137 259 -89 -27 52 -51 240 130 255 486 -5 -167 2 -22 -28 346 -208 -98 190 -393 -87 103 173 -12
8159 -12 88 61 -180 147 216 -48 117 -160 345 -237 394 75 191 -199 159 -179 -20 276 69 -50 117
8180 117 99 -275 56 -454 -119 -139 -241 -7 227 -228 70
8191G0
$$ Imaginary data points
##PAGE= N=2
##DATA TABLE= (X++(I..I)), XYDATA
0 0 0 0 0 0 0 0 8 -8 8 -8 16 -16 24 -24 32 -40 45 -54 64 -73 87 -99 115 -133 153 -176 200 -228 258 -291
30 -291 327 -368 412 -461 515 -573 637 -707 785 -869 964 -1067 1179 -1307 1447 -1606 1784
47 1784 -1990 2221 -2493 2815 -3199 3672 -4270 5047 -6110 7649 -10098 14573 -25389 105135
61 105135 54000 -142773 58670 4627 -7489 44371 -66582 -33162 83612 -5190 -39577
72 -39577 -6641 28698 20291 -26002 -7383 6749 -4301 35477 -31865 -43697 64710 5610
84 5610 -54744 28616 4142 -8132 35519 -32710 -27912 56081 -5321 -43744 15082 8116 -3099
97 -3099 14085 -15763 -12141 28697 10844 -27608 -10305 21234 2461 -14446 2226 -5737 4236
110 4236 27928 -23514 -23592 41047 202 -28240 13285 -6248 39 24059 -28695 -14592 38959
123 38959 -566 -24629 4320 9416 4795 -689 -13754 -7604 17453 11311 -25645 -8680 28212
136 28212 2010 -12526 1578 -6714 10985 14874 -28978 -10381 30505 -1037 -18741 4475
148 4475 4659 4608 6928 -14733 -8161 20939 1641 -20057 2120 9942 -1473 1393 -4828 -6275
162 -6275 14477 7137 -18587 -3447 16270 -1080 -10504 129 -225 5181 8266 -13949 -5272 20559
176 20559 -728 -14529 4164 1971 -319 4798 -10384 -4986 16439 1827 -13628 1637 8933
189 8933 -860 -3124 -3435 -3564 7850 4824 -12961 -2021 14462 -1201 -7502 2299 -1056 3114
203 3114 5467 -11654 -4292 14625 -1177 -10748 2954 3907 863 2488 -5897 -3537 10209 997
217 997 -11536 112 6890 -1143 -1477 -1021 -2557 6532 4678 -10732 -2285 10899 -1897 -7044 1963
232 1963 146 2713 3841 -7616 -1893 10643 -1056 -7711 1805 2477 -394 868 -4116 -2226 7810
247 7810 1808 -7993 804 7303 -1350 -2943 -98 -1383 3566 1691 -7967 28 8206 -1661 -4365
262 -4365 2034 424 1329 1303 -5564 -1505 6929 -692 -6051 2018 3263 -19 303 -1953 -1156 5157
278 5157 378 -6220 1012 4419 -1616 -1714 15 -594 3561 1727 -5566 122 5514 -1622 -3497 1128
294 1128 295 1147 1247 -3630 -9 4991 -979 -4014 1540 1444 -729 -208 -1934 -639 3899 163 -4342
311 -4342 1213 3630 -1088 -1799 -138 -543 1580 280 -3445 507 3589 -1075 -2128 1022 442 513
327 513 339 -2405 -382 2988 -489 -2983 782 1759 -233 -158 -818 37 1930 -254 -2863 482 2454
344 2454 -712 -1145 89 -80 1305 278 -2216 367 2600 -1052 -2114 375 602 545 -421 -1689 284
361 284 2133 -728 -1979 370 1188 -553 -285 -695 -58 1946 -149 -1894 460 2059 -588 -840 165
378 165 143 863 6 -1311 518 1665 -824 -1175 725 287 151 -344 -754 -27 1545 -177 -1591 489
396 489 1305 32 -153 -354 322 900 -83 -1201 135 1342 -581 -790 -26 463 500 -17 -891 34 1039
415 1039 -91 -1300 132 796 17 -576 -672 236 1328 -273 -1011 214 620 10 -453 -157 33 439
433 439 -288 -995 668 927 -542 -608 137 318 16 -424 -831 156 890 -197 -903 351 801 -122 -166 -361
453 -361 28 506 -316 -462 474 486 8 -351 -573 398 321 -279 -684 281 554 -336 -381 128 433 240 3
474 3 -549 -210 323 -303 -597 148 312 -60 -35 -222 130 404 -396 -636 204 364 -88 -172 276 335 364 -401
496 -401 -517 -111 781 -234 -633 257 182 0 -204 -286 164 212 61 -191 459 534 66 -79 -330 641 331
517 331 -296 -263 91 205 -388 -91 -84 159 39 5 -520 199 175 -234 -172 -40 164 339 240 -96 -94 150 82 -310
541 -310 325 265 -93 -296 -247 197 16 -117 -305 -85 152 -138 -95 -251 129 83 -407 -366 119 81 196 74
563 74 -72 80 132 19 -224 81 345 -126 -300 -131 60 107 260 -175 118 508 -71 -472 148 260 -119
584 -119 -125 -298 242 141 133 -126 461 311 476 -226 16 65 -81 70 -138 224 -100 -351 -288 -47 -247 99
606 99 -239 -174 -38 388 -313 61 74 269 50 -38 111 -105 304 -93 -240 119 195 120 184 -72 -16 209 74
629 74 -234 46 -12 -13 -47 34 -15 154 -61 -165 47 256 91 -192 -124 167 -19 -189 65 226 -213 -39 -69
652 -69 20 -53 338 -117 -19 4 45 -210 -55 -127 216 79 -156 168 -419 -59 -295 -220 196 379 -297 -119 119
675 119 116 102 -140 -128 395 -260 -332 -262 -108 -242 -58 68 -193 118 -2 -313 -166 143 -96 -277 76 16 116
698 116 219 43 1 83 92 -145 -76 57 128 -171 7 -265 169 255 -100 187 175 63 -219 -173 85 -107 -39 -67
722 -67 -233 -99 117 263 89 124 -273 -111 186 130 -194 60 136 -81 71 13 -57 -224 -141 -3 84 -90 -232
745 -232 201 -89 -216 -228 -127 373 348 -116 -194 -233 72 116 -82 -122 154 -158 33 142 -152 96 -105 -80 -58
768 -58 -300 -43 76 366 55 157 -27 -76 46 116 -57 121 -237 -267 -75 -353 109 -51 -112 -253 -246 -79 -75
791 -75 -78 78 11 39 -89 156 -98 110 -20 95 171 -204 201 247 230 4 71 -28 18 -162 300 226 -87 -64 253
816 253 195 -78 -15 66 15 -253 -142 89 121 -230 129 -41 314 4 99 111 -35 141 43 -196 65 31 -105
839 -105 -97 447 -313 82 136 -10 41 244 -60 24 -241 149 108 105 -35 -170 359 -94 115 354 -125 188 146
862 146 47 -227 196 0 50 -50 109 69 60 92 -191 96 16 -49 -102 104 19 -2 110 -130 -340 -88 97 84
886 84 -219 158 -48 -154 -139 -127 -56 258 -49 20 -74 -287 154 -70 -142 277 -83 -60 149 331 157 -2 -65
909 -65 103 -141 -100 48 144 169 274 -126 89 109 183 -3 258 -44 86 25 182 -99 159 -105 -22 -160 340
932 340 -45 -35 175 227 -32 149 30 -198 -211 45 175 -57 -7 143 -367 -149 -41 60 69 -131 -30 -281
954 -281 203 -76 65 -239 70 -389 -192 89 -336 -182 378 -106 -101 -191 171 -172 -87 57 377 -59 -260 -113
976 -113 57 -243 177 -116 177 -189 245 4 151 -72 -69 374 159 -157 -66 111 116 -370 7 -252 122 101
998 101 -127 -117 -269 -72 -514 17 2 -224 -135 -7 -117 303 -190 -134 -110 4 174 104 -241 -185 -248 -44 -29
1021 -29 -128 82 -21 -143 -482 -5 -41 -191 -21 17 -71 -55 52 -110 1 43 202 -48 218 -157 -123 -275 38
1044 38 -83 -361 145 -52 -230 -3 -156 -33 -186 71 -231 32 -35 205 261 188 314 -169 76 160 -206 121
1066 121 57 17 88 164 -179 -408 -177 -82 -109 -502 -64 327 155 22 2 53 -58 148 -132 172 -65 -40 194
1089 194 162 188 233 -57 18 194 -25 409 92 -60 108 264 456 69 457 -127 -217 -82 -134 132 -77 307
1111 307 -361 -111 28 110 -54 -46 152 -101 -193 -288 -153 -337 50 208 -79 -1 -3 -263 -73 176 -379 76 197
1134 197 -106 -291 196 -296 209 -48 349 81 207 166 -118 -108 -392 19 23 -41 129 -22 138 -262 -173 39
1156 39 258 96 -84 -119 -384 10 -134 85 108 47 176 64 93 -114 -108 395 -49 -81 -119 -200 244 114 -199
1179 -199 19 21 66 66 69 149 225 429 -146 -123 -74 -203 96 -204 -97 21 -93 -201 179 135 -136 -99 135 -6
1203 -6 -37 165 125 167 -235 11 -72 28 -162 124 -140 -335 -38 -42 -8 -309 -148 258 -16 -379 -132 -185 -46
1226 -46 154 -64 98 -6 -110 -145 -186 98 -149 178 -13 -118 -277 -40 -22 -73 95 -250 453 -284 -214 -156
1248 -156 -120 26 -174 -57 384 68 62 327 -158 -60 -145 6 -84 -25 33 234 204 14 -12 -319 -1 150 256
1271 256 -12 66 -25 129 -60 -25 -21 -2 -58 364 -159 -9 191 364 220 18 -113 159 61 284 -286 236 368
1294 368 37 28 22 -177 73 -108 -221 -13 -256 23 -40 10 65 350 68 97 99 -25 39 29 -420 229 -235 -151
1318 -151 83 326 286 151 14 -92 102 -73 120 51 76 88 42 280 -36 -458 -59 -216 -22 -188 -289 -7
1340 -7 -195 -78 240 32 -167 165 -66 -301 104 -22 -97 30 -115 -338 41 58 -173 27 -95 -32 -125 73
1362 73 20 382 -68 -355 275 -114 131 40 -178 -155 -80 24 201 -90 262 375 67 31 -55 -232 8 -349
1384 -349 349 -88 111 -216 32 143 227 237 -60 -65 58 -111 168 -113 -281 -352 159 88 228 13 18 -183 -162
1407 -162 -44 109 -123 -213 -117 46 -73 -158 163 -47 -121 -29 -38 -60 -380 27 58 24 -30 27 -312 -488 192 273
1431 273 -180 152 -54 -22 8 -267 -21 31 183 -51 265 -154 241 -44 -107 142 -155 -244 21 170 9 76
1453 76 -18 -358 -34 -102 -15 -207 -104 128 53 -240 94 268 20 140 363 -101 -59 -64 -295 -250 -43 100 209
1476 209 102 239 -283 -16 20 -80 177 209 -22 102 -46 5 97 101 298 238 -210 143 76 114 189 -81 -84 121
1500 121 118 23 -282 164 43 -223 -467 -138 -106 -39 -209 172 220 -247 159 -155 -43 216 26 -20 -112 66 136
1523 136 55 -274 -117 229 -10 -14 315 -26 -267 134 -216 112 128 -377 -53 -209 -112 81 73 -193 53 -104
1545 -104 -351 -319 -363 227 166 -119 -196 -188 85 -74 35 170 -25 -199 100 227 -76 54 2 143 -149 -115 -240
1568 -240 55 43 -136 107 77 -246 98 2 -14 105 -259 -119 52 -22 119 232 117 -4 121 -11 -152 303
1590 303 44 -89 132 150 -235 -153 -224 186 6 57 -170 108 80 9 -24 110 48 -214 -122 -26 -32 -66 205 -84
1614 -84 -128 76 -25 131 56 159 -209 -87 -504 -253 127 81 62 -205 -127 -46 268 65 74 155 -212 -96 -151 213
1638 213 232 -83 57 -16 247 3 122 16 -228 -13 113 -5 102 -24 -15 124 13 -40 101 123 -315 -13
1660 -13 -141 -53 43 -109 -359 192 -423 -138 28 -24 189 -123 93 -100 -158 83 245 -128 -62 148 23 -250
1682 -250 130 -153 -32 -208 130 -266 -32 32 -250 -146 49 -108 -142 209 54 141 73 50 -79 69 -164 -166
1704 -166 138 -71 -39 149 -227 135 300 -290 173 7 -294 -3 76 106 -294 -60 -196 362 159 -132 83
1725 83 191 122 -152 -58 -249 50 75 246 -2 -139 104 -78 -291 -17 206 -53 -157 -1 144 -423 129
1746 129 -182 -102 -42 78 -219 -124 235 196 -127 -273 28 -210 -160 -140 110 148 201 -189 -97 68 208 18 -241
1769 -241 133 -106 -59 192 17 45 -77 -21 -84 205 82 -190 -63 114 -121 119 229 157 -47 -348 266 -217
1791 -217 -323 54 85 -189 186 146 -139 74 -28 -41 142 6 66 42 -114 -167 -266 14 -43 169 163 -260 26
1814 26 -112 173 -127 132 186 -119 -106 -22 155 -167 -78 27 -59 149 242 22 -27 120 213 -220 108 -129 258
1837 258 224 21 -33 56 -330 -15 -336 108 -307 -189 27 -79 82 -32 29 -143 268 -243 -154 9 -300 120
1859 120 -177 24 -32 -188 119 37 -246 428 -99 379 -150 -77 -8 -263 -76 55 -276 -134 -44 -269 -5 210
1881 210 -113 -117 69 67 102 -288 137 -197 -29 -125 -300 142 -259 -17 -115 26 35 -129 -29 -77 -132 110 36 -182
1905 -182 245 -48 55 59 166 310 30 104 84 502 -43 371 198 -250 -13 96 74 -199 36 -82 -107 -11
1927 -11 -201 -47 179 -285 18 166 -100 278 -6 -58 94 155 -31 57 -59 19 -131 35 232 18 -107 -124
1949 -124 93 137 216 262 -133 -84 244 -108 -127 354 -200 -183 99 -18 -95 289 171 91 67 76 -20 -340 -198 -67
1973 -67 143 303 -302 -38 97 158 192 -175 35 89 357 61 -104 -22 -137 -62 288 -208 82 -112 220 -59
1995 -59 6 151 37 -167 -324 250 -69 -299 -84 -105 -59 84 -126 42 1 137 -7 135 -7 105 40 326
2017 326 -8 23 -256 -8 -203 391 -202 -173 -13 205 -128 17 272 -153 96 -116 -3 35 -40 -16 134 143
2039 143 -48 -144 -113 -41 187 20 -258 -298 -40 134 208 -12 69 -94 166 86 100 138 119 287 126 -180 196
2062 196 -61 59 -157 46 -357 -81 -217 127 -136 -292 119 -103 -127 238 113 -131 -214 40 -27 -35 126 204
2084 204 -57 14 152 -460 353 202 -14 15 -58 58 15 -65 -103 -63 19 204 -15 -151 -156 -14 93 9 19 86
2108 86 205 217 -143 -34 -73 -67 -29 209 -115 168 119 -134 -15 63 -156 -38 -70 57 54 -95 -60 -38 -64 -51 372
2133 372 156 -352 115 -7 -61 -254 -65 66 7 -397 263 102 -73 83 1 121 172 198 110 158 -15 -214
2155 -214 -102 -51 80 -342 -55 76 127 222 -36 -39 -173 -219 -443 -46 -5 -197 253 0 -93 28 11 75 -168
2178 -168 -168 -204 91 161 -285 -236 -85 87 -298 -401 -331 -375 -78 -245 -28 23 245 -43 -5 308 -253 -92 133
2201 133 -104 202 -195 -66 -85 -223 190 397 7 -74 -120 -245 139 84 -202 362 233 169 146 106 191 -281 -186
2224 -186 -17 -24 335 132 179 20 83 -234 66 258 -270 46 -339 63 69 -109 103 95 126 71 -239 -33 -183
2247 -183 -343 -79 159 206 -112 175 -207 -162 -48 -310 -373 47 -21 -83 -143 123 42 52 105 3 21 -282 156
2270 156 279 -40 -156 -140 -66 38 -114 27 -63 40 -108 97 -9 -274 -134 125 -225 -131 -79 -41 75 -132
2292 -132 -13 -146 169 -116 50 -178 82 110 -168 152 86 39 -140 9 57 166 -12 72 25 -82 -37 -58 -52
2315 -52 -199 130 -75 -214 -29 264 54 -70 61 51 61 91 -285 596 381 -47 -31 -159 45 75 300 -15
2337 -15 95 236 -15 -135 -120 81 6 7 -178 -167 18 209 63 12 25 -298 -60 58 -49 0 50 94 -2 55
2361 55 74 -170 223 74 -312 108 9 -143 150 105 -248 -165 -23 -338 -84 -182 -161 305 -279 -237 46 38 139
2384 139 146 -204 -6 51 122 -185 -122 -145 83 -222 197 -124 -131 -119 -8 146 -63 -82 115 -97 -85 -51 -67 -34 -348
2409 -348 -339 -76 -137 -222 196 -278 -102 136 -81 80 206 52 260 -212 39 -69 -41 11 3 -166 175 -133 157
2432 157 -12 -5 -59 -177 247 175 -320 33 14 53 197 324 453 257 -152 -104 154 43 91 121 135 -115 60
2455 60 120 49 432 165 -405 -61 11 63 236 -126 83 21 -4 -105 -259 -56 -55 -151 -131 185 -3 -180 32 -156
2479 -156 35 -146 -181 226 -63 128 318 -230 -130 -67 41 73 112 -88 285 190 -107 26 182 -136 270 42
2501 42 -43 9 94 155 218 -62 -66 -36 130 52 -39 -109 -52 -322 -218 31 59 -192 49 -121 76 64 111 -66 -19 -67
2527 -67 -293 -41 61 17 115 217 -33 319 -345 -169 18 49 -132 278 28 6 -18 288 104 -206 122 112
2549 112 -77 26 84 -207 -45 13 -66 212 20 -8 352 -275 -241 -275 -66 -202 303 270 -67 -85 -94 -270 294
2572 294 31 158 295 -204 179 -26 34 -212 -232 -113 -213 -183 186 -43 -366 -40 115 23 -237 135 -19
2593 -19 159 -110 -287 461 56 -172 -239 -237 -72 127 49 -325 152 -62 13 289 51 -233 -146 21 73 10 -139
2616 -139 262 -70 -149 161 99 143 -228 -160 -57 171 109 -162 -133 140 145 333 -266 36 151 37 -295 204 281
2639 281 225 -126 58 -10 73 -296 13 115 -94 69 356 -135 -111 -196 -95 -213 194 -82 16 -16 388 394 -46
2662 -46 -47 -324 187 14 -113 -44 217 -26 -114 -239 112 -11 -270 195 12 -44 -147 -162 48 95 127 179 -26
2685 -26 246 217 -83 18 -206 124 -85 69 -45 -104 58 4 -141 22 58 11 111 240 -272 -94 -139 -262
2707 -262 255 153 -73 -4 63 57 -57 7 -28 192 -148 171 92 273 -280 107 -319 -184 218 115 174 -249 108
2730 108 51 213 -124 39 -58 105 -191 -306 -33 159 18 -141 163 407 -209 -200 122 -42 -11 62 -257 -252 43
2753 43 -232 -10 22 129 100 75 51 -10 -183 -144 -161 71 286 197 130 -34 295 217 144 -33 76 189 -88 52
2777 52 118 148 -136 -99 -58 -542 -153 139 12 280 30 227 62 -78 -5 -359 262 52 88 -89 -216 -112
2799 -112 66 345 -387 115 94 -317 83 -45 30 139 -38 -304 -77 6 -122 174 -226 -58 -97 -137 172 231
2821 231 179 -24 -148 -56 -185 -37 45 -67 -104 365 178 236 15 -238 -148 -60 316 105 20 -23 22 -67 240 -21
2845 -21 -272 -306 -36 -129 112 -127 34 177 6 140 224 -114 94 -146 -10 -157 75 181 23 64 -147 -127
2867 -127 -209 73 23 -4 -220 230 143 520 -86 137 49 -235 -191 -134 97 200 64 249 149 -120 -209 -133 -216
2890 -216 69 143 -1 202 96 251 20 82 76 147 -272 -69 -117 -148 409 29 -75 -109 495 47 -139 -190 -66
2913 -66 -263 -129 199 109 -41 -75 35 -45 -61 -262 -8 149 -32 -44 -53 -23 -109 -215 72 62 -32 16 -53 -20 -188
2938 -188 -36 -74 -103 -15 204 103 -30 60 95 45 -142 200 77 39 56 -302 -150 -74 175 84 -37 172 220 71
2962 71 -211 11 -226 -179 132 -34 22 82 -85 -120 115 11 379 52 -45 -224 -280 -329 -142 -90 74 103 -104
2985 -104 234 11 -272 137 42 -1 1 85 -153 -20 131 54 20 155 -121 113 -105 -231 -260 -27 -44 133 -94
3008 -94 44 166 62 105 88 -166 97 -89 104 89 51 -130 -169 -20 233 592 -244 -120 44 -78 129 -155
3030 -155 47 -53 187 236 -276 8 -136 -18 291 36 206 25 -215 -245 -159 118 299 -6 -178 -41 -61
3051 -61 -249 38 270 115 -79 -159 50 -217 -181 44 201 -32 38 80 97 132 208 130 142 203 -95 -467 53 -377
3075 -377 144 80 174 -158 -469 -39 -1 -2 163 178 -323 15 60 -329 -79 -242 94 50 -49 -288 253 200 -160
3098 -160 254 -200 46 91 50 -1 -265 -74 -124 -287 2 244 -32 -81 32 -167 177 -334 339 5 -10 -318
3120 -318 134 -30 -147 -11 20 -3 150 37 84 -54 14 189 44 10 110 141 66 144 119 -60 297 68 -248
3143 -248 -200 206 152 65 62 161 -247 281 85 -239 1 -250 -79 -136 171 173 151 -198 -145 104 134 -43 12 -327
3167 -327 -257 -27 -115 -102 -259 -112 151 -75 -217 -440 -99 -68 -327 -110 -15 201 150 236 179 62 -1 -31 -137
3190 -137 14 -170 -328 -391 38 14 -280 -149 -68 249 -221 -119 28 44 21 -34 -363 196 -185 94 -273 56
3212 56 57 -133 -77 8 -26 3 22 -102 -131 -74 -325 62 92 -58 -77 268 54 189 -97 126 -192 -35 24 -83
3236 -83 39 16 35 -74 92 -34 153 -138 97 101 -124 157 217 111 -209 -79 -275 0 219 -85 -9 115
3258 115 -154 -101 132 27 215 15 -152 10 -29 65 -296 47 -30 -140 50 196 -69 -97 142 163 -15 -174
3280 -174 -55 -173 257 133 -177 427 -47 -10 -195 -26 249 213 74 94 121 325 -151 -92 116 -320 -72 -47
3302 -47 -66 -167 241 -152 -23 -249 48 -254 334 -199 -21 -23 -68 321 73 194 -193 29 -280 -129 157 59
3324 59 17 -166 417 107 -429 -120 40 334 37 -52 184 -79 81 -54 -241 286 84 -256 -147 129 -3
3345 -3 -20 381 -90 -178 150 94 -289 -46 -59 9 102 -24 54 296 421 -85 -114 60 -352 -196 47 -184 -173 245
3369 245 -137 142 26 -184 -123 127 -284 -263 -94 -36 323 -41 163 72 66 112 121 116 -442 27 -245 -111 76 153
3393 153 140 -165 -190 31 -81 -97 -123 -83 43 -117 -230 -37 251 58 -58 216 -156 -121 75 64 125 189 66
3416 66 -117 45 32 45 -146 144 208 180 -13 -112 131 224 12 13 -1 22 355 203 -179 -276 228 263 -129 61
3440 61 -193 -177 48 -170 -304 97 -90 -9 223 92 205 210 -18 -168 -52 -243 -71 -24 234 -173 219 -189
3462 -189 -232 47 -276 59 72 175 185 -30 332 180 -8 140 2 64 -105 -129 -126 325 16 -130 -13 111
3484 111 -88 114 18 108 32 -127 57 -330 110 -204 262 23 -49 269 -95 277 -51 320 31 20 253 62
3506 62 218 37 44 45 162 -54 214 -96 213 -68 17 167 302 -41 325 56 256 -23 33 -126 56 203
3528 203 -10 25 146 -90 -103 -289 5 40 217 376 -175 16 -215 -28 -76 -326 -256 -174 313 449 145 -67
3550 -67 -166 120 141 9 -143 -108 -363 -58 20 84 50 124 224 -38 -67 9 177 -233 117 37 275 174 197 220
3574 220 94 -53 81 121 -252 14 256 -66 -52 -75 -19 213 5 -11 219 -68 -89 -228 -123 58 -145 -53
3596 -53 160 -32 6 -7 -58 -380 65 -102 -244 -132 -77 242 76 -119 -61 7 -241 31 243 -175 -199 112 -52
3619 -52 12 5 -180 -258 -102 -139 -138 134 56 398 -126 45 92 -59 233 -21 18 163 -65 23 -162 -254 57 10 -179
3644 -179 4 -157 -269 -148 10 22 262 79 -20 87 -178 -90 -82 -389 49 19 38 116 98 165 -51 110 -43
3667 -43 272 241 -174 -208 -179 28 -324 -210 54 -240 116 218 -17 -27 -111 29 104 87 146 263 46 68 -107
3690 -107 199 -202 82 -9 141 3 157 130 -228 -122 -62 -116 -45 -85 -21 -100 -206 169 -8 -157 -86 201 -258
3713 -258 169 137 -102 219 135 5 -36 -27 141 -3 -48 -100 -215 -199 -108 -122 246 65 195 -126 13 -85 -70 -55
3737 -55 178 -22 181 243 53 96 -151 -26 239 -71 64 32 -20 42 -106 161 67 249 -330 -177 62 112 -54
3760 -54 288 177 -375 5 170 -318 -194 224 253 -40 175 -57 -304 270 -55 -120 -31 35 -15 -202 4 39
3782 39 -284 12 89 -190 8 -150 114 123 -396 188 131 94 135 65 -3 1 -53 193 122 179 284 186 107 -153 -2
3807 -2 59 -226 -168 -23 -24 50 -47 -76 -10 64 -71 293 106 -141 -125 262 -229 35 -118 -90 35 169 -141 -155 135
3832 135 -236 102 163 186 -88 158 41 -81 217 203 -51 71 13 -158 172 196 166 -91 57 -321 162 -152
3854 -152 -273 247 -45 55 -282 60 379 -246 -102 110 -91 -138 -19 -7 -194 152 184 302 -190 92 -56
3875 -56 -235 -76 -151 -56 -168 -36 -353 -151 -47 -72 385 -163 136 168 56 -252 -551 -243 0 -108 -55 -64 -162
3898 -162 -44 71 140 -49 155 -106 -416 124 -36 -211 137 18 55 -203 260 317 289 39 186 48 150
3919 150 36 216 -50 -58 -152 -54 64 161 8 -170 -10 -211 124 -29 -374 128 192 -178 -324 297 -502 420
3941 420 -44 61 196 -133 -257 15 -65 -238 101 169 2 -53 207 -214 82 -150 -22 217 -3 -42 78
3962 78 0 62 -85 140 103 17 68 71 -99 324 -40 -170 -23 104 -102 -244 -102 57 10 -166 347 221 79
3985 79 -215 -60 343 176 37 316 -102 -138 201 509 65 206 24 -262 118 -154 77 -76 -6 -138 97
4006 97 67 -199 222 -235 46 17 -144 309 -186 -311 150 130 -93 248 57 -199 -64 -247 -120 172 -108
4027 -108 37 252 -111 473 92 24 40 -176 5 166 143 -34 10 -32 33 152 -127 -274 90 -136 -120 6
4049 6 -190 306 -55 181 -24 219 49 -12 59 -251 -164 -7 84 74 48 -14 -319 -79 -224 61 -237 -58 204
4072 204 193 -172 -178 -32 50 220 -130 32 -133 -36 112 -136 -300 -83 -130 44 -10 220 105 56 161 75 -81
4095 -81 180 158 29 5 2 -161 -124 -59 -310 -204 -431 -127 5 -198 233 -151 56 -12 13 24 -133 60 75 -72
4119 -72 125 -193 -143 -76 -200 -106 -119 -132 301 58 71 -174 -25 193 -36 -123 -41 -86 13 -65 73 -105 -55 235
4143 235 -16 -269 -110 184 -153 154 -132 -160 195 480 225 -208 6 -77 -76 126 32 -30 175 -352 279 -443
4165 -443 73 197 -124 59 -150 164 -123 158 -91 31 -20 -153 14 383 -202 -44 -284 176 -124 -214 -132
4186 -132 173 -335 -102 35 -125 131 58 241 -288 5 -37 -31 -6 50 2 -40 111 3 156 177 235 -16 307
4209 307 -19 190 -5 10 85 173 -49 -79 162 -172 254 -130 82 366 151 88 71 59 81 229 -141 -38 206
4232 206 38 -52 60 -91 -205 -8 64 -205 62 -202 -67 187 -87 174 288 21 -210 -16 -41 -144 322
4253 322 129 147 32 86 54 147 -154 -203 115 -27 340 -150 160 159 88 -126 58 -263 83 -302 -68 83 -32
4276 -32 -122 -1 150 177 45 -140 58 11 -26 89 82 45 -206 -151 -259 -38 74 -163 -171 -68 249 -212 -18 -346
4300 -346 172 147 28 37 134 15 79 9 -143 199 -187 -127 -159 -12 25 -21 207 -130 23 -213 544 -376 296
4323 296 -304 251 208 19 142 108 135 -134 134 226 -298 -72 37 97 -42 -298 121 -197 327 123 89 28
4345 28 108 291 -163 -23 -54 -60 -220 17 302 -103 -6 132 228 -133 -201 174 -166 -37 -155 20 81 -83 -212
4368 -212 -41 61 63 -102 81 257 71 177 -159 136 -167 398 -172 95 -161 -284 -245 -143 21 -69 -179
4389 -179 105 67 -62 334 -118 119 -162 19 148 -142 -42 -59 0 34 -56 -29 -21 -25 -123 27 -455 -47 4 -213
4413 -213 77 11 36 -281 97 73 102 -62 -99 124 -3 -81 -274 174 56 202 -197 136 327 38 -84 -126
4435 -126 196 159 -155 80 -154 191 -173 -91 -151 -57 -11 -174 88 33 -39 151 -183 -164 -88 -174 403 -209 -15
4458 -15 -77 26 -220 -194 37 54 91 -95 181 57 96 -146 131 -72 -102 84 197 -202 57 241 -122 100
4480 100 88 116 -151 -291 206 10 -86 122 -131 33 120 45 -179 34 -75 -105 79 -46 40 -402 309 -273
4502 -273 -84 -175 -143 62 45 38 249 -303 -4 24 93 10 -242 151 292 -262 -112 -110 -56 120 -53 12 -274 79
4526 79 31 -94 -99 -229 -56 255 -100 199 -206 106 -286 22 24 -236 -255 143 -48 -168 77 -206 -136 -232 -49
4549 -49 -161 -70 -209 -179 -90 209 -248 -229 161 19 -40 159 81 8 -79 250 -55 -134 148 -13 123 -259 -372
4572 -372 -320 65 -195 -245 -198 334 -117 116 -172 -119 -59 253 -35 325 66 59 49 68 55 -321 -105 -97 64 -189
4596 -189 557 -57 201 160 -322 227 -112 -414 -141 146 -59 278 427 0 244 105 -36 -121 71 -153 40
4617 40 115 320 174 -247 102 -122 127 -123 -109 -105 216 -52 84 -78 37 -107 -34 91 157 356 156 -194
4639 -194 283 -182 42 -174 -321 -132 38 151 -153 142 -98 42 -69 218 -9 -50 -215 41 -33 14 83
4660 83 -48 352 -334 -66 254 30 -116 -310 -44 199 153 74 131 -164 49 139 -77 -47 -104 -6 323 59 497
4683 497 251 -23 -85 -76 -128 -146 72 -35 305 -187 54 281 -81 -211 -68 -75 70 298 -24 159 119 -237 313
4706 313 -103 -18 108 -12 -224 12 -45 226 -57 -291 -85 51 -293 -193 -113 364 -72 -297 149 -106 10
4727 10 -194 -56 -154 62 -1 -114 -228 -39 -283 135 165 -114 -72 333 -282 -66 -29 -90 126 -132 -195 153 264
4750 264 135 162 -243 -13 103 -226 106 -4 199 5 46 -275 108 60 149 -328 64 112 288 387 71 -233
4772 -233 -49 -153 -238 -234 -77 52 -15 26 -6 122 129 -26 251 101 -106 13 121 -208 -379 -120 31 -24 220
4795 220 -160 -60 83 -314 78 -49 196 -56 -136 28 -221 -275 -246 -23 25 287 105 30 -334 -266 171 -125
4817 -125 -64 -179 7 97 -131 -166 166 220 -44 28 -54 293 387 -283 -303 -121 11 40 152 301 -185 -175 -227 110
4841 110 -112 -128 23 -44 -176 160 418 376 1 225 -260 95 -184 219 111 54 -17 73 -90 246 -41 124
4863 124 96 -313 73 -111 -73 149 -162 -70 99 64 276 -306 -168 51 -101 -131 -319 176 -143 -32 250 -116
4885 -116 -21 -36 -62 -150 120 7 -41 -326 121 4 194 17 94 -202 -315 311 140 -124 149 84 -2 -142 -342
4908 -342 79 -411 3 -120 226 54 -49 -81 197 -193 68 140 -229 2 -54 82 29 -54 -86 93 -104 -305
4930 -305 -113 194 -253 -7 99 99 114 -196 141 66 47 -77 95 -49 88 270 -174 24 212 253 119 137
4952 137 -174 106 139 20 43 180 -156 -87 -147 180 -54 285 69 305 10 38 228 -59 85 -509 117 -100
4974 -100 264 44 -110 67 88 139 -99 415 -12 -123 -29 78 -75 133 48 125 -172 288 177 124 15 -175
4996 -175 31 213 -80 -80 28 -367 171 -16 165 326 22 -152 -131 196 -168 30 61 28 -8 -226 -45 -226
5018 -226 102 -10 10 -108 -111 159 -52 -131 221 49 -279 -143 17 364 -87 105 -214 -70 51 15 -143 154
5040 154 -210 -41 -95 204 -41 211 -302 -38 137 -2 -106 -21 108 -119 124 -286 72 -41 6 217 107
5061 107 40 135 341 -155 74 -276 -283 -4 -50 300 11 109 -145 -35 -5 -140 90 -97 385 88 36 165 147
5084 147 -22 -52 259 -69 256 136 192 191 197 100 -57 -204 -11 -182 -218 -123 -98 213 358 -45 -108 11 -19 56
5108 56 -14 134 19 7 200 -198 -100 17 -140 -126 110 48 53 245 -27 -66 276 24 41 -336 -55 149 154 204
5132 204 -218 -56 116 246 -28 378 223 61 101 -197 286 -76 295 27 120 41 167 69 167 222 107 -4
5154 -4 -34 -55 78 39 121 303 59 152 -8 -7 188 48 212 120 -173 -7 150 -394 -74 121 -155 -153 105 -8
5178 -8 147 -188 155 185 -294 -18 -23 67 -50 -183 202 -179 -86 -96 -340 110 -71 -388 35 73 -196 -107 -47 107
5202 107 18 -73 53 228 129 176 -178 -52 124 65 -65 280 5 18 120 142 -434 -198 -216 -37 115 269 111
5225 111 120 80 -236 -339 113 50 256 -155 -6 259 -244 -55 126 -220 179 -80 -321 110 207 57 292 -74
5247 -74 55 56 39 121 387 73 115 -140 178 -256 -30 201 -98 256 -204 42 53 -307 -191 140 19 170
5269 170 -182 84 70 121 -17 -137 -68 -117 237 5 -13 147 43 71 -68 -198 -173 195 -146 -11 58 -183 -149
5292 -149 132 -21 -270 360 101 146 -236 -18 -85 108 -125 -188 87 142 -159 -315 -105 181 -104 199 -57
5313 -57 249 7 -63 76 -2 327 227 231 58 57 -39 -131 58 139 219 -36 -393 41 180 200 -297 -31 -343 -362
5337 -362 -232 67 -146 -12 -169 -111 -81 -31 -5 -26 180 173 32 93 -23 -21 -154 -210 110 -125 210 134 5 -146
5361 -146 48 -159 -15 -461 -219 -115 8 145 200 -2 -192 -16 7 -118 4 -136 -248 1 166 -30 207
5382 207 -235 94 110 -205 416 103 -144 -80 -169 -62 117 -293 -34 -39 28 224 211 -330 249 283 -121 36 18
5405 18 -492 -97 -79 52 39 55 -204 -274 399 199 119 261 -7 -161 -44 82 -205 -196 -1 74 -128 19 -278
5428 -278 -111 -225 100 196 29 122 -201 159 12 162 -35 169 -66 96 -89 160 65 111 194 34 -212 -84
5450 -84 27 163 241 181 268 -188 -240 165 6 -54 206 -38 -104 201 -229 -235 171 201 -9 114 -30 -201 77
5473 77 41 -297 85 100 -43 16 -164 -176 16 117 69 -1 141 -320 -117 -374 114 -55 111 181 -127 6 -19
5496 -19 -33 81 274 -31 -96 -6 10 -74 84 -273 110 -210 104 47 403 -244 -128 -273 87 -81 -152 -74 -278
5519 -278 112 262 -81 13 132 -109 178 154 271 316 46 -177 162 -281 149 13 -132 225 95 30 176
5540 176 202 -138 -238 -92 -101 134 -36 50 -64 -185 48 -182 239 -38 -107 27 55 -325 144 40 -103 -123
5562 -123 -109 -105 73 -12 -116 -180 -193 -98 -300 241 -66 34 109 20 -367 -303 84 207 -303 -274 207 97 28 182
5586 182 108 120 -167 -82 131 -48 -419 105 186 11 127 -199 28 -72 -252 291 -199 -177 1 167 -183 -336
5608 -336 -75 -121 -66 105 296 -18 191 289 6 95 352 -101 -26 -217 -49 -53 62 -153 -188 94 379 75 312
5631 312 280 -88 -2 -119 219 -147 -197 17 -56 -119 48 -267 74 256 -95 -22 -167 37 -300 -6 38 -161
5653 -161 -237 -100 42 -56 48 -41 321 187 -118 -250 100 -133 -63 79 -288 12 53 8 -142 -242 -22 -54
5675 -54 -3 118 361 -40 -230 -3 40 194 12 155 -72 95 -78 62 -118 -14 -36 -44 -192 -197 -112 120 69
5698 69 134 -243 268 51 -93 254 14 159 -118 255 -273 2 -113 89 44 -73 -179 -279 -157 58 301
5719 301 -117 -138 201 146 44 -14 29 218 87 -86 -60 66 -72 -68 -40 218 -302 217 121 77 318 124 -296
5742 -296 -155 20 111 303 -185 -60 -61 11 -115 -13 -31 -329 1 -105 -38 -98 -14 -1 -72 -1 -11 64 -164 104
5766 104 -69 82 -48 -81 24 -58 118 -186 -195 107 167 80 -167 -145 142 -168 -73 -215 -130 149 138 136 -326 302
5790 302 -97 -113 170 294 187 -92 32 -182 -69 -249 85 216 124 58 -198 -117 24 55 -209 -76 -46 -124
5812 -124 -84 -296 233 -9 -223 155 -222 -94 -96 56 98 59 -190 118 -392 -218 -397 244 185 320 -80 94
5834 94 -83 -30 123 -217 -278 76 82 -204 240 -110 155 -78 73 281 270 -264 13 -22 68 -61 52 -77 92
5857 92 -99 263 108 57 108 100 151 156 -203 -195 66 89 244 118 -7 -402 180 -46 186 -118 199 -65 -178 43
5881 43 69 -248 77 -10 -82 49 238 -45 -158 -83 -37 65 252 208 73 -52 65 -192 463 -129 -8 336
5903 336 182 50 68 161 -105 -181 -35 78 -13 -35 -144 238 -121 -21 492 -127 -180 -127 129 369 -32 110
5925 110 47 -94 -79 -8 -131 -119 -30 -71 40 119 -130 -331 85 28 157 32 -158 157 -237 -138 53 -41 119
5948 119 -43 -174 -270 -261 161 102 -195 132 -201 -228 -78 270 30 -141 95 187 -143 0 -215 72 -93 130
5970 130 -105 174 67 -51 -1 -22 -168 33 80 -62 -234 -120 439 -242 -314 71 260 112 38 -12 -95 84
5992 84 40 -178 113 70 25 84 177 119 5 24 29 -33 50 -10 -184 -73 112 60 -210 69 23 174 -15 -301 -385
6017 -385 -235 101 -193 2 55 -103 50 518 -86 492 -14 0 -104 89 323 210 146 -17 -285 329 -52
6038 -52 -49 -53 -89 91 -133 -85 27 197 -115 -125 -184 -17 -6 -182 37 -112 -84 277 75 -97 226 -132 -89 79
6062 79 -147 -32 7 -226 76 63 -23 -254 162 -190 64 -5 -66 -105 263 -23 -149 -32 128 -116 251 -170
6084 -170 70 -63 -15 92 58 39 -164 387 172 -8 324 -234 -102 -84 -124 -33 26 -30 -18 -235 -272 -36 -68 -306
6108 -306 205 -6 -38 -44 193 -5 -105 109 72 6 162 -295 -344 92 -142 -75 348 292 48 -66 -184 142 -71
6131 -71 -140 91 15 -25 23 -204 -135 -119 -123 -54 59 125 -86 -286 168 166 12 76 48 137 -115 -81 -38 -223 -44 248
6157 248 -67 -336 216 -448 -161 64 260 68 57 25 11 -242 223 181 -12 -11 -46 82 -75 -113 148 502 -439
6180 -439 -50 36 171 226 -153 -199 -274 67 139 -291 76 -21 -123 -17 -264 77 -34 -37 221 -84 -35 -58 25 105
6204 105 -205 -207 -64 138 -225 -175 -27 -128 -70 288 225 170 2 105 -153 39 294 -62 102 165 195 -77 -169
6227 -169 -213 -106 54 -109 13 397 -190 49 -111 24 151 -5 -97 -133 288 57 -92 -25 -324 220 84
6248 84 -208 200 -57 150 -281 143 476 -417 -96 -18 177 -70 -145 50 4 71 108 237 -89 -25 91 129 -253
6271 -253 95 262 -69 -212 -21 107 -78 153 -1 -146 154 102 455 -3 -49 196 87 176 -73 -25 26 -396
6293 -396 -11 -169 -263 57 -93 24 -11 52 -66 -36 228 -264 121 23 31 -280 162 106 -214 -136 135 300 -73
6316 -73 -272 -52 -178 51 47 99 73 -133 -74 -54 189 118 283 67 -35 -152 476 115 397 -50 -165 -33 -18
6339 -18 35 190 40 175 30 -174 174 164 -22 39 -143 -3 -7 315 41 -181 -182 286 73 -60 -295 -104 223
6362 223 -118 24 69 149 40 -365 158 -401 -83 -36 -129 -22 -76 -304 4 182 -63 -168 -3 211 134 -109
6384 -109 96 100 -56 74 27 -73 -221 -302 -34 58 27 -158 -12 -102 95 -22 -88 -38 -2 -90 53 56 -24 59 -23
6409 -23 -10 0 -3 171 141 156 58 -61 -94 -48 -98 299 -393 -14 47 -28 14 -79 322 145 55 148 -202 59 -134 -98
6435 -98 212 -226 528 -163 91 33 -195 32 -150 59 457 239 -171 236 116 -84 121 145 -173 -60 -61 65
6457 65 113 118 -203 -190 68 -166 102 -97 70 -188 -42 -53 -154 85 -263 -46 74 82 -283 41 33 223 230 64
6481 64 58 33 -123 -248 -11 80 -260 142 36 -2 5 45 81 186 76 -315 33 110 -262 218 -116 74 118 -310
6505 -310 -3 -355 -135 -139 201 -79 -156 -24 50 -280 -28 71 -121 -181 -31 136 137 173 76 116 516 -1 4 -152
6529 -152 158 27 -207 -6 -233 -34 179 34 192 -178 248 204 -74 -37 -37 166 64 318 11 108 -8 229
6551 229 -255 -50 -92 141 174 -55 -187 165 188 132 -47 123 93 162 88 7 220 -152 253 -26 -55 -90 -70 13
6575 13 70 -165 20 -292 -135 49 -278 -158 35 -205 -286 221 -209 -271 -141 19 215 -155 -199 -118 -11 47
6597 47 -81 181 270 -4 179 -253 -356 154 66 307 -11 -24 -169 104 -71 -46 9 136 -469 -272 -73 -241
6619 -241 78 -132 182 18 2 -23 4 -78 -124 155 -248 -199 360 12 -84 -240 7 194 14 138 135 -7 -383
6642 -383 28 173 -10 165 -207 48 -227 67 -312 -219 21 67 -33 55 -146 -66 -106 150 149 -4 -267 -19
6664 -19 51 -43 -179 -187 252 -39 115 6 88 107 -205 -151 -33 319 148 32 -4 -100 -99 -96 -31 -387 243 -100 70
6689 70 100 -34 562 -55 -300 243 -21 -201 85 127 22 -44 -68 359 121 -59 178 78 210 61 -38 -94
6711 -94 29 110 -83 -90 42 -12 136 -90 -70 192 85 -18 228 27 16 -333 -12 -160 241 161 35 57 -30
6734 -30 233 11 100 -202 -4 -151 -95 -112 -106 98 -49 280 -96 221 -86 48 -237 -87 -104 -41 -3 85 -234
6757 -234 304 11 -136 -162 -51 -110 239 -83 -43 -133 296 63 50 83 -148 21 -363 -18 26 465 161 -71
6779 -71 55 -177 -74 -562 178 172 25 -57 -88 168 -90 113 252 245 25 108 38 -209 16 -149 -234 -41 127
6802 127 -147 -109 -27 -50 233 -90 -8 87 -64 36 387 -157 52 -26 -246 -134 85 -387 -377 -55 -103 -164 177
6825 177 483 29 -196 -311 -15 67 -216 -48 -52 -132 101 83 -161 277 -185 1 -97 -227 -333 -307 -152 129
6847 129 -213 35 69 42 97 -55 90 -42 13 -85 189 -15 185 -17 23 134 206 255 191 168 -98 -27 17 -48
6871 -48 271 -186 308 339 -98 -23 83 479 53 -35 -167 192 85 116 -122 -143 -27 88 448 -185 -75 376
6893 376 -148 -4 207 108 -98 115 84 -310 -53 134 7 35 25 17 -123 28 -163 122 92 -280 287 -197
6915 -197 -112 -259 -10 75 -165 261 -170 95 -69 -212 21 -325 86 -151 51 -60 230 -144 -98 -10 254
6936 254 130 -165 355 -221 303 290 171 134 7 -112 -89 -142 208 -302 -23 -222 140 -176 -171 147 -76 318
6958 318 248 331 78 58 140 -66 -169 16 172 140 -145 137 94 198 -118 -46 93 172 109 177 11 210 6
6981 6 24 -211 -250 -197 -92 86 369 132 -166 -519 -276 -30 -30 -69 216 167 433 -114 132 5 -352 -122 -151
7004 -151 -25 38 -376 189 50 106 81 -17 148 -337 138 -43 -116 -360 -140 255 -127 78 -198 -134 15 -114
7026 -114 122 223 -128 207 100 35 -134 -332 50 160 -44 -78 -185 -51 45 -156 -136 -110 -201 -378 81 235
7048 235 -33 471 170 12 245 83 222 -90 -125 -99 -15 95 185 28 -333 -232 -12 -296 175 48 -120
7069 -120 28 -94 -6 33 -291 24 247 -11 132 283 -27 -304 -50 97 -9 22 173 -225 136 -1 -26
7090 -26 57 7 -267 120 182 196 95 -361 194 311 134 -323 12 -64 -119 -27 177 171 262 139 38 65 -152 222
7114 222 126 42 83 -171 444 -70 -11 170 -168 -460 -209 -253 -145 -100 -112 57 46 398 -39 -169 308 312 -11
7137 -11 10 -169 -85 -154 218 -214 -202 -288 27 159 115 150 12 65 87 4 -163 35 326 -4 41 -48 -57 -104 43
7162 43 240 237 -4 -73 -293 142 -39 80 76 -118 301 76 45 311 -255 -60 170 74 93 -216 106 -264 -316
7185 -316 223 61 -187 -218 -303 -243 185 146 29 220 134 251 184 -57 232 -115 -299 -112 163 -111 33 56
7207 56 -38 -21 20 20 -127 -57 -83 497 445 -173 -14 39 42 -150 -68 338 11 -107 118 -270 -129 143 -158 4
7231 4 -225 2 -8 -98 97 -104 103 -65 226 197 194 128 -115 89 248 -136 -105 -56 -63 307 73 210 69 -72
7255 -72 -45 276 320 34 243 74 -47 -273 85 -193 251 -112 -53 280 273 -47 -94 135 -66 -119 -220 168 138
7278 138 -119 -77 -70 421 106 -67 -108 44 258 -232 -110 39 -12 -223 -192 -133 -119 -17 263 142 -219 -25 -230
7301 -230 -203 139 273 216 229 -230 -4 41 317 175 -104 -64 -72 202 236 65 -151 150 -87 159 175 199 -222
7324 -222 -101 112 -200 110 11 37 48 100 9 -123 185 159 137 -2 -23 -251 -143 -354 312 21 5 -202 -179
7347 -179 54 -192 -67 31 53 169 13 -310 218 -142 46 -127 -346 -97 349 126 -273 -73 -93 -359 27
7368 27 -13 102 439 252 -238 52 168 34 -104 -77 62 -305 169 36 -66 -155 -89 378 191 160 289 -215
7390 -215 -99 -226 -57 -45 306 -49 -68 90 57 -51 -129 -49 -178 54 -227 8 104 -50 -36 130 -112 3
7412 3 -225 81 306 178 113 43 133 -3 160 100 26 6 105 -181 201 89 143 -54 216 87 -174 -55 -116 53
7436 53 -35 -205 88 -31 -194 -36 -95 46 6 -54 -64 -104 35 -330 -276 -174 100 -118 147 129 -136 -39 -33 -59
7460 -59 261 -46 67 -200 97 158 -49 -70 298 260 205 32 -226 -3 152 136 33 286 -100 -6 -167 -81 13
7483 13 -91 103 221 276 193 -356 109 172 -307 21 -224 261 -115 -255 268 -49 -136 -53 152 -72 -50 -54 272
7506 272 53 -17 228 278 -40 -12 265 27 306 -130 -110 -69 31 -92 -113 -4 155 -31 -198 -165 228 -302
7528 -302 -72 -96 58 -263 418 -267 -177 163 45 -372 47 -261 -29 -71 133 163 49 -34 134 293 -140 115
7550 115 99 292 278 -57 -163 90 15 75 -173 68 40 157 -27 -160 273 93 241 41 226 -285 262 73
7572 73 -233 71 229 138 13 -13 154 -144 -134 -57 -226 38 62 61 -246 -194 49 -143 93 141 -57 127 -102
7595 -102 132 -35 14 89 -27 148 204 -207 -221 19 248 101 -96 -167 123 12 -138 -419 61 43 -9 72 218
7618 218 -218 -266 117 -161 -162 140 -242 -114 -65 -177 316 113 65 -220 -333 -218 283 134 82 -142 88 168
7640 168 -171 -62 -323 139 -54 27 14 -42 61 -47 184 -96 527 15 84 36 -132 -10 -268 -20 -275 263
7662 263 66 -57 -197 -109 -145 103 166 166 -174 34 71 -155 55 -66 152 -201 -225 139 75 -114 148 80 -6
7685 -6 -35 36 80 37 15 -194 156 148 -523 -235 -247 -62 182 -29 72 136 -42 -386 -85 -174 -99 77 32 148 -2
7710 -2 62 2 -10 -146 -82 -273 -38 -91 215 139 258 78 -185 -87 -212 -286 241 89 138 -238 -42 98 -62 101
7734 101 334 -109 -135 -48 -66 -223 -41 60 -28 25 42 119 67 -60 -98 61 182 190 -48 113 -43 -25 110 102 46
7759 46 -132 293 -29 -289 336 -300 207 252 165 109 22 201 -39 300 -106 -360 130 -680 55 -77 318 -159
7781 -159 -27 -378 -442 -528 -44 124 -65 -41 -221 114 181 114 -142 214 16 136 -293 152 116 25 117 -199 222
7804 222 203 153 -20 35 91 -52 106 278 84 -133 -144 97 153 104 230 -53 142 -89 -150 313 144 311 155
7827 155 170 67 -1 32 -45 -57 -83 -302 -145 -26 -293 37 264 -119 92 35 -70 -154 119 -260 203 -32 -241
7850 -241 -107 -135 87 132 -152 104 -13 228 -31 -115 -275 -61 273 -82 56 -133 -9 92 -137 199 -149
7871 -149 4 -215 -30 44 -176 -29 101 175 200 -85 181 344 -121 -103 234 53 77 -299 -143 163 71 -132
7893 -132 -141 210 248 181 51 -259 -192 132 211 198 -303 166 -13 138 -264 40 -245 243 13 -128 113 117 108 -111
7917 -111 142 -79 -257 -267 119 244 15 -30 -476 -351 -39 -85 275 -136 172 115 -120 -132 -56 -73 46 111 10
7940 10 -31 -31 35 -120 81 39 139 47 -192 110 -97 -272 -145 -20 388 -116 -150 -379 -232 127 -2 -8 -131
7963 -131 -409 147 24 -1 264 -86 70 16 118 102 -74 -152 -26 -54 153 105 -219 148 -37 158 -38 -214
7985 -214 -135 -71 88 119 -47 69 -244 21 78 85 195 -124 291 515 -16 -167 112 301 -180 -60 -5 -17 -110
8008 -110 -102 -2 -26 158 -258 19 -211 21 20 16 -233 156 12 408 145 -37 -75 -136 121 85 244 -22 -1 96
8032 96 257 78 142 89 -107 66 -98 -313 134 332 -395 -147 -95 -93 110 -170 4 -254 -91 -170 -28 -39 -105
8055 -105 -189 -295 136 38 -285 -276 172 293 -19 126 259 118 -385 -51 0 145 142 -96 -69 -246 -48 277 -155
8078 -155 -255 389 45 6 -123 -66 -181 -100 162 -41 318 67 -11 -110 -34 -12 -85 221 4 318 17 146 -138
8101 -138 -72 -391 95 121 -20 -5 96 -69 -104 510 52 -149 52 -102 25 188 255 66 -127 22 -211 91
8123 91 -342 86 179 137 -110 -94 129 -369 254 457 -71 -4 23 -238 -34 78 306 -9 -151 -144 242 -291 -92
8146 -92 -209 -206 -54 106 78 142 69 -26 223 -238 94 286 -72 92 150 321 47 -29 58 -69 103 -59 -216
8169 -216 80 287 15 -58 -238 -28 48 281 -24 -342 -123 9 -218 -306 21 51 84 -162 44 214 -171 -75
8191g5
##END NTUPLES=NMR FID
##END=
