##TITLE=1H_DE-77_ORG_dAW
 aceton-d5
 8 sc, 
 26.11.2024
##JCAMPDX= 6.0         $$ Bruker NMR JCAMP-DX V2.0
##DATA TYPE= NMR FID
##DATA CLASS= NTUPLES
##ORIGIN= UXNMR, Bruker Analytische Messtechnik GmbH
##OWNER= root
$$ XWIN-NMR		Version 3.5
$$ Tue Nov 26 15:30:04 2024 Russian Standard Time (UT+4h)  she@DPX200
##.OBSERVE FREQUENCY= 200.1315
##.OBSERVE NUCLEUS= ^1H
##.DELAY= (6, 6)
##.ACQUISITION MODE= SIMULTANEOUS
##.ACQUISITION SCHEME= undefined
##.AVERAGES= 8
##.DIGITISER RES= 18
##SPECTROMETER/DATA SYSTEM= spect
##.PULSE SEQUENCE= zg30
##.SOLVENT NAME= Acetone
##.SHIFT REFERENCE= (INTERNAL, Acetone, 0, 15.7039)
##AUDIT TRAIL= $$ (NUMBER, WHEN, WHO, WHERE, WHAT)
$$ ##TITLE= Audit trail, XWIN-NMR		Version 3.5
$$ ##JCAMPDX= 5.01
$$ ##ORIGIN= Bruker BioSpin GmbH
$$ ##OWNER= she
$$ F:/spectra/data/she/nmr/H-F/1/audita.txt
$$ ##AUDIT TRAIL=  $$ (NUMBER, WHEN, WHO, WHERE, WHAT)
(   1,<2024-11-26 15:28:44.67 +0400>,<she>,<DPX200>,
      <created by zg, POWCHK disabled, PULCHK disabled
       configuration hash MD5:
       00 E9 B6 7A A2 85 ED C7 34 08 36 98 17 FE 4E 26
       data hash MD5: 16K
       75 34 15 C9 51 E1 49 A9 0C DD 8D 35 88 41 F5 FA>)
$$ ##END=
$$ 
$$ hash MD5
$$ 0A BF 71 A2 09 8C 4D 65 A0 2C F9 80 BE 96 F4 A6
##$RELAX= 
##$RELAX= 
##$RELAX= 
##$RELAX= 
##$RELAX= 
##$RELAX= 
$$ Bruker specific parameters
$$ --------------------------
##$DU= <F:/spectra>
##$EXPNO= 1
##$NAME= <H-F>
##$PROCNO= 1
##$TYPE= <nmr>
##$USER= <she>
##$AMP= (0..31)
100 100 100 100 100 100 100 100 100 100 100 100 100 100 100 100 100 100 
100 100 100 100 100 100 100 100 100 100 100 100 100 100 
##$AQSEQ= 0
##$AQ_mod= 1
##$AUNM= <au_zg>
##$AUTOPOS= <>
##$BF1= 200.13
##$BF2= 200.13
##$BF3= 200.13
##$BF4= 200.13
##$BF5= 200.13
##$BF6= 200.13
##$BF7= 200.13
##$BF8= 200.13
##$BYTORDA= 1
##$CFDGTYP= 0
##$CFRGTYP= 5
##$CHEMSTR= <none>
##$CNST= (0..31)
1 1 145 1 1 1 1 1 1 1 1 1 1 1 1 1 1 1 1 1 1 1 1 1 1 1 1 1 1 1 1 1 
##$CPDPRG= <>
##$CPDPRG1= <>
##$CPDPRG2= <>
##$CPDPRG3= <>
##$CPDPRG4= <mlev>
##$CPDPRG5= <mlev>
##$CPDPRG6= <mlev>
##$CPDPRG7= <mlev>
##$CPDPRG8= <mlev>
##$CPDPRGB= <>
##$CPDPRGT= <>
##$D= (0..31)
0 1.2 0 0 0 0 0 0 0 0.06 0 0.03 0 0 0 0 0.0002 0 0 0 0 0 0 0 0 0 0 0 0 
0 0 0 
##$DATE= 1732620524
##$DBL= (0..7)
120 120 120 120 120 120 120 120 
##$DBP= (0..7)
150 150 150 150 150 150 150 150 
##$DBP07= 0
##$DBPNAM0= <>
##$DBPNAM1= <>
##$DBPNAM2= <>
##$DBPNAM3= <>
##$DBPNAM4= <>
##$DBPNAM5= <>
##$DBPNAM6= <>
##$DBPNAM7= <>
##$DBPOAL= (0..7)
0.5 0.5 0.5 0.5 0.5 0.5 0.5 0.5 
##$DBPOFFS= (0..7)
0 0 0 0 0 0 0 0 
##$DE= 6
##$DECBNUC= <off>
##$DECIM= 24
##$DECNUC= <off>
##$DECSTAT= 4
##$DIGMOD= 1
##$DIGTYP= 9
##$DL= (0..7)
0 120 120 120 120 120 120 120 
##$DP= (0..7)
150 150 150 150 150 150 150 150 
##$DP07= 0
##$DPNAME0= <>
##$DPNAME1= <>
##$DPNAME2= <>
##$DPNAME3= <>
##$DPNAME4= <>
##$DPNAME5= <>
##$DPNAME6= <>
##$DPNAME7= <>
##$DPOAL= (0..7)
0.5 0.5 0.5 0.5 0.5 0.5 0.5 0.5 
##$DPOFFS= (0..7)
0 0 0 0 0 0 0 0 
##$DQDMODE= 0
##$DR= 18
##$DS= 0
$$ [...]
##$SUBNAM2= <"">
##$SUBNAM3= <"">
##$SUBNAM4= <"">
##$SUBNAM5= <"">
##$SUBNAM6= <"">
##$SUBNAM7= <"">
##$SUBNAM8= <"">
##$SUBNAM9= <"">
##$SW= 24.0689530833862
##$SWIBOX= (0..15)
0 0 2 0 0 0 0 0 0 0 0 0 0 0 0 0 
##$SW_h= 4816.95568400771
##$TD= 16384
##$TD0= 1
##$TE= 0
##$TE2= 300
##$TE3= 300
##$TEG= 300
##$TL= (0..7)
0 120 120 120 120 120 120 120 
##$TP= (0..7)
150 150 150 150 150 150 150 150 
##$TP07= 0
##$TPNAME0= <>
##$TPNAME1= <>
##$TPNAME2= <>
##$TPNAME3= <>
##$TPNAME4= <>
##$TPNAME5= <>
##$TPNAME6= <>
##$TPNAME7= <>
##$TPOAL= (0..7)
0.5 0.5 0.5 0.5 0.5 0.5 0.5 0.5 
##$TPOFFS= (0..7)
0 0 0 0 0 0 0 0 
##$TUNHIN= 0
##$TUNHOUT= 0
##$TUNXOUT= 0
##$USERA1= <user>
##$USERA2= <user>
##$USERA3= <user>
##$USERA4= <user>
##$USERA5= <user>
##$V9= 5
##$VALIST= <valist>
##$VCLIST= <CCCCCCCCCCCCCCC>
##$VD= 0
##$VDLIST= <DDDDDDDDDDDDDDD>
##$VPLIST= <PPPPPPPPPPPPPPP>
##$VTLIST= <TTTTTTTTTTTTTTT>
##$WBST= 1024
##$WBSW= 4
##$XGAIN= (0..3)
0 0 0 0 
##$XL= 0
##$YL= 0
##$YMAX_a= 191841
##$YMIN_a= -125034
##$ZGOPTNS= <>
##$ZL1= 120
##$ZL2= 120
##$ZL3= 120
##$ZL4= 120
##$ABSF1= 10
##$ABSF2= 0
##$ABSG= 5
##$ABSL= 3
##$ALPHA= 0
##$AQORDER= 0
##$ASSFAC= 0
##$ASSFACI= 0
##$ASSFACX= 0
##$ASSWID= 0
##$AUNMP= <proc_1d>
##$AZFE= 0.1
##$AZFW= 0.1
##$BCFW= 1
##$BC_mod= 2
##$BYTORDP= 1
##$COROFFS= 0
##$CY= 11.3945322036743
##$DATMOD= 1
##$DC= 2
##$DFILT= <>
##$DTYPP= 0
##$F1P= 15.6554695791079
##$F2P= 12.8336369535428
##$FCOR= 0.5
##$FTSIZE= 0
##$FT_mod= 4
##$GAMMA= 1
##$GB= 0.15
##$INTBC= 1
##$INTSCL= 1
##$ISEN= 128
##$LB= 0.24
##$LEV0= 0
##$LPBIN= 0
##$MAXI= 10000
##$MC2= 0
##$MEAN= 0
##$ME_mod= 0
##$MI= 1.114404
##$NCOEF= 0
##$NC_proc= 0
##$NLEV= 6
##$NOISF1= 3.799351
##$NOISF2= 2.8
##$NSP= 1
##$NTH_PI= 0
##$NZP= 0
##$OFFSET= 15.70392
##$PC= 1
##$PHC0= -26751.07
##$PHC1= 72.38745
##$PH_mod= 1
##$PKNL= yes
##$PPARMOD= 0
##$PSCAL= 0
##$PSIGN= 0
##$REVERSE= no
##$SF= 200.130013532006
##$SI= 16384
##$SIGF1= 3
##$SIGF2= 2
##$SINO= 400
##$SIOLD= 16384
##$SREGLST= <1H.CDCl3>
##$SSB= 0
##$STSI= 0
##$STSR= 0
##$SW_p= 3612.71676300578
##$SYMM= 0
##$S_DEV= 0
##$TDeff= 0
##$TDoff= 0
##$TI= <>
##$TILT= no
##$TM1= 0
##$TM2= 0
##$TOPLEV= 0
##$USERP1= <user>
##$USERP2= <user>
##$USERP3= <user>
##$USERP4= <user>
##$USERP5= <user>
##$WDW= 1
##$XDIM= 8192
##$YMAX_p= 0
##$YMIN_p= 0
$$ End of Bruker specific parameters
$$ ---------------------------------
##NTUPLES= NMR FID
##VAR_NAME=  TIME,          FID/REAL,        FID/IMAG
##SYMBOL=    X,             R,               I
##VAR_TYPE=  INDEPENDENT,   DEPENDENT,       DEPENDENT
##VAR_FORM=  AFFN,          ASDF,            ASDF
##VAR_DIM=   8192,          8192,            8192
##UNITS=     SECONDS,       ARBITRARY UNITS, ARBITRARY UNITS
##FACTOR=    0.0002076,     1,               1
##FIRST=     0,             0,               0
##LAST=      1.7004516,     0,               0
##MIN=       0,             -125034,         0
##MAX=       1.7004516,     191841,          0
$$ Real data points
##PAGE= N=1
##DATA TABLE= (X++(R..R)), XYDATA
0 0 0 0 0 0 0 0 0 0 -8 8 -8 8 -8 16 -16 17 -24 27 -32 40 -48 56 -64 72 -83 96 -110 125 -141 162 -181 203
32 203 -227 256 -288 320 -354 396 -438 485 -538 595 -660 730 -808 896 -995 1106 -1234 1381
50 1381 -1553 1757 -2006 2311 -2704 3227 -3957 5064 -6936 10912 -37694 129744 172163 -73535
64 -73535 -94294 46620 47735 -80423 -44162 72726 60519 -40340 -48007 -7246 11589 28511
76 28511 43551 -10801 -63272 -18167 51059 17584 -38015 -2067 51185 1839 -63040 -17651
88 -17651 65472 38896 -51402 -55262 27548 55937 -4611 -39748 2047 28592 -10817 -34081
100 -34081 10102 44591 9349 -37350 -29781 6945 28067 24029 -593 -26964 -20541 11762 14126
113 14126 -9842 1502 31891 5002 -51113 -29173 47485 49121 -24627 -46441 6495 28661
125 28661 -4010 -13904 15691 19599 -13877 -28925 -4847 22826 22741 64 -20725 -15859 10218
138 10218 19480 -1740 -15632 934 13438 -4553 -17741 4981 26670 6256 -28116 -21635
150 -21635 15367 26611 50 -18056 -3783 10923 -486 -12230 2167 18892 5320 -19606
162 -19606 -17459 9495 21892 6840 -12835 -13533 41 8404 3523 -2632 2864 7009 -5447 -16622
176 -16622 -2020 21199 15108 -13680 -21248 1657 16435 4175 -8232 -1550 5600 -2347 -9888
189 -9888 -1023 12698 9758 -7979 -16415 -3126 13041 10822 -4622 -9513 -237 4550 -2187 -4765
203 -4765 4155 10171 -589 -14071 -8103 10049 14189 -1259 -12873 -4482 6574 3280 -4167 102
217 102 7232 944 -10800 -7745 7442 12676 1387 -10268 -7982 2774 7505 1738 -3035 -382
231 -382 2372 -2037 -6467 418 10287 4886 -9780 -10794 3356 10721 2071 -6384 -3001 2526 717
246 717 -3497 109 5685 3230 -5237 -7272 1025 8315 4725 -4402 -6158 65 4132 765 -1567
261 -1567 1228 3478 -1659 -6614 -2338 6770 7002 -2629 -7833 -1342 5103 2385 -2756 -1122 2919
276 2919 -287 -5166 -2076 5484 5678 -1747 -6504 -2775 3750 4551 118 -2832 -1319 1160 -323 -1728
292 -1728 1085 4742 965 -5731 -4829 3724 6850 8 -5125 -1756 2336 988 -1393 302 2789
307 2789 332 -3343 -2922 2167 4490 622 -3035 -3112 792 2725 431 -753 177 1021 -939 -2532
323 -2532 129 3903 2452 -2933 -4136 322 3651 1198 -1857 -880 588 -476 -1985 184 2851
338 2851 1748 -2086 -2815 -16 2763 1721 -893 -1851 -691 1048 209 184 1081 1008 -713 -2734 -839
355 -839 2461 2446 -908 -3018 -752 1720 969 -860 -5 1241 -758 -1791 -441 1653 2029 -725 -2095
372 -2095 -1097 972 1311 36 -978 138 129 -663 -299 619 1481 35 -1508 -1291 589 1621 624 -1077
390 -1077 -573 389 86 -487 250 1078 163 -1500 -1187 358 1670 339 -844 -906 -82 563 537 92 -96
409 -96 4 -478 -755 282 841 186 -693 -992 -136 1079 389 -599 -222 -85 -167 -307 96 778 481 -434
429 -434 -1050 -37 363 440 -55 -367 -373 -32 -125 255 499 183 -394 -996 -198 456 683 69 -561 18 414
450 414 340 -56 96 75 -277 -614 -130 497 520 83 -527 -485 78 552 328 -361 11 -319 -361 -3 476 85
472 85 -159 -323 -409 -9 431 299 -319 -35 158 -145 -121 145 185 -65 -157 -341 141 284 31 -106 -155 -93 -26
495 -26 13 299 -20 178 -259 -340 -150 668 352 -298 -294 147 243 250 -99 -116 -352 -155 -401 231 239 280 -149 -127 -71
520 -71 226 -56 220 -61 -282 305 100 318 -42 65 20 155 66 569 249 203 -139 -329 -18 331 72 67
542 67 -73 36 51 -60 -128 426 -160 99 112 -342 201 65 -171 199 77 -62 -45 -12 222 19 -254 -97
564 -97 10 21 164 -338 80 256 -24 -99 215 82 5 -69 115 123 -1 -74 -3 -165 -208 33 119 -87 -126 247
588 247 -15 169 -148 319 276 180 -92 -125 -229 265 -170 -38 149 -273 -188 -22 325 328 78 -317 -42 173
610 173 153 -21 386 -26 7 51 -134 110 217 -217 174 -80 94 502 -106 -328 245 -92 224 206 1 58
632 58 -237 -268 194 44 239 56 40 -197 -365 72 -60 -243 -114 -266 243 -81 4 326 77 -233 -264 183
654 183 81 68 180 154 -241 14 -13 -36 -67 42 -190 -570 -290 87 122 173 119 -104 -77 42 126 -184 -149 40
678 40 -161 -13 170 33 59 -160 -205 160 96 521 160 123 1 -281 14 110 -148 79 13 -197 195 235 424
701 424 38 -208 58 -69 -306 301 120 15 57 45 39 -59 -75 -76 -158 -298 -21 38 -118 229 -119 -443 197 5
725 5 -168 -42 48 -228 -334 -139 304 264 -116 -124 -180 9 112 86 153 -19 14 -16 -312 -60 350 -125 20 -130
749 -130 -264 4 35 396 -135 76 -2 -102 115 -98 -105 -167 -77 -355 183 -11 57 -290 202 -69 77 165 -93
772 -93 61 -216 332 97 59 148 26 52 -17 -63 -122 318 -213 102 164 -155 23 489 -113 118 -170 5 81
795 81 63 187 340 -119 85 -15 -5 181 37 70 -128 -27 93 -179 -18 -63 -250 76 -107 165 274 -68
817 -68 -196 -29 -26 -120 -36 94 111 -388 -72 -471 151 157 11 -82 -182 -95 142 -12 -140 -224 -150 -322 381 174
841 174 -192 321 -160 -36 230 100 225 -211 -51 -4 -112 41 126 -127 28 43 -108 -169 2 103 228 -70
863 -70 -59 51 79 -9 -412 58 -174 150 149 260 -49 46 -152 -43 92 60 -202 -61 136 -241 206 -88 70
886 70 23 249 74 -173 408 -19 295 99 -127 -128 133 138 -74 406 -106 -177 -8 16 184 270 75 -197 -118 180
910 180 71 -78 -10 -25 -277 105 252 347 170 -130 -175 273 38 427 -79 -102 -227 -277 -166 -327 95 67 37
933 37 481 37 -353 9 153 -253 -27 -135 -24 202 291 -174 -28 -38 268 28 53 -57 101 -170 -108 -178
955 -178 8 106 -99 111 -345 -65 138 -26 66 69 -227 -159 21 127 -169 -109 -61 -77 -259 401 7 -99 -50
978 -50 28 415 150 91 -101 -35 -334 -177 -174 -328 -95 89 -170 1 320 -63 198 -351 257 47 -141 -149 -139
1001 -139 -173 201 11 53 -61 131 -83 -168 -196 18 63 -134 -32 -141 135 -217 112 272 539 65 167 -194
1023 -194 -298 -62 115 -206 -168 -290 93 156 49 -324 65 48 -154 -155 -123 29 -134 -26 118 72 53 -114 -31
1046 -31 84 -56 -1 104 169 -17 281 -175 47 146 -189 137 229 -30 -215 -64 130 194 294 -340 -442 76
1068 76 -34 14 -148 -30 -45 -58 426 139 -50 115 81 -85 -55 307 160 13 78 -58 -209 96 271 -19
1090 -19 -75 -146 360 -8 -95 -165 56 -71 -106 -364 -41 -61 80 -162 -456 239 50 -114 20 16 -293 -11 -115
1113 -115 1 -107 195 -6 -285 -248 64 -94 155 113 86 76 -159 -13 5 -33 97 -75 120 80 61 -10 -115
1136 -115 227 -216 80 39 -245 -146 15 24 -243 36 -103 202 241 90 198 -94 24 72 45 -38 -283 272 -107
1159 -107 21 7 180 224 -343 86 19 209 -116 -152 -193 -130 -42 -164 -19 125 93 -277 142 10 182 64 164
1182 164 25 123 -118 -141 -150 -12 221 112 -143 -102 -266 200 -96 84 183 -414 -22 -35 167 85 68 76 -101 -235
1206 -235 149 127 -8 279 -5 117 286 255 261 12 -242 -78 -205 -178 20 109 -196 141 -81 -62 -323 -157
1228 -157 133 138 50 30 53 31 94 285 0 -302 -162 70 -24 292 -100 83 174 -60 -127 -105 -8 -223 -66 -242
1252 -242 27 -78 105 264 98 -68 -122 -56 197 114 107 80 226 -50 87 62 190 -208 -63 -151 -153 262 -217
1275 -217 -242 -119 261 -93 64 -95 35 59 9 240 75 -22 40 -133 43 -179 -132 56 -44 -70 104 61 50
1298 50 -240 39 -117 -60 38 27 114 -11 153 28 229 224 73 143 80 32 -76 20 302 82 82 99 -80 -63 202
1323 202 92 -295 80 -190 117 -116 -145 -269 198 261 107 -96 263 21 -30 65 -89 -114 73 130 110 -156
1345 -156 -191 162 33 -99 -88 216 -176 -14 84 -87 279 -116 -69 58 202 -155 -51 141 -279 -99 66
1366 66 -119 -209 57 -454 372 -204 -122 -99 -86 29 -225 46 -125 27 278 14 -43 57 41 -126 125 -125
1388 -125 -107 -69 -135 -37 -84 -259 169 117 -19 -226 -242 -160 152 -99 -300 -155 -51 -214 231 320 260 -67 84
1411 84 -110 -22 141 -115 -93 -186 -13 -105 49 -85 234 -5 80 183 121 -128 84 70 -241 -61 -307 -62 268
1434 268 -103 -132 -15 -129 35 126 -7 -241 142 -290 281 -212 101 -22 -51 221 16 518 -203 -146 -210 134
1456 134 43 -49 108 17 41 210 -154 -92 -207 14 -88 267 -74 -12 71 34 3 129 -426 155 202 -20 198
1479 198 311 -173 -42 44 -23 -258 -106 -286 -26 109 -49 192 -78 14 -141 -374 -45 -16 -148 37 -161
1500 -161 -129 260 -306 -24 299 -183 -72 8 13 -239 58 -16 218 145 -90 133 94 270 50 -169 -404 -51
1522 -51 139 150 80 244 -101 -126 -99 -231 139 -191 179 -45 -44 6 255 243 83 -192 -51 -15 -89 74 -92 -159
1546 -159 81 129 57 35 49 284 -33 -38 -142 250 78 -27 142 126 76 -204 70 231 -361 -32 101 -65 -49
1569 -49 -67 41 216 -161 168 116 -123 61 -120 -25 193 -108 225 52 33 165 198 -164 192 79 191 193 -19
1592 -19 180 -54 -27 62 -31 -85 -92 103 142 -109 207 -310 -90 152 208 -148 173 57 -281 150 318 136 0
1615 0 -4 -10 -18 -19 212 224 -134 -63 -118 84 108 -30 249 285 24 41 -193 -98 174 -71 -201 258 8 -340 -211 -113
1641 -113 64 74 22 -258 185 73 338 123 -198 117 -7 219 133 -125 7 96 113 362 -312 -166 -271 -291
1663 -291 17 241 -279 -28 72 142 66 -512 -104 -88 138 225 -36 -354 48 216 -142 -226 208 -58 -129 -93
1685 -93 -85 120 69 -97 -22 -236 105 -34 65 15 -2 18 53 -4 380 -34 243 -109 -9 79 -194 -32 173 -51
1709 -51 -200 -182 -619 430 157 114 8 11 -34 99 298 203 131 145 -1 80 361 -136 -76 -69 -199 151 121 -209
1733 -209 -71 -46 -97 -140 222 32 -219 -131 245 89 -305 163 -71 -86 266 36 -245 -8 104 -96 -18 -314
1755 -314 3 -96 163 86 -113 209 221 -100 -98 11 298 -143 -109 226 133 290 -40 -29 356 188 -140 12 105
1778 105 152 258 -31 -1 -67 -70 -312 -102 567 -227 164 77 -35 -55 278 -32 -5 1 152 -126 -250 50 -175
1801 -175 -130 -195 0 -74 -266 -166 166 57 155 -4 -25 234 -224 -273 -31 15 232 131 134 -133 -81 2 -258 100
1825 100 -269 -398 83 142 68 -108 45 -164 66 190 -40 -97 89 271 71 -132 203 -63 309 42 44 199
1847 199 59 -170 14 57 -34 39 80 -11 -152 121 22 -317 53 -36 -92 -141 72 -87 20 54 -9 -218 -386 22
1871 22 485 -64 7 -42 32 49 -118 82 -44 47 84 -8 59 130 -98 -155 -59 238 -196 141 9 219 -123 -57
1895 -57 -135 42 216 173 54 -158 -138 175 -40 52 -3 232 230 177 110 -26 299 68 -87 -85 -158 87 -57 165
1919 165 135 243 53 50 -334 222 -109 142 155 -118 -123 121 54 8 -248 -52 131 -169 3 13 -224 -222 -202 -117
1943 -117 126 140 -208 -105 204 -176 -17 182 65 -41 -67 -18 54 15 -296 -272 -43 150 57 145 -274 -192 -197 -105
1967 -105 29 69 49 -242 224 61 -89 111 -229 526 92 -160 -99 20 -51 -70 -41 -297 114 168 8 -51 -331
1990 -331 40 -102 -30 365 327 -54 83 -48 -70 155 200 258 63 -41 155 -313 -58 -86 71 -212 -18 -251
2012 -251 -57 82 -310 -263 -59 210 28 -202 -69 -16 -117 81 -101 -35 -58 -355 -120 264 -200 -13 -263
2033 -263 -132 -14 158 51 -227 -234 196 -39 263 150 -6 99 -30 67 29 -14 150 -152 104 -166 -130 -63
2055 -63 -227 193 -195 -65 -263 -17 -193 -117 -90 -145 85 -40 -240 -107 -160 62 169 -268 -33 48 200 52
2077 52 -71 -142 88 -83 271 144 55 2 227 286 182 122 -257 -391 44 -115 -185 387 -243 69 -101 -40 -66
2100 -66 -43 3 -165 2 -168 -72 11 153 238 -22 -128 3 -93 -204 -88 -35 -97 -326 -71 -56 256 -164 51
2123 51 -44 -131 205 188 404 -5 -270 -221 -363 159 191 140 -104 61 118 164 8 -190 166 -12 184 -24 234
2146 234 185 82 -142 241 -217 -93 -230 -23 219 -140 55 -287 -167 -12 -243 -133 -183 423 123 131 -123
2167 -123 -152 33 69 202 -212 34 24 -96 -88 -177 111 231 15 164 115 8 -196 22 116 22 -115 -311 99
2190 99 192 -196 -282 -314 10 -178 -166 100 -217 218 -66 -230 158 -22 82 54 -167 -238 127 106 484 9 -184
2213 -184 -92 24 201 -103 -204 109 150 409 88 -365 -251 -196 5 -86 -144 -136 -331 165 166 -266 -190 -215 259 -32
2237 -32 -277 -54 165 20 -145 -297 183 56 56 -124 26 89 73 -258 189 -38 164 237 -333 -224 4 80
2259 80 -19 -164 -47 -127 -77 -21 335 -265 59 1 -195 262 -94 97 -213 -308 -72 -20 188 232 5 25 57 102
2283 102 -151 227 117 -57 185 187 221 -112 -72 346 4 -93 -129 -26 -164 16 -106 -217 -4 144 235 -116
2305 -116 -47 133 -137 79 -96 75 477 58 -22 2 27 74 41 -130 -117 -134 225 49 -370 294 221 -128 438
2328 438 34 -111 193 216 -270 249 60 -267 64 -326 168 322 46 -177 3 271 172 24 -121 285 80
2349 80 -22 160 32 -58 -159 -29 -86 249 -449 -63 128 62 -250 200 -67 -54 4 -257 203 60 36 -1 23
2372 23 -125 -94 -288 -218 -16 132 -185 64 -66 208 -263 -83 -88 248 -265 -9 66 -149 -83 -126 -27 -84 229
2395 229 -45 -86 107 32 26 -217 -242 128 79 197 32 -140 121 309 122 81 66 95 217 -16 73 271 -367
2418 -367 224 -107 154 187 187 34 343 297 205 -32 118 50 -93 72 68 -96 -166 -331 173 241 49 83 98 -61
2442 -61 -132 47 -56 -48 315 -48 250 -174 -211 64 -217 110 184 -21 -240 -40 -246 88 -172 187 -60 127
2464 127 335 268 -411 102 63 -419 -331 19 453 -316 11 327 242 -6 32 -79 -100 -206 -117 -121 107 153 -123
2487 -123 -185 30 15 416 -80 -95 17 -26 22 -152 -105 313 -47 -13 -135 -14 44 13 -60 -356 214 -248 215
2510 215 57 18 -177 39 21 1 -132 -73 171 -262 -9 -2 81 -333 202 -70 22 209 -232 265 -233 -53 53
2533 53 -28 -377 68 -11 6 -92 137 -110 102 90 -208 -229 36 -79 90 -57 -273 -51 157 204 81 115 172
2556 172 140 178 -23 -122 22 -229 -39 -370 54 -175 163 -83 173 60 -14 51 24 -47 176 -171 -162 -182 57
2579 57 141 -94 90 -58 95 -261 -78 87 278 -388 -208 -93 255 89 -242 -30 182 -240 12 3 -280
2600 -280 -42 177 13 217 -86 -187 296 -26 -257 286 -85 -370 44 -170 141 -339 -225 -59 -4 -18 -30
2621 -30 69 -216 -71 175 -204 172 -59 3 -18 27 34 -6 44 213 135 63 277 72 -189 -149 -130 -153 -254 109 -323
2646 -323 77 49 -60 -51 -19 15 30 -282 47 67 28 195 -259 -27 -308 145 -156 169 269 -254 395 -161 -73
2669 -73 197 -119 213 286 102 -55 7 84 -112 -135 334 228 96 50 -172 -214 173 97 -126 8 262 -273 -55
2692 -55 57 -37 75 52 95 114 -235 105 202 72 -147 266 -111 144 259 -260 -161 86 222 223 244 -29 -162
2715 -162 218 129 -43 308 -70 504 -48 248 -326 19 -88 -211 -131 -133 145 -18 -253 300 56 231 220 23
2737 23 -163 164 170 19 -75 -120 24 -200 290 61 -11 35 -310 94 -38 -189 -128 -72 152 322 -90 264 188
2760 188 -391 7 -150 98 -47 -177 308 -274 -66 116 -366 -132 -45 -119 123 -66 -56 5 294 -96 142
2781 142 -46 -46 -8 -33 105 -55 50 135 -48 264 525 -20 -60 -182 -51 -68 -17 110 141 -241 42 -107 -137
2804 -137 -74 38 22 -366 -44 45 7 -114 94 -200 37 -203 352 267 144 -60 72 -295 41 252 -19 -195
2826 -195 117 -36 22 -12 -340 166 74 81 58 136 64 -45 -2 86 -72 204 -97 157 -29 294 -4 -25 -112 -75
2850 -75 40 203 -221 98 -3 55 3 -182 -177 -359 -25 -269 270 40 104 -20 -145 -38 23 -160 164 146 -17
2873 -17 107 -81 -111 123 -49 92 85 -240 -42 -24 -13 180 -46 -361 139 96 -132 53 82 -35 -28 -302 -77
2896 -77 220 -224 -169 -162 -4 -36 -208 194 -5 -18 146 158 -2 -396 37 -41 72 34 -173 -47 -130 -138 135 -10
2920 -10 33 -78 110 -55 -301 443 -150 -9 -50 308 -243 -24 48 -40 70 -30 246 -83 -24 -6 -89 -171 -100
2943 -100 -67 -239 -207 -124 -124 -100 131 -43 -26 36 254 352 23 -136 231 -38 0 -19 -295 242 -187 196 -82 246
2967 246 46 75 151 -203 -60 -224 212 185 23 36 122 176 81 -168 -103 -79 -71 -13 -48 -332 -65 93 96 270 30
2992 30 59 -165 62 215 -6 88 491 1 -129 105 -99 -167 -249 92 -122 202 -36 -182 -77 -71 273 27
3014 27 -256 237 93 -79 -164 -23 105 7 108 -245 -91 -50 148 -43 78 -128 16 -40 116 199 -4 239
3036 239 -71 279 73 165 194 -93 -235 -7 117 -161 -42 -91 -114 -98 105 37 367 -147 -46 -52 261 4 -267
3059 -267 19 194 115 180 69 159 -102 55 -171 -33 118 38 400 -126 -97 -158 -39 135 -41 -55 -55 -252 160
3082 160 133 8 -171 119 21 -126 -9 72 -53 -221 -117 -147 130 -47 98 -65 -266 -48 -102 110 -45 86
3104 86 -33 -106 341 -199 -7 263 -100 -69 -20 -219 12 80 66 60 66 283 -92 -182 -5 72 -69 182 40 70
3128 70 -49 436 3 -221 66 -64 -6 161 -101 230 -324 -159 154 187 336 -10 -419 -119 43 143 -334
3149 -334 -48 236 117 -135 197 71 68 76 67 -188 87 231 305 -164 59 4 -66 -117 127 -96 -261 -97 -58 -374
3173 -374 103 -26 -56 46 -187 -139 -228 142 -1 120 -147 218 288 -104 -180 -196 -42 -273 -65 -72 274 313 47
3196 47 -300 158 -21 -61 375 -271 -7 304 -34 -29 57 215 63 101 -27 -100 -42 -114 -81 -79 -54 29 119 -26 -13
3221 -13 -147 -12 -320 276 247 -89 -98 138 -94 -139 -266 64 210 362 82 -120 -137 -131 123 139 167 298 -92
3244 -92 -44 -68 -104 199 86 -52 16 -230 -229 204 -7 -1 -256 -9 265 -98 -73 165 137 -101 47 197 63 -192
3268 -192 376 369 65 -1 24 196 21 352 -85 126 25 332 -65 35 136 -274 126 -21 152 -12 99
3289 99 156 -19 415 97 -2 4 -82 -109 74 13 -4 -59 -144 106 -222 -111 -153 -52 -91 -101 87 123 112 -388 263
3314 263 144 113 34 -7 191 -147 195 -442 30 202 174 -71 -319 -216 181 -159 27 130 234 14 159
3335 159 115 61 18 81 259 105 86 139 44 -231 281 321 68 167 55 478 -136 123 -6 -246 0 -184 18
3358 18 -59 33 302 -19 181 -410 149 69 82 53 223 -195 281 87 -94 135 -14 33 -61 256 31 -74 -133
3381 -133 88 -122 -149 -446 -225 -94 -70 8 73 -25 -95 33 -225 -7 -24 265 -138 52 -193 73 2 -146 309
3404 309 -8 -186 45 -80 -19 -220 60 56 80 170 -109 74 146 144 -69 -177 -32 93 234 153 -21 -157 -114
3427 -114 -88 -372 -55 94 192 -100 -90 173 297 -223 169 -66 -4 -141 -319 -146 -72 -11 -38 596 362 173
3449 173 -2 300 -24 133 -93 -22 -394 36 -169 -114 94 130 -199 -94 181 -228 -256 -216 57 -54 -40 -210
3471 -210 18 -57 -73 159 -335 -221 101 -323 271 188 171 218 23 225 -56 24 -160 -150 31 -187 105 -383
3493 -383 63 -59 -219 -43 345 182 -235 213 -147 201 104 -13 -195 -241 -12 -85 146 137 -331 -50 103 68
3515 68 204 -122 56 -287 -25 -19 -192 129 326 67 293 -28 -100 -66 -142 -79 256 255 351 55 -7 -205 -128 106
3539 106 190 277 44 343 -201 -105 18 107 -41 -97 184 48 11 -65 -114 -46 54 -106 -37 0 -22 -156 123 -47
3563 -47 -63 113 330 -84 -294 -101 -247 -171 167 -280 -267 -75 279 -256 7 131 24 68 -30 -226 94 148
3585 148 53 -114 211 83 168 -207 39 128 -199 -57 -271 -10 245 -30 -326 318 57 134 -72 -120 212 -175
3607 -175 270 -7 -276 -38 -167 73 164 -136 61 87 -153 -177 145 -10 -7 -135 144 219 46 122 -50 -551
3629 -551 36 -115 -80 -265 -81 85 -183 42 5 2 166 25 57 259 -236 140 -287 216 -20 -177 -126 53
3651 53 -87 -25 -38 -139 -44 75 -161 172 166 6 -47 310 97 -219 -80 -181 -209 177 -214 59 415 155 27
3674 27 -277 109 -60 -211 -52 -39 -68 149 -259 -24 57 -192 162 236 -173 44 -57 -24 181 147 -108 -218
3696 -218 -30 216 -90 143 -72 -43 -101 58 -72 130 37 32 270 -267 233 6 -344 33 -87 -95 349 95
3718 95 -109 -185 25 119 -145 451 -275 -372 37 279 -237 151 229 67 43 11 234 232 126 3 -93 -172 157 -150
3742 -150 -55 -3 -207 -342 -169 -13 -102 53 108 19 -109 53 16 -218 193 -55 -206 75 202 121 -31 42 -37
3765 -37 -5 11 -23 -13 43 89 -9 -255 211 -314 206 120 97 206 59 17 -201 -102 -11 -297 184 -239 269 266 -152
3790 -152 159 -38 -7 273 -106 26 -106 -34 -167 67 -20 -141 61 -169 170 -47 15 -71 156 -47 130 -65
3812 -65 43 122 -126 -112 -160 -296 111 244 -155 61 -29 70 -140 43 -185 -154 -171 307 -109 -91 46 -52 316
3835 316 -161 2 13 -63 101 -103 325 142 -6 187 132 41 -156 -312 93 5 206 232 -211 -216 -194 -165 278
3858 278 48 -300 -126 -29 -36 -79 96 -79 -111 57 -255 -128 23 -461 -189 -34 -130 -103 2 167 6 -287
3880 -287 -198 -184 -59 46 -236 -330 135 140 -160 51 -57 -171 146 26 17 164 65 147 52 -119 438 -63 -132 56
3904 56 164 128 56 -43 271 24 -142 208 192 -55 -134 -27 188 -25 -75 -50 -164 -97 -94 226 34 -138 -86 28
3928 28 48 78 428 -55 117 -169 -12 21 -165 395 66 -239 104 288 99 198 -114 17 128 4 174 -26
3950 -26 -170 -45 -51 91 348 -130 -12 293 -162 186 -69 101 52 -191 10 42 -48 8 179 49 2 108 -181
3973 -181 48 70 -25 -82 -95 -190 -80 -135 -114 74 -201 92 -225 203 -22 -104 207 206 232 196 -155 164 -232 19
3997 19 -100 24 245 100 123 -308 93 4 -199 -76 249 -68 10 14 138 -371 -26 -97 -288 -22 -122 -72 198
4020 198 -232 342 279 -130 11 -251 213 -384 -171 -137 11 -176 29 88 25 64 221 142 115 60 -116 52 131
4043 131 -93 -292 -229 246 -22 -256 74 87 -343 -30 -9 -340 -210 215 56 -34 -94 -71 -466 109 -93 -7
4065 -7 -81 -293 250 70 -275 332 -182 -7 10 83 -42 -39 51 14 -219 172 -139 83 -170 62 -103 -33 -303
4088 -303 21 -174 -151 50 28 100 -467 175 56 -141 83 -133 -258 303 43 11 232 -214 -19 -261 91
4109 91 111 65 48 -98 -68 215 -106 -92 246 -273 -140 46 331 76 142 38 -183 236 -85 -211 -63 -115 72
4132 72 -258 4 45 13 -12 59 89 164 20 98 -11 245 168 -253 -23 -41 24 -172 -45 26 -110 -19 349 -297
4156 -297 -15 205 -16 142 -114 369 223 -14 139 -12 147 -178 -130 31 133 -142 140 -10 -61 56 116
4177 116 -159 -243 196 33 -207 39 116 -107 44 9 23 -56 -75 137 -452 93 206 -7 -205 92 16 -150
4199 -150 -65 -103 -1 -187 90 -62 -298 96 30 148 -61 -276 -187 264 130 -46 -113 319 152 33 139 -45
4221 -45 18 27 6 218 216 -49 -22 -104 -21 -126 -140 -212 234 65 -187 87 141 104 -219 130 152 203 78 -132 143
4246 143 4 -36 -50 372 68 -51 154 349 -324 -5 -49 236 -37 54 337 60 -194 32 -61 23 55 124 -187
4269 -187 -78 188 368 466 9 39 -185 -104 -61 267 352 -31 -239 -132 -78 -269 70 -71 -362 -102 193 104
4291 104 135 380 -31 -162 -161 180 -232 188 -126 90 94 3 -153 -35 -360 -136 14 51 129 -193 -224 -21 -31
4314 -31 -78 270 111 334 -131 -140 296 -45 -193 172 -85 167 343 -181 -31 -52 -312 236 -56 123 -157 -107
4336 -107 25 96 -360 30 169 -73 212 135 123 -47 -278 157 1 -21 -259 -159 -88 -129 -44 -87 71 13 39
4359 39 -4 445 161 -184 33 -309 -107 -62 164 -103 102 7 -61 92 -330 -87 220 -136 91 8 125 -28
4381 -28 -57 -89 -84 287 -114 -180 -144 76 -293 47 -72 -274 -71 85 191 -177 24 126 -61 43 -290 -121
4403 -121 -101 8 284 179 -149 40 -88 260 -45 -113 317 -225 26 118 43 -29 116 -85 -242 -172 -248 295
4425 295 32 184 -32 -84 297 -67 251 -153 -34 38 10 61 261 251 28 368 -13 109 1 121 -283 -90
4447 -90 -61 -106 138 226 242 102 296 -298 -302 -17 137 -13 -260 -211 -153 232 -213 -12 78 184 86 -247 34 169
4471 169 115 27 -148 -99 -53 -156 -55 289 224 202 -55 153 16 -34 128 -24 520 93 12 -34 341 -45 -206
4494 -206 307 -88 42 -95 -129 249 309 121 101 -96 240 -3 -200 224 188 51 68 233 194 141 350 -55
4516 -55 7 -167 -37 230 188 -301 278 117 -164 52 -23 -81 102 27 -275 -37 -183 -350 152 118 -72 -25 284
4539 284 -60 181 232 90 -232 139 -150 -102 -194 -2 98 28 262 -206 31 -73 45 -51 -65 -97 -8 50 -94
4562 -94 -37 -22 211 -47 28 -114 114 -147 -171 14 -45 128 252 -118 -85 76 455 21 91 64 254 159 -206
4585 -206 68 -116 13 67 -78 -56 -330 -60 -26 152 65 288 -371 49 -319 -158 -104 -229 -123 -125 96 6 152
4608 152 -302 36 234 -90 -50 2 -76 7 -193 265 113 141 -62 142 -17 -4 103 -189 -152 55 116 -163 143
4631 143 14 -29 10 176 0 258 188 -67 -83 247 -115 37 -150 383 209 316 -59 -33 -181 215 148 -283
4653 -283 112 41 49 -29 18 476 257 -24 -125 -13 12 16 -57 224 -164 -147 115 355 199 222 -165 -282 581 108
4677 108 37 206 201 -110 97 26 -171 116 272 126 327 125 -274 -213 -438 304 -167 5 -68 189 -117 -118 267
4700 267 48 -127 9 91 -257 -75 -142 24 -21 429 -248 -49 409 296 -82 134 -160 -67 65 86 249 -99
4722 -99 182 -444 -147 34 299 124 114 -158 -264 -88 20 -90 19 34 -256 -150 11 -86 -82 -139 -82 -35 65
4745 65 -51 82 74 -314 323 -100 5 -30 -318 -7 173 221 -239 -67 369 10 243 119 182 247 580 -13
4767 -13 -215 -179 178 -287 47 -51 -51 -484 -68 55 -60 -133 -46 -8 231 53 284 -34 -47 134 372 -172 -103
4790 -103 8 -14 234 -15 -105 110 -83 151 47 -240 102 -223 -168 -125 -136 147 -11 -254 116 48 97 207
4812 207 -32 39 -15 -201 -54 116 -26 338 -203 -138 96 -60 96 20 13 -220 69 -171 54 41 101 -312 170
4835 170 -94 -116 110 -133 286 220 -297 302 273 116 153 -33 -67 -242 -5 -133 33 495 293 120 -98 88
4857 88 16 102 -39 -96 -55 98 212 295 320 -15 -33 37 -121 109 3 -29 -194 -599 72 108 -104 -74 308 216
4881 216 92 133 63 -40 -21 -33 -68 -48 -107 4 -195 -98 154 45 184 151 143 229 399 -63 159 -49 -107 102
4905 102 -137 -214 52 357 119 407 45 -99 -16 -277 -238 -532 -53 -18 38 -106 -234 -231 68 273 -210 -231 228
4928 228 144 14 -120 -146 4 -97 193 19 232 -31 0 71 34 -412 -161 -278 40 -110 -242 116 46 -49
4950 -49 -168 158 33 40 -131 253 -16 -346 106 -345 45 124 38 69 -9 40 48 -110 67 -107 -127 19 -22 -152
4974 -152 164 175 -44 239 -46 187 104 134 -257 -36 87 14 -175 38 -147 -39 202 226 -132 -39 -101 199
4996 199 -166 5 -254 -39 -120 49 -98 -102 -150 54 -144 -41 39 119 86 172 20 121 323 120 6 46 -10
5019 -10 -307 27 37 -445 26 -40 101 96 189 20 -19 12 -39 -77 -269 275 -88 17 132 -33 175 242 104 264
5043 264 132 -128 -18 -59 -143 84 390 -273 49 -184 -119 123 139 302 17 -61 15 205 42 54 -269 27
5065 27 52 275 117 -15 -8 71 -46 3 30 166 -65 -206 40 -281 -144 -255 141 -181 -229 -52 231 142 -130
5088 -130 205 34 113 92 88 103 85 14 -46 46 -488 -13 -285 52 179 -34 219 -90 -232 -190 -125 7 231 52
5112 52 -187 -14 88 -129 196 -49 55 3 177 -63 216 -98 -316 -35 -126 -165 -190 -59 -209 -16 90 -164
5134 -164 149 48 117 185 -242 187 -166 -45 150 108 353 36 96 -34 66 5 213 -250 -178 29 39 -32 119
5157 119 -378 -151 63 -227 50 -2 -343 -286 -165 86 -217 -153 152 -272 -159 -173 -21 4 -35 59 -32 -253 -140
5180 -140 271 -87 -87 62 -46 12 185 137 -220 80 135 -309 60 18 296 -38 17 87 51 31 50 -159 -91 181
5204 181 -87 25 114 25 142 82 305 33 -186 86 100 111 31 96 -104 113 44 -47 139 12 -291 147 70
5227 70 -227 263 -123 101 72 397 291 -96 100 21 -280 72 50 -173 -165 141 86 -166 9 -133 35 -311
5249 -311 64 -252 5 79 123 -5 -187 -234 140 364 -64 75 -153 -86 100 -98 -93 177 102 319 77 231
5271 231 68 -39 -215 104 -242 259 -137 -275 -36 -135 20 -146 157 -63 -115 -89 -39 236 115 -269 252
5292 252 -107 -75 -197 -99 -385 -96 -34 97 142 239 -4 -64 270 216 116 -204 70 8 -350 364 108 21 235
5315 235 137 -61 -233 93 234 118 -103 -93 68 -134 -76 98 -401 311 -150 72 -256 83 -165 10 248
5336 248 -329 -53 -29 38 -195 190 -130 -267 -174 14 186 -134 -52 -112 -206 111 264 85 40 58 78 -67 156
5359 156 58 -401 -140 -114 35 -175 -29 212 -67 221 -34 -11 -102 -30 42 71 273 -154 155 201 21 154 300
5382 300 -24 -25 -172 -60 -46 -364 -115 3 -14 -120 218 120 226 -279 70 -101 -109 18 -38 -124 178 108 -167
5405 -167 -121 -89 -279 22 -117 -120 -198 237 -219 -87 -228 136 -140 -5 209 -101 21 -129 155 -1 -22 10
5427 10 54 -153 169 31 246 -7 9 181 7 -237 -139 -52 88 -3 -21 -62 156 105 133 143 -24 79 416 -212
5451 -212 158 174 -54 -236 -66 -146 -79 -187 255 -203 -72 30 177 59 44 194 -74 163 75 -150 111 127
5473 127 111 -80 92 -11 -127 -122 -142 183 82 -63 10 417 -271 173 -21 48 -113 -191 194 2 112 187 -18
5496 -18 -9 202 -76 -197 -348 94 55 25 -80 96 -20 -168 213 -473 55 297 -28 -34 -371 -314 88 133 175
5519 175 -24 210 0 98 74 -131 108 -5 -19 -73 -161 -211 155 -84 285 -100 37 -69 -10 -96 165 334 -21
5542 -21 11 124 204 275 129 70 295 189 305 -98 -71 332 -87 -158 -86 -148 -11 -39 39 -55 157 -183 -320 -45
5566 -45 -326 -160 233 212 335 -82 -378 -156 72 -81 -123 180 68 -92 1 86 116 -76 -125 115 231 14
5588 14 -39 77 41 -162 28 66 -45 -153 -29 85 -140 48 21 154 -3 -120 254 -49 -114 -171 74 196
5610 196 228 136 -13 62 -144 118 156 -17 15 50 -166 -68 115 -202 22 -368 -40 -179 34 -84 -63 6 -62
5633 -62 128 -43 -77 -132 -72 -101 -252 148 57 252 -99 92 -146 55 -209 2 160 395 -95 235 -308 -43
5655 -43 -445 31 122 112 -25 -349 210 16 10 29 -135 -5 265 175 -291 -115 -169 100 32 515 -132 99 78
5678 78 88 12 -109 75 -388 191 97 207 292 89 -254 93 -65 -335 67 -174 -2 -53 -88 -120 -36 153 93
5701 93 -26 14 -68 -65 498 1 206 -64 358 128 210 -29 211 -40 -64 47 48 188 -187 268 307 154 280
5724 280 115 182 166 249 -247 -314 307 232 -250 97 -319 106 12 36 -126 168 -241 15 -154 -219 205 -295 -97
5747 -97 -91 179 -207 -123 55 -84 -39 43 94 28 129 12 -36 52 -73 238 173 21 70 -42 -95 42 -166 132
5771 132 0 31 -12 36 200 -27 339 -191 259 -146 330 36 250 65 60 -22 -63 220 -55 -375 -169 32
5793 32 -85 -28 -341 -45 99 179 -314 181 -271 -24 -216 221 121 -207 6 -17 281 334 -55 -23 11 -48 -51
5816 -51 330 71 275 428 116 -152 130 151 -284 294 -81 155 233 -31 104 -30 185 53 2 36 75 -104
5838 -104 79 387 123 89 22 -132 64 177 98 62 -99 7 -15 194 -183 -242 -33 -233 179 312 88 66
5860 66 652 -118 -146 24 -159 25 -106 -102 289 79 -235 -36 -148 295 3 -271 14 38 178 200 78 -191
5882 -191 -59 424 -378 -112 30 261 105 89 31 123 -566 -149 -76 160 43 342 -144 -124 -37 -258 -183 -95 -249
5905 -249 -130 13 -171 217 68 27 -119 122 112 28 -382 -4 22 -75 56 134 -127 28 158 -75 -101 -41 -65
5928 -65 220 -91 -99 74 64 -165 -178 5 11 -64 -32 375 122 18 32 -172 -5 85 -60 -28 -201 102 182 -273
5952 -273 35 107 -137 -33 159 -27 -110 20 68 43 2 -15 -130 -272 -3 -11 348 177 1 155 165 31 23 -244
5976 -244 -141 27 -206 -292 117 -109 360 -128 58 97 153 48 131 345 82 60 45 58 91 139 -185 161 -68
5999 -68 95 -143 -339 92 523 -180 -163 212 97 -199 -55 -262 62 299 -39 91 -30 175 -96 -174 136
6020 136 210 198 149 33 -30 102 -207 -60 -199 -68 56 -140 136 74 -25 -55 -126 18 40 5 -3 120 289 280 70
6045 70 -152 160 -419 -127 159 198 43 -121 123 170 -40 310 34 -199 -262 -125 -155 116 220 258 59 184
6067 184 191 201 25 39 -38 -244 -140 -67 214 250 208 -339 218 -70 -134 159 276 -143 133 15 276 21 169
6090 169 -209 82 126 -261 322 152 73 -101 66 -9 -38 -81 -201 -60 215 -193 21 438 71 -138 599 -95
6112 -95 246 -26 54 -157 -170 217 -61 56 63 15 -272 29 85 168 181 255 117 -174 -162 -188 87 -31 -12 -5 -110
6137 -110 55 116 168 7 -63 -332 -54 83 112 -55 -43 107 -196 1 -311 247 232 -65 174 -112 -204 22
6159 22 257 -273 224 36 177 15 -107 42 -216 -123 -212 114 -40 -128 -205 -110 -477 126 106 46 134 193 49
6182 49 173 288 260 87 152 -65 154 -163 135 77 6 -184 25 -75 106 -68 -66 -26 -262 38 39 254 -12
6205 -12 122 71 32 289 -56 95 -83 94 103 22 103 -300 72 -51 -199 217 19 -276 79 -210 115 -13
6227 -13 170 83 131 -7 -176 77 -86 183 177 75 63 -135 -300 137 -231 58 160 -128 65 25 -81 -327
6249 -327 184 -88 352 -32 -66 79 -348 -168 -50 -5 -55 12 88 186 35 58 94 -17 -106 4 585 -105 -76
6272 -76 178 187 -49 95 79 207 -38 434 103 15 66 200 152 164 -207 1 372 -102 251 -126 95 -398 -312
6295 -312 -198 -175 -181 -204 126 278 6 115 39 -143 -59 -65 218 23 96 173 -179 -129 -159 -14 -18 290 86 -190 26
6320 26 61 274 -26 -103 16 20 39 -109 136 205 -154 -138 31 -46 19 103 -103 97 -30 35 -218 284 -1 13
6344 13 299 -5 25 -220 52 324 100 -22 73 278 -83 -136 -8 -151 -9 -147 346 -52 -121 117 -9 31
6366 31 -158 64 85 -333 -74 -42 -179 17 -170 -114 -59 109 389 -105 -34 139 171 -123 -11 -167 65 -328
6388 -328 -232 -242 -110 -40 -246 -85 46 64 150 271 107 -6 -138 61 339 68 -80 49 208 -23 -80 176
6410 176 29 -14 38 46 -132 -83 271 -99 -19 258 97 259 -151 -12 -20 44 -142 -69 -140 -114 104 -394 297 -55
6434 -55 -19 -178 288 -212 -190 241 161 117 -171 -69 -88 62 -149 191 -62 238 189 -131 -143 -235 -13 -81 101
6457 101 -32 -63 -187 52 34 -256 101 274 -72 -2 33 234 -72 248 470 -16 -277 -124 234 420 32
6478 32 -48 -200 -61 68 -120 -152 59 -126 55 -124 -14 -139 31 -186 1 -48 -46 -21 135 156 216 11 80
6501 80 279 89 180 224 35 150 167 76 41 -155 -165 31 -257 -86 55 -23 175 223 176 -130 -80 -15 -225 -206
6525 -206 158 159 -229 67 -115 -311 -317 -22 -178 60 187 -117 -87 -71 138 -43 67 -303 -265 -334 -337 -30 162
6548 162 -58 306 -137 -272 145 21 -34 34 63 -311 308 26 122 132 0 -138 115 156 36 -16 -225 53
6570 53 -5 222 -67 42 235 -91 -186 -134 18 70 -73 5 -106 -221 64 42 34 -159 -33 -149 58 170 4
6593 4 -86 -269 87 -157 -244 -252 -151 76 35 -46 168 144 -77 213 -74 -130 218 -27 -90 335 410 38 -1 311
6617 311 124 188 63 -63 196 -239 10 131 185 38 -183 -36 -76 51 238 77 -151 161 -265 17 108
6638 108 -35 175 332 241 -252 31 -89 -189 111 -64 -176 -89 234 50 81 30 18 124 -139 -73 -38 22 251
6661 251 -1 -128 116 104 -293 -5 -158 -55 58 209 -53 -222 -101 -281 196 239 90 27 -27 -132 49
6682 49 43 -113 -22 12 -151 56 67 -273 -143 273 199 15 32 -253 -218 -28 100 281 -200 -63 350 -67 12
6705 12 212 -72 -66 165 30 273 33 -317 -183 -69 -38 254 -88 -230 -219 408 -429 -24 65 79 81 -130 -65
6728 -65 310 214 188 -3 8 -228 -128 -238 98 12 160 -428 132 104 151 -274 145 -128 -180 217 12 -296 175
6751 175 -248 -102 -57 -236 256 -179 -23 -15 165 -36 79 61 106 -328 54 383 -62 44 13 14 -115 159 179
6774 179 33 16 53 -172 -149 -205 98 -22 197 85 98 -6 35 -44 -108 41 -13 19 181 -20 271 -88 78
6797 78 -6 -14 -149 123 -214 -87 -24 -8 -190 -114 91 -113 229 -91 -148 -54 142 196 -72 -164 -40 169 -281 92
6821 92 19 93 -133 -241 224 -221 87 -308 -32 -55 -24 59 49 228 -176 98 -158 322 110 -44 247 -116
6843 -116 -154 -36 97 -30 -7 179 -49 -28 132 -131 -208 -71 177 134 151 159 55 79 -31 35 16 -26 131 160
6867 160 -147 111 -72 107 -185 -18 73 68 234 207 -147 -139 -97 34 -65 -21 129 -25 132 178 -95 180 3
6890 3 16 -340 128 21 -18 -76 -380 -73 -43 -62 170 -117 43 71 80 -77 144 -104 32 110 -33 118 -195 206
6914 206 24 37 -259 97 158 -345 -31 332 15 330 -130 -35 -4 37 71 120 -11 121 -113 120 -83 186
6936 186 23 249 31 33 46 -49 -103 86 -89 -226 77 -59 -60 -166 -26 -209 83 -156 -27 528 -12 181
6958 181 -32 77 -90 -48 94 196 -357 -211 151 -47 -187 32 -78 -140 -117 -212 -89 -78 -382 -102 95 385
6980 385 68 -12 -70 -15 95 131 -202 84 151 -96 -125 -103 -78 -53 130 -172 31 -60 297 -10 5 315 144 -229
7004 -229 198 238 146 -16 158 -97 134 168 -66 179 206 364 -83 -251 -104 59 -228 -59 -4 -156 -101 57
7026 57 9 29 -116 51 143 -51 113 63 34 53 309 -235 -46 -21 131 -99 -101 -35 140 126 71 179 -166 -22
7050 -22 12 33 -5 -74 -34 -101 128 139 128 59 -70 10 93 -10 -244 240 -28 -364 -13 31 70 -20 -59 -36 -55 186
7076 186 -321 -336 33 -112 219 188 224 -53 -61 -315 141 28 48 125 99 53 -236 15 155 -102 191 -358 123
7099 123 212 76 4 -200 226 -39 44 359 227 97 -328 63 104 290 138 131 100 -64 41 37 267 26 294
7122 294 191 -108 -142 -444 209 1 -138 129 -205 -226 -22 -278 32 19 243 97 16 -99 232 -111 -105 203
7144 203 74 -375 126 96 -237 105 3 -100 108 -211 244 196 -61 128 -135 -163 -115 -22 -300 -229 85 -7
7166 -7 -330 105 -3 -32 -93 39 116 -130 -99 -116 -44 54 220 51 -54 46 -22 238 -110 -382 451 -118 286
7189 286 181 69 232 -16 -124 -30 -33 283 73 -46 175 165 159 34 160 275 28 -205 -96 -381 -33 -17
7211 -17 -51 -437 -10 97 -85 139 -149 -171 131 54 1 -13 -25 -97 -267 -109 67 -14 44 -107 -52 -4 -301 257
7235 257 80 227 15 57 84 -79 34 17 -444 -79 -112 -42 133 123 207 127 -203 -80 50 282 283 282 -49 -103
7259 -103 267 -204 112 25 174 -52 -62 188 -185 -347 -183 11 47 -14 79 -96 -42 103 337 23 282 58
7281 58 300 -178 -58 20 343 182 -114 -37 -288 -295 177 74 -181 80 -24 141 65 61 -90 137 -161 35 229
7304 229 5 -95 33 279 150 73 -69 77 202 -32 -57 109 54 -260 -114 80 352 190 65 103 32 -23
7326 -23 27 -52 -233 153 -104 82 75 107 -140 -405 62 -82 121 -14 212 -289 -58 88 209 -14 147 62
7348 62 339 89 57 -69 72 212 202 212 28 -138 -10 -52 46 178 -1 66 64 207 160 -69 127 -17 124
7371 124 -157 -305 -102 211 -165 -85 -87 -81 44 -35 -150 -56 -246 339 -83 180 -168 -155 -304 41 -165 63 -123
7394 -123 87 314 -396 -105 -185 -1 -3 147 -317 -88 -118 212 -140 -105 -57 -31 -226 -281 -118 147 -315 -48 133
7417 133 -78 -14 -18 352 8 10 -199 -256 162 -352 -151 210 -126 405 159 -129 -32 -122 -279 20 -163 -31 178
7440 178 208 182 -70 -127 -73 -223 194 -70 -96 84 -139 258 62 -223 53 251 -266 313 -109 -101 -374 -54
7462 -54 45 344 152 -95 -377 -70 -3 -117 -197 68 158 150 -222 -75 186 18 -8 8 -72 192 -136 -91 -158 191
7486 191 -24 -93 355 -88 126 -495 339 -328 -53 -61 -121 -248 -240 217 225 293 -125 184 273 -220 49 124 -33 -4
7510 -4 -101 -90 360 -46 -128 -74 165 -9 -4 20 151 161 -157 30 129 268 125 175 81 24 -179 -14 184 -43 189
7535 189 -37 -95 248 170 -160 -7 135 74 -138 -308 229 -167 -193 102 364 55 -82 31 204 30 -133
7556 -133 -178 98 135 -144 117 -119 24 3 -13 20 -167 39 -147 -2 -220 8 53 -57 369 -102 49 10
7578 10 93 102 -48 -287 109 42 -7 -198 86 -287 -168 191 -127 -88 -1 -310 -208 11 -237 126 -107 -97 -18
7601 -18 -77 -228 167 -9 18 -158 31 -101 119 234 -324 -106 85 -235 172 203 69 92 212 11 94 -236
7623 -236 -246 222 -164 191 -92 -417 -307 80 -114 -29 -207 -397 126 23 -54 -85 83 -194 63 131 54 11
7645 11 -79 222 135 -324 50 110 -38 81 142 110 144 -449 -244 77 -319 -121 456 17 -100 135 -176 -249 -50
7668 -50 -396 31 -315 -19 331 57 114 -158 141 41 -229 62 -77 298 -81 195 -200 -134 222 -37 -67
7689 -67 258 -122 256 365 139 119 -222 -393 -138 -208 -486 -61 10 320 75 -132 -256 4 22 164 -9 -298
7711 -298 -73 -25 280 -34 -20 204 58 88 -174 142 -14 202 8 -75 59 38 23 -24 57 287 -236 13 -95
7734 -95 -113 111 409 83 277 -220 177 -31 -76 -36 -53 -47 -34 343 145 426 -196 247 309 175 103 32 -37 515
7758 515 -158 -25 30 216 214 -175 -101 244 -30 117 -378 17 -116 56 11 118 87 129 -138 149 52 -103 -3
7781 -3 32 -198 136 145 -64 -214 -89 -224 -406 98 -149 -85 -294 -132 -125 102 -350 105 30 -348 -85 -8 49 -242
7805 -242 -120 40 294 -138 31 -9 133 -168 -224 -44 89 112 -198 114 244 93 -90 77 40 -170 -32
7826 -32 130 140 4 -18 29 -73 62 -65 142 17 -426 139 207 -98 32 -136 -10 -360 83 160 -190 -132
7848 -132 -343 161 302 -62 -527 32 -72 66 -75 46 226 257 89 260 107 -114 -427 -130 26 4 -158
7869 -158 -121 21 -132 -207 174 -126 -96 -100 -26 139 -4 -15 90 -317 -406 -518 -66 84 110 -223 -107 27 -99
7892 -99 -331 172 -287 -296 138 129 -56 413 -6 54 213 138 -505 223 -110 -2 248 247 -24 178 -90 53 15
7915 15 -352 -49 -94 55 94 103 272 -52 32 157 -123 40 -100 163 135 -87 -196 -15 -90 -380 213 -287 72
7938 72 225 -276 -20 -158 -207 -79 -182 -115 -38 45 130 111 -26 -3 300 202 65 -359 -76 -45 150 -17 -251
7961 -251 -12 274 -209 -222 -47 199 27 191 -19 -341 -282 -203 -89 121 8 -44 2 -11 -133 -249 -92 25
7983 25 175 -14 14 16 178 159 -208 -32 109 -212 -25 -307 -305 129 -254 -218 -194 -35 152 -7 -188 -101 247
8006 247 61 18 119 -178 82 73 104 -52 -168 142 -102 -105 48 -263 264 113 -284 -275 83 -112 -137 -281 129
8029 129 80 -140 -27 376 50 303 175 12 -417 49 146 -292 -16 -187 32 -191 161 -90 -194 -213 -24
8050 -24 -260 108 139 25 -25 -54 165 251 -10 42 23 -111 -308 41 47 -282 70 -154 -187 -151 -237 -380 -156 -57
8074 -57 -28 185 -11 -98 -33 75 93 -63 28 56 58 196 136 71 212 -28 -5 43 -236 515 -51 153 -195 -8
8098 -8 350 162 -202 -76 -117 -186 -49 50 38 -64 -149 -35 -86 -9 217 15 268 -321 -77 -367 4 -367 -32
8121 -32 145 -17 243 -88 235 -146 93 -187 339 -14 39 102 -118 74 -242 123 -77 195 47 -6 110
8142 110 -132 -200 -16 -45 75 211 259 -270 230 -132 -153 -179 16 175 -185 128 -170 47 -49 31 -130 192
8164 192 -143 32 -86 12 -87 71 52 -277 474 182 -51 -6 -2 12 -91 -35 322 108 -127 -57 -150 -78 -125 197
8188 197 -27 130 27
8191B7
$$ Imaginary data points
##PAGE= N=2
##DATA TABLE= (X++(I..I)), XYDATA
0 0 0 0 0 0 0 0 0 -8 8 -8 8 -16 16 -24 24 -32 40 -48 56 -64 72 -87 99 -113 132 -151 172 -195 221 -248
30 -248 279 -314 353 -396 440 -491 546 -606 673 -745 825 -913 1010 -1119 1240 -1375 1529
47 1529 -1704 1905 -2139 2418 -2753 3165 -3688 4374 -5321 6715 -8984 13294 -24376 110825
61 110825 191841 -110978 -125034 45234 72297 -66134 -35153 80946 58443 -59874 -54038
72 -54038 15206 36651 22387 19205 -24666 -57151 -6095 61391 21669 -40605 -9530 43682
84 43682 -1354 -57387 -8767 66212 27914 -59533 -47956 41111 58652 -13408 -48105 1088
96 1088 32392 -5641 -29140 13576 40652 -1748 -43630 -20518 24504 33329 11153 -15551 -29401
109 -29401 -12866 19806 20610 -6864 -4845 19306 -1467 -43856 -15883 52614 41433 -37307 -50559
122 -50559 13560 38537 -2167 -19543 9562 14638 -17764 -25365 6255 28510 15541 -11413
134 -11413 -24122 -9795 15569 18888 -4511 -17237 373 13835 -2421 -14393 5855 21988
146 21988 -1027 -29120 -14585 23350 25730 -6898 -23301 -3820 13428 1642 -10266 2580
158 2580 15328 317 -20471 -11669 15603 21280 -1317 -19020 -11997 5646 11701 2643 -4885
171 -4885 -1178 3528 -5338 -11931 2525 20356 8831 -18823 -19589 7196 19976 2495 -11893
184 -11893 -3691 5565 -352 -7277 1576 12017 4918 -11467 -14132 2372 16007 8402 -8853 -11542
198 -11542 666 6940 -155 -3869 3919 7273 -3655 -12780 -3553 12971 11307 -6143 -14433 -2255
212 -2255 9744 4700 -4498 -1577 5084 -427 -9451 -4234 10082 11099 -3249 -12452 -5456 6724
226 6724 8765 469 -5328 -1638 2233 -858 -3807 2097 8789 1640 -10849 -8196 7005 11603 -34
241 -34 -8938 -3563 4444 2082 -2528 -92 4752 1276 -6132 -5741 3172 8268 2205 -6519 -5963 2174
257 2174 5618 1079 -2414 588 2268 -2393 -5177 -30 7429 5313 -4999 -8035 82 6940 2563
272 2563 -3253 -1712 2483 -238 -4041 -198 5795 4332 -3885 -6748 -650 5214 3864 -1105 -3998
287 -3998 -1285 2007 528 -1131 865 3134 -344 -5799 -3192 5029 5869 -1418 -6290 -1088 3698
302 3698 1775 -1558 -173 2141 -269 -3594 -1915 3088 4026 -536 -4118 -2244 2147 3142 218 -1742
318 -1742 -371 829 -701 -1531 946 3505 893 -3520 -3654 1701 3984 987 -2676 -1410 1132 173
334 173 -1107 502 2626 660 -2750 -2652 1244 3331 865 -1945 -1642 254 1457 598 -338 293 477
351 477 -832 -2013 -11 3055 1878 -2004 -3100 93 2331 961 -1224 -652 704 -241 -1431 246
367 246 1789 1148 -1274 -2067 17 1352 878 -372 -1052 -175 459 -120 -248 837 1046 -493 -1658 -919
385 -919 1176 1518 -300 -1682 -453 422 590 -398 359 645 -309 -1296 -564 1109 1220 99 -1201 -806
403 -806 368 797 295 -56 -201 -217 -172 -285 168 934 384 -722 -1071 401 1213 348 -602 -372 -112 73
423 73 -440 13 723 -112 -647 -707 200 546 369 -567 -456 -225 443 402 441 249 -116 -398 -309 380 545 487
445 487 -164 -622 -199 750 484 -21 -92 -468 147 -238 -133 202 356 -102 -304 147 428 217 75 -244 0
466 0 75 4 68 277 182 -184 -229 -63 258 603 109 -593 49 90 -108 70 102 89 -310 -249 -151 156 533 -16
490 -16 -463 -246 205 16 394 46 -79 0 -76 -156 -72 396 -28 -160 -165 51 544 332 24 -122 -133 -161 -335
513 -335 -187 180 447 -482 -42 266 245 144 -290 -144 19 -16 140 -114 -199 -105 59 -14 171 148 -107 -167 64
536 64 -114 240 234 -179 -359 106 -213 -160 -164 309 39 -191 -42 -73 -39 16 -210 406 18 -348 -1 165 180 164
560 164 -370 -247 89 82 411 -142 113 -62 -64 74 81 -38 151 -73 -258 137 363 198 42 16 -235 361 -10
583 -10 100 373 59 25 -189 105 -6 161 -132 -227 -107 -256 55 -43 -118 24 21 -164 -200 -185 137 -20 -231
606 -231 -127 255 87 248 71 -117 -3 -118 -183 180 56 26 -193 -177 23 58 435 -115 -96 28 270 18
628 18 23 393 -169 -238 -125 80 -111 289 -9 -160 -372 -113 -24 -47 77 146 -155 99 276 368 -39 -91 -205
651 -205 -85 -323 258 -33 -58 -36 196 169 -12 199 340 -441 -219 107 -87 236 -12 -88 -341 111 -78 186
673 186 66 183 -158 22 -402 227 118 95 -53 -195 -178 -31 242 -140 -177 -193 -263 21 430 42 103 -179
695 -179 -3 154 76 50 48 202 43 -154 -113 145 182 112 284 -180 -97 -126 202 30 -17 -96 189 139 28 25 61
720 61 -29 -216 25 346 39 -98 -202 123 59 146 -37 -113 4 -150 221 -138 -236 -41 -142 -156 -162 150 -81
743 -81 492 68 -175 -306 38 -216 43 307 92 119 269 54 -76 342 114 -144 123 50 -53 -211 -80
764 -80 31 -254 184 84 -27 -144 270 94 -199 -130 -110 -52 -25 -264 36 49 -51 43 126 -69 -128 199 -170
787 -170 -49 -45 43 -313 5 -180 54 326 229 -29 79 -204 -179 232 -86 77 -66 44 -53 -118 104 -290 -41
810 -41 -145 46 34 129 -124 -348 69 -411 53 -51 22 -12 -75 -355 52 -188 -108 81 -14 4 -19 155 17 119
834 119 -184 -143 167 -24 -83 66 217 113 -201 -23 451 6 -118 -60 -240 87 42 108 14 -97 -228 -130 -284
857 -284 216 -138 -329 -248 71 69 -97 -142 -118 -26 136 -133 -239 -271 -48 -216 173 75 95 72 -135 -97 -80 68
881 68 -152 174 28 41 -104 160 -303 -5 -130 230 229 109 33 -274 -321 63 -48 -41 29 -90 114 46 130 -312
905 -312 -118 218 -119 -172 38 6 -335 202 52 -12 148 21 6 -122 -80 2 -181 -186 -199 -158 256 -137 210 -199
929 -199 -234 143 235 42 246 -195 54 236 138 -307 53 -95 101 -14 125 -203 89 -7 368 -266 -153 -134
951 -134 -64 62 -255 226 134 -297 -49 -15 110 79 -57 -81 -61 12 199 -116 82 -89 -101 -217 -61 337 -270
974 -270 -52 -36 28 145 -29 127 167 -375 -320 201 -339 148 -68 51 -243 50 163 24 196 -162 195 50
996 50 -25 16 -60 168 -137 -366 -55 107 -86 -8 273 130 -386 2 -318 -339 -63 203 122 186 3 -43 112
1019 112 -157 -140 -154 169 124 10 -209 14 88 -186 459 99 -10 -95 -366 66 -48 63 143 -14 -119 -89
1041 -89 6 -175 92 215 206 -15 -79 140 -38 164 -290 54 -158 -52 138 27 8 -104 -16 -23 -310 -12 -41
1064 -41 -15 -45 320 421 105 257 -302 -46 0 -210 85 240 -27 -196 118 -208 -17 -23 272 167 63 -160
1086 -160 -31 264 64 -238 -339 81 -1 -300 168 -29 -214 125 221 218 -128 59 -78 8 250 -308 -135 44
1108 44 -263 -412 -181 104 168 -65 5 222 -82 -81 -56 -248 -52 -20 224 -43 -39 -130 272 93 -177 85 123 11
1132 11 232 389 -27 210 -77 -195 -98 95 37 -39 143 230 -190 89 74 -322 -217 -259 -2 70 11 46 -169
1155 -169 313 -55 -195 25 96 -14 -4 -28 126 -255 117 -16 137 -83 -99 -68 482 157 -131 131 248 -187
1177 -187 82 -43 -204 -121 -10 -103 -73 173 -355 -131 110 352 -119 77 -73 78 -95 -114 -37 183 93 37
1199 37 -187 12 -119 -194 -161 -151 -14 70 -254 73 76 105 -251 81 368 33 -158 -413 80 165 -257 23 246
1222 246 234 171 -455 -99 -27 227 184 242 122 301 -247 -117 180 120 50 -175 -192 36 81 0 327 -34 113
1245 113 -131 -88 199 -81 -23 44 -71 -233 -190 116 -206 4 -112 -45 243 122 32 -242 -37 213 -13 171
1267 171 15 275 -34 30 273 123 -241 -5 42 6 -46 232 184 150 -173 -106 98 39 0 196 83 -62 101
1290 101 253 -167 -263 -90 56 -195 -9 -124 83 105 296 153 -325 -120 -27 -95 133 132 -91 -124 32 1 -254
1313 -254 338 85 42 -20 -192 -270 -219 -177 166 -120 65 14 -276 -71 312 -153 -194 -121 -54 2 -144 255 -135
1336 -135 -245 -364 -62 83 -54 -207 66 -101 149 50 18 54 178 -201 105 -72 -94 215 102 25 -82 -289
1358 -289 -150 -44 54 137 106 369 104 207 214 -178 229 32 -120 -13 129 -258 18 162 -442 41 -144 -129
1380 -129 40 208 -117 94 84 -239 83 -49 258 12 -142 -6 -3 -178 -113 440 16 -21 156 74 -29 25
1402 25 -70 164 -152 45 -21 -90 -43 268 95 -135 114 -292 -196 -108 -10 172 292 65 -27 64 -102 -66 -24 255
1426 255 142 -118 26 -223 28 -79 -84 -54 60 -64 -205 -121 -313 12 -69 -66 -106 416 424 -11 29 159 14 -36
1450 -36 248 109 -273 193 -127 -225 -75 -14 230 -79 -16 -142 254 -205 -158 111 -123 47 278 43 130 32
1472 32 130 -149 -46 202 10 -100 -4 -117 -77 -126 -45 126 202 -253 -119 50 -221 -169 79 236 -60 -87 282
1495 282 58 -314 -83 -48 81 -114 -29 -28 -120 177 221 342 -116 -440 4 -36 60 346 228 28 8 -87 113
1518 113 149 124 -61 214 21 102 217 -76 64 165 92 -197 105 286 -260 115 85 -386 -35 -70 133 202
1540 202 194 -37 -216 -312 -29 -139 -110 136 -210 192 32 -309 299 214 -30 109 59 -136 29 -81 36 117
1562 117 -223 163 -101 20 68 60 183 -28 -182 -144 54 -226 41 -23 -77 -22 -18 -76 129 -127 94 -404 157
1585 157 -62 -163 -154 65 -145 -115 182 -158 459 191 -243 -243 26 119 5 -368 55 -20 71 -289 -28 190 -73
1608 -73 135 -123 -165 2 120 -48 -57 -267 38 91 142 -149 40 219 -153 -272 325 229 -389 -114 213 -184
1630 -184 107 -157 71 1 146 38 -633 -19 22 -198 -121 67 87 140 -382 -10 135 -91 130 41 84 233
1652 233 151 -51 -203 57 185 126 -127 -24 286 108 87 -352 331 149 206 -217 226 136 -16 237 16 532
1674 532 -266 10 -29 -109 48 -50 -164 101 -13 -258 -72 149 198 42 -227 -225 -325 -99 350 -9 -251 69
1696 69 -30 269 -29 202 -132 108 240 57 8 93 156 -119 -155 352 -148 46 142 192 249 -289 12 -27 148
1719 148 29 -24 -111 42 -55 -62 -98 224 56 -55 130 -113 157 173 -131 87 46 193 210 9 105 -46 -63 -42
1743 -42 -327 -54 119 138 -33 73 18 -176 -176 26 11 -94 87 -35 29 43 -257 -19 -150 -76 -132 -47 -277 -294
1767 -294 56 -417 -35 -66 155 -201 -189 95 -1 373 -250 9 64 44 -99 82 -233 -154 164 16 -277 -31
1789 -31 -109 6 67 29 203 164 -123 -122 -14 5 238 -172 15 167 217 241 204 -81 -198 225 330 190 -201 220
1813 220 362 137 46 261 -70 -214 -117 2 150 94 403 136 -162 20 69 131 26 -201 -414 -213 -199 51
1835 51 159 -92 -233 246 24 -11 57 -60 -471 269 -123 168 -133 165 211 137 -46 -324 183 -159 49 34
1857 34 73 193 32 -243 87 179 56 -268 247 -112 -140 228 385 2 -62 95 -55 78 -148 19 -64 238
1879 238 27 -51 -78 -88 -195 85 -253 63 232 -329 -52 -32 153 -18 -175 76 60 184 46 -296 169 330
1901 330 6 -179 -357 73 73 86 -144 -71 160 -200 25 -170 -302 -47 276 -173 -25 83 25 52 -49 79
1923 79 254 -119 -131 69 -138 -152 -343 173 -69 -67 143 285 186 -201 29 -213 282 -187 -355 -245 -115 60
1945 60 112 -76 129 135 167 -124 -8 -69 44 -1 84 -4 -4 64 -63 -41 12 -203 -127 -98 -230 -218 -100 82 90 -34
1971 -34 -35 -266 -115 90 -25 -37 -226 -143 -239 -291 194 27 280 -35 64 170 109 -42 -155 -236 248 86 -43
1994 -43 181 -25 142 -55 146 70 -169 -29 -40 80 -80 -31 -132 37 -164 112 79 156 -14 134 284 97
2016 97 -101 103 63 -133 287 182 -56 -15 -435 65 119 206 -26 144 222 -338 324 21 -15 -201 -80 179
2038 179 22 -60 -120 -44 90 -42 21 232 -31 -122 216 -333 257 -143 77 -399 -161 45 -66 -149 -37 -165
2060 -165 -53 57 -121 285 20 74 -200 183 70 229 -124 -190 -201 -88 67 37 -86 3 225 -108 77 76
2082 76 76 -127 -123 107 -305 201 -15 189 76 52 -11 -76 38 182 166 -149 -52 -38 -334 -29 -9 -19 97 -97
2106 -97 -77 123 371 -103 -7 -107 -78 104 46 -79 -292 3 -69 304 141 120 22 121 173 -88 110 139 -137 -96
2130 -96 -186 -12 -116 61 -109 -100 46 13 -160 330 79 -175 1 -128 -84 -42 204 63 105 -249 -91 62 -17
2153 -17 -51 280 88 -188 -206 159 302 -52 -1 107 185 8 -96 -5 96 -82 124 45 53 -2 60 -415 176 195
2177 195 -83 -43 50 -49 -34 -213 97 -26 -180 78 -223 24 -252 50 51 -253 -15 -378 98 168 -161 -146 -223
2200 -223 250 -66 -83 107 -133 128 -49 418 -225 -77 -112 32 -44 138 -79 -85 -13 -188 -27 37 299 -74
2222 -74 -80 17 138 131 50 50 -79 51 128 133 99 -17 65 172 0 12 147 191 -188 145 -10 -250 60 -148 -177 -24
2248 -24 -198 -96 -124 -67 -11 54 -123 -307 -255 33 147 63 385 -20 -68 -187 -402 142 -17 -51 89 -41 4
2271 4 -167 361 197 179 345 -110 -197 -90 -138 -272 -124 122 240 -105 -217 -9 -273 127 -370 -33 84 214
2293 214 -155 28 -248 -165 -304 -291 -17 -195 -99 -3 136 -111 -121 339 -144 -54 118 189 14 40 -153 -148 -285
2316 -285 93 274 -112 -150 196 -9 -41 180 13 -93 -66 -56 42 -1 -5 94 144 -195 -283 -123 161 75 -33 100
2340 100 -31 -152 -424 -360 -50 164 204 283 -6 -120 57 -133 -146 65 319 93 -168 -90 -23 133 -301 166
2362 166 -173 48 49 -138 -18 -201 -42 39 -354 110 85 -224 -109 -234 -77 167 176 203 -105 -243 118 80 273
2385 273 -22 -10 77 113 47 -32 -1 -42 318 109 14 161 -70 -53 29 -72 107 -164 68 74 102 412 -6 69 -73
2410 -73 170 -117 50 21 -63 -34 63 -101 93 -5 -73 -207 66 -64 143 119 -120 142 32 -158 208 52 -387
2433 -387 115 266 -200 -103 -63 -7 78 -37 -214 -19 -145 154 155 155 102 -283 141 51 -228 -334 -144 48 171
2456 171 8 187 488 48 -30 101 -138 464 -19 -281 190 -152 307 -316 73 -267 -34 55 196 30 -242
2477 -242 -46 -258 79 28 49 -106 -24 6 -94 -359 40 -50 330 -221 71 309 -123 76 266 -17 -35 -41 262
2500 262 -106 93 77 -127 -12 217 351 521 -347 -522 -57 50 171 -67 -146 -247 -112 -193 50 -66 67
2521 67 54 22 -77 134 123 -494 -203 -142 79 49 -139 128 220 138 -120 -235 -19 -226 -29 159 207 249 -52 141
2545 141 77 27 -301 -326 123 -23 321 -141 28 130 3 -139 -210 187 -223 92 -68 -52 -47 26 -181 -260 173
2568 173 129 63 0 -183 33 27 -77 -281 -70 -105 447 126 -212 24 -65 166 -43 74 -103 -2 195 8
2590 8 171 -70 -211 195 83 -159 -208 216 24 17 264 -311 -163 136 153 -36 4 -180 -101 47 -23 47 75 -60
2614 -60 -168 -152 115 -428 206 -170 -146 134 -226 61 182 -11 82 -263 -89 175 180 -246 -287 58 18 -49 -84
2637 -84 -60 86 -64 -37 128 102 -16 30 67 146 -106 -55 202 -313 67 241 -13 461 46 304 424 36 63
2660 63 -5 -140 257 -164 -194 -69 -73 -108 -93 -38 -154 12 -10 -422 -72 -87 18 -328 77 180 -82 214 -102
2683 -102 -326 58 -345 4 433 12 -57 44 -252 -156 -326 -174 25 -172 245 -216 227 -324 -421 -38 -60
2704 -60 -27 101 -248 171 4 52 268 -207 -48 145 -284 66 185 19 282 -169 228 -80 -119 262 107
2725 107 230 56 92 25 379 137 116 95 31 -314 23 13 4 -245 132 -113 358 105 -326 -37 432 38 -78
2748 -78 182 110 75 159 -79 -109 -7 -64 7 17 -28 -211 233 151 41 65 119 -188 -132 -58 -404 -42 9 -212 -65
2773 -65 113 257 -160 216 301 -121 29 -295 157 -106 142 -157 236 -277 145 -97 -126 91 365 39 -97
2794 -97 127 211 -192 92 -175 -387 -16 230 317 143 -41 23 -241 -259 97 -50 -21 177 -193 -41 -140 -97 -191
2817 -191 -301 -25 -221 -5 -59 -89 102 -116 -106 -27 115 10 -137 89 234 47 150 -79 -191 -39 -126 14
2839 14 -53 -21 -37 55 299 15 -58 -183 -62 -236 121 -30 -25 172 -25 250 273 -78 -95 162 37 264 -423
2862 -423 -148 -118 -93 269 -355 0 127 -163 91 -128 161 0 87 -66 -8 146 323 -198 -23 -163 47
2883 47 256 44 226 142 -320 -73 221 214 -178 -329 188 -234 -81 225 -30 -208 98 -54 92 -42 -82 -357
2905 -357 53 -111 -106 -242 -117 -168 9 263 14 -73 -39 129 -304 365 -173 137 233 -241 -179 139 -246 -63
2927 -63 75 246 126 37 149 51 75 278 -158 175 -126 -136 170 110 -74 -180 -209 -85 38 67 -107 58 -36
2950 -36 73 277 228 -104 45 -137 -169 40 29 -37 42 8 162 -165 -228 392 -106 14 -132 -187 332 112 496
2973 496 259 264 78 110 53 -5 -47 216 -218 -228 -2 -79 111 -17 -131 -73 77 110 57 -153 -184 251 -33 -16
2997 -16 107 -31 22 -44 136 1 349 272 211 172 313 131 -106 -208 -121 -178 -258 -156 223 173 23 85 -461 88
3021 88 31 213 -287 396 -168 -29 -86 -12 -37 -133 103 110 3 -3 9 112 -264 -148 -11 -248 -128 -153 -161 -6 275
3046 275 15 -299 133 164 -285 95 -39 -38 -153 1 -177 -183 81 -232 248 16 -151 41 -201 -31 63 -27
3068 -27 65 -326 209 -210 -44 169 181 -213 90 356 -576 73 -117 -38 50 140 124 174 -277 -39 -43 237 255 47
3092 47 153 -120 -55 -91 264 421 -222 147 62 124 -12 -32 374 148 -290 48 -293 -92 25 -388 50 87
3114 87 198 223 -39 -127 300 32 -57 251 -190 -90 133 111 91 63 -32 139 -46 -345 -63 -89 138 -193 -166
3137 -166 -250 -57 76 263 -222 -75 -82 372 -295 -307 12 71 -17 28 153 -187 -42 90 -182 312 -90 -170 33
3160 33 329 -111 -278 297 -42 -47 128 -81 140 -93 -197 133 71 -107 153 17 -45 -3 -92 8 -192 -136 -9
3183 -9 208 263 -616 -138 25 -41 -15 -73 174 100 3 -141 61 583 42 54 360 -195 -16 109 156 3 310
3206 310 -170 -108 195 -162 106 130 -123 24 -31 37 232 -50 332 534 291 507 43 292 -130 1 269
3227 269 -330 54 31 259 -206 -337 -267 165 -142 171 143 409 -3 50 26 -52 -4 145 198 80 46 -94 -224
3250 -224 -141 -18 136 -139 -87 144 94 197 146 38 -125 -105 -13 133 91 218 -155 -127 -74 90 -403 155 302
3273 302 385 171 393 227 -331 -145 128 -329 36 186 -126 194 164 -178 119 137 -243 344 -95 164 -179
3294 -179 17 -455 -47 30 -35 231 -116 -43 145 130 -92 50 5 273 224 165 169 -283 133 199 136 154 -22 -103
3318 -103 191 70 -19 1 -120 33 -206 62 -70 74 -42 231 -122 -267 19 -69 126 -294 -136 -20 166
3339 166 306 218 256 51 100 -101 -240 287 262 -41 16 -40 24 90 166 261 102 84 305 75 -9 309 -41 91
3363 91 -93 -133 104 -103 19 -85 38 -18 -109 -79 24 118 193 -22 -58 207 57 39 -129 194 28 -279 46
3386 46 306 107 399 71 -295 -187 -97 -43 -207 -74 178 -127 84 -114 -123 27 102 -66 -195 -83 -203 -82
3408 -82 -71 -145 -278 -12 229 -113 57 21 106 -291 169 15 -98 68 -5 133 -41 313 -25 -25 17 26 88 -91
3432 -91 -281 -175 120 49 126 61 289 144 202 3 -210 -59 -39 -265 -10 84 73 137 -65 11 -212 -134 214 62
3456 62 -29 113 23 -141 -57 87 -29 91 97 -44 82 90 -227 -462 211 103 37 -270 39 -53 123 115 -136 13
3480 13 -319 4 133 32 143 -14 -104 24 -141 57 -91 -141 118 79 -201 136 -225 151 362 -100 -16 -31
3502 -31 -397 -107 -22 -130 173 97 -177 -29 -9 86 -240 30 -337 -257 257 -135 -10 -22 -26 -8 -59 53 -248 226
3526 226 141 -341 164 2 126 -84 44 -19 316 -19 90 48 277 -181 -112 -11 63 201 24 72 -179 388
3548 388 17 -172 162 242 165 -159 3 71 -209 52 142 -211 194 316 -530 101 -155 120 243 195 137 -25
3570 -25 31 29 23 225 -125 17 27 -2 -374 236 -18 -217 27 154 -155 -159 -39 297 241 63 -205 -134 -9 1
3594 1 -175 160 -23 -52 57 -120 66 -19 -16 174 -40 310 85 80 9 -138 247 112 -128 -161 166 -225 -118
3617 -118 -56 56 140 -44 -197 -89 314 91 210 -59 -190 160 -79 -234 322 150 -14 240 0 -227 134
3638 134 77 31 115 208 -94 219 10 93 -273 -104 68 -43 88 -72 235 -123 -78 59 16 63 -353 40 -60
3661 -60 11 28 15 191 146 -93 -109 58 27 228 -109 -216 247 -27 327 140 43 -166 132 -163 -186 -187 157 187
3685 187 35 18 -13 5 -156 47 74 -35 -64 266 -168 -8 -187 -178 -120 260 -226 -92 -237 -22 164 54 -179
3708 -179 -275 -232 28 -20 153 -144 -25 135 -239 28 51 5 138 33 -165 -58 -95 -32 60 287 -44 -221 118
3731 118 -133 10 -182 -42 -160 58 100 -18 -19 16 -79 105 -62 -150 304 186 -154 -12 490 54 -366 343
3753 343 154 236 336 156 77 -13 3 133 13 -203 337 -168 401 -102 26 -158 -57 -86 -48 -260 -172 344
3775 344 -11 -177 -108 25 -250 -102 -112 133 62 154 6 -127 44 -12 186 2 -219 -33 91 -191 215 -70
3797 -70 432 -277 -49 -277 -112 -8 308 -226 -125 181 128 -40 44 120 42 -154 -64 218 37 -53 -88 -43 56
3820 56 418 -73 -127 -99 35 -35 196 -203 76 353 -157 -105 -193 -119 -142 166 -97 131 279 -40 10 -61 128
3843 128 -29 -118 87 98 -102 28 -84 215 170 -104 -317 -30 -97 28 19 -27 -84 0 -267 243 139 -97 115
3866 115 -11 -43 299 -215 -47 201 -60 -65 220 -144 302 -201 -164 -261 -146 -254 -85 89 167 -20 -70 -69 -172
3889 -172 334 -206 85 12 -70 -166 -125 236 188 -1 -155 -187 101 122 -39 -15 -26 306 -16 104 61 57 34 89 91
3914 91 -241 63 168 -43 115 88 -119 82 55 -232 -133 198 82 -159 -39 249 -117 263 298 0 315 -95
3936 -95 317 -164 -131 -47 156 -162 -37 -197 57 279 -103 246 -96 -102 -26 -132 -90 48 -89 247 -242 -83
3958 -83 85 -262 40 223 196 350 -121 155 -81 225 82 44 80 -122 64 -38 143 -40 61 -42 79
3979 79 -166 -239 -65 148 288 114 70 -105 -9 86 101 97 -316 95 159 133 36 -262 -67 -82 -126 61 37 22 0
4004 0 -172 150 12 97 -289 178 -94 326 181 15 103 76 48 -145 -240 -4 -74 -81 -45 30 -131 413 40 -9
4028 -9 151 40 107 13 -67 59 166 -5 103 280 32 96 -29 -55 55 182 152 -161 70 25 381 -81 66
4051 66 1 146 25 347 -3 124 -28 -131 138 -127 29 -381 -231 -129 283 -126 266 147 24 70 121
4072 121 -34 336 79 -92 217 -155 -131 190 24 64 118 -148 90 274 -45 -97 -15 187 7 -36 125 307
4094 307 -160 -27 122 -166 -89 -122 27 -233 136 308 -66 82 109 367 191 -123 15 -186 -83 -129 -138 -49
4116 -49 103 85 -216 233 -201 145 155 -79 -194 -111 -244 -6 289 -125 90 133 185 -135 85 -179 192 10
4138 10 72 240 -96 -226 -122 -259 154 -324 140 -244 -110 -23 152 152 -63 269 -96 174 -170 356 111 150
4160 150 -19 146 -72 -130 -103 -31 -31 -218 -173 94 -18 77 105 98 -10 4 -63 -232 -123 78 189 -32 -315 -116
4184 -116 -29 -161 158 -61 160 307 -113 175 -62 -17 -65 -159 -41 -122 -41 -33 -387 169 137 -121 -117 311 351 -262
4208 -262 252 91 -35 385 26 112 76 218 -205 -61 65 352 140 -23 -149 156 -62 -45 62 -46 -268
4229 -268 18 291 114 201 -274 -79 -67 21 156 157 109 -10 -308 168 168 73 -12 210 -153 8 -86 109 -51 -25
4253 -25 33 -171 57 -182 249 -208 -26 305 -154 139 -147 -89 -169 -84 265 4 107 167 -191 -43 57 -107
4275 -107 -236 -123 -145 66 67 105 -97 290 267 -62 -147 -154 246 -260 142 -209 -41 -109 -41 -67 -212 -119 -26 131
4299 131 127 -203 155 152 -11 12 -245 -260 -68 121 298 -236 -416 142 -67 206 248 34 89 263 21 -63 -199
4322 -199 -113 46 -146 -25 142 27 526 274 121 -57 -228 -84 -8 -114 -1 81 -38 -92 268 41 187
4343 187 -103 77 -14 -168 -17 -182 -288 0 152 -229 -19 15 -77 -174 78 300 -49 -139 -40 23 -51 44 316
4366 316 -73 -181 207 -140 235 89 86 -224 94 160 228 -56 -364 -135 -92 99 89 53 -123 -20 38 101 335
4389 335 52 -48 77 34 317 -135 215 41 373 183 94 -225 26 69 -106 -13 153 0 140 150 304 -13
4411 -13 -352 268 1 174 73 144 147 -62 -122 211 255 59 67 108 57 33 73 83 261 -163 -103 52 282 149 9
4436 9 -61 72 133 -68 1 -66 59 -189 49 -59 -37 139 4 -106 74 -264 50 272 -46 -40 -340 -89 86
4459 86 140 18 142 -104 203 -270 -164 106 -63 -275 -111 28 -9 -204 -9 -168 121 -114 -224 -214 -65
4480 -65 -138 -86 -153 -18 -51 57 236 -318 197 -7 -2 59 20 -133 187 103 -102 52 -64 -138 250 151 74 -22 102
4505 102 -229 -184 9 -97 24 -242 -41 130 187 -23 -475 -119 157 -403 17 9 -73 -160 -71 44 257 -47
4527 -47 189 1 -38 -267 19 -208 157 224 201 338 -235 -88 65 -40 66 112 -33 28 -252 137 38 77 -22
4550 -22 23 14 292 92 196 66 -80 25 -86 214 172 -138 -76 109 87 -194 -348 -89 1 36 118 204 12 238
4574 238 128 185 -260 199 -41 -25 135 67 -168 -69 8 -148 -284 172 -189 -68 109 -482 -27 90 -93 -102
4596 -102 75 -41 82 -47 -73 386 121 54 299 -303 -88 -53 182 34 118 -39 -350 2 26 -227 -179 -84
4618 -84 103 -70 125 -53 -159 90 -86 205 -197 -75 -119 -137 169 -128 175 66 146 52 275 -189 35 -260
4640 -260 -166 88 -198 -35 -33 84 -118 -48 -150 106 126 10 -40 -39 -335 -22 96 -11 101 -243 -173 190 22
4663 22 -6 71 112 -145 82 -66 -119 2 48 -12 -403 -86 -193 -217 -140 -173 267 -528 -32 121 4 -176 -36
4686 -36 10 -528 -71 -225 -285 -31 -83 -124 276 68 418 73 -20 -47 -54 132 68 -368 -206 -125 -252 66 22 -200
4710 -200 -69 -68 37 136 -139 -203 -153 73 135 80 -103 -340 -24 -123 190 -15 -66 -85 59 42 252 288 368 -40
4734 -40 45 77 70 237 -243 -172 153 -161 -127 53 -82 -64 46 146 368 -96 -165 -202 -188 -338 222 182 -11 -194
4758 -194 -238 39 48 -166 116 -200 -319 -153 123 96 -292 -41 166 -10 127 45 46 -174 -113 -279 91 -140 -92
4781 -92 -27 189 -1 -343 -186 68 -86 149 62 -55 359 -237 42 372 11 311 116 -195 -13 -90 -49 254
4803 254 -7 -154 298 -191 88 -171 78 236 -186 -12 103 289 -5 -160 -107 137 -347 303 62 274
4823 274 84 169 265 104 173 -187 182 -242 37 -40 -52 47 -5 -155 106 -220 340 144 116 99 -144 -70 -64 91
4847 91 429 128 -99 6 -261 286 74 -6 191 139 -81 -51 -82 80 6 -35 -207 97 293 101 -271 -290 217
4870 217 -134 -162 20 37 -96 -296 -101 320 -237 -241 -19 206 -140 37 -166 174 -23 180 100 -65 -57 -39 -86
4893 -86 -98 84 -84 149 294 -27 -271 170 56 79 -37 33 -378 208 -6 99 212 213 -8 157 46 -124
4915 -124 -116 -52 -211 25 -253 111 41 31 -42 -68 5 179 185 211 69 127 146 -223 -182 -227 231 -63 138 60 176
4940 176 82 30 -167 33 -29 -19 -56 -17 -55 -304 -108 177 -171 166 -182 -136 206 21 -133 -362 -210 -29 -184
4963 -184 -281 -50 -22 -105 -164 -90 347 227 -530 144 28 157 109 28 206 146 174 -204 -22 -78 -98 -95 92 12 -265
4988 -265 69 53 357 -145 47 -158 80 129 -341 -235 -127 -72 -29 3 -286 -127 11 -204 -124 -118 24 48 27
5011 27 57 -139 -87 -88 -132 192 -178 -145 -49 40 -23 96 162 20 -144 -214 -75 -99 426 459 49 145 213 -4 -206
5036 -206 156 92 -238 -171 243 -453 16 -61 -122 -158 78 -97 40 -152 119 235 -446 9 -32 275 -253 119
5058 119 -210 -29 -56 118 78 -11 -54 146 185 -176 217 99 117 -244 -206 16 175 61 81 -64 -242 170 156
5081 156 75 81 -76 44 397 -59 -95 -30 -9 -91 -311 3 198 76 -140 5 9 159 191 -48 -108 392 -34 71
5105 71 -131 289 -88 -256 88 120 387 138 0 137 -109 -112 -19 -78 -119 44 325 127 -231 11 -84 184 -61
5128 -61 93 -31 90 32 17 -150 54 -222 -80 -17 -28 309 -231 85 135 78 -19 109 -53 111 -104 -108 85
5151 85 37 -114 -239 5 56 -371 2 -78 -108 333 117 175 75 416 173 248 80 -48 -142 -196 -56 -154 -87 -241
5175 -241 -231 123 176 90 -66 -178 109 -18 -45 -87 -307 -206 211 -2 12 290 198 166 -2 52 31 45 2 336
5199 336 57 -27 -46 -155 67 -181 122 -47 -36 214 -359 -141 -11 182 108 320 -41 152 -227 -112 -60 -197
5221 -197 37 23 -324 -149 25 179 -14 -20 -171 -25 -61 -198 362 -152 200 -74 -67 103 -106 -30 -161 44
5243 44 -114 -117 -36 -105 126 56 -82 -42 -1 -134 -359 -78 119 -105 -193 87 -99 -103 130 76 -178 -218 -166 -54 -328
5268 -328 75 96 143 57 -117 455 -31 -214 70 -114 -163 -332 78 -87 -444 125 223 -57 2 80 186 -238
5290 -238 -186 190 185 219 -223 -79 -312 351 65 15 -162 181 146 -125 319 28 -7 -189 14 -330 -116 -167 252
5313 252 35 75 -120 -295 52 60 -65 -109 -14 128 31 -55 -135 170 -71 90 42 137 41 242 38 210 -11 71
5337 71 -99 -137 256 77 275 125 97 31 41 -71 -9 328 -97 13 33 24 -53 268 345 -216 -45 -184 -128 -278
5361 -278 -169 -98 -67 -95 37 -36 161 11 56 -64 222 291 -133 -35 -37 -333 -200 258 -160 -157 -83 101 -239 -13
5385 -13 -31 -345 -134 -16 187 161 59 52 -28 217 10 -122 71 -348 48 92 116 -86 -15 245 234 124 123 45
5409 45 84 197 -142 -35 -187 -8 -160 -114 -241 163 -2 147 320 211 -37 12 -271 -258 91 76 63 -333
5431 -333 -32 119 -195 -244 89 216 151 173 258 -117 33 -8 -91 173 -146 -363 5 -197 49 -79 -152 -121 42
5454 42 270 57 286 46 84 -2 137 33 28 54 158 37 -40 -9 227 416 -41 71 122 -180 28 134 -122
5477 -122 -107 -168 236 64 -47 -74 38 231 26 -175 -180 -11 -240 -59 -281 -18 100 222 108 214 327 186
5499 186 27 142 47 -55 123 -181 91 -61 81 150 -93 -7 11 -37 -27 -57 122 64 -88 -374 118 142 483
5522 483 30 -82 5 -43 -71 55 21 -116 327 -43 70 183 -193 -156 141 122 -20 157 -20 50 34 -114 -136
5545 -136 51 -271 62 -174 -86 337 -82 209 -11 -154 -289 -32 48 -90 -156 -108 70 -8 -177 -235 -71 19
5567 19 -208 140 293 -1 238 -340 -117 86 -181 -203 -99 -105 -270 -172 48 181 -317 160 -90 29 275 -4
5589 -4 23 -62 -193 -125 -333 149 123 -148 -55 53 -63 -95 67 142 119 32 47 -47 -110 -164 -140 114 14 224 -98
5614 -98 -180 -61 152 -131 -30 30 256 -119 -218 328 280 72 -208 51 -64 -124 -144 -1 31 -93 167 208 -232
5637 -232 -53 -27 -266 -62 84 358 162 -57 36 -106 69 -145 -104 -348 86 -117 -462 114 -60 288 122
5658 122 -203 122 -147 78 -235 170 -349 147 -239 -9 136 36 51 -193 -58 -258 -20 -59 267 130 120
5679 120 141 -190 -277 -212 293 43 -82 -168 361 25 45 -1 -407 78 -54 -61 16 133 -251 -244 88 11 -11 -165
5703 -165 -139 39 59 258 -49 -261 138 -129 128 247 207 -66 180 42 -17 -298 -122 218 63 189 -220
5724 -220 3 26 -323 44 -20 -184 -57 170 -95 106 6 311 -94 237 -32 -92 127 213 123 220 5 -153
5746 -153 -129 -68 -106 -121 46 -148 423 293 -326 121 85 -239 202 -11 366 -67 -163 222 129 148 -52 -114 309
5769 309 71 170 275 -22 -132 162 220 244 -92 163 86 100 289 18 80 -196 -347 228 -273 -238 -54 -189
5791 -189 -48 76 -25 -34 156 -91 118 -95 85 -57 22 99 46 203 -115 150 216 -216 -105 177 -145 163
5813 163 73 -137 -64 -292 70 -86 -33 145 -36 -73 -96 43 -79 -17 26 -153 -27 30 -314 -79 36 239 114
5836 114 47 -15 410 -167 193 -28 -43 64 291 100 -54 -39 56 282 -346 289 -223 -32 -78 -179 -71 208
5858 208 1 114 275 46 -112 -17 -152 -28 347 182 322 27 -368 -71 115 26 -271 25 -130 183 4
5879 4 18 63 138 -171 -200 353 11 -121 33 -34 58 37 -73 -206 -209 225 123 24 126 -162 11 -143 167 -132
5903 -132 -85 -104 -28 124 237 395 119 240 -135 178 -73 -1 -94 -221 49 -54 -163 -6 133 -312 261 118
5925 118 -93 -79 245 7 88 -115 -13 -100 325 -164 -236 168 65 141 -57 -344 -101 324 36 127 -106 51
5947 51 -284 17 185 76 -93 -190 -47 -84 37 72 -24 18 -211 -127 142 64 -278 333 342 -259 -115 -121 -108 -366
5971 -366 -336 38 -245 358 -58 -27 -129 -4 -221 156 107 107 53 29 -196 -79 -249 -327 414 261 -152 -75 -122
5994 -122 118 -66 92 55 -216 -383 -219 -86 -160 -99 -113 27 -7 -54 -125 -150 -139 -105 354 -4 -283 -83 -1 -38
6018 -38 296 -414 6 -325 -86 207 137 -130 -27 249 294 -192 -96 -26 21 84 -38 251 46 -82 109 323
6040 323 -98 335 51 146 188 38 219 -42 20 -18 10 49 -25 -29 14 -95 -6 -13 -101 -91 45 219 -76 -285 -13
6065 -13 9 -166 225 -232 -98 48 -178 122 -2 -19 -225 97 -142 164 255 -346 353 -203 87 52 -199 46
6087 46 -223 -341 23 -104 -119 -68 48 -170 162 74 247 -44 34 -208 -211 -156 181 96 142 221 -210 -55 151 -115
6111 -115 -113 361 89 110 20 -22 248 21 202 -141 216 -94 236 -124 149 -312 153 187 211 11 -49 -16 -227
6134 -227 -407 -540 -119 32 -4 14 -179 157 -38 -16 55 16 -118 -159 -170 113 478 -2 -9 316 -147 54 -67
6157 -67 -81 90 127 -125 -264 225 -145 -181 -73 23 -166 171 -23 -137 -31 304 276 -193 245 -92 -94 111 59
6180 59 -84 301 -146 43 -157 430 98 -170 -236 28 -122 -127 3 55 -102 -18 -18 -48 5 -36 -143 194 -10 77
6204 77 -148 118 -14 153 -129 -41 92 -97 117 -101 -150 -34 -273 -132 -240 220 3 -92 5 238 4 65
6226 65 -81 40 -179 19 -172 68 315 -210 -94 27 134 -349 -211 -60 -183 -13 122 1 257 -179
6246 -179 16 47 -40 -126 -154 19 130 -255 -200 62 91 352 199 232 2 54 -303 77 86 -223 -237 -20 -19 -50 -341
6271 -341 235 -91 -8 646 255 184 135 -182 110 -254 -171 106 101 -105 -222 -13 132 120 115 -132 -327 -192 52
6294 52 13 42 -137 -57 -87 87 38 112 -177 -6 182 -225 209 -49 -302 193 -143 -161 75 -217 -68 82 -109
6317 -109 -177 23 -68 22 78 -81 93 -89 136 160 -67 -221 1 -122 -178 -169 -89 -69 -200 200 216 -158 53 -127
6341 -127 5 -149 -369 109 128 101 -49 -199 -75 154 25 13 -276 164 -150 -213 -59 26 10 78 -92 -157 497
6364 497 -109 114 23 184 59 81 -483 -6 -34 7 -83 308 -59 -162 32 -183 -200 211 -106 44 -22 -232
6386 -232 -17 -4 9 -110 -148 81 79 -88 303 -110 135 -82 -203 45 123 11 -215 -146 9 -2 -74 -112 19
6409 19 189 -98 205 -140 32 -118 133 -7 -24 11 379 63 8 -35 -143 -369 162 220 -77 226 -216 183
6431 183 167 204 -9 4 166 126 -329 137 233 -113 -124 133 18 117 238 -213 -256 9 77 51 223 39 15 -119
6455 -119 107 244 79 -66 215 107 -357 256 177 99 122 -176 -60 130 -123 -65 3 -285 144 -7 57 122
6477 122 -26 -17 112 -470 -46 101 44 -128 214 106 193 -46 168 -135 33 142 3 225 -367 -106 -123 -28
6499 -28 -74 -40 -179 -177 35 13 -177 220 209 71 -5 -14 251 -110 -171 -106 -372 -117 140 193 -20 228 30 -36 -81
6524 -81 17 -264 -122 -30 -412 -48 -20 -128 -289 -114 151 105 189 -139 42 280 -90 143 -78 84 -21 184
6546 184 21 -23 180 -139 114 221 -22 218 161 -24 -34 139 -66 14 264 4 -112 -119 119 -44 124 122 -43
6569 -43 96 -156 -115 96 -174 23 243 70 54 64 -155 -122 -320 -234 -165 -108 188 -128 -183 -286 -86 -235 -26
6592 -26 -139 56 121 -36 -52 258 79 359 -135 -16 135 -28 23 -64 8 64 -182 2 95 156 51 -173 51
6615 51 57 279 -4 -44 15 -35 -81 -31 202 210 45 -162 -67 112 112 174 -80 -74 -10 -36 136 262 188 -95 -13 181 5
6642 5 39 -92 234 -13 -112 -102 -57 -4 -44 -166 -60 -80 -92 228 -46 -13 -63 -31 -191 13 -166 26 -74 -300
6666 -300 170 -70 -84 152 82 -296 -94 5 -127 248 237 -109 -197 -229 347 77 -217 -12 -24 -128 93 -25
6688 -25 -69 -38 -89 265 1 4 -67 -203 8 24 24 -157 -60 264 108 82 151 -173 -218 17 242 -474 300 -63 198
6713 198 76 -87 59 125 236 -313 -202 125 81 -118 -552 39 260 34 7 60 -185 120 -204 43 -41 112
6735 112 -5 -1 218 51 11 -127 324 -120 127 -183 281 -10 -118 -179 -66 -327 -39 -81 14 182 53 -61
6757 -61 229 27 93 195 -228 -278 113 74 30 35 165 -49 263 -100 -75 185 -3 189 129 103 -70 -134 -190 140
6781 140 -67 -29 128 -33 187 -166 50 -123 -5 -121 118 -40 177 31 257 411 65 157 108 -257 103
6802 103 -453 333 106 36 180 -3 240 -270 -136 -16 -441 -292 -129 -434 23 337 -147 230 -88 -47 25
6823 25 -73 -228 -81 -1 -136 -127 -308 -87 -59 135 -40 -102 99 -557 -196 122 75 90 143 9 -213 243 -239
6846 -239 63 -163 -253 84 -107 -351 166 -65 363 -79 7 7 64 0 -179 62 155 105 4 104 -54 375 231
6869 231 180 138 54 70 12 -15 -75 337 68 -2 -84 -118 -143 226 -465 34 97 238 50 102 132 135 252 -158 183
6894 183 183 360 -245 56 37 156 -110 -470 -135 343 -118 118 -65 -45 21 -200 -391 -94 265 39 -282 85
6916 85 104 -144 45 363 -72 -121 129 -99 -91 -40 29 1 -312 -139 28 156 278 109 108 202 231 94 -129 59
6940 59 94 -42 11 86 -70 75 101 -48 -228 138 -150 54 114 -182 -334 93 -72 -38 375 63 77 -88 4
6963 4 -104 -70 -52 48 43 -122 20 6 -72 291 36 470 -298 -182 100 -74 29 -28 19 -141 -248 -267 18 -99
6987 -99 -78 270 -187 -99 -336 321 139 -71 345 -61 204 146 271 -131 58 139 226 370 43 32 -55 155 -80
7010 -80 89 -82 73 -67 192 30 -262 -225 -98 -271 28 73 -241 -96 -26 193 278 45 -146 179 -15 159
7032 159 72 -84 70 51 14 -128 107 59 -182 -70 -234 -101 255 -23 21 84 -2 -299 -218 -114 50 -130 19
7055 19 -230 -126 120 -53 -170 -121 -274 -20 -124 -38 -87 -130 -137 -343 -21 -307 -288 -95 176 20 -22 -45 84
7078 84 -158 73 87 -180 136 87 129 -247 12 -208 -72 13 -138 -24 128 -373 122 153 252 206 24 318 84
7101 84 198 162 -342 -325 30 -41 -5 100 -249 -178 -39 -94 96 -40 61 161 -53 -121 -36 -211 110 -56 8
7124 8 -71 18 -225 80 103 43 110 59 -227 -5 -211 43 49 41 -185 72 29 -78 154 88 77 -71 77 -191 -38
7149 -38 -94 79 210 -87 111 290 81 -53 -61 5 -26 -10 333 -73 -123 212 34 -226 294 -89 -377 160 -13
7172 -13 -12 93 -4 -198 20 53 57 95 122 -124 153 -40 117 -144 -193 -33 225 -23 -310 -295 -116 199 128 32
7196 32 -31 -96 25 48 16 -254 -87 -5 -252 -132 -50 -136 211 -91 332 -77 -119 -305 -2 61 37 189 290 131
7220 131 -251 -12 -216 193 269 107 141 -328 57 59 131 -45 -82 -184 -76 -86 -206 252 -39 22 -22 -276 -99
7243 -99 41 -97 -11 -187 -166 -132 111 -330 213 -23 -357 122 -209 -351 -115 190 -254 -66 -124 -54 161 -285
7265 -285 -218 -226 -84 -148 130 -27 -75 33 24 -81 -250 -38 275 9 -107 -55 -145 56 -231 5 -353 117 -135
7288 -135 -232 -133 -42 -101 -78 163 -203 -177 -28 -74 -152 375 143 -24 -97 163 21 -54 -98 -127 43 -191 -92 97
7312 97 -80 -229 6 -198 -182 -189 236 29 -116 5 -127 -117 11 -35 311 -88 321 330 135 -169 -170 -350 -150
7335 -150 -148 206 76 159 89 58 -81 112 322 -89 -4 -117 196 35 -341 -185 77 202 -94 -82 -201 24
7357 24 187 -59 99 249 40 38 92 -155 -168 -235 -169 -61 -39 -41 -228 -75 -52 371 -73 149 34 34 -211 -143 64
7382 64 298 480 -263 71 -100 27 -45 47 40 259 -294 -20 -29 -14 289 77 111 80 -121 -144 65 91 -101 133
7406 133 152 -87 161 -366 75 -53 53 -124 -49 0 105 73 -118 -1 10 107 -281 -124 -296 207 259 -145
7428 -145 89 -79 -174 -50 -31 -170 -69 171 122 -116 -440 -184 256 -39 -156 -227 -131 119 -330 -136 249 -124
7450 -124 -199 348 -16 -77 -16 -223 -202 -130 -278 63 91 249 -134 349 27 16 127 72 99 70 108 -142 12 176
7474 176 -308 -19 79 -120 281 -10 -244 -73 -130 -401 42 79 97 -31 74 -115 53 -119 149 -28 -100 -238
7496 -238 -186 -71 15 -183 214 341 82 3 -220 389 -60 -2 -201 -354 23 -259 23 103 66 315 -107 345
7518 345 145 -153 -60 -116 133 300 126 92 349 184 299 61 77 -88 111 186 -105 -50 -415 252 -111 -61
7540 -61 20 -10 -28 62 208 105 40 180 -279 -144 31 -271 -179 96 146 -157 -178 125 119 -217 228 -78 26 -131
7564 -131 43 34 -155 149 -49 37 -78 -147 226 198 -282 69 200 -10 103 92 -20 290 -200 -208 254 62 -330
7587 -330 85 177 -98 70 177 277 140 104 136 70 180 -349 -21 -75 250 -52 -209 -134 -27 237 21 -27
7609 -27 -228 -172 44 -53 62 212 -95 5 168 -100 9 78 126 -101 -65 -165 104 70 -160 82 -175 -19
7631 -19 307 -120 -246 355 -103 -114 -146 -57 -91 10 -201 -190 183 318 52 -239 259 73 -90 147 51 -346
7653 -346 -187 -261 138 -28 76 -174 -202 -164 64 48 40 -276 -75 147 39 114 309 -129 -165 117 -27 103 -254
7676 -254 -172 69 112 -110 111 142 -39 -147 86 40 -286 -29 64 49 -29 -55 -147 273 174 -229 147 -143 -209 31
7700 31 -115 -135 -270 -24 -236 14 -108 -417 174 -95 -398 -73 158 9 -20 -26 55 241 283 155 100 -343 -5
7723 -5 -11 -273 36 -161 54 -46 143 92 -70 210 -47 -118 -65 -7 -350 -265 76 -89 36 -190 280 14 -39
7746 -39 -295 -93 -140 96 164 171 123 -243 46 -155 190 -79 125 82 85 184 -320 81 -211 2 -104 310 -260
7769 -260 -21 160 134 -118 -251 -181 -50 -138 -120 -240 -195 148 -232 -277 212 -164 45 16 -86 -12 -188 -107 -131
7792 -131 -35 -155 351 -104 -18 -9 -190 89 -270 225 57 200 72 -57 -108 -163 -75 -79 -106 -120 -147 -206 86 153 -133
7817 -133 -135 -184 -153 116 118 -102 -120 -156 -21 -249 -26 180 -14 -59 430 -253 132 5 -127 -126 -243 -156 -32 12
7841 12 261 -80 -256 48 -25 -84 192 320 169 -237 46 24 340 -11 -70 148 -163 89 170 9 -97 439
7863 439 101 338 68 105 20 36 -112 97 -115 97 -143 311 222 -160 8 52 -37 43 54 -81 70 220 -130
7886 -130 -112 -137 -52 4 3 -29 118 -200 -191 281 -164 -115 -115 -15 -105 -17 -9 -233 8 -28 51 35 131 -207 -212 -243 -55 222
7914 222 -288 -29 136 30 -218 126 156 156 -55 -97 154 50 -401 -236 -54 -99 -19 -72 178 18 142 87 -456
7937 -456 -125 -196 -100 -24 306 230 115 322 36 -57 -140 119 45 -343 -66 -1 167 -207 494 88 36 -144 92
7960 92 -103 -65 26 320 -4 20 238 -337 -115 181 182 -207 -333 -208 -14 -278 -62 -201 167 -140 -272 30
7982 30 126 -49 92 158 208 73 -163 161 6 33 226 -124 -207 69 202 316 -183 -210 -102 -8 -73 114 357
8005 357 -136 56 -249 -215 78 174 107 -20 231 337 167 -152 -257 249 128 45 -34 -143 31 210 -188 90
8027 90 -103 -31 49 -60 -99 -177 -395 3 129 91 111 -79 -88 -82 -114 -86 134 -176 59 139 156 102 -4 70 -221 -167
8053 -167 1 159 -50 78 -293 74 -41 -274 -207 -93 81 -154 144 17 -202 54 172 -25 -146 162
8073 162 -127 132 50 343 21 -69 68 202 -292 -28 -203 -148 263 -230 261 84 224 -284 -179 -129 -111 28
8095 28 13 122 88 -193 -120 -94 33 -145 268 200 -25 -59 219 -33 -389 30 -221 -364 -147 154 -146 3
8117 3 -207 72 83 -85 -43 -177 164 -102 -109 -289 -23 3 119 128 147 38 -209 108 57 35 120 -120 -178 410 213
8142 213 -8 73 154 -130 35 -248 -180 63 -209 -202 124 -56 -331 148 262 232 -136 -215 153 44 -163 -361
8164 -361 170 73 215 132 195 -336 -10 163 428 151 -169 292 -59 -175 -135 -176 -209 -52 -180 149 236 146 375
8187 375 -92 -166 177 -13
8191a3
##END NTUPLES=NMR FID
##END=
