##TITLE=1H_DE-77_ORG_d6A
 aceton-d5
 8 sc, 
 26.11.2024
##JCAMPDX= 6.0         $$ Bruker NMR JCAMP-DX V2.0
##DATA TYPE= NMR FID
##DATA CLASS= NTUPLES
##ORIGIN= UXNMR, Bruker Analytische Messtechnik GmbH
##OWNER= root
$$ XWIN-NMR		Version 3.5
$$ Tue Nov 26 14:32:55 2024 Russian Standard Time (UT+4h)  she@DPX200
##.OBSERVE FREQUENCY= 200.1315
##.OBSERVE NUCLEUS= ^1H
##.DELAY= (6, 6)
##.ACQUISITION MODE= SIMULTANEOUS
##.ACQUISITION SCHEME= undefined
##.AVERAGES= 8
##.DIGITISER RES= 18
##SPECTROMETER/DATA SYSTEM= spect
##.PULSE SEQUENCE= zg30
##.SOLVENT NAME= Acetone
##.SHIFT REFERENCE= (INTERNAL, Acetone, 0, 15.7039)
##AUDIT TRAIL= $$ (NUMBER, WHEN, WHO, WHERE, WHAT)
$$ ##TITLE= Audit trail, XWIN-NMR		Version 3.5
$$ ##JCAMPDX= 5.01
$$ ##ORIGIN= Bruker BioSpin GmbH
$$ ##OWNER= she
$$ F:/spectra/data/she/nmr/H-F/1/audita.txt
$$ ##AUDIT TRAIL=  $$ (NUMBER, WHEN, WHO, WHERE, WHAT)
(   1,<2024-11-26 14:31:44.85 +0400>,<she>,<DPX200>,
      <created by zg, POWCHK disabled, PULCHK disabled
       configuration hash MD5:
       00 E9 B6 7A A2 85 ED C7 34 08 36 98 17 FE 4E 26
       data hash MD5: 16K
       9C 2B EA D9 48 14 DA F5 4C 3B D0 BA 10 61 18 0C>)
$$ ##END=
$$ 
$$ hash MD5
$$ 4D 71 52 16 33 4D EB 00 31 DF BB 4B 6F CA 97 A6
##$RELAX= 
##$RELAX= 
##$RELAX= 
##$RELAX= 
##$RELAX= 
##$RELAX= 
$$ Bruker specific parameters
$$ --------------------------
##$DU= <F:/spectra>
##$EXPNO= 1
##$NAME= <H-F>
##$PROCNO= 1
##$TYPE= <nmr>
##$USER= <she>
##$AMP= (0..31)
100 100 100 100 100 100 100 100 100 100 100 100 100 100 100 100 100 100 
100 100 100 100 100 100 100 100 100 100 100 100 100 100 
##$AQSEQ= 0
##$AQ_mod= 1
##$AUNM= <au_zg>
##$AUTOPOS= <>
##$BF1= 200.13
##$BF2= 200.13
##$BF3= 200.13
##$BF4= 200.13
##$BF5= 200.13
##$BF6= 200.13
##$BF7= 200.13
##$BF8= 200.13
##$BYTORDA= 1
##$CFDGTYP= 0
##$CFRGTYP= 5
##$CHEMSTR= <none>
##$CNST= (0..31)
1 1 145 1 1 1 1 1 1 1 1 1 1 1 1 1 1 1 1 1 1 1 1 1 1 1 1 1 1 1 1 1 
##$CPDPRG= <>
##$CPDPRG1= <>
##$CPDPRG2= <>
##$CPDPRG3= <>
##$CPDPRG4= <mlev>
##$CPDPRG5= <mlev>
##$CPDPRG6= <mlev>
##$CPDPRG7= <mlev>
##$CPDPRG8= <mlev>
##$CPDPRGB= <>
##$CPDPRGT= <>
##$D= (0..31)
0 1.2 0 0 0 0 0 0 0 0.06 0 0.03 0 0 0 0 0.0002 0 0 0 0 0 0 0 0 0 0 0 0 
0 0 0 
##$DATE= 1732617104
##$DBL= (0..7)
120 120 120 120 120 120 120 120 
##$DBP= (0..7)
150 150 150 150 150 150 150 150 
##$DBP07= 0
##$DBPNAM0= <>
##$DBPNAM1= <>
##$DBPNAM2= <>
##$DBPNAM3= <>
##$DBPNAM4= <>
##$DBPNAM5= <>
##$DBPNAM6= <>
##$DBPNAM7= <>
##$DBPOAL= (0..7)
0.5 0.5 0.5 0.5 0.5 0.5 0.5 0.5 
##$DBPOFFS= (0..7)
0 0 0 0 0 0 0 0 
##$DE= 6
##$DECBNUC= <off>
##$DECIM= 24
##$DECNUC= <off>
##$DECSTAT= 4
##$DIGMOD= 1
##$DIGTYP= 9
##$DL= (0..7)
0 120 120 120 120 120 120 120 
##$DP= (0..7)
150 150 150 150 150 150 150 150 
##$DP07= 0
##$DPNAME0= <>
##$DPNAME1= <>
##$DPNAME2= <>
##$DPNAME3= <>
##$DPNAME4= <>
##$DPNAME5= <>
##$DPNAME6= <>
##$DPNAME7= <>
##$DPOAL= (0..7)
0.5 0.5 0.5 0.5 0.5 0.5 0.5 0.5 
##$DPOFFS= (0..7)
0 0 0 0 0 0 0 0 
##$DQDMODE= 0
##$DR= 18
##$DS= 0
$$ [...]
##$SUBNAM2= <"">
##$SUBNAM3= <"">
##$SUBNAM4= <"">
##$SUBNAM5= <"">
##$SUBNAM6= <"">
##$SUBNAM7= <"">
##$SUBNAM8= <"">
##$SUBNAM9= <"">
##$SW= 24.0689530833862
##$SWIBOX= (0..15)
0 0 2 0 0 0 0 0 0 0 0 0 0 0 0 0 
##$SW_h= 4816.95568400771
##$TD= 16384
##$TD0= 1
##$TE= 0
##$TE2= 300
##$TE3= 300
##$TEG= 300
##$TL= (0..7)
0 120 120 120 120 120 120 120 
##$TP= (0..7)
150 150 150 150 150 150 150 150 
##$TP07= 0
##$TPNAME0= <>
##$TPNAME1= <>
##$TPNAME2= <>
##$TPNAME3= <>
##$TPNAME4= <>
##$TPNAME5= <>
##$TPNAME6= <>
##$TPNAME7= <>
##$TPOAL= (0..7)
0.5 0.5 0.5 0.5 0.5 0.5 0.5 0.5 
##$TPOFFS= (0..7)
0 0 0 0 0 0 0 0 
##$TUNHIN= 0
##$TUNHOUT= 0
##$TUNXOUT= 0
##$USERA1= <user>
##$USERA2= <user>
##$USERA3= <user>
##$USERA4= <user>
##$USERA5= <user>
##$V9= 5
##$VALIST= <valist>
##$VCLIST= <CCCCCCCCCCCCCCC>
##$VD= 0
##$VDLIST= <DDDDDDDDDDDDDDD>
##$VPLIST= <PPPPPPPPPPPPPPP>
##$VTLIST= <TTTTTTTTTTTTTTT>
##$WBST= 1024
##$WBSW= 4
##$XGAIN= (0..3)
0 0 0 0 
##$XL= 0
##$YL= 0
##$YMAX_a= 165215
##$YMIN_a= -109180
##$ZGOPTNS= <>
##$ZL1= 120
##$ZL2= 120
##$ZL3= 120
##$ZL4= 120
##$ABSF1= 10
##$ABSF2= 0
##$ABSG= 5
##$ABSL= 3
##$ALPHA= 0
##$AQORDER= 0
##$ASSFAC= 0
##$ASSFACI= 0
##$ASSFACX= 0
##$ASSWID= 0
##$AUNMP= <proc_1d>
##$AZFE= 0.1
##$AZFW= 0.1
##$BCFW= 1
##$BC_mod= 2
##$BYTORDP= 1
##$COROFFS= 0
##$CY= 11.3945322036743
##$DATMOD= 1
##$DC= 2
##$DFILT= <>
##$DTYPP= 0
##$F1P= 15.6554695791079
##$F2P= 12.8336369535428
##$FCOR= 0.5
##$FTSIZE= 0
##$FT_mod= 4
##$GAMMA= 1
##$GB= 0.15
##$INTBC= 1
##$INTSCL= 1
##$ISEN= 128
##$LB= 0.24
##$LEV0= 0
##$LPBIN= 0
##$MAXI= 10000
##$MC2= 0
##$MEAN= 0
##$ME_mod= 0
##$MI= 1.114404
##$NCOEF= 0
##$NC_proc= 0
##$NLEV= 6
##$NOISF1= 3.799351
##$NOISF2= 2.8
##$NSP= 1
##$NTH_PI= 0
##$NZP= 0
##$OFFSET= 15.70392
##$PC= 1
##$PHC0= -26745.73
##$PHC1= 67.18745
##$PH_mod= 1
##$PKNL= yes
##$PPARMOD= 0
##$PSCAL= 0
##$PSIGN= 0
##$REVERSE= no
##$SF= 200.130013532006
##$SI= 16384
##$SIGF1= 3
##$SIGF2= 2
##$SINO= 400
##$SIOLD= 16384
##$SREGLST= <1H.CDCl3>
##$SSB= 0
##$STSI= 0
##$STSR= 0
##$SW_p= 3612.71676300578
##$SYMM= 0
##$S_DEV= 0
##$TDeff= 0
##$TDoff= 0
##$TI= <>
##$TILT= no
##$TM1= 0
##$TM2= 0
##$TOPLEV= 0
##$USERP1= <user>
##$USERP2= <user>
##$USERP3= <user>
##$USERP4= <user>
##$USERP5= <user>
##$WDW= 1
##$XDIM= 8192
##$YMAX_p= 0
##$YMIN_p= 0
$$ End of Bruker specific parameters
$$ ---------------------------------
##NTUPLES= NMR FID
##VAR_NAME=  TIME,          FID/REAL,        FID/IMAG
##SYMBOL=    X,             R,               I
##VAR_TYPE=  INDEPENDENT,   DEPENDENT,       DEPENDENT
##VAR_FORM=  AFFN,          ASDF,            ASDF
##VAR_DIM=   8192,          8192,            8192
##UNITS=     SECONDS,       ARBITRARY UNITS, ARBITRARY UNITS
##FACTOR=    0.0002076,     1,               1
##FIRST=     0,             0,               0
##LAST=      1.7004516,     0,               0
##MIN=       0,             -109180,         0
##MAX=       1.7004516,     165215,          0
$$ Real data points
##PAGE= N=1
##DATA TABLE= (X++(R..R)), XYDATA
$$ [...]
1939C18k76N1J2k58K24j86J08L30m05M58m14k75N70k15r0l64L18M50J56q87M51
1960G6j06J84l58l5J19R4J41n23L10K05K42k84j69J9L74k2P6j60j96K51j21l0
1982H7J40O8k44j67j27L75K1l24r1K25K91k23k02j38M76J90l49J97r4j68O8l22
2004c11K50L12M4l90N8L8J88J03n68K04K47l77P8j50K40K01r8l11k1N42k34k22
2026a77K13r9R5j04k18K76J93J46k93k81J22K93L9m53K85k1p4j7J58L40k01l40
2048a18K07q8L49l12l90N94j44j26j05j79L56j98l12P16k38J95K6m98n3N55j99
2069C8j69l42M68J51n42L66j67K43J14n08K9J51M50l61J48m62L55J63k52j97L27
2090CL04k80j09k41M41j49J72k50L47k89k55J53K28k1J50k34j68R4K79j18j64
$$ y = [318, 42, 93, 105, -153, 71, -115, -7, 323, -82, 376, -38, -313, 257, 42, -48, -412, -94, 356, 512, -375, 76, -30, 154, -204, -239, -120, -26, 115, -408, -98, 107, 349, 65, -104, -85, 289, 267, 343, 183, -13, 238, 117, 87, 227, 295, 51, -116, -243, 132, 153, -171, -262, -37, 254, 31, -171, -309, 167, 357, 8, 205, 111, -57, 11, -311, -61, 251, 295, -95, -37, 1, 189, 292, -276, -72, 175, -202, -124, -274, -34, 167, 69, -242, -263, 279, 45, -177, 36, -63, 32, -72, -290, -14, 179, 325, 32, -249, -127, 166, 205, -248, 37, 16, -58, -75, 83, 423, 222, -118, 89, 1, 350, 38, -352, 242, 98, -28, -133, -312, 44, -154, -466, 250, 12, 207, 233, -265, -318, 237, 38, -131, -473, -5, 146, -396, -30, -197, 46, 160, -348, -319, -168, 282, -79, 69, -393, -38, 125, -127, -324, 3, 307, 27, -82, -323, 118, -31, 141, -109, 238, -51, -306, -153, 75, 54, 204, -30, -198, -104, 175, 57, -107]
2111a07K39Po8m15M4L23K76l82j09J38Q7m5l7J95k08L56l43K26l02p2j1L74m44
2134b78k6J97L8J5R4L58o48k7J61K02K05k84k38N49j0m53QJ43n0J52l70m8M88
2157A78l21R1R4j87M18j65k29Q2L40l8m37k52N70j13k16J90J6J70q0k53J68J14
2179A40j98k6k52L35k05L67p5l40J36M82m84l25M47N8L45k86m4k18N44o03J62
2200d0j18M52l94j18L64k80L45j72j67k3K43j61J28k29Q7K55l56J9K26K43j38
2221A66K2m89K39N50q41N4L33K2j2k14K48J78l14k0j12J17K28p3k84M89j16k18
2243d7j10K33K35k98Q7l64N37L02o63J44j69K57j02j79J42N1O5l40MK75L9J68
2265B67l43J26RN0L7k84J97J61j35l58L04j03K36l89j8L43J61l47j23L28JM3k82
$$ y = [-107, 132, 139, 71, -344, -300, 23, 299, -83, -192, -54, 33, -12, -49, 146, -62, 294, -49, 177, -125, -197, -208, 166, -278, -304, -107, -69, -54, 40, 398, -250, -277, -116, 86, 291, 7, -231, 318, 308, -145, -137, 6, -44, 108, -262, -310, 178, -143, -52, 42, -145, 273, 108, -121, -39, 301, 263, -174, -426, 144, 31, -185, 5, 21, 191, 111, -142, 26, 140, -58, -84, -336, -1, -206, 161, 86, -254, -118, 364, -120, -445, 2, 60, 405, 119, 75, -143, 401, -202, -40, -158, 294, -100, -218, 146, -134, 211, 39, -128, -151, 92, -69, 59, -170, -83, 172, -184, -165, 61, 304, 166, 188, -301, -62, 488, -353, -299, 34, 56, 44, -170, 78, 256, -58, -78, -190, -73, 155, 82, -202, 287, 171, -47, -157, 76, 311, 13, 100, -264, 273, 575, -88, 56, -113, 144, 42, -137, 5, 56, 121, -219, -215, 60, 99, 267, -76, 50, 59, 109, 146, -138, 59, 220, 85, -273, 31, -72, 164, -225, -243, 100, 261, -86, -209, 119, 120, 163, -119]
2288a19M5K20p0l38J40J8K75q2Q1j43j5J31j51j90K41J19j40R6n48N06J78l10
2310e6J64J08j02R5l29P4j36J30N4Q4J9J55j63J26m29J67Q9k66K94l9k34Q1J4
2333a00J97L1p7j95j9J90J08j52j09L96j5k55j4l23P30m23J37j77K08qj53J59
2355A36n61M38N6n1k75L83m0J30j26n24L14K30K87p69L71K33R5l99Q1j12K39k76
2377a40k30N85k74J02m08O01m4O7k85k74N1K81m7j91K28j86M78m33j56L49k05
2398a31k86O04l7L4l48j05J59K06J5M0l59K04K65l43Q3j1M3q3L98m33L38k88R8
2421F3k22R9J86K27j18k00m7K88j34l8J56k55J19k03L14n32L77j59J0n0J05J85
2443A71k08j09L19p4q2l80J94J32nm5N3Q4n2K5k74J09m9K56O2R5j12l15M00l77
$$ y = [-119, -74, 146, 76, -262, -122, -104, 171, 89, 170, 27, 12, 143, -8, -198, 43, 162, 22, 118, -430, 76, 254, -56, 108, 216, 114, 209, -120, -46, -182, -52, 2, 86, 105, 260, 97, 223, -206, -39, 50, -216, 78, 39, -195, -114, -100, 97, 128, 51, -144, -163, 27, 135, -17, -126, 270, 255, 0, -14, -337, 393, -30, 107, -70, 138, 130, -23, 136, -425, 13, 69, 18, -257, 126, 86, 216, 90, -434, -120, 110, 397, -372, -1, 232, 327, -72, 9, -103, 136, -140, -370, 215, -59, 43, -365, 236, 192, 259, -26, -300, -249, 32, -15, -206, 22, -164, 314, -119, -275, 74, -131, -417, 187, 150, 184, -164, -269, -110, 96, 111, 151, -208, -4, 261, -82, 1, -10, 33, -50, 348, -85, 253, -35, 63, -159, -60, 126, 353, 235, 35, -12, 276, 142, 104, 260, 5, 124, -79, 235, -297, 80, -79, -69, -119, -14, 171, -37, -146, 173, 99, 17, -363, -169, -37, -42, -87, -34, 50, -2, 23, -251, -142, -191, 65, 127, 222, 110, -205, 195, -182]
2467a82L83m6J22j65j29L7L50k63%k32P2K61j17k11P9J54qj56j92L48l25L71o1
2490I0J39m35K49qJ62j0j47K5j09K17k94j19R7L33n5j52l4J41m9j28L1m00L93
2513f3j26J63R8l8J96j81J7j85N07l43mJ5J62O8j92p7j41Q1p4L94m67L77j07j40
2537f0K13k18K02k73k26N60l20R7K55m04L39j17k45K65k66J4J82p9K44k29L49
2558B83m78L02j83L7m2r1J83j08J86o3J4Q6m32L27J07o2j33J78J56l63J55j07
2580d8O4L16n57L72j39P9l09K96n8j75M53q7j52o3O7j67K60k48L51j65j48L02
2602B44j69j63L20k04L18n77J29M3r0J12k60L91L3o8P5n0j34J10j32L77K0l61
2624c6N0j49L34N7l0j86k8K44k62J18J35m42K24J11l5k22j24M18q2j80m7K57J49
$$ y = [-182, 201, 155, 277, 112, -17, 20, 370, 107, 107, -125, -53, 208, 91, -120, -41, 113, 105, -51, -243, 105, -220, 151, 90, 229, -206, 43, 35, 197, 187, 40, 65, -44, 173, -121, -240, -143, 190, 135, -17, -51, 90, 41, -87, -56, -456, -63, -189, -26, 72, 34, 230, 49, 66, -119, 388, 45, 41, 56, 218, 286, 94, 17, -124, -43, -117, 277, -190, 187, 80, -60, 153, -65, 137, -136, -362, 198, -122, -25, 230, -174, 165, 48, -197, 68, -198, -184, -2, -81, 163, -66, 283, -195, 107, -76, -39, -81, -172, 11, -97, 89, 26, 40, 126, -306, 21, 128, 66, -67, 111, 267, -96, 59, -48, 16, 332, -225, 147, 8, 87, -222, 74, 16, -159, 294, 207, 55, -8, 59, -108, 152, -96, 255, 90, -58, 244, 75, -88, 232, 28, 346, -231, -102, -59, -149, -37, -297, 94, 127, 59, 134, 84, -50, 60, -72, 305, 325, -36, 14, -135, 199, 256, 226, 40, 12, 256, -6, 112, 247, -195, 29, 140, 105, -117, -241, 177, 95, -85, -132, 125, 274]
2647B74M0Nl62J89k41r5M6K36k58l8K71m76L43P3J80j21nL9j12k30Q4M8R7N4n8
2672a7M8o1j45r8K37NL25k34l2n8K12j95k93K15K09j31j04p7J52%j04J59J95k95
2696h7o4K34k04K28M1k69L81k81K96k58k1K12m52J65mK29j26j50L89n53K29j07
2718a72K3J44J50j61m2N24k72k21J7O7q2o5K90j3M7l17K54j04J35k60j66L06q0
2741Bj90K38j40J98j75k02M46l4j91L4j93L55k30M5Q5m3j55k8M46l23m9K25j73
2764e2J94l87K38M0P3m50L12N9L9k48K00j96K15m4k3M4M1J7j65j6J65J18k06J70
2788A38k20Q1k83j2N82l28j26L00K0K40k57j1q7%K4J31k00L0l64L37M6l5n7p9
2812a30K75Nk32J05j73J22J25l56J00n9O28l33J5J25j15Q6m3J32k90R5L16l15
$$ y = [274, 314, 319, -43, 146, -95, -190, -144, 92, -166, -204, 67, -409, -66, 7, 187, 66, 61, 100, -12, -242, -158, -110, -13, 41, -17, 31, -30, -175, -273, -36, -31, 294, 60, 28, -30, 182, -13, -306, -91, 118, -13, -117, -194, -42, -42, -146, 13, 208, -87, -151, 83, -121, 107, 148, -121, 260, -21, 275, 17, -4, 208, -244, -79, -83, 146, 20, -130, 259, -294, -65, -172, -149, -5, 145, -16, -58, 466, 194, -27, -10, 57, -25, -90, 200, 187, 234, -83, 171, 67, 202, -58, -224, 82, 2, -188, 50, -90, 108, -67, -269, 177, 143, -48, -14, -207, 148, -82, -37, 48, 5, -150, -178, 268, -55, -104, 121, -52, 142, -245, -7, 33, 106, -344, -32, 27, 66, -182, 18, -178, 37, -7, -30, 14, 55, 72, -93, -109, 56, 174, -32, 138, -82, -1, -284, -296, 286, -42, -168, 132, 152, 392, 135, 124, 37, 37, 61, 192, -8, 22, -342, -5, 41, 6, -51, -130, 145, 150, -82, 23, -150, -28, 97, -259, -159, -218, 410, 77, 92, 217, 102, 188, 145, 277, -13, 82, 398, 83]
2834H3k99K11q4K46J17n36L91j43N2l79J38M33k46O4L2L36l38j63J71R2l90L09
2856I7R9k42k3n8R4K26j76K67k22k89K1M17l04K11j20j07K46p1L1m5K75k54M24
2879D97k67m13J47m4n4R2j63K12P0o3J19mp6j1J45k64o8k34L25j42L99j20r8j3
2903b8m5j55L25m68K16j5m5K01j87J92q0p6j2N00k22j22J38P9m13L63l61L46L35
2926D66m58L63l52J00l13R8K7J9K32l47J38L26k11l17L00O9j18j30K70j45r5J51
2948G3k65L19j58k2L3q0K82M2j91Q7j97p5O8j74O9K81n6j49M9J14l29L83k38m91
2972f25M36K10J20j56k56M09j4m8K31j80p9J68n7k03m1K34k78J11O0j98K44j20
2994c2qJ0j94M15l85J14J58k51K16N2m22L95J05m26j31L1M72k19J59J29j65Q6
$$ y = [83, -216, -5, -89, 157, 274, -262, 129, -14, 38, -341, -203, 230, -16, 48, 80, 416, 78, -85, 86, 178, -212, 97, 196, -46, -69, -127, -33, 193, 17, 284, 62, -227, -206, 211, -93, 118, -2, -109, 137, 66, 97, 52, 327, 73, 497, 230, -183, -36, -80, -134, -42, -205, 7, 77, 14, 133, 129, 53, 42, 187, -77, -145, -379, -54, -196, 203, 83, -15, -28, -73, -228, 97, -371, -155, -170, -215, -14, -201, -9, -89, -165, -177, 323, 101, -21, 117, 196, -217, 146, -215, 131, 466, 8, 371, 19, 119, -194, -96, -69, -50, 182, -165, -27, 299, 88, -229, 71, 140, 22, -108, 162, 17, -78, 73, -192, 127, -31, -53, -20, -100, 182, 224, 33, 120, -77, -152, -84, -258, -189, 92, 36, -113, -64, 50, -279, 104, -134, -625, -189, 21, 141, -15, -271, 138, 124, 76, 307, 127, 48, 216, 159, -44, -85, 149, -129, -18, 42, -156, 88, -32, -40, -30, -224, 191, -194, -80, 78, -173, 43, 95, -327, 68, 173, -253, -384, -353, 119, -100, 59, 188, 23, 109]
3016A09k28J81j4j38J56k07o4L92j4L9k46QJ48P9j87N2l6o7j40J68k5K7J58l42
3040a91L55j66K12l79K63j3J45q2M5J45j45k0P7m66J47Q0k28M50l04m0K4Nm6K22
3064I0j28J63k64l8J27J12o6j0m26N7K44N8J28j1P9k38K18r4k37K22k5j8n9K21
3088A05Q0j29j17J01j09J02J70j62r1J06k25k1M03n9l28M05l69Mn5k8J37O1M09
3111C90m48K47k87O0M76k66J62l93P4k18N85j95j14k00j86L18M1K86n65J70m1
3132a04J62n5R2k16qj85K31K38j51ok05L12k83p5L87l04M31j32O7K2k07K25l65
3155a29J75j5nM89p17M89j10j92Q6o5o4L95j26n97K53J2K27k03QM9J66J73k51
3178D8k9K75m24pM58n55J89K43j51L28l48L3J26j55k73J10N30m61L31j60l82L75
$$ y = [109, -119, 62, 48, -90, 66, -141, -205, 187, 173, 212, -34, -26, 122, 201, 14, 66, 30, -37, -177, -9, -34, -7, 151, -191, 164, -2, 210, -169, 94, 81, 226, 144, 189, 334, 189, 169, 246, -220, -73, 7, -221, 229, -75, -115, -91, -86, -132, 90, -38, 125, -139, -177, -50, 62, -4, -14, -440, -383, -139, -81, 47, 36, 115, -123, 95, 1, -236, -14, -39, -57, -116, 105, 185, 56, -61, 40, -69, 33, 203, 41, -50, 56, -169, -190, 213, 154, -174, 231, -138, -134, -189, -217, -80, -19, 390, -58, 189, -98, -38, 438, 172, 334, -59, 15, -203, 382, 187, 73, -127, -313, 5, 46, 332, -233, -63, -104, 58, 3, 95, -121, -129, -314, -83, 155, 4, -2, -207, 105, -178, -253, 134, -170, 261, 129, 196, 218, 11, 236, -129, 46, 31, 26, 515, -202, 287, 177, -15, 71, 6, -58, 337, 211, -386, -133, -121, 106, -97, -89, -40, 126, 299, 48, 19, 294, -130, -137, 321, -234, -45, 198, 47, 375, 27, 60, 186, 31, -242, -132, 398, -63, 268, 108, -274, 101]
3200A01j4k20J04L21n97K72k87O20k65k56P3j77L29j56J20O7l01L02j42q4N9K9
3222a02K40k01J92l67K20R5j45J17J00j73m10M62N6j74k65K95J26j09r0J99R9
3243A65k64K68k26J34k47k9K11j42N93l67l68O37m64R5O5p7O4k22L59r1P3k42
3265g5K03K9k64K53k0K76k17k35j50K36K8Q9m8l61N78l37j00J83K27J17n69M34
3287B77m91J86K81o20M78J5j88l2R4k94L11j1j03r6N9J56j78J44J09k65K09l3
3309Hj23L2M09l82K55l21J45R6k62J4j25K36N6J93k23J91m04J14Jk8J11m9j0K63
3333A97k96o0k50M09R9J04K36m49J21J31r8J5O6k72P5rJ12j33j20K57l48K41k22
3356a94J52P8J11j03k1k88J42K53j97J68O8l3k81J58mK4Q2J21Kk99j96O67m38
$$ y = [101, 87, -133, -29, 292, -305, -33, -320, 300, 35, -221, -148, -325, 4, -152, -32, 35, -266, 36, -106, -190, -131, -102, 138, -63, 129, -238, -18, 77, -68, 49, 149, -24, -434, 28, 84, -90, -355, -60, 66, -43, -133, 66, 165, -99, 169, -57, 77, -170, -199, 12, -130, 463, 96, -272, 365, -99, -4, 61, -16, 48, -174, 185, 94, 167, -75, 128, 157, -107, 146, 126, 402, 185, -50, -200, 36, 64, 153, 105, -256, 322, -15, -115, 68, 295, 412, -157, 277, -214, -28, 253, -367, 111, 126, -62, -94, 0, -294, 17, 6, -97, -193, -134, 22, -156, -12, 97, -168, 41, 8, -115, -83, 326, -56, 199, -122, 23, 119, -143, -129, -254, -18, 38, 231, 8, 199, -205, -91, -90, -118, -7, -56, -66, 197, -99, -159, -409, 0, 99, 203, 439, -10, 111, 242, 144, 159, 225, -47, 28, 19, 131, -2, -122, 135, -213, 28, -194, -42, 36, 147, 44, 23, -265, -123, 130, -67, 101, 169, 136, -145, 13, 9, 33, 115, 236, 238, -61, -257, 410, -28]
3379b8l16L76j15J00j70L97j5n10L08J39r0l58K56N2J67m5p0p0j42J36j43K13
3401G2k20K13k12K74k60J92P7rr5J35j64PJ95p1l62K34j61K12j15J97n3j39j73
3424b26M51m93J40p0L99j47k57J89j77M20l08K53k09k33K20M14n89N80k09j55
3444gl22K39mJ63q5K04j54J88q4m39J64J1K40qj13J48k4K2m14J80P3j84P0K27
3468I1k61K12r7K81j98R8J20l42J56l4J35j93Q5j11j1J63l0k64K09J02O5k85K17
3491A08l13L17p6K98k65l52K16j67J69J98k66o1O04m80K6j18K59k80L91M3J3p0
3513A94m21k5K25M6OMPJ26l6j7n0p2O7j58j48L23M0j92j30K12J8Q7j69J73K3k89
3539a56K51k60q0L61k26m9J50j14m4L5P2K49l45L09N4r6K35l93l21L91l12J46
$$ y = [-28, -344, 32, -83, 17, -153, 244, 229, -281, 27, 166, 76, -282, -26, 26, 193, 148, 78, 8, -134, 2, -141, 72, -148, 65, -147, 127, -133, 59, 136, 127, 32, 167, 3, 10, 205, 134, -228, 6, -155, 57, -58, 139, 86, -53, -226, 225, -268, -128, -198, 201, 54, -203, -14, -191, 229, -79, 174, -35, -268, -48, 366, -223, 357, 148, -7, -329, -90, -94, 69, -16, 188, 34, 222, 138, -301, -137, -126, 114, 106, -7, 141, 117, 139, -275, -95, -22, -206, -136, 91, -170, 42, -55, 226, 28, 126, 246, -96, 60, 26, 161, -32, 53, -58, -69, 94, 64, -200, 9, 111, 176, -109, 108, -205, 112, 36, 334, 69, -283, -67, -234, -65, 133, -133, -194, 410, -70, -44, -162, 97, -183, 208, 251, 264, 194, -227, -252, -27, 19, 25, 29, 36, 162, 126, 109, 59, -13, 54, -104, -252, 71, 111, -81, -211, 1, 19, 106, -63, 110, 133, -156, 95, -165, -245, 116, -110, -159, -9, -123, -167, -132, -60, 189, -156, 153, 207, 111, 346, -47, -368, 23, -289, -143]
3561a43P4j68K93p7J96k05K91m53J49J73l11N58q8l52j09L62k07K97j20p9k30
3582a49P2o0n8M66l82J03K5n4j5j81J18R6k49K55J58K05r5n67J06K96k4N5P4m80
3606b85M45n5J27j61M2n2j73J63j74J85J02K30l15P5J71k25K02l43j25J11J20
3627F5q4L50l41o6L74r0l21J87j61j21J45N7J34o4j16J79j72L40o36J31K9J5L72
3650B06l03J41q6J89j06K2nMJ44m9k13j88K58j21K05J70l22l36M20j56K87k98
3672a37N8R0o4K9K61n73L85q2J0K62n14K57J77l49M79k68N3l14K36O1K38n82J77
3695a10j25K54l8j89J95J10q2k10J14q9J02J20J28n52L86r8N9L21r7M2k49j19
3717a27j3m1L02m00L93J58m38n9K25K01m30K74j41K28L6Jj66J42o5j29p5K5N5
$$ y = [-143, -69, -237, 56, -21, 175, -30, 261, -192, -43, 130, -181, 377, 289, -63, -172, 190, -17, 280, 160, 81, -149, -77, -137, -195, 271, -111, -8, 17, -37, -52, -233, -115, -19, -268, -13, 145, 350, 255, -312, -206, 90, 66, 121, 195, -285, 160, 105, 232, 71, 113, 61, -112, 51, -123, 62, 164, 394, 79, 154, 325, 100, 302, -41, -166, -55, 65, -19, 331, -10, -76, 298, 208, -113, 74, -87, -208, -63, -6, 128, 64, -52, 127, -45, 295, -341, -210, -181, -166, 206, -97, 44, -42, 147, 41, 63, 58, 62, 206, 157, -56, -244, 14, -107, 98, 268, -54, -390, 30, -126, 161, -137, -79, 11, -53, -24, 237, -336, 49, -33, -23, 239, -275, -18, 159, -190, 289, 21, 74, -240, -4, 57, 295, -287, -110, -235, 19, -19, -208, -13, 97, 15, -195, -81, -170, -68, 52, 180, -372, 14, -84, -25, 296, 199, 241, -8, -127, -140, -181, 121, -279, 114, 272, -166, -225, 0, 201, -229, 45, -96, 132, 168, 169, 3, 145, 80, -49, -124, -99, -44]
3740d4J3k69M03Ml46M71j04m25J03op4L59j39j6M20l92j24K76q3o3qR5k45K25
3764C1o7J18k16m2J8J52J95j9j83J71j94O8k95P2J65k17L94l43R3J73j33k9J64
3787G6Q0l70Q4Q5r2J16n2j16K81j23J5J81j60k00J32P8L3J38l75K39K89m53M65
3810C51m02R7j14j58J63K08j70j78N7J01k02J1J20J45j49L43k1l51J88K07j44
3831A02l56K32j93K75P7K81l98J73j55J14l38J58J72Q1j73j24K27k09J55k04j35
3852b38M32k19K67j18l67L16k91j17K72jQ6k99J97L71j79j60j01L87j65j27J63
3873A09m14L39r5r4K09K17l65lpJ97l13J68K31l65Q0K09j43l4K55k59P0J5l3j18
3897a44O61n74k1LJ03j23MJ49l88N93m50L17n6J54m82J25j39M88k89L7J03O4j08
$$ y = [-44, -31, -300, 103, 107, -239, 232, 128, -297, -194, -200, -274, 85, -54, -70, 350, -42, -166, 110, 27, -36, -44, 51, -194, 31, -36, 82, -134, -176, -158, -6, 189, 170, -13, 158, -36, 32, -263, -191, -26, -243, 151, -192, -99, 74, -59, -88, 76, 156, -214, -130, -45, -137, -21, -73, -189, 92, -31, -16, 165, 5, -195, -63, 15, 48, 186, -189, 50, 339, -114, 351, -51, 46, -68, -226, -63, 145, -25, -203, -146, -45, -247, -236, -116, 29, -120, 223, 202, -149, 39, 246, 102, -254, -22, -215, 60, 137, 418, 20, 193, 38, 152, -186, -28, 144, 225, 52, -72, 155, -54, 101, -103, -238, 194, -25, 242, 124, -243, 73, -218, -335, -63, -64, 22, -277, -80, 291, 112, -48, -149, 238, 73, -54, 109, -305, 34, -61, -155, 54, 271, -94, -97, -104, 93, -220, -52, 179, -186, -106, 103, -40, -74, 181, -78, -8, 7, -26, -144, 517, -57, -78, -75, 28, -95, -91, 58, -330, 263, -187, 130, 74, 228, -254, -129, -268, 220, -69, -32, 71, 135, 27]
3920B7o8r4R9L60m99L26l0o9r4j97L42j74J74j78k68M96k67L22k36j85K50o8j1
3943d2J00LP9m03J77l6M12N1k28J2k82J43q8J41l16k7K44R8J98q6l78K78l54N18
3967B14K0m85N82p60J36M05J9mo6j57O06n30L83m25k1O3m5Q9j55J30j7k08J50
3990g6L55n14L6K59pO2M4m16J4K81j2o3K4K01l59L34k05p1J39J8R7J9j58N6k36
4015a78O0K15k42L01K96m49K15l78L16m4M26o05k10L61j18J80l53L05l52K58j85
4036a81m6j42N28r6r8n7l4k4J89m44M09j62K1r9N73k56n9r0k65J79L8K44J2k54
4060a14j77K92J11k83JJ06Q1l6J26M0k55K0o9J10m7J74m9K8p8P13p80j23K8K85
4084A04j33J12R7K37n52MML1J53J75J59j24m53j61L86K3K6j88K55l42M43o3l14
$$ y = [27, -41, -135, -36, 324, -175, 151, 121, 52, -42, -239, 103, -71, 103, -75, -343, 153, -114, 208, -28, -213, 37, -31, -42, 58, 61, 140, -263, -86, -122, 290, 341, 113, 125, -157, -14, -102, 39, -277, -304, -60, 38, 236, 150, -228, 50, -304, 214, 234, -251, 331, -429, -293, 112, 131, 127, 61, -96, 510, -20, 363, -62, -83, -20, -65, 24, -131, -1, -18, -226, -76, 279, -235, -199, 60, 53, 115, 159, -257, -243, 38, 26, -37, -13, 188, -171, 163, -42, -113, 26, 44, 141, 160, 2, 58, -178, -118, 97, -145, 156, 452, 3, 218, -160, 156, 112, 538, -67, -277, 84, -34, 146, -207, 98, -254, 4, -181, -227, -369, 159, 63, -35, -92, -126, -150, 39, -405, 4, -158, -137, -236, 337, 81, 22, -68, -333, -154, -116, 128, 140, -114, -291, 1, 112, -171, -170, -64, 17, -19, 107, 147, -108, -88, -157, -47, -94, 80, 31, 59, -19, 694, -86, -209, -181, 104, -29, 83, 180, 417, -135, -131, -127, -96, 57, 232, 391, 267, -186, -347, 39, 62, 88, -100, 155, -187, 256, 193, -121]
4107a21J09L11j85J81l07j51j14N05O0j96j38N1J03j82l1J42j44j02m3L84P6j55
4129E3J27P4m10r6K67k42L75j52j89J08Q4J01L9k46P5J17m84Q7L23J86l70J50
4151b3j83L13j53l44K85k33L94m27J62M07p7k35J60q0l50K81J89pJ67j22j58N5
4173B1j50J78j2J58p4R8k38pL73j35l11q6J25o6J45j01J65k54j25J00L67j39j15
4196h3K9M4P6J29j26j47L2J47k69M28j23q8j73J74k9l20L03Q3j21J9j15J52j1
4219A1J9q6J87l18J9J73o8M24j40j79j2n31N58J22j77n6J56R4k06P7o7P0k54J22
4243f2L58n58N65l13L5k8Q0P8j88m1L43k56J8j32K98l76J23N6j03k46N00J17n86
4266c18M88J98j67j03J17q0k47J5J09j04J36L51j36k63r0p0N0M24j8j25j96j17
$$ y = [-121, -12, 299, 114, 295, -12, -163, -277, 228, 288, 92, -46, 5, 108, -74, -105, 37, -107, -209, -252, 132, 208, 53, 180, 254, -156, -252, 15, -227, 148, -4, -193, -85, -1, 100, 139, -107, -32, 85, -399, -312, 11, 197, -173, -23, -206, 107, -46, -390, -105, -338, 56, -371, -209, 198, 121, -114, 46, -34, -384, -103, 86, 79, 246, 124, -34, 21, -129, 49, 37, 195, 121, 219, -19, -26, 347, 212, -99, -185, -60, -126, 19, -82, 83, -171, -296, -196, 171, 32, -83, -54, -10, 66, 195, 69, -78, -46, 101, -168, 260, 137, 49, -124, 50, 21, -299, 4, 87, -34, -15, -130, 22, 11, 30, -56, 131, -187, -168, 5, -63, 361, 221, 42, 30, -501, 57, 179, 2, -54, 102, 196, -10, 67, 0, 70, -184, -62, 296, -262, 303, -10, 25, -3, 77, 155, -33, -74, 269, 13, 31, -101, 197, -179, -56, 0, -103, -349, 151, 268, -318, 170, 368, 201, 98, 215, 135, -112, -97, 12, -92, 44, 395, 259, -4, -94, -164, -114, 310, 292, 167, -29, -146]
4288a46N18k65j13K29j52j62j34L77j12J20L2j49J40m20K57j32N6R9j92M79n56
4309b26K52m70M58J73m2k78M4K07k9j83J25j05l37M47K17p0m80J09M80L9j80j67
4331a6N1k44m8K58j42k04K01QK09L8j30k10L09j00Q6j33j55M01k38K31k01J80
4353A51j0n63M61J0J5j85J94l17K52K52mn89K48L51p5p3p8k40R5M46l09%J14r6
4377E0j80r6K74k75L80l69J86J1O9j41j72L01j89M2J82O4k7l14M86m40L70K01
4399D13o53N80m33L6j56K70J08k9l2j73J50K66m88N8J03J34j86N1k75M06p6k32
4421a58J99j07l06L40k81L31P0M4m47K86Q3Rj96j86J19q5L16k12J14P6J25k24
4443i0lJ55j49K1K88l60L50L8k97R7r0j53L42k88J83Q4or1K43k20k19K95m90P30
$$ y = [-146, 372, 107, -6, 223, 71, -91, -225, 152, 40, 160, 192, 43, 183, -237, 20, -112, -56, 43, -149, 330, -226, 26, -444, 14, 187, 145, -133, -89, 118, 89, -94, 31, -74, -411, 36, 253, 183, -297, -188, 292, 331, 151, -16, 35, -209, -257, 1, -141, -345, -144, -136, 73, 111, -19, -229, 80, -20, 66, -67, -222, 179, -59, 172, -29, 151, 141, -422, 39, 49, 64, -121, 73, -244, 8, 260, 256, -333, -85, 266, 191, 118, 40, -200, -105, 341, 32, 32, 146, 50, -130, -226, 48, -227, 153, -216, -30, -19, 50, -91, -263, 38, -151, -109, 73, 137, 110, -204, 282, -158, 212, 413, -240, 340, -93, -57, -213, 57, 165, 136, 104, -69, 81, 347, -141, -83, 20, 154, -32, 19, -256, 150, 74, -158, 41, -66, -372, -32, -313, 18, 88, 132, -315, -29, 54, 63, -133, -319, -200, -285, 31, -181, -67, 9, 134, -90, -93, 62, -87, -66, 222, -138, 212, 250, -47, 50, -40, -193, 149, -139, 44, 128, 122, 31, 274, 54, -165, 130, -360, 370]
4467C70j81k47l26K44J12J50k37K50k78J54k31RP0L05k01M4k23J76j08n9mj28
4489c39J66NJ00K1K07l09M06j24o6K56J5o64M58j76J63R5l14J19K31k31K44k82
4511a9J53N2k4j55k41L74l6j67K39j32p0J54j64P0j48Q3lJ98j55J31l36M6K71
4534A21m5j16j90kK83J5o8k82K54p1j33R7J05J31k4J72k17k00j03J24L40L22k91
4557B22j14Nm05J92K17q9J86l61L1M60n80K33K82m86k0L08MJ00k3J33j35l23J71
4580Hk6K95k19j00q8J80k42K57k94K91m52M16o0j6J33l02J9J39J29J33k31j18
4602a48n7Q5j10L26r3L4m5R1n15Q10k77jj27J56j66m2L77p91M41K21k39L44j27
4625A47k20P3n0R3j50M05m80O4J73J11j07m71L1J36M35k54RL71m79J35o3R1J92
$$ y = [370, 189, -58, -384, -140, -28, 122, -115, 135, -143, 11, -220, -211, -141, 164, -37, 7, -216, -40, -148, -207, -211, -339, -173, -168, -68, -47, 160, -149, 257, 133, 67, 323, 338, -326, 132, -44, 119, 214, -100, 19, 250, 19, 263, -19, 134, 186, 162, 7, -234, 140, 104, -63, 176, 44, -26, 128, -36, 34, -114, -31, -34, 164, 9, 140, -196, -150, 121, 76, -40, -230, -232, 51, 66, -2, -284, -30, -101, -234, -137, -32, 99, 75, 247, 30, -170, -273, -149, 191, 513, 222, 108, 113, -292, -100, 117, 28, 214, -147, -116, 344, -236, -3, 279, -207, -227, 81, 85, 185, 162, 295, 160, -163, 8, -18, 277, 58, -42, -130, 50, -192, 65, -229, 62, -390, 26, -34, -50, 83, -219, -200, -61, 68, 201, -30, -148, -205, -120, -230, 96, 3, 37, -8, 83, -432, 378, 101, 100, -27, 129, -37, -79, 298, -493, -52, 169, -70, 274, 147, -73, 0, -50, 43, -107, 298, -182, -118, 55, 166, 59, -412, -381, -245, 190, -64, -55, 316, -163, -28, -91, 0, 192]
4648A92j54P4k50O5p9L7L7j50K23J21K50k89p8K24j07J34j98m5jj0j66L66K30
4671D26m70l2j53J66J21k01J66j2M4J94k57J6Q7j31J92m07K96j15m5k5K67m82
4693c55J85O8J26m2J35r2q2J62k23L82m76N66j77L7j66J36L4j11J14k80j46p7
4715b82N30j69N4p8L22k28j33J35k3l75K29k3j6m4L3R2J01j31j42K46j58J39J13
4738A92j82k57j1M86p4p4l67M80n50K50k09L46P6l52K62K11l19J85p1k84M65l85
4760a82R5j86K49k28L06k57J57K8Q7k41J06K26k95K59m24m0M89k06j71J23r1j03
4782b99K29J69l39J20j60M84k40j50J36j16J75Jl2m2J91o8o2j00M10m50J42nj62
4805a68J76l5j07J78L6L3J07l13p0M08n7q2J6J26l28J62Q1k98K67j35j71K3L29
$$ y = [192, 38, 112, -138, -73, -152, -115, -78, -228, -5, 116, 366, 77, -1, 223, 116, 250, 52, 7, 6, -4, -170, 196, 426, -44, -76, -229, -63, 58, -143, 23, 11, 55, 249, -8, 8, 95, -36, 156, -251, 45, -70, -115, -140, 127, -355, -170, -102, 24, -18, 117, 25, -57, 105, -118, 264, -212, 354, 177, 214, 48, 184, 218, 107, 221, -59, -205, -282, 248, 79, 133, 55, 377, 149, 16, 151, 128, -247, -18, -41, -57, -101, -68, 24, 125, -6, -148, 98, -60, 79, 192, 10, -247, -258, 228, 154, 80, -287, 193, -357, -107, -316, 30, 106, -246, 16, 227, -92, 93, 22, -262, 203, -182, -87, -273, -24, -252, 54, -203, -46, -18, 69, -172, -66, 160, -135, 124, -300, -340, 149, -57, -228, -105, -196, -299, -70, 99, -240, -120, -280, 204, -36, -186, -50, -166, 9, 10, -22, -64, 127, 59, -3, -103, 307, -143, -1, -6, -168, 8, -27, -134, 44, 80, 113, 220, -93, -163, 245, 188, 106, 122, 248, -80, 82, 163, -135, 132, -3, -174, -151, 178]
4828A78k1k09M3R6J2Mk67j1J81pr3J98o5j33o7J03p9m5K49L3q6j19j33q8L21K59
4854B54j01K87k13l97Q4k5k6J55j07K69l51J42p5J71J72j22r8l77N96m24J25q4
4876a45J0J61K2K07l20k8L03l88K23k07K08l42O74m64q4l0J81o6Mn7N9K29M4r7
4900I7k67r5M03m25K23M9R8l3k65K08P6j63O2K03j90r9L6K03j76m8P3J36j37L25
4924B94Oj11j56j15j72N34k84q8K35N4k72j01L9J71j58K57K81m66q5K56j79R4
4946C4j0o6J90j21j7j53NK3Q7L58l38J34j82j19k78M33J22o5p5L15l95k5K16Q1
4970A54r3j26l5K62l78M61j98j4J6k08L69o5J03l83l0M1M4k33J26r4L87K69l44
4993C1K67j05k84J33o4on8j57L79m5k36J16j48K9L78k71l4K0J18j99r4J49p3l6
$$ y = [178, 157, -52, -9, 87, 99, 103, -164, -175, 6, -1, -94, 104, 39, -94, -161, -58, -137, -182, 67, 100, 14, -105, -238, -326, -5, 254, 153, 440, 227, -170, -86, -111, -137, 18, -89, 180, -171, -29, -104, 67, 239, 117, 19, -358, 238, -186, -61, -145, -135, 26, 48, 255, -65, -93, 210, -178, 45, -162, 46, -296, 378, -86, -170, -200, -19, -85, -81, -138, -79, 150, 194, 97, -170, -265, 138, -287, -64, -15, 83, 50, -215, -7, 69, -94, -32, 171, -19, -118, -82, 121, -55, -103, -30, 106, -31, 294, 300, 189, 33, -82, -254, 280, -4, -92, 143, 197, -75, -176, -137, 34, -124, 133, 414, -52, -137, 119, -60, 34, 24, -42, 148, 27, 10, -143, -138, -115, -28, 330, -8, 126, -56, -175, -453, -20, 102, 37, -38, 277, -118, -143, 73, 154, 61, -65, -100, 162, -216, 245, 47, 33, 49, -159, 210, 145, 248, -135, -165, -124, -80, -313, -187, -281, 106, 375, 31, 298, 193, -91, 42, -22, -28, -86, -243, 136, 91, -145, -29, -177, -148, 230, -41, -75, -55, 63, -136, -230, -81, -154, -190]
5017a90J14j37J77M86j75l53n5k5K01lK76k29J05l7M9m4k85J66L10j72n09J02
5039b28Q5J8J00L06l06K54J71n47L48L0m1m42L94k61JK34m34j43K77Q0K06k19
5061a17M17l72O2m6j57L31j48L5J28j09j17J33J68JJ0J80o13P8M73k88Jj33Q1
5084bn2J29J5P6m3j31k72l0J04J99R1l71J21J10k74M12k1k38J53k28J21K9J56
5107E4k52M28L8l48K6J35q7K76m40J60k3L89k72n6K7rq3l09N02j31k27L55j9j75
5131d1r0M2P8J47j78K80k41n4L05l01j03K00j47J01j59J26L19m77N16m95P5j2
5153a09J27j3l76K70J0J37j56N7P8J58q9J49k26J53k76l1j52L14j67K94k79J82
5175E5k01j88P9J67J1n1L58k90j28J91K80l24K06m80J58K36O5j22J19l19q2L59
$$ y = [-190, -76, -213, -36, 450, 275, -78, -133, -158, 43, 40, 316, 87, 192, 155, 204, 160, -125, 41, 351, 179, -330, -228, -143, -125, -25, 281, -25, 229, 400, -147, 201, 231, 190, -252, 142, -119, -118, 116, -318, -461, -184, -104, 102, -117, 300, -72, -10, -56, -213, 118, -30, 5, 133, 24, -93, 40, 208, 209, 219, 399, -214, -136, 337, 49, 50, -83, -2, -54, 75, 90, 166, 123, -8, -280, -310, -206, -7, 84, -287, -166, -56, -330, 82, 61, -177, -24, -252, -131, -102, 54, -198, 230, 268, -80, -54, 81, -6, 270, -170, -10, -33, 356, 84, 28, 55, 46, -37, -346, 156, 25, -202, 153, 134, -41, -131, -89, -11, 136, -42, 238, -3, -57, 248, -53, -156, 44, -103, -2, -161, -35, 284, -193, 323, -172, -97, -109, 18, 5, -371, -101, -91, 46, -110, -53, 25, 183, 94, 243, 17, 170, -106, -137, -289, 25, -142, 152, -127, 55, -146, -334, -255, -88, -77, -128, 230, -60, -188, 3, 283, -41, 165, -315, -157, 79, 144, 22, 141, -178, -260, 99]
5197I9q8k7J07j5J22N2k27j72J43L25M5l64L8j46J20j9K21m10N3J53j22K02m91
5220d01O32k19J38j26J72k80l74M39J52J97o19J01J24l27M22K45j80j07L74k58
5240A05j29j45J37J88l12J77M2K14o21K54J13rJ85l93J26k18M22j96O5M9J4l16
5262b48N35q3j48o3k19K74R6j0k05Q2j02K43l09N16l41l08O8L60j34k73Q0J6J41
5285c2N6J30q3J64k76J77j27K90n21J99j01K04r0J37k05K75o0j88Ol2K16n0p8
5308A1jJ50k95RJ50j08Q4l10Q07o33j12K14KP1j6j58M74r6j94j43M8o6qL93m21
5333a48Q7J9M4j29K33j32m0L31k60o6M17j80J31k50k16J80J0k90M73k07j99J57
5355c5L8Q1j51M20k66j70K41q9k58K38j23K95l54J8QJ50l1L3L6k58P1l8K35l50
$$ y = [99, 11, -16, 91, 76, 198, 250, 23, -149, -6, 319, 364, 0, 38, -108, 12, -7, 214, -196, -143, 10, -112, 90, -401, 231, 12, 150, 24, 196, -84, -458, -19, 133, 330, -289, -188, -64, -391, 31, 276, 96, -11, 363, 105, -24, -169, -32, 156, -156, 21, 63, 277, -344, -90, 23, 14, 199, -194, -68, -286, 136, -60, 5, 54, 68, -248, 287, 204, 56, -7, -226, 48, 144, 134, -71, 11, -91, 152, -157, 359, 18, -290, -222, 138, 4, -269, -189, -173, -32, 24, 154, 71, 235, -41, 136, 9, 299, -222, -23, -124, 80, -10, 127, -78, 197, 137, -51, -45, -77, 139, 89, 11, 10, 160, -135, -126, 24, -84, 0, -310, 497, -136, -248, -34, -32, 39, 23, -135, 339, 243, 49, -94, -46, -112, -120, 273, -148, -61, -42, 2, -127, 106, -26, -66, 265, 5, -61, 356, 176, 307, 57, -159, 21, 31, -259, 214, 7, -192, -35, 3, 84, -67, 353, 87, -83, 158, 69, -189, 49, -74, 221, -133, -115, -107, 43, 12, 45, 81, -177, -106, -144, 91, -259]
5379b59J95j04N61n53Q2N2L0r1m3R3q0K70l47q1K34L8j37J27R8k46L17l2r5K68
5403B97l32j35K1J12L0k24J93J48Kk01j75L10k91R9J02R3k17L82k57J18j51k35
5425c11K33j81N67l2l14NmJ6k7j7J4J72J00p5L7o17P28l48J22o5J16k58Q3q4K76
5450A36k38J69j2R0n5K04l19J94P1l19L8q6M04k86J36j47j2M9L1n75Q24k38l6
5473B3J79k26P7K49j63m43K06k21N85J2m58M87k29O1J33k89O7j40k5l26M06k10
5495b45L26k90K68j06k4J50l10J15Kl10K70J87p5J81j35J2M1P3l7j27L00m68M43
5518B41M4K16n67O4j5j83P0J92k15L29m58K73R1m3k67L03N0j35J92M5n52J97J66
5541C8m12L74K58%j85Q8o9Rk53M09j82K8j01K50m4k20k1j72L35k82pPK27k42J82
$$ y = [-259, -64, -168, 393, -160, -78, -26, 4, -87, -130, -37, -117, 153, -194, -275, -41, -3, -140, -13, 85, -161, 156, 124, 29, 297, -35, -170, -149, -37, -7, -231, -38, 110, 112, -89, -264, 46, -245, -146, -44, 49, -168, 214, -43, 75, -76, -311, -78, -259, 308, 276, -38, -33, -37, -21, -48, -65, -51, 121, 221, 146, 183, -434, 294, -54, 68, 3, 119, -139, -56, -140, 136, -102, 67, 55, 145, 90, 294, -25, 169, 240, -79, -41, -127, 277, -9, 127, -20, -32, 17, 48, -527, 297, 59, 23, 202, -24, 53, 302, 139, -304, -98, -319, 266, 278, -180, 307, 78, 139, 272, -17, 50, -90, -115, -441, -35, -245, 81, -209, 59, -47, -71, 79, -231, -116, -114, -424, -154, 33, -42, 139, 4, 16, 57, 130, 93, -34, 266, -202, 241, 285, 501, -66, -2, -17, -200, -130, 62, -153, 176, -282, -9, 82, 39, -228, 75, 125, -10, 182, 227, -325, -128, 38, -374, 0, 258, 258, 73, 161, 92, 101, -152, 257, 75, 103, 2, 252, 208, -12, -33, -205, 130, -152, -159, -152, 75, -167, 15]
5566A5K35j00j57r7J16j01j20M18p3%Qj13r2N4J24o4m56N44k95M91l11k34Q4J90
5590F6l88L71L2L8m12RJ83K6L40l83N5J69j29j20J34m4J76m37K96J49l27L64k07
5613c9J9M5O1k35K0RL4J27j11N1K32l70J18K45j39L9j75Q0K27k27O2l22L15m14
5637c48L80j07L69j16j72p8m6J66m57N46K2k54J23j3J02K73l48n2M3j10J14j24
5659h7K67l40R9Q1J51k87p7J50J44J37m15J14qK19k78j50L18n0K76k39j71M2J20
5682A6p1K63j89o4L95j42o3o7r9J81j46k02K88J03j56j61J94k1j25J60k28J92
5704E8l06N18m56K75k2l05Q7L63k74oK73j41j42q3R3k5J87%J3k54M7l43J87N05
5728B49k71P5R5j44R4k63J60j4j11o0J49k6Q0l03Q2L09j44j18K2R0R7J60l14M09
$$ y = [15, 250, 150, -7, -104, 12, -89, -209, 209, 136, 136, 144, 31, -61, -7, 117, 53, -403, 141, -154, 337, 26, -208, -124, 66, -322, 49, 81, 119, -293, -284, -101, -75, 265, -118, -63, 106, -23, -143, -9, -53, 123, -314, -18, 131, -196, 168, -39, -20, 25, 86, -149, -129, -120, -86, 41, -70, -19, 213, -157, -39, 206, 67, 106, -69, 11, 238, 11, 73, -249, 66, -348, 32, -75, 294, 178, 6, -72, -118, 48, -409, 137, 159, -95, 28, 15, 117, 390, 42, -10, 33, -77, 37, -87, 180, -160, -61, 20, 171, -116, -193, -43, 101, 238, -177, -63, -71, 148, -130, -280, 38, -12, 264, 25, -146, -104, 16, -55, 208, 19, -45, 350, 208, 145, 78, -21, 160, 14, -188, 100, 203, 47, -114, 80, 59, -66, 94, -134, 58, -248, 270, -186, 89, 67, -238, -151, 212, -62, -68, 205, 64, -78, -161, -68, -93, 94, 94, 107, -147, -100, -443, -256, 249, -22, 53, 148, 4, 98, -165, -5, -19, -130, -190, -41, -67, 13, -290, -208, 101, -43, -161, -139, -49, 48, 208, -106, 303]
5752C03m02M19k50m6j47J34L16l87j72J16O1O8J68l92K30M6j41Q0K48k07k40j42
5774c37N45l6K37o62L37K5OJ1m29N87n31J86J21j07K62j73P1j19q2K12k50K45
5796A19R4j62L6j24J56mj91j80K30k20L23k09J85m32L67J41j49O0q2k85M27k2
5818G8m60O80k77OJ64m64J41J19j99L10j96j71L29o7j30J57K93l11k33M79j09
5839A39L7j32j2L0m2o2j16K49p4J14k62l2J25l9K11j31J81k00k02K34k1n7L45
5862B83k32P1r3j43J96J65k30m4r5J95j62O7L1j75J03K25L1l01K39m3j32l12K57
5885i9j19N4J0R2j02K43J65P7l08Q9K68l44l2J5l9j01l4K24N1j29N2J04k12J61
5909H6Jo1j12l35J46L39no5Q9Q8k01l98K07K35N3k15J26M5l0M2L9M2p5n7j52J31
$$ y = [303, -99, 320, 70, 24, -123, 11, 327, -60, -232, -116, -55, 13, 181, -211, 19, 65, -76, 4, 252, 45, -195, -337, 208, 172, 409, -253, 84, 109, 115, 126, -303, 284, -247, -61, 60, -47, 215, 42, 113, -6, -88, 124, -126, 119, 213, 51, 87, -37, 119, 115, -76, -256, -26, -246, 77, -132, 53, -379, -12, 129, -20, 40, -42, -327, 100, 78, -382, 298, 21, 27, 191, -273, -132, -13, -212, 98, -98, -269, 60, -7, -137, 20, 313, 2, -231, 248, 139, 176, 44, 32, 62, 20, -42, -158, 91, 17, 131, -131, -163, -38, -77, 134, 3, 184, -16, -218, 16, -5, -62, 283, 51, 122, 29, -114, 82, 247, 17, -27, -122, 73, -89, -22, 9, -166, -63, 162, 193, -108, 131, 88, -44, -356, -99, -218, -164, -154, -62, -164, 79, 244, 321, 13, 102, 370, 26, -6, 9, -30, -131, -165, 59, 110, -19, 33, 137, -75, 86, 87, 26, -86, -421, -275, 64, 59, -6, 83, 171, -30, -428, -221, 14, 67, -148, -22, 23, -7, 35, 74, 116, 41, -16, -168, -37]
5935c7j85K73q5L16l55J53L39n61L12j46J3j91P1N6k88J52N03l92J11k49j0J75
5957b5j38K08o1J39J7nj62l7J82P0k8n3l07K69n4J23k15L68p09M12j24J63r1j72
5981b30J26j02J12J48om2l5K61l14p7K41k21K46J20m81K88j59J16J17j23K31k00
6003A6K17j90J55m5m76K98j54J64K48n16R8J76k77N98j28K64m18L1q0n4K2r7k38
6026c86L06r7L26j4j38J92o83O14r4j27J26m1j17l6P7p1L51k16nj13Pl4M89l69
6050e3k81M00j04J75k57Q0K5K12j10N4n0M5Q4l69K16K74m67J88L57n48M34k96
6072Ik74J15K77j4j14K61l06j93L30N5k7j79J28j16j12J0L30j32QQ5l3k06N43
6095D45m26O1j25j00J11J51J40l81J27O0k50M3k0J40P4k18K24k17K44k08J07L79
$$ y = [-37, -222, 51, -34, 282, -73, 80, 419, -142, 170, 24, 37, -154, -83, -27, -315, -163, 340, -52, 59, -190, -200, -25, -163, 45, -16, 123, 140, 135, -27, -64, 118, 188, 160, 107, -200, 69, 15, 138, -77, 291, -418, -6, -130, 33, -58, -230, -104, -206, -94, 54, 48, 6, -29, 232, -82, -159, 82, -139, 107, 227, -254, 34, -125, -9, 108, -15, 216, 16, 233, 43, 198, 153, -323, -25, -179, -15, 233, -283, -185, -9, -286, 312, 184, 448, 30, 61, -19, -73, -51, -148, -386, -80, -177, 149, 135, -3, 189, -494, 120, 26, -101, 25, -16, -133, -169, -92, -163, 188, -28, -33, -146, -139, -173, 316, -53, -334, 66, -38, 137, -120, -40, -15, 197, 87, 141, 91, 136, 220, -149, 67, 341, -126, 62, 419, -129, 305, 9, -265, -150, 127, 113, -1, 260, -46, -239, 91, 146, 119, -60, 68, -48, -160, -150, 180, 48, 56, 141, 108, -98, 445, 19, 80, -45, -145, -34, 117, 257, -124, 3, 63, -187, -144, -164, -24, 50, -168, 56, -161, 83, -125, -18, 361]
6117C61n63L95j13m7J32k82J6K28j78K71k90J02o8K81J58k98k75L77k86L2J71
6138A24l18M18n0j07l30N87m80O4K54l59K28jJ4K3m8J8on8K97n10K16j75N74j77
6162A98k38m9j3j30J89J33k40l06J60M23K8r5r3J56k82J18l8R0l7J1k19M44l39
6185a29K38m4l12L86p1j08J15l16J20J22q5r7J88J16m18L52k3q5Q2j21j50K10
6207c0j46L06k99J88Q6M8k44j35J96K0J4k28NL36J06k51L98j6m81L20j08k70J86
6230Aj95J99K52k85q9J50p0J13Rk09Jm9J08J90j27K26p1m84L56J44O0l78J37j0
6254b1L1J6j17j18N24j82l62N41n58N38l46k82N12Or9K4k44l9jJ61K04j29j83
6277a24o7K4P1J69n0M05k10m17L73j00p0J00k6O0j86J28l39K3J86q0j29J57J03
$$ y = [361, -202, 193, 80, 33, 165, -117, -101, 127, -51, 220, -70, 32, -36, 245, 403, 105, -170, 207, -79, -47, 124, -194, 224, 174, 67, -263, 324, -156, -92, 162, -197, 31, 30, 44, 67, 19, 37, 31, -27, 270, -240, -24, -199, 375, 198, -40, -89, -102, -232, -43, 90, -150, -456, -296, 127, 155, 60, -33, 123, -159, -41, -79, 11, -26, -15, -234, 210, -129, 109, 65, -247, 139, 68, -40, 75, -241, -121, 1, -84, -181, 7, 123, -295, 57, 34, -51, 31, -90, -240, -30, -176, 130, -169, 19, 105, 153, -91, -226, -30, -10, 4, -224, -219, 117, 223, -28, 370, 354, -127, 193, 85, -185, 1, -194, 5, 257, -28, -117, 33, -37, 76, 85, -124, -123, -172, -64, 126, -1, 225, 154, -330, 26, 170, 230, -148, -11, -21, 10, 26, -91, -209, 315, 133, -229, 312, -246, 292, -54, -336, 176, 182, 83, 107, -137, -176, -177, -16, 188, 59, -124, -191, -167, -96, 73, 23, 428, 218, -199, 174, 74, 4, 104, 78, 138, -48, 80, -259, -236, -50, -130, -259, -102, 1]
6300AR3k13J17j50J30QJ0r1P0q3l3J40r4j66J89M4J54j46L47l04j63j48O35l90
6324d3K90l04k1Qn73P01J1J6J07k72K2J85K4k27K41l87J74k47M68m92J88L86j82
6347G3J0k12K46l93O76m82J53mL4o8R4r6n5Q0k08r2J77k21K84r1K55r2J71j99
6371D0o3L8j06K51j80N2%o9J56K09k50n9k2J60q0O2j59K05m1j3k78J94k50M08
6395B05L6J2r8q6M8k20JM26m4k67J00l26J72N7O4j09J11j50N1k21L80J2k22J89
6419A21l3N0O7k2q5l21J75K2k3P5O9j51O6J65J4m07N9M89m50L14l13j01K38P3
6443I1O0k62N70q56N65j75n1n3K98j46q4J35j61l02O25j84J4j54k22K72l3K43
6465A90k80L13l73K24j49k07Q8L53k19J60j15J70n9r5j81o8K36j3r2n2K06j22
$$ y = [1, 94, -119, -2, -152, -22, -14, -4, -95, -25, -108, -141, -1, -95, -261, -72, -28, 126, -20, 327, 23, -140, -288, 347, -43, 247, -57, -78, -70, -643, 58, 69, 85, 192, -80, -58, 127, 151, -76, 165, -222, -48, -295, 173, -319, -131, 255, 73, 83, -129, 117, -276, 400, -82, 71, 67, 101, 33, 127, 31, -24, 56, -152, -244, -67, -288, -4, -95, 160, 68, 239, 40, -23, 15, -91, 160, -20, 32, 32, -37, 119, 328, 78, 19, -3, 157, 77, 139, -20, 185, 144, 131, -147, 47, -203, 205, 241, 253, 155, 69, 117, -103, -102, 324, 280, 13, 113, -213, -41, 16, 80, -29, 82, -68, -17, -238, 142, 154, -68, 121, 88, 138, 205, 183, 98, -223, -48, -26, -49, 26, 95, -56, 10, 175, 189, -218, -159, 330, -120, 194, -119, -220, 18, 91, 151, -111, 459, -397, 168, -7, -58, -111, 187, 41, -43, 92, -69, -371, 254, 70, 84, -70, -292, -20, -53, 190, -90, 223, -150, 74, -75, -282, -194, 159, -60, 100, -15, 155, 96, 1, -180, -248, -12, -25, -117, -169, 37, -85]
6487h5J15J35k13J25K13j06p5l94J64Q7j97K60J3L1k97Q1K30k76R2M6l47M06J5
6510B3j08J5N3J38J09j84N4Nk63K30K0L0p3j05l2K90j96Ql81K67J95O1k26j12
6534a82J77L89m14k56J66K03l0K07j56j17l65L67L77l41o2R3k05L40m34L67j81
6555e7K12P7l60J50J6N2k3J06Q0j52k09K10K01n23K56m9j59K73q7J56k76l0M07
6578B71m73K97O0m15J09K53j26n4%J80k52J82k33J35J20j45J01K4K36j28j43L3
6600C2Nk23RL9N3J70n2q8Q9K14l74K25l06L84k78Q4J59k97L05j91J18rk45k25
6624d02J52L22j12J25j12K04n29Q0M28J25k36j06P7r0J3L04l00PK8j55j4J62R9
6647G0k36J47L3l63J84J96r6K37k47J27j24M4J94Q3l24j56L02k48K27j55l04M20
$$ y = [-85, 30, 165, -48, 77, 290, 184, 109, -285, -121, -34, -231, 29, 42, 73, -224, -143, 87, -189, -97, -51, -398, 8, 23, -85, -70, -17, 121, 230, 46, 100, 105, -158, 72, 92, 122, 49, -56, -88, 202, 6, 14, -367, -100, 95, 156, -70, -182, -5, 384, -30, -286, -120, 83, 53, 260, 104, -13, -378, -11, 366, 25, -37, 56, -149, 191, -243, 124, -57, 155, 232, -128, 22, 38, 90, 67, 173, 253, 101, -108, 102, 303, -220, 36, -13, -172, 101, 14, 170, -106, -136, 271, -202, 95, 155, -260, -151, 102, -24, -78, -78, 102, -150, 32, -201, -66, 54, -91, 10, 34, 270, 142, -1, 32, 37, -186, -177, -138, -85, 85, 33, -55, 34, 248, -126, 99, -207, 177, -101, -17, 142, -155, 150, -41, 77, 68, -177, -402, -250, 72, -40, 85, -27, 177, -352, -272, 156, 281, 45, -61, 16, -74, -61, 243, -57, -50, -22, -177, -191, -29, 70, -166, -19, 14, -349, -165, 31, -65, 172, -75, 52, -72, -28, 166, 249, -75, -231, 71, -177, 50, -105, -409, 11]
6669A1r9L07J51j51o84L40l00N47K1l71J3J76P0j37K35l8J79l28j61K60j26nN50
6692D60n56N0Q4j86N11l23M8k75N2JK82l43K34k75K02J37m86N43q5r7J86k45l7
6715a18J31N9K49n62M90k24l68L65o4l05L31o7K26j94k76J77Q5J89k16k6M03k73
6737A2k5J73k45J83l9j48L8n7N0k49L74j03K81m62M67m21K47j07J85J22k87L97
6759C86m80J48j52k4N1J09q8k22J05K91j97J85j12L93j44j46K35K55o75L69l10
6780b3k3K47j57o8j65L75k6rj90l6L76l25n06O78m0l0k86L19k01k18M62k66J97
6803H5k4j8M1j78K04J62k98lK3J8Qq5K66j21n15J39K37j35j08K61r2K96j6K14
6827C61l19k23k8K52l2j77O2p8K28p7m1J37k6L7k36J27M3j0K00n39L51o6n3n0
$$ y = [11, -88, 219, 370, 219, -465, -125, -425, 122, 143, -228, -215, -39, 31, -106, 129, 91, 270, -58, -219, 41, -85, -90, 460, -96, -46, 38, -148, 363, 40, 88, -187, -135, -134, 148, -195, 39, -236, -34, 103, -383, 160, 75, -22, 164, -81, -118, 13, 72, 321, -241, 249, 25, -343, 22, -42, -347, -16, -83, 143, -51, -327, -150, -65, 124, -92, -118, 285, 12, -13, 160, -85, 98, 59, -89, -51, -108, -58, -307, 67, -36, 245, -217, 250, -171, 76, -31, 154, 276, -11, 386, -94, 54, -98, -122, -71, 38, -50, -272, -167, 124, -73, 112, 0, 393, 249, 103, 338, 593, -82, 287, -23, -46, 201, 44, -24, -189, 186, 160, 151, -39, -75, 301, -24, -530, 148, 108, 78, -208, 111, -90, -308, 154, -112, 85, 61, 43, 84, -94, 110, 272, -26, -29, -6, 12, 20, -65, 201, 80, -435, -296, -59, -194, -302, -41, -133, 163, 147, 361, 42, -181, -209, 43, 11, -166, -104, -182, 46, -31, -72, 65, 39, 76, -160, -33, 10, 0, 200, -339, 12, -54, -107, -157]
6851a57J58L34l03O0K52j03j98Q3j77L45l50J1p1O3j10j97q1N72M9l83M76J03
6873C76m66N27m43j56M07j69k8k67J57j1M0j6K8j87K3K89J40Kk48r9q3J90M91
6896D97o38J94K16l55J83j55J18Pk79N7K25L64l38Q4l05j01O41n33j1k17K1N27
6918B02j93k33L53j04k14L36k79M10p6m65L04k74k41M17J8j99K16J65n4m5O8o
6940A06k18K85j39n3N4l5n4j77K93j71K75j18L9l51M81j78P3k86N77k65j72m0
6962g4J33J05j79J47k00L1K03k92J19K84r0j20k63J31J08j08K11l01o5L23k02
6983i9J91LM53m23j1K71l94k04J85K00Q%m41L96k56L23j81P7k6m03L28o5J79l11
7007b00J00L31m06k4J96L2N4o8l7J58j27l17M01m4l10L95k86K17J33j54j58K73
$$ y = [-157, 1, 335, 32, 92, 344, 241, 43, 126, -51, 294, -56, -45, -116, -53, -163, -360, -441, 131, 180, -203, 273, 376, -90, 437, -6, -162, 245, 76, 48, -219, -62, -73, -33, -49, -21, -208, -185, 104, 244, 246, -2, -101, -184, 6, 497, -141, 53, 269, -86, 97, -58, 60, 67, -212, -155, 70, 434, 96, 180, -125, -226, 415, -118, -129, -346, -325, 202, 9, -224, 129, 25, -189, 147, -132, 278, 202, -263, 41, -233, -474, -57, -39, -238, -22, 143, 89, 44, 112, 106, -112, 173, 34, -19, 35, 0, -54, -231, 62, -109, 166, 48, 87, -264, 217, 39, 112, -174, 403, 138, -34, -74, 59, 164, -15, 132, -68, -37, 166, -126, -7, 277, 187, 67, -196, -65, 43, -65, 146, -155, -220, 103, -99, 92, 95, 548, 125, 114, 385, -9, -213, -28, 172, 180, 180, -261, 135, -121, 202, 21, 98, 72, -331, -3, -68, 111, -200, -100, 231, -175, -199, -3, 29, 83, 15, -22, 136, 9, -308, 93, 49, -261, 134, -152, 65, 198, 44, -114, 159]
7029A59m31J86J30m40L17L66k19J65m12K87j70l1P8K10J7m06M55o05L53j42o8
7050b01L81l33L06k65n4Lj91K77M08m24K08k91L43k16L47j98L15o42lL37o8R7
7072A36p3K91m86K06j38J5P9m99O69l75M01m93M39j70r5J76j05M7Q2j40J15j72
7094i0q0R5J58j21k96M09J31j54j64K80om1m25J73J40j24J74k1o8N7%n8J03j45
7118g3j9K36M6m12L41k20n8M83k65J24J30j68l95K23q4K21J24m17j1j4K43m3O0
7141E2k22L68l44L5kO4K7j65K16k55J79j00J79k32K97j6n22P48m99L03oj13j8
7164b6j32j15L05J34o4L9J62o9k01j22k43J90K43l41K35N2j18M0k69L32P5%j47
7187d0p4K95k38j54L27q5K9j22J55J84j2o5k29r9N3K82k19J89J7j68K93l84n3
$$ y = [159, -272, -86, 44, -396, -79, 287, 68, 233, -179, 108, -62, -93, -15, 195, 212, -194, 261, -344, 9, -133, -201, 180, -153, 153, -112, -166, -163, -354, -77, 331, -93, 115, -176, 167, -49, 298, 100, 415, -227, -230, 107, 39, 136, 63, 354, -132, 74, -64, -49, 30, -469, 200, -175, 226, -267, 172, 2, -93, 83, -22, 25, 107, -33, 82, -90, -170, -75, 83, -38, -334, 75, 206, 52, -112, 168, 162, 121, -304, -131, 9, -115, 59, 38, -30, 27, 27, -31, 72, -73, -92, 144, 190, -222, 119, -101, -159, 324, 59, 183, 313, 145, -250, -27, -111, 110, 234, -183, -194, -208, 35, -8, 52, -170, 198, -146, -111, -113, -49, -22, -187, 29, -226, -47, -147, 32, -200, 97, 81, -441, 307, -192, 111, 105, -8, -26, -158, -273, 32, 166, 102, 141, 303, 234, 33, -89, -332, -142, 101, -240, -5, 47, -71, -31, -300, 32, 107, 107, -40, -114, 181, -57, -211, 116, 31, 60, -62, 93, 277, 265, 200, -29, -128, -75, 207, -12, 177, 194, 26, 319, -65, -118]
7210a18m2L49j52l9J38p5r3J21k58J78k26K28k67J81K12n8k74J70P%N7P9l25L54
7234A47l09R5O6J5L69j84m8o3j63J06l2R1j63J19l2j15J49l40O33j86k61L34L6
7257B64k17M2j05l1K96k28m43J31N11K36p66K88K56j37o2J74k39m6L21l24J62
7278H3j13j24J3R5r2j7N8j9j01K02j32l3K76l7q1K54j84km3n0M08k74j21m7K3
7303e8R1J26m93L38J0j08P2k7k09Q2k54O09Ok25K99k4l10j15L23j29L34o26M20
7326A32l49N39m28J40j51J67j34M11m26k03R9K38j55J54J15k5l09j87L88O7O4
7347A47p3m70J38N2O6J47N4L45l58J44l71R1M11m70K13k2k98M55j59Rj46J0J33
7370D8L1j03or6J96n1n9o1J9l73O28k81L05j15r2J43j97K2j61N6J48J13j89K81
$$ y = [-118, -160, 189, 37, -2, 136, 61, -32, 89, -169, 9, -217, 11, -256, -75, 137, 79, -195, -25, -18, -18, 39, 118, -207, 147, -162, -67, -1, 14, 383, 199, 151, 88, -75, 31, -1, 90, -73, 46, 14, -101, 48, -292, 341, 155, -106, 228, 264, 47, 89, -16, -47, 249, 21, -422, -291, 220, 456, -310, -22, 234, 97, 35, 209, -30, -76, 245, -79, 83, -30, -154, -141, -46, -138, -155, -97, -116, -217, -15, -147, -180, 96, 59, -22, 232, 48, 46, 3, -47, 361, 87, -34, -81, -58, 33, 159, -334, 4, 14, -94, -22, -49, -258, -176, -430, 179, 185, -40, 259, 235, -75, -190, 133, 4, 338, -288, 132, -217, 322, -106, 34, -117, 50, -84, 327, -99, -302, -203, 35, -120, 34, 149, 124, -185, -372, 16, 83, 147, 74, -396, -258, -206, -140, 7, 61, 406, 48, 192, -179, -88, 323, -147, 66, 44, -254, 201, 42, 51, -95, -85, 48, 79, -24, -30, -126, 70, 19, -40, -101, -82, -455, 173, -108, 197, 82, -10, 133, -64, -42, -203, -147, 1, 114, -75, 206]
7394B06j51J12j8j05M3q1j62J04l7J12O9l5K22k89J90k86K68o9p5j84l4P0m7K89
7418A12p5k35J88L02o19L69K1J43l71L38J81l20J19k13P5l6J99l46L56j47m8K12
7440B05J52m53K73l77K21o1L9J42k60M74j95j76O3K55m22Lj63L82j50j53J91%
7462a0K2L57n99L83j40k57M17n4l60K55l38L82o8p8P0r9q7Q7J51j28K82m15K32
7485Ej13K69k13Q4n1O7k63Q7l35M94N0N5k9p0L9l66m8N25l26M43m35O3J16J3l16
7510b55K02J11j33R1j63J23k29N85l54l9K00l8mo7j89L32l51J55K02k00K71j96
7532E4p4k19L49l17O7J62j73Q6K0j03L17k9MK42p71K76q6K32j40L15r2k74J44
7555a0N8J17l49k1J55J4j70O0q1j0L80n36M93J57k98k4p0r8L87k62L06n77M33
$$ y = [206, 55, 167, 149, 44, 87, 6, -156, -52, -89, 23, 92, 57, 279, -10, 180, -106, 162, 93, 18, -166, -200, -130, -177, 112, 37, -198, -10, 292, -327, 42, 63, 206, -165, 173, 354, 34, 153, -60, 15, -21, 178, -168, 188, 41, -7, 205, 357, -96, 177, -200, 21, -40, -1, 141, -119, 355, 160, -16, 47, 302, -120, -117, -280, 102, -48, -201, -10, -10, 12, 369, -230, 153, 13, -244, 173, 119, -241, 14, -324, 58, -10, -88, -18, -117, -204, -117, 34, -94, 188, -227, 5, -108, 161, -52, 32, -19, 48, -215, -128, -463, 31, 81, 136, 107, 37, 76, -290, -338, 187, -139, 304, -131, -68, 48, 61, -255, -53, 58, -75, 16, -147, -24, -253, 332, -22, -61, 139, 101, 97, 30, -159, 173, -178, -23, 179, -21, 250, 54, -20, -239, 110, -207, -140, 22, -151, -65, -45, -148, 169, 140, 144, 386, -385, -109, -195, 37, -103, 212, 120, -154, -10, 48, 165, -184, -205, -50, -36, -206, -146, -227, -237, 143, -393, 100, 257, -41, -65, -135, -233, 154, -108, 198, -379, 54]
7578E4k44l3J80r0K5Q6j5R4r7J51j12Mj05J02j85M36l43L09P6k37K66m47J36O3
7602G4k17p1L74o7L9K8P9J84o04P7K2pP5P4J62q4j95Q1j44L28j21j2j58K54j12
7627E9p3KJ64J16m23J30j80K94J82j92k02J45O0j6k51K00RQJ5J56l1q4m16J70
7651a58K36q2l7n5K50j65k21N4O7K84k41l7J46o2j05J62M2j68k4n9K38Lj01J52
7675A19j14Q3k77J68k01J79j21n1K59j29Q8k17L04n5Q4k15J79j3j1K1j68K75k89
7698a02K72j95j13l4L6o9J51m4J80n8J62l01K26k16J76Oj88K44j73J06M7q7m27
7721d01M77m8K70k86J49m83L80J7j74K23j52J05k6k02k0k9P3R3p0K13k92J32j72
7744b23J52L56k94O9r9j50K21m8K37p0N9j23J29J26k75j48J54j10K20j14j59q7
$$ y = [54, -190, -223, -43, -133, -108, -22, -37, 57, -40, 111, -1, 3, -102, 0, -185, 251, -92, 217, 293, 56, 322, -125, 11, 74, -143, -214, 160, 93, 132, 160, 239, 423, -181, -104, -82, -89, -14, 60, 222, 138, -57, 24, -120, 208, 87, 75, -83, 171, 59, -14, -12, 152, 268, -155, -25, -205, 89, 271, 79, -123, 22, 82, 66, -185, 15, 24, 32, 47, 203, 172, 88, -328, -158, 78, -4, -41, -96, 154, -11, -232, -178, -111, 173, -68, -105, 41, -21, -126, 36, 78, -90, -114, -173, 65, 68, -33, 119, 5, 88, -189, -21, -222, -43, -164, -215, 44, -85, 3, -214, 90, 35, 119, -96, 83, 70, 59, 80, -88, 187, -102, 170, -25, -138, -172, -136, -205, -54, -98, 82, 24, 186, -115, 111, -105, 71, 77, -111, 133, -40, 66, 113, 26, -401, 76, 28, 298, 12, 161, -322, 58, 75, -99, 124, -28, 77, 51, -151, -171, -200, -127, -34, -104, 109, -183, -51, -223, -71, 285, -9, 60, -39, -189, 32, -16, 221, 151, 210, 87, 216, 342, 67, -81, 73, -37, 183, 69, -90, -177]
7766a77p8L05j50p7K97k21k20L21K54L21p21J87l9P2j35k0L96m26J14J31j91K28
7788A71J06n80M09N9o8j28P0R4r7l15K35J89k78J23K13j98L2M4k50Q3K09j51j66
7811a94K36j06M12l95N2J38j76K11l54L44k0J34n68K99j27Q2J40m3m90O9L68j12
7833a00Q3r3j3J15L85m7n97R8Q3J15o1J9J33k00n2J7p6L51l32j4J18m9J76k9q
7858B2l0M1N9k54M14j33Q3m03j21M68j71N5O3j6m2j38P0J32K17m38K6J2J90nL1
7883A32l02J06n6J35J40N9J7k7l03J84k15j16K25p5N13m09K8m12K46L88k24lj89
7906a58j08J94j1J87q5J41l33J21j61L92k98j2L90k93J35j97J94j65J83K7j30
7927A3o7J14j88K55l43K98k01N1R2mJ36j76QJ79m6n07M16Q2Ll65M89P5j50O9l21
$$ y = [-177, -255, 50, -100, -177, 120, -101, -321, 0, 254, 575, -146, 41, 2, 74, -61, -81, 315, -111, 3, 134, -57, 171, 277, -303, 106, 165, 97, -31, 39, 133, 36, -279, -44, 145, -133, -10, 203, 5, 37, 81, -169, -86, 123, -28, -194, 42, -64, 348, -47, 5, 143, -33, 178, -176, 168, 148, 282, -286, 13, -114, -32, 108, 65, -425, -356, 12, -100, -17, -110, -123, -8, 377, 330, -267, -169, -86, 29, -32, -13, 120, -80, -132, -115, -191, 160, -172, -186, -68, -117, 59, 30, 22, -8, 33, 92, -162, 252, 119, 202, -201, -322, 146, -25, 30, 93, 77, 35, -103, -33, 99, 316, -122, -96, -84, 106, 101, 132, -170, -64, -120, 15, 155, 214, 231, 204, -99, 85, -130, -246, -21, -96, 417, 8, 36, -376, -130, 258, 34, 31, -158, -266, -72, -83, 104, 19, 160, -173, -52, -213, 179, -119, -131, 259, -34, 101, -96, 98, -67, 116, 143, 13, -54, 60, -128, 127, -216, 82, -119, -68, 24, 20, 156, -20, -12, 167, 121, -386, 30, 112, 115, -250, 239, 314, 164, 233, -88]
7952h8J86l15K11J60j15N3k83J28j43N1L13k31L9J09j77K18j94p1J72R7R9l20
7974a01q3J18J85l09l2K74r8J47K3J04J16l67j78L08P4q8J18n12L06K80l11K54
7996B28k89l0L61k15m41O94o42K14J6N0J53k59K26q1L04k17j53J8R4J26k01J40
8018I6k13N6J41K4RMJ87m75M69n00J90J2R3k79j50K95K28k04k52N57k31J09j55
8041A1Q1l18N59j68l46J83k13K30j61K84k7k95N4M56m19K76k7j91j63M17l82r8
8063b57R7J41m8J87l33K31J59k37j6k94N59P9l62l3J93j42M8j35K55j05o0K4J26
8086G7M9l57K19j47J91R4R9m17K24J12k71J81k25R6K31O4k30l7k09L16N3l7j68
8109i2J92m9j75K66j16j46k75K0L16N5L50m07j4j15K20R0M7J0k10nK31k78q7K40
$$ y = [-88, 98, -217, -6, 154, 39, 92, -191, -63, -206, -155, 158, -73, -34, 75, -102, 116, -78, -149, 23, 120, 219, -101, -184, -66, 119, -190, -222, 52, -46, 101, 124, 228, 344, -23, -201, 107, 181, 93, 211, -301, 5, 285, -26, 228, -61, -91, 270, 55, -386, 308, -334, -120, -104, -54, 99, -160, 66, -15, 289, 72, -81, -63, 31, 157, -44, 96, -117, -61, 80, 104, 113, 117, 304, -171, 298, -202, -12, 0, 93, -186, -336, -41, 187, -17, -269, 288, 57, 166, 11, 92, -226, 333, 165, -181, 2, -211, 19, -142, 142, 115, -180, -126, 330, -89, 187, 160, -31, -194, 223, -159, -257, -160, -19, -67, 120, -213, 18, 177, -60, -76, -370, 189, 268, -94, -127, 66, -76, -28, -163, 92, -13, -73, -49, 77, 126, -231, -12, -159, 32, 126, 225, -192, 32, 144, -127, 54, -171, -75, 156, 220, -10, -47, -256, 60, 113, 76, -92, 100, 51, -124, 142, 26, -120, -395, -375, -59, -4, 346, -61, -75, -190, 30, 120, 167, 177, -33, -38, 193, -85, -172, 68]
8133F8j89J89q5n0K17n55N34j95O6m6L6j39m3R3K95m67L81Q5M8k66j53N5L6Q1
8157dk68M16n83O76k97L43l74J26j90L37l84L14l68K81j65j02L88r6k37j52M11
8178G2j39J87k67N3q2K51j35rJ82r3K4j51l4
$$ y = [68, -121, 68, -17, -67, 150, -405, 129, -66, 0, -46, -10, -149, -192, -99, 196, -271, 110, 195, 243, -23, -176, -121, -85, -4, -272, 144, -439, 237, -60, 283, -91, 35, -155, 182, -202, 112, -256, 25, -140, -242, 146, 50, -187, -339, 72, -67, 120, -147, -94, -176, 75, -60, -69, 113, 20, 44, -107, -141]
8191a41
$$ Imaginary data points
##PAGE= N=2
##DATA TABLE= (X++(I..I)), XYDATA
0@%%%%%%%qJ6j6J6k4L2l2M0n1N9p2Q8j03J19j38J60j85K13k45K79l17L60m07M60
31B44n16N77o47P23q05Q96r96J106j227J359j503J663j841K041k264K512k795
48a473L121l500L945m476N121n929O977q394J0427j3606J9316l2684J15982P0388
62A65215k72646j749J74536J5258j58071K0057J31686q88j14866p507N6268J1630
74A8923j0485J5907k5815l8876K8966N1516l9019m6528N3999O2868o4438q7390
86h0372M2749R8091j4698q7168K80P9623P340q2557k3930Q4910M6927p3392o3290
99f5487N2919O3042l3734n2889K4015M1658j5158l0266L467J1736N924J1558r823
112F962l4964J0061N7143o791p5962K68Q8838O773r6335j6087R7753K6733q9660
$$ y = [0, 0, 0, 0, 0, 0, 0, 0, -8, 8, -8, 8, -16, 16, -16, 24, -27, 32, -40, 48, -55, 64, -74, 86, -99, 114, -131, 148, -169, 191, -216, 244, -272, 305, -342, 381, -424, 472, -524, 582, -645, 714, -789, 874, -967, 1074, -1190, 1322, -1473, 1648, -1852, 2093, -2383, 2738, -3191, 3786, -4608, 5819, -7787, 11529, -21155, 94827, 165215, -107431, -109180, 65356, 80614, -77457, -57400, 74286, 73398, -41468, -48975, 7293, 18923, 8438, 24345, -1470, -40346, -11380, 40136, 1117, -45411, 8588, 71456, 7018, -80372, -37623, 60468, 45770, -41398, -41118, 38505, 45845, -36712, -60642, 24268, 71195, -2197, -65487, -12568, 50474, 16740, -36149, -12134, 29524, 14366, -15900, -12433, -697, 5227, 16785, 6962, -28002, -17941, 39202, 32411, -43551, -43283, 45555, 52328, -44007, -60094, 37659, 64392, -25268]
125b5268l3485P5273L5112n9574l5540M1983L4227k2544k8425L834K1842J2112
137A9547j2227k8533k836L6996K0224l3588l1198K5918L5829j9715m1430J1357
149a9656M6859L086m8787j8831M5378L3264l7493m4994K7899N0676j7471n3126
161c3196Q101N2050J086m5258q752L3731J1705k1564j1977J0004J1794L510j0301
174I33j8601M587L2031N069l9734j6015M2070K4181m0906l0249L7709L5413l3043
187C445l7960K4076L9867j4210l8259L289L2954P402k4524j5860J5006K1010m884
200A1352k2925m683K0527J2313j4944j8026R758K1394j938k4314p510K4725J7186
213B2915k1493k6734J5722L4147q356l7289q4L7757O611l5480j0828L0946J3742
$$ y = [-25268, -58753, 16520, 51632, -7942, -43482, -1499, 32728, 10184, -18241, -14407, 7435, 19547, 7320, -21213, -24049, 12947, 33171, -417, -31615, -5697, 30132, 10417, -31013, -19656, 27203, 30289, -18498, -37329, 8049, 41313, 3820, -41174, -13275, 37401, 19930, -33196, -25095, 26955, 28041, -17217, -25969, 7762, 19467, -2097, -14074, -4070, 7724, 11234, 933, -17668, -13081, 18950, 24019, -15715, -31730, 10340, 34521, -6385, -36634, 1075, 36488, 3445, -34515, -10439, 29428, 15218, -23041, -19752, 13202, 20604, -3920, -19780, -4774, 16236, 11352, -11573, -16256, 4271, 16584, 1640, -16386, -6628, 14766, 12828, -11486, -18996, 5729, 22915, 1422, -25312, -9590, 24557, 16201, -21088, -21172, 16585, 23196, -12284, -23112, 7834, 21576]
226B1576k6046j4982J8799J6642j0054j4826l67J0162P959l242j3496m042J7726
239E809J0699j8330j7499J7819K1912j5211k5893J1659K8546p506k8702J490K8249
252A3042M991k4747j1693J8226J5556j0893j6454M877J6402j06j4677m943J1413
265I94R275p054j2136J390J3701N840j3572j2492J0245J8368n782k2192J79K4352
279A1116N112k3878r754K2625J2495k0094j5187J6775J6870j1629j7199N940J4748
292G940N13j0711n223N160P715P95q645o015Q383J0348p336j4211N703J7364l289
307H491j9521o21K0278M839j8329r533J5200J2618j0966j3733O806J3777l008
320F298j2767n04J1506L182r205o242N949Q377j606q706k987P293P569m658j1045
$$ y = [21576, -4470, -19452, -653, 15989, 5935, -8891, -9258, 904, 8863, 5621, -7875, -11917, 5809, 16508, -1822, -19321, -1502, 20410, 5199, -20694, -9035, 19511, 12005, -16697, -15207, 13042, 18033, -6714, -18407, -181, 15375, 4482, -11972, -7095, 9307, 9201, -5476, -10419, 994, 10269, 3215, -8921, -7531, 6170, 12010, -1562, -14054, -3809, 14559, 8777, -13415, -13236, 11116, 16228, -7650, -17404, 5221, 17716, -2378, -17565, -790, 16080, 4451, -12748, -6808, 7940, 8453, -2258, -7481, -2321, 5394, 6189, -2456, -8471, -88, 10260, 2924, -11287, -5584, 11780, 8491, -11030, -11651, 8627, 13466, -4863, -14396, 804, 13422, 2456, -11277, -4471, 9306, 6298, -6469, -6973, 4533, 7715, -1490, -7732, -1783, 6594, 4988, -3718, -6705, 588, 8157, 3499, -7546]
335g546P69J2857K591j3054n632J3374Q230j2763j1385J1447J3386q665j4609
348a1000M850J4776j001j3003j882R627L876n734n103K402M801J099m514m190
362d996M139O887k247j0161J85J1288L551j1883o612J0376R281q314j0742N875
376c373J1157l311j1024J130J0213J550r734k946P380N736n442o437K037N937
390B873R61m277l898K404N439j42o112k290O771M146o867o007O173Q816n412j0388
406g810L322J1133o29j0733j749R140L630p828l674N340M099l305m335J719L741
421B061O49l427k551J501M876N33n568l122N297N214m516o438L143P239j645q345
437e099J069Q274K27q039j883P419L688o293m441M014M726j934m117M19K929R21
$$ y = [-7546, -6777, 6080, 8671, -4383, -10015, 3359, 11589, -1174, -12559, -1112, 12274, 3609, -11000, -6150, 8626, 7625, -5378, -7260, 2367, 6243, 509, -4594, -2192, 2609, 3708, -806, -4996, -857, 6030, 3783, -6378, -6193, 5095, 8646, -3237, -9849, 527, 9808, 1494, -9248, -3373, 7784, 4473, -6551, -5421, 4792, 6342, -3392, -6338, 1042, 6778, 1336, -5101, -3064, 2873, 3834, -443, -4341, -1937, 3502, 3360, -2752, -5042, 1729, 5875, -992, -6999, -826, 7990, 2578, -7810, -4488, 6645, 6016, -4717, -6466, 2674, 6304, -1524, -5198, 142, 4241, 936, -3399, -1680, 2061, 2710, -717, -3268, -1767, 3109, 3642, -1926, -5048, 249, 5463, 947, -5491, -2348, 4891, 3246, -5099, -4030, 4244, 4471, -3568, -5451, 1968, 5656, -637, -5078, -1064, 3662, 1728, -2389, -1970, 959, 1880]
453A880j949j419K21K356J105l071k045L027L896k690n772J774O467L36p117j762
469d763O888K323n420l426N207L088m142l795L655M158k405l700O86L115K91j680
485H0j501K69J273J652j034k699N80L651p58l547k28M648Q19n297j757N385K761
502D297n064l163L349L962k236l769J128L589j029k463L03J822M4q65o62K49J142
519F34O32r50j696L84K416J184l400k004L424K318k838k675K209L052k689k874
535b873K398L529j967m006J619L175l63k619R3J236K95q26K77J03m64L53O52j119
553e07k18J130P10j789j031K211J820k528k527K043K891j433k528P83K327o91
569F63j702L41K175o71j801m9J539O70j497n89Q98l5M59K36q08m66L78J392p42
$$ y = [1880, -69, -1488, -1267, 1089, 2194, -877, -2922, 105, 4001, 1311, -4461, -2687, 3780, 4116, -3001, -4763, 2125, 4448, -972, -4398, 809, 3897, -245, -4040, -385, 3773, 1368, -2332, -1646, 1469, 1760, 80, -1421, -1152, 121, 1773, 739, -1960, -1380, 2271, 1513, -2034, -2262, 2386, 3205, -2092, -3849, 1536, 4297, -767, -3930, -581, 3381, 1145, -2624, -1496, 2093, 1064, -1399, -1096, 726, 770, -95, -757, -508, 634, 1266, 316, -1380, -996, 1420, 2604, -796, -2800, 624, 2942, 104, -2571, -362, 2690, 1, -2873, -475, 3054, 1087, -2919, -1300, 1875, 1512, -1107, -1014, 222, 517, -309, -32, 71, -393, -40, 612, -507, -725, 405, 1115, -674, -1705, 506, 2326, -202, -2729, -686, 2205, 772, -1756, -973, 1354, 663, -1039, -698, 1477, 806, -995, -1044, 495, 1165, -332, -921, -23, -58, 401, 637, -171, -637, -259, 1133, 391]
588C91j100K76J327l89j868P19K214o76k684N36K722M4k659k13K052j22j323L79
606c74Q52m64p24Q68L88n96n18O69J94q04M34R33o48j267M22J928n29j954K19
625i71J558K65j290r5J025N4q84o68J461L15r27o91Q68M96n48r1O48n81n89P82
645A37O33n12j172O81J208j062m99O54P44j534n46J688J000j469j167J411Q42
662A037j125n20J213j99j437K12J504j94j253L53O59n6l06K78K80p72m24R81N67
681G98p27n75K42P92m36j92L74J78p96l96P50Q56q80p02N24J028n99r00O93L15
701C47p74k7J055M19j519l06R46K44p89J03Q37l90q43Q18P20q02q95P32J221r89
721A08q61N07P39n94k71R07J84r75l86Q23J46n02q2M27k00j38K15O87o55q52M92
$$ y = [391, -709, -433, 894, 505, -1363, -644, 1570, 894, -1790, -1254, 1468, 1512, -1147, -1360, 692, 570, -753, -374, 478, 14, -710, 158, 546, -50, -568, 101, 295, -509, -75, 858, 210, -1057, -635, 1293, 764, -1190, -971, 587, 852, -438, -533, 492, 546, -338, -1006, 455, 770, -157, -848, 20, 516, -32, -123, 525, -56, -645, 137, 770, 258, -914, -233, 975, -87, -586, 68, 812, -722, -1268, 420, 1420, -49, -1216, 195, 1037, -88, -608, 605, 406, -1031, -819, 685, 491, -762, -409, 250, 194, -112, 166, 446, -326, -750, 231, 798, 71, -504, -262, 530, 94, -98, 276, 454, -342, -738, 12, 868, -12, -714, -190, 838, 239, -661, 32, 347, -427, -454, 601, 1020, -499, -805, 141, 385, -404, -301, 536, 146, -697, 121, 841, 39, -856, -124, 1097, 108, -753, -246, 493, -101, -372, 535, 719, -256, -642, 181, 327, -175, -257, 170, -30, -168, 47, 734, 79, -773, -281]
742b81Q40l21p38L62K97M9l51K24M81n11p23M53N74P5o35O7M88o9p15O39K32k66
764A71q06O24R90p77o92K9R04q70K90P51j84q25j46J140j60r90J40Q23k23m99
784c10L75N64m79p55M59J043j377M23K47n2j74P7J73J03q67J21N63J30K5m13J19
805ep8K17k13J77k09j50j42Q72p6k29o21L20K64l14O9M83j38m42j45Q44K60j311
827e67J38O50l01J78l2J38n40k00L12P89j012N6J30O33l23j50O88j94n29k51N80
848A93M35j217L58K04K1J89j04j7j89K32j55N44j64m58k79N50j66P6l0m1k85k31
870e34M21P25n26p28J18Q66l78j83J20M66n46k59O02L14o06k77L50N60n30k37
890b62L24j04k35J95O73k99l88k98M92j89k63K67K77n05R1M29Q8l67l79J47P72
$$ y = [-281, 559, 238, -500, -138, 159, 208, -143, 81, 562, 51, -672, -219, 355, 430, -205, -138, 350, 281, -434, 205, 437, 171, -635, -11, 979, 202, -490, -461, 443, -427, -137, 614, 430, -395, -541, 599, 439, -551, -411, 412, 189, -310, 65, 629, 150, -605, -146, 897, -480, -57, 190, 138, -36, 41, 214, 317, -550, -429, 134, 264, 289, -124, -5, -83, 134, -79, 98, -111, -261, -403, 469, 393, 164, -457, -137, 127, -187, -118, 365, 227, -215, -360, 484, 744, -567, -429, 221, -80, 98, 66, 204, -336, -536, -224, 565, -447, -391, -261, 372, 49, -101, 587, 393, -136, -387, 193, 628, -589, -231, -27, -6, 183, 79, 62, -127, 105, -50, 494, 330, -128, -407, 143, -23, 53, 23, -18, -303, -534, -113, 612, 86, -642, -524, 342, -36, -219, -99, 367, -179, -438, 164, 478, -128, -405, -55, 505, -25, -262, 62, -42, -277, -82, 591, 292, -96, -394, 98, -91, -354, -87, 190, -315, -224, 205, 293, -74, -453, -306, 466]
911D66k06m11j17J23K33M8J03J89k98m77P3M69J75o29J62L6M9K90P2l91q2j16
933b39J77O20k76m36M17m19k64M42P17m76o04oP24J4o41j24P43l37R9p3J42j98
955Bn74N56L33l85J76J37p8j94K6N22o70k56J49N90K14j071M99L05k30k11n9O51
977D32l52m61J82K50R0m61q1K16L10K14nk72r3j71N04m39j85K33L58j6n00L0Q89
1000F72o52k1k21N25K59p07l94L89L62j95Pl12O31n23L0Q67m78k22N4m58M53l05
1022b39M22j05q3j2L63j51m45l2L64J45n44L05O31m83k91m68Q35J08l45l37L02
1043f0N36l27O4k77J16o4J35k31K33k29nK58k33J1K50r2j30m19M82K82m30m10
1065e40O81J17k12m26J36O14k87n31N74j2k50k09N5L66j4j69k3R0Q1K00n1l75
$$ y = [466, 260, -151, -268, -145, 88, 136, 239, 428, 130, -347, -274, 195, 370, -259, -97, -61, -12, 278, 350, -41, -123, -239, -62, 558, 282, -154, 263, -156, -420, 22, 739, 263, -341, -347, 377, 391, -250, -374, 369, 32, 131, 58, 200, 2, -572, -16, 317, -68, 108, 245, 167, -27, -1, 521, -149, -405, -256, 334, 548, -523, -24, 281, 51, -160, -219, 432, 80, -381, -199, 51, 141, -320, -401, -185, 125, 339, 334, 62, -31, -202, 302, -137, -322, -89, 269, 253, -247, -217, 672, 20, -1, -222, 303, 562, -145, -539, -150, 212, 17, 24, -288, 343, -180, -150, 717, 239, 17, 71, -387, 66, -239, 183, 78, -5, -17, 346, 195, -250, -282, 82, 227, -317, -12, 619, 136, -155, -623, 212, 320, -25, -362, -60, 476, 149, 213, -64, 52, -12, 123, -108, 125, -104, -109, 149, -84, -73, 177, 85, -45, -464, 18, 300, -130, -540, 141, 258, 46, -380, -244, 370, 83, -448, 126, 114, -136, -345, -290, 76, 62, -107, -130, -40, 41, 241, 190, -185]
1087a85j59K14L95n35J91j35M73k14j94J81N15l48o07K61J63L58o22L81J68J51
1107D52o39J15J83J07m80r2L02N12l82J63l28j28J64N35n56m12N28L84m04k80
1127b56K49K11k16J07O0m9O2k42k32L22J9m8Pk40M19j10j34O9L96k83K5Q9n7j87
1151a9J86l73L5L55k9Rj78k53L00k2M1k28J93J00k10l55P91k36l10p0M21n4N7
1174A51l67o2M64o4J37k98k29J45L03k21q9J2L03J19m97L12K48l03n20k5N71K43
1196C33k37l15K69j25M48n1o09M22k39o4L76l24m14O57l55L20k5K48q6o55K43
1217a83J37L95o17lM31o81N96j13J95L03n45K3K06K02m48j56K50On2L37k43k26
1239a86K95m7j72J5K51r5P2o5l09J80J59j43r2L2L75l05r7K04J40n8l16O6j10
$$ y = [-185, -344, -130, 265, -270, -79, -214, 259, 45, -149, 32, 547, 199, -408, -147, 16, 374, -248, 133, 301, 452, -187, -72, 111, 218, -262, -354, -52, 460, 78, 241, -87, -215, -51, 484, -72, -484, 44, 428, 24, -256, -7, 204, -12, 95, 155, 106, 168, -74, -306, 16, 35, -13, -6, -246, 173, 63, -71, -2, 394, 111, 136, 225, 168, -19, 167, -206, -171, 184, 155, 164, -14, -267, 33, 11, 52, -176, 17, 117, -93, -448, 343, 107, -203, -273, 148, 94, 151, -216, -278, 186, 122, 259, -39, -268, -123, 180, -41, -130, -118, 185, 304, -193, 119, 367, 64, -456, -481, 90, 333, 96, -219, 50, -75, 373, 322, -287, 135, -104, -168, 208, -116, -530, 127, -228, 92, 67, 315, 229, -426, -183, -46, 349, -268, -271, 160, -521, 75, -38, 157, 460, -85, -62, 144, 346, -102, -258, -8, -2, -54, 283, 40, -186, 109, 62, -110, -95, 156, 61, 133, 68, -241, -61, 98, -45, -137, -105, 270, -35, -132, 72, 212, 154, -162, -96, -206]
1262b06J21k9J48l5J05l85J81N2K62l24k61L44p7lK06m03m0O22N6m87l7l4L93
1285A69m17J29L31K52m64Mm39N11J02m6k66L77k75Q4J72k52J8p6J83p4l22O28
1307C29j34m17P1L82j44l42K7J34K69j10l33Q6M13j87j45J37J49j4j43k8M1p6
1329c5K12k10j31L22j4k6q5k0J2M00l12m48O13j27o4l08L22J06k32p3oK19j58
1352d3r8L03k40N7L7qJ26j90k16M43j69J76k05J68j06n70P44l57L59l09P2M31
1374D05k47J84l39J44k40o1K69j40m3n81M76M77l09j34N6N30k99k92J74l82M16
1395F4k64M26j80J0l62L17M9j12L35k20j86l5KJ49O6l86M19r7j7l2J12q2J88k65
1419a01L47l28N61m24n8l67K59J90k91J57qK64j95p0P6K42j63rP4j96Q2l9k80
$$ y = [-206, -85, -114, 34, -1, 104, -281, -100, -48, 214, -110, -371, -27, -104, -107, 99, -304, -344, 278, 334, -153, -190, -224, 169, -248, -119, 212, 464, 0, 4, -435, 76, 178, 132, -134, 243, -32, 52, 224, -28, -10, -86, 97, 23, -299, 329, 195, -222, -151, 231, 87, -255, -228, -94, 175, 65, -268, -182, 231, 44, -101, 36, 185, 171, 28, 0, 41, -35, 177, -33, -164, 158, 144, 118, 33, 13, 25, 425, 113, -335, 278, 151, 87, -221, 101, 207, -25, -98, -104, 115, -43, -141, 162, -78, -21, 16, 8, 134, -56, -272, 171, 2, 178, -27, 141, 35, -535, 209, -148, 211, -98, -26, 405, 158, 342, 3, 147, -93, -154, 115, -25, -68, -649, -173, 304, -5, -139, -83, 447, 148, -144, 30, -352, 64, -200, 226, 46, 56, -306, 11, 60, -52, 283, 63, -123, -158, -156, -7, 59, -327, 92, -5, -22, -54, 58, -24, 164, -101, 246, -82, 479, 55, -3, -370, -111, 79, -212, -55, -63, 201, 6, -64, 12, 254, 91, 82, 156, -40, 42, 3, -277]
1442b77L04J22j93Q0K01l44K82K13m54m9k24K99N5J65nJ42l76m9k5l8J99k19k31
1465d22L70O7l34K82J90l06j03M76l29N9j69J90l01K47R8L2j41J46J78l53J70
1486D7l0K24j34j73j4m7j18M55k58J76K61n13J71j75L24j78J66o8%j7k22m8J39
1509c2k33J58n9K56j13K57k11k44M80k42N0j62J51l64K39N2j47K32j03j57J5M28
1531B51l15r4J38J62k60J8L85k79L4k13L41j96j98j2l4J49J86j49K46j93j26L09
1553A50J8l89M01k38M63p26L97Lj84M34k33p7o2Q1K53k61j85P3r1J98j99M83k18
1576I1M7j50N1j96J18K82m7n16N66k89O3kJ35l06L9J68j36k8K49k82M06j62m23
1599c22M75r8Q4j01P5k45L23k97J53Q2j00j57N05j47q8K6j96p8J82J39j00J79
$$ y = [-277, 27, 149, -44, 36, 237, -107, 175, 388, -66, -115, -339, -40, 15, 180, 175, 317, -59, -108, -133, -171, 28, -191, -422, -52, 15, -319, -37, 153, -153, -256, 220, -109, -50, -219, -29, -330, -83, 15, 47, -94, 52, 230, -123, 47, 17, 241, 107, -66, -80, -127, -245, 210, -48, 128, 389, -124, 47, -128, 196, 18, 184, 116, 116, 99, -123, -171, -32, -265, -107, -166, 90, -23, 234, 23, -221, 259, 17, 67, -95, 56, -308, -69, -17, -164, 68, -35, -192, -177, 251, -64, -158, -20, 142, -118, -100, 285, 6, 40, -173, 168, -28, -226, -238, -272, -123, 63, -86, 160, -33, -159, 150, 168, -221, 180, -58, 405, -321, 76, 79, -105, 329, 96, 19, -43, 38, 291, 30, -155, -82, -173, 25, -174, 309, 91, 138, -12, 39, -157, -39, 243, 196, -320, 246, -43, 20, 18, 153, -153, -114, 54, -82, -110, 139, -143, 263, 101, -322, 153, 55, 139, 38, 113, -132, 191, -106, 47, 129, 29, -128, 377, 230, 142, 168, -28, -106, 76, 215, 115, 294]
1621B94o00K95L35j80k04J51j32JJ87P6P9k61Q3r5k38N82o01K11J66k69M36l68
1643e2K20p6j20J48J15j37m8l28l07M83M3LJ46l50N70K51o36m69P69J3l43j6J69
1666D8N1l04M36J49k01O3J00o6l31L94J5l70k11K09L19j54k60J93J05k29j7J58
1688I7k00m8j85K01K27m40P72o50L0K84p3Pm03L45O3L7P0n4m9N10l25j00r7j03
1712h4k00M37j91M89m05K60k37n4O8J71l75L9j26L04P4j90k15L8K18l42M06K12
1734B97j52k28P5K9m1qj87N1J60M7O1j32n0k76K01M5K58m60K81Q6j02M70m72m2
1758h9M9L51o1l09k50M02l52J67j71N20j30l29L92Nl46O1M25n06O7N39n89K43
1780H9j31PJ3K05j08o0J01o7k07M4J97N5k65J34K08l33K83m71L19k58L75k00k08
$$ y = [294, -306, -11, 324, 144, -60, 91, -41, -40, 147, 223, 302, 41, 124, 29, -209, 373, -228, -17, 149, -120, 316, -52, 168, 92, -28, 120, 235, 98, 50, -278, -585, -102, -59, -56, 90, -260, 310, 561, -75, -544, 225, 238, -105, -121, 48, 99, -205, 231, 380, 179, 242, 342, 276, -55, 339, 354, -16, -227, -18, 301, 147, -113, 80, 185, -44, -61, 97, -103, -151, -336, -135, 92, -348, 424, -226, -196, 88, 15, 22, -381, -36, 27, 64, 134, 80, 31, 541, 216, 116, 19, -84, -284, 153, -38, 451, 46, 306, 69, 15, 83, 254, -121, -82, -208, 96, 170, -20, -235, -197, 21, -321, 85, 297, 145, -83, -8, 21, -20, -28, -215, -164, -4, 43, 104, -28, -78, -354, -153, -108, 150, -310, -29, 57, -45, 425, -47, -89, -40, 311, 250, -59, -309, 93, -259, -92, -263, 257, 127, -202, 190, 195, -151, -90, 335, -171, -104, 435, -154, 89, -42, -35, -22, 183, 75, 15, 116, 49, -158, -114, 83, 138, -127, 7, 215, -118, 165, -306, 13, -245, 130, -70, -278]
1803b78K90M4j18J18l65N65J67m31J86n31M89r4j21O7P0J64j25j13j55R2M41r72
1825f10L14M02J26l89J46j07K53j2k59K9K5J39mo9m4M13m52j77M83L9j37j49o7
1848a07M87Nk73J74l68N53l43Pp6J34J72l63m06J83P12l97m69K81J47j04M0l39
1870c50L89M49m33k52O0L16j35l00J64j40Q65p63m3M11J01r6m39J22J10K01o3
1891A74p7m9j21K51jl53L77J38m87j16K97J47k76J08l94N42Jj23k76J22J72q4
1913b8L2l24N62j06m47J80K35J01j23j71R2N47q94K41n6N2j3Q5l9J44j12O08o26
1936f0J0L22j79k77L34k30J79q2j80J07L32n8m09J94P2l8K56n02L17p0O0m04l8
1959c44J42M19l77m08P28K27k35k89k35Q22k83o6k60R6m3j6J95k21P9RR8m46L45
$$ y = [-278, 12, 56, -62, 56, -309, 256, 423, -8, 178, -353, 136, 42, -79, -12, 58, 222, 97, -16, -171, -79, 362, -610, -296, 106, 232, -157, -11, -118, 135, 123, -136, -107, -82, 57, 53, -16, -60, 353, -99, -276, 207, 246, 109, -40, -107, 380, 385, 112, 286, -82, 471, 128, 135, 59, 193, 365, 2, -404, -221, 491, 94, -375, -94, 53, -51, -11, -350, 39, 488, 55, -197, -137, 179, 44, -256, -92, -232, 633, -130, -173, 238, 339, 243, -196, -74, 36, 237, 174, 97, 48, -73, 178, 177, -176, 201, 339, -148, -264, 33, 180, -96, 12, -382, 160, 161, 38, -238, -116, 56, -28, 4, -320, 242, 136, -311, -131, 104, 205, 82, -89, 3, 550, -344, -103, -159, -107, -120, -35, -74, 70, -42, 566, -60, -50, 272, 93, -184, 150, -80, 99, 17, -163, -56, 276, 218, -191, 3, 75, 37, 293, -209, 108, 38, 98, -306, -344, -202, 217, -160, -568, 160, 387, 152, -137, -372, 450, 167, 101, -159, -63, -106, -122, 73, -148, -69, -60, 38, -408, -63]
1982f3L85n76k15K99K74j41J31j52N4RJ57o7K56k43%k43j27K25j43L54l76N92
2004C90k9j32k15k13J31N66k54k85R7J77p2k08l71Q03l95p9l94P97j68j65o3M2
2026d0r0L46j58l98K51oK61j72k66L59%j83p5M2M54k52k40K98q6J37l94K03L67
2049C58j02r3n02M82R6j38n43L91J24K70n35J13Q5L59l45k08P2K89O7l50M8K87
2071B25L8k1n34K00o6N40l67p9o0J87J44n11m2L3P37n29j37k0K41J1m81L63L96
2094B68Q5m86q3R5J57K40l53j43M84R3m15j46K10L56m50J1j4P36p48k65j05N85
2116A12k66J94k48L90j5K9m30K38J83k44j28m0P0M04o6m89J25O00k09k66k57N93
2138B80KN9p29L47L56j58k87o0M75p9n05N3K76j78L95l11J1M48j36j74l79J23
$$ y = [-63, 322, -254, -469, -170, 104, -37, 94, -58, -4, 5, 162, 95, 351, 108, 108, -135, -262, -37, -180, 174, -202, 390, 361, 229, 14, -199, -68, 498, 244, -41, 56, 233, 161, -47, -418, 385, -10, -89, -483, 314, 146, -19, -82, -40, -130, 216, 58, -340, -89, -95, 166, -6, -272, 87, 87, -96, -171, -129, 325, 73, -167, 131, 45, 182, -212, -9, 358, 256, 163, -339, 143, 239, 101, -442, -51, 73, 343, -192, -79, 6, 365, 20, -188, -116, 173, 240, -110, -62, 225, 263, 242, -292, -92, -158, 382, 15, -64, -124, 63, 207, -304, -346, -313, 424, -105, -242, -262, -21, -10, -491, -128, 268, 353, -133, -216, -121, 36, 276, -77, -220, 264, 357, -58, -204, 6, 362, -88, -77, -91, 645, -103, -368, -473, 112, -154, 40, -208, 182, 167, 196, -234, 4, 187, -57, -185, -225, -155, 249, 183, -306, -181, 419, 210, -56, -313, 280, 282, 341, -388, -41, 315, 157, -130, -190, 285, 206, -299, -246, 30, -148, 247, -64, -53, 395, 259, 85, -294, -171]
2160a71N56k74k30l50R90j68k05j54l1J63P6m77o9L42j00Mk1j58M71J15m94K69
2182H4J67j5l83K43R7J73Rm39Q4K82m08j47K49K45J98n48rqNL39k17n1L01k87
2206c6J07l72M29p7J46j17l24L17j51J87K15l38J19l88M04l24K01k07r9N27j13
2227A06j10J0j72J87R3k3j31k12J99J84k87m8J20K85k09K39m07P21l68m54Q5L17
2249A25q4J54k31j98K53J64k07K93n26N95l65k67K50L00l31J28l49l1K91l00J39
2270a97q1O36l35j71L8J72K4m93K78P19o92OK13l56J52P3J45l59J51n3J93m36
2292c73M81n9k02k24L69l12L96k10k68L66K99j96k84K93p1j91J08Q6n3J52j28
2313b1k73K08j05P3J44J94n68L98M94q56K94K32l90QN9M9j00O4r9Q1L73n25J93
$$ y = [-171, 385, 111, -119, -469, 521, 353, 148, -6, -37, 126, 202, -275, -344, -2, -102, -98, -119, -277, 194, 309, -185, 84, 251, 236, -147, 96, 193, 366, 375, -64, 20, 302, -106, -253, -4, 241, 439, -109, -118, -126, -121, 218, 1, -50, 251, -36, 71, -301, 128, 51, 197, 80, -244, 73, -78, 109, 324, -14, 105, -283, 121, -203, -2, -209, -308, 219, 106, -4, 6, -166, 21, 114, 91, -40, -252, -53, 131, -156, -204, -84, 201, -8, 231, -176, 545, 177, -277, -192, 125, 41, 195, -36, -234, 19, 183, -24, 269, -257, 338, -27, -294, -44, 256, -75, 53, -296, -327, -36, -336, -197, -278, 358, 23, -148, -110, 62, 86, -407, -129, 590, -102, -96, 117, -239, -87, -14, 131, -228, -77, -130, 63, -373, 108, 49, -153, -377, -8, -320, 76, -134, -402, -36, 263, 67, -217, 76, 5, -186, -78, 8, -45, 107, -21, -294, -86, -191, -118, 26, 220, -348, 50, 544, -312, -18, 214, -176, -168, -109, -60, -160, -96, -195, -114, 259, -266, -73]
2336g3l44M78PR2k30J93k39O85m70l89N07k28j28l1L3K49K8P0q7M7k20K11j18
2359D3j7J9J34k58J15o5J3J44m69K87%j90o8K97j74N91k16j42L3J14j85l56M06
2382E6O5k8m3j80K57K01l26k53L00J80l75K18r3l8Q3J47j35R9J97N2o08M03N3
2405B32j40l41L35j91l6J58l1K60j74k51L65k00k6q3K81m03L25Pn2l31K27P7N3
2428F1K4j46j48K23J21l75J54n5L39k82O6J30j06l5k52L24J62j28J76k48l03M08
2450A10j89J67j5J09j04k68r3R1L08N6l23q7K02J71q7j93J28j15K38j83NK94k00
2473B2J08l22j31L83j40j72K01J72l33K29j24L74j15m6k28L22k06k30K49JL45
2494C59k82k73P1O3o0l5Q4J84J38n62J87J61k06L36j39j33J07L88n09j10L04m8
$$ y = [-73, -417, 61, 68, 160, -70, 123, -116, 569, 99, -290, 217, -11, -139, -170, -137, 112, 140, 210, 123, 170, -50, 161, 43, 26, 45, 179, -79, 36, -29, -16, 128, -341, -54, -54, -244, -312, -15, -189, 402, 186, 44, 77, 191, 6, -350, 56, 121, 93, 50, -130, 127, 328, 2, -251, 49, 229, -146, 72, -21, -59, 24, 171, 36, 135, 332, 384, -224, 179, 232, 92, -249, 86, -105, -141, 17, -14, 246, 72, -179, 186, -14, -40, -123, 158, -245, 80, 87, 35, -296, -69, 8, 61, 85, -61, -209, 14, 135, -240, -86, -141, 198, -84, -18, 112, 6, -29, -281, 43, 205, 77, 253, 5, -298, 110, -79, 88, 73, 182, 78, -190, -283, -192, 116, 172, -151, -238, -36, 135, 48, -145, -17, -132, 106, -77, -72, 222, 22, 130, -192, -323, 60, -80, -252, -51, 121, -212, 17, -107, 267, 152, 106, -122, 200, -6, -236, 13, 14, 359, 77, -196, -125, -62, -122, -157, -73, 111, 249, -313, -126, 35, -171, 165, 26, -107, 0, 388, -121, -231, 73, 25]
2516B5j8j08j28J95MJ40k48J93J47J14l37j49r5L51O2o04N96R6J85p13K79k85
2538b98J06L56k53k9j91M74k59J51j3K96m78J36o4N65n94o4K15K29j81k26J21
2559aK42k52K72K6l28K93k70Q6j91j14nN16m08K95R1l42J8r2J82P4k87J80K61
2582B46j83J49j50k3o9K45j88L1P6j18O9kK9o6m07L88j06J87j0k02j85O2J28K36
2606A37m9n6n17O41l04J80j76K86j22r3Q4p1L29k21J56l85J78j30j52L63j50j14
2628a86J85pO3k14K16J5J90l10L17m19R4NK58Jl13J23J15k29J53J70k9k95J8R2
2652A3j07Q7k23L9R2K66k76K17k13p0nJ84J29j29RM9q5J53k50O6j12K62J53k43
2676FK7J45j24j97L36n36M10j48K70K9l54J36J6J16l36RM03m38K38L5k05K11m
$$ y = [25, 7, -101, -229, -34, -30, 110, -138, 55, 202, 316, -21, -170, -265, 86, 148, -456, 140, 236, 421, -292, -13, -298, -192, 164, -89, -118, -309, 165, -94, 57, 44, 340, -138, -2, -66, 499, -95, -159, 56, 285, 104, -122, -1, 241, -11, 261, 287, -41, 252, -18, 68, -123, -237, -242, 274, -134, 161, 252, -90, -72, -164, 18, 92, -195, -15, 246, 63, 212, 62, 39, -30, 215, 27, 58, 134, 16, 85, 83, 112, 46, -361, 27, -79, 108, 98, -104, -289, -227, -99, 137, 88, 32, -485, 156, -148, 32, -144, 142, 20, -73, 11, -60, 269, 48, 204, -181, -3, -133, -285, 78, -72, -186, -1, -8, 55, -159, 57, 72, 262, -48, 269, -150, -56, -51, 207, 208, -105, 18, 133, -96, 57, 227, 198, -97, -79, 13, -94, -7, -230, -191, -99, 167, -109, 108, -105, -175, -180, 4, 133, 4, 13, 62, -23, 130, -120, -54, -166, 96, 249, 6, 33, 178, 54, -143, 193, -343, 67, -81, 189, 218, -136, 0, 16, 132, -204, -195, 208, -230, 8, 43, -162, 49, 45]
2699D5N2k33K97j26O2J0l27K53k7K19k85j9J50k44L21l11J60J18o9K29j33L2l68
2722a94P5L97J08Km70q9O6K3K04N4q3Q5Kn0k73m1J95k74K69p2rO9L46l39k1j86
2748b06K3J45R6j49J50J52k29l25L93q0K15k16j92J4L75m24K66L12n42K53k08
2769a77L4J20J41m0j32K25n1J09j13m04O06j70k69j19K09K66j61j71m9J71j81
2790a56J73L52m00J7O6k29p6K47p6k2J6K33J69n14J24k91R0L95N9l29N2P8k4K49
2814B03q8l14k45J93J99k21Q3L70m21N59k37op6L79n17K71N6j92k77K13L4O4J57
2837A87l89K54k63J83k38L99l92L13k6j4k47JJ84N4k8RJ6l6J56J71j1j57p7j31
2861h2L63m72PP1k25L81R3J63l84K31k15J72k79M83l11l1J3k59K36j71K26J82
$$ y = [45, 97, -136, 161, 35, 97, 107, -220, 33, 6, 225, -60, -79, 71, -173, 148, -163, -3, 115, 46, 275, 142, 174, -194, -119, 278, 386, 388, -82, -171, -105, -82, 122, 176, 93, 178, 180, 130, -143, -184, 11, -263, 6, -66, -75, -6, 340, 1, -20, -206, -183, -38, 58, -91, 59, 211, -18, -343, 50, -30, 185, -31, -223, -209, 166, -258, 8, 320, -222, 31, -177, -143, -23, 118, 78, -54, 171, 120, 229, 116, -288, 318, 148, -121, -240, -31, 235, 74, -97, -146, 25, -156, 17, 369, -31, -14, 52, -177, -253, -6, -82, -104, -88, 145, 314, -200, -76, -367, -277, 118, 177, -152, -100, -22, -46, 203, 115, -199, -444, -251, -52, -273, -190, 180, -241, 318, 81, 75, -1, 378, -139, 132, 188, -4, -281, -68, -34, 30, 187, -202, 52, -211, -28, -266, 133, -259, 54, 28, 14, -233, -232, -48, 6, -22, -13, 3, -33, 123, 294, 283, 126, 49, -82, 281, -191, -184, -113, -338, 43, 136, 299, -85, 146, -69, 103, -176, 307, -4, -35, -22, -281, -45, -216, 10, 192]
2883A92j38j34R1Qk71j87N41j0O9j31n88Q49l91M95k94j82r0J87l45L15NK11k57
2906e5K0J7o9J82r2p8L4j60J46L32o73K91N0o2k38J77J98J15J36M3m61m7J38j20
2930a76K9J77J1p6q3R3J58q1K61k90k49M66l19P9L50j23k52j18o8L90J46k38J4
2953A01Nl76M83N4l54K07o3Ql47P2L54n80L11J88n3J35n4j97L40m9k02R0j48J67
2977I2k26j4J87j99l9K94j13J04n7l21J2J78l5O9L16k13l52M57J11j69k50K14
2999D6k38J13j9J37J94k06J20k17R6K0O3k42K85k58J10L57l87L3J60k37N2J44
3021A26j62J92k69K46n9k33K27J9K0j9r6J33l24K16J60nj31j18J56l88P4M43o0
3044A48j89o3J83k62J70l11j5K63N6L8j91J00P5k20L62R2l13K01k10J59q9mM2
$$ y = [192, 54, -80, 11, 19, -252, -439, 102, 92, 161, 30, -558, 291, -100, 395, 101, -81, -171, 16, -329, -14, -9, 202, -55, -35, -18, -87, 95, 3, -75, -41, -201, -55, 277, -396, -105, -55, -117, -355, -178, 20, 135, 271, 314, -147, -194, -56, -176, -147, 30, 41, -35, -118, -25, 133, 52, 313, 23, -226, 240, -79, 0, 350, 227, -25, -143, -211, 179, 325, 87, 101, 106, -270, 213, 267, -87, 120, 57, 65, -282, -210, 144, -436, -125, 63, 10, 145, 91, -106, 234, 185, -17, 73, -75, 92, -134, -148, 39, -160, -199, 95, -18, 86, 29, -292, -280, -102, -137, -68, 248, 35, -317, 140, 251, 82, -168, 46, -192, -79, -98, 39, 233, 27, 147, -70, 26, 46, 109, -133, 152, -106, 4, 361, -26, 7, 167, -70, -18, 126, -36, 156, -113, 133, 74, -159, 68, 87, 107, 88, -8, 125, -199, 17, 177, 172, 41, -77, 79, -309, -235, 208, 148, -41, -104, 79, -183, -13, -324, -339, -76, -20, 18, -173, -73, 2, -218, 144, 236, -77, 124, -86, 73, -16, -20, 22]
3067B2n1Nk24k04N51j04R8N3k87K82k8k72O6O4nRo3j82K88j52k01J31J50M05l06
3092D5Q2j40J64L8l39L51k19q7j06O7J20j1K00k46j51P3M6J55J22l27L09j65j12
3115a31J08M15l10o7O7J97l53J87m4j49n9K77L2l27J52k61J47L85o34M48j28L
3137d5J90k18r9K77k13J18L66l98j63L03O9l26L64k36j66M81pl47qK40l09J96
3159F9j79L01l93J21J76p1K06m12n2L04L70l01K39m21J47L1j64m6K32j11K0k08
3181a42j97L65l93M73jK90k85k48N9J02J97j54j04o9J48j30mM21n02L07p7J6m86
3204d14N58j06j00J59L23k92k34R9ln0j15Q1n28P76nj75k02M00o1k20K48p3n2
3227A4J14j82J7L39o56J25K90q1j13Q3J18k48J96P0L7l31L81n94J55M41k99j4
$$ y = [22, -29, -24, -248, -452, 99, -5, 93, 146, -141, 141, 113, -159, -93, -29, -34, -25, -88, -270, 18, -134, -335, -204, -54, 351, 45, 127, -13, 151, 189, -150, 201, -18, -105, -211, -144, -24, -35, 165, -81, -232, -159, -113, 42, 164, -163, 146, -19, -131, -23, 392, 82, 15, 82, 279, -74, 113, 69, -80, -139, 138, 170, -157, -5, -266, -119, 266, -368, 80, -48, -45, 145, -73, -172, 105, -108, 10, 376, -22, -185, 118, 187, -139, 225, -11, -177, 304, 297, -50, -58, 182, -127, 69, -110, 191, -202, -81, 95, 24, 230, -182, -234, 70, 440, 139, 378, -43, 104, 135, -29, -75, 157, 46, 66, -142, -339, 26, -367, 106, 105, 395, 110, -138, -79, 23, 220, 66, -38, -107, 41, -89, -93, 328, -174, 133, 56, 72, -414, 144, 38, -62, 97, 420, 128, -106, -7, -10, -60, -175, -94, -622, 154, 149, -26, -228, 172, 111, -109, 139, 66, 14, 128, -54, -37, 302, -354, -229, 61, -20, -133, -50, 68, -180, 16, 86, 123, -208, 173, -421, -266, 175, -124, -138]
3249a38K51k25K18j19L0P5j2k24J49kk53K92L5L4k65m5M88L6j69k2m04J78J89
3272I7k26P4J22j26j61j91L63K4N1j15K8j26L43o7q4l7j23R7n7J41p5j0lN2J38
3297A29r9J97J11l16k40M6O2j04L64k0k38j00K66q9P6k41K48Ll8K53m59J64K36
3320B11J46l25P0j0L0j14j24l8L04k82K23k06P1j0j04m2Q0L62k67J33j07j7j99
3343b15R0J65j03j32R5j23R9K74k43O8J5J55Pk72J04M8L4J35l23J27r4qk01M71
3367A73j62j94j71P56l68l3j8O8m05K72m9k00M34J08k63o9n4M89l20L50k98n9
3389a3J09j06k49K84l4k21L39l90J56M05l23L6k05RM13k34R4P5k36L6J79k67L88
3412B45l4k72O2P4k07J18q9m9J03p3K06j15J39q3k46K58j55J24k57J50O0J36J34
$$ y = [-138, 113, -112, 106, -13, 17, 92, 80, -144, 5, 3, -250, 42, 77, 111, -154, -199, 289, 325, 156, 134, -270, -92, 97, -129, -55, 67, -59, -220, -411, -48, -24, 27, -88, -60, -186, 157, 90, 6, -31, -154, -57, -114, 27, -48, -58, -61, -9, 129, 30, 227, 338, 22, -218, -172, -110, -214, 150, 130, -108, -208, 58, -31, 45, -196, 52, 55, 17, 270, -189, -25, 211, 357, 32, 102, 92, 122, 8, -116, -154, 150, -132, 91, -115, -44, -54, -158, -200, -120, 242, -25, 108, 1, -16, -215, -125, 40, -63, -195, -100, -223, -124, 150, -93, -25, -10, 145, 152, -120, -16, 32, 66, 201, -122, 5, -89, -97, -298, 173, 11, -183, -354, 402, 34, 1, -17, 51, -354, -82, -131, -331, 103, 211, -52, -121, -175, 314, -6, 344, 46, -13, 96, -10, -259, 25, -9, -230, 109, -281, -125, 280, -43, -7, -212, -203, 210, -24, 70, 145, -91, -55, 124, -143, 245, 211, -61, 1, 75, -132, -14, -103, -152, -49, -122, 84, -31, 108, 25, -221, 37, -118, 6, -251, -101, -41, 95, 229]
3435B29l23j6P7N7J07l06Q9L49l70J92L06l46R9k85J68P4k9N8l50M09J41m92p
3458a69J8N10n31K55j66J69k01nM24m75O3K80l59n2K88j63K62j2j82J35k33L42
3480A98l83K47j47o0K00O9J2j48Q2l38K54R6j8Pj38J48j73L6J08p4K92r6j63J51
3504A62l26Q3J31k45K51n10M30L65o53J50m3J50j99L71l36P0l3J96J89l45n2p1
3526b65M30j48k6L06q8l9k07j50K85j42J02j45j1M17k95J37l14J63j40M98n30
3547a62L25k67R3M9o2j22K26K23l88K80k16J26m71J59R3J12j71K93j29j45j51
3568c05L37j37K56k41j3k75J08N06j60l12K51J82J1p9p6J10l43J88l6N2m9N6j76
3591a45j28M08n2M7r5J03k78O5j34N00m81M20j72Q1L4K9Nj3k12L4m5J9n4j15L99
$$ y = [229, -94, -110, -33, 24, 131, -175, -86, 263, -107, 85, 391, 45, 144, -141, 27, 101, 72, 130, -220, 189, 330, -162, -169, -151, 359, -172, 83, -83, 86, -115, -120, 304, -171, -108, 172, -187, -239, 49, -114, 148, 136, -46, 89, -144, 198, -185, 62, -85, -145, 55, 124, 136, -12, 70, -268, -14, 82, 64, 71, -67, 81, -92, -56, 52, -22, 270, 174, 11, 162, -164, -81, 50, -195, 56, -454, -24, 341, -312, -162, -205, -55, -254, 117, -219, -149, -182, 14, 203, -142, -194, -265, 165, 17, -9, 297, 209, 170, -37, -187, 98, -44, 58, -87, -98, 319, 24, 161, -153, 10, -130, 368, -162, 163, -104, -11, 38, -24, -146, 80, 303, -85, 195, -21, 105, -366, -207, -114, -2, -173, 120, -9, -154, -305, 32, -105, 151, -90, -103, -378, -270, 236, 76, -236, 15, 197, 208, 129, 53, 163, -180, 8, -28, 24, -25, 31, -145, -273, 135, 83, 130, 35, 138, -140, -75, -209, 291, -190, 230, 58, 139, 173, 202, 207, 194, -18, 16, -29, -10, -64, -179, 220]
3616B20p0k08N6J24k47K49j67o2J23J10j29K58k92l04J82J64l6K72O0n19K6K92
3638A02L1k73J88K49o34N41j33j16k40M8K90N3k93L6K18M9l97J81k9J25Q5N7j10
3661B8lL17k99J59j42J21m41K65j9k8J45O2n8l12K79j15k48R9K80j98j18N5N87
3684D16l91m0J82P3l66l4J33J28k76j25M12L0k78j08O42l12r7K83q9j85J75l15
3706a42K94n9J76m02j10k4L63q5q4K13k97K8J14j14j22J52L17m08k60N08K11l24
3728e5pL44j41j36K8P2l03M8K35k12kK41L2k0j49K94j22o5k20K5K08n7P9R0l11
3753a04J97k06K24l4K2o5J6O0j05o6P6j64J22O8j39K40n5l55M03k16M8J3k78K51
3777d7l2K85K11n81K75k02M0K26m58K35o4J91M08n78J20j23J40r7J6L06l77K00
$$ y = [220, 150, -58, -2, 122, -125, 124, -43, -105, 18, 128, -1, 257, -35, -339, -157, 7, -29, 243, 303, -216, -190, 102, 133, -140, 48, 297, -337, 204, 71, -45, -285, -237, 53, 106, -187, -151, 67, 116, -281, -100, -129, -4, 81, 138, 28, 25, 342, 43, 202, 60, 181, -260, 5, -14, -42, 103, 165, 107, -205, 74, -41, -289, -190, 90, -108, -226, -171, 416, 25, -15, 167, 240, -126, -160, -27, 101, -175, -300, 112, 142, -136, -244, 398, 86, -11, 272, 183, -2, 173, -142, 152, 93, 269, -133, -243, -267, 96, 11, -73, 140, -157, -129, -15, -129, -251, -99, 218, -190, -450, 58, 269, -55, -62, 282, 141, 5, 33, 105, -198, -150, 85, -127, -129, 112, 144, 124, -25, 269, 147, 82, -138, -113, 95, 38, 117, 207, -104, 93, -113, 111, 77, 99, 34, 50, 110, 5, -61, 15, -149, -27, 41, -98, 142, 87, -268, 135, -81, -33, -20, -298, -47, -79, 206, 417, -164, 111, -91, -51, 175, -283, -48, -112, 79, 487, -91, 29, -94, 46, -51, -35, 271, -106, 94]
3799I4k38K99l24J89j7J74j95j5R7pJ93l16n5j4K85j9j48J33l00L18k84J66j28
3822a12k20L88j73K8L0mk11K63N4J0j01k86O32j79j38j40J94J48l60m9M67j83
3844E8o2j15o5K60k44L24k61P1Q8k88K63k35Q5k65N24m8q3k0j14K90j52qM8M9
3868A00j37j17o5J36j61Q2J79K8J40O7l8r9J6n4P4M0j54N0l11J85K22l04J35J66
3892A80k29R0j61J13K32j35n8NJ43l18p7M30p2k78J94j07K39n42M58K2Q2l92J01
3915h0jK16J48k79k35L91r4j82q6L12l43R5J81J99j03n04L54k90K91J77k91J15
3937ik24L58k2k87O3j9K18j36m9K11l54L77r1l9L16j26k58K3K6k98L91k58K23
3960C6k60K60N2o2K2q0J02l26L19P3K92m58J8p9mO3J70j41j68J72K2l4nrM7j96
$$ y = [94, -144, 155, -169, 20, 3, 177, -18, -33, 64, 57, 250, -66, -121, -135, 150, 131, -17, 116, -184, 134, -150, 16, -112, -332, 56, -117, -89, -59, -63, -274, -11, 43, 53, -48, -334, 298, 119, -19, -159, 35, 183, -177, -226, 241, 58, -4, -119, -184, 76, -168, 156, -105, -34, 54, -234, 29, -206, -121, -386, 138, 90, 7, -13, -127, 163, 11, 3, 51, 100, -37, -154, -219, -83, -244, -162, 17, 45, 185, 252, 214, 115, 131, 77, 151, 191, 37, 87, -224, -39, 183, -121, 14, 180, -49, 41, -120, -7, 225, 90, 32, 37, 180, -138, -215, 215, 143, -135, 59, -48, 191, -351, 107, 129, 211, -181, -80, -81, 135, 283, 4, -231, 160, 66, -116, -202, 110, -233, -138, 43, 242, 139, -365, -11, -301, -10, 167, -124, -9, -233, 125, 103, -184, -121, -140, 78, -58, -107, 104, -250, 127, 36, -3, 313, 187, -71, -48, -22, -320, 71, -187, 36, -224, 36, 88, 26, 48, -32, 70, -256, 63, 136, 428, -30, -12, -91, -95, -32, 138, -3, -171, 1, 23, -11, -16, -25, 22, -174]
3986a74J38P9o9j14J93Q9j09K34J96l61K8j76J67j75R1j95L94n21N63m40p9J49
4008i2k01L02K09l77L10p5k52N2J04P6o7j5j5J16J21j79J49j64j06O5q5K66j88
4031d6J56J66j95j17M3k33J91K4O7J16k53J06j0n3K48n20M21j07l8L18m10N45
4053D19q01L05q7J08k18J51j3j33Q4r8L34o2J26J10q6RL21o64L67k37o1j3L3J62
4077E6kk62K46J93l02k7J55k6L7k8m11K38p9L50j2l48MRL20m12K61k5mK41j16
4102E6l2K84j80j61l1N1j9k55M0L95k17N9K31j88M4q6M8m7j13N9o4J1J09L33m21
4127i4J63j57K96j30j6J51k14j76r8L28j97J04j08P7N7J04n20N36j89j51M01k94
4149a27J42k86m3J61J84l96M80k62J21rK89k44k87J10J30R0M1k08J91l14O2L05
$$ y = [-174, -36, 43, -26, -140, 53, 142, 33, 267, 463, 102, 130, -46, 121, -54, 37, -158, 236, -285, 278, -162, -241, -92, -293, 9, 218, -159, 151, 76, -176, -124, -20, 56, -11, -26, -41, 75, 196, 17, 166, 2, -104, -39, -124, 142, -46, 110, 276, 81, -36, 7, -226, -35, -11, 56, 172, -81, 25, 15, -38, 210, -310, 111, 4, -34, 284, -126, 419, -382, -77, -164, -56, -274, -123, -136, -269, -185, -283, 51, -11, 115, 225, 139, 148, 469, -195, 172, -65, -126, -139, -106, 56, 54, -208, 38, 231, -71, -98, 57, 31, 68, 40, -371, -133, -212, 138, 126, -222, -218, -209, 111, -301, -40, -65, -69, 172, 56, 24, 308, 128, -33, -64, -13, -32, -287, -247, 148, -69, -10, 221, 33, 77, -9, 39, -8, -121, -62, -126, -115, -6, 327, -94, 69, -88, 208, 78, 62, 213, -1, -177, -275, 53, -144, -40, -148, -71, -14, 90, -430, 106, -83, -234, 167, -127, 15, -271, -314, -153, 31, -365, 115, -147, -26, -35, 254, 10, -277, -167, -37, 53, 94, -114, 77, -237, -175, 130]
4171A30k38L53j70j07j41j7K06k22L45l84M77k68j54L28j65K20m61J13P5mK1k4
4193h7J32J73l9j11o0K69j11j78QK49r9k58Qj46M25n0k47J39j16J82K9R1j90n1
4217c8O1k89J91j8m7K80j06J62l21K27j08j38j8J68n2l8l2L36k40J22j41L33j97
4240I7J75l86K95k83p4J07J3Q2R9q1%L98n41L2K30k09K0K02l3Q4n8j36k32J55
4264d4j87N78l68l0Q5K45l42j01K23j28lj71K62K78o7l72j3j39M08n3p7O6j82
4287a32L20Mj40q5j3J86k04NJ26J62m08K11L2K81o2j02J36l67J15l4Q6j91J01
4310B7J9r1K1l13M36J74n84M36l92J77kR6k38M89m60L41j33J27n7j16M92J0m76
4333a7l0J57l74M13j50k79M63J07m88P71o07j50K47j4j42K2J36M9j93r7J89j29
$$ y = [130, -108, 245, 75, -32, -173, -190, 16, -206, 139, -245, 232, -36, -190, 138, -27, 193, -268, -155, -80, -84, -63, -87, 45, 218, 179, 68, 8, 277, 166, -12, -4, 245, 146, -112, -104, -250, 175, 125, -122, 17, -99, 83, 112, 203, 13, -38, 23, -266, -75, -93, -140, 140, 34, 196, -125, 102, -6, -144, -162, 6, -46, -84, -116, 220, -20, 102, -39, 294, 97, 272, -114, 181, -102, -176, -69, -56, 26, 125, 44, 44, 442, -99, -67, 163, -46, -26, 176, 143, 227, 169, 33, -199, -44, -231, 347, -21, -51, 34, 279, -63, -164, 59, -69, -72, -243, 19, 297, 230, -142, -155, -294, 114, 61, -16, 50, -132, 188, 192, 52, -33, -46, 140, -64, -59, 67, 229, -179, 32, 64, 345, 283, 181, 317, -50, 65, 31, 117, -74, 27, 46, -45, -24, -337, 99, 273, -311, 125, -267, -90, -92, 4, -234, 255, -205, 136, 3, 130, 73, -43, 449, 459, -17, -47, 110, -264, 149, -1, -280, 183, 290, -198, 573, -34, -184, 63, 49, -93, -71, 65, 114, -79, -176, 13, -116]
4355a16K72j07L54k31R5N0m12L24k56n7K41j68lp1L10l92m3Q1K23k78J2J59m82
4378d95M06M99o04n4O12k45J8k20K46l94j2N09k68k03J19N01j92m21J78K3J10
4399A13l34R9n5Q2n7j8M03j44J17j1k88J02J86l62J17L0j03k01N36L0o0j65k31
4422b14K57n5j02K04Q0m20J39K24m4R9l73L86p7k87J31J36j03P4j21J06J13k08
4444e5j56J15Q2j74J41J41J4r5r0j32L04kq3jj76R3M1N14m11O9R6n64M07q7J91
4469A82l27j13K67R0J01m24J68L03p37M38K59l37K70J47j81l39J94L3j13J24k28
4490b23J82N7k48J55j48O15m97j28L34l99M02J41l57O6j26k7N04j86m2j26K69
4511B18q3N8k44J63j41n0Pp5q4k7L74m04L19j74L18l36L33j66j8J80O2J24l38
$$ y = [-116, 156, 49, 403, 172, 267, 317, -95, 229, -27, -84, 157, -11, -14, -85, 225, -167, -210, -129, 94, -184, -172, -13, -495, -89, 410, -194, -248, 364, 119, 137, -83, 163, -231, -243, 266, -2, -205, -86, 415, 223, -198, -20, 3, 113, -221, -122, -177, -95, -152, -170, 233, 89, 206, 195, -93, 9, 195, -167, -50, -20, -123, -324, 212, 242, 182, 17, -214, 43, -12, -114, 90, 170, -250, -111, 113, 69, 168, -205, 181, 104, -183, -52, 84, -19, 55, -66, 40, 153, -55, -211, -96, -14, -188, -47, 94, 108, 13, -77, -209, 95, 93, 10, 9, -167, -74, -33, 481, 70, 139, 235, -329, 78, -9, 182, -145, -258, 9, 99, 200, -224, -56, 247, -490, -52, 207, -130, 140, 287, 106, -233, -39, -6, -119, 5, -223, -41, 16, -232, -77, -225, 390, -107, -235, 99, -300, 102, 243, -114, -48, -174, -201, 303, 117, 75, -51, 218, 135, 193, -51, 112, -29, -79, -72, -147, -231, -258, 116, -288, 31, -143, 175, -161, 172, 6, -12, 168, 230, 354, 16]
4534A6K69j79q9J6P0k31L73l10R1J05q1mK9j6rN7o7k20P3j72N68q0l19LK74j91
4560b4K46m98N0K56J95k36R0j75J71o5r3K70j7k42J30k34J98Pk01J11P5N5k68
4583a99K39J5K52k96j23M8K03p3n9N5j66K55r0k1j32K02k18k35N28l59k32M38
4605C2r9ql66N38M1j49J22k6j37lp6L91k58k87L80j20L81k53l3n3k51n3L92R8
4629B03l07J82Km7M1p7m3k8M3k40L87M8l02L95k92J84j7R4q7k16N1j49J41Lk51
4654b82L41k66J92J16k91J02J84j10l61P21l83j77J30k50L08J14p2K03k70J21
4674G0J17N3k9k06j48R9j9k21K46Qj7j2J09K06j55l9K9j76kq0J06J2O3o4N0m3
4700d3k39M13p8j8K50k61K25j63k04J71l3k58K92l6P5J84k03%m14N11k59J49J4
$$ y = [16, 285, 106, 17, 33, 103, -128, 245, -65, 26, 131, 50, 46, 75, 59, 50, 107, 40, -180, -107, -279, 289, 209, -110, -107, 167, -24, 222, -276, -226, 30, 225, -11, 79, -96, 75, 10, -83, 187, 170, -72, 58, -176, 22, 29, -172, -61, 14, 69, -199, 40, 55, 307, 11, -112, -64, 139, 66, 7, 62, -104, 151, 61, 40, -92, 110, -108, -343, 185, -174, -406, 32, -67, -75, -441, 97, 138, -11, 111, 85, -52, -55, -131, 260, 2, -285, 95, -25, 356, 103, 70, 17, -234, -287, 105, 203, -104, 78, 80, 33, 74, -3, -46, -74, -31, -271, 116, 164, -138, 257, -35, 149, 132, 226, 139, -77, -26, -175, -34, -31, -282, 59, -207, -15, 101, -190, -88, 96, -14, -375, 346, -37, -214, -84, -334, -26, 88, 16, 219, -51, 70, 187, 240, 211, 5, -143, -44, -63, -284, -38, -30, -47, -59, 50, 256, 101, 62, 91, -85, -87, -167, -61, -49, 14, -50, 0, -43, -282, 131, 53, 35, 285, 24, 249, 86, -118, 53, 20, -238, 54, 18, 93, 277, 74, 74, -340, 171, -88, 61, 75]
4723G5j46RL66j75k89M40j12m59K46J68k71J4q6J8j2L54J32j57J2j13J85j65N0
4746H4P4o1j97R1K8J1m1L5K17l88KL42L2j64o7Q4k99J69j66J19q0M23l42M9K11
4771A66j55L2J72m98L68k16K09j70L8J23J21j9M0j2k71J27j49O0k8J68m18J19
4793a93K02J23l62L43r1o1O6j84l2K77q7R4n3J11Q9m58J94L6k87L36j28J70r9
4816FJ07j5m74M7K10q3j76K42N6Q7l32N39m72m1K93Q1o9o6N83m35n4j02K01q0
4840E3j22o6K74l67J53q2L63n65Q0L95O9k74J7K20N5j47q8j0K50O3l44J46r5L7
4864A5J08k31pK35j84K73K04p92O49n62K31J11J28K13l14k54J52K78Lr2k60J28
4886C2p9K57R6k49o1j47K62J3j85M2k04M48m11J84k31r4K57L25k80M27n65Q0j37
$$ y = [75, -71, -62, 304, 129, -160, 280, 168, -291, -45, 123, -148, -134, -220, -202, -214, 140, 272, 115, 127, 14, 199, 34, 84, 158, 97, -100, -9, 19, 30, -11, 24, 241, -147, -145, 197, 229, 65, -2, 82, -217, -48, -214, -95, -175, 248, -94, -45, 166, 11, 43, 215, -283, 85, -131, 78, -92, -54, 69, 190, 171, 211, 199, -72, 55, -94, -34, -62, 106, -312, -193, 9, 132, -230, 113, 22, -39, 27, -157, -189, 88, 1, 95, 42, 153, 242, -216, -22, 14, -273, 63, -65, 105, 6, 113, 98, -376, -329, -119, -202, -378, -136, -80, 7, -325, 214, -258, -299, -6, 75, 6, -60, 523, 88, 34, -68, 133, 53, -69, -135, 139, -228, -75, -157, 206, -359, -279, 116, 185, -89, -72, 148, 203, 56, -32, -42, 208, 271, -73, 73, -22, 15, 123, -108, -115, 120, -64, 209, 413, -379, 270, -292, -61, 50, 178, 391, 77, -177, -25, 253, 256, 164, -96, 32, -47, 210, 306, 57, -4, -151, 111, 124, -61, -19, -223, 225, -186, -2, -233, -327, -70, 255, -25, 402, -163, -83, -220]
4909b20M9K74N4n8J1j03J43k86LJ3j15K98j3j04K7n5L19j58J3m2K45n34L08rr0
4934c0Q2j68K54O8l7m23K02K22j72L0j9j24L20k61k11K41K54K0k73M4LJ92Rk64
4958d1k06K54q9J50K79k07j44j81K96k53L76j14Pm0J55m13R0J09j46K76m1j5R1
4981A93k02qJ95m35K09J09j75J26O4k5l64L17Mj37K84k19Rj67L83O2l67J70n6
5004c0J90l15J70k55m5K48J27lj19K10j94j76K74j06k04L10o0J50l86L38m36N84
5026B72l05k05M04j17p3Q3l11K24K80n8l91j11O06k64q0K0j35J41L3L5K7k51J03
5049g3q4J51P1r6k72O2L90k45J82j77J05r7J87o7m5Q9o2K22o0r4j30K0n3n6j08
5074b40N46l36L29Q6j88l12L04j95o4J45Q2J56l61J83k61P2J8n6k43L80L5K09
$$ y = [-220, -171, 103, 157, 99, 110, 7, 150, -136, -133, -120, -235, 63, 50, -54, -27, -82, 237, 79, 92, 50, 295, -239, 69, 60, -30, 52, -116, 138, 206, 169, -254, -52, 170, -2, 28, 9, -115, 205, -56, -267, -26, 228, 248, -25, 19, 22, 214, 223, -41, -247, 7, -82, 68, 347, 140, -4, -185, 111, -142, 234, 120, 127, 87, 242, -171, -81, 28, -118, 158, 117, 102, 193, -9, -17, 178, -257, -48, 61, -114, 12, 76, 51, -313, 4, 8, -129, 155, -64, -55, -222, 161, 223, -144, 26, -30, 160, -155, 15, -240, -285, -37, 90, 87, -32, 178, -16, -192, 82, -24, -228, 82, 22, 172, -214, 124, -312, 272, -33, -238, 166, 49, -24, 59, -252, -28, 252, 194, -197, -308, 298, 34, -46, -26, -161, -20, 13, 48, 75, -176, -73, -157, -6, 65, -31, -303, -241, 149, -96, 86, -91, 14, -83, 104, 37, -8, 81, 19, 241, 181, 87, -43, -23, -76, -132, -240, 306, -30, 299, 385, 197, -115, 189, -6, -70, 75, 157, 313, -48, 135, -126, -54, -36, -92, -335, 45, 80, 289]
5096B89k37n7K09m33M4K96j56K2J19K19m0j12k33j36M19l62j15K22j7k4j32LJ51
5119f1J76j27l9R3J98k87j12M56j35r9O1J09l37K94k04k55O6L44m3J9k53K6K06
5142I6j00O1J40o5j76m5K66m23J41K82j28m6k47L19J6l66J28J72q2J86j95Pj20
5165a79J73n2J79L03k50m8J1m17N26l80M18j59J42l5j85j55K39K6j98O0k42j15
5187c38M85K2k07rq8M84k18j08l63L63j00P7M46l35j20K12n2j98R1k44J48K39
5209A87j20m0j19K24l74p5L49M6M1K6J80m70M75m20q0K55o7j84j01J33L62l01
5231g3Kj88P5J74J11J54k20J34l5m79L71J1L1l81K75J69K10l30J24j02p3N7QM2
5255F7L6n4k54L8L25j1k55rQ2J42r5K96m22n8R6J21M0L56m21j11j43K20lN3k97
$$ y = [289, 52, -5, 204, -229, -185, 111, -45, -23, 96, 315, 275, 163, -70, -206, 213, -149, -264, -42, -59, -83, -215, -212, -61, 115, -12, -51, 42, 240, -47, -159, 297, 162, 63, 124, 233, -104, 190, -14, -269, -203, 141, 98, 117, -136, -110, 96, -4, 57, 197, 132, -44, -89, 177, -246, -105, 177, 49, 3, -244, 75, 91, -275, -147, 25, -57, 129, -66, -59, -179, -6, -58, 121, 424, 174, 126, 137, -280, 246, -134, 284, 125, 267, 232, 47, -108, 131, 157, -41, 19, -223, -338, 147, 169, -38, -47, -135, 349, 131, 23, -340, 23, -77, 0, 446, 111, -9, 203, 151, -47, 44, -200, -52, 187, 67, 27, -92, 132, -242, -317, 32, 78, 119, 145, 325, -145, 330, -90, -170, 85, 18, -166, -267, -134, 228, -73, -71, -259, -184, -10, 101, 255, 35, 169, 134, -345, 26, 37, 68, -313, -38, 131, 341, 11, 135, 33, -40, 17, 25, 67, 103, 49, -205, -167, 158, 147, -108, -117, -35, 107, 12, 308, -114, -172, -76, 45, 85, 441, 20, -91, -234, -14, -17, 36, -261]
5280b61J95J27j71K06j33M0m70L49K58j36n8k1J10J53q8p6k28J72j63l5M79l17
5302f8J52j71J65m4J93k2q2Km11M11m5j01J7j17K92l83N3L15k95L16m60K64j43
5325a62q3J71J40k90M98l12M06k81q2L31p6l09K37l29j32L44J59o04N05j40Jj02
5347a10pJ95J14j0k01m7R3Q7J6o6j19L42l07K4j30K84l19K83j83MJ00r0J8L01
5371B72n93N23k31J83l52K27p4k44J85o7K72n23K70K47l8q0n8o1L27l97L57j25
5393B0J69j05pj12k78J05J27j85M76l36J52j42ok33N3M02j62K40M1l71J58m6k84
5416c24M69r8j37J31J61%l54J72j70k1J12Q9J28k06o8M06m4k80j19K64j20P0k08
5439a47rK12k69L70j80L56j65m11K30K75k01l99L08J71J32l78J59J57l10R0l24
$$ y = [-261, -66, 61, -110, 96, -37, 3, -467, -118, 140, 4, -54, -75, 35, 188, 100, 24, -204, -32, -195, -230, 249, -68, 84, -87, 78, 34, 227, 205, 123, 125, -286, 125, 80, -21, -4, -121, 171, -212, -159, 156, -139, 177, -283, -19, -162, -245, -74, 66, -224, 274, -38, 368, 87, 5, 336, 260, -49, 188, -141, -273, 71, 230, -374, 131, -9, -8, -110, -117, 78, 192, 182, -19, -66, 27, 114, 130, 64, -55, 287, -20, 4, -126, 158, -161, 122, -61, -57, 43, -47, -29, 272, -321, 202, -29, 154, -198, 29, -45, -289, -104, -171, 101, -422, -152, 95, 57, -23, -81, -142, 185, -212, 145, 20, 189, 84, 77, -35, -313, -208, -81, -266, 210, -126, 26, -116, -122, -355, -302, 100, -62, 178, 219, -152, 6, -40, -324, 145, 47, -90, 41, 202, 202, -152, 20, -150, -171, -59, 30, 158, -48, -116, 290, 246, -34, -153, 111, -9, 61, -147, -156, 56, -213, 157, -23, 333, 168, -243, -13, 262, 61, -338, -30, 141, 273, -105, 54, 211, -99, -9, -333]
5460c33L10J49j24J78r6M0m56K10J50j66J68m62M37M8P2M2l49J5P4K85l16L48
5482B24n10K22J68J96l44Jj45J68O8q3M2J45p6r4K40j06oK12j92j37j2K9l0M9
5506B9j26J26l38K53k0m7k53J78K76j78rk6N02k02l14k05L17J82k27P9n9J87m16
5529b91J38K20R8K4l16K10k42J84O2qK9j65j59J35J87Q3j44L6n8L5j98n6O18m17
5553Ej53L07n5k11K72m9j70J75N4m55N32j26j57L22n31L05N1J71o97J71J71p9
5575a47k08K50J11J30l26K99P2j11m22K67K77L0j95m3j43Q7O1j15J95j36R5j21
5597i3o5K20J64l37jJ80J36p1j1j53j0N3m10O14j21J4m4j4o6J71N3jj34L11n70
5622a85K63R3k69K47j02q3J3k9K74j44j97K40l68L08o9J97O4j70j17L0j31K98
$$ y = [-333, -23, 126, 2, 180, 84, 124, -332, -122, 28, -138, 30, -432, 5, 53, 125, 167, -182, -167, -93, 192, -124, 224, -286, -64, 104, 300, -44, -43, -188, -20, 48, -35, 7, 152, 76, -18, 222, 116, 110, 322, 130, -7, -19, 10, -20, 29, -97, 29, -309, -56, -76, -123, -376, -198, 78, -100, -109, -135, 367, 165, -149, -354, -37, 145, -82, -3, -62, 125, -291, -153, 67, 165, 189, -127, 83, -159, 25, 87, 79, 108, -57, -216, -81, 106, 189, 45, 81, 23, 58, -140, -196, 422, 5, -148, 159, 104, -107, 165, 116, -54, 121, 175, -280, 252, 126, -31, 291, -240, 65, 116, 287, -410, -239, -68, -147, -355, -105, 6, 136, -190, 109, 181, 70, -352, -85, 192, 222, 27, -16, -159, -72, -11, -126, 69, -67, 28, -93, -158, 62, 226, -111, -112, 68, 204, 133, 122, -31, -41, 12, -398, 216, 95, 109, 65, 51, -15, 156, 209, 208, 74, 385, -185, 78, 171, -98, 149, 47, -36, -23, -52, 222, 78, -119, 121, -247, 61, -8, 189, 253, 83, -34, -4, -135, 163]
5644A63k93R2K09k83Q6l91M46r7J72K8j94N0K49k53L02j16n50K29L92k61N0J00
5666A30N0k46o9P8nL08k64p6r0J5L62j67j22l27O47m69J70n5K37J01k72k56L42
5689B2Pq3K25k28J58J58j52k74P4J43k54L33n0l6O0l6k22j50J73k15M19j08K53
5712B17o03N43j22j36Q7J19j78o9M40k07K6k17L64n3m84K00J50K25m89j36N08
5733A85p0m46O42K4o07M81k59J73K15l28j95P7L37k03L1k71M00k23J86k21j03
5754a75L24j79j00k40O58k00j48R2n7N2p6M00k43k29j31M05j0L2n30L84J18j33
5776A4J43j92L42l02L50k52j63o9q0L50J15j62r6j55K74n9l5q4J42m96N04k38
5798a49k39P49m72jJ76R2l30J73R5j42j87K34m2N6k35L07k17J71N8M7k54l9L19
$$ y = [163, -130, -38, 171, -112, -26, -417, 29, -68, 104, 132, -62, -12, 237, -16, 286, 170, -380, -151, 241, -20, 30, 130, 180, -66, -135, -57, -62, 246, -18, -94, -184, -169, 193, 26, -96, -423, 224, -245, -75, -130, 107, 208, -64, -320, 22, 29, -54, 171, -57, 101, 259, 107, -167, -93, 50, -204, 129, 79, 43, 103, 67, -155, -305, -132, -347, 72, -36, 217, -386, 157, 35, -101, -14, 105, -73, -142, 298, 91, 117, -100, 264, 211, -273, -73, 77, 302, -187, -323, 185, 115, -331, 311, 335, -272, 209, -50, 123, 338, 10, -185, -108, 229, 26, 57, -214, 186, -37, 149, -72, -175, 149, -30, -130, -370, 288, 88, -60, 32, -25, 27, -49, 351, 108, -121, -252, 153, 143, 175, -355, 29, 147, 14, 157, -35, 307, 5, 355, 103, -60, -129, -209, 141, 256, 94, -2, -157, 117, 58, 23, -61, 81, -415, 89, -149, -388, 361, -111, -112, 64, 156, -174, -1, 94, -48, -235, -1, -43, 13, -222, 85, -132, 39, 97, 144, -110, -149, 170]
5821A70l4J30l23n7KN5k41j36M91R4Q4k25L35k03O3j54k15r2J77J72j92O9L57
5844C27j34k30J3L87l65k67L64j61L10j37M5r2n9k04R5K29l07K62m21O99m79K51
5866A26k84L08M0l76K16l0K9k9J39K88k55j12K01l38l6L41j00R0o3K06k07l7j02
5889A5k40N58j56k52j8j8J85j25j37O2Q0J45p8J89l53N2j22L09j12J82j81LK96
5912B84l76K02q5n2J8L8j07K63l0j74Q8k13L31L9j24j86o4J90k68K10N1k02L08
5935A41L5k80L13p41P96l00k9K49l45J4M26n36J31J10J69K1j35j52K1K71p1R7
5957B05J96m76p7M26j96l8q2O2R1j13P8j25L88n15K94J34m43M65n9k56r0J87o30
5980e74O47R0j07M0l78L10J96n2J01K3m08J54k30K75J88m60M98l69j47L98p00
$$ y = [170, 136, 266, -57, -114, -112, -57, -298, -434, 57, 151, 235, 10, 345, 142, 205, 51, -164, -256, -79, 93, -99, -30, 327, 193, -37, -24, 363, -2, -269, 95, -66, 244, 107, 152, 60, 1, -203, -108, 121, -186, 76, -345, 354, -125, 126, -158, 150, 190, -186, 30, 0, 29, 0, 139, 427, 172, 60, 261, -77, -113, 228, 128, 218, 155, 361, 154, 117, 15, -225, 333, 177, -75, -93, -111, 74, -51, -188, -126, -46, 99, 21, 210, -143, -91, -213, 96, -16, 166, -15, -12, 284, -92, 110, 25, -27, -9, 29, -78, 185, 155, -19, 69, -144, 187, 226, 102, -84, -148, 42, -226, -16, 35, -167, 141, 176, -104, 209, -532, 264, -36, -65, 184, -161, -147, 279, -257, -126, -16, 153, 174, 39, -113, -92, 179, 108, 205, 401, -75, -152, 274, 78, 40, -42, 20, 111, -2, 76, -49, 339, -176, 118, 252, -191, 274, 215, -41, -131, 56, -574, 73, 163, 56, 96, -282, 28, 224, 172, 273, 296, -112, 42, -188, 87, 275, -185, 313, -56, -203, 195, -505]
6001e05N43J70k6M2k41KM2L06j94j79K4M81l10l90J85k32K85J34J70k16q6L3m9
6024a1l27J64M67o00K63J64l1pJ64n71J3L23K95k72k1J50k57k9j39M47k86K73
6046A72r4k42M5M31q7j50l8J39J43k17J21j19j04j68K23j71P8n8J08J70j90k63
6068b71O75l90k09K43N7j28j28L16j3l0n8n5P5k85K84m69J86K60k18M34j99K66
6090C43j38j30Mn3j53k6J31J60l32L4N42j62n01J87M5k7J16j1J21k96j50K55K7
6113a4K6j11M72p4l24j17L07N2j82k46J60L5j48j63K74j52M53r1l41K87j1K09
$$ y = [-505, 38, 208, 182, 224, -17, -15, 27, 333, 139, -40, -16, 465, 155, -235, -50, -282, 3, 137, 307, 91, 5, 38, -11, -338, -174, 293, -307, -44, 120, 89, 82, 246, -325, -312, 11, 306, 34, 13, 163, -94, -123, -262, 185, -101, 172, 78, -164, -119, 312, 225, 75, 37, 176, 319, 102, 223, 104, 0, -168, 55, -116, -38, -96, 12, 182, -8, -271, 404, 14, -195, 48, 105, -23, -151, 165, 152, 122, 64, 9, 84, -201, 83, -386, -200, 60, -158, 276, 77, 343, 205, 75, 79, 26, -127, -153, -22, 138, -194, -160, 382, 220, -281, -94, -49, -76, 40, 29, 150, -146, -296, -41, -14, 12, -99, 373, 299, -25, -142, 165, 217, 35, -211, -51, -16, -164, -327, -53, -205, 248, 157, -184, 103, 92, 301]
$$ [...]
8191A85
##END NTUPLES=NMR FID
##END=
