##TITLE=1H_DE-77W_b_TFA
 DMSOd6
 8 sc, 
 25.11.2024
##JCAMPDX= 6.0         $$ Bruker NMR JCAMP-DX V2.0
##DATA TYPE= NMR FID
##DATA CLASS= NTUPLES
##ORIGIN= UXNMR, Bruker Analytische Messtechnik GmbH
##OWNER= root
$$ XWIN-NMR		Version 3.5
$$ Mon Nov 25 15:41:26 2024 Russian Standard Time (UT+4h)  she@DPX200
##.OBSERVE FREQUENCY= 200.1315
##.OBSERVE NUCLEUS= ^1H
##.DELAY= (6, 6)
##.ACQUISITION MODE= SIMULTANEOUS
##.ACQUISITION SCHEME= undefined
##.AVERAGES= 8
##.DIGITISER RES= 18
##SPECTROMETER/DATA SYSTEM= spect
##.PULSE SEQUENCE= zg30
##.SOLVENT NAME= D2O
##.SHIFT REFERENCE= (INTERNAL, D2O, 0, 15.7039)
##AUDIT TRAIL= $$ (NUMBER, WHEN, WHO, WHERE, WHAT)
$$ ##TITLE= Audit trail, XWIN-NMR		Version 3.5
$$ ##JCAMPDX= 5.01
$$ ##ORIGIN= Bruker BioSpin GmbH
$$ ##OWNER= she
$$ F:/spectra/data/she/nmr/H-F/1/audita.txt
$$ ##AUDIT TRAIL=  $$ (NUMBER, WHEN, WHO, WHERE, WHAT)
(   1,<2024-11-25 15:40:16.04 +0400>,<she>,<DPX200>,
      <created by zg, POWCHK disabled, PULCHK disabled
       configuration hash MD5:
       00 E9 B6 7A A2 85 ED C7 34 08 36 98 17 FE 4E 26
       data hash MD5: 16K
       11 C4 D6 39 DA AF 92 8F A4 6D B3 49 19 4D 0D DD>)
$$ ##END=
$$ 
$$ hash MD5
$$ 0D 44 DA 26 29 78 09 AD DC 2D D0 AE FB BD DA 2C
##$RELAX= 
##$RELAX= 
##$RELAX= 
##$RELAX= 
##$RELAX= 
##$RELAX= 
$$ Bruker specific parameters
$$ --------------------------
##$DU= <F:/spectra>
##$EXPNO= 1
##$NAME= <H-F>
##$PROCNO= 1
##$TYPE= <nmr>
##$USER= <she>
##$AMP= (0..31)
100 100 100 100 100 100 100 100 100 100 100 100 100 100 100 100 100 100 
100 100 100 100 100 100 100 100 100 100 100 100 100 100 
##$AQSEQ= 0
##$AQ_mod= 1
##$AUNM= <au_zg>
##$AUTOPOS= <>
##$BF1= 200.13
##$BF2= 200.13
##$BF3= 200.13
##$BF4= 200.13
##$BF5= 200.13
##$BF6= 200.13
##$BF7= 200.13
##$BF8= 200.13
##$BYTORDA= 1
##$CFDGTYP= 0
##$CFRGTYP= 5
##$CHEMSTR= <none>
##$CNST= (0..31)
1 1 145 1 1 1 1 1 1 1 1 1 1 1 1 1 1 1 1 1 1 1 1 1 1 1 1 1 1 1 1 1 
##$CPDPRG= <>
##$CPDPRG1= <>
##$CPDPRG2= <>
##$CPDPRG3= <>
##$CPDPRG4= <mlev>
##$CPDPRG5= <mlev>
##$CPDPRG6= <mlev>
##$CPDPRG7= <mlev>
##$CPDPRG8= <mlev>
##$CPDPRGB= <>
##$CPDPRGT= <>
##$D= (0..31)
0 1.2 0 0 0 0 0 0 0 0.06 0 0.03 0 0 0 0 0.0002 0 0 0 0 0 0 0 0 0 0 0 0 
0 0 0 
##$DATE= 1732534815
##$DBL= (0..7)
120 120 120 120 120 120 120 120 
##$DBP= (0..7)
150 150 150 150 150 150 150 150 
##$DBP07= 0
##$DBPNAM0= <>
##$DBPNAM1= <>
##$DBPNAM2= <>
##$DBPNAM3= <>
##$DBPNAM4= <>
##$DBPNAM5= <>
##$DBPNAM6= <>
##$DBPNAM7= <>
##$DBPOAL= (0..7)
0.5 0.5 0.5 0.5 0.5 0.5 0.5 0.5 
##$DBPOFFS= (0..7)
0 0 0 0 0 0 0 0 
##$DE= 6
##$DECBNUC= <off>
##$DECIM= 24
##$DECNUC= <off>
##$DECSTAT= 4
##$DIGMOD= 1
##$DIGTYP= 9
##$DL= (0..7)
0 120 120 120 120 120 120 120 
##$DP= (0..7)
150 150 150 150 150 150 150 150 
##$DP07= 0
##$DPNAME0= <>
##$DPNAME1= <>
##$DPNAME2= <>
##$DPNAME3= <>
##$DPNAME4= <>
##$DPNAME5= <>
##$DPNAME6= <>
##$DPNAME7= <>
##$DPOAL= (0..7)
0.5 0.5 0.5 0.5 0.5 0.5 0.5 0.5 
##$DPOFFS= (0..7)
0 0 0 0 0 0 0 0 
##$DQDMODE= 0
##$DR= 18
##$DS= 0
##$DSLIST= <SSSSSSSSSSSSSSS>
$$ [...]
##$SUBNAM2= <"">
##$SUBNAM3= <"">
##$SUBNAM4= <"">
##$SUBNAM5= <"">
##$SUBNAM6= <"">
##$SUBNAM7= <"">
##$SUBNAM8= <"">
##$SUBNAM9= <"">
##$SW= 24.0689530833862
##$SWIBOX= (0..15)
0 0 2 0 0 0 0 0 0 0 0 0 0 0 0 0 
##$SW_h= 4816.95568400771
##$TD= 16384
##$TD0= 1
##$TE= 0
##$TE2= 300
##$TE3= 300
##$TEG= 300
##$TL= (0..7)
0 120 120 120 120 120 120 120 
##$TP= (0..7)
150 150 150 150 150 150 150 150 
##$TP07= 0
##$TPNAME0= <>
##$TPNAME1= <>
##$TPNAME2= <>
##$TPNAME3= <>
##$TPNAME4= <>
##$TPNAME5= <>
##$TPNAME6= <>
##$TPNAME7= <>
##$TPOAL= (0..7)
0.5 0.5 0.5 0.5 0.5 0.5 0.5 0.5 
##$TPOFFS= (0..7)
0 0 0 0 0 0 0 0 
##$TUNHIN= 0
##$TUNHOUT= 0
##$TUNXOUT= 0
##$USERA1= <user>
##$USERA2= <user>
##$USERA3= <user>
##$USERA4= <user>
##$USERA5= <user>
##$V9= 5
##$VALIST= <valist>
##$VCLIST= <CCCCCCCCCCCCCCC>
##$VD= 0
##$VDLIST= <DDDDDDDDDDDDDDD>
##$VPLIST= <PPPPPPPPPPPPPPP>
##$VTLIST= <TTTTTTTTTTTTTTT>
##$WBST= 1024
##$WBSW= 4
##$XGAIN= (0..3)
0 0 0 0 
##$XL= 0
##$YL= 0
##$YMAX_a= 159257
##$YMIN_a= -155391
##$ZGOPTNS= <>
##$ZL1= 120
##$ZL2= 120
##$ZL3= 120
##$ZL4= 120
##$ABSF1= 10
##$ABSF2= 0
##$ABSG= 5
##$ABSL= 3
##$ALPHA= 0
##$AQORDER= 0
##$ASSFAC= 0
##$ASSFACI= 0
##$ASSFACX= 0
##$ASSWID= 0
##$AUNMP= <proc_1d>
##$AZFE= 0.1
##$AZFW= 0.1
##$BCFW= 1
##$BC_mod= 2
##$BYTORDP= 1
##$COROFFS= 0
##$CY= 11.3945322036743
##$DATMOD= 1
##$DC= 2
##$DFILT= <>
##$DTYPP= 0
##$F1P= 15.6554695791079
##$F2P= 12.8336369535428
##$FCOR= 0.5
##$FTSIZE= 0
##$FT_mod= 4
##$GAMMA= 1
##$GB= 0.15
##$INTBC= 1
##$INTSCL= 1
##$ISEN= 128
##$LB= 0.24
##$LEV0= 0
##$LPBIN= 0
##$MAXI= 10000
##$MC2= 0
##$MEAN= 0
##$ME_mod= 0
##$MI= 1.114404
##$NCOEF= 0
##$NC_proc= 0
##$NLEV= 6
##$NOISF1= 3.799351
##$NOISF2= 2.8
##$NSP= 1
##$NTH_PI= 0
##$NZP= 0
##$OFFSET= 15.70392
##$PC= 1
##$PHC0= -26711.36
##$PHC1= 15.38744
##$PH_mod= 1
##$PKNL= yes
##$PPARMOD= 0
##$PSCAL= 0
##$PSIGN= 0
##$REVERSE= no
##$SF= 200.130013532006
##$SI= 16384
##$SIGF1= 3
##$SIGF2= 2
##$SINO= 400
##$SIOLD= 16384
##$SREGLST= <1H.CDCl3>
##$SSB= 0
##$STSI= 0
##$STSR= 0
##$SW_p= 3612.71676300578
##$SYMM= 0
##$S_DEV= 0
##$TDeff= 0
##$TDoff= 0
##$TI= <>
##$TILT= no
##$TM1= 0
##$TM2= 0
##$TOPLEV= 0
##$USERP1= <user>
##$USERP2= <user>
##$USERP3= <user>
##$USERP4= <user>
##$USERP5= <user>
##$WDW= 1
##$XDIM= 8192
##$YMAX_p= 0
##$YMIN_p= 0
$$ End of Bruker specific parameters
$$ ---------------------------------
##NTUPLES= NMR FID
##VAR_NAME=  TIME,          FID/REAL,        FID/IMAG
##SYMBOL=    X,             R,               I
##VAR_TYPE=  INDEPENDENT,   DEPENDENT,       DEPENDENT
##VAR_FORM=  AFFN,          ASDF,            ASDF
##VAR_DIM=   8192,          8192,            8192
##UNITS=     SECONDS,       ARBITRARY UNITS, ARBITRARY UNITS
##FACTOR=    0.0002076,     1,               1
##FIRST=     0,             0,               0
##LAST=      1.7004516,     0,               0
##MIN=       0,             -155391,         0
##MAX=       1.7004516,     159257,          0
$$ Real data points
##PAGE= N=1
##DATA TABLE= (X++(R..R)), XYDATA
0 0 0 0 0 0 0 0 0 0 -8 8 -8 8 -12 16 -16 24 -24 32 -38 42 -48 56 -69 80 -88 104 -118 134 -152 172 -195 219
32 219 -245 273 -305 341 -378 420 -467 519 -574 635 -703 779 -862 956 -1064 1183 -1323 1483
50 1483 -1672 1899 -2177 2526 -2981 3601 -4499 5926 -8562 15073 -66924 -53342 83111 54220
64 54220 21736 -22301 -81190 -106892 3346 107528 65046 -64471 -90326 -16287 51918 52229
76 52229 9335 -50922 -50442 33220 92172 20065 -75051 -43696 59524 74161 5460 -40448
88 -40448 -37996 -14443 41422 80911 14257 -99020 -80567 58303 101550 -10527 -86759 -24442
100 -24442 44719 18596 -25269 -17307 4189 12329 22750 14424 -28718 -41945 14895 60130 27003
113 27003 -20128 -12809 8722 204 -1065 24009 25942 -2774 -13477 -926 -1824 -3237 16098
126 16098 18270 -17843 -28612 10552 22162 -23203 -33088 25617 44042 -23135 -62784 -5683
138 -5683 51541 25710 -22760 -21327 3111 9475 11955 13417 -2139 -12765 8998 29592 9222
151 9222 -19752 -7960 22522 24090 2498 -11996 -12213 2538 24095 22058 -13542 -31099 2075
164 2075 28985 1058 -27354 413 32409 3607 -36077 -16294 25978 20484 -11949 -11920 9386
177 9386 8943 -5149 -4723 4034 5874 8097 9369 -2381 -13925 -2174 18274 16121 -4052 -13039
191 -13039 -4919 5821 10315 4092 -9628 -11199 7942 16180 -7756 -24816 694 29053 7998
204 7998 -29953 -19405 20119 23427 -7520 -18594 827 12245 2423 -4848 -1145 2850 4900
217 4900 6721 863 -9076 -6598 7343 11893 1378 -7594 -4155 3123 5130 -1027 -8175 -4688 8504
232 8504 11076 -8002 -19191 -245 20848 6458 -22059 -15571 14829 18067 -8446 -18936 537
245 537 14515 3410 -10679 -7241 2970 6876 3235 -3829 -8443 -4717 4849 7045 -1911 -9655
259 -9655 -4569 4559 4698 -3531 -9960 -3569 7890 7589 -8649 -16298 757 17399 5001 -18328
273 -18328 -13564 12350 17408 -5952 -17556 -305 14889 5404 -9499 -7120 5560 8659 1142
286 1142 -5722 -5037 431 5244 4038 -2419 -5979 -1362 4955 3987 -4933 -9003 -119 9823 5796 -8842
302 -8842 -12757 2111 14911 3140 -14235 -9360 11942 13861 -6874 -15831 906 15549 5418
315 5418 -11158 -9038 6314 10225 -448 -8528 -3766 3739 4466 -686 -4373 -3123 607 3517 353
330 353 -4976 -5860 335 6896 3260 -7714 -8815 3480 10588 289 -12503 -6084 10814 10791 -6251
345 -6251 -13431 1141 13769 4841 -9871 -7012 7473 10098 -1024 -8379 -1967 6834 5569 -1759
359 -1759 -4179 -419 3407 3332 104 -3258 -3085 2130 5692 1550 -5917 -5299 4008 7802 -1094 -9570
375 -9570 -3053 9360 7539 -6552 -10242 2655 11117 1974 -9914 -5316 7208 7684 -3322 -8110
389 -8110 -219 6968 2884 -4021 -3456 2041 4075 1185 -1211 -1262 -530 1317 3300 1279 -3370 -3586
405 -3586 2551 5972 47 -7173 -3129 7071 6438 -4845 -8705 1698 9343 1914 -8618 -5055
419 -5055 6783 7822 -3133 -7835 -29 7196 3384 -4110 -3236 3032 4832 727 -2387 -1100 1841
434 1841 2407 907 -322 -1440 -1509 1523 3283 -142 -4060 -1819 4086 3770 -3886 -6684 1008 6361
450 6361 1173 -7095 -4645 4283 4914 -2967 -6413 -102 4796 1472 -3904 -3045 1796 3164 545 -1870
466 -1870 -1538 587 1839 1035 -98 -1649 -768 1793 2359 -67 -3441 -1540 3603 3346 -2825 -5614
482 -5614 1039 6204 1157 -6834 -4199 4923 5041 -3479 -6160 739 5381 1015 -4207 -2382 2340
497 2340 2479 -275 -1507 -717 1099 1719 790 -703 -925 118 1634 1520 -299 -1715 -1215 1612 2538
514 2538 -1552 -4789 -759 5146 1842 -6410 -5206 3659 5540 -2921 -6825 -3 5537 420 -4946
529 -4946 -2125 2853 2343 -1201 -2405 -1101 646 1740 1176 -1511 -2046 681 2090 -83 -1620 -442
545 -442 784 544 13 -1047 -1584 -234 3325 1894 -4306 -4584 2637 5729 -1257 -6106 356 5373
561 5373 398 -5199 -1777 4450 2961 -2149 -2097 445 827 1088 1458 -247 -1891 -45 1953 -177
577 -177 -2581 -297 2548 1109 -2174 -2153 -533 651 1907 1320 -2494 -4227 726 4051 -686 -4803
593 -4803 156 5866 231 -6367 -2155 5352 3875 -2829 -2746 1774 1245 -1013 -241 1112 37 -474
609 -474 528 -535 -2171 -281 2715 1151 -2645 -1829 -22 261 281 1148 91 -2195 -415 2454 621
626 621 -3044 572 4884 1415 -5083 -2478 5168 4305 -2899 -2552 2451 2270 -1378 -1214 1925 1611 -350
643 -350 -324 -366 -1278 -519 2236 1197 -1751 -2080 354 225 -939 332 1442 -1200 -1834 785 1037 -1706
661 -1706 -586 3858 1719 -4301 -2967 4027 4296 -2298 -2762 2368 2023 -2405 -1931 2545 2724 -617
677 -617 -1372 -223 -1091 -1050 1798 2256 -1176 -1844 -118 36 -1225 283 2497 370 -2251 -360 1220
694 1220 -954 -1037 3110 3047 -2502 -4002 2185 4087 -824 -2033 2461 2921 -2328 -2977 2020 3489 -31
711 -31 -891 529 -48 -1953 -122 2355 574 -1694 -36 248 -1838 -964 2189 1071 -2002 -1034 1148
728 1148 -328 -2284 804 3556 -932 -4072 293 3644 -217 -3008 1134 3094 -1136 -3886 545
743 545 3302 354 -1572 697 949 -1837 -1038 1943 1650 -1521 -966 602 -862 -1749 919 1934 -951
760 -951 -1471 422 368 -1540 15 2862 556 -3201 -1319 3079 733 -2395 102 3524 587 -3658
776 -3658 -1179 3137 1496 -1587 -281 1252 -1003 -1929 913 2058 -135 -1634 172 -98 -1525 -497
792 -497 1847 717 -1448 -685 127 -766 -348 1922 1477 -1643 -1681 1641 1148 -2491 -587 3188 1270
809 1270 -3075 -2662 1782 1886 -1231 -1024 1363 -222 -2033 -752 1187 1134 -149 -174 355 -1308 -570
826 -570 1257 1557 -330 -328 395 -491 -587 845 1624 -334 -867 995 683 -1298 -919 2355 2134 -1924 -2261
845 -2261 849 1458 -1045 -1397 1117 1282 -1359 -1606 312 611 477 -217 17 -581 -365 368 703 -76
863 -76 -426 558 -410 -1201 96 962 150 -686 566 726 -1144 -997 1072 1352 -793 -1343 475 1076 -1337
882 -1337 -1132 1011 1264 -1120 -1354 482 1106 -226 -222 -314 143 101 -119 485 195 183 421 -272 -725 124
902 124 1474 401 -541 278 716 -201 -1152 781 1457 -68 -1060 504 914 -619 -1207 864 1080 -460
920 -460 -1610 279 1116 -174 -645 -93 513 -379 -401 12 199 270 -29 -426 -812 -1 591 0 -574 187
940 187 547 -149 -1252 -109 1168 255 -1154 141 537 98 -902 -56 1280 103 -940 -366 685
957 685 42 -766 76 915 -69 -652 -205 519 357 -174 -478 -339 694 703 47 -461 -22 851 -74 -1032 -241
978 -241 1034 314 -777 -291 535 172 -805 -315 781 363 -571 -366 252 -112 -508 -291 335 304 -123 -87
998 -87 362 187 -33 -345 -123 35 271 -283 -220 -178 332 -547 -862 1 647 192 -581 51 840 159 -416
1019 -416 -707 480 883 -139 -480 388 355 -399 -107 434 432 60 -481 45 670 -271 -463 -258 402 -149
1039 -149 -439 -233 251 93 -401 -394 193 559 -271 -687 -303 594 639 -875 -334 603 776 -316 -64 158
1059 158 711 -236 -611 -62 461 -268 -251 94 363 673 -53 -87 341 51 -155 -303 233 96 -205 -534 -127
1080 -127 -80 -217 -637 28 465 142 -320 -242 461 589 -170 -369 687 626 179 -654 -135 682 321 1 -211
1101 -211 904 462 -209 -321 272 815 -25 -153 -121 323 -24 -130 8 147 -169 -122 -287 183 218 -578 -270
1122 -270 260 222 -207 -201 656 868 -354 -789 -80 622 25 -539 -143 162 233 -552 -600 61 576 -105 -380
1143 -380 -193 150 420 -263 -312 77 304 11 -409 -44 430 -37 -166 -20 382 -108 -185 -72 353 398 -360
1164 -360 22 344 -129 -1025 -543 640 301 -352 -87 162 329 4 -383 176 -11 120 1 -105 149 130
1184 130 139 -264 -323 442 299 -155 -382 229 51 -650 -74 637 338 -269 -456 286 -406 -980 -534 616 137
1205 137 -661 -447 310 -12 -597 -296 604 300 -359 -462 -157 -92 177 72 -166 134 215 332 -466 -104 510
1226 510 533 -348 -675 5 621 -459 -456 556 280 -499 -425 415 528 -496 -529 437 -29 -246 -311 435 -73
1247 -73 -138 -130 90 -13 -146 475 478 -206 104 415 -21 -365 517 667 92 -467 281 446 -358 -548 348 841
1269 841 -428 -953 167 815 -49 -474 17 718 -663 -645 110 483 -310 -482 26 -257 -69 -142 543 101
1289 101 -307 -76 268 -103 169 614 241 -207 23 550 140 -537 414 789 -473 -788 44 981 285 -685
1309 -685 150 897 -256 -1081 -113 558 500 -114 162 -97 -547 -17 521 297 -129 7 247 -174 -379 463
1329 463 571 19 -245 29 -170 -660 164 592 165 -939 -140 555 136 -649 211 861 -116 -1229 -641
1348 -641 303 591 -4 343 57 -210 -248 243 114 28 40 161 -272 -707 357 633 252 -494 -41 110 -469
1369 -469 -272 499 626 -357 -454 840 -63 -734 121 1234 111 -995 -465 667 353 -604 -20 441 -265
1388 -265 -522 84 511 -53 123 195 -412 -803 32 498 345 -345 259 426 -413 -421 360 625 -484 -493 222
1409 222 430 -301 -323 857 467 -1100 -331 522 558 -263 -4 658 3 -661 -260 717 57 197 142 -34
1429 -34 -690 -274 775 563 -349 -120 457 -156 -692 293 848 5 -340 -71 340 -348 -710 857 510 -420
1449 -420 -561 13 213 -616 -251 923 209 -544 -535 470 368 -520 -286 412 -115 -137 334 475 -177 2
1469 2 329 62 -399 -31 240 211 -158 -35 545 -135 -661 303 656 -1 -1012 -285 278 -348 -487 383 205
1490 205 -33 -545 55 481 248 -102 634 -48 -246 -24 308 135 -211 254 -28 -39 -302 575 214 -318
1510 -318 12 92 207 -604 -209 509 217 -386 -219 445 119 -404 -16 324 110 -689 36 119 45 92 171 213
1532 213 -333 -405 359 186 -190 -10 261 -235 -359 -25 193 -36 -202 607 184 -224 -324 469 444 -161 -46
1553 -46 -74 -33 -267 -102 554 357 -152 -377 370 126 -148 135 380 501 -30 172 286 128 91 368 119
1574 119 -181 50 166 -150 203 338 35 -242 -230 223 295 -383 -306 299 -66 -318 -280 337 361 -214 -259 38
1596 38 190 -90 -459 93 66 -75 -188 -236 -71 26 19 -7 -190 -147 135 -22 11 140 85 172 -143 -180 184 -56
1620 -56 76 30 -167 -217 -82 102 245 -136 -133 197 270 -156 -357 161 -144 73 -387 85 49 228 -44 -85 -47
1643 -47 -171 231 110 -373 279 218 152 -143 119 122 1 -222 1 177 -247 -292 -9 -21 -60 -57 -111 295 -277 -367
1667 -367 -136 296 -178 -254 56 -50 -134 79 55 37 336 -46 -138 -513 79 59 -107 -267 -65 173 -254 -8
1689 -8 290 -52 -29 -123 -127 146 397 -83 108 17 182 -251 285 114 55 -169 22 225 15 -127 -411 179 153
1712 153 74 94 194 -129 67 -238 -142 -174 31 58 -182 158 36 -65 107 -35 214 48 -414 -31 159 -69
1734 -69 -162 -115 -68 209 -53 92 195 -51 -242 154 8 206 -5 -127 -102 -1 498 105 73 228 222 -211 -232
1757 -232 -244 304 -33 -135 -95 -35 117 104 -188 198 133 -159 -246 -38 30 -358 -13 2 71 160 -32 139 74 125
1781 125 -227 -33 89 306 -336 -76 -276 224 -98 58 -179 320 123 -638 -73 35 -88 -324 279 29
1801 29 -29 10 -9 241 -92 184 -33 -4 162 149 286 -38 242 -59 73 -217 -156 458 319 160 40 75 -244
1824 -244 37 -121 118 -56 -68 108 73 -30 -201 100 204 375 215 -156 287 204 -51 -283 129 314 189
1845 189 -110 172 137 285 -10 -130 -161 415 -26 102 227 -299 164 -4 -492 -126 135 -26 368 -322 183
1866 183 123 -202 55 -75 246 -9 96 43 -141 -18 33 235 140 53 -281 111 -54 -308 -135 -16 82 -127
1888 -127 -2 -28 -30 -116 83 -293 -221 -6 11 -492 326 269 348 -102 -213 -221 130 -349 260 254 96 -151 179 568
1912 568 143 -7 -394 258 -29 -303 272 109 200 -91 -123 -26 178 -109 444 117 -208 298 64 125 -115
1933 -115 89 -110 20 -29 -49 -65 -170 -35 403 154 -456 -197 -141 -152 167 79 164 206 -118 -657 20 10 -245
1956 -245 -104 209 -166 -220 -23 127 -283 -43 183 189 -258 -50 -10 -221 -66 0 -114 70 -71 79 410 -134
1978 -134 110 -31 -52 -332 -199 462 -35 -317 -139 223 371 -184 -49 -68 47 119 26 27 229 247 9 251
2000 251 -60 28 -4 228 -221 -83 -229 -221 -243 412 225 -264 -168 -196 478 -414 -156 -94 11 -103 -396 388 330
2023 330 -64 -576 -271 127 -279 -314 -41 82 -19 110 -45 -132 -222 192 265 45 -224 259 -210 -125 -196 -37
2045 -37 -153 -309 4 -86 -67 -108 267 131 -66 -387 181 448 10 -151 167 -19 14 -24 -210 221 -108 -29
2067 -29 -473 -58 239 112 89 3 -224 69 -70 -256 63 363 297 374 72 53 -284 -99 593 338 -65 -314
2089 -314 -168 -45 289 -176 2 373 247 -282 -100 -73 175 98 -82 -318 -138 154 92 -411 36 347 402
2110 402 -198 -105 -72 -37 95 125 154 76 -175 10 287 -211 149 -76 109 88 -243 107 356 4 -331 -44
2132 -44 328 145 -48 147 -28 -88 33 121 -122 -203 339 -139 -313 -397 17 291 132 -156 24 47 -140 2
2154 2 167 -124 -235 1 420 10 -250 203 191 160 -672 -210 173 67 33 -152 215 -50 -538 252 -330 -310
2176 -310 167 145 -51 -434 -76 408 -5 -46 49 163 -47 -126 129 219 131 230 -187 -182 -46 -150 314 153 -403
2199 -403 -164 200 363 116 -85 78 314 -65 -363 -258 143 264 -53 -122 -125 -154 189 -45 -1 15 339 -151
2221 -151 -26 -110 -76 -119 136 -119 225 73 -380 16 310 -128 -62 238 145 -170 -389 -20 417 -114 -247 -83
2243 -83 97 396 -32 -231 -91 -223 -5 -148 -271 17 65 -11 -252 118 211 291 127 44 -227 -158 -77 194 74
2266 74 -237 -48 174 245 139 -253 203 254 -65 -88 145 -43 261 -91 34 -420 150 -142 94 103 -324 -155
2288 -155 -10 -205 -203 -156 172 -75 113 -164 -134 91 3 367 -303 -170 262 72 235 -217 -31 206 97 195
2310 195 -126 263 -113 -55 -147 68 152 24 -69 -290 -78 382 -28 -10 -174 135 458 -21 121 36 -148 62
2332 62 72 157 -151 -180 472 433 -69 28 82 409 -8 -191 73 -181 128 301 -306 140 280 -84 -159 -62 -78
2355 -78 -149 -6 111 -262 -36 26 422 -141 -42 -126 80 197 -126 -122 9 211 374 -288 -301 -145 258 216 -469
2378 -469 -86 135 156 -63 -89 -106 -194 178 54 -459 74 203 329 3 -75 324 -112 99 -98 -180 -72 -306
2400 -306 95 -444 -276 -11 148 -312 14 57 -71 561 154 -167 155 -341 5 140 -122 -19 19 -44 58
2421 58 -118 -198 -73 223 -364 -196 75 78 -8 -70 156 -62 -26 42 -360 -100 307 298 -121 -54 -127 -12 284 6
2445 6 -350 55 -157 125 -76 -203 -278 -200 130 -87 -568 -65 -127 -125 102 230 272 227 351 154 -4 215 206 -7
2469 -7 -197 -106 340 153 -215 -87 153 61 157 189 -107 -446 142 66 -32 -143 104 94 -199 -102 405 63 68 181
2493 181 -152 34 -218 407 34 -412 -55 58 348 -270 -216 -48 162 39 -100 -273 -115 241 27 -17 -331
2514 -331 -14 -132 11 -109 -84 -1 4 33 -140 -227 215 297 -28 -181 252 -60 425 -107 -323 4 44 171 -35
2537 -35 -216 -244 89 72 -172 -190 -429 194 260 91 -496 -18 254 -27 -378 -112 392 79 -84 -380 -20 -116
2559 -116 78 -62 -208 -305 78 92 -79 -221 -229 -120 224 37 -232 56 251 -6 88 112 55 53 -42 143 76 74
2583 74 106 49 -278 -61 67 62 34 -297 -410 -145 163 105 -308 -167 178 110 -169 -42 61 338 124 -50 -125
2606 -125 42 247 271 -225 -159 -184 125 -9 -216 -76 74 63 9 -289 64 -47 151 195 -120 -37 -29 274 89
2629 89 -259 3 311 26 -57 -310 -115 -68 244 58 88 -140 258 -60 -96 -269 99 -189 14 -62 166 126
2651 126 82 99 -99 -66 54 460 10 -25 -58 -13 143 306 -140 -7 -171 -102 -160 87 -28 -142 48 -394 -297
2674 -297 103 -36 94 -97 -91 94 -9 -91 -155 -12 238 192 -146 -102 -78 -324 -10 228 42 91 -153 25 -89
2697 -89 278 60 51 -264 -118 41 29 182 54 -222 404 -99 -190 211 32 111 -42 303 -183 -327 36 341
2719 341 310 -179 -231 -49 132 87 -85 -114 -33 -43 -96 -170 33 -199 0 -173 33 -212 -196 -72 22 83 79 104 115
2744 115 -171 -84 -117 100 -9 -35 -32 -126 47 -231 74 -79 260 -9 3 -391 -108 -11 -253 72 61 -132 -100
2767 -100 259 20 51 -24 90 21 13 -98 72 -340 201 -103 -230 9 18 41 10 -327 251 433 47 -238 -335
2790 -335 -270 193 -10 -156 76 125 227 -57 -68 162 -139 -114 172 196 105 -14 206 -50 103 89 -26 -240
2812 -240 -42 -191 -91 58 87 24 120 -85 219 107 156 -287 252 121 51 -281 212 268 78 83 214 -143 -28
2835 -28 74 98 137 -82 117 -153 327 -126 107 268 30 -154 244 162 310 -48 -232 -114 0 -64 29 -45
2857 -45 -113 57 117 -3 -136 67 -139 -21 -80 -80 235 69 164 -30 245 257 385 234 -180 -47 296 -139 -320
2880 -320 -229 -168 298 138 304 81 28 23 -210 50 -56 -231 524 -53 -248 -15 -162 142 131 148 -66 -196
2902 -196 -5 -49 -87 217 2 189 -202 -336 120 -75 284 -113 79 142 -168 -157 -184 89 49 142 61 183 -7
2925 -7 -171 -157 262 155 -110 -361 96 -64 30 -181 286 120 -159 257 71 -123 105 341 -100 8 -227
2946 -227 -128 243 -14 -78 108 201 219 -69 357 37 345 75 -104 -257 328 185 82 -61 -43 54 -108 55
2968 55 -130 224 275 -291 -157 36 -69 -127 -173 -32 -83 -75 85 -14 172 -12 251 103 133 -244 76 310 -29
2991 -29 378 -286 105 317 -187 -28 1 180 169 184 -53 -388 -10 -159 -100 281 -211 147 54 66 -2 -163 315
3014 315 -130 212 278 -135 100 6 -109 -256 -211 -299 -125 209 -203 -147 113 105 -170 153 -228 21 66 153 -164
3037 -164 34 190 27 -281 -70 147 59 246 -256 -66 144 -103 -3 -47 -250 15 -47 22 134 207 -41 -309
3059 -309 -200 41 -73 -127 -141 -10 -58 -48 -68 207 51 177 133 82 188 -53 119 334 49 146 214 4 -80
3082 -80 -245 29 5 113 14 194 -16 -171 260 46 63 157 -48 39 39 -41 -5 -1 -80 101 -20 70 -161 60 141
3107 141 -25 -63 -233 206 24 96 -151 25 247 -232 -186 -275 -89 -20 -9 -33 -172 104 121 89 277 -8 41
3130 41 -51 -54 96 217 264 191 -68 3 22 308 91 -74 -114 10 82 -26 82 31 54 -145 -323 -109 268 213
3154 213 -11 216 417 -38 -434 -106 55 -190 203 127 6 -146 75 27 -137 -196 120 124 77 34 335 -102
3176 -102 243 12 21 -39 -187 -108 129 26 -191 -318 285 49 4 503 146 137 -128 132 -16 93 83 82 -133
3199 -133 -43 65 -217 -278 218 222 102 -314 217 157 -206 -247 -68 76 -28 -51 150 -37 93 -52 -62 -228 -187
3222 -187 -233 -158 -48 231 77 52 -133 -176 -59 -488 -20 -83 48 -50 41 53 312 96 -2 -100 88 -169 84
3245 84 -49 139 0 -37 -353 -42 46 26 104 -83 303 -61 225 -28 -248 72 47 -80 63 -206 288 -231
3267 -231 114 389 100 -129 -85 38 -24 86 -295 91 -120 -149 -46 34 116 -254 170 -189 26 141 -100 201
3289 201 -293 77 60 351 -380 81 -158 -214 170 28 -319 135 -218 168 157 78 136 -288 175 -71 -7 -143
3311 -143 -217 -196 -106 20 -103 -70 -258 -39 -2 3 17 375 64 -12 -55 -118 26 -8 -158 -114 -34 294 -179 -142 -18
3336 -18 -40 -123 150 -149 -232 -115 112 -258 -24 186 256 293 -183 16 -17 -162 -104 -312 -327 17 -10 -167 -69 -21
3360 -21 94 103 -203 -153 55 136 181 154 -48 239 141 -17 40 173 37 215 31 64 74 -6 -238 -109 -199 -41
3384 -41 -221 398 37 110 171 39 140 41 -242 147 137 -80 117 95 -247 -28 -12 183 79 167 103 -146 -291
3407 -291 -163 74 -183 54 68 12 33 -54 117 88 89 253 -104 -41 -265 -107 271 49 -118 -81 10 232 76
3430 76 66 144 174 -76 -27 -33 38 100 172 -126 23 51 13 78 30 -24 -7 -3 156 69 -129 -231 187 -316 111 28 -199
3457 -199 -170 -13 -68 133 -263 53 1 264 116 -202 -53 118 107 -104 58 -126 -115 -211 21 -204 115 13
3479 13 106 -113 -142 130 -94 -246 -96 -75 -99 -18 -148 -50 171 -189 -137 -249 123 -115 34 -15 -542 -19 -18 53
3503 53 -160 469 -121 25 278 -300 75 -25 -254 -117 177 6 117 -97 222 140 -1 444 289 68 -76
3524 -76 260 458 177 126 6 -90 19 57 2 -66 -155 179 -57 55 -255 -401 379 -62 -97 -180 -64 286 0
3547 0 -20 -35 230 144 -237 338 224 11 137 179 51 25 -119 -155 -45 -22 91 -15 43 -81 -13 52 66 54 96
3572 96 -17 -70 183 166 22 256 -82 -267 -49 46 134 35 -26 -4 126 185 -192 66 198 -165 59 135 -153
3595 -153 299 22 15 56 -118 133 -204 103 182 271 163 43 -202 -213 119 273 113 209 61 59 -231 174 -159
3618 -159 102 233 -164 -255 163 -234 5 -170 -102 83 64 -140 -242 26 -28 384 102 62 50 59 -38 7 -162
3641 -162 -158 -36 134 277 311 24 -171 188 -37 29 267 18 -1 229 259 -41 -116 -2 262 86 -107 29
3663 29 -155 -89 -239 207 -103 -28 223 -52 -92 51 116 -7 59 -333 -175 159 29 68 -19 -254 -188 -249 -266 43
3687 43 -67 -28 169 476 64 -393 -290 -153 34 -258 156 208 149 -223 -96 223 156 170 -120 182 292 190
3709 190 -67 34 -383 -186 -27 87 -62 189 -238 231 181 56 250 -206 -242 -48 -402 -168 69 116 193
3730 193 -5 168 -135 201 89 -7 -154 -53 32 22 -163 -464 47 -644 271 -57 68 9 114 78 -98 406
3752 406 118 -2 -51 40 172 -252 106 -144 127 -53 30 22 97 -46 19 105 52 183 -167 80 -148 -209 62
3775 62 173 -204 -190 29 237 -33 187 142 120 138 -449 -152 -261 -302 -77 -29 301 222 245 -163 198 -67 -88
3798 -88 250 -129 210 336 253 -100 58 -23 7 113 158 37 -253 -86 11 -3 -75 178 58 327 -45 44 -244
3821 -244 139 128 -2 5 169 -189 -253 154 -137 -32 -299 -2 170 -93 -47 -204 -145 133 89 -194 160 217 -34
3844 -34 -64 401 192 -236 -230 29 115 -241 21 -8 -282 -32 22 38 -228 -52 38 70 -294 -116 125 29 -95 1
3868 1 153 -134 -123 83 -161 42 -94 110 -4 -124 -5 -277 51 108 153 37 -279 -41 201 200 179 -100 -295
3891 -295 -26 -22 94 -109 -22 14 14 53 -130 -135 98 231 -20 -79 128 10 -186 -133 224 119 186 282 75 202
3915 202 -240 -35 -115 -79 -243 -274 -241 100 -88 -110 -80 -125 132 173 57 -117 150 264 212 239 43 -314 -46
3938 -46 -72 117 -190 97 164 168 289 -17 0 428 128 2 -11 -95 -117 -2 44 -67 -56 -70 -94 -252 158 19
3962 19 22 193 380 -37 149 -89 -299 170 58 -28 -82 -124 -250 -43 -160 13 52 72 207 -80 67 210 204
3985 204 100 -90 -222 239 79 306 148 94 -20 99 -215 -145 -11 87 -132 -148 207 277 199 -317 -101 -90
4007 -90 30 -98 -53 77 0 -111 -110 160 326 99 -200 23 187 -72 61 135 139 80 -10 -267 -295 40 -180 0
4031 0 -217 -10 -8 57 146 -9 -145 8 -41 303 56 86 150 -18 -168 -9 100 -160 -174 166 24 -45 -39 -21 -109
4056 -109 -125 159 -286 359 156 -179 251 69 -6 77 -322 -228 -16 123 -29 -32 300 -62 151 78 -129 224
4078 224 111 -265 -176 43 -275 -98 213 241 123 -152 -52 81 -294 -119 222 -110 -37 -153 -17 -90 -87 82
4100 82 222 -134 109 64 -196 -273 -196 -50 -26 150 79 -196 -287 -43 -18 -334 194 -170 18 160 107 62 -199
4123 -199 141 173 -230 -194 -56 85 -236 -187 -98 45 19 -112 297 -186 -245 173 -136 -72 -147 156 70 -64 272
4146 272 -128 -91 198 -106 -271 -13 -339 -281 107 72 -88 -172 -52 -21 170 2 -58 99 -190 -288 60 2 -123
4169 -123 -208 -42 81 -86 -38 0 170 117 27 -391 -70 -80 -83 -56 217 237 26 -8 -45 1 -278 11 379 17
4193 17 0 -12 -74 109 -23 -94 208 -226 167 184 300 84 14 64 106 -186 300 -12 155 51 34 -12 -84 -132
4217 -132 252 -366 -41 -150 -112 -36 80 178 178 -105 -88 -132 126 215 -117 47 264 -116 44 156 -37 229 -159
4240 -159 -90 -25 -18 -117 84 -247 -120 -119 196 40 6 -104 -120 -207 -61 10 -19 96 -120 40 -235 -329 -296 -35 88
4265 88 -520 -51 -73 -47 -57 303 -29 -242 -105 -103 -56 16 -13 97 -124 30 -118 90 334 -91 -271 196 228
4288 228 207 39 159 172 134 117 37 -153 255 -215 -122 105 -209 244 -58 238 -33 -42 92 50 20 -121 -20
4311 -20 15 -225 -6 -216 -58 16 60 -122 271 -128 140 168 117 181 -100 203 0 121 14 22 -159 325 -74
4334 -74 149 79 133 396 60 147 -47 -114 112 -141 -499 276 50 108 146 187 259 291 153 -51 162 74 172 -178
4358 -178 -80 -115 65 176 -39 -90 43 -17 -480 -153 -49 -131 -135 170 32 -193 202 211 24 -71 40 309 95
4381 95 168 1 185 -234 -216 -145 -37 -112 -21 -10 -21 160 -160 93 -31 36 -63 -55 7 -204 96 55 -101 -72 -171
4406 -171 60 -31 19 104 362 -56 -293 121 170 -46 -185 -292 -6 124 126 -177 89 -277 -169 224 -372 -189
4428 -189 54 165 -61 -109 -44 165 164 -9 28 52 -231 225 117 -26 138 -68 -184 183 222 -154 144 -20
4450 -20 -26 -89 -83 325 -81 96 15 235 0 -305 49 -11 -106 -280 145 166 188 -52 117 -133 26 -69 90 164
4474 164 286 75 99 -96 -147 3 108 201 76 166 -262 -517 -45 83 156 -237 -73 61 -182 -1 -21 -123
4496 -123 186 75 142 -8 110 73 151 102 167 9 6 -79 213 172 -107 -74 161 -299 -26 234 58 28 -5 -206
4520 -206 55 -91 223 220 98 -258 197 202 -119 45 -49 113 72 -93 66 100 403 122 -110 341 -180 -37
4542 -37 215 -231 255 76 -246 -16 39 169 91 326 272 -89 -380 -126 165 -17 18 17 41 162 -133 -70 33
4565 33 -99 -114 14 173 -11 259 -198 39 -147 152 -80 129 -67 -63 -54 -40 196 -3 343 3 -137 118
4587 118 135 88 -102 71 -189 56 74 -196 21 103 230 361 -6 61 -8 374 -166 -133 74 16 -132 -182 -84
4610 -84 5 71 47 158 115 176 261 -79 282 76 -27 -329 -255 302 196 -108 -177 -212 175 83 247 192 -102 -153
4634 -153 122 33 -59 143 -346 -200 -129 -108 27 -48 176 28 216 45 -83 -223 -46 -171 -14 57 49 89 265
4657 265 238 52 -6 -85 50 124 -391 43 103 -151 377 -99 42 100 87 178 -185 42 -19 -12 60 48 -119 119
4681 119 33 -33 107 27 126 -196 -35 78 294 275 166 160 -268 -228 -92 -59 -253 8 62 -59 -276 -28 72
4704 72 -55 -261 -54 26 -6 -197 -244 -256 -55 201 -60 -86 -219 -19 179 -23 318 119 -13 7 33 98 29
4727 29 367 154 -11 30 -38 -79 48 -27 30 163 327 228 -77 158 275 35 -69 280 -79 108 -116 14
4749 14 101 178 233 -275 -64 -48 154 -80 -63 145 -182 -137 140 0 -226 -151 -85 -31 123 -48 24 -229 -272 -153
4773 -153 28 187 -69 -25 -377 -180 20 32 0 182 53 -446 55 -29 128 30 -62 168 -254 9 205 -207
4795 -207 152 -135 -10 -415 72 220 5 102 -9 -117 -237 -97 -2 -167 -179 -74 117 8 190 -235 114
4816 114 3 115 132 168 209 40 522 -167 -154 -32 241 92 -48 -137 56 -374 34 113 344 -228 27 -391
4838 -391 -188 -46 162 111 -213 241 239 -177 -360 51 51 271 188 -125 -167 54 292 59 -11 61 -88 215 -178
4861 -178 187 -42 -294 -98 11 203 -376 258 18 59 189 96 47 -192 -131 146 94 171 -177 -188 3 34 -180
4884 -180 358 62 260 -271 -81 134 164 208 146 285 169 -41 -97 117 -68 -131 -5 -12 83 -67 43 -126 52
4907 52 368 -86 -60 -134 -18 81 -247 -123 -145 140 -51 -4 210 144 172 -220 277 -285 -253 -146 -230 88 -126
4930 -126 -45 139 -105 -169 -63 205 126 -153 -46 43 -135 -144 -249 90 -146 48 -153 209 -209 57 268 120
4952 120 82 -378 -222 -496 141 -99 -91 -198 -297 225 -149 43 155 -107 -55 -274 308 -239 124 290 -192 -59
4974 -59 256 145 189 -56 330 121 -81 -34 -114 -99 93 151 63 -112 194 -53 -130 313 -51 151 4 74 57
4997 57 5 123 180 -23 -38 -190 -134 320 -29 -388 112 -8 -60 -487 -182 176 257 64 220 40 131 30 -39
5020 -39 81 -50 34 252 -12 134 -140 -79 -67 -63 71 63 -180 -10 148 209 -113 175 225 105 -26 -358 -41
5043 -41 -311 -108 248 -188 -89 155 -265 -144 110 55 172 -75 -214 -14 -227 133 65 30 164 36 97 134
5065 134 242 -36 -201 -139 219 156 7 47 85 -347 27 -102 -185 129 -70 22 130 -9 84 -49 21 364 257
5088 257 -289 346 243 -41 -53 -81 93 304 55 369 -41 -212 -74 -279 -92 -223 11 -341 139 41 99
5109 99 79 88 288 -26 133 69 -44 152 -229 -72 165 41 166 91 -92 169 148 -204 170 149 94 53 136 193
5133 193 -22 88 -110 14 246 -189 -80 266 49 16 65 -28 364 -177 -93 123 151 -69 -356 -167 185 6
5155 6 -265 -243 -125 44 -291 -141 -384 337 -200 -173 27 100 -89 58 189 -100 -318 -47 -209 100 211 -226
5177 -226 129 99 38 -225 127 -160 157 72 101 46 82 -84 -113 -74 -259 88 374 -50 -21 141 -10 -395 36
5200 36 -45 -56 -17 14 209 -134 102 -150 41 -141 -209 41 -15 -203 -347 -269 -50 -10 100 -18 -169 -80 24
5223 24 82 -325 71 62 -157 38 -49 -149 -399 -73 -4 -53 368 106 -389 -171 -140 -30 327 -101 -40 -115 -75 57
5247 57 174 -162 -147 113 -30 43 52 283 79 -100 -8 188 -273 -109 -48 135 296 171 -49 72 -178 -194 149
5270 149 35 69 -153 272 -61 323 -269 -93 -120 -67 122 -118 202 132 117 -96 -3 -160 -93 -113 -24 128 -9
5293 -9 -253 -180 -115 272 -376 214 22 70 114 -181 149 106 220 110 -37 -70 368 -167 -46 -29 -416 81 42
5316 42 252 51 -70 62 143 235 123 -109 166 53 18 -95 -147 -171 247 178 -30 165 52 -158 288 -174
5338 -174 182 -35 -348 248 -104 79 15 -24 34 -38 19 -56 166 153 -126 77 -144 -180 -63 241 -206 -131 243
5361 243 -235 -111 -372 40 -53 0 132 28 -207 299 54 -364 -55 -32 -360 -270 -92 -168 -164 -69 -166 -165 124 -221
5385 -221 -109 85 -320 -46 228 263 -351 -95 -74 -21 -207 66 63 357 180 347 25 13 5 -189 -24 -47 131
5408 131 -224 -195 109 333 193 211 66 -76 36 -12 59 26 34 35 -30 202 -411 -92 -62 151 -125 -52 191 -177
5432 -177 -150 -176 13 -15 -122 44 -86 244 -296 165 -75 -33 115 -229 -68 -97 -33 6 86 -475 254 200 -25
5455 -25 -109 -15 -136 -41 182 81 259 19 -72 -6 233 -99 8 -252 81 10 -11 -287 261 334 124 -207 -85
5478 -85 70 19 -40 -181 -106 136 316 -70 242 98 -27 8 174 -82 -329 -92 -44 -246 -166 68 149 29 -100
5501 -100 318 -367 -155 5 -145 34 -62 -41 11 -392 -176 -97 -359 -226 -105 -45 -110 -130 159 -83 -186 360
5523 360 -101 174 8 93 42 -195 115 93 -248 126 182 50 -270 -154 83 -27 -132 25 -155 223 13
5544 13 -2 130 -137 -249 25 -97 15 -68 294 130 -95 82 143 13 58 27 -180 295 112 -19 7 -71 397
5567 397 -34 272 -72 59 -88 44 195 -110 -39 -177 -15 -104 30 -272 -51 -355 84 -233 19 201 135
5588 135 271 -57 195 13 -252 51 -98 325 141 137 -17 92 283 -45 -445 29 -282 -99 190 58 128
5609 128 375 -18 57 -231 -502 10 245 -259 170 -199 -71 -12 108 96 -160 -511 243 42 -325 244 -9
5630 -9 -122 -6 114 39 -65 -294 256 -134 180 -74 0 189 97 29 -74 -118 260 -393 -2 -237 162 -32
5652 -32 15 109 280 292 -94 12 -19 -292 -294 -82 167 606 221 -15 264 320 -152 16 385 -44 -225 19 -31
5675 -31 0 254 256 -125 178 -106 177 -277 -39 164 146 68 89 27 -84 -63 302 342 -326 53 -231 98 -145
5698 -145 218 -98 48 1 -14 5 98 114 119 -284 143 -46 -170 -32 -53 212 -68 316 -81 -147 -108 -203 -90 -165
5722 -165 337 -159 -145 -116 -400 -269 -80 -254 125 -57 -122 87 -72 57 148 -170 123 46 -376 205 198 -214
5744 -214 -144 -148 -70 15 -19 -132 -153 -12 67 43 -49 -454 -118 -217 -145 -1 277 226 -144 137 -321 367 -294 53
5768 53 -321 58 79 64 -31 -166 11 -37 70 -13 203 -12 167 271 20 111 -17 84 28 -50 -88 -226 223
5791 223 -2 -28 62 -76 -101 87 176 48 76 55 -96 343 93 12 -235 99 -73 20 -113 -75 179 -98 -48
5814 -48 -261 -40 -255 -14 22 222 -231 340 10 47 57 -293 53 -138 -196 -25 2 -109 248 50 106 75 -62
5837 -62 -23 55 -228 -333 150 158 -12 -4 43 -23 -6 204 356 -86 2 176 -105 -69 -154 -282 208 322 71 236
5861 236 -156 248 98 89 -90 -151 36 -204 285 183 22 18 -91 12 176 -65 -248 63 -194 20 17 82 8
5884 8 181 418 149 -347 89 -90 -203 -215 -216 29 -38 1 -30 -136 -154 -93 98 -48 -336 24 18 65 -140 139
5908 139 56 -118 -27 -361 -139 -168 170 -38 -89 247 64 15 -128 470 88 93 -108 -62 98 -31 29 2 295
5931 295 149 -160 -69 -10 34 82 82 0 -235 -105 75 224 -28 10 -41 -66 -58 -6 157 -47 131 168 95 -60 -83
5956 -83 -27 -13 -21 -148 -7 -151 -114 -65 42 -199 -77 16 64 331 -20 -150 4 -303 38 245 -113 -158 26
5979 26 -150 2 186 -17 -328 -73 -211 137 74 -56 -185 -221 -315 18 94 -111 297 -15 -11 -150 -501 21
6001 21 169 9 71 228 152 243 -114 -390 -220 -271 -135 -41 12 56 -2 200 33 -19 -2 -4 -246 -250 202 170 286
6026 286 33 46 380 9 78 179 -38 43 -206 -71 64 -13 -113 12 24 -141 408 -16 20 7 11 -117 201
6049 201 -68 221 42 240 -135 -270 -33 -66 153 -72 -228 165 -156 66 -76 252 -79 -86 418 112 31
6070 31 107 102 -63 156 -391 -37 -21 73 -112 5 169 -105 32 -65 -146 -87 -215 -240 -68 0 173 -59 50 113
6094 113 35 -275 -8 -54 60 246 -162 -101 193 -264 236 -287 -329 133 126 -270 44 107 -131 20 -30 25 -121
6117 -121 -152 -147 -166 -131 52 -23 -33 -55 -84 -247 169 34 -23 -118 81 -249 210 158 -192 102 -75 -8 -116 -126 -37
6142 -37 -98 -66 -104 18 184 284 234 172 75 -519 -15 -118 -229 -169 144 254 23 -98 -62 88 229 -102 216
6165 216 49 49 -246 307 40 182 51 3 42 14 55 65 7 -318 -260 20 101 -125 118 -153 105 29 271 264
6189 264 175 -3 22 389 359 214 -31 -66 -273 329 37 -49 -32 237 -24 -269 -123 -247 -157 54 308 -156
6211 -156 62 255 56 113 225 -161 -193 194 90 -159 -293 182 -128 212 -330 168 282 -220 43 12 -75
6232 -75 97 -103 -47 -35 -138 -231 -50 -191 -210 148 -137 108 -12 -137 34 -121 12 -196 6 -344 -84 103
6254 103 -100 -84 27 22 142 114 73 -237 -2 -180 19 -249 26 279 33 -106 -358 90 -48 -40 161 145 -73
6277 -73 -120 254 -367 -157 179 254 -10 -57 5 -66 108 161 -121 -85 42 38 186 43 156 226 -348 -281 -39 -384
6301 -384 276 -12 -39 65 -212 178 -340 -27 67 -134 -216 47 -201 34 -107 77 -153 -16 -145 130 190
6322 190 226 131 29 -9 3 -125 -46 -148 -72 200 48 -191 -100 15 77 -288 182 -79 -112 94 184 -216 -231 -25
6346 -25 76 -110 29 -106 -129 -155 -292 65 232 124 -26 49 35 96 -157 292 39 39 2 -115 43 -65 129
6369 129 -58 6 -112 35 13 84 144 7 -206 -10 210 -231 258 -50 -474 3 58 65 -13 201 -108 -142 -66
6392 -66 69 -89 -37 178 -50 45 -97 -178 -193 -9 -116 51 -110 4 -47 64 161 -144 263 -418 3 6 -105
6415 -105 80 -116 73 -4 111 -103 159 216 -216 237 57 -15 -110 -78 -111 -87 -379 63 185 -81 363 414 -139
6438 -139 -123 -5 25 -332 16 -155 75 -193 -95 154 -124 164 41 102 -8 -140 -65 -225 82 77 188 -336
6460 -336 -235 -96 -208 194 158 64 -205 86 -76 23 9 -1 143 -169 -135 48 197 -105 -270 -157 -18 -179
6482 -179 110 11 -151 -186 -177 -262 -19 31 144 -39 -177 76 -25 -30 43 236 14 -62 156 37 -205 249 143
6505 143 -90 -42 7 192 -71 5 -96 -74 -23 19 -156 289 11 -66 120 -17 49 357 -178 -213 152 -163 -2
6528 -2 272 247 386 29 -124 -64 -142 138 -50 84 474 202 209 278 -143 208 -80 -48 -30 -182 11 -33 100 -86
6552 -86 146 -26 119 115 231 -102 248 -69 8 -168 -62 269 -49 -114 87 164 -126 318 -36 -19 -321 36
6574 36 -239 -60 382 -255 14 194 -146 80 64 -84 -208 -281 -170 89 94 171 55 -472 25 -184 -219 -193 245
6597 245 -169 -22 207 185 88 176 158 -159 -93 -185 -238 43 -331 -75 185 274 206 1 36 -68 96 -313 192
6620 192 -9 -223 -7 -89 -327 200 252 296 101 -61 -258 50 -2 246 -65 -13 -88 -190 119 -177 125 -34
6642 -34 218 85 -71 59 83 171 -229 -100 -152 -297 -131 125 -5 -142 187 178 225 221 -227 229 -76 143 212
6665 212 -55 -94 366 397 293 -413 150 57 138 140 -63 213 -201 70 173 52 -110 90 -269 -39 206 181
6687 181 237 407 176 -207 -270 -153 56 -22 96 -106 -129 23 283 169 -474 48 -158 -235 227 -48 141 273
6709 273 -348 10 81 222 68 -342 229 66 85 204 -59 15 3 144 -59 -126 -127 -74 280 83 432 111 -250
6732 -250 42 260 32 -212 24 -51 -161 -60 -171 -77 -226 -59 -28 -116 -121 386 175 -218 -36 -53 -49 -169 82
6755 82 -300 -78 -36 -42 123 224 -17 -132 123 -223 -214 -46 118 -121 208 -88 -44 198 20 151 311 22
6777 22 -53 -37 -271 19 312 -287 -122 -377 126 -201 -74 -174 -183 15 -362 -59 -240 134 -224 -20 -168 114
6799 114 212 85 -58 229 249 166 91 432 121 -101 -215 -124 198 -123 -131 -260 101 -388 173 -80 132 198 -25
6822 -25 23 -1 -278 -33 -13 -22 311 281 146 -29 128 73 202 -188 120 -68 -46 1 -281 -179 -347 -125 -288
6845 -288 -126 132 -204 60 -203 -51 294 -451 116 -47 -130 -29 -24 -6 -136 -63 19 -150 -19 118 -144 -106
6867 -106 298 20 -296 136 11 125 -102 -301 96 -231 -89 42 227 78 -106 119 54 -107 -154 47 193
6888 193 -30 52 -270 161 -102 74 238 -2 -2 -31 347 -261 214 -238 -228 108 -195 137 44 -85 100 -121
6910 -121 165 321 115 -45 -72 135 -92 83 -88 -97 308 211 -19 255 -143 -85 367 -35 96 -94 175 95
6932 95 -46 -215 157 -26 -60 92 -32 413 127 -207 197 28 131 222 -24 54 -299 172 9 89 242 -162
6954 -162 146 34 -234 -149 -384 -259 99 -113 269 -170 -198 132 -327 150 -61 -134 -29 333 -51 -288 -20
6975 -20 -157 185 138 -108 -308 75 -112 -48 70 -75 -93 213 46 11 -51 -343 65 -383 190 -232 -278 -36
6997 -36 -35 124 7 -61 -163 -8 -274 174 -202 402 -27 97 -177 248 196 -243 -99 93 -14 8 94 173 11
7020 11 -32 43 -97 12 -225 84 131 -98 -59 -214 -337 -25 -269 201 -78 116 26 36 -8 -277 85 216 55
7043 55 -333 -128 -161 -92 6 -103 -20 7 -162 60 43 75 -138 359 129 -274 -192 -287 177 -134 135 -40 146
7066 146 -88 -323 -138 -307 3 -79 219 27 -70 -13 -192 -24 -234 3 -5 101 -28 44 143 -157 176 -2
7088 -2 252 -45 265 -39 199 123 99 -163 -166 -42 120 -94 -211 -154 -44 90 -376 137 -96 -108 78 162 99
7111 99 263 -91 48 151 310 -40 -48 -55 46 -16 -103 85 284 249 32 -9 -280 284 -77 -190 52 64 -91
7134 -91 300 398 -1 30 -4 -112 -341 134 -199 -232 -151 -168 -115 -39 -26 40 304 311 -3 -30 287 -144 231 88 67
7159 67 -295 -211 -43 -62 331 141 399 75 -13 -187 299 11 -52 -26 61 50 206 39 -118 57 -48 174 -227
7182 -227 -122 51 103 334 105 -45 -296 -3 -76 26 17 98 194 -211 -72 32 39 -251 50 178 178 22 23 183
7206 183 147 210 -109 75 -2 -116 66 122 -68 66 -111 -199 150 -66 -297 28 232 -18 24 57 -41 17 271
7229 271 211 -48 -101 74 304 352 -115 77 -85 47 -255 -192 -79 -106 -26 -242 85 233 8 94 1 -269 78
7252 78 126 300 -154 -33 41 -236 -64 3 -251 142 296 -58 -41 90 -1 -383 66 -142 331 125 122 172 122
7275 122 246 150 -46 -29 203 141 153 144 -87 -97 393 -28 -76 -148 -26 157 157 -202 -26 173 112 -119 -160 265
7299 265 42 168 -27 -91 122 -117 108 -428 225 54 -31 386 -189 29 -247 95 -249 -221 26 -185 -66
7320 -66 5 -70 131 71 -32 41 135 -128 -208 324 -40 3 -363 -104 65 85 250 221 -24 220 -459 149 295
7343 295 178 124 -51 182 9 76 136 174 66 65 85 92 -27 170 -251 306 -39 -166 154 85 34 -84 264 -77
7367 -77 -176 45 -366 -122 -361 74 435 -227 389 -260 162 14 35 -18 -91 -104 87 -140 26 -29 -210 -154 -36
7390 -36 196 -183 232 -58 -147 291 103 -203 -76 -194 -258 157 131 375 -58 182 -294 -27 -15 223 51 81
7412 81 39 -193 -74 -194 212 -135 -75 44 -122 103 -185 -161 -435 92 -71 156 -118 124 -97 -111 -160 161
7434 161 13 -2 -324 -3 -26 71 154 210 68 167 -228 12 132 36 -29 50 -95 -291 -135 -82 -1 109 70 -129
7458 -129 -313 -48 321 160 364 42 -18 -163 180 -138 -61 -53 106 -42 124 136 -86 166 -128 242 -216 -143
7480 -143 91 19 -48 291 36 61 260 310 176 -424 -46 206 212 -34 36 -24 -123 94 191 -237 24 41 -75 -20
7504 -20 346 85 41 -119 -180 11 233 -23 124 -127 -207 46 -250 152 49 -36 182 -66 167 159 -312 -136
7526 -136 -88 142 45 32 -2 63 293 -165 -50 85 -200 52 107 102 -147 105 -67 22 -56 13 -187 106 268 -13
7550 -13 214 -247 -168 97 -31 185 47 -198 -105 -7 -186 32 97 -78 -47 148 38 -196 254 -274 38 33 31
7573 31 -296 -139 -60 10 153 -19 0 39 293 -10 -86 230 171 96 -303 245 58 111 246 -149 -224 33 -247
7596 -247 -77 85 176 -164 -9 -165 -372 322 -166 97 -158 228 225 -19 63 32 132 -135 68 23 -52 91
7618 91 52 92 -271 -173 88 62 -169 43 -20 252 -128 76 -139 54 -151 -24 17 -309 112 357 -166 181
7640 181 271 73 -149 110 -180 -58 -115 -60 44 -91 250 51 107 -31 -308 248 -41 -158 -252 111 25 -135
7662 -135 139 197 261 -241 -92 67 133 -222 1 285 -69 115 -51 -266 26 -38 17 124 41 68 -266 15
7684 15 6 184 273 102 -47 85 -25 -98 -49 85 102 -324 -89 0 -180 -198 138 151 -194 -265 123 -3 -51 -148
7708 -148 -164 -316 -53 448 50 -31 10 -166 -125 145 30 -137 -244 150 -164 7 9 -94 -72 -100 11 78 64
7731 64 95 37 -2 -87 51 365 423 -15 -112 203 -96 5 -15 -171 305 286 48 -288 -30 -8 -95 161 13 -336
7755 -336 -53 -114 -109 223 -139 -22 56 -194 -81 105 -282 46 -323 -143 61 130 168 -108 36 -54 14 -34 56
7778 56 5 105 -21 93 65 12 -20 -129 5 -143 39 266 218 287 203 -150 4 -62 -270 8 -141 135 225
7801 225 33 145 -86 210 -331 -339 31 -109 -23 -18 -187 -186 71 73 130 23 55 257 -99 -121 168 37 -83 254
7825 254 80 -67 -141 113 230 -94 -130 17 239 167 -76 86 174 10 204 89 170 253 4 100 -58 144
7847 144 180 -24 109 -130 -124 154 -6 -219 291 -375 -146 29 238 -214 144 -113 -175 -159 -373 -95 377 -81
7869 -81 70 229 99 -111 35 -22 131 -140 119 13 161 75 295 201 -109 129 66 -114 107 -43 181 422
7891 422 2 -114 148 80 83 3 -145 201 91 -39 -38 48 -169 -43 -94 -61 -171 131 -42 -87 148 172 -17 14
7915 14 -76 -91 357 -148 -228 26 79 -134 -217 156 155 -182 -233 37 82 -322 177 342 -211 64 -141 -18 -85 161
7939 161 -238 -60 -31 -45 -43 122 153 261 471 -292 19 -29 -207 163 -244 69 -16 108 -51 -65 -101 -78 42
7962 42 -3 -202 -344 -31 -197 369 -23 -10 57 88 -97 125 -72 -101 -42 157 -3 220 54 -219 -23 -226
7984 -226 -37 -395 -142 -135 -37 374 106 114 251 180 96 188 -8 136 -16 46 7 -185 27 89 314 236 -20 -133
8008 -133 24 54 -30 108 274 -203 -44 -116 -176 -18 75 -106 -138 -217 213 183 -113 147 -69 335 -6 56 -90
8031 -90 -49 -66 116 -122 28 29 -176 47 -177 7 196 228 186 -202 59 33 -86 -105 -149 22 -22 42 -131 -136 103
8056 103 -390 -159 -33 -37 385 -60 -118 -141 53 -103 229 -78 -217 -72 24 -417 49 202 208 43 325 213
8078 213 18 -24 178 -288 212 -313 27 -81 -454 156 -45 100 80 -69 140 -128 224 3 -167 -135 -100
8099 -100 -10 117 -46 12 103 141 20 63 227 -14 146 -84 -164 85 -37 -6 206 -107 249 67 -110 15
8121 15 -36 110 193 -173 322 122 125 234 109 -15 375 19 -98 -25 357 52 228 193 -128 -17 57 -137 -178
8144 -178 -116 188 91 -367 95 -130 105 140 -28 -7 -329 -93 135 150 151 33 85 -273 -224 -108 -11 182 -47
8167 -47 72 167 -50 296 189 15 -45 193 -26 -1 274 48 36 138 152 62 144 -1 13 -126 -176 96 314
8190 314 -59
8191e9
$$ Imaginary data points
##PAGE= N=2
##DATA TABLE= (X++(I..I)), XYDATA
0 0 0 0 0 0 0 0 0 -8 8 -8 16 -16 21 -24 32 -37 45 -55 64 -72 87 -101 114 -133 152 -174 198 -229 256 -292
30 -292 327 -367 412 -461 514 -571 636 -708 784 -872 962 -1066 1182 -1309 1450 -1607 1786
47 1786 -1990 2225 -2497 2819 -3205 3677 -4278 5064 -6137 7709 -10239 14989 -26997 121550
61 121550 155288 -155391 -149254 48322 159257 21388 -86428 -51992 53004 77300 33113
72 33113 -57287 -91315 -18366 95530 79027 -40062 -95351 -20198 50201 48449 13644 -16086
84 -16086 -43468 -17600 50087 58302 -20326 -48356 24110 63199 -1802 -44975 5449 43490
96 43490 6599 -10851 20909 10539 -45995 -32520 47504 61796 -13009 -58541 -27848 10963
108 10963 22300 21642 1718 -31382 -22311 27251 30541 -26662 -43011 18735 59624 20192 -33206
121 -33206 -35732 -2844 32966 50028 16446 -45067 -43625 30772 61168 -1857 -45933 -1193
133 -1193 38120 -1310 -36541 -1267 33203 5410 -24561 -7782 8721 -6325 -10913 9120
145 9120 10548 -8019 -8381 4737 377 -8340 5018 17493 2389 -14846 -7213 7957 11178 9517
159 9517 2076 -14851 -15666 12335 22886 -10233 -28014 8871 34056 -6924 -48698 -17045 35643
172 35643 25169 -21540 -28381 96 9297 -2875 -6314 -1743 -1601 1648 6396 -2890 -14874 -5019
186 -5019 16452 16081 -4868 -14520 -4752 7184 11258 5343 -7337 -9911 4805 12733 -5064 -18913
200 -18913 1444 21722 96 -30081 -13300 22975 16385 -19423 -23792 4161 14042 -3050 -12924
213 -12924 -3260 4289 3767 -22 -5812 -9848 -2404 10738 10249 -4515 -11350 -2337 7840 5791 -3527
228 -3527 -8451 -2335 9103 7694 -10370 -18203 1523 19454 2069 -24488 -14541 15808 15716 -13022
242 -13022 -21239 395 13548 -458 -13586 -5823 5698 5420 -1075 -5739 -5625 -155 7284 6909
256 6909 -2524 -7242 -397 7623 5466 -2967 -5536 2006 10110 5621 -8749 -11482 5955 17396
270 17396 1638 -18694 -9313 15832 15585 -10286 -18935 2075 16699 3180 -12697 -7550 7394
283 7394 9030 -1597 -7323 -3254 3094 5917 2485 -3038 -4615 882 6657 3071 -4460 -5878 2830
298 2830 10187 3448 -9446 -9796 5832 13664 -241 -15380 -6495 13441 11088 -10052 -15746 3795
312 3795 15576 2077 -13799 -7177 9113 9843 -3728 -9615 -2122 6161 4840 -1552 -4551 -994
326 -994 3329 3801 188 -3653 -2437 3542 7629 1748 -7175 -5369 6698 10681 -1103 -11426 -2570
341 -2570 12662 9187 -7910 -11849 4432 14513 2457 -11841 -5927 8936 9557 -3514 -9309
354 -9309 -270 8066 4333 -4257 -5416 714 4238 2190 -1874 -3952 -1783 3189 4742 -385 -5996
369 -5996 -3266 5257 6674 -2846 -8926 -632 10201 5334 -8318 -8726 4564 11174 -73 -10205
383 -10205 -3557 8839 7108 -5297 -8333 1027 7646 1773 -5604 -3716 2663 3375 -727 -2696 -855
398 -855 244 1257 1648 136 -3611 -2342 3006 5014 -1206 -6814 -1248 7423 5056 -5858 -7228
413 -7228 3773 9744 428 -8900 -3905 8061 6463 -4397 -7952 891 7255 1369 -5984 -3645
427 -3645 3336 4127 -1741 -3747 -1221 1737 1198 -777 -1390 -1872 -858 1356 1961 -1270 -4169 -1086
443 -1086 4118 2615 -4168 -5659 1671 6467 -131 -7325 -3455 5584 4645 -4052 -6429 1197 5586
458 5586 767 -4508 -2604 2419 2901 -659 -2611 -915 1458 1810 925 -996 -1591 -194 2330 1901
474 1901 -791 -2791 -261 3693 2621 -3123 -4405 2188 6346 285 -6933 -2838 6039 4653 -4212
489 -4212 -6044 1725 5412 -225 -4978 -1602 3085 2394 -1549 -2271 -371 1008 1119 -4 -1242 -944
505 -944 958 1590 363 -943 -1441 -565 1777 1949 -1809 -3936 -22 4816 912 -5891 -3853 4724
521 4724 4952 -3993 -6984 1073 5459 -87 -5776 -1603 3740 2136 -2407 -2081 393 1569 2021 434
537 434 -1391 -978 1853 2662 415 -1175 306 2249 1212 33 -79 -393 1365 3378 1203 -3814
553 -3814 -3415 3597 5376 -2356 -5961 136 5233 -483 -6120 -1212 5075 2311 -3541 -2953 911 1594
569 1594 778 584 -186 -1417 366 2166 218 -1926 181 2913 880 -2143 -1167 1056 1800 1719 268
586 268 -2107 -3029 1168 3752 -1115 -4727 579 4984 -660 -6175 -1469 5835 2499 -4255 -3192 2006
602 2006 2376 -778 -509 1338 774 35 492 412 -940 686 3243 1522 -2093 -1176 1621 1794 540
619 540 687 -239 -1791 -69 2506 575 -3009 -105 3590 -41 -5471 -1994 4974 3208 -3988 -3664
635 -3664 2033 2648 -1630 -1448 1766 1237 -1086 -907 60 -425 397 2494 1217 -2249 -1498 942 1077
652 1077 -257 51 975 -1165 -1755 828 1476 -1367 -769 2376 531 -4233 -2783 4097 3676 -2521 -3680
669 -3680 2058 1841 -2610 -2051 2922 2936 -1624 -1718 315 586 79 1867 1735 -843 -1818 208 1156 -735
687 -735 455 1720 -350 -2409 -473 1628 -140 -1370 1830 2026 -2939 -3902 2219 4113 -1337 -3210
703 -3210 1535 1994 -2298 -3042 2155 3676 -910 -2438 -22 321 -1527 337 2160 403 -2779 -1073
719 -1073 264 -804 -517 1541 795 -2581 -1569 1445 22 -1876 716 2601 -1207 -4015 335 3869
735 3869 68 -3080 701 2922 -1244 -3523 1178 3789 -27 -2290 515 1263 -1235 -684 2587 1633
751 1633 -2014 -1550 1077 36 -1205 792 1755 -672 -2185 223 839 -1513 -39 2158 -44 -3146
767 -3146 -1391 2984 1119 -2784 -420 2928 133 -3555 -367 3854 1178 -2223 -944 1641 -361
782 -361 -1385 1408 2403 -620 -2021 -127 409 -815 -32 1749 204 -2055 -1590 525 119 -98 1461
799 1461 1025 -2528 -1820 1296 1331 -1547 -598 2855 1162 -3482 -1847 2902 2504 -1525 -1466 1130 353
816 353 -1839 111 2181 1229 -776 -678 -55 -662 -352 1504 1089 -462 -1143 -118 -212 -488 724 1196
834 1196 -757 -1268 184 525 -1208 -772 2442 1598 -1778 -2075 1442 1991 -747 -1074 943 1073 -1241
851 -1241 -1785 1125 1459 -191 -861 -65 -440 -349 351 640 -240 -266 241 -131 -883 200 1067 -8 -888
870 -888 -130 608 -745 -797 1138 1595 -567 -1675 825 1652 -422 -1068 945 1224 -808 -1346 594 1595
888 1595 -69 -807 -119 449 -310 37 347 7 119 395 -339 -617 363 1140 -91 -915 -172 662 -47
907 -47 -984 470 916 -368 -1392 347 809 -835 -975 950 1128 -913 -1696 239 925 -437 -689 27
925 27 549 -11 -325 341 716 610 70 -478 -349 33 898 -412 -782 195 615 -386 -1185 384 1088 -3
945 -3 -866 178 595 -233 -970 324 1083 -356 -1175 -269 1073 52 -694 120 1031 -4 -658 -233 712
964 712 211 -159 -374 60 336 163 -28 -476 321 743 118 -904 -20 785 635 -950 -564 812 -101
983 -101 -734 -175 923 498 -764 -323 270 265 -71 -346 244 -66 -289 -97 428 118 -496 -383 323 448
1003 448 80 -188 -247 201 346 -37 -613 260 1035 133 -562 -88 580 385 -962 -485 766 720 -429 -575
1023 -575 581 433 -147 -452 245 306 132 -445 226 482 -180 -298 37 413 185 -307 -477 50 381 -347
1043 -347 -280 253 93 -418 -424 22 588 195 -464 -216 692 871 -418 -565 448 829 -111 -663 -79 671
1063 671 112 -421 -382 435 353 -593 -314 110 507 -25 -291 117 -36 -313 -26 213 118 -88 -243 415 439
1084 439 -120 -831 -269 529 326 -374 -540 621 545 -247 -428 -180 886 317 -133 -303 394 430 -463 -126
1104 -126 402 541 75 -390 79 416 196 -510 -108 189 -145 -625 -66 113 46 -224 -66 424 -97 -407
1124 -407 -338 -100 789 -322 -672 170 694 119 -217 -139 478 602 -425 -281 89 573 149 -594 -55 655
1144 655 34 -328 -26 120 230 -79 -435 91 292 -213 -325 7 433 -283 -474 198 475 359 -453 362
1164 362 454 -23 -406 -125 833 294 -361 -272 145 287 -21 -168 -63 159 -132 -92 65 67 107 -75 -380 -33
1186 -33 155 328 -284 -332 381 102 -320 -303 279 371 -326 -204 431 -86 -583 -468 282 138 -516 -533 317 395
1208 395 -142 -118 473 170 -286 69 -291 294 223 381 -190 -102 -41 328 -222 -242 411 239 -305 -508 288 354
1230 354 -418 -260 108 747 -294 -531 438 746 -356 -539 285 337 -420 -262 623 383 -221 -372 -72 27
1250 27 36 142 202 -245 -136 76 89 -252 618 533 -499 -722 -95 738 -378 -813 577 688 -551 -812 79
1271 79 852 -40 -332 217 221 -535 -283 438 337 -262 -453 -201 -175 -253 273 682 -188 -709 -168 356 -432 -76
1293 -76 533 69 -690 -62 394 175 96 372 512 -128 -1148 -35 1158 378 -844 -152 425 -327 -521
1312 -521 152 656 327 -139 -300 -131 -500 151 649 76 -387 -332 260 -463 -205 178 479 -33 -613 361
1332 361 168 -333 486 852 251 -684 -139 690 -47 -403 270 434 -203 -899 -260 741 292 -599 -304 81
1352 81 -88 -507 515 586 -232 471 306 -42 -473 529 637 85 -160 -121 489 -370 -56 682 116 -337
1372 -337 -152 656 267 -660 134 711 -336 -1006 -253 626 33 -316 -351 571 -97 -657 41 258 -230 136
1392 136 -164 -200 -384 -66 725 143 -637 178 42 -494 -561 504 332 -214 -708 -102 280 -671 -219 753
1412 753 167 -911 -241 662 886 -786 -186 446 197 -694 -260 488 310 -487 -198 60 -384 -151 583
1431 583 -41 -468 -196 459 -215 -494 178 819 -297 -910 16 265 -150 -444 506 622 -785 -671 299
1450 299 918 -517 -471 648 64 -718 -487 381 456 -138 -249 234 -316 -493 -64 117 -93 -144 202 133 -729
1471 -729 -253 657 123 -1138 -115 307 -239 -695 9 496 -278 -786 122 579 -133 -244 280 665 -294
1490 -294 -392 170 513 126 -593 302 127 -96 -187 511 356 -245 -115 362 -131 -267 556 625 -354 -414 308
1511 308 -42 -177 -126 605 230 -625 -487 492 359 -542 -104 568 -93 -412 -106 328 103 -175 420 63
1531 63 -96 -347 288 211 -30 113 23 -356 -291 -104 175 -137 -107 186 4 -120 -172 323 257 -669 -548 534
1553 534 348 -290 -121 514 133 -256 -14 409 216 -189 53 248 120 -3 -210 -3 206 115 297 294 -285
1574 -285 336 239 195 -51 -466 -172 -113 -49 386 130 -84 -39 407 -118 -199 -71 431 111 -402 -452 44 227
1596 227 -264 -103 295 501 87 -200 243 -62 83 -41 -277 102 -82 175 85 -23 176 82 -37 -205 -74
1617 -74 158 -357 -88 309 350 85 -84 149 308 -204 -24 275 -43 -236 -408 94 76 83 -80 -625 496
1638 496 0 175 9 -124 -177 139 -167 -96 51 -49 44 150 -1 -94 -224 -353 21 -102 -226 -23 -33 97
1660 97 -153 4 167 160 -170 -215 -193 43 -83 -387 -18 -195 416 -469 -81 401 -98 96 -387 -125 -61 214
1682 214 449 -321 -371 41 74 -126 155 235 -6 -514 180 187 -89 35 39 113 -94 -114 86 204 131 -354 -437 -154
1706 -154 240 -64 -192 89 -176 -164 1 -43 344 217 -374 -144 -177 313 45 -177 61 275 -22 -158 -312
1727 -312 481 152 -136 -94 -13 314 -233 187 99 -199 -225 255 15 10 -216 -22 171 297 -84 -94 152 180 -234
1750 -234 -142 231 -155 368 -5 -147 -93 361 99 32 -115 80 159 1 -154 -89 490 -188 -238 220 -104 -44
1772 -44 -315 -217 -29 3 -162 -1 220 -138 31 -68 164 -154 -149 -333 21 -11 -74 311 -129 99 -26 -85 -142
1795 -142 259 166 -182 -83 395 79 50 40 -64 153 239 -432 -93 89 -174 -130 68 -50 -323 -287 44 12 204
1818 204 -2 -61 20 -43 -128 130 100 -219 -47 -22 -152 184 62 -192 99 274 227 68 73 276 269 86 -372 181
1842 181 92 91 -85 -3 -47 -186 -26 -112 176 105 114 -99 -206 -91 -61 -116 -331 -7 179 114 -126 162 -71 -250
1866 -250 -132 96 8 -14 -242 -23 215 290 -545 55 340 -58 -210 -75 300 227 -185 -52 -43 -73 -158 -49 -13
1889 -13 -269 179 -195 0 -180 15 -76 -70 17 78 76 -139 -389 91 243 -148 -25 -88 -40 -330 -188 236 182 -175
1913 -175 130 -140 -119 -40 172 210 109 -72 103 -35 -44 -151 -263 -196 -236 -211 -198 76 272 74 203 -11 -426
1936 -426 278 128 -268 -138 176 250 -191 -340 55 125 -278 -83 200 20 -535 157 350 -113 -121 -71 -21 -252
1958 -252 -373 152 271 83 132 -34 -55 -47 -74 127 -87 -341 16 457 15 -437 344 -46 79 34 146 51
1980 51 -196 -318 75 137 1 -115 472 264 -267 -332 277 99 39 -334 412 -48 -162 -77 -86 -340 -149 79
2002 79 -279 -62 5 309 92 -76 -158 200 25 -68 1 72 -38 -186 63 309 -278 -198 29 239 40 -172
2024 -172 310 275 101 -71 -186 122 -87 -292 85 23 -35 142 537 54 -127 130 -166 -133 445 106 58 90
2046 90 132 -107 146 162 563 510 -93 152 -146 166 -233 -376 -155 68 -151 -172 -286 314 340 55 -433 -12
2068 -12 -101 69 128 -218 -141 34 106 -49 -84 184 161 219 17 -188 -118 -124 330 -12 -45 -196 72 8 -25 -270 259
2093 259 57 -22 -512 -207 159 376 -143 -240 -82 -103 -196 79 -143 -94 129 -177 -100 -46 239 147 282 13 169
2116 169 -15 -400 -32 91 37 22 -160 199 -46 -328 37 374 61 -185 -213 129 -69 62 72 -182 -245 100
2138 100 -108 198 -170 107 406 -347 -273 -2 478 92 -228 -111 -160 -114 -18 0 -454 -213 153 25 -381 -143
2160 -143 82 64 -67 -119 79 443 171 -232 74 54 39 -122 88 -68 -154 117 116 -270 -6 108 -164 -166 -383
2183 -383 -240 248 -92 -33 -226 -65 141 -213 17 -64 -149 311 349 -49 -334 -12 -9 251 -93 -104 182 -86
2205 -86 -26 -321 -202 323 -82 212 25 -338 -151 201 290 -144 147 30 53 -361 -340 37 -124 421 -20 144
2227 144 -152 8 234 -47 -454 -49 -52 247 -4 -263 -126 178 -222 -163 -129 381 -36 -68 -146 -287 -87 100
2249 100 277 10 239 488 -86 -235 -307 229 -60 41 -289 23 -136 139 221 58 -37 -272 152 -13 18
2270 18 -115 -43 453 42 -175 -175 6 -55 4 20 -125 45 28 -337 205 -129 260 42 172 25 -199 258 197
2293 197 194 -116 68 202 42 166 108 3 26 -40 31 21 -173 469 28 -310 -237 158 -65 104 -171 307 -276
2316 -276 38 -44 -190 4 3 -129 -378 -12 67 147 -89 -268 -123 66 310 -274 40 -136 -329 252 263 348
2338 348 65 101 -66 144 -341 -331 530 31 -176 -241 108 110 -96 -69 -93 -179 225 156 61 -193 -282 -22 -200 -50
2362 -50 42 -15 169 71 -15 -191 67 233 -158 -42 -318 183 356 -63 -417 146 232 72 46 -31 16 341 -156
2385 -156 -257 -469 -100 16 -128 -52 39 196 133 -216 -284 -278 -34 69 -290 -261 -87 187 424 -113 -430 -42
2407 -42 60 389 24 152 119 112 194 -292 -237 -100 -92 161 -129 -451 112 62 260 36 -249 -114 -152 98 -119
2430 -119 -145 -193 165 -12 -324 23 11 -216 -264 -417 -89 -100 -38 -121 -397 151 27 -1 -77 -264 -49 341 11
2453 11 -204 -438 12 390 22 61 -120 125 -46 179 -137 109 288 306 203 -123 -362 -74 113 120 -5 147
2475 147 213 170 55 -299 63 58 76 -113 161 -91 37 58 13 -96 214 283 -96 -169 121 412 -83 216 48
2498 48 -2 33 138 -47 -173 27 -153 4 -222 -119 -256 -34 163 -109 -54 48 65 -192 64 72 12 368 -64
2521 -64 -116 68 158 202 334 146 -148 241 -146 -272 -290 112 -87 480 230 -151 49 45 -80 41 -27 264 312
2544 312 86 122 -262 143 52 -123 -174 -13 -64 262 62 -267 179 30 248 34 -17 196 200 -54 -433 122
2566 122 128 73 98 -212 -348 83 -80 -22 -217 -219 -161 241 -50 41 -274 -37 28 185 -83 -69 -130 344 -200 198
2590 198 -247 21 197 5 -168 -135 188 -101 -213 52 -169 -97 -55 -69 155 57 125 249 114 -270 137 328
2612 328 -135 -164 60 292 25 67 148 -241 -87 92 285 -51 -57 4 194 -228 -417 -40 -5 496 111 39 47
2635 47 -8 -218 -74 -58 -274 116 -4 -115 -153 122 395 -172 -323 -157 79 399 -276 48 69 188 -216 349
2657 349 -51 -92 89 -137 30 -325 272 354 113 -105 -122 24 -119 122 16 -17 209 120 171 -96 24 42
2679 42 -144 -44 -242 223 -86 296 -73 -100 277 70 -3 270 143 -34 114 -210 -90 10 -41 214 221 -51
2701 -51 43 216 253 -357 100 -152 167 6 -58 -136 -5 91 192 -14 -281 324 321 59 -210 -206 -75 221 -106
2724 -106 -70 -22 -13 272 85 90 67 -34 276 215 14 -154 -80 10 -179 108 -102 248 -145 24 97 -57 74 267
2748 267 -280 -224 -109 -325 -62 -296 -19 -34 -6 -324 -311 188 -199 -19 -72 -11 15 166 126 -143 -491 -48 103
2771 103 236 -148 -97 -74 78 -27 54 62 -261 -131 -21 -81 -289 -37 -19 22 115 10 -111 -7 177 -37 312
2794 312 -112 -65 7 -139 -265 212 54 149 -141 -160 289 127 -81 291 -35 -152 126 12 -185 -73 303
2815 303 271 48 189 168 193 76 -49 -57 -41 39 -105 147 -17 -43 -235 117 -47 37 -235 22 -364 -75 -253
2838 -253 156 99 -22 -56 -230 274 264 -1 -14 -190 -37 8 -186 -141 315 16 120 -24 -132 -53 232 27
2860 27 170 333 486 -34 177 35 273 135 173 17 -10 88 154 463 -105 -9 -260 -100 -189 -23 -90 -41 188
2883 188 -90 63 -17 -189 -90 23 297 -207 -217 -259 13 -28 50 425 -136 71 110 71 100 -50 -347 202 206 414
2907 414 -7 -21 -153 85 179 -159 -42 -73 -140 111 -42 22 258 -186 237 -325 -67 -142 -190 202 -529 42
2929 42 -232 2 76 54 -104 -58 6 173 -181 -28 -97 165 150 -137 -210 31 -392 -84 -160 -126 110 309 -59
2952 -59 -346 -149 106 386 -174 64 109 148 -282 186 -165 89 -198 -59 1 -130 96 233 122 -71 110
2973 110 22 45 -189 -120 -20 42 -18 -198 117 54 119 352 49 56 14 -3 270 63 -229 118 154 244 56 -2 -28
2998 -28 -206 268 -182 223 243 -94 85 103 -103 -58 290 191 154 -61 -351 241 -204 -293 87 -261 -268 45 -310
3021 -310 260 94 -219 -113 34 -199 -121 -20 -129 -124 237 -108 -384 -32 151 221 71 198 -31 344 -199
3042 -199 -25 -98 231 13 -31 80 -229 -117 -26 11 308 120 171 356 11 233 -213 -204 -44 -53 -75 -154 -181 -8
3066 -8 -59 -185 108 241 -335 134 21 31 -192 -64 -240 -427 125 136 11 60 47 -79 106 142 -26 -44 -87
3089 -87 -35 -130 369 54 -47 217 -236 192 17 -92 226 406 -204 7 -232 195 67 264 -322 -67 -12
3110 -12 284 -30 114 72 11 95 -139 234 8 -6 -3 -160 -22 167 278 90 99 -236 -102 -303 309 -57 93
3133 93 333 -69 -53 180 -113 42 381 37 -2 198 105 34 115 -88 -224 132 35 -287 307 -115 304 -184
3155 -184 -148 100 80 -40 -128 12 -35 185 224 -103 -297 -15 -89 -61 360 45 -9 -142 -20 -217 212 17 137
3178 137 -38 -42 134 -48 86 -211 182 171 202 160 26 -191 -52 291 -175 118 100 -117 186 282 119 84 34
3201 34 60 233 -186 -97 -11 90 -61 -163 285 230 188 47 -249 5 7 114 -236 -93 14 62 127 -23 222
3224 222 -61 -306 39 273 -108 67 93 36 -40 -35 -114 -38 -280 -72 -174 -201 -82 -65 -119 90 199 26 138
3247 138 -147 -17 241 -177 -33 -380 76 76 26 445 239 6 17 -130 -389 22 -61 -354 -114 19 97 83
3269 83 118 415 174 -169 -44 14 82 374 -117 194 -303 -17 99 -150 -30 19 -147 -16 -119 -58 -70 -199
3291 -199 -58 62 108 191 31 158 -325 -129 -319 31 -184 -123 43 -59 144 161 2 245 -127 160 -54
3312 -54 202 144 -382 -68 -112 -46 -160 -65 -163 176 -209 185 -40 117 -18 139 134 145 119 -75 95 17 -101 -64
3336 -64 280 -113 -61 241 46 -147 -43 239 248 57 -198 -261 -5 -77 -18 -75 -64 -195 6 -3 128 182 96 73 22
3361 22 -81 -91 29 -9 112 55 -85 57 166 -313 -54 34 194 -97 -111 -54 -168 133 230 170 15 118 -11
3384 -11 -11 65 27 -21 153 -245 103 -128 -37 -102 2 213 -231 -55 -47 -87 0 -86 15 46 -237 -100 -41 165 27
3409 27 -188 308 30 -15 232 -132 81 364 -226 -47 -50 -8 -226 -56 195 -124 -92 92 50 194 158 153 117 1
3433 1 -343 -8 162 -161 -19 283 94 78 -147 335 -159 15 204 -297 -38 -156 -89 -159 267 -70 -110 -76
3455 -76 67 353 29 -17 -89 -218 -187 126 184 -2 32 50 66 -154 -121 -131 -96 -52 -64 -209 -362 -128 94 266
3479 266 -36 -157 -35 48 -90 271 39 -244 132 35 -73 -104 53 240 217 13 36 -12 -62 104 54 -128 -74
3502 -74 226 -104 171 -353 163 -227 -206 -144 -255 189 -211 32 -47 56 16 83 -122 -54 151 -257 -89 -385
3524 -385 -22 10 -325 -11 -32 125 -110 13 310 -59 -175 -335 -34 10 -117 132 61 208 -10 36 443 -54
3546 -54 -177 -109 -23 -112 -42 91 234 76 -131 -111 -113 142 41 -77 178 75 -42 68 -3 -104 0 -12 -90 91
3570 91 -6 2 127 -216 63 -10 -164 -20 122 36 -150 189 330 -129 158 -134 41 3 -124 298 125 6
3592 6 196 -67 -216 107 219 25 -29 15 52 -8 -196 -155 210 -33 -7 -115 227 35 27 -121 -249 66 183
3615 183 -141 -277 133 -270 -102 -49 80 139 179 74 -124 -54 61 83 47 -168 -43 14 -108 -116 -126 -158 69 -56
3639 -56 103 -178 161 -168 -373 30 16 313 308 -122 -165 80 -47 -45 -34 45 -132 26 -98 227 -103 9 -107
3662 -107 279 -75 -100 -246 162 128 27 -67 100 108 -90 -73 -57 -165 72 -6 -8 30 -215 110 -354 -293 -5 182
3686 182 -60 -208 186 -19 -155 38 -158 109 -229 52 -157 -316 -92 -164 205 147 -266 159 -186 -158 -142
3707 -142 -298 188 10 -271 -95 232 -159 120 224 350 30 -154 -333 219 -25 7 122 -235 18 -23 26
3728 26 -90 -150 -135 281 -153 -28 -91 -184 101 -47 26 -86 -201 -116 -95 -84 -38 -107 196 -241 -62 50 197 135
3752 135 -71 -4 57 -54 -141 4 -416 174 147 -474 294 142 -372 267 192 67 -163 -8 252 35 -67 -175
3774 -175 139 34 -119 -268 52 -99 -257 53 -9 55 86 -86 45 1 37 -176 10 -12 92 -45 -69 -90 83
3797 83 -172 326 -131 435 103 151 361 -109 203 17 -142 -115 55 -256 165 171 27 -76 -27 192 -48 122
3819 122 -67 5 -181 7 35 90 -210 -33 -113 -114 90 -179 -75 -162 110 -113 -115 74 -166 -167 -48 -49 -213 153
3843 153 -55 -157 113 32 -166 9 -168 22 -57 77 -183 14 127 -187 219 -105 260 -48 51 130 -404
3864 -404 -68 54 -113 -10 7 270 200 108 63 -206 109 -142 385 -40 108 -3 2 -92 266 -108 218 26
3886 26 -170 -21 -105 191 -157 -65 -101 19 162 107 -194 -224 -128 -276 29 -34 -341 -199 85 135 -260 -14 -187
3909 -187 207 128 -68 176 -373 -35 10 190 47 -113 194 23 -106 -363 204 175 259 133 62 24 73 4 383
3932 383 -55 -19 275 166 -114 110 -241 86 -38 -4 326 -118 253 -185 -203 58 -7 24 88 -103 -169 -144 -104
3955 -104 134 -91 226 -43 33 -92 -107 24 37 -135 30 83 161 57 152 -215 165 29 -21 -67 -55 164 362
3978 362 -106 -169 -86 -172 11 21 28 -210 158 -206 38 -190 -320 48 -74 -29 -75 -230 -4 237 -10 -87 -49
4001 -49 -341 92 155 -344 -171 -13 -91 122 -385 81 -28 -50 -159 -55 263 -326 -18 -48 85 21 -234 -216
4023 -216 -64 -42 16 36 16 199 -60 -306 2 -101 62 -21 131 94 111 82 -66 -259 15 -159 -331 299 -46
4046 -46 -17 -52 1 -160 73 -27 -136 -153 -443 83 98 -108 44 311 -34 176 28 -113 -242 100 -269 61
4068 61 50 80 -34 -352 -15 194 174 6 -7 30 -61 33 292 -70 -176 -134 94 -190 -29 144 1 -2 -124 93
4092 93 18 -26 219 -327 260 179 83 -42 -49 108 -235 167 299 -72 439 -218 -125 -190 -174 370 -190 -411 -274
4115 -274 151 228 34 144 -188 74 -84 -430 248 153 66 256 -9 -133 -352 110 -223 -89 232 -31 -92
4136 -92 -13 -39 -44 -19 -47 318 -86 101 25 -207 117 132 111 167 -60 24 20 -150 104 10 19 -284 -26 -119 -106 -24 -55
4163 -55 -105 6 48 -91 -157 -31 52 -420 -114 -82 63 -14 -25 -180 -187 -70 -87 105 -187 62 122 76 27 -75 -317
4188 -317 14 -102 -176 88 218 -128 -120 -113 12 -138 2 93 21 2 -160 152 -153 -282 -56 -31 300 80 -91
4211 -91 184 81 -9 -79 208 -136 -194 -254 37 146 -59 176 -105 -4 -185 47 264 -96 66 265 370 -37
4233 -37 -208 12 86 -4 185 -335 129 119 -172 148 63 -64 -109 -100 148 -210 -204 -67 -95 1 -278 199 86 194
4257 194 114 80 -306 -170 -141 -2 25 169 58 -158 -38 -135 -55 69 -51 -44 173 -315 -55 -35 -265 13 31
4280 31 280 -14 -291 -10 -209 44 -46 -90 30 104 -44 -52 344 27 0 30 -68 -5 74 -108 -43 2 -205 -42
4304 -42 -20 -168 -215 -21 -154 139 134 58 -53 -19 187 -327 1 -39 -214 -50 4 -32 -41 -264 -11 -216 -117 197
4328 197 152 241 -35 -172 200 203 -160 48 71 -67 64 -308 -194 -94 66 40 211 -235 -83 57 63 -273 6
4351 6 -387 243 241 74 26 86 180 -190 2 118 -122 -100 161 -243 146 -80 84 -177 -108 -43 47 -40 118 -13
4375 -13 -189 246 195 254 -43 77 -118 -224 94 292 -138 107 -308 26 -20 -154 185 204 56 89 32 -49 141
4398 141 89 -52 66 -62 -154 -127 220 -339 -228 11 160 -17 230 494 164 94 -140 205 65 -55 149
4419 149 -14 -180 157 -384 -45 -19 -133 235 92 114 -169 -132 -184 59 -348 315 103 -57 -33 51 -332 -261
4441 -261 -197 289 -99 123 77 -156 163 -191 -96 171 -255 -44 8 418 -185 343 8 200 257 113 147 -43
4463 -43 -45 -57 38 -60 307 -228 -184 -98 -25 -129 -19 33 -72 -37 -253 108 122 344 35 -156 -197 -153 -66 -19 553
4488 553 378 -135 36 -225 212 -204 -229 10 -13 -212 127 -102 -325 135 -202 366 55 157 302 -36 24
4509 24 -129 38 86 211 -41 -83 57 315 560 -94 -367 -234 19 -53 34 24 -183 -39 -96 -15 -160 -180 129
4532 129 211 391 17 -184 176 -164 15 203 -141 79 -53 97 62 -190 -206 -45 -87 -84 -139 -24 -136 -73 -264
4555 -264 -258 138 -221 94 255 -26 62 127 -271 60 -484 6 218 145 -223 214 16 -14 234 150 -68 -368
4577 -368 -32 -55 78 24 -47 139 -31 -137 -36 -256 -140 257 -298 -244 -100 425 293 -94 -43 43 256 97
4599 97 -207 -219 -84 213 -206 95 51 4 -84 -400 -68 -4 -93 -303 63 -154 -172 17 57 107 43 -112 202 47
4623 47 18 -104 -112 207 -110 111 -194 65 92 -209 -56 -80 -27 57 -125 -102 21 -155 270 68 -212 -49 136
4646 136 -149 -207 18 182 145 38 -158 -195 -214 12 95 168 -197 331 205 168 -168 -171 8 85 167 11 157 380
4670 380 139 -92 -150 -112 133 23 -65 -159 -41 144 -275 -77 -130 -137 32 335 64 -266 -76 -134 166 -1 -62
4693 -62 -116 -56 -19 -43 142 -64 152 154 249 81 314 159 -125 99 -150 18 39 -255 -132 233 166 -170 82
4716 82 -2 -124 -32 -44 -94 124 330 261 -142 36 -69 -172 -227 31 -74 306 64 -114 22 -81 -72 126 211
4739 211 356 51 -137 -273 99 -269 34 -104 -121 128 -194 117 296 -123 -82 27 134 -264 30 -11 -88
4760 -88 166 -88 -115 -54 57 -134 290 -124 103 -78 166 135 -7 -4 4 -95 -126 237 -57 -54 51 -87 -241 -65
4784 -65 -160 -102 78 135 42 265 -34 187 5 -201 157 146 -101 333 37 163 -232 295 -99 -19 -163 55
4806 55 -2 25 -21 303 185 -89 150 18 -200 163 146 177 187 -393 -281 -15 60 127 679 28 41 4 -15 -210
4830 -210 -74 -27 5 247 -56 26 317 -79 -12 57 178 109 251 115 -169 38 -216 38 -166 115 -225 -36
4852 -36 -145 -105 19 -233 -132 -79 -24 181 81 186 -51 -163 -27 -229 19 44 -53 -314 354 367 184 -8
4874 -8 -148 7 143 145 -31 108 126 -58 25 -117 182 -136 472 178 -76 -59 8 265 52 -73 -219 192 -122
4897 -122 -137 55 92 179 225 -146 51 -12 -35 -68 68 160 32 128 -289 63 -185 151 192 175 42 207 -94 70
4921 70 22 -60 163 -177 131 -212 69 8 -10 9 -53 221 -129 181 85 30 96 69 -244 30 -25 -51 158 -61
4945 -61 -365 -47 122 192 276 -201 54 -16 6 96 -280 306 -204 5 -119 99 -64 -364 139 -50 48 33 118
4968 118 61 -79 131 -137 -203 -98 130 -159 208 221 278 10 -7 50 -69 165 29 81 195 148 -94 20 -257
4991 -257 -35 2 179 368 -221 -314 -105 116 43 153 71 -207 53 -35 -42 -34 -155 16 227 184 15 71 -109 40
5015 40 134 -114 -10 -148 -119 53 -135 -91 -19 -117 20 199 -25 -352 -185 163 -139 308 122 -17 -31 -28 91
5038 91 -281 312 -9 -392 -182 71 -121 109 -37 -182 -381 58 -78 -197 136 -5 188 -137 63 -267
5058 -267 199 25 -98 -87 243 -338 45 257 -144 -18 -53 161 49 -154 14 194 17 68 -14 67 180 -13
5080 -13 98 77 -163 -144 -125 -181 -11 -22 31 164 -22 144 -319 -27 -231 107 106 -77 72 430 -54 -460 139
5103 139 147 266 -273 -221 -39 -52 75 55 -126 23 -200 14 -328 147 -24 7 -131 -244 -252 -125 132 43 139
5126 139 3 179 241 -55 -30 -30 268 -97 -353 -212 -28 -27 -49 -157 -144 -31 -44 65 181 -211 -176 37 -188
5149 -188 93 -83 -134 -95 -252 -108 183 57 -244 -111 337 -135 -124 -117 -68 -9 -147 -450 -51 -69 138 24 -106
5172 -106 145 -302 67 -278 -205 320 32 19 227 -85 115 -124 20 -112 33 80 273 181 -201 -55 109
5193 109 -201 11 234 -52 136 -123 66 -200 63 62 -21 68 172 -169 -392 -1 7 4 -72 -303 17 218 46
5216 46 -83 -195 -181 29 -106 -31 -145 67 211 23 26 24 -165 128 -127 -32 -69 -249 190 -87 -58 -14 -158 -47
5240 -47 -130 -156 -44 236 130 4 72 90 85 -231 119 32 4 20 34 149 155 80 -166 -388 300 -169 206 275 26
5265 26 196 -216 154 262 -111 215 76 191 39 -39 70 110 252 -361 253 170 -69 167 21 -236 7
5286 7 251 -43 216 219 68 -16 -35 -315 132 213 53 -354 214 -133 229 106 -27 183 -246 -35 461 31
5308 31 35 48 -238 -92 -51 186 -50 106 -28 42 5 58 -165 11 47 -251 143 -57 -122 -37 490 -90 -313 -190
5332 -190 -17 272 205 338 -225 176 -331 -6 98 -175 267 -123 1 49 162 102 -276 10 -37 -44 102 158
5354 158 -37 -35 -69 156 213 266 43 -263 -54 -28 -237 -217 171 -109 66 123 188 -61 260 284 69 72 291 62
5378 62 339 220 -36 132 74 -45 -190 -122 323 0 -119 -373 -42 -428 21 65 101 -172 151 283 -223 127
5400 127 89 80 -51 -407 37 7 -122 143 297 343 -27 -47 -54 155 154 -253 -37 143 254 163 25 65 -166 -47
5424 -47 -89 -17 -178 -188 -327 -72 -69 -108 136 219 40 218 179 18 -18 115 -188 36 131 -59 176 212 169 -381
5448 -381 -33 22 153 -57 95 121 -225 9 43 114 58 -170 128 -168 -185 99 -140 -228 -126 16 -7 -159 75
5471 75 106 118 101 59 -2 33 -396 124 118 279 -229 -329 -5 -165 148 -217 -1 109 54 49 -41 39 209 178 225
5496 225 -27 -123 256 -240 -86 -189 50 -116 96 -445 109 125 -157 137 -108 -171 -325 -319 -168 122 115 141 259
5519 259 -132 -173 -347 -143 258 -150 -299 -111 96 156 -443 130 167 -256 -14 -39 205 79 62 -123 -127 18
5541 18 -49 18 -141 -55 266 377 -1 87 -103 129 -35 -93 138 -339 85 -27 -197 95 -22 -131 -94 167
5563 167 -45 190 131 -90 -62 88 64 78 -105 -31 -108 184 -37 114 22 -73 8 128 -187 -171 204 -28 -308
5586 -308 51 215 97 -200 -109 -108 13 182 -214 43 -96 -52 -390 56 151 11 -123 187 65 35 87 141 49
5609 49 -116 74 -102 -70 -129 208 -188 35 187 137 -21 284 55 -155 -67 92 106 65 -126 -232 -117 158
5631 158 145 208 155 -57 -116 -231 126 251 -285 82 -361 -161 77 3 -42 -115 -203 252 37 -124 309 -262 -12
5654 -12 -66 151 -101 -28 160 -228 -377 -205 -47 -118 69 -171 52 -169 -88 -229 -1 -68 204 -138 -262 177
5676 177 169 24 -11 34 -385 -221 138 -13 18 211 -138 101 355 186 74 -299 -84 140 44 136 -35 -119 -93
5699 -93 -170 -88 -155 -11 16 -250 20 -178 -295 -92 166 138 -98 441 364 -68 -145 -16 -150 -217 11 51 108 -121
5723 -121 -258 -123 -56 285 20 162 77 -354 -311 -231 -240 214 94 209 19 -37 273 -173 -134 -280 30 -141 -122
5746 -122 -60 -182 40 25 -294 -214 -363 76 -154 154 -26 160 18 -48 -158 -149 32 142 -138 -210 -4 -85 169
5769 169 -113 -47 -49 77 -3 172 27 -163 68 -209 135 184 58 226 79 -249 -306 -59 61 -75 109 -37
5791 -37 -52 -118 -267 4 -52 8 58 4 106 190 -68 68 88 144 130 160 329 157 183 144 -386 70 -77 22 258
5816 258 59 -113 273 -205 80 11 -197 207 -351 -246 -62 89 -300 -2 -442 69 -185 83 -10 -117 -9
5837 -9 -173 -234 237 180 -204 3 -149 -71 -139 -49 -5 -391 -217 144 -233 275 -87 -208 -125 14 168 122 -75
5860 -75 80 184 -83 -40 81 -116 125 134 -68 -151 -295 122 -11 -147 -298 151 83 -201 137 -27 98 -127
5882 -127 14 -186 -163 -120 165 -22 131 -42 -75 -439 -34 -115 218 4 109 160 -227 -67 241 176 6 149
5904 149 -96 2 -88 -83 9 119 27 -333 -58 -110 -39 -200 -46 42 -61 -14 220 63 -111 -83 13 145 -45 117
5928 117 91 344 -13 259 55 -67 -215 349 222 13 -141 85 -9 -18 33 42 9 2 195 74 -260 -7 -123
5951 -123 -69 53 -17 -222 95 -93 -46 -263 -78 -95 -138 -87 -399 -108 127 -82 155 -79 -232 118 101 -281
5973 -281 98 -461 263 -385 -66 199 -50 68 -113 0 142 -15 -101 -5 272 350 -333 -141 59 180 56
5994 56 94 -186 -70 146 233 -172 48 188 -82 -77 169 107 -88 35 36 81 -14 107 -35 95 -221 -147 -100 327
6018 327 -153 20 -166 60 -272 92 240 -83 91 21 -60 123 -184 -26 103 238 -81 -103 -14 -223 290
6039 290 32 -359 92 -3 120 -237 -191 -226 27 61 -152 -118 141 34 47 355 -32 12 -73 -12 -125 -111 95
6062 95 -181 -85 -162 143 65 103 170 160 -113 -36 249 287 -250 50 96 -74 -181 -78 -89 301 29 -115 39 -218
6086 -218 -194 -69 83 114 321 57 177 -256 -265 -69 -182 -58 102 87 -280 -64 -166 -45 182 -87 161 -154
6108 -154 202 178 -45 75 -12 113 -236 -17 13 160 64 -55 -119 260 348 -94 4 -101 -1 -78 -143 167 222
6131 222 -129 -93 -22 -200 217 -191 -30 97 -29 52 183 45 271 43 118 115 -163 159 -204 108 -135 31
6153 31 -80 -282 -33 -204 31 -282 -261 34 -52 -18 92 92 -70 65 -590 154 -144 -28 4 1 44 -54 43 49 22
6178 22 -86 229 -148 212 17 69 -123 -177 -204 65 41 -94 63 366 -51 108 186 -13 7 -151 12 -191
6200 -191 235 -20 -303 -16 210 -104 -214 -15 168 183 -236 253 -124 172 -19 -65 -48 -21 -89 95 100 -101
6222 -101 -28 -130 47 -241 -189 125 453 -86 57 249 -108 -28 -8 129 -54 13 -66 224 -35 -184 83 -360
6244 -360 379 74 58 50 127 199 71 166 -174 60 -361 63 -108 90 274 19 -55 227 -125 -168 141 -312 -156
6267 -156 5 46 -85 -18 -157 148 -55 246 59 131 -142 128 61 -85 25 -146 -112 -183 -126 -78 -20 -162 -84
6290 -84 -36 191 105 327 69 -85 185 -2 64 354 20 7 -45 -97 303 62 186 -152 54 -50 180 -92
6312 -92 0 -209 93 -38 -276 -155 -40 55 -55 -91 -311 -126 -278 -5 309 -100 -2 86 -51 93 -53 35
6334 35 88 -96 139 -16 197 404 -20 -206 75 95 -173 441 3 -113 -84 395 -160 -36 285 84 -64
6355 -64 -270 84 193 -42 150 -3 21 339 61 32 100 -214 -190 -70 128 -135 75 16 233 -117 -103 -282
6377 -282 338 -341 38 278 -92 -2 -219 -195 -149 14 247 9 -39 86 -252 -17 -440 -155 12 186 145 116
6399 116 69 24 3 -147 -192 -23 -133 147 78 -39 29 -57 -258 -150 -120 200 -132 73 188 132 -32 119 305
6422 305 -28 81 -56 -61 -97 302 16 -282 -142 -243 66 -54 167 -219 76 -242 100 30 -13 90 33 -88
6444 -88 -186 120 269 -59 83 -172 -98 -146 134 -63 -16 -321 -160 195 -98 -66 198 -8 -61 127 -71 62
6466 62 -399 239 -230 49 6 -146 -91 151 180 -145 -23 161 -21 -63 -73 -102 19 9 -149 180 -274 53 339
6489 339 -32 -191 194 434 2 -97 54 -13 221 -33 -238 16 -383 -105 106 -421 111 -205 -116 131 480
6510 480 1 28 179 -13 44 233 287 30 -52 117 -216 -64 -53 41 63 -227 90 138 -56 -27 -49 140 -204
6533 -204 -178 269 -218 74 -65 99 -188 -37 112 34 206 188 209 -12 104 -155 -61 -305 -80 -45 16 -19 -176
6556 -176 98 -207 283 -20 -39 35 107 364 -76 -166 -36 25 -143 -185 122 -110 14 178 22 37 -153 189
6578 189 193 -153 -149 -145 -199 51 27 231 -54 -157 87 -116 -210 -61 -173 93 41 278 -136 -86 -3 -255 -79 -175
6602 -175 205 127 -201 114 -224 -78 144 -276 72 113 -256 -184 93 -82 61 -94 -196 192 285 -94 147
6623 147 -96 87 -87 108 106 -73 93 -3 -22 13 206 -57 -107 149 -96 3 80 90 -102 -108 -17 -118 -132 391
6647 391 284 -60 45 45 408 -33 226 32 132 -163 -19 -150 -83 -321 -330 132 102 60 29 -399 -103 139 -167
6670 -167 77 -137 266 -58 136 -33 -72 58 -172 87 119 10 -188 -10 225 -287 112 240 -53 -84 -51
6691 -51 11 145 90 9 4 -85 -114 -14 268 102 -30 -102 -303 -28 -59 81 -173 -77 -315 -11 214 -161 26 52
6715 52 273 217 -16 -63 68 -318 113 199 116 335 164 78 -139 26 -122 106 -32 -89 152 -320 57 -170
6737 -170 32 -95 61 25 141 14 98 -220 -236 51 -274 -37 124 109 17 -54 161 72 -129 99 -78 180
6759 180 29 499 25 95 39 228 91 78 -89 10 -87 48 -169 -106 237 -119 7 -184 166 -307 235 59
6781 59 -37 -210 49 318 -126 84 -93 14 355 191 370 -21 -96 -145 103 -197 -302 109 229 -38 67
6802 67 5 110 -321 -35 -43 113 -186 128 51 254 36 226 307 -132 130 -96 -16 -219 55 -138 -7 281
6824 281 -159 56 -73 25 -140 -123 -10 -136 -171 -198 -139 -101 -235 -264 -154 103 -88 -347 160 -227 71 -226
6846 -226 -219 -93 14 -213 -67 -55 400 98 -99 -35 239 233 318 -61 193 21 78 -177 -212 155 -85 70 45
6869 45 193 -67 121 -270 266 27 177 16 58 -165 -175 218 -37 -116 -1 -240 -136 -55 57 143 -50 297
6891 297 -71 6 10 -56 132 -72 -179 -325 59 210 115 -76 -216 101 57 -259 214 -26 -119 52 -188 182
6913 182 -109 -216 133 -133 183 86 139 -12 35 86 -154 322 261 -23 -12 207 55 -290 25 55 76 139 -91
6936 -91 -29 -176 -395 -292 201 -18 -166 106 -156 283 -50 -77 165 118 -115 -11 -77 -65 -212 -64 -113 53
6958 53 229 214 -104 -69 -322 -26 -23 -94 -98 -234 -12 235 -33 -32 37 -28 399 402 -172 73 98 47 282 50 -329
6983 -329 -62 144 -207 -106 -12 128 -299 -107 -171 -115 -80 -12 -64 226 -161 339 -126 132 20 337 -28 -194
7005 -194 88 -41 -173 261 405 -33 101 -13 -175 187 -110 -148 -79 -99 -175 -88 128 88 13 -232 176 384
7027 384 -183 -129 89 179 -36 477 81 -65 -129 76 -73 61 159 4 217 -288 -135 -171 -178 -41 -52 107 154
7050 154 -104 121 141 71 -128 -114 29 -225 -388 -174 80 25 78 -15 36 22 -25 1 4 172 283 90 -82 -89 29
7075 29 -188 -145 -48 87 -93 -47 -108 14 -23 93 65 203 30 -102 405 -184 1 241 -202 -329 401 -48
7097 -48 53 -282 -55 38 -5 41 42 11 403 -105 -52 -31 -29 -14 162 125 -279 73 235 157 -93 148 17 148 -67
7122 -67 -59 -121 14 89 -79 -58 -279 39 16 -205 -3 213 220 171 -12 -60 -144 -187 35 -345 -10 47 -52 22 131
7147 131 356 267 -111 -62 -23 165 -11 83 214 -143 56 -27 190 151 99 -22 9 -10 -318 -82 93 -56 51
7170 51 27 -32 5 -10 98 351 139 -189 -112 -101 1 -20 151 -31 184 465 -26 -54 99 -143 -180 -222 -346 197
7194 197 -50 212 162 -198 178 188 62 -51 -36 -158 -229 214 -329 84 -189 -84 -10 128 6 134 15 -42
7216 -42 66 13 -18 44 -31 -26 52 205 -389 275 81 -39 96 -35 85 -165 24 -271 -139 -308 179 26 -74
7239 -74 -198 19 -230 -34 -132 -161 -334 -64 335 -364 119 -164 21 340 109 -24 173 -89 -272 27 152
7260 152 318 102 115 -6 -16 186 24 237 -61 -122 -14 72 99 -44 -60 235 1 -290 68 -98 -96 49 -27
7283 -27 94 -107 70 52 -179 -83 182 201 263 -92 116 -117 -72 45 -9 -122 41 243 143 -62 -38 216 -215
7306 -215 -247 -8 52 34 -236 8 -193 -190 -318 124 -102 282 -154 -172 89 -46 19 -214 -94 84 6 47 -58
7329 -58 -112 -5 -69 -42 448 -94 -113 29 117 -122 -367 117 -76 105 52 124 116 671 -293 -186 312 -81 -397
7352 -397 -222 -188 123 149 135 87 76 -218 -277 -124 305 -26 -32 141 23 96 94 -10 -214 13 61 -235 -137 -21
7376 -21 173 -30 422 -42 -56 225 148 85 -37 -2 -27 -26 -102 -139 333 105 -167 5 -140 115 280 92 -152
7399 -152 282 -136 28 107 -96 162 192 -11 -145 -160 -11 -258 72 34 -179 -121 -103 -454 -21 67 262 476
7421 476 86 44 -75 53 -143 -313 107 -72 -116 106 -105 -21 -145 -56 -103 94 -190 -242 261 250 116 -167
7443 -167 -180 80 -262 -50 -29 -88 -125 5 57 -116 179 234 82 175 -152 -4 -62 -168 41 -37 58 187 42
7466 42 -111 -51 122 257 -12 -199 25 24 -46 225 -7 245 -54 21 -120 -111 -294 -232 161 126 180 -4 3 285
7490 285 120 -17 -313 -11 -115 -23 -80 -74 -52 -42 -44 -9 -319 175 -151 73 169 -114 95 191 -80 82 -72 9
7514 9 129 -222 258 185 38 316 -88 -107 -69 -141 -108 -87 -10 -141 22 109 -57 -94 6 112 -11 -158 146 40
7538 40 73 104 77 -33 19 198 -112 -92 -304 170 -79 249 -63 34 -108 80 249 -69 14 -97 -48 72 -137
7561 -137 144 137 158 9 -149 -105 168 53 241 310 -15 78 121 -250 48 18 -37 -33 -336 -291 -31 -267 -214 101
7585 101 -221 -38 -184 -110 -319 104 13 151 -30 -154 -112 161 -170 101 -250 376 53 258 -80 -170 -84 240
7607 240 -22 149 348 219 112 -27 47 29 112 -28 239 -19 63 -55 -141 23 -73 56 18 -212 -208 0 -177
7630 -177 226 49 -289 148 105 -98 89 -114 8 120 17 -178 -295 70 -27 14 10 -58 -111 -13 126 194 -285
7653 -285 138 -66 187 -5 241 -54 -15 -75 -251 -28 162 163 -22 34 172 -125 -77 -79 -419 -97 204 205 206 37
7677 37 -148 92 133 -5 32 273 102 221 -143 4 -185 -244 -298 -114 -362 69 -31 -244 131 7 40 -74
7699 -74 -29 97 496 53 -311 -112 -223 187 121 383 50 -94 12 51 124 -23 -187 151 221 107 -244 -4
7721 -4 271 -81 -155 112 -61 45 358 -211 17 -76 185 96 -100 -58 -50 -74 204 -203 -274 79 -77 -228 41
7744 41 -275 -143 -31 -13 204 206 52 -167 255 -127 -319 -82 4 -66 30 76 43 409 -293 -191 -47 -66 -182
7767 -182 -100 -44 -179 29 5 410 125 114 204 28 -248 212 25 -195 95 50 -22 -63 176 302 -250 35 -138
7790 -138 -160 -135 -121 -143 77 140 -47 -25 -137 -296 229 -155 121 -69 113 19 -127 -155 -6 -61 -155 -5 46 -74
7814 -74 -35 8 142 2 62 49 19 352 -149 -32 -131 -64 -81 116 -68 116 45 -325 256 -135 109 -53 -291
7837 -291 -237 2 12 -2 -115 -156 323 7 93 -157 56 162 -136 196 38 9 61 -61 66 50 -14 14 -233
7860 -233 -177 -244 71 -241 213 -95 -27 -232 5 26 69 -33 -9 -184 -98 -113 222 242 -56 -174 -66 233 6
7883 6 145 -5 60 20 92 93 -120 205 -31 -115 80 -87 -231 4 9 -82 -215 213 -42 -284 -50 -186 -214 281
7907 281 28 -237 -9 24 107 -79 306 -205 136 306 -97 -87 26 -140 -44 73 -1 318 4 318 46 -318
7929 -318 -32 59 152 88 -35 -282 -259 216 -51 142 266 8 -15 -91 147 -1 -231 -1 341 -35 -139 -50
7951 -50 100 65 -34 113 -153 96 -177 94 124 40 -7 -200 -58 -108 -18 -307 30 203 -221 -37 21 263 196
7974 196 -63 96 30 206 -273 -8 -144 -434 -64 -97 171 -346 105 -77 -91 152 109 -106 61 -101 -272
7995 -272 75 -209 89 60 31 75 289 -113 120 -328 -225 59 -143 -380 -232 282 -109 -301 -120 183 158
8016 158 -305 6 28 -469 240 44 358 142 -73 266 107 -98 106 -279 93 -96 -70 98 -373 -147 190
8037 190 -138 -196 173 26 -170 157 -12 -25 -125 264 78 99 170 -321 77 196 -283 -141 -160 123 9 134
8059 134 -501 164 217 55 51 118 93 -35 -46 241 -77 224 181 -6 -88 -79 92 229 6 -146 231 -254 12
8082 12 -11 -35 -41 -109 111 166 227 202 500 202 -98 210 193 -134 -89 -138 -119 -33 -100 35 272 248 -216 -151 -57 -5
8108 -5 -255 88 -102 105 84 71 59 79 -109 -148 91 -69 -23 15 51 62 -92 255 178 193 100 -199 20 -315 47
8133 47 24 -152 -281 152 -39 169 66 -180 149 -6 54 32 315 -302 208 146 105 28 -105 100 -49 372
8155 372 309 140 112 240 -23 42 -222 -264 52 59 333 -268 96 -117 67 64 373 60 -131 -188 294 -153 174
8178 174 44 83 23 -263 203 79 61 15 29 -111 185 113 202
8191B02
##END NTUPLES=NMR FID
##END=
