##TITLE=1H_DE-77Fk_TFAd6O
 DMSO-d6
 8 sc, 
 27.11.2024
##JCAMPDX= 6.0         $$ Bruker NMR JCAMP-DX V2.0
##DATA TYPE= NMR FID
##DATA CLASS= NTUPLES
##ORIGIN= UXNMR, Bruker Analytische Messtechnik GmbH
##OWNER= root
$$ XWIN-NMR		Version 3.5
$$ Wed Nov 27 16:14:31 2024 Russian Standard Time (UT+4h)  she@DPX200
##.OBSERVE FREQUENCY= 200.1315
##.OBSERVE NUCLEUS= ^1H
##.DELAY= (6, 6)
##.ACQUISITION MODE= SIMULTANEOUS
##.ACQUISITION SCHEME= undefined
##.AVERAGES= 8
##.DIGITISER RES= 18
##SPECTROMETER/DATA SYSTEM= spect
##.PULSE SEQUENCE= zg30
##.SOLVENT NAME= CDCl3
##.SHIFT REFERENCE= (INTERNAL, CDCl3, 0, 15.7039)
##AUDIT TRAIL= $$ (NUMBER, WHEN, WHO, WHERE, WHAT)
$$ ##TITLE= Audit trail, XWIN-NMR		Version 3.5
$$ ##JCAMPDX= 5.01
$$ ##ORIGIN= Bruker BioSpin GmbH
$$ ##OWNER= she
$$ F:/spectra/data/she/nmr/H-F/1/audita.txt
$$ ##AUDIT TRAIL=  $$ (NUMBER, WHEN, WHO, WHERE, WHAT)
(   1,<2024-11-27 16:13:33.26 +0400>,<she>,<DPX200>,
      <created by zg, POWCHK disabled, PULCHK disabled
       configuration hash MD5:
       00 E9 B6 7A A2 85 ED C7 34 08 36 98 17 FE 4E 26
       data hash MD5: 16K
       E2 73 A7 45 D1 40 A1 5C 0A EC 2F 67 04 33 9E 44>)
$$ ##END=
$$ 
$$ hash MD5
$$ 0B 88 29 27 DC EA 4A 4F 06 22 32 78 AC 0E 5B 24
##$RELAX= 
##$RELAX= 
##$RELAX= 
##$RELAX= 
##$RELAX= 
##$RELAX= 
$$ Bruker specific parameters
$$ --------------------------
##$DU= <F:/spectra>
##$EXPNO= 1
##$NAME= <H-F>
##$PROCNO= 1
##$TYPE= <nmr>
##$USER= <she>
##$AMP= (0..31)
100 100 100 100 100 100 100 100 100 100 100 100 100 100 100 100 100 100 
100 100 100 100 100 100 100 100 100 100 100 100 100 100 
##$AQSEQ= 0
##$AQ_mod= 1
##$AUNM= <au_zg>
##$AUTOPOS= <>
##$BF1= 200.13
##$BF2= 200.13
##$BF3= 200.13
##$BF4= 200.13
##$BF5= 200.13
##$BF6= 200.13
##$BF7= 200.13
##$BF8= 200.13
##$BYTORDA= 1
##$CFDGTYP= 0
##$CFRGTYP= 5
##$CHEMSTR= <none>
##$CNST= (0..31)
1 1 145 1 1 1 1 1 1 1 1 1 1 1 1 1 1 1 1 1 1 1 1 1 1 1 1 1 1 1 1 1 
##$CPDPRG= <>
##$CPDPRG1= <>
##$CPDPRG2= <>
##$CPDPRG3= <>
##$CPDPRG4= <mlev>
##$CPDPRG5= <mlev>
##$CPDPRG6= <mlev>
##$CPDPRG7= <mlev>
##$CPDPRG8= <mlev>
##$CPDPRGB= <>
##$CPDPRGT= <>
##$D= (0..31)
0 1.2 0 0 0 0 0 0 0 0.06 0 0.03 0 0 0 0 0.0002 0 0 0 0 0 0 0 0 0 0 0 0 
0 0 0 
##$DATE= 1732709612
##$DBL= (0..7)
120 120 120 120 120 120 120 120 
##$DBP= (0..7)
150 150 150 150 150 150 150 150 
##$DBP07= 0
##$DBPNAM0= <>
##$DBPNAM1= <>
##$DBPNAM2= <>
##$DBPNAM3= <>
##$DBPNAM4= <>
##$DBPNAM5= <>
##$DBPNAM6= <>
##$DBPNAM7= <>
##$DBPOAL= (0..7)
0.5 0.5 0.5 0.5 0.5 0.5 0.5 0.5 
##$DBPOFFS= (0..7)
0 0 0 0 0 0 0 0 
##$DE= 6
##$DECBNUC= <off>
##$DECIM= 24
##$DECNUC= <off>
##$DECSTAT= 4
##$DIGMOD= 1
##$DIGTYP= 9
##$DL= (0..7)
0 120 120 120 120 120 120 120 
##$DP= (0..7)
150 150 150 150 150 150 150 150 
##$DP07= 0
##$DPNAME0= <>
##$DPNAME1= <>
##$DPNAME2= <>
##$DPNAME3= <>
##$DPNAME4= <>
##$DPNAME5= <>
##$DPNAME6= <>
##$DPNAME7= <>
##$DPOAL= (0..7)
0.5 0.5 0.5 0.5 0.5 0.5 0.5 0.5 
##$DPOFFS= (0..7)
0 0 0 0 0 0 0 0 
##$DQDMODE= 0
##$DR= 18
##$DS= 0
##$DSLIST= <SSSSSSSSSSSSSSS>
$$ [...]
##$SUBNAM2= <"">
##$SUBNAM3= <"">
##$SUBNAM4= <"">
##$SUBNAM5= <"">
##$SUBNAM6= <"">
##$SUBNAM7= <"">
##$SUBNAM8= <"">
##$SUBNAM9= <"">
##$SW= 24.0689530833862
##$SWIBOX= (0..15)
0 0 2 0 0 0 0 0 0 0 0 0 0 0 0 0 
##$SW_h= 4816.95568400771
##$TD= 16384
##$TD0= 1
##$TE= 0
##$TE2= 300
##$TE3= 300
##$TEG= 300
##$TL= (0..7)
0 120 120 120 120 120 120 120 
##$TP= (0..7)
150 150 150 150 150 150 150 150 
##$TP07= 0
##$TPNAME0= <>
##$TPNAME1= <>
##$TPNAME2= <>
##$TPNAME3= <>
##$TPNAME4= <>
##$TPNAME5= <>
##$TPNAME6= <>
##$TPNAME7= <>
##$TPOAL= (0..7)
0.5 0.5 0.5 0.5 0.5 0.5 0.5 0.5 
##$TPOFFS= (0..7)
0 0 0 0 0 0 0 0 
##$TUNHIN= 0
##$TUNHOUT= 0
##$TUNXOUT= 0
##$USERA1= <user>
##$USERA2= <user>
##$USERA3= <user>
##$USERA4= <user>
##$USERA5= <user>
##$V9= 5
##$VALIST= <valist>
##$VCLIST= <CCCCCCCCCCCCCCC>
##$VD= 0
##$VDLIST= <DDDDDDDDDDDDDDD>
##$VPLIST= <PPPPPPPPPPPPPPP>
##$VTLIST= <TTTTTTTTTTTTTTT>
##$WBST= 1024
##$WBSW= 4
##$XGAIN= (0..3)
0 0 0 0 
##$XL= 0
##$YL= 0
##$YMAX_a= 185608
##$YMIN_a= -171669
##$ZGOPTNS= <>
##$ZL1= 120
##$ZL2= 120
##$ZL3= 120
##$ZL4= 120
##$ABSF1= 10
##$ABSF2= 0
##$ABSG= 5
##$ABSL= 3
##$ALPHA= 0
##$AQORDER= 0
##$ASSFAC= 0
##$ASSFACI= 0
##$ASSFACX= 0
##$ASSWID= 0
##$AUNMP= <proc_1d>
##$AZFE= 0.1
##$AZFW= 0.1
##$BCFW= 1
##$BC_mod= 2
##$BYTORDP= 1
##$COROFFS= 0
##$CY= 11.3945322036743
##$DATMOD= 1
##$DC= 2
##$DFILT= <>
##$DTYPP= 0
##$F1P= 15.6554695791079
##$F2P= 12.8336369535428
##$FCOR= 0.5
##$FTSIZE= 0
##$FT_mod= 4
##$GAMMA= 1
##$GB= 0.15
##$INTBC= 1
##$INTSCL= 1
##$ISEN= 128
##$LB= 0.24
##$LEV0= 0
##$LPBIN= 0
##$MAXI= 10000
##$MC2= 0
##$MEAN= 0
##$ME_mod= 0
##$MI= 1.114404
##$NCOEF= 0
##$NC_proc= 0
##$NLEV= 6
##$NOISF1= 3.799351
##$NOISF2= 2.8
##$NSP= 1
##$NTH_PI= 0
##$NZP= 0
##$OFFSET= 15.70392
##$PC= 1
##$PHC0= -26719.51
##$PHC1= 11.58745
##$PH_mod= 1
##$PKNL= yes
##$PPARMOD= 0
##$PSCAL= 0
##$PSIGN= 0
##$REVERSE= no
##$SF= 200.130013532006
##$SI= 16384
##$SIGF1= 3
##$SIGF2= 2
##$SINO= 400
##$SIOLD= 16384
##$SREGLST= <1H.CDCl3>
##$SSB= 0
##$STSI= 0
##$STSR= 0
##$SW_p= 3612.71676300578
##$SYMM= 0
##$S_DEV= 0
##$TDeff= 0
##$TDoff= 0
##$TI= <>
##$TILT= no
##$TM1= 0
##$TM2= 0
##$TOPLEV= 0
##$USERP1= <user>
##$USERP2= <user>
##$USERP3= <user>
##$USERP4= <user>
##$USERP5= <user>
##$WDW= 1
##$XDIM= 8192
##$YMAX_p= 0
##$YMIN_p= 0
$$ End of Bruker specific parameters
$$ ---------------------------------
##NTUPLES= NMR FID
##VAR_NAME=  TIME,          FID/REAL,        FID/IMAG
##SYMBOL=    X,             R,               I
##VAR_TYPE=  INDEPENDENT,   DEPENDENT,       DEPENDENT
##VAR_FORM=  AFFN,          ASDF,            ASDF
##VAR_DIM=   8192,          8192,            8192
##UNITS=     SECONDS,       ARBITRARY UNITS, ARBITRARY UNITS
##FACTOR=    0.0002076,     1,               1
##FIRST=     0,             0,               0
##LAST=      1.7004516,     0,               0
##MIN=       0,             -171669,         0
##MAX=       1.7004516,     185608,          0
$$ Real data points
##PAGE= N=1
##DATA TABLE= (X++(R..R)), XYDATA
$$ [...]
$$ plain form
1948 57 -282 -7 -31 -171 -120 -242 -49 -120 21 -3 95 64 -166 -104 -29 134 143 -153 183 14 -115 -268 148 50
1972 50 27 -154 -9 135 -22 240 -182 33 39 48 251 5 323 182 -354 69 178 -87 311 -313 -1 -77
1994 -77 -122 114 0 193 -125 103 -9 -69 -49 28 84 80 -33 -92 -239 -71 360 202 -63 224 12 -109 -78
2017 -78 -170 27 -226 152 116 168 -28 -102 -189 -50 158 109 -29 -180 125 207 -115 -15 -193 -29 -170 -132 103
2040 103 152 169 -158 47 -2 51 22 169 6 -319 219 -77 291 164 -206 264 73 277 -18 -28 38 -194
2062 -194 -163 132 139 211 -216 -95 -118 -177 -142 -188 105 -154 -277 -249 110 217 240 -120 -82 -180 65 -71 20 98 -118
2087 -118 -158 407 152 -109 -12 -95 -225 -269 -94 -90 -49 228 144 -95 -76 122 -309 53 -282 -201 155 -36 -139
2110 -139 170 -63 119 19 -155 172 -42 -117 115 -162 -157 -191 121 -103 41 -206 -342 -216 190 -84 290
$$ packed form
1948E7l39K75k4j40N1j22J93p1J41k4R8l1k30O2P5J63Rk96L36j69j29j53M16r8
1972E0k3j81J45J44j57K62m22K15ORK03k46L18j41n36M23J09k65L98o24L12p6
1994g7m5K36j14J93l18K28j12o0K0P7N6mj13n9j47J68M31j58k65K87k12j21L1
2017g8r2J97k53L78l6N2j96p4q7J39K08m9j38j51L05Q2l22J00j78J64j41L8K35
2040A03M9J7l27K05m9N3k9J47j63l25N38k96L68j27l70M70j91K04k95j0O6k32
2062a94L1K95PP2m27J21k3n9L5m6K93k59j23K8L59J07K3l60L8r8K45j36R1P8k16
2087a18m0N65k55k61R7q3j30m4J75MM1K77q4k39J9J98m31L62l35Q1L56j91j03
2110a39L09k33J82j00j74L27k14p5K32k77Nl4L12k24J44k47j36J26M06k74L74
$$ plain form
2131 290 213 -2 -147 10 -72 -46 -85 82 -192 -177 105 217 206 -37 -30 -151 25 -140 -496 -141 -20 58 -204
2154 -204 -78 112 -103 -67 -126 -74 25 -116 -30 -10 172 -152 118 -79 62 313 115 -49 -7 79 -91 22 -125
2177 -125 338 98 -338 -181 -145 97 -180 -45 153 -177 129 92 254 332 -191 78 -6 358 333 15 -248 144
2199 144 -88 35 380 -51 -222 -109 -89 164 -199 -230 113 84 -67 -317 -141 -67 -341 -82 126 17 -184
2220 -184 -27 -148 30 -207 76 -322 -142 -243 -68 58 22 64 -275 -88 -82 309 123 -6 -213 -181 -324 -301
2242 -301 -166 -132 286 140 172 168 -3 -17 -64 177 -106 -268 -450 239 197 3 141 -128 80 -98 -163 -170 -44
2265 -44 93 -131 -77 -19 -109 174 -177 69 -44 55 127 6 4 101 -137 137 12 -28 44 383 -204 -378 235 316
2289 316 -48 -115 51 -199 189 98 -111 -113 221 -89 211 -376 170 -158 -67 -152 -85 -129 24 -25 -55 24 109 89
$$ packed form
2131B90p7k15j45J57q2K6l9J67k74J5K82J12j1k43Pj21J76j65l56L55J21P8k62
2154b04J26J90k15L6n9N2R9j41Q6K0J82l24K70j97J41K51j98j64M2Q6j70J13j47
2177a25M63k40m36J57L6K42k77J35J98l30L06l7J62P8n23K69q4L64k5l18k63L92
2199A44k32J23L45m31j71J13K0K53l63l1L43k9j51k50J76P4k74K59K08j09k01
2220a84J57j21J78k37K83l98J80j01J75J26l6M2l39J87OL91j86j29k07L2j43K3
2242c01J35L4M18j46L2mj71j4m7K41k83j62j82O89m2j94J38k69K08j78o5pJ26
2265d4J37k24N4N8r0K83l51K46j13R9P2j21kR7k38K74j25m0P2L39n87j74O13Q1
2289C16l64o7J66k50L88r1k09kL34l10L00n87N46l28R1q5O7m4J53m9l0P9Q5k0
$$ plain form
2313 89 -124 217 -153 -312 -153 -32 134 -319 -112 231 -62 -4 187 -395 -53 40 100 156 84 163 21 -166
2335 -166 60 -110 135 -94 -25 112 7 -51 -180 -67 -174 -252 -88 50 68 14 30 30 17 27 -235 -146 -189 27
2359 27 -48 -115 -252 52 168 151 373 -97 74 -221 43 -164 -2 201 -51 10 -461 -79 25 -73 -158 204
2381 204 -97 182 78 201 7 103 -96 -9 -15 16 -274 -273 89 173 -243 87 273 133 354 82 -73 74 110
2404 110 23 -64 15 -135 261 80 39 26 237 91 5 85 127 95 -124 -125 -245 -244 97 80 3 -234 436 -371 -206
2429 -206 -1 -110 -97 50 -169 -319 290 -29 -119 -279 -193 273 54 -139 137 329 -70 38 17 -35 -23 213
2451 213 3 461 -256 243 -69 -283 115 -102 -88 -45 182 13 92 38 345 -58 182 -88 177 7 100 98
2473 98 111 94 25 -147 28 -64 -133 236 136 -274 -111 -55 410 -24 22 -120 14 119 -19 -95 85 143 45 55
$$ packed form
2313H9k13L41l70j59J59J21J66m53K07L43k93N8J91n82L42R3O0N6p2P9j42j87
2335a66K26j70K45k29O9J37j05n8j29J13j07p8J64J38J8n4J6%j3J0k62Q9m3K16
2359B7p5o7j37L04J16j7K22m70J71k95K64k07J62K03k52O1m71L82J04r8q5L62
2381B04l01K79j04J23j94R6j99Q7oL1k90JL62Q4m16L30J86j40K21k72j55J47L6
2404A10q7q7P9j50L96j81m1j3K11j46q6Q0M2l2k19jj20JL41j7p7k37O70q07J65
2429b06K05j09J3J47k19j50O09l19r0j60Q6M66k19j93K76J92l99J08k1n2J2K36
2451B13k10M58p17M99l12k14L98k17J4M3K27j69P9n4L07m03K40k70K65j70R3k
2473I8J3j7o9j72J75r2o9L69j00m10J63N6M65m34M6j42J34J05j38p6J80N8r8J0
$$ plain form
2497 55 252 74 87 170 104 279 -70 -172 66 281 59 -29 -68 64 -74 15 156 -69 129 96 -236 27 -124
2520 -124 -41 18 27 73 -78 -203 296 -125 -259 -307 -163 62 94 125 77 0 375 -18 160 235 -93 168 -363 -20
2544 -20 -8 292 -148 -157 78 -109 200 -116 11 -440 105 -56 58 -164 -297 -112 -48 77 -46 -358 -93 -170
2566 -170 353 360 136 -9 -217 -63 27 -377 141 -24 142 262 -195 -33 -129 138 53 -324 -70 99 -215 -143
2588 -143 -87 -24 126 97 -138 -68 265 -147 -224 189 -58 -56 65 -13 -40 157 -64 37 37 8 278 143 205 -194
2612 -194 323 3 120 218 -39 213 10 -105 42 283 -238 20 -81 42 215 -143 -304 -82 -194 -42
2632 -42 194 -19 -35 -121 78 -15 -113 68 -30 -58 108 -94 -147 -56 3 -134 119 -4 131 -261 -227 245 61 195
2656 195 -87 -3 -174 327 -13 -110 -137 -106 2 1 65 36 331 -16 -85 -110 23 -39 49 64 -69 58 18 413 -72
$$ packed form
2497E5J97j78J3Q3o6J75l49j02K38K15k22q8l9J32j38Q9J41k25J98l3l32K63j51
2520a24Q3N9RM6j51j25M99m21j34m8J44K25L2L1m8p7L75l93J78P5l28K61n31L43
2544b0J2L00m40rK35j87L09l16J27m51N45j61J14k22j33J85O4J25j23l12K65p7
2566a70N23Pk24j45k08J54R0m04N18j65J66J20m57J62r6K67q5l77K54J69l14P2
2588a43N6O3J50k9k35P0L33m12p7M13k47KJ21p8k7J97k21J01%k9K70j35O2l99
2612a94N17l20J17R8k57K52k03j15J47K41n21K58j01J23J73l58j61K22j12J52
2632d2K36k13j6q6J99r3r8J81r8k8J66k02n3R1N9j37K53j23J35l92L4M72j84J34
2656A95k82Q4j71N01l40r7k7L1J08jO4k9K95l47o9k5J33o2Q8J5j33J27m0L95m85
$$ plain form
2681 -72 184 -4 30 58 -240 -264 -133 -92 -58 134 -7 -170 -80 -118 -287 106 228 144 -175 -91 -132 76 -36 -23
2705 -23 -214 34 265 -274 -45 -54 -98 19 -238 -156 432 163 -66 -42 159 -165 -99 -12 193 152 -44 379 141
2728 141 -415 -111 -55 -167 95 146 -108 2 103 -23 -390 -170 166 -254 -286 -88 -365 198 -62 -117 91
2749 91 -427 303 -409 280 -183 -147 229 -193 -50 142 233 -23 -50 148 -50 81 151 -214 125 59 -200 -50
2771 -50 -121 -119 -67 -138 -20 190 37 -206 307 -204 235 -28 -422 -25 -72 -155 51 49 -108 -26 -89 83 40 16 -49
2796 -49 -50 -119 11 164 154 -160 159 226 -91 35 -24 130 243 100 319 -55 87 67 221 -138 30 115 41
2819 41 -153 -68 194 -60 334 9 -326 76 47 -145 -95 24 240 62 110 -249 189 224 -17 -34 -21 -131 201
2842 201 -124 -35 -162 21 95 -129 271 140 -211 110 232 -153 65 -299 133 200 25 -36 330 20 -92
$$ packed form
2681g2K56j88L4K8k98k4J31M1L4J92j41j63R0l8j69L93J22q4l19Q4m1K08j12J3
2705b3j91K48K31n39K29rm4J17k57Q2N88k69k29K4K01l24O6Q7K05m1j96M23k38
2728A41n56L04N6j12K62N1k54J10J01j26l67K20L36m20l2J98k77N63k60n5K08
2749I1n18P30p12O89m63L6L76m22J43J92R1k56k7J98j98J31P0l65L39o6k59J50
2771e0p1KN2p1J18K10j53k43N13n11M39k63l94L97m7q3K06kj57Q2o3J72m3k4o5
2796d9jo9J30J53j0l14L19O7l17J26n9J54J13j43K19l74J42k0J54l59J68Q5p4
2819D1j94Q5K62k54L94l25l35M02k9j92N0J19K16j78M8l59M38L5k41j7J3j10L32
2842B01l25Q9j27J83P4k24M00j31l51L21J22l85K18l64M32O7j75o1L66l10j12
$$ plain form
2863 -92 28 -160 -102 -52 -206 42 -323 -274 189 -85 194 208 -241 49 7 -70 288 22 62 -133 240 116 -26
2886 -26 28 182 -55 -195 77 -208 102 -306 -198 126 35 24 -13 33 594 58 93 223 -46 257 -61 -106 152
2909 152 128 -276 166 -104 -185 -59 30 147 -186 52 -140 -60 128 8 26 -315 -117 216 -150 312 218 63
2931 63 -6 -307 23 18 -448 -70 297 -416 91 -5 12 256 329 461 -174 -204 125 -198 68 -207 -146 -24 -238
2954 -238 286 104 -170 -128 121 97 -176 40 -89 45 141 -2 456 -86 -39 -266 -107 27 -12 66 105 -352
2976 -352 122 -109 -33 -49 -241 101 245 146 236 -31 147 -303 -187 -94 178 21 -88 -121 -116 219 32 -37 136
2999 136 159 73 -156 82 -142 151 -142 -304 -27 122 -20 136 27 -54 -148 -81 -83 113 -47 29 -530 40 95
3022 95 330 32 -305 95 56 140 143 -7 490 54 167 215 36 78 -277 -104 319 -265 108 -256 -56 56
$$ packed form
2863i2J20j88N8N0j54K48l65M9M63k74K79J4m49K90m2p7L58k66M0j95L73j24j42
2886b6N4J54k37j40K72k85L10m08J08L24r1j1l7M6N61n36L5J30k69L03l18m5K58
2909A52k4m04M42k70q1J26Q9J17l33K38j92Q0J88j20J8l41J98L33l66M62r4j55
2931F3o9l01L30nm66L78L67p13N07r6J7K44P3J32o35l0L29l23K66k75O1J22k14
2954b38N24j82k74M2K49k4k73K16j29J34R6j43M58n42M7k27J59J34l9P8L9m57
2976c52M74k31P6j6j92L42J44r9R0k67J78m50J16R3K72j57j09l3NL35j87o9J73
2999A36K3q6k29K38k24K93k93j62K77J49j42J56j09q1r4O7kJ96j60P6n59N70N5
3022I5K35k98l37M00l9Q4Lj50M97m36J13M8j79M2l55J73M23n84L73l64K00J12
$$ plain form
3044 56 -60 19 117 -420 -168 97 -23 -62 -263 -8 141 -17 49 -169 240 279 206 -6 126 179 -303 375 26
3067 26 162 -56 -218 134 219 15 165 211 -160 24 -11 -153 -127 39 -246 -106 -80 -3 159 59 41 -50 -110
3090 -110 148 -204 -64 -55 25 89 256 371 -124 -393 -5 129 140 111 -271 -153 42 172 -276 -129 -10 54
3112 54 196 -87 -77 249 116 -129 231 -191 42 -123 57 271 8 72 -60 -77 27 -215 -21 -16 62 106 -40
3135 -40 -20 270 23 331 -31 -172 -50 264 -241 -236 -128 303 278 190 70 -12 129 150 -285 -159 136 244 223
3158 223 34 19 -92 -137 -83 1 44 208 -1 -47 -119 94 277 101 318 -168 89 -76 91 34 -113 38 -166
3181 -166 -187 111 31 109 118 261 313 -321 -129 -331 14 107 103 -16 -36 -2 228 -74 33 -101 -201 -360 30 1
3205 1 190 180 -246 214 187 -97 -219 209 -110 124 -138 -27 -117 34 174 9 -19 179 -14 -4 -80 -174 -103
$$ packed form
3044E6j16P9R8n37K52K65j20l9k01K55J49j58O6k18M09L9p3k12J32N3m82O78l49
3067B6J36k18j62L52Q5k04J50M6l71J84l5j42K6J66k85J40K6P7J62j00j8r1o0
3090a10K58l52J40RQ0O4J67J15m95k69L88J34J1k9l82J18J95J30m48J47J19O4
3112E4J42k83J0L26j33k45L60m22K33j65J80K14k63O4j32j7J04k42J94NP8M4j46
3135d0K0K90k47L08l62j41J22L14n05NJ08M31k5q8j20q2J41K1m35J26K95J08k1
3158B23j89j5j11m5N4Q4M3J64k09m6p2K13J83j76K17m86K57j65J67n7j47J51k04
3181a66k1K98q0P8RJ43N2o34J92k02L45R3mj19k0L4K30l02J07j34j00j59L90k9
3205AJ89j0m26M60k7k84j22M28l19K34k62J11r0J51J40j65k8J98j93J0p6r4P1
$$ plain form
3228 -103 -132 -120 -50 100 -127 159 47 151 -55 -61 101 14 -11 -6 -149 156 211 46 43 147 0 141 233 163 -124
3253 -124 -251 39 189 -40 81 168 -13 -25 45 -64 188 5 282 181 12 149 86 -149 -136 -68 -73 103 -260
3276 -260 29 222 24 -124 138 -114 -76 -141 -10 108 -125 -32 -13 287 -5 -30 251 -41 -133 53 -230 30
3298 30 134 -31 222 -355 64 196 164 265 -371 -235 121 220 -64 -208 174 185 13 150 111 6 -183 -168
3320 -168 -276 15 11 -291 153 100 -295 -84 -48 61 204 -250 -88 -185 -69 -275 261 -190 84 -151 -167 -94
3342 -94 14 -428 -117 217 157 -3 -131 -240 54 196 22 -1 266 60 73 100 143 -70 -265 130 72 -4 -110
3365 -110 -245 74 1 85 150 9 289 354 10 181 93 247 112 -77 252 -66 227 4 268 -16 -33 -144
3387 -144 95 51 -64 42 320 102 -112 -78 -309 -32 324 61 -6 -98 -92 58 -66 114 -117 34 337 29
$$ packed form
3228a03k9J2P0J50k27K86j12J04k06oJ62q7k5Nj43L05N5j65lJ04j47J41R2p0k87
3253a24j27K90J50k29J21Q7j81j2P0j09K52j83K77j01j69J37o3k35J3O8nJ76l63
3276b60K89J93j98j48K62k52L8o5J31J18k33R3J9L00k92k5K81k92r2J86k83K60
3298C0J04j65K53n77M19J32l2J01o36J36L56R9k84j44L82J1j72J37l9j05j89J5
3320a68j08K91ml02M44n3l95K11L6J09J43m54J62r7J16k06N36m51K74k35j6P3
3342i4J08m42L11L34o0j60j28j09K94J42j74k3K67k06J3K7M3k13j95L95n8p6j06
3365a10j35L19p3Q4O5j41K80O5l44J71q8J54j35j89L29l18K93k23K64k84j7j11
3387a44K39m4j15J06K78k18k14L4k31K77L56k63o7r2OJ50j24J80k31J51L03l08
$$ plain form
3409 29 136 110 84 -24 256 -9 129 361 -231 -120 11 258 131 180 85 -92 -109 -7 75 36 38 8 -3 181
3433 181 250 67 -61 43 297 252 -92 -40 -84 -136 -349 -1 -128 -255 -68 -198 262 -176 67 -322 -139 -177
3455 -177 92 320 -216 168 56 233 29 -3 -131 251 24 159 -142 -253 -83 152 186 -340 -157 -1 111
3476 111 -155 -1 124 -87 222 -218 -177 -170 -51 3 -51 -98 266 -193 148 294 132 -91 -182 -7 -188 -21
3498 -21 -149 42 28 14 238 199 67 -104 48 -112 -154 87 -20 210 52 -201 383 145 81 -91 -59 57
3520 57 19 -283 9 27 110 202 17 173 -49 119 133 32 120 71 64 -43 197 -41 -152 155 -21 -167 171
3543 171 180 111 -105 119 31 178 -230 -41 -177 22 240 166 -134 197 58 49 96 -123 -93 -72 -120 160 -551 -247
3567 -247 2 -109 -66 247 -132 273 -158 56 -98 20 111 -350 306 70 -104 126 -62 -66 -262 176 207 -307
$$ packed form
3409B9J07k6k6j08K80k65J38K32n92J11J31K47j27M9r5j77j7J02Q2l9Kl0j1J84
3433A81O9j83j28J04K54m5l44N2m4n2k13L48j27j27J87j30M60m38K43l89J83l8
3455a77K69K28n36L84j12J77k04l2j28L82k27J35l01j11J70K35L4n26J83J56J12
3476A11k66J54J25k11L09m40M1PJ19N4n4m7L64m59L41J46j62k23r1J75j81J67
3498b1j28J91j4j4K24l9j32j71J52j60m2K41j07K30j58k53N84k38o4j72L2J16
3520E7l8l02K92J8Q3R2j85J56k22J68J4j01Q8m9pj07K40k38j11L07j76j46L38
3543A71Ro9k16K24q8J47m08J89j36J99K18p4l00L31j39rM7k19L0K1m8K80p11L04
3567b47K49j11M3L13l79M05m31K14j54J18R1m61O56k36j74K30j88mj96M38L1n14
$$ plain form
3589 -307 -182 21 -100 -416 -34 446 -293 155 43 -212 173 -212 208 -159 -84 -78 -50 -26 80 -110 275 -240
3611 -240 -102 177 445 -9 -61 45 378 226 506 390 42 -146 -261 98 -112 189 -287 -31 243 225 -102
3632 -102 9 29 -73 113 147 -157 -68 -5 174 501 29 -6 -50 -7 -313 -120 225 -53 -286 -252 230 162 85
3655 85 291 -20 -9 -41 -154 84 157 88 -168 -207 256 -214 47 -411 -14 -341 44 146 148 267 125 -48 -171
3678 -171 361 -49 354 18 -161 -73 -77 -11 5 71 180 199 -57 -34 -196 -19 -169 120 131 -163 39 -131 114
3701 114 131 -181 243 -313 -38 -37 65 263 71 150 41 106 185 -2 -161 -61 -286 134 -178 6 -37 119
3723 119 104 204 167 -119 141 77 211 277 190 112 -93 -18 117 293 90 102 -43 -39 -75 115 207 -15 -448 56
3747 56 77 -164 -264 4 131 -70 -123 290 -233 16 183 316 49 138 -233 145 -53 -16 -156 81 -215 -71
$$ packed form
3589c07J25K03j21l16L82M80p39M48j12k55L85l85M20l67P5OK8K4J06j90L85n15
3611b40J38K79K68m54n2J06L33j52K80j16l48j88j15L59k10L01m76K56K74j8l27
3632a02J11K0j02J86L4l04Q9O3J79L27m72l5m4M3l06J93L45k78k33L4M82o8p7
3655H5K06l11J1l2j13K38P3o9k56l9M63m70K61m58L97l27L85J02KJ19j42j73j23
3678a71N32m10M03l36j79Q8mO6J6O6J09J9k56K3j62J77j50K89J1k94K02j70K45
3701A14J7l12M24n56K75JJ02J98j92P9j09O5P9j87j59J00k25M20l12J84m3J56
3723A19j5J00l7k86K60o4J34O6q7p8k05P5J35J76k03J2j45Ml6J90R2k22m33N04
3747E6K1k41j00K68J27k01n3M13n23K49J67J33k67Q9l71L78j98L7j40K37k96J44
$$ plain form
3769 -71 -154 -205 421 -204 -62 -172 11 -23 -46 -299 -64 -160 -289 -7 -39 -281 226 81 -51 -9 251 -78 -5
3792 -5 39 151 -64 151 246 387 269 287 242 -228 -93 -162 -64 -75 -133 123 -149 204 295 108 150 218 -71 251
3816 251 -236 -110 -136 241 222 -84 -183 -89 -54 57 -12 -90 130 -208 263 -94 -58 332 210 -26 162 -23 47
3839 47 95 305 168 -49 119 91 -26 -72 -148 -7 -218 -135 -71 -85 17 46 -21 -77 207 -422 -32 -26 41 -79 -84
3864 -84 39 131 -97 -90 127 311 -252 227 -3 41 72 13 72 140 -305 -181 -142 74 -7 -177 0 104 151 -55
3888 -55 104 -311 -258 107 -27 -192 222 216 -96 87 -13 142 0 80 99 -61 -455 -363 -315 269 64 -340 116
3911 116 -163 286 231 -8 202 96 106 -101 86 -24 177 89 -149 -86 -71 71 -67 -87 -69 21 122 -74 185
3934 185 -83 116 201 -179 -197 259 36 140 12 -170 113 213 194 -182 53 -90 -90 -345 -158 122 -251 -238
$$ packed form
3769g1q3n1O26o25J42j10J83l4k3k53K35r6j29K82l2k42N07j45j32M2K60l29P3
3792eM4J12k15K15R5J41j18J8m5m70J35o9R8j1n8K56k72L53R1j87M2O8k89L22
3816B51m87J26k6L77j9l06r9R4L5J11o9p8K20l38M71l57L6L90j22k36J88j85P0
3839D7M8K10j37k17J68k8j17m6p6J41k11Q3O4j4J02K9o7n6K84o29L90OO7j20n
3864h4J23R2k28PK17J84n63M79k30M4L1n9N9O8m45J24L9K16q1j70J77J04M7k06
3888e5J59m15N3L65j34j65M14ol12J83j00J55j42Q0J9j60l94R2M8N84k05m04M56
3911A16k79M49n5k39K10j06J0k07J87j10K01q8k38O3J5J42j38k0J8R0J01j96K59
3934A85k68J99Q5l80j8M56k23J04j28j82K83J00j9l76K35j43%k55J87K80l73J3
$$ plain form
3956 -238 120 -186 -195 -43 92 56 202 47 -376 126 -148 52 -411 -75 154 92 324 110 -9 -11 262 -185
3978 -185 94 190 10 3 97 -102 203 118 105 -140 337 76 -435 198 315 143 147 74 40 74 -174 -183 63 57 -75
4003 -75 182 413 -273 -7 89 -254 -115 366 -155 124 -33 -320 196 193 129 -245 4 -187 90 -41 -184 -106
4025 -106 201 308 508 122 -325 20 -88 -31 -212 165 -190 75 -112 35 144 -31 -34 373 -166 -403 229
4046 229 152 104 -35 -55 -290 -1 259 -65 -146 85 219 103 -28 -23 -217 -237 228 159 -32 365 -162 205 -102
4069 -102 -176 89 271 -223 -197 -140 -39 -80 -241 -64 -172 -55 109 143 -105 -51 -137 -179 72 72 70 -27 -13 -71 306
4094 306 -124 261 -256 -92 33 -59 190 29 -282 77 243 224 24 253 -52 198 -271 -151 -228 72 -21
4115 -21 -57 -101 25 -47 179 297 -6 -41 -122 125 47 -15 -17 -33 227 65 55 101 246 204 30 182 283 -68 -13
$$ packed form
3956b38L58l06rJ52J35l6J46j55m23N02k74K00m63L36K29o2K32k14j19kK73m47
3978a85K79R6j80pR4j99L05q5j3k45M77k61n11O33J17j72Mp3l4L4k48rK46oj32
4003g5K57K31o86K66R6l43J39M81n21K79j57k87N16lo4l74K49j91K77j31j43P8
4025a06L07J07K00l86m47L45j08N7j81L77l55K65j87J47J09j75lM07n39k37O32
4046B29p7m8j39k0k35K89K60l24q1K31J34j16j31Nj94k0M65o9j91L97n27L67l07
4069a02p4K65J82m94K6N7J01m1j61J77j08J17J64L4k48N4q6m2K51%kr7J4n8L77
4094C06m30L85n17J64J25r2K49j61l11L59J66j9k00K29l05K50m69J20p7L00r3
4115b1l6m4J26p2K26J18l03l5q1K47p8o2kj6K60j62j0M6J45m2j74J52J01l51N5
$$ plain form
4140 -13 203 -16 15 -75 150 42 -182 17 151 54 77 47 -211 -170 131 206 -53 -42 22 366 -95 8 94 24
4164 24 97 30 64 293 -54 2 83 128 -261 436 196 -65 -7 173 193 24 350 -170 -4 116 -2 239 -211
4187 -211 57 98 94 -143 52 -114 103 69 60 -41 -2 -257 74 -91 -87 166 -271 440 58 -381 187 184 202 -430
4211 -430 -98 -128 167 80 -163 149 -56 -397 202 108 -30 -138 -67 14 -400 -46 22 -149 70 -5 -32 -216 -401
4234 -401 -40 -55 -149 133 -21 -276 -51 105 -173 165 31 -244 -373 -177 161 69 181 341 63 7 -35 -101
4256 -101 178 -9 223 94 337 -400 76 -259 -142 -5 -195 341 -78 186 6 -115 -265 -18 -200 233
4276 233 3 -303 39 -294 95 -38 -175 167 106 -91 -133 -52 -241 -174 150 -228 -74 -189 -258 -140 10 8
4298 8 18 -29 53 213 -302 61 108 128 122 -303 23 -2 -35 196 141 61 7 120 -82 128 -426 91 120 -250 -120
$$ packed form
4140a3K16k19L1r0K25j08k24J99J34r7K3l0k58M1L01P5k59J1O4L44m61J03Q6p0
4164B4P3o7L4K29l47N6Q1M5l89O97k40k61N8J80K0j69L26n20J66J20j18K41m50
4187b11K68M1mk37J95j66K17l4rj01L9k55L31j65MK53m37P11l82m39N68lJ8o32
4211d30L32l0K95q7k43L12k05l41N99r4j38j08P1Q1m14L54O8j71K19p5k7j84j85
4234d01L61j5r4K82j54k55K25J56k78L38j34k75j29J96L38r2J12J60k78n6m2o6
4256a01K79j87K32j29K43p37M76l35J17J37j90N36m19K64j80j21j50K47j82M33
4276B33k30l06L42l33L89j33j37L42o1j97m2Q1j89O7L24l78J54j15o9J18J50k
4298HJ0m7Q2J60n15L63M7K0om25L26k5l3K31n5q0n4J13k02K10n54N17K9l70J30
$$ plain form
4323 -120 -109 144 233 399 364 339 -15 -183 -267 -72 -221 -81 470 5 181 -123 -122 114 324 65 -308 207
4345 207 91 17 -176 -128 -346 -140 -51 126 235 -80 29 35 -92 154 350 -139 104 -425 -100 127 199 158
4367 158 112 161 87 -287 -88 184 -4 -225 -332 -84 261 92 -377 -46 38 -239 -276 125 70 -6 60 -135 -120
4390 -120 245 -7 -5 -230 -204 -151 -219 198 -249 -59 -18 46 -213 131 143 66 -172 163 -5 70 -202 120 -173
4413 -173 -136 21 40 201 -250 174 152 20 -85 148 316 -354 547 220 -17 11 111 174 250 -112 198 -77
4435 -77 -25 -8 83 -74 127 263 72 238 56 -40 131 -60 -194 -236 182 144 -255 -3 112 128 -18 -374 44
4458 44 53 -350 107 61 16 301 14 -209 59 -43 254 216 -214 128 17 49 120 20 16 -159 -114 -107 7 -276
4482 -276 -280 220 10 -21 -434 59 332 -194 57 15 -254 -195 376 184 -384 -38 13 16 110 -151 -37 402 -292
$$ packed form
4323a20J1K53Q9J66l5k5l54j68q4J95j49J40N51m65J76l04JK36K10k59l73N15
4345B07j16p4j93M8k18K06Q9J77J09l15J09Oj27K46J96m89K43n29L25K27P2m1
4367A58m6M9p4l74J99K72j88k21j07K48L45j69m69L31Q4k77l7M01n5p6O6j95J5
4390a20L65k52Kk25K6N3o8M17m47J90M1O4k59L44J2p7k38L35j68P5k72L22k93
4413a73L7J57J9J61m51M24k2j32j05K33J68o70R01l27k37K8J00O3P6l62L10k75
4435g7N2J7R1j57K01J36j91J66j82r6J71j91j34m2M18l8l99K52J15J6j46l56M18
4458D4Rm03M57m6m5K85k87k23K68j02K97l8m30L42j11L2P1j00mj75M5PJ14k83
4482b76mN00k10l1m13M93K73n26K51m2k69N9N71j92n68L46N1LR4k61J14M39o94
$$ plain form
4505 -292 -129 -81 -88 32 140 -84 194 -70 -151 132 -136 46 167 -31 51 77 -177 195 -47 56 -327 -176
4527 -176 83 -130 225 -153 -70 -36 -102 102 -56 15 138 -268 -436 -20 -61 -196 76 156 90 93 -288 -225 -58
4550 -58 -286 33 -129 -121 -131 48 -18 -67 -23 -204 -212 -293 -21 -91 30 -207 -148 100 60 264 261 203 -11 33 -101 12
4576 12 -37 -1 3 -137 -67 155 312 115 388 79 183 -29 57 179 12 56 -309 135 -6 -222 323 231 -199
4599 -199 176 81 -108 76 251 91 141 109 60 -97 -201 -324 -89 75 -45 53 -242 -56 -108 41 -80 88
4621 88 17 6 83 -69 -65 -210 229 63 145 348 -71 -69 108 -228 -239 -224 -155 -6 -41 18 101 -180 85 151 -156
4646 -156 45 207 -307 -66 71 -28 -125 -310 225 61 -51 281 41 -39 6 -122 127 -97 101 66 -24 -278
4668 -278 181 -363 -63 70 -103 225 -299 306 -116 -180 97 388 160 13 -90 -128 105 324 -33 -20 7
$$ packed form
4505b92J63M8pJ20J08k24K78k64q1K83k68J82J21j98Q2K6k54L72k42J03l83J51
4527a76K59k13L55l78Q3L4o6K04j58P1J23m06j68M16m1j35K72Q0o6Ll81O3J67
4550e8k28L19j62Qj0J79o6m9M4j81qq1K72p0J21k37N9K48m0K04ln8k14M4j34J13
4576A2m9L6Mj40P0K22J57j97K73l09J04k12Q6J22j67M4l65M44j41k16N45r2m30
4599a99L75r5j89J84J75j60N0l2m9j57j04j23K35J64j20R8k95J86n2J49j21J68
4621H8p1j1P7j52Mj45M39j66Q2K03m19KJ77l36j1J5O9J49l5N9Q3k81K65O6l07
4646a56K01J62n14K41J37r9r7j85N35j64j12L32k40q0M5j28K49k24J98l5r0k54
4668b78M59n44L00J33j73L28n24O05m22o4K77K91k28j47j03l8K33K19l57J3K7
$$ plain form
4689 7 56 -61 -278 -327 105 106 -77 40 44 -62 -115 -325 -480 140 318 196 -210 123 -33 -35 -373 -6 -109 -35
4713 -35 202 227 -81 -123 50 102 -261 -35 345 196 -141 247 -488 158 77 28 19 -158 157 -73 -456 289 -73
4736 -73 5 4 15 -242 78 -168 333 57 -59 -318 79 2 -321 -233 28 223 138 -158 -185 89 -141 57 94
4759 94 -177 -280 14 -37 -38 -44 94 29 -202 126 -29 -81 260 162 122 143 141 46 202 -3 -229 -148 76 81 14 228
4785 228 151 -243 -455 5 -191 -2 30 63 193 170 70 -64 -158 -47 -194 -18 -3 -6 -40 48 -6 34 173 -228
4809 -228 -9 -113 -142 58 101 125 69 93 -187 -142 64 133 24 -216 -23 -75 55 -222 -55 203 -174 150 117
4832 117 37 -43 -125 135 53 -98 235 -91 -4 136 -26 118 -117 -196 89 -163 -40 -150 16 -462 126 -26
4854 -26 -169 -78 -73 -16 220 21 -146 53 -86 -52 84 -120 -356 494 111 138 58 80 91 101 -71 39 -92 -147
$$ packed form
4689GM9j17k17m9M32Jj83J17Mj06n3k10j55O20J78j22m06L33j56kl38L67j03P4
4713c5K37K5l08m2J73N2l63K26L80j49l37L88p35O46q1m9rj77L15k30l83P45l62
4736g3P8jJ1k57L20k46N01k76j16k59L97p7l23Q8K61J95q5k96k7K74k30J98L7
4759I4k71j03K94n1joJ38o5k31L28j55n2L41r8m0K1kr5J56k05k26Q1K24No7K14
4785B28p7l94k12M60j96J89L2L3J30k3j00j34r4J11j47J76J5ll4Q8n4M0J39m01
4809b28K19j04k9K00M3K4n6K4k80M5K06O9j09k40J93n2J30k77J67K58l77L24l3
4832A17q0q0q2K60q2j51L33l26Q7J40j62J44k35p9K85k52J23j10J66m78N88j52
4854b6j43R1NN7K36j99j67J99j39L4J36k04k36Q50l83K7q0K2J1J0j72J10j31n5
$$ plain form
4878 -147 73 36 87 -110 44 2 -64 -206 -35 410 -187 -99 28 -19 255 226 521 129 69 203 202 -172 -212 70
4902 70 -142 -241 191 20 317 316 158 139 58 -171 199 98 210 153 -34 21 66 -50 -101 -330 235 61 30 80
4926 80 49 199 -93 93 -117 -87 -76 -262 -166 103 -41 242 -109 -287 137 12 -114 102 99 -130 -219 -351 41
4949 41 -197 -265 219 -259 -214 -234 99 148 -31 48 193 197 -265 69 105 19 147 -71 -42 269 -181 38 186 -78
4973 -78 -192 4 37 251 -100 -55 145 105 -99 131 131 245 -57 -272 103 -107 -182 -255 -179 -237 56 -136 49
4996 49 18 -112 387 -81 -40 279 300 49 -241 -63 26 80 -261 -178 428 253 -111 -216 63 174 -122 72
5018 72 47 164 -5 -124 -130 58 145 10 -89 -274 -83 23 82 -46 136 168 -31 -179 356 -254 1 76 46
5041 46 -90 -25 44 -43 113 -77 -205 -98 29 94 169 69 52 54 46 114 112 310 31 -1 114 36 -82 179 -127
$$ packed form
4878a47K20l7N1j97J54m2o6j42J71M45n97Q8J27m7K74k9K95l92o0J34jl74m0K82
4902G0k12r9M32j71K97jj58j9q1k29L70j01J12n7j87N5M5j16n1k29N65j74l1N0
4926H0l1J50k92J86k10L0J1j86R6K69j44K83l51j78M24j25j26K16lk29q9j32L92
4949D1k38o8M84m78M5k0L33M9j79P9J45Mm62L34L6q6J28k18K9L11m50K19J48k64
4973g8j14J96L3K14l51M5K00m0k04K30%J14l02k15L75k10p5p3P6n8K93j92J85
4996D9l1j30M99m68M1L19K1k51k90J78Q9N4l41Q3O06j75l64j05K79J11k96J94
5018G2k5J17j69j19oJ88Q7j35r9j85J91J06N9j28J82L2j99j48N35o10K55P5l0
5041D6j36O5O9q7J56j90j28J07J27O5P5j00j7KqO8kJ98k79l2J15p8j18K61l06
$$ plain form
5066 -127 387 155 -190 418 101 77 -219 146 -214 -154 337 135 130 -90 -68 16 40 -53 -1 129 86 116 40 -19
5090 -19 -256 274 -239 -32 28 -38 8 12 176 115 184 141 -142 471 -179 -210 -167 71 -1 78 158 29 -16 -71 -81 -205
5116 -205 119 -456 -217 -107 -471 111 -146 178 80 -238 -118 209 -189 -118 -73 -90 -19 158 -23 -85 274 175
5138 175 13 93 -33 189 -292 33 -40 87 17 -48 234 -32 -272 37 -133 15 172 250 -15 -331 14 -282
5160 -282 253 -226 -61 -76 -132 -233 48 -41 -7 -1 5 150 -150 117 -175 -272 46 -283 -145 -74 49 169 -151
5183 -151 240 -101 -273 269 399 11 44 31 -85 -28 12 125 280 46 -133 -123 -227 95 -166 -13 -52 44
5205 44 77 402 309 139 229 148 -102 160 314 -25 1 12 67 101 -232 -18 -121 -210 68 -99 386 -73 -84 103
5229 103 206 335 -251 306 169 -234 -161 264 -139 -62 -69 124 224 -69 186 112 37 -233 83 -49 -38 -30 239
$$ packed form
5066a27N14k32l45O08l17k4k96L65l60O0M91k02nk20K2Q4K4r3N2J30m3L0p6n9
5090a9k37N30n13K07O0o6M6MJ64o1O9m3k83O13o50l1M3K38p2P9Q0j29m5n5j0j24
5116b05L24n75K39J10l64N82k57L24r8l18J20L27l98P1M5j7P1J77j81o2L59r9
5138A75j62Q0j26K22m81L25p3J27p0o5K82k66k40L09j70J48J57P8k65l16L45k96
5160b82N35m79J65j5n6j01K81q9L4OOJ45l00K67k92r7L18l29J38P1J23J20l20
5183a51L91l41j72N42J30l88L3j3j16N7M0J13J55k34j79J0j04L22k61J53l9R6
5205D4L3L25r3j70R0q1k50K62J54l39K6J1N5L4l33K14j03q9K78j67M85m59j1J87
5229A03J03J29n86N57j37m03P3M25m03P7pJ93J00k93K55p4p5k70L16j32J1QK69
$$ plain form
5252 239 144 -274 -152 75 -268 -490 -107 -26 56 -43 84 -119 76 -208 -60 -162 242 236 -165 -42 76 106
5274 106 264 245 -135 210 -174 226 470 -47 -221 126 489 -34 43 36 137 -101 -40 -12 -207 81 -165 -189
5296 -189 -157 27 -251 108 166 -259 318 148 26 43 -252 -2 -390 -132 -167 243 -134 -400 -282 347 -337
5317 -337 51 69 -199 332 22 -174 -51 -121 -85 -59 331 5 -147 33 43 160 39 -1 -304 44 -305 118
5339 118 52 275 -313 -224 132 53 62 -55 76 -42 335 -2 474 -11 144 331 -153 -170 262 310 -104 -53 196
5362 196 -318 -300 36 -83 -120 31 250 174 102 84 398 126 75 37 -90 -172 -24 -31 261 49 132 15 -264 181
5386 181 57 308 108 26 238 -147 -157 60 13 -87 -109 197 -29 -203 146 226 -148 54 -87 8 -46 307
5408 307 40 -24 -142 199 -19 -72 123 159 -57 -78 -51 102 -21 31 -247 65 -98 -142 168 -111 -22 145 148
$$ packed form
5252B39r5m18J22K27l43k22L83Q1Q2r9J27k03J95k84J48j02M04om01J23J18L0
5274A06J58j9l80L45l84M00K44n17j74L47L63n23P7pJ01k38O1K8j95K88k46k4
5296a89L2J84k78L59N8m25N77j70j22J7k95K50l88K58l5M10l77k66J18O29o84
5317c37L88J8k68N31l10j96J23p0L6K6L90l26j52J80J0J17j21m0l03L48l49M23
5339A18o6K23n88Q9L56p9Rj17J31j18L77l37M76m85J55J87m84j7M32M8m14N1K49
5362A96n14J8L36j19l7J51K19p6p2j8L14k72n1l8j27q2J48pK92k12Q3j17k79M45
5386A81j24K51k00q2K12l85j0K17m7j00k2L06k26j74L49Q0l74K02j41R5n4L53
5408C07k67o4j18L41k18n3J95L6k16k1K7J53j23N2k78L12j63m4L10k79Q9J67L
$$ plain form
5431 148 -31 -40 -21 -48 -132 43 -106 -31 -119 -221 -27 -338 -4 204 10 -195 17 34 -155 -205 50 -3 -44 -45
5455 -45 30 -310 -11 -219 -44 29 -121 -177 -414 -244 -217 50 229 -88 129 -27 -23 239 99 -162 -136 -84 -158
5478 -158 -35 -126 144 -159 161 -157 43 -219 -161 123 -9 76 43 -254 160 23 56 104 138 -71 266 91
5500 91 74 228 33 -112 -234 -158 275 -237 -261 -43 235 3 259 290 -85 -254 98 132 -147 209 -359 -170
5522 -170 277 4 159 32 -119 -177 -163 75 195 190 42 161 185 -97 269 -169 -3 -20 -424 -246 -129 87
5544 87 23 170 59 332 -252 -262 -235 311 -195 257 170 -276 197 8 138 -84 -91 -14 168 -33 -106 215 256
5567 256 -170 -59 -132 206 50 -1 312 -25 49 -28 -48 -83 45 279 -83 280 -45 -203 -325 -56 -242 70
5589 70 -179 -1 -18 64 19 -164 187 -117 -285 -126 36 116 -115 219 -315 -40 239 49 -158 25 -245 -215
$$ packed form
5431A48j79rJ9k7q4J75j49P5q8j02J94l11L34K08j94k05K12J7j89n0K55n3m1j
5455d5P5l40K99k08J75P3j50n6k37J70K7K67J79l17K17j56MK62j40k61K6N2p4
5478a58J23r1K70l03L20l18K00k62N8K84j32Q5l3k97M14j37L3M8L4k09L37j75
5500I1j7J54j95j45j22P6M33n12k4K18K78k32K56L1l75j69L52L4k79L56n68J89
5522a70M47k73J55j27j51n8J4K38J20nj48J19K4k82L66m38J66j7m04J78J17K16
5544H7o4J47j11K73n84j0K7N46n06M52q7m46M73j89J30k22pP7J82k01p3L21M1
5567B56m26J11p3L38j56n1L13l37P4p7k0l5J28K34l62L63l25j58j22K69j86L12
5589G0k49J78j7Q2m5j83L51l04j68J59J62Q0k31L34n34K75K79j90k07J83k70L0
$$ plain form
5611 -215 52 443 11 107 -45 -57 -209 -199 -1 -71 -184 119 -241 59 143 -121 45 -23 94 -91 318 -169
5633 -169 9 -82 8 -66 248 -181 -225 299 -84 262 187 -102 -170 74 -98 -357 66 -266 359 -310 -110 -84
5655 -84 95 -117 -139 -29 -95 -71 96 -85 251 -316 213 -214 -203 236 86 -380 -217 -48 401 72 -138 -131
5677 -131 -2 -8 -253 314 -98 149 -428 181 -228 111 99 -21 -275 178 -108 241 -138 298 -52 -178 126
5698 126 54 -184 15 -86 -373 96 212 189 -95 514 63 269 34 -321 -55 156 509 186 42 -126 11
5719 11 -17 -67 -386 -190 -1 -76 204 268 -254 -47 -27 70 -69 -118 -105 -20 129 -107 -223 -110 -80 7 105 104 82
5744 82 -290 134 95 39 112 320 -93 -22 -138 390 -72 -88 108 128 -37 8 147 41 69 220 -102 -260 10
5767 10 -138 31 102 344 9 68 165 -77 -5 39 -149 -100 187 32 -203 -264 -45 248 61 -72 138 93 -104
$$ packed form
5611b15K67L91m32R6j52j2j52J0J98p0j13L03l60L00Q4k64J66o8J17j85M09m87
5633a69J78r1R0p4L14m29m4N24l83L46p5k89o8K44j72k59M23l32O25o69K00K6
5655h4J79k12k2J10o6K4J67j81L36n67N29m27J1M39j50m66J63J69M49l29k10P
5677a31J29ok45N67m12K47n77O09m09L39j2j20k54M53k86L49l79M36l50j26L04
5698A26p2k38J99j01k87M69J16k3k84O09m51K06k35l55K66K11L53l23j44j68J37
5719A1k8n0l19J96J89p5K80O4n22K07K0R7j39m9J3Q5J49k36j16J13L0Q7R8jk2
5744H2l72M24l9n6P3K08m13P1j16N28m62j6J96K0j65M5J39j06K8J51l22j58K70
5767A0j48J69P1K42l35N9R7k42P2M4j88M9K87j55k35o1K19K93j87j33K10m5j97
$$ plain form
5790 -104 -202 237 -57 -18 165 -87 108 143 286 -142 12 141 18 -43 -300 132 -97 -223 240 360 173
5811 173 -221 -320 243 -38 -52 -157 -216 -26 -389 222 87 -65 -454 -9 -115 102 169 93 279 -132 -366 94
5833 94 17 -24 262 -54 -11 34 -3 125 224 -54 -65 40 -176 -43 -9 99 17 112 186 357 -41 -103 163 -111
5857 -111 -96 -95 -234 -185 14 72 -74 -41 -265 -209 10 126 -148 -197 278 -61 -101 -304 284 152 136 32 279
5880 279 -152 -182 -444 -104 -84 1 178 -97 77 285 261 -82 325 348 -219 20 -344 -42 146 -39 97 -46
5902 -46 135 -593 -99 -70 155 38 225 123 -185 236 -167 103 -69 -460 -46 -167 137 217 -213 255 116
5923 116 194 -121 170 -47 174 319 -138 35 119 -20 -178 111 -100 -318 -212 502 -17 -12 -7 80 -70 -166 -233
5946 -233 148 -60 -238 306 -55 -309 -255 -284 269 228 -132 -88 -142 -19 144 -48 -366 86 97 -98 0 -47 -320
$$ packed form
5790a04r8M39k94L9J83k52J95L5J43m28J54J29j23o1k57M32k29j26M63J20j87
5811A73l94r9N63k81j4j05n9J90l63O11j35j52l89M45j06K17O7p6J86m11k34M60
5833I4p7m1K86l16M3M5l7J28R9k78j1J05k16J33L4J08q2R5P4J71l98o2K66k74
5857a11J5Jj39M9J99N8j46L3k24N6K19J16k74m9M75l39m0k03N88j32j6j04K47
5880B79m31l0k62L40K0Q5J77k75J74K08k4l43M07K3n67K39l64L02J88j85J36j43
5902d6J81p28M94K9K25j17J87j02l08M21m03K70j72l91M14j21L04Q0m30M68j39
5923A16P8l15K91k17K21J45m57J73Q4j39j58K89k11k18J06P14n19NNQ7j50r6o7
5946b33L81k08j78N44l61k54N4k9N53m1l60M4n4J23J63j92l18M52J1j95R8m7k73
$$ plain form
5969 -320 -21 -67 -524 80 -295 96 157 273 -18 142 223 -335 -214 -75 -181 39 151 -60 -332 111 205
5990 205 27 316 -10 4 -250 -304 -174 101 177 -409 58 203 152 266 -24 -30 92 -3 108 149 140 -197 -202 -251
6014 -251 19 137 -226 80 -66 -9 293 -250 -325 77 33 421 -244 129 128 -216 -96 -77 37 82 158 -179 -88
6037 -88 -197 35 387 -177 208 -266 189 26 -32 -243 345 90 44 -103 -182 -215 75 150 103 -117 -255 147
6059 147 -89 -174 28 -8 -133 103 95 -181 135 -121 154 -50 -277 12 -80 161 53 499 -292 169 -350 64
6081 64 -92 -298 -222 -110 131 261 15 -47 29 147 -65 -368 -44 -182 80 275 -64 9 -2 65 0 -263 -74
6104 -74 -407 -176 191 6 -52 42 -11 112 -75 -107 68 -137 -34 169 -151 -184 187 54 246 -271 223 120
6126 120 -24 222 -43 51 -136 66 -154 4 166 68 45 -54 322 -141 -85 -227 -142 68 -19 496 51 -163
$$ packed form
5969c20K99m6m57O04l75L91O1J16k91J60Q1n58J21J39j06K20J12k11k72M43R4
5990B05j78K89l26J4k54n4J30K75P6n86M67J45n1J14k90oJ22r5J11M1rl37nm9
6014b51K70J18l63L06j46N7L02n43p5M02m4L88o65L73jl44J20J9J14M5P6l37R1
6037h8j09K32L52n64L85m74M55j63n8k11N88k55m6j47p9l3K90P5m7k20j38M02
6059A47k36q5K02l6j25K36qk76L16k56K75k04k27K89r2K41j08M46p91M61n19M14
6081F4j56k06P6J12K41J30k46o2P6J18k12l03L24j38K62J95l39P3j1O7o5k63J89
6104g4l33K31L67j85n8R4n3J23j87l2J75k05J03K03l20l3L71j33J92n17M94j03
6126A20j44K46k65R4j87K02k20J58J62r8k3r9L76m63N6j42Q5K10q7N15m45k14
$$ plain form
6148 -163 -140 180 -156 53 -170 -206 -41 -90 145 -327 147 -75 -325 335 41 200 162 163 111 131 -56 -148 -141 -147
6172 -147 40 330 77 54 52 -12 145 -144 2 84 296 46 -387 -162 -92 -105 -52 55 -110 23 48 125 226
6195 226 50 106 270 39 150 -185 -7 -102 229 239 114 115 -244 112 -16 -161 -90 -100 -131 195 -14 227 -39
6218 -39 -233 -19 82 130 -62 -68 -223 93 108 47 -219 72 552 19 -5 210 144 119 119 68 78 -19 301 35 -491
6243 -491 -7 -110 277 -123 166 161 244 67 102 -67 56 194 156 59 13 -28 316 -409 287 -179 -56 -156 -191
6266 -191 -180 -39 527 117 60 -289 212 -149 256 -4 -36 -229 -151 -187 -6 258 -17 -116 131 -162 -215 -208 175
6289 175 183 -19 -190 187 -174 60 0 -124 -46 -50 -172 -230 55 104 66 67 -75 100 -144 4 -51 -172 271 68
6313 68 -16 -193 -75 128 -278 -93 203 106 9 -79 196 13 259 -155 -61 -163 -107 -69 95 289 -208 -96 12
$$ packed form
6148a63K3L20l36K09k23l6J65m9K35m72M74k22k50O60k94J59l8Jn2K0j87r2Po
6172a47J87K90k53k3ko4J57k89J46Q2K12k50m33K25P0j3N3J07j65J33K5P7J01
6195B26j76N6J64k31J11l35J78r5L31J0j25Jl59L56j28j45P1j0l1L26k09K41k66
6218c9j94K14J01M8j92oj55L16J5o1k66K91M80n33k4K15o6k5%n1J0r7L20k66n26
6243d91M84j03L87m00K89nQ3j77L5j69J23J38l8r7m6m1L44p25O96m66J23j00l5
6266a91J1J41N66m10n7l49N01l61M05k60l2j93P8l6J81K64k75r9K47k93n3PL83
6289A75Qk02j71L77l61K34o0j24P8mj22n8K85M9l8Jj42J75k44J48n5j21M43k03
6313F8q4j77J18K03m06J85K96r7r7q8K75j83K46m14R4j02N6L8J64J94m97J12J08
$$ plain form
6336 12 -29 1 -88 210 219 -12 146 -242 383 -129 -62 194 -163 172 18 327 92 81 -24 54 204 1 47
6359 47 -371 -57 316 59 -77 163 -67 -214 -160 31 -72 -110 -327 0 -98 -117 242 -196 -177 202 -30 -119
6381 -119 39 -140 240 -100 -47 146 47 -23 71 -99 -36 38 106 -301 -270 279 -72 -46 44 90 -277 228 111 376
6405 376 263 -9 20 -84 -65 -187 52 105 -90 -177 36 -22 207 -268 -72 -14 -378 134 101 189 56 -157 184
6428 184 92 -408 130 -83 296 40 -200 209 204 241 15 253 227 -146 -178 14 109 -250 -62 225 118 -107
6450 -107 13 -355 -18 -38 -22 -142 -58 273 248 444 66 200 337 56 85 -251 92 -251 -72 201 -147 18
6472 18 48 143 -195 -35 -43 -111 -331 161 -125 -47 -42 -114 171 81 298 82 54 496 104 -56 -48 48 11 85 -164 183
6498 183 228 -68 -61 248 108 -285 -5 -86 -39 57 102 225 184 -169 251 78 -264 -108 -44 -68 194 195 -87 -89 115
$$ packed form
6336A2m1L0q9K98Rk31J58l88O25n12O7K56l57L35j54L09k35j1j05P8J50k03M6
6359D7m18L14L73k57j36K40k30j47N4J91j03l8k17L27r8j9L59m38J9L79k32q9
6381a19J58j79L80l40N3J93r9p0R4j70O3P4O8m07L1N49l51K6R0M6l67N05j17K65
6405C76j13k72K9j04J9j22K39N3j95q7K13n8K29m75J96N8l64N12l3Q8j33k13L41
6428A84r2n00N38k13L79k56k40M09nL7k26K38k6l73l2J92R5l59J88K87j07k25
6450a07J20l68L37k0J6j20Q4L31k5J96l78J34J37k81K9l36L43l43J79K73l48J65
6472A8L0R5l38J60qo8k20M92k86P8Np2K85r0K17k16k8M42l92j60QR6l7P4k49L47
6498A83M5k96PL09j40l93K80q1M7R6M5J23m1l53M20j73l42J56O4k4K62Jk82kK04
$$ plain form
6523 115 174 -262 -57 270 -266 145 -248 75 233 -55 172 -62 -95 127 -205 -97 -115 -202 269 25 -95
6544 -95 -68 180 -196 -271 -58 -199 -90 -59 -64 -231 133 168 -185 175 -48 57 336 161 -32 -298 182 -229
6566 -229 318 160 -5 66 -58 -79 -187 -232 -308 -410 88 211 -20 77 -181 302 1 175 -248 -63 250 -125
6588 -125 -55 205 34 -311 -245 -253 276 185 185 -34 -100 99 -348 51 281 -11 -35 71 -210 48 -75 85 238
6611 238 -67 116 188 6 154 222 8 -80 -262 -108 -18 -257 -114 -63 -215 140 89 118 82 -300 -81 -125 238
6634 238 -151 -151 374 313 356 201 24 -78 -72 -83 -199 -67 -83 97 126 106 67 149 174 112 49 28 -31 -194 -220 -36
6660 -36 -172 77 -58 -132 -18 78 -30 44 63 72 198 -56 32 315 2 199 160 -188 117 354 -265 81 29
6683 29 71 -77 -27 37 173 -51 -84 43 -49 21 31 211 -145 133 133 -138 80 -29 -128 21 67 208 29 -27
$$ packed form
6523A15N9m36K05L27n36M11l93L23J58k88K27k34l3K22l32J08j8q7M71k44j20
6544i5K7K48l76p5K13j41J09L1nj67L64L5l53L60k23J05K79j75j93k66M80m11
6566b29N47j58j65P1j24k1j08m5p6j02M98J23k31R7k58M83l01J74m23J85L13l75
6588a25P0K60j71l45O6qN29r1%k19o6J99m47L99K30k92k4J06k81K58j23J60J53
6611B38l05J83P2j82J48O8k14q8j82J54R0k39J43N1j52L55n1K9l6l82K19m4L63
6634B38l89%N25o1M3j55j77j02Oj1j16J32j6J80K9k0l9Q2K5o2o3k1n9j63k6J84
6660c6j36K49j35p4J14R6j08P4J9RJ26k54Q8K83l13J97l9l48L05K37o19L46n2
6683B9M2j48N0O4J36k24l3J27r2P0J0J80l56K78%k71K18j09r9J49M6J41j79n6
$$ plain form
6707 -27 -22 1 -274 -7 -40 6 -152 17 295 -55 -69 282 -192 -198 69 85 121 -121 -55 104 347 -57 -11 -39 -249
6732 -249 -106 69 -232 -234 -89 -157 -41 76 -12 -10 310 -42 -6 3 -77 -111 41 108 -11 -163 -42 -13 -30 88 -349
6757 -349 282 29 221 -60 -297 116 -158 69 -69 154 -181 -128 -37 116 -27 -36 106 -333 10 -292 174
6778 174 -214 -98 88 -116 44 154 -315 85 143 -173 160 246 -64 60 -185 101 -41 84 -106 55 130
6799 130 -153 163 -238 137 -132 -78 -125 49 5 -141 51 -72 147 215 225 28 -7 95 -159 32 291 394
6821 394 30 38 -270 -174 281 -274 0 -94 -50 185 167 6 -106 71 -42 -88 71 -307 -45 -81 131 106 -160
6844 -160 263 -281 -196 -75 74 -114 -157 -37 71 42 -213 44 2 113 -226 35 462 141 -133 14 -145
6865 -145 95 116 28 28 -110 -115 38 -186 141 -389 -98 -157 -132 -106 -79 47 -197 241 213 -147 76 78 -25 -31 -10
$$ packed form
6707b7NK3k75K67l3M6j58J69K78l50j4L51m74oK67J6L6k42O6J59K43m04M6k8k10
6732b49J43J75l01kJ45o8J16J17q8KL20l52L6Rq0l4J52O7j19j52J21K9j7J18m37
6757c49O31k53J92k81k37M13k74K27j38K23l35N3R1J53j43rJ42m39L43l02M66
6778A74l88J16J86k04J60J10m69M00N8l16L33Q6l10J24k45K86j42J25j90J61P5
6799A30k83L16m01L75k69N4m7J74m4j46J92j23K19O8J0j97l5J02k54J91K59J03
6821C94l64Ql08R6M55n55K74r4M4K35j8j61j12J77j13m6J59l78K62l6K12k5k66
6844a60M23n44Q5J21J49j88m3J20J08k9k55K57m2J11l39K61M27l21k74J47j59
6865a45K40K1q8%j38nJ53k24L27n30K91n9K5K6K7J26k44M38k8l60K23Kj03oK1
$$ plain form
6890 -10 114 154 -79 158 -128 -22 174 193 401 -113 91 179 27 -82 -57 -44 251 -86 93 -70 89 79
6912 79 -231 86 -150 55 139 231 77 216 128 -159 -81 158 -8 57 161 -255 -137 269 30 -227 167 -186
6934 -186 -13 -315 175 32 95 -75 213 -67 184 -87 115 -51 -73 95 -129 -332 -193 -319 -397 -169 227
6955 227 -43 270 -72 136 -3 -201 209 32 61 77 -123 -123 -205 134 193 -163 -251 -20 -182 -67 -386 -73
6977 -73 42 -18 -149 -14 122 102 92 -374 -270 252 279 -99 -46 439 -1 56 256 299 -25 125 -253 -37 6
7000 6 67 -202 118 142 -139 365 -64 53 48 67 180 -124 -244 -299 166 -153 -271 317 -331 102 -151 -15 -251
7023 -251 -355 -101 177 -33 268 147 54 45 -216 6 -156 -71 -197 21 338 -7 23 118 162 -151 -19 319
7045 319 227 -186 69 -215 -195 -275 27 263 130 216 -119 -403 55 -108 -95 -44 -83 171 71 50 48 -27 143 189
$$ packed form
6890a0J24M0k33K37k86J06J96J9K08n14K04Q8j52j09K5J3K95l37J79j63J59j0
6912G9l10L17k36K05Q4R2j54J39q8k87P8K39j66O5J04m16J18M06k39k57L94l53
6934a86J73l02M90j43O3j70K88k80K51k71K02j66k2J68k24k03J39j26p8K28L96
6955B27k70L13l42K08j39j98M10j77K9J6k00%q2L39N9l56q8K31j62J15l19L13
6977g3J15o0j31J35J36k0j0m66J04N22K7l78N3M85m40N7K00M3l24J50l78K16M3
7000FO1k69L20K4k81N04m29J17nJ9J13l04j20n5M65l19j18N88o48M33k53J36k36
7023b51j04K54K78k10L01j21r3rk61K22j62Q5j26K18L17l45L0R5M4l13J32L38
7045C19r2m13K55k84K0q0L02K36j33Q6l35k84M58j63J3N1l9K54j00k1kp5J70M6
$$ plain form
7069 189 -350 37 96 174 42 -78 -123 64 -99 98 -395 -304 85 -249 26 -177 16 318 -138 -65 -224 203
7091 203 312 -81 -157 -344 7 -34 -42 98 180 -2 147 8 -197 -312 -306 80 263 120 -155 -93 -32 104 -22
7114 -22 -39 -137 -105 11 -312 353 191 -184 21 -36 -166 -167 -115 -285 -132 -131 154 -62 -220 -193 -110 -23 -98 52 173
7139 173 175 -27 161 139 9 70 54 0 -227 183 46 86 -43 -59 -6 -47 -215 -180 -103 8 -175 -322 125 -259
7163 -259 -91 -4 29 28 -50 60 157 -116 -188 17 -50 263 -133 -13 -6 268 144 153 339 -140 23 149 10 143
7187 143 -74 201 -80 19 231 186 187 -68 142 -214 151 -156 157 -51 61 -210 -201 -268 93 177 -70 129 -49
7210 -49 96 72 -51 12 188 -14 343 197 -164 -127 -158 -185 33 234 103 -106 92 60 62 -65 107 132 -217
7233 -217 93 376 12 -145 -51 -84 16 -218 73 245 64 229 88 -137 -182 -252 333 -208 -60 87 -405
$$ packed form
7069A89n39L87N9P8j32j20m5J87j63J97m93R1L89l34K75k03J93L02m56P3j59M27
7091B03J09l93p6j87L51m1qJ40Q2j82J49j39k05j15OL86J83j43k75O2O1J36j26
7114b2j7r8L2J16l23O65j62l75K05n7j30jN2j70J53JK85k16j58K7Q3Q7p5J50J21
7139A73Kk02J88k2j30O1j6n4k27M10j37M0j29j6N3m1j68L5P7J11j83j47M47l84
7163b59J68Q7L3jp8J10R7k73p2K05o7L13l96J20PK74j24RJ86m79J63J26j39J33
7187A43k17K75k81R9K12m5Jk55K10l56L65l07L13k08J12k71Ro7L61Q4k47J99j78
7210d9J45k4j23O3J76k02L57j46l61L7l1k7K18K01j31k09J98l2Kj27J72K5l49
7233b17L10K83l64j57R4l3J00k34K91J72j81J65j41k25m5p0N85n41J48J47m92
$$ plain form
7254 -405 212 44 -179 97 300 16 140 -183 -36 -113 -64 -1 -191 -147 114 -42 71 103 5 -173 -34 119
7276 119 197 -70 -25 -214 73 -168 -279 144 -133 278 129 -127 -35 -64 296 178 10 -198 189 -85 -77 43
7298 43 81 -219 199 23 208 -53 -22 -92 -2 178 -167 242 -87 -105 117 0 8 -70 126 331 61 -120 89
7321 89 290 -93 19 33 12 -40 257 -54 -12 -270 -17 -52 -87 -106 10 -43 -289 -3 -227 -124 106 -77 -281
7344 -281 50 376 87 -331 -266 206 37 -91 53 106 -402 -127 91 34 -106 -284 -431 71 57 93 -6 140
7366 140 169 55 -109 181 -81 78 178 -34 111 176 -261 67 -137 -168 -145 -88 -106 64 62 39 -247 286 16
7389 16 145 -50 308 62 248 -15 193 -192 -55 -71 96 -327 -31 110 130 -196 -201 -257 241 -198 234 -479
7411 -479 -164 233 -28 69 -56 46 147 -41 -216 -89 -59 200 138 -87 2 -1 36 -205 -352 120 82 -18 47
$$ packed form
7254d05O17j68k23K76K03k84J24l23J47p7M9O3j90M4K61j56J13L2r8j78J39J53
7276A19P8k67M5j89K87k41j11M23k77M11j49k56R2k9L60j18j68k08L87k74QJ20
7298D3L8l00M18j76J85k61L1p0R0J80l45M09l29j8K22j17Qp8J96K05k70j81K09
7321H9K01l83J12J4k1n2K97l11M2k58K53l5l5j9J16n3k46K86k24J03K30j83k04
7344b81L31L26k89m18O5M72j69j28J44N3n08K75K18n7j40j78j47N02j4L6r9J46
7366A40K9j14j64K90k62J59J00k12J45O5m37L28k04l1K3N7j8J70kk3k86N33k70
7389A6J29j95L58k46J86k63K08l85J37j6J67m23K96J41K0l26nn6M98m39M32p13
7411d79L15L97k61R7j25J02J01j88j75J27L0K59o2k25Q9lL7k41j47M72l8j00O5
$$ plain form
7434 47 111 9 -249 45 57 -79 -125 86 44 -137 -197 13 139 104 34 -175 186 78 8 -155 -105 -173 -145 285
7458 285 220 -30 -6 -189 -37 -324 -48 122 -160 -47 -154 79 -138 280 -190 44 191 132 -108 -132 -331
7479 -331 6 246 -110 246 154 -145 96 -113 164 286 429 -270 19 -47 18 227 23 -120 35 31 126 -145
7501 -145 247 131 -240 89 -115 154 125 -326 95 87 211 -268 -50 -338 -127 61 -84 146 -25 -8 -98 -74
7523 -74 140 54 -25 27 66 133 99 -141 73 290 199 7 280 66 -129 -116 133 -270 -232 149 121 -80 138 -227
7547 -227 -73 -31 198 -130 194 -27 28 159 9 319 -114 -91 196 225 -21 -237 -57 -107 94 88 40 19 -56
7570 -56 -110 -214 222 -67 -154 54 249 182 196 107 -208 -17 -32 -76 -287 225 75 -141 115 -49 -213 -113 -82
7593 -82 7 65 88 111 -73 44 202 131 29 35 178 -55 101 -311 141 22 -402 -155 125 162 -77 -24 -104 -152
$$ packed form
7434D7O4j02k58K94J2j36m6K11m2j81o0K10J26l5p0k09L61j08p0j63N0o8K8M30
7458B85o5k50K4j83J52k87K76J70k82J13j07K33k17M18m70K34J47n9k40k4j99
7479c31L37K40l56L56r2k99K41k09K77J22J43o99K89o6O5K09k04j43J55mR5k71
7501a45L92j16l71L29k04K69k9m51M21qJ24m79K18k88K11J88j45K30j71J7r0K4
7523g4K14q6p9N2L9O7l4k40K14K17r1j92K73k14j95J3K49m03L8L81k8k01K18l65
7547b27J54M2K29l28L24k21N5J31j50L10m33K3K87K9k46k16J80n0K01om8k1p5
7570e6n4j04M36k89q7K08J95o7J4q9l15J91j5m4k11N12j50k16K56j64j64J00L1
7593h2Q9N8K3K3j84J17J58p1j02OJ43k33J56m12M52j19m24K47K80L7k39N3q0m8
$$ plain form
7617 -152 -195 278 73 134 -148 -76 -92 -74 43 122 -324 10 146 -100 2 -299 181 94 3 -66 48 251 72
7640 72 106 237 -64 -50 -61 247 -4 86 38 121 24 143 81 184 253 -116 -114 -259 181 -216 -175 -512 -210 79
7664 79 -305 -139 126 -26 -79 -34 -111 -209 21 -98 -219 11 58 10 194 -50 155 75 -148 -11 97 69 114
7687 114 -206 12 363 113 508 192 -19 -167 72 -102 229 -62 271 -77 270 -43 -102 33 67 -196 -130
7708 -130 48 159 -32 -330 -118 -98 -204 305 -46 8 215 12 201 -230 77 41 -44 -48 204 -290 16 132
7730 132 158 -174 -165 -344 -27 134 102 -23 -40 77 117 -210 -26 -74 3 -243 -88 -10 83 114 45 241 -98 113
7754 113 136 -177 -164 0 -44 43 116 -356 258 -344 136 215 -241 -132 -22 -282 -26 160 55 220 52 297
7776 297 42 75 19 17 49 255 -37 -104 123 93 -61 -241 -309 -175 169 -89 -258 153 24 178 158 -113 -146
$$ packed form
7617a52m3M73k05O1k82P2j6J8J17P9m46L34J36k46J02l01M80q7r1o9J14K03j79
7640G2L4J31l01J4j1L08k51R0m8Q3r7J19o2J03O9l69Kj45M40l97M1l37L02K89
7664G9l84J66K65j52n3M5p7r8K30j19j21K30M7m8J84k44K05q0k23J37J08k8M5
7687A14l20K18L51k50L95l16k11j48K39j74L31k91L33l48L47l13n9J35L4k63O6
7708a30J78J11j91k98K12K0j06N09l51N4K07k03J89m31L07l6q5mK52m94L06J16
7730A32K6l32Rj79L17J61l2j25j7J17M0l27J84m8P7k46J55P8R3L1o9J96l39K11
7754A13K3l13J3J64m4Q7P3m72O14o02M80P9m56J09J10k60K56J86j05J65j68K45
7776B97k55L3n6kL2K06k92o7K27l0j54j80o8J34L44k58j69M11j29J54k0k71l3
$$ plain form
7799 -146 248 210 -88 180 -20 161 -61 -5 -250 -64 88 12 14 15 99 51 40 31 -155 -61 8 146 153 -93 98
7824 98 44 -199 -253 -90 -363 -211 -196 74 -178 -65 4 295 531 13 90 -141 -87 66 102 27 217 -261 437
7847 437 -202 -383 154 293 142 -45 -69 -28 -322 87 78 146 -278 83 -80 -131 184 -4 234 -12 181 -159
7869 -159 21 232 -99 370 -151 -7 -223 220 -64 -106 276 -67 -27 199 -16 -46 -214 -5 -79 -57 -188 -195
7891 -195 89 -162 179 -118 106 23 226 257 -118 -169 -107 3 94 292 -138 145 -5 -157 -86 -53 -47 -99 69
7914 69 -3 1 53 -9 -74 182 62 -173 -40 -124 -22 175 -141 -89 -154 64 -19 158 375 61 75 -53 -325 -204
7938 -204 163 -137 -333 -271 -52 -114 16 395 -245 249 -138 43 339 90 -181 -165 -127 -10 15 153 262 -67
7960 -67 219 -108 -157 86 -1 166 -44 -174 335 -17 45 144 -56 194 -1 172 -141 -123 35 -18 -211 -17
$$ packed form
7799a46L94l8k98K68k00J81k22N6k45J86J52p6KJQ4m8j1rj86R4O9J38Pk46J91
7824I8n4k43n4J63k73J52J5K70k52J13O9K91K36n18P7k31N4J53L6p5J90m78O98
7847D37o39j81N37J39j51j87k4M1k94M09rO8m24L61j63n1L15j88K38k46J93l40
7869a59J80K11l31M69n21J44k16M43k84m2L82l43M0K26k15l0j68K09p4K2j31p
7891a95K84k51L41k97K24q3K03L1l75n1O2J10R1J98m30K83j50j52P1L3On2J68
7914F9p2MN2o2o5K56j20k35J33q4J02J97l16N2o5K18q3J77K17l14J4j28k72J21
7938b04L67l00j96O2K19o2J30L79o40M94l87J81K96k49k71J6L8J17K5J38J09l29
7960f7K86l27m9K43q7J67k10j30N09l52O2R9k00K50j95J73l13J8J58n3j93J94
$$ plain form
7982 -17 72 -81 -83 146 -24 -97 -107 102 -373 -127 -40 200 188 -44 206 149 414 138 -202 -158 -317 59 -137
8005 -137 -290 -88 -22 57 191 307 94 128 -175 0 190 106 151 70 -319 -90 51 -136 101 88 141 245 182
8028 182 21 96 170 -447 -42 40 17 148 53 223 -399 261 -41 -13 12 -342 -73 120 -8 -126 148 -325
8050 -325 -275 -184 7 -71 -60 183 110 263 72 -66 480 -88 -11 189 -3 134 327 144 85 22 214 249 52
8073 52 -9 30 -144 58 176 -216 1 -52 30 118 183 -50 -53 -287 50 253 216 50 -256 519 291 141 -231
8096 -231 -6 158 -145 44 4 -57 63 -147 103 71 294 145 167 92 -119 70 158 -290 -256 -48 52 137 102
8119 102 241 -16 -231 -64 -102 -86 314 206 55 -195 359 -91 -366 7 328 -108 -304 -50 264 107 299
8140 299 -334 111 55 -36 -25 -46 143 41 -72 1 6 -313 180 55 247 157 -106 128 20 100 -19 -112 150
$$ packed form
7982a7Q9j53kK29j70p3j0K09m75K46Q7K40j2k32K50n7K65k76l40M4j59L76j96
8005a37j53K02O6P9J34J16k13L4l03J75J90q4M5q1l89K29J41j87K37j3N3J04o3
8028A82j61P5P4o17M05Q2k3J31r5J70o22O60l02K8K5l54K69J93j28j18K74m73
8050c25N0R1J91p8J1K43p3J53j91j38N46n68P7K00j92J37J93j83n9o3J92L5j97
8073E2o1L9j74K02J18l92K17n3Q2Q8O5k33lk34L37K03l7j66l06P75k28j50l72
8096b31K25J64l03J89m0o1J20k10K50l2K23j49K2p5k11J89Q8m48L4K08J00Q5l5
8119A02J39k57k15J67l8J6M00j08j51k50N54m50k75L73L21m36j96K54L14j57J92
8140B99o33M45n6r1J1k1J89j02j13P3Nl19M93j25J92r0k63K34j08Q0j19r3K62
$$ plain form
8163 150 66 -81 -197 -20 -171 -286 -159 181 286 -492 -164 390 -158 281 103 -311 -207 160 2 188
8183 188 -15 -49 -117 -338 132 123 -47 -19
$$ packed form
8163A50q4j47j16J77j51j15J27L40J05p78L28N54n48M39j78m14J04L67j58J86
8183A88k03l4o8k21M70rj70K8
8191a9
$$ Imaginary data points
##PAGE= N=2
##DATA TABLE= (X++(I..I)), XYDATA
$$ plain form
0 0 0 0 0 0 0 0 8 -8 8 -8 16 -16 24 -29 32 -40 48 -57 72 -81 96 -112 129 -149 172 -197 224 -255 288 -326
30 -326 367 -414 462 -517 578 -644 716 -795 882 -978 1084 -1200 1329 -1472 1630 -1809 2011
47 2011 -2239 2504 -2808 3170 -3604 4136 -4810 5689 -6895 8662 -11500 16830 -30334 138524
61 138524 185608 -146499 -171669 -18742 113022 76395 41025 -1472 -44548 -58182 18670
72 18670 63488 35177 -16868 -24840 -33309 -20736 32595 70635 7659 -66498 -45040 31647 45379
85 45379 15499 -2677 -15578 -33339 -800 57840 45370 -31252 -47904 11091 38313 2684
97 2684 -7460 19808 9065 -35803 -28641 26399 44074 7465 -22972 -26796 -18407 4142 33612
110 33612 26899 -15805 -32279 -5332 13343 2325 333 14916 9582 -14872 -17020 5322 15709
$$ packed form
0@%%%%%%Qj6J6j6K4l2M0n3O1p2Q8j05J29j53J77k08K41k78L21l69M21m79N43o14
30c26O93p81Q76r79J095j222J360j511J677j860K062k284K529k801L102l439L820
47B011m250M743n312N978o774P740q946J0499j2584J5557k0162K8330m7164J68858
61A38524M7084l32107k5170J52927J31764l6627l5370m2497m3076j3634P6852
72A8670M4818k8311n2045p972q469J2573N3331L8040o2976p4157K1458P6687J3732
85D5379k9880j8176j2901j7761L2539N8640j2470p6622j6652N8995K7222l5629
97B684j0144K7268j0743m4868P162N5040J7675l6609l0437l824Q389K2549K9470
110C3612o713m2704j6474K6947J8675j1018j992J4583n334k4454k148K2342J0387
$$ plain form
123 15709 10839 5456 -4570 -18194 -7749 21693 22820 -10132 -21663 3882 16705 -2873 -12278
136 -12278 5455 13480 -3754 -11988 193 6830 148 -1690 1727 -1081 -3429 3536 6259 -4690
150 -4690 -9869 2522 11604 3380 -7220 -6087 -134 3240 5258 2399 -6124 -7642 2254 6265 -3281
165 -3281 -6300 4223 6453 -7487 -13672 422 12256 3789 -8307 -6592 51 784 -567 733
179 733 -28 -1761 -1133 732 -1866 -3196 1284 4746 707 -4426 -3189 1373 2687 1616 -976 -2461
195 -2461 -727 2769 2428 -2893 -3842 2454 5062 -2153 -6338 -308 5705 1251 -4932 -2853 2472 2119
211 2119 -1450 -2064 -429 1173 553 14 -1430 -1841 148 2236 860 -1982 -1779 439 1230 514 -302
228 -302 -864 402 1017 118 -1937 -1669 1872 2571 -1662 -3930 -719 3058 634 -3252 -2134 1104 1527
$$ packed form
123A5709m870n383j0026j3624J0445K9442J127l2952j1531K5545J2823j9578r405
136a2278J7733Q025j7234q234J2181O637o682j838L417k808k348O965K723j0949
150d690n179J2391R082q224j0600J133N953L374K018k859q523j518R896M011r546
165c281l019J0523K230j3940o185J4094J1834q467j2096J715O643P33j351J300
179G33p61j733O28J865k598j330M480L462m039n133J237M562J314j071k592j485
195b461J734L496l41n321r49O296K608p215m185O030O013m454o183K079N325l53
211B119l569o14J635J602o20n39j444m11J989K088j376k842K03K218P91p16q16
228c02n62J266O15q99k055K68L541O99m233k268L211L777k424l886J118L238M23
$$ plain form
245 1527 -1193 -2126 -322 1102 788 -431 -985 -691 621 788 -101 -1187 -596 971 1121 -121 -368
262 -368 242 641 722 -154 -653 -48 1157 1256 -913 -2074 366 2067 205 -1862 -1197 1141 1068 -746
280 -746 -1301 91 955 464 -786 -794 -102 751 764 -204 -865 -332 704 577 -485 -318 399 936 409 -484
300 -484 -666 -8 1123 474 -1052 -998 520 1200 -205 -903 -181 764 699 -531 -504 379 1090 -47 -583
319 -583 -359 291 476 108 5 -673 215 399 -229 -207 -193 43 -48 197 -479 -222 378 590 254 -570 -137
340 -137 563 459 -374 -810 -162 677 -62 -1114 -172 312 687 66 -511 -249 42 365 47 -330 108 537
360 537 193 38 -573 -171 -320 -188 -169 -366 -290 341 285 -238 -517 -240 525 230 -184 -427 74 606 -78
381 -78 -366 -297 297 402 -523 -447 8 114 -82 -196 -54 -76 240 121 8 225 52 68 46 -86 -151 259 -49
$$ packed form
245A527k720r33J804J424l14j219n54K94J312J67q89j086N91J567J50j242k47
262c68O10L99Q1q76m99O05J205R9k169j161K440J701j862k067O65K338p3j814
280g46n55J392Q64m91j250qO92Q53J3r68o61N33J036j27j062J67P17N37n27q93
300d84j82O58J131o49j526N4J518O80j405o98P22R45o5j230K7Q83P11j137n36
319e83K24O50J85l68j03o78Q88J84o28K2J4K36r1K45o76K57O00K12l36q24M33
340a37P00j04q33m36O48Q39p39j052R42M84L75o21n77K62K91L23l18l77M38M29
360E37l44j55o11M02j49J32J9j97P6O31n6n23k79K77P65k95m14k43N01N32o84
381g8k88O9N94J05r25P6M55J06j96j14J42k2L16j19j13K17j73J6k2j32o5M10l08
$$ plain form
404 -49 306 -212 -574 -6 250 173 -360 -196 -41 477 267 -66 -435 567 202 -299 -132 235 217 -207 -268
425 -268 -149 155 -12 137 -143 -266 81 -69 -246 -15 160 -41 86 -69 -272 -50 -48 69 -391 14 126
446 126 75 -116 -32 -97 -9 -66 0 -440 170 104 273 -34 -339 174 173 80 77 -95 -98 228 -46 -21 -57 -45 106 273
472 273 6 -181 31 255 45 -111 -385 -7 -7 79 -52 -315 -6 190 87 79 -258 15 120 -75 93 84 -54
495 -54 -86 36 -178 11 -75 103 200 34 -96 89 16 -296 -99 -39 -97 215 127 -125 188 168 73 -168 -88 -39
519 -39 -194 340 -423 -60 194 144 -74 87 24 -126 3 184 260 6 94 30 -118 32 -201 164 -258 204
541 204 154 -99 -100 87 201 270 -57 53 264 -25 261 152 -117 -16 -197 -181 236 258 -143 -26 -122 123 98
564 98 62 4 235 61 -244 -157 -127 -225 7 -207 53 45 -66 40 -28 28 302 59 18 54 -165 -7 139 327
$$ packed form
404d9L55n18l62N68K56p7n33J64J55N18k10l33l69J002l65n01J67L67j8m24o1
425b68J19L04j67J49k80j23L47j50j77K31J75k01J27j55k03K22KJ17m60M05J12
446A26n1j91Q4o5Q8n7O6m40O10o6J69l07l05N13jr3lj72lL26k74K5l6J2J51J67
472B73k67j87K12K24k10j56k74L78%Q6j31k63L09J96j03ql37K73J05j95J68rj38
495e4l2J22k14J89q6J78R7j66j30J85p3l12J97O0n8L12q8k52L13k0r5k41Q0M9
519c9j55N34p63L63K54n0k18J61o3j50J29J81P6k54Q8o4j48J50k33L65m22M62
541B04n0k53jJ87J14O9l27J10K11k89K86j09k69J01j81J6M17K2m01J17r6K45k5
564I8l6n8K31j74l05Q7L0r8K32k14K60qj11J06o8N6K74k43m1L6k19J58J46J88
$$ plain form
588 327 249 52 -4 -105 145 -26 -132 246 -158 98 -264 -73 92 109 -218 163 180 -96 200 90 122 176
610 176 151 161 78 97 -116 56 -5 -277 125 -66 97 -145 8 -7 169 208 -75 -59 265 -56 204 -21 -276
633 -276 135 119 83 -39 80 -173 -191 68 2 70 -259 -28 -13 360 -134 72 -207 170 127 -217 -240 118 287
656 287 -225 -113 -441 -69 -46 139 -81 -157 109 -189 -69 -187 63 -114 -20 5 -59 98 -140 -233 -65 129
678 129 -402 252 -236 -126 51 223 220 -249 -74 -108 -149 231 209 -175 -79 -24 233 389 109 63 378 -218 -508
701 -508 -210 252 -13 -157 -9 260 -317 -102 -190 71 -338 -124 208 -147 -294 347 60 168 -26 6 330
722 330 -155 268 -112 188 -56 29 -267 -239 -209 165 183 0 166 -48 84 165 116 70 -194 -64 84 -65 -41
745 -41 152 -23 212 -39 -58 37 23 -45 226 -188 -67 207 -19 121 -448 -45 -300 -6 153 -81 -21 2 54
$$ packed form
588C27p8j97n6j01K50j71j06L78m04K56l62J91J65J7l27L81J7k76K96j10L2N4
610A76k5J0q3J9k13J72o1k72M02j91J63k42J53j5J76L9k83J6L24l21K60k25k55
633b76M11j6l6j22J19k53j8K59o6O8l29K31J5L73m94K06k79L77m3l44k3L58J69
656B87n12J12l28L72K3J85k20p6K66k98J20j18K50j77R4K5o4J57k38r3J68J94
678A29n31O54m88J10J77J72lm69J75l4m1L80k2l84R6N5K57J56k80m6L15n96k90
701e08K98M62k65j44J48K69n77K15q8K61m09K14L32l55j47O41k87J08j94L2L24
722C30m85M23l80L00k44Q5k96K8L0L74J8j83J66k14J32Q1m9m6k64J30J48j49K4
745d1J93j75K35k51j9R5j4o8K71m14J21K74k26J40n69M03k55K94J59k34O0K3N2
$$ plain form
768 54 218 143 42 33 -67 -35 134 -190 203 -53 26 -12 -104 -119 -359 304 -51 -93 20 225 119 250 209 -67
792 -67 -224 -32 -75 -75 -70 34 -83 134 1 -178 -176 -41 1 -135 80 -199 263 49 255 188 -112 6 -136 -52
816 -52 138 -14 214 -35 -245 134 -37 -112 -122 -171 -218 12 64 339 79 -277 188 404 -11 -223 149 -177
838 -177 -379 -7 -97 -69 -69 104 69 75 -140 -8 243 -9 -68 -19 -71 197 -242 35 -115 279 19 -129 -197 -185
862 -185 -138 43 -124 13 -183 217 -13 -44 -62 215 75 -122 -145 360 -57 72 236 -4 184 -12 223 -38
884 -38 86 -170 -206 -108 143 16 -336 -436 96 -67 54 88 381 249 17 172 -176 -63 289 72 -166 103
906 103 -229 75 99 -94 -164 -92 -95 90 50 -56 -16 -390 97 89 -24 -148 -340 -210 240 -101 -211 83 -57
929 -57 8 357 146 -35 9 61 -167 -183 -30 -409 32 176 -19 399 -29 227 34 -255 -4 -76 -53 -176 -6
$$ packed form
768E4J64p5j01rj00L2J69l24L93k56P9l8r2j5k40O63l55m2J13K05j06J31m1k76
792f7j57J92m3%NJ04j17K17j33j79KJ35M2j36K15k79M62k14K06o7l00J18j42Q4
816e2J90j52K28k49k10L79j71p5j0m9m7K30N2K75k60l56M65K16m15k12L72l26
838a77k02L72r0K8%J73l5Ok15J32K51k52n9M9n2K68m39K77j50L94k60j48o8J2
862a85M7J81j67J37j96M00k30l1j8K77j40j97k3N05m17J29J64k40J88j96K35k61
884c8J24k56l6R8K51j27l52j00N32j63J21L4K93j32k32J55l48J13L52k17k38K69
906A03l32L04K4j93p0P2lJ85m0j06M0l74M87qj13j24j92J30M50l41j10K94j40
929e7O5L49k11j81M4N2k28j6J53l79M41J44j95M18m28K56j93k89K51p2K3j23J70
$$ plain form
952 -6 -134 -102 -190 -158 198 230 225 -5 -54 -150 94 233 203 32 -72 -266 -261 43 -422 -52 158 -225 -7 -279 -109
977 -109 -35 256 72 -212 191 -20 -49 -49 316 134 82 106 -11 -27 136 -81 95 -114 -171 77 -52 55 56 159
1001 159 208 55 95 112 -30 -156 -210 124 289 -26 67 46 179 93 4 158 -189 -189 136 125 -220 11 -34 382
1025 382 -72 288 85 -399 436 143 -196 -11 36 162 179 -53 163 48 384 223 146 5 231 186 38
1046 38 156 -82 -377 -78 98 -154 187 132 -221 109 167 -131 65 -154 99 221 30 -57 -32 -168 58 246
1068 246 -33 132 69 -9 -8 -187 275 -84 -75 -145 -30 -145 19 -146 -383 -50 20 -29 224 5 238 123 155
1091 155 -321 -80 303 209 -117 -36 -178 54 179 63 96 -290 159 -414 253 -156 80 -314 66 -111 -273
1112 -273 59 325 -31 80 192 -88 -59 -120 163 -125 206 -36 -245 -28 198 -65 230 33 -348 73 182
$$ packed form
952fj28L2q8L2L56L2nk30m9r6K44J39l0j71j04j94NL04m65L70K10l83K18k72J70
977a09P4K91j84k84M03k11k9%L65j82n2K4j17j6J63k17J76k09n7K48j29J07JJ03
1001A59M9j53M0J7j42j26n4L34J65l15R3k1J33q6q9J54l47%L25j1l45K31m5M16
1025C82m54L60k03m84Q35k93l39J85M7J26J7k32K16j15L36j61p7j41K26m5j48
1046C8J18k38k95K99J76k52L41n5l53L30N8k98J96k19K53J22j91q7K5j36K26J88
1068B46k79J65o3p8Jj79M62l59Rp0J15j15J64j65k37L33P0m9K53k19K33j15L2
1091A55m76K41L83r4l26Q1j42K32J25j16L3l86M49n73O67m09K36l94L80j77j62
1112b73L32K66l56J11J12k80K9o1K83k88L31k42k09K17K26k63K95j97l81M21J09
$$ plain form
1133 182 -65 93 -437 -23 -438 69 -152 30 204 -80 -20 308 -38 134 210 -117 368 0 203 331 -305
1154 -305 -117 -246 371 188 11 241 38 122 -235 213 52 414 -66 120 -116 39 222 -70 -136 -37 25
1175 25 -276 -26 10 403 -214 -28 100 -160 161 -239 27 168 60 -407 -60 270 139 -69 53 248 32
1196 32 -77 35 100 -51 412 72 -201 -98 253 -103 12 -46 -207 -17 24 -71 -72 242 18 205 -34 168
1218 168 -166 -253 -719 -147 1 154 98 -96 -254 -117 -227 -215 -172 -203 -1 163 -48 -33 29 -430 327 91
1240 91 313 -261 -73 87 -99 -188 122 5 -73 -39 -142 -8 83 318 231 -103 18 95 -5 162 44 404
1262 404 126 88 -84 46 -191 -130 328 74 -95 206 19 -10 -46 83 -226 0 -377 -137 34 0 -134 -129
1284 -129 -158 -306 -97 -24 220 -40 -46 -113 -309 155 -34 -49 -116 -196 2 -162 8 10 143 -11 243 -171 59
$$ packed form
1133A82k47J58n30M14m15N07k21J82J74k84O0L28l46J72P6l27M85l68K03J28o36
1154c05J88j29O17j83j77K30k03Q4l57M48j61L62m80J86k36J55J83k92o6R9O2
1175B5l01K50L6L93o17J86J28k60L21m00K66J41j08m67L47L30j31k08J22J95k16
1196C2j09J12O5j51M63l40k73J03L51l56J15n8j61J90M1r5jL14k24J87k39K02
1218A68l34q7m66N72J48J53n6j94j58J37j10J2M3l1K02J64k11J5O2m59P57k36
1240I1K22n74J88J60j86q9L10j17p8L4j03J34R1K35q7l34J21P7j00J67j18L60
1262D04k78l8j72J30k37O1M58k54j69L01j87k9l6J29l09K26l77K40J71l4j34N
1284a29k9j48K09P3K44k60oo7j96M64j89j5o7q0J98j64J70KJ33j54K54m14K30
$$ plain form
1307 59 215 -91 -48 -191 -346 370 -118 -178 353 79 -91 -12 241 -111 295 289 218 -302 -50 107 -156 -160 -258
1330 -258 338 -246 22 177 3 16 -124 9 163 -141 167 109 -10 -225 335 -99 -384 -44 160 -182 -277
1351 -277 -15 84 144 -183 -251 -32 188 91 347 23 56 -175 71 -232 87 -87 -62 11 -450 -129 -232 -255 -215
1374 -215 214 -50 -109 214 152 -463 -158 -247 181 -88 31 -27 10 -3 132 113 25 -151 -92 326 -192 -327 -372
1397 -372 51 -83 -86 -97 103 -93 24 -109 127 122 366 203 35 -137 -438 81 -18 157 122 177 72 -131 -42
1420 -42 -51 244 -67 -176 45 50 -21 77 73 -32 27 -122 44 -29 280 243 -99 -248 -105 81 96 -242 -200 85 19
1445 19 -225 35 0 -151 -156 179 15 122 -124 -24 -246 -183 45 194 -117 12 90 71 134 157 -49 96 165
1468 165 187 415 69 -29 27 319 -85 -225 -12 38 133 234 126 -48 24 97 -106 -200 13 -412 -194 188 13
$$ packed form
1307E9J56l06M3j43j55P16m88o0N31k74j70P9K53l52M06op1n20K52J57k63mr8
1330b58N96n84K68J55j74J3j40J33J54l04L08n8j19k15N60m34k85L40K04l42r5
1351b77K62R9O0l27o8K19K20r7K56l24L3k31K46l03L19j74K5P3m61L21j03k3M0
1374b15M29k64n9L23o2o15L05q9M28k69J19n8L7j3J35j9q8j76N9M18n18j35m5
1397c72M23j34lj1K00j96J17j33K36nK44j63j68j72l01N19r9J75l5N5j05k03Q9
1420d2rK95l11j09K21Np1R8mj05N9j49J66p3L09l7l42j49J43J86J5l38M2K85o6
1445A9k44K60l5j51nL35j64J07k46J00k22O3K28J49l11J29P8j9O3K3k06J45O9
1468A65K2K28l46r8N6K92m04j40K13N0R5J01j08j74P2P3k03r4K13m25K18L82j75
$$ plain form
1491 13 21 -128 -318 -28 -178 -54 -175 -150 93 -206 31 157 -45 -138 -4 19 152 13 339 -389 -232 -121
1513 -121 -60 -170 -29 -265 -31 -92 -18 -186 130 20 -449 -108 230 364 -206 205 63 -29 3 -87 101 -58
1535 -58 -9 -8 157 -186 -42 -58 -97 167 -207 -142 -72 191 -68 -156 -88 -271 136 -50 -58 -61 -258 -215 11 55 -117
1560 -117 381 -25 -27 -381 172 217 -213 197 -43 84 -118 -199 -2 80 181 104 -26 -30 -117 224 -150 60 -104
1583 -104 127 65 11 -104 -227 -153 -26 -121 49 339 -157 333 -31 -151 117 -30 87 13 -31 -48 265 229 -6
1606 -6 -43 -325 -193 138 -12 1 129 -10 106 -37 -141 -18 136 220 377 102 -92 24 37 111 83 -66 144
1629 144 -229 -64 -8 43 -41 -273 -255 193 -178 -70 128 95 -143 -193 -153 46 -88 161 1 -19 89 17 190
1652 190 -134 219 -2 -94 -147 -188 82 92 33 -108 -31 132 -189 18 81 -11 180 12 74 -40 151 98 307
$$ packed form
1491A3Qj49j90K90j50J24j21K5K43k99K37J26k02r3J34K3J33j39L26p28J57J11
1513a21O1j10J41k36K34o1P4j68L16j10m69L41L38J34n70M11j42r2L2r0J88j59
1535e8M9JJ65l43J44j6l9K64l74O5P0K63k59q8O8j83M07j86qlj97M3K26M4j72
1560a17M98m06kl54N53M5m30M10k40J27k02q1J97Q2J01p7j30mq7L41l74K10j64
1583a04K31o2n4j15j23P4J27r5J70K90m96M90l64j20K68j47J17p4m4j7L13l6k35
1606fl7k82J32L31j50J3J28j39J16j43j04J23J54Q4J57k75j94J16J3P4k8j49K10
1629A44l73J65N6N1q4k32J8M48l71J08J98l3k38n0M0J99j34K49j60k0J08p2J73
1652A90l24L53k21r2n3m1K70J0n9j41P7J63l21K07O3r2J91j68O2j14J91n3K09
$$ plain form
1675 307 338 -77 -133 -153 125 139 48 -412 152 -118 -35 -41 -92 -13 220 -34 36 -127 -152 34 -237 -232 144 -223 -215
1700 -215 132 -64 375 17 199 114 228 148 -30 123 -59 46 291 -36 -18 0 -64 328 -113 -219 -75 269
1722 269 120 126 26 132 143 307 -158 115 27 -198 111 119 199 101 -113 121 80 -113 28 -57 -293 -93 43
1745 43 134 193 116 -168 148 -79 130 161 -248 -362 -1 54 -442 50 -124 235 217 -91 166 -54 78 420
1767 420 -297 -221 -63 225 -126 -27 -111 29 221 -156 -19 -238 -187 217 -184 -192 -33 -44 -56 -155 280 -22 -141
1790 -141 55 -381 21 129 -329 21 236 175 -271 -134 -52 -58 -109 54 119 -167 -92 -73 12 -321 -73 350 65
1813 65 -55 303 68 -85 -161 -139 357 238 172 -88 97 242 121 -173 -1 8 -234 -107 37 -173 113 -105
1835 -105 169 -349 47 -161 337 -125 -84 -403 -68 -38 -378 -127 -74 62 317 144 -144 -50 64 174 141 -344
$$ packed form
1675C07L1m15n6k0K78J4r1m60N64k70Q3on1P9K33k54P0j63k5J86k71NL76l67Q
1700b15L47j96M39l58J82q5J14q0j78J53j82J05K45l27J8J8o4L92m41j06J44L44
1722B69j49Oj00J06J1J64m65K73q8k25L09QQ0r8k14K34m1j93J41q5k36K00J36
1745D3R1N9p7k84L16k27K09L1m09j14L61N5m96M92j74L59j8l08K57k20J32L42
1767D20p17P6J58K88l51R9q4J40J92l77J37k19N1M04m01qJ59j1j2r9M35l02j19
1790a41J96m36M02J08m58L50K15o1m46J37Q2on1J63O5k86P5J9Q5l33K48M23k85
1813F5j20L58k35j53p6K2M96j19o6k60J85J45j21k94J72Rk42J27J44k10K86k18
1835a05K74n18L96k08M98m62M1l19L35L0l40K51N3J36K55j73k88R4J14J10l3m85
$$ plain form
1857 -344 -166 -286 32 -215 264 -142 -208 -169 -136 55 50 191 247 299 -207 53 71 -203 72 44 -132 116 163
1880 163 -35 -177 63 -53 6 -4 -126 156 -59 -141 93 4 -168 345 -32 -71 -433 64 276 -167 -111 138
1902 138 157 -48 93 -253 257 -258 17 -104 51 184 -246 214 -106 103 7 -87 -200 115 75 -13 48 328
1924 328 -314 183 17 227 -210 -21 -66 -116 194 23 55 263 126 -179 -107 -256 4 -110 -101 -113 -2 -30 166
1947 166 28 42 -315 34 -134 -45 -44 -82 -29 173 -241 -177 -83 -29 147 -136 -193 252 -111 14 209 -219 54
1970 54 -143 -161 181 43 -239 -23 -120 -33 150 89 -61 -82 -225 -166 78 -45 95 105 23 53 209 344 9
1993 9 68 -108 -23 35 3 56 202 -363 33 -57 -280 124 -348 8 42 -103 120 -197 -8 85 42 -49 26 -31 -169
2018 -169 -331 -183 -69 -27 -254 -70 302 -29 -54 -67 124 170 42 193 199 115 72 111 -34 33 -213 140 119 14
$$ packed form
1857c44J78j20L18k47M79m06o6L9L3J91nJ41N6N2n06K60J8k74K75k8j76K48M7
1880A63j98j42K40j16N9j0j22K82k15q2K34q9j72N13l77l9l62M97K12m43N6K49
1902A38J9k05J41l46N10n15K75j21J55J33m30M60l20K09r6r4j13L15m0q8O1K80
1924C28o42M97j66K10m37J89m5n0L10j71L2K08j37l05P2j49K60j14Rj2J11k8J96
1947A66j38J4l57L49j68Q9Jl8N3K02m14O4R4N4J76k83n7M45l63J25J95m28K73
1970E4j97j8L42j38k82K16r7Q7J83o1j50k1j43N9K44j23J40J0q2L0J56J35l35
1993IN9j76Q5N8l2N3J46n65L96r0k23M04m72L56L4j45K23l17J89R3m3r1P5n7j38
2018a69j62J48J14M2k27J84L72l31k5j3J91M6j28J51Oq4m3L9j45O7k46L53k1j05
$$ plain form
2042 14 -104 -66 -154 102 62 163 162 -126 239 -73 38 210 69 -285 -276 -123 28 16 -160 2 -23 -168 160
2065 160 154 -185 -127 20 258 -357 -62 44 120 221 -194 169 145 0 -177 382 -137 -178 -175 -187 -41 213 -148
2088 -148 181 212 -50 68 -215 -35 -147 -196 -90 -18 327 172 -22 238 -210 -5 -25 121 119 -41 -170 165
2110 165 -113 174 0 40 108 261 -135 -33 74 160 -186 11 -322 318 7 6 -86 171 166 -74 -28 -231 69
2133 69 82 -46 251 17 -249 -44 -153 353 -52 62 69 86 -248 -322 -66 -87 15 34 -35 132 53 124 157 -27
2157 -27 -99 199 88 -11 46 -292 -317 -102 368 73 -33 27 21 10 59 -193 185 225 -123 -229 126 -2 17 -220
2181 -220 70 -34 -60 87 -269 136 255 -125 207 4 -68 295 111 -29 176 -55 -85 216 -138 26 -72
2202 -72 -186 -201 169 112 1 25 61 271 45 105 72 253 48 -74 176 17 45 37 -8 -201 -82 104 31 -23
$$ packed form
2042A4j18L8q8K56m0J01jk88L65l12J11J72j41l54RJ53J51j2j76J62k5j45L28
2065A60ol39N8J47K38o15K95J06P6J01m15L63k4j45j77N59n19m1Lj2J46K54l61
2088a48L29L1k62J18k83J80j12m9J06P2L45j55j94K60m48K05k0J46kj60j29L35
2110A65k78K87j74M0O8J53l96J02J07Q6l46J97l33O40l11jr2K57nk40M6k03L00
2133F9J3j28K97k34k66K05j09N06m05J14PJ7l34p4K56k1J02J9o9J67p9P1L3j84
2157b7p2K98j11r9N7l38k5K15M70k95j06O0oj1M9k52L78M0l48j06L55j28J9k37
2181b20K90j04k6J47l56M05J19l80L32k03p2L63j84j40K05k31l0L01l54J64r8
2202g2j14j5L70n7j11K4L6K10k26O0l3J81k05j22K50j59K8qm5j93J19J86p3n4
$$ plain form
2226 -23 -175 -79 193 -130 34 240 123 272 73 -349 -174 90 256 -99 -211 23 -387 165 188 60 -335
2247 -335 203 -63 -165 -155 247 -61 -189 -62 -82 5 -11 -27 135 68 -187 40 -199 28 100 274 28 146
2269 146 -131 53 -208 -243 -74 -216 282 -143 21 -13 -86 278 167 89 -120 139 13 131 -186 131 -25
2290 -25 75 -114 352 -264 66 -93 34 -110 8 66 81 134 -120 -220 -110 85 77 -171 29 72 151 6 -195
2313 -195 -41 -155 -143 -205 -158 33 3 -124 -23 165 4 -153 14 -100 177 -51 -62 -138 4 -97 129 -58
2335 -58 116 -89 -127 -89 108 -175 -96 130 222 -44 84 -75 23 -53 70 -36 -147 206 206 -88 -82 -179 -378 -216
2359 -216 163 -53 92 -334 -120 -135 212 25 -183 82 -126 103 -126 327 262 78 -161 -54 -263 -29 -103
2380 -103 88 -34 201 141 -152 -10 126 102 113 -411 227 -105 112 -16 -71 -142 236 102 -338 -44 -237 -140
$$ packed form
2226b3j52R6K72l23J64K06j17J49j99m22J75K64J66l55j12K34m10N52K3j28l95
2247c35N38k66j02J0M02l08j28J27k0Q7j6j6J62o7k55K27k39K27P2J74k46J18
2269A46k77J84k61l5J69j42M98m25J64l4p3L64j11p8k09K59j26J18l17L17j56
2290b5J00j89M66o16L30j59J27j44J18N8J5N3k54j00J10J95qk48K00M3P9j45k01
2313a95J54j14J2o2M7J91l0j27J01J88j61j57J67j14K77k28j1p6J42j01K26j87
2335e8J74k05l8L8J97k83P9K26R2k66J28j59R8p6J23j06j11L53%k94Or7j99J62
2359b16L79k16J45m26K14j5L47j87k08K65k08K29k29M53o5j84k39J07k09K34p4
2380a03J91j22K35o0k93J42J36k4J1n24O38l32K17j28n5p1L78j34m40K94j93R7
$$ plain form
2402 -140 -78 -103 181 -17 100 75 112 -409 -317 67 45 368 -211 223 316 184 -95 278 89 -20 -278 59
2424 59 45 134 247 -155 -130 0 180 174 58 -116 131 -35 81 -221 4 180 69 -1 -276 236 -153 296
2446 296 -82 71 -34 22 173 -143 -14 -282 -85 -186 -249 -38 -279 61 86 14 -233 -219 60 -204 -172 61
2468 61 143 -295 -152 -81 224 38 -175 -101 -160 141 268 -47 316 -195 309 -206 -19 355 14 -30 49 -214
2490 -214 -67 -38 410 31 -168 6 256 -299 172 -62 114 54 -84 243 59 121 65 157 -245 -6 120 -233
2512 -233 -122 -178 -69 179 16 120 -45 29 -99 -62 103 -182 21 -320 63 317 141 -144 -65 -30 -333 257
2534 257 130 -668 -78 -142 -54 53 107 15 159 -159 11 -167 140 94 90 198 -354 -108 136 -130 179 -108
2556 -108 3 174 110 -120 -445 -58 -201 141 289 -85 -99 174 14 144 254 107 252 24 -107 181 55
$$ packed form
2402a40O2k5K84j98J17k5L7n21R2L84k2L23n79M34R3j32k79L73j89j09k58L37
2424E9j4Q9J13m02K5J30J80oj16j74K47j66J16l02K25J76j11p0k75N12l89M49
2446B96l78J53j05N6J51l16J29k68J97j01o3K11k41L40K5p2k47J4K79k64L2K33
2468F1Q2m38J43P1L05j86k13P4n9L01J27l15L63n11N04n15J87L74l41m4P9k63
2490b14J47K9M48l79j99J74K50n55M71k34J76o0j38L27j84O2n6R2m02K39J26l53
2512b33J11n6J09K48j63J04j65P4j28L7J65k85K03l41L83K54j76k85P9L5l03N90
2534B57j27p98N90o4Q8J07N4r2J44l18J70j78L07m6mJ08n52K46K44k66L09k87
2556a08J11J71o4k30l25L87j43L42J48l74j4K73j60J30J10j47J45k28j31K88j26
$$ plain form
2577 55 -33 -82 79 -6 42 -22 -236 10 253 53 -1 134 9 113 100 -324 -134 -10 -279 1 -153 -94 -258
2600 -258 -24 -186 31 43 -252 217 -215 -8 -72 -97 166 115 11 -171 -166 149 -56 209 5 264 -35 186
2622 186 288 364 346 -233 116 -200 -113 -1 -45 151 312 148 252 -42 325 237 -134 172 187 -203 -144 -206 -162
2645 -162 -194 -218 -140 249 -72 19 137 37 87 389 -245 -95 -141 516 36 86 -25 -57 -99 286 -34 -264 152
2668 152 -86 98 -120 -6 -145 -84 33 73 -161 -31 8 113 -52 131 -82 84 159 -48 218 -68 134
2689 134 46 -16 139 190 81 -43 -79 -149 141 -167 224 106 59 -5 114 293 -88 4 9 -51 184 -24 46 -22
2713 -22 -388 -412 -14 123 14 15 -122 488 107 341 173 -362 -147 -74 221 -218 -182 127 4 305 -422 -117
2735 -117 -15 319 305 -128 26 -49 113 -68 17 -35 60 -9 117 -77 -25 278 -15 -130 -165 138 39 136 10
$$ packed form
2577E5q8m9J61q5M8o4k14K46K43k00n4J35j25J04j3m24J90J24k69K80j54N9j64
2600b58K34j62K17J2k95M69m32K07o4k5K63n1j04j82NL15k05K65k04K59k99K21
2622A86J02P6j8n79L49l16Q7J12m4J96J61j64J04k94L67q8l71L06J5l90N9o2M4
2645a62l2k4P8L89l21R1J18j00N0L02o34J50m6O57m80N0j11l2m2L85l20k30M16
2668A52k38J84k18J14j39O1J17M0k34J30L9J05j65J83k13J66P5k07K66k86K02
2689A34q8o2J55N1j09j24l6p0K90l08L91j18m7o4J19J79l81R2No0K35k08P0o8
2713b2l66k4L98J37j09Jj37O10l81K34j68n35K15P3K95m39L6L09j23L01p27L05
2735a17J02L34j4m33J54p5J62j81Q5n2R5o9J26j94N2L03k93j15l5L03r9R7j26
$$ plain form
2758 10 -46 146 187 -218 398 -139 -149 -191 206 -23 -86 -201 54 285 84 105 174 187 -37 -61 -35 225 -484 205
2782 205 29 230 96 -61 -66 -238 -172 135 -55 105 -128 81 -12 -22 -135 -295 -464 101 122 -192 -115 86
2804 86 -37 -360 165 160 -1 -32 -20 -95 -74 95 -112 234 -146 -95 156 -148 109 168 -126 -18 -32 -125 128 -75
2828 -75 38 63 -172 98 547 79 -33 -145 233 17 -23 217 136 190 -120 -191 -30 253 -66 -79 -110 89 302
2851 302 -302 -133 -461 7 15 366 56 340 28 -156 -84 -101 279 165 -33 181 -169 146 -79 50 240
2872 240 35 333 -308 -145 31 56 -258 174 -123 20 95 46 59 46 -191 47 279 -3 -70 -45 317 271 135
2895 135 352 -116 -102 93 -318 -168 343 -155 -5 -333 206 99 -326 -253 -96 -36 -151 -10 211 -76 275
2916 275 25 72 -284 53 252 114 -88 180 -299 -112 -6 94 -240 66 160 -37 235 -179 -307 -299 490
$$ packed form
2758A0n6J92M1m05O16n37j0m2L97k29o3j15K55K31k01K1O9J3k24k4K6K60p09O89
2782B05j76K01j34j57nj72O6L07j90J60k33K09r3j0j13j60j69N65K1l14P7K01
2804H6j23l23N25nj61l1J2p5K1J69k07L46l80N1K51l04K57N9k94J08j4r3K53k03
2828g5J13K5k35K70M49m68j12j12L78k16m0K40q1N4l10p1J61K83l19j3l1J99K13
2851C02o04J69l28M68QL51l10K84l12j84P2j7L80j14j98K14l50L15k25J29J90
2872B40k05K98o41J63J76K5l14M32k97J43P5m9J3j3k37K38K32k82o7K5L62m6j36
2895A35K17m68J4J95m11J50N11m98J50l28N39j07m25P3J57O0j15J41K21k87L51
2916B75k50M7l56L37J99j38k02K68m79J87J06J00l34L06R4j97K72m14j28QP89
$$ plain form
2937 490 -249 101 19 -185 -94 -97 -196 15 195 7 266 -62 -43 -92 251 157 -52 280 37 125 1 -158 -29
2960 -29 94 157 -46 356 -15 -1 -17 -115 181 64 -155 60 141 51 -256 69 -65 258 201 166 -297 -51 -124
2983 -124 -162 -111 -75 -117 -7 240 -87 -80 -49 -136 -55 -18 179 124 145 -192 26 67 104 87 113 -253 -231 -4 -72 334
3009 334 -87 -189 -17 172 -15 68 82 111 248 175 35 -315 -148 115 199 -97 -121 -62 -152 137 -17 173 44
3032 44 64 305 -20 138 89 74 55 -306 -49 -50 300 380 176 459 184 -249 -208 -167 -155 180 -154 49 68 201
3056 201 -297 -167 207 401 8 -74 -49 -93 -218 -247 185 273 -95 -20 -25 -189 245 178 -368 8 -62 155 37
3079 37 -242 -124 -46 -54 202 -7 17 185 124 136 231 160 22 -128 110 92 -64 90 158 135 33 -18 241 -2
3103 -2 -357 156 49 -55 315 49 -33 -181 -22 425 1 -70 62 117 125 184 142 97 -163 -117 -128 -163 171 -244
$$ packed form
2937D90p39L50q2k04R1lr9K11J80j88K59l28J9m9L43r4k09L32k43Q8j24j59J29
2960b9J23O3k03M02l71J4j6r8K96j17k19K15Q1r0l07L25j34L23n7l5m63K46p3
2983a24l8N1L6m2J10K47l27PL1q7Q1L7J97n5K1l37K18M1L7j7K6l66K2K27o8M06
3009C34m21j02J72J89j87Q3J4K9J37p3j40l50J67K63Q4k96k4N9r0K89j54J90j29
3032D4K0K41l25J58m9j5j9l61K57jL50Q0k04K83k75m33M1M1J2L35l34K03J9J33
3056B01m98J30L74J94l93q2K5m4j25k9M32Q8l68P5nj64M34o7n46L76p0K17j18
3079C7k79J18P8qK56k09K4J68o1J2R5p1j38j50K38j8j56J54O8k3j02n1K59k43
3103bl55N13j07j04L70k66q2j48J59M47m24p1J32N5QN9m2m5k60M6j1l5L34m15
$$ plain form
3127 -244 183 70 33 -101 4 158 -126 375 47 -11 -281 58 344 251 -38 -95 -14 -160 -115 256 -143 0
3149 0 -113 47 -123 -92 -268 102 20 -14 128 -112 48 -28 50 -249 64 -146 -40 232 240 -32 87 -95 141
3172 141 -59 40 64 199 -332 38 -154 4 -93 252 -41 -85 -64 -143 121 136 152 60 -249 51 117 -57 -217
3195 -217 179 213 -323 26 -100 34 231 -119 -63 -15 94 352 -288 -133 70 -103 -111 32 131 -144 39 -193
3217 -193 243 152 -118 0 -280 -10 -310 -231 218 -284 117 230 -36 -284 37 57 -58 -126 139 7 -296
3238 -296 -42 -244 251 -219 -124 360 -121 -38 -65 -153 -173 -158 236 40 39 -41 362 29 5 192 9 -46 -94 -189
3262 -189 -248 95 277 45 141 -17 -256 -580 -145 196 197 -92 -319 123 142 91 275 -505 -170 52 39 28 255
3285 255 -99 -286 -150 -153 150 122 87 37 224 227 -150 147 206 33 -254 140 -213 265 -81 -213 -186 142 -74
$$ packed form
3127b44M27j13l7j34J05J54k84N01l28n8k70L39K86r3k89n7Q1j46M5L71l99J43
3149@j13J60j70L1j76L70q2l4J42k40J60p6P8k99L13k10J06K72Qk72J19j82K36
3172A41k00R9K4J35n31L70j92J58r7L45k93m4K1p9K64J5J6r2l09L00O6j74j60
3195b17L96L4n36L49j26J34J97l50N6M8J09K58o40J55K03j73qJ43R9k75J83k32
3217a93M36r1k70J18k80K70l00P9M49n02M01J13k66k48L21K0j15o8K65j32l03
3238b96K54k02M95m70R5M84m81Q3k7q8k0J5L94j96jq0M03l33k4J87j83n5m8r5
3262a89n9L43J82k32R6j58k39l24M35L41Jk89k27M42J9n1J84p80L35K22j3j1K27
3285B55l54j87J36lL03k8l5n0J87Ll77K97N9j73k87L94l53M78l46j32K7L28k16
$$ plain form
3308 -74 -155 -315 -97 -41 305 274 -111 -13 10 290 -4 206 159 -42 117 -219 -91 20 132 184 6 -173 80
3331 80 -66 167 256 247 -122 -125 306 186 253 83 -132 -35 48 -89 166 -205 37 -1 148 128 3 207 -82 119
3355 119 121 -52 142 -210 63 24 221 -199 -97 -196 70 -54 -78 242 -243 -4 7 -31 153 -73 -21 -55 -80
3378 -80 100 -97 458 -4 311 53 -17 102 211 -180 169 103 -169 -394 137 141 16 104 -54 -82 -37 159 -132
3401 -132 5 -228 80 -272 234 -104 170 235 -306 127 54 -185 -128 -105 135 6 53 27 151 235 -22 29 -16
3424 -16 57 280 301 -353 -126 121 -186 -33 -161 -134 -73 -77 54 -18 -93 -138 -145 -17 204 324 215 367 -155 96
3448 96 -185 -249 -194 -162 -132 -226 298 -189 -31 -91 -284 -131 -252 11 -50 -248 210 -102 27 131 234 126 140
3471 140 132 44 221 68 -171 -178 -68 -2 -42 44 -278 64 20 15 -16 225 -116 104 151 130 -96 -25 -62 -116 199 -143
$$ packed form
3308g4q1j60K18N6L46l1l85R8K3K80k94K10m7k01J59l36J28J11J12N2j78j79K53
3331H0j46K33Q9rl69lM31j20O7j70k15R7Q3j37K55l71K42l8J49k0j25K04k89K01
3355A19Kj73J94l52K73l9J97m20J02r9K66j24k4L20m85K39J1l8J84k26N2l4k5
3378h0J80j97N55m62L15k58p0J19J09l91L49o6k72k25N31Mj25Q8j58k8M5J96k91
3401a32J37k33L08l52N06l38K74O5n41M33p3k39N7K3K40j29M7k6J24Q4k57N1m5
3424a6P3K23K1o54K27K47l07J53j28K7O1mJ31p2p5m5pJ28K21J20j09J52n22K51
3448I6k81o4N5L2L0r4N24m87J58o0j93J53j21K63o1j98M58l12J29J04J03j08J4
3471A40qq8J77j53k39pJ10O6m0Q6l22L42m4nl1K41l41K20M7k1k26P1l7n4L15l42
$$ plain form
3497 -143 181 113 221 -50 109 33 -177 71 -75 308 308 -320 -145 -62 190 -187 12 64 28 86 -160 58 45
3520 45 39 311 -329 106 54 57 278 128 112 127 -50 -192 74 94 62 149 180 -221 332 57 32 -35 -182 191 -193
3545 -193 -437 -254 -364 -171 -1 105 59 74 28 -208 -289 -28 101 -53 -196 -120 33 -88 -93 36 -122 -252
3567 -252 259 -258 -364 234 -107 -78 323 -229 -164 338 154 18 -86 -18 -111 96 -95 327 -28 -101 96 29
3589 29 101 -36 42 -164 171 -3 9 182 -37 -10 -224 356 -109 92 328 -57 -153 -79 -246 27 -145 -45
3611 -45 11 24 -98 -18 158 -194 15 42 -191 -51 168 -94 -67 106 52 124 -232 131 -8 -24 -98 14 -185
3634 -185 -118 307 186 33 -91 -1 32 333 -70 43 40 -112 19 137 23 7 247 -71 -80 -147 167 26 325
3657 325 52 -27 -281 50 422 -102 -259 224 -34 -84 16 285 151 -41 -9 -227 77 -16 73 165 172 -324 152
$$ packed form
3497a43L24o8J08k71J59p6k10K48j46L83%o28J75Q3K52l77J99N2l6N8k46K18j3
3520D5oK72o40M35n2LK21j50j6J5j77j42K66K0l2Q7L1m01N53k75k5o7j47L73l84
3545a93k44J83j10J93J70J06m6J5m6k36q1K61J29j54j43P6J53j21nJ29j58j30
3567b52N11n17j06N98l41K9M01n52O5N02j84j36j04O8r3K07j91M22l55p3J97o7
3589B9P2j37P8k06L35j74J2J73k19K7k14N80m65K01K36l85r6P4j67K73j72J00
3611d5N6J3j22Q0J76l52K09K7k33J40K19k62K7J73n4P2l56L63j39j6p4J12j99
3634a85O7M25j21j53j24R0L3L01m03J13lj52J31J18j14j6K40l18ro7L14j41K99
3657C25k73p9k54L31L72n24j57M83k58n0J00K69j34j92L2k18L04r3Q9R2Pm96M76
$$ plain form
3680 152 -272 39 -182 -301 -163 -11 -76 100 -60 -100 -19 -80 111 -114 -333 263 242 -149 -248 -3 -221 220
3702 220 -23 -154 -62 -62 183 -5 137 -91 -36 -66 0 -135 -161 -37 38 -111 378 327 -164 246 -51 -236 -97
3725 -97 -124 258 -206 -287 -338 74 20 -75 221 68 26 -424 165 -36 -46 127 399 179 77 108 -7 28 75 170
3749 170 -35 -76 -99 98 -250 -292 47 -68 243 111 121 274 6 150 -7 -3 137 319 -139 -146 331 -15 177
3772 177 65 170 74 -73 254 -72 188 98 212 128 114 147 45 -89 -27 -43 -56 322 67 -304 -13 312 193
3795 193 -33 -124 -145 -104 -119 64 -151 -83 -74 336 -4 -322 -9 -68 147 1 -136 256 -43 253 119 76 69 -99
3819 -99 -242 161 -218 58 153 199 122 -69 -108 188 -181 193 44 -162 -174 144 94 239 -35 -64 -72 -124 33 156
3843 156 8 -120 189 -243 192 -181 -91 -149 -123 132 -99 165 -47 146 278 19 38 149 -426 -172 -27
$$ packed form
3680A52m24L11k21j19J38J52o5J76j60m0Q1o1J91k25k19N96k1l91r9K45k18M41
3702B20k43j31R2%K45j88J42k28N5l0O6j35k6J24P5j49M89n1m91M10k97j85J39
3725i7k7L82m64q1n1M12n4r5K96j53m2m50N89k01j0J73K72k20j02L1j15L5M7R5
3749A70k05m1k3J97l48m2L39j15L11j32J0J53k68J44j57MJ40J82m58pM77l46J92
3772A77j12J05r6j47L27l26K60r0J14q4j4L3j02j34O2j6j3L78k55l71K91L25j19
3795A93k26r1k1M1j5J83k15O8RM10l40l18L13n9K15j46j37L92k99K96j34m3pj68
3819i9j43M03l79K76R5M6p7j91l9K96l69L74j49k06j2L18n0J45k74k9qn2J57J23
3843A56j48j28L09m32M35l73R0n8K6K55k31K64k12J93J32k59J9J11n75K54J45
$$ plain form
3864 -27 72 132 211 -65 -284 13 4 -140 68 -261 -42 66 10 -81 206 103 -2 -25 -181 115 133 0 2 397
3888 397 -44 -217 -133 -34 73 -156 -32 55 21 47 55 44 -93 264 198 -110 -64 -128 225 135 -193 387 577 33
3912 33 -47 -6 -97 65 110 54 -434 -318 163 74 114 -89 322 190 80 -152 -9 40 38 -38 -61 82 159 72 80 143
3938 143 7 201 -82 393 214 -138 70 17 -15 -217 96 -265 -101 186 -171 201 232 23 86 -59 2 -271
3960 -271 186 106 235 -79 -80 66 -93 -324 -17 -59 185 81 81 -93 -204 -30 -164 -8 -111 -32 97 -1 102
3983 102 -192 -136 53 -51 -119 -52 405 -7 -37 1 207 234 57 -87 -210 -191 231 6 -64 -259 438 -9 82
4006 82 -381 -77 -401 -274 -33 159 70 97 -314 332 -90 35 144 -196 255 -109 204 -27 -130 -293 6
4027 6 -103 163 416 197 -86 103 -341 108 -276 -291 235 -139 -13 -257 -266 42 93 -71 8 -71 -44 39 203
$$ packed form
3864b7R9O0P9k76k19K97rj44K08l29K19J08n6r1K87j03j05k3j56K96J8j33KL95
3888C97m41j73Q4R9J07k29J24Q7l4K6Qj1j37L57o6l08M6o4L53r0l28N80J90n44
3912C3q0M1r1J62M5n6m88J16M81q9M0k03M11j32j10k32J43M9kp6k3J43P7q7QO3
3938A43j36J94k83M75j79l52K08n3l2k02L13l61J64K87l57L72L1k09O3j45O1k73
3960b71M57q0J29l14jJ46j59k31L07m2K44j04%j74j11J74j34J56j03P9J29r8J03
3983A02k94N6J89j04o8O7M57m12l0L8K06K7j77j44j23J9M22k25p0j95O97m47R1
4006H2m63L04l24J27K41J92q9K7m11O46m22J25J09l40M51l64L13k31j03j63K99
4027Fj09K66K53k19k83J89m44M49l84j5N26l74J26k44rL08N1j64P9p9K7Q3J64
$$ plain form
4050 203 -121 -56 -257 162 -75 43 113 33 -13 73 -120 75 -231 -227 -140 72 -254 -44 5 -264 -98 172 228
4073 228 -171 125 189 3 -227 -108 -235 29 -282 -12 236 -117 206 61 113 76 -132 -22 179 85 -361
4094 -361 366 -103 5 -167 -81 58 309 102 -226 -43 -47 204 243 -82 -26 -89 -219 10 85 21 -83 184 -53
4117 -53 74 18 -39 180 188 -11 66 61 -241 -127 212 219 -276 125 -33 110 -21 98 55 354 215 545 -4 179
4141 179 -59 -528 -1 -266 -167 180 145 -113 -202 11 135 -48 173 260 -86 -229 -152 -30 -70 -39 33 154 -293
4164 -293 -246 -262 245 117 -271 -302 -66 190 -122 39 94 -62 -65 -4 87 112 -93 -168 7 -46 80 67 216 -235
4188 -235 -245 220 -56 90 -125 162 -342 27 144 -4 -206 14 65 -78 -127 -237 -25 -116 -31 -10 21 -140
4210 -140 -98 -100 -141 -36 179 38 -306 -184 254 -103 -48 317 -7 -111 -300 -135 -86 -273 39 233 164 -18
$$ packed form
4050B03l24O5k01M19k37J18P0q0m6Q6j93J95l06MQ7K12l26K10M9k69J66K70N6
4073B28l99K96O4j86k30J19j27K64l11K70K48l53L23j45N2l7k08J10K01r4m46
4094c61P27m69J08j72Q6J39K51k07l28J83mK51L9l25N6o3j30K29P5o4j04K67k37
4117e3J27n6n7K19Qj99P7nl02J14L39Pm95M01j58J43j31J19m3K99j39L30n49J83
4141A79k38m69N27k65R9L47l5k58q9K13J24j83K21Q7l46j43P7J22m0L1P2J21m47
4164b93M7j6N07j28l88l1K36K56l12J61N5j56lO1R1K5k05p5J75n3J26j3J49m51
4188b35j0M65k76J46k15K87n04L69J17j48k02K20N1j43m9j10K12r1Q5K1L1j61
4210a40M2km1J05K15j41l44J22M38l57N5L65l24j04j89J65M9j87L12J94o9j82
$$ plain form
4232 -18 261 -102 -79 -59 -54 -216 -34 -55 -125 -4 -60 -164 16 305 -214 138 277 -37 -64 35 2 -79 145 217
4256 217 -21 94 160 -134 -145 -35 68 -233 95 -22 -9 -32 196 -78 90 17 -115 161 10 -27 -240 -131
4278 -131 -343 -295 -88 -531 189 1 -139 286 52 -212 49 351 -231 -256 -144 -59 24 -47 133 -105 -20 92
4300 92 260 -39 230 -341 -6 -50 -160 42 159 -105 -286 -99 -291 44 -240 -260 299 191 328 -104 -12
4321 -12 -244 11 -43 -34 16 -33 -127 -10 -18 21 3 -196 24 -18 -12 193 307 -54 -19 171 -235 -110 118 -132 -111
4346 -111 -148 -22 88 -66 -171 163 -54 30 47 35 -261 -9 -8 346 -71 -118 179 -11 77 -342 -244 393 14
4369 14 -43 4 -144 104 -110 197 -36 91 -91 -249 163 214 -147 -163 309 97 -94 205 -13 -92 -4 -195
4391 -195 -43 42 -116 50 -231 -24 210 131 211 124 158 -74 -141 -145 -297 -207 440 127 -524 -173 -233 -132 137
$$ packed form
4232a8K79l63K3K0Nj62J82k1p0J21n6j04J80K89n19L52J39l14k7R9l3q1K24P2
4256B17k38J15O6k94j1J10J03l01L28j17J3k3K28k74J68p3j32K76j51l7k13J09
4278a31k12M8K07m43P20j88j40M25k34k64K61L02n82k5J12Q5Q3p1J80k38Q5J12
4300I2J68k99K69n71L35m4j10K02J17k64j81J87j92L35k84k0N59j08J37m32R2
4321a2k32K55n4RN0m9r4J17qL9j8j99K20m2OK05J14l61L5J90m06J25K28k50K1
4346a11l7J26J10j54j05L34k17Q4J7j2k96K52JL54m17m7K97j90Q8m19R8O37l79
4369A4n7M7j48K48k14L07k33J27j82j58M12N1l61j6M72k12j91K99k18p9Q8j91
4391a95J52Q5j58J66k81K07K34p9Q0q7L4k32o7mj52R0O47l13o51L51o0J01K69
$$ plain form
4414 137 73 -54 -534 60 -26 -201 35 -10 -17 -367 -418 75 -116 -122 -165 -234 66 23 2 -83 372 -103 90 -80
4438 -80 -272 85 104 -201 -32 -50 120 -69 -81 -54 159 10 81 7 2 -139 -178 -122 -36 -321 304 124 147 141 212
4463 212 3 -54 95 37 -76 -21 220 -97 -280 -102 -10 -46 70 1 146 -53 -353 146 53 361 135 -152
4485 -152 -37 -344 -29 48 0 -2 -144 -135 161 179 211 144 56 17 94 22 164 -13 159 186 429 -273 -73 -98 -142
4510 -142 -216 -65 -134 -32 -71 -349 305 156 39 -92 215 169 293 -61 -134 -443 99 -104 0 184 -330 78
4532 78 -12 109 -127 -19 -102 163 29 404 -270 92 4 86 298 -348 -87 -162 -246 -8 192 24 142 0
4554 0 150 182 73 -119 -271 134 260 -232 191 -105 -119 41 -108 98 -60 -169 -128 -206 -162 -204 209 114 121 0
4578 0 113 -17 294 -9 -29 112 133 27 51 273 -10 178 -42 320 38 90 340 167 -3 122 -275 -85
$$ packed form
4414A37o4j27m80N94q6j75K36m5pl50n1M93j91om3o9L00m3k1q5M55m75J93j70
4438h0j92L57J9l05J69j8J70j89j2K7K13j49P1p4nj41l9N6Q6k85O25j80K3oP1
4463B12k09n7J49n8j13N5K41l17j83J78R2l6J16o9J45j99l00M99r3L08k26k87
4485a52J15l07L15P7m8kj42RK96J8L2o7q8l9P7p2J42j77J72K7K43p02K00k5m4
4510a42p4J51o9J02l9k78O54j49j17j31L07m6J24l54p3l09N42k03J04J84n14M08
4532G8r0J21k36J08q3K65j34L75o74L62q8Q2K12o46K61p5q4K38K00j68J18j42
4554@J50L2j09j92j52M05J26m92M23k96j4J60j49K06j58j09M1p8M4m2M13r5Pj21
4578@J13j30L11l03k0J41K1j06K4K22k83J88k20L62k82N2K50j73j70J25l97J90
$$ plain form
4600 -85 -198 -35 157 -6 -38 -30 153 -16 178 -30 -36 -68 -84 -183 78 -79 -294 1 -36 130 -15 96 65 -11
4624 -11 -285 34 84 56 167 -465 -246 -87 -30 182 82 -70 153 170 77 -67 89 -170 91 74 111 -37 -56
4647 -56 -57 -63 160 -15 21 40 -75 124 181 -23 100 -274 -91 141 -178 -79 68 85 -79 -167 49 31 -25 -22 -272
4672 -272 -466 213 42 133 -207 -220 -20 -146 -4 -188 190 -395 81 182 -373 -227 6 150 144 -65 337
4693 337 8 96 84 -42 -338 -58 122 -65 45 -287 357 -35 -158 36 -41 -93 -63 -57 -5 144 87 -55 325
4716 325 -116 -182 -241 -94 22 -382 133 -268 -250 -295 64 -17 161 64 353 83 -2 -106 83 -66 50 80 -60
4739 -60 11 156 39 -124 -70 -143 -148 48 108 94 -225 -204 153 177 13 -84 -50 -166 10 2 286 -293 164 28 -76
4764 -76 173 -174 -138 -118 118 -93 258 -74 -357 363 -99 -38 -209 -342 24 -70 -281 -88 141 -64 15 -7
$$ packed form
4600h5j13J63J92j63l2QJ83j69J94k08ol2j6r9K61j57k15K95l7J66j45J11l1p6
4624a1k74L19N0k8J11o32K19J59N7K12j00j52K23J7r3j44J56k59K61j7L7j48j9
4647e6joK23j75L6J9j15J99N7k04J23l74J83K32l19R9J47J7j64q8K16j8n6Lk50
4672b72j94O79j71R1l40j3K00j26J42j84L78n85M76J01n55J46K33J44ok09M02
4693C37l29Q8j2j26k96K80J80j87J10l32O44l92j23J94p7n2L0ON2J49n7j42L80
4716C25m41o6n9J47J16m04N15m01J8m5L59q1J78r7K89k70q5j04J89j49J16L0j40
4739f0P1J45j17j63N4p3nJ96O0j4l19K1L57K4j64r7L4j16J76qK84n79M57j36j04
4764g6K49l47L6K0K36k11L51l32k83P20m62O1j71j33L66r4k11J93K29k05P9k2
$$ plain form
4786 -7 268 -15 -15 -7 235 198 56 77 -228 180 90 -19 -41 -265 349 -67 93 182 42 50 -83 -231 -210 40 -88
4811 -88 66 -395 90 109 -160 -151 -200 -200 -268 -27 -80 -95 -11 -138 83 244 -7 61 47 139 11 -110 -264 -118 153
4836 153 -548 -121 6 184 -194 23 -248 25 -178 -55 39 242 102 -30 112 -137 -17 -109 -128 -137 -199 -58
4858 -58 40 -35 -119 -332 227 91 -11 319 225 -8 -94 -202 162 61 -94 325 -114 -131 -108 89 95 230 180 57
4882 57 -18 -153 -87 214 122 13 219 -107 -106 -172 18 -284 -141 124 -54 152 -194 -143 -52 39 -71 -257 114
4905 114 50 -37 53 285 -126 -225 72 82 152 -115 56 28 -18 -134 -144 76 4 -89 -184 3 -121 110 37 -58 26
4930 26 54 -268 29 210 -12 145 196 -24 -311 -31 61 -35 -82 223 -158 -77 -26 89 287 93 62 57 -39 -118
4954 -118 -5 273 155 -55 -353 145 -274 -66 -118 -256 -160 -76 9 108 -175 -146 -198 25 6 -88 167 365 -123
$$ packed form
4786gK75k83%QK42l7j42K1l05M08r0j09k2k24O14m16J60Q9j40Qj33j48K1K50j28
4811h8J54m61M85J9k69Rm9%o8K41n3j5Q4j27K21J61k51O8j4R2j28j21j54J46K71
4836A53p01M27J27J78l78K17k71K73k03J23R4K03j40j32J42k49J20r2j9ro2J41
4858e8R8p5q4k13N59j36j02L30r4k33q6j08L64j01j55M19m39j7K3J97OJ35n0j23
4882E7p5j35O6L01r2j09K06l26Jo6J90l02J43K65j78K06l46N1R1R1j10j86L71
4905A14o4q7R0K32m11r9K97J0P0k67J71k8m6j16j0K20p2r3r5J87j24K31p3r5Q4
4930B6K8l22K97J81k22J57N1k20k87K80R2r6m7L05l81Q1N1J15J98j94l1nr6p9
4954a18J13K78j18k10k98M98m19K08n2j38R6Q4Q5R9k83K9n2K23j9r4K55J98m88
$$ plain form
4977 -123 -39 -167 -262 195 181 241 103 14 292 -16 -125 212 63 -88 65 -136 32 -10 -23 34 -193 225 -103
5000 -103 167 -173 -307 46 103 -110 260 123 -149 122 -34 130 -119 391 297 11 -30 4 102 142 19 139
5022 139 -27 210 -63 41 233 10 -76 136 -48 -26 134 337 -22 203 -176 -246 -42 169 -106 -62 54
5043 54 234 -35 357 305 184 32 37 -150 -75 35 110 148 129 -27 -239 38 66 -48 -275 6 -140 -266 -81
5066 -81 289 115 41 296 -58 78 65 77 67 112 390 -36 310 327 -53 -29 -229 -111 181 139 44 14 189 92
5090 92 -135 -207 -92 66 -233 289 76 448 -109 -51 -11 -212 90 246 -30 433 215 232 61 -240 -107 -311
5112 -311 104 -19 169 72 -134 18 101 -215 183 141 158 256 -104 7 39 -118 81 196 -41 -65 -73 1 -30 5
5136 5 9 53 329 4 289 -161 255 292 -21 -40 54 -107 -45 143 -488 -203 261 214 270 -168 -28 176 198 -28
$$ packed form
4977a23Q4j28r5M57j4O0j38q9K78l08j09L37j49j51J53k01J68m2j3N7k27M18l28
5000a03K70l40j34L53N7k13L70j37k72K71j56J64k49N10r4k86m1L4R8M0j23J20
5022A39j66K37k73J04J92k23q6K12j84K2J60K03l59K25l79p0K04K11k75M4J16
5043E4J80k69L92n2j21j52Nj87P5J10P5L8j9j56k12K77K8j14k27K81j46j26J85
5066h1L70j74p4K55l54J36j3J2j0M5K78m26L46J7l80K4k00J18K92m2r5l0J75r7
5090I2k27p2J15J58k99N22k13L72n57N8M0k01L02J56k76M63k18J7j71l01J33k04
5112c11M15j23J88r7k06J52Q3l16L98m2J7R8l60J11L2j57J99J15k37k4qP4l1L5
5136EMM4K76l25K85m50M16L7l13j9R4j61O2J88o31K85M64m7N6m38J40K04K2k26
$$ plain form
5160 -28 -327 -54 -185 10 65 112 -85 22 142 -64 162 -23 -113 -128 191 46 128 -83 -147 225 -115 5
5182 5 -29 194 125 -248 -193 247 334 -52 -138 -29 -222 -44 6 -261 132 -56 -165 -49 171 -49 49 -396 -308
5205 -308 313 6 30 18 -251 -238 226 115 72 197 263 -117 -58 223 -145 129 245 249 151 -197 120 142 51 326
5229 326 253 -224 -106 7 160 -19 -127 121 110 -238 29 -103 -40 -44 223 -50 123 -64 115 139 6 417
5251 417 -22 564 -71 237 39 48 -149 42 -2 -277 28 -103 204 -67 50 -31 -92 -5 -168 22 -134 -371
5273 -371 65 26 36 88 -262 141 -186 -401 244 41 -149 -49 44 -239 -31 273 -133 -135 116 57 -69 -47 -4
5296 -4 -108 193 -95 61 -138 18 212 -92 78 103 140 -57 -161 -212 11 1 -48 54 133 -166 57 72 38
5319 38 55 0 -241 -7 -72 9 5 -230 -229 -102 264 100 -40 107 -191 34 103 -258 -85 -30 -111 186 -107 -216
$$ packed form
5160b8k99K73j31J95N5M7j97J07J20k06K26j85r0j5L19j45Q2k11o4L72l40J20
5182El4K23o9l73N5M40Q7l86q6J09j93J78N0k67L93j88j09J16K20k20R8m45Q8
5205c08O21l07K4j2k69J3M64j11m3J25O6l80N9K81l68K74J16Mr8l48L17K2r1K75
5229C26p3m77J18J13J53j79j08K48j1l48K67j32O3mK67k73J73j87J79K4j33M11
5251D17m39N86o35L08j98Rj97J91m4k75L05j31L07k71J17q1o1Q7j63J90j56k37
5273c71M36l9J0N2l50M03l27k15O45k03j90J00R3k83K08L04m06kK51n9j26K2M3
5296dj04L01k88J56j99J56J94l04J70K5L7j97j04n1K23j0m9J02P9k99K23J5l4
5319C8J7n5k41K34o5Q1mk35JJ27L66j64j40J47k98K25O9l61J73N5q1K97k93j09
$$ plain form
5343 -216 -218 5 66 -30 206 -100 -232 188 -24 33 -105 84 -45 -73 -190 300 111 2 -142 -413 217 -45
5365 -45 -50 -345 -54 72 179 51 135 -73 -180 569 -12 -72 -39 241 142 -300 25 110 186 -44 -90 186 21
5388 21 -17 154 -67 -49 104 291 -124 51 -331 -196 38 -124 155 -92 259 -5 -92 -65 -42 -253 -234 246
5410 246 -18 -237 -109 2 -178 255 160 -263 8 280 308 -21 -134 -265 122 108 105 -82 -96 279 34 -31
5432 -31 -123 39 83 1 -21 226 102 124 -424 -91 -69 -167 -74 150 -44 -192 -321 -4 311 -53 -297 164 0
5455 0 -34 337 -69 -6 -122 -155 -154 -103 77 -111 325 -266 -184 -102 -3 63 119 85 -81 180 183 -168 102 13 -211 -67
5481 -67 239 185 249 39 -1 184 166 222 -49 8 -130 83 159 185 126 -104 171 63 32 15 21 -120 -186 49 -120
5506 -120 150 78 -6 189 196 -145 523 -56 -33 180 236 -42 -71 87 -224 142 -314 47 -74 -331 -4 -72 -66
$$ packed form
5343b16kK23O1r6K36l06j32M20k12N7j38J89j29k8j17M90j89j09j44k71O30k62
5365d5nk95K91J26J07j28Q4k08j07P49n81o0L3K80r9m42L25Q5P6k30m6K76j65
5388B1l8J71k21J8J53J87m15J75l82J35K34j62K79k47L51k64q7K7K3k11J9M80
5410B46k64k19J28J11j80M33r5m23K71K72K8l29j13j31L87j4lj87j4L75k45o5
5432c1r2J62M4q2k2K47j24K2n48L33K2r8R3K24j94j48j29L17L15l64k44M61j64
5455@l4L71m06O3j16l3JN1J80j88M36n91Q2Q2R9O6N6l4j66K61Ll51K70q9k24J44
5481f7L06n4O4k10m0J85j8N6k71N7j38K13P6K6n9k30K75j08l1j7Oj41o6K35j69
5506a20K70p2q4J95Pl41O68n79K3K13N6k78k9J58l11L66m56L61j21k57L27o8O
$$ plain form
5529 -66 131 -114 -58 -53 -317 147 -104 -42 243 -178 -172 -51 -97 47 -37 -147 -118 -41 -321 133 123 33 -23 -69 23
5554 23 -268 174 170 -54 -107 -144 114 82 -141 -68 -89 -146 140 -138 60 72 -287 125 58 -300 67 -98 -98 -79 -12
5579 -12 -472 122 -35 10 8 -67 38 148 173 -293 175 -15 324 42 -46 -113 42 -69 -237 -11 -69 104 -439
5602 -439 16 -153 138 433 -74 -208 92 -60 2 -287 -124 64 13 -22 -68 -313 -148 -294 113 -20 -57 -17
5624 -17 60 98 111 120 161 30 100 -345 -25 92 -81 92 -146 -14 -105 -244 6 191 83 -119 -118 -206 -35 101
5648 101 -131 -172 -91 -71 334 -40 -141 159 -12 36 -39 194 -121 69 390 -53 -105 133 -184 -93 141 -243
5670 -243 148 -12 30 -372 121 12 191 76 -475 -5 182 110 41 81 -75 319 -62 -46 7 4 24 133 267
5693 267 -138 -99 -171 -60 -5 110 68 -261 -114 3 -178 55 -13 -107 154 82 -207 90 -21 51 -120 143 -49
$$ packed form
5529f6J97k45N6Nk64M64k51O2K85m21OJ21m6J44q4j10K9P7k80M54j0r0n6m6R2
5554B3k91M42mk24n3l7K58l2k23P3k1n7K86k78J98J2l59M12o7l58L67j65%J9O7
5579a2m60N94j57M5kp5J05J10K5m66M68j90L39k82q8o7J55j11j68K26n8J73n43
5602d39M55j69K91K95n07j34L00j52O2k89J63J88n1l5m6k45J65j46M07j33l7M0
5624a7P7L8J3RM1j31P0m45L20J17j73J73k38J32r1j39K50J85j08k02Jq8J71J36
5648A01k32m1Q1K0M05l74j01L00j71M8p5K33l15J90L21m43n2K38l17R1K34l84
5670b43L91j60M2m02M93j09J79j15n51M70J87p2o9M0j56L94l81J6N3lK0J09J34
5693B67m05L9p2J11N5J15m2l29J47J17j81K33o8r4K61p2k89K97j11P2j71K63j92
$$ plain form
5716 -49 224 77 -154 -233 208 -44 -126 -229 -122 50 -32 60 261 -43 -48 91 66 -107 -79 133 -66 -157 -130 8
5740 8 66 182 -353 221 15 18 -87 7 71 238 -94 249 -145 8 409 122 207 -228 105 82 36 32 -33 -179
5764 -179 179 271 267 41 -159 -271 190 283 25 -15 320 70 -239 89 -45 32 -246 100 -101 -404 84 61
5786 61 -11 92 -39 225 -15 -126 155 -155 3 337 -34 -16 -115 153 38 90 108 255 -10 -16 -28 183 57
5809 57 -88 -422 25 -125 -197 79 212 134 331 -120 -12 200 81 -112 34 158 51 153 -32 -86 162
5830 162 64 -527 -235 171 -77 72 -18 -17 82 67 -181 205 -160 121 -13 100 -36 169 -51 -298 -271 -54
5852 -54 100 312 63 -51 101 -67 -394 -329 144 -240 -27 280 50 95 255 32 15 19 197 123 -152 -63 188
5875 188 123 152 200 -124 -8 -151 80 -14 41 -46 179 -113 185 -139 -1 114 277 -3 -272 -157 40 -259
$$ packed form
5716d9K73j47k31p9M41k52q2j03J07J72q2R2K01l04nJ39k5j73K8K12j99r1K7J38
5740HN8J16n35N74k06Lj05R4O4J67l32L43l94J53M01k87Q5m35L33k3m6mo5j46
5764a79L58R2mk26k00j12M61R3k58m0L35k50l09L28j34P7k78L46k01l03M88k3
5786F1p2J03j31K64k40j11K81l10J58L34l71J8r9K68j15N2J8J47k65oj2K11j26
5809E7j45l34M47j50p2K76J33p8J97m51J08K12j19j93J46J24j07J02j85n4K48
5830A62r8n91K92M06k48J49r0JR9j5k48L86l65K81j34J13j36K05k20k47K7K17
5852e4J54K12k49j14J52j68l27O5M73l84K13L07k30M5J60k23j7MJ78p4k75Q9K51
5875A88o5K9M8l24J16j43K31r4N5q7K25k92K98l24J38J15J63k80k69J15J97k99
$$ plain form
5897 -259 -17 73 65 168 32 34 -90 207 171 -70 -22 -206 340 -142 -11 81 -208 176 -81 516 165 -133 52
5920 52 70 307 -234 71 -14 61 159 67 24 154 -15 -151 190 -68 -59 -214 61 -250 112 131 108 -69 -149 120
5944 120 -97 -53 47 -262 79 242 -160 -23 212 -109 -184 -254 -25 330 116 -96 328 150 -83 173 100
5965 100 -53 137 74 -121 -80 -102 141 -79 -315 268 200 209 133 -69 -41 20 140 18 -25 -42 22 96 -188 -322
5989 -322 71 -186 -82 -123 -286 -89 -178 -30 73 -161 107 -17 11 208 -132 127 -161 -17 -169 117 128
6010 128 105 -138 196 -230 445 82 -73 -55 -76 80 -226 11 -206 120 -128 142 -138 184 476 284 -194
6031 -194 -211 66 121 -125 -261 -200 377 117 -184 -62 102 59 99 -89 107 -110 -46 -93 -92 261 -83 3 -21 42
6055 42 -155 -28 -4 15 -8 -32 155 -321 -208 -108 -44 270 238 -299 227 -6 -385 20 128 -23 -14 151 194
$$ packed form
5897b59K42R0qJ03j36Kj24K97l6k41M8j84N46m82J31R2k89L84k57N97l51k98J85
5920E2J8K37n41L05q5P5R8r2m3J30j69j36L41k58Rj55K75l11L62J9k3j77q0K69
5944A20k17M4J00l09L41J63m02J37K35l21p5p0K29L55k14k12M24j78k33K56p3
5965A00j53J90o3j95M1k2K43k20k36N83o8Rp6k02K8O1J20j22m3j7O4P4k84j34
5989c22L93k57J04m1j63J97q9J48J03k34K68j24K8J97l40K59k88J44j52K86J1
6010A28k3k43L34m26O75l63j55J8k1J56l06K37k17L26k48K70k80L22K92j92m78
6031a94j7K77N5k46j36O1N77k60l01J22J64m3M0j88J96k17O4m7JL53l44Q6k4O3
6055D2j97J27K4J9k3k4J87m76J13J00O4L14l2n37N26k33l79M05J08j51RJ65M3
$$ plain form
6078 194 -95 -16 78 329 -464 42 384 -100 -113 -30 168 197 -83 167 88 -92 -525 -60 9 -210 219 157 -59
6101 -59 34 39 209 192 -37 378 151 -106 21 -181 -22 -7 367 135 191 -87 -104 -118 -22 173 -116 -222 -33
6124 -33 -98 -183 -2 -57 56 38 -250 -134 -152 -31 284 0 -56 -13 -9 -91 116 250 138 -307 -87 2 106 169
6148 169 198 -86 153 -189 -166 -90 132 -93 138 -52 307 148 -157 41 -180 -339 -206 458 62 -140 -11
6169 -11 155 -140 74 62 -107 -319 247 -256 103 69 12 -94 -35 -192 48 -163 -193 167 46 23 106 263 90
6192 90 -178 -120 200 27 230 35 122 75 31 -133 -57 -135 -83 204 98 35 232 99 150 -104 108 -44 169
6215 169 -111 -279 -258 -17 230 151 -42 -41 54 170 107 -135 -81 -460 70 72 22 -114 92 54 227 26 111 159
6239 159 -144 -127 238 -323 -187 298 215 -288 -30 -108 -252 374 -238 34 153 -186 164 -87 -221 -253 -123
$$ packed form
6078A94k89P9R4K51p93N06L42m84j3Q3J98K9k80K50p9j80m33M65O9k19M29o2k16
6101e9R3NJ70j7k29M15k27k57J27k02J59J5L74k32N6k78j7j4R6J95k89j06J89
6124c3o5q5J81n5J13j8k88J16j8J21L15k84n6M3Mq2K07J34j12m45K20Q9J04O3
6148A69K9k84K39l42K3P6K22k25K31j90L59j59l05J98k21j59J33O64l96k02J29
6169a1J66k95K14j2j69k12N66n03L59l4n7j06N9j57K40k11l0L60j21k3Q3J57j73
6192I0k68N8L20j73K03j95Q7m7m4j64P6p8N2K87j06o3J97j33N1k54K12j52K13
6215A69k80j68K1K41K47p9j93JR5J16o3k42N4l79N30Kn0j36K06l8J73k01Q5M8
6239A59l03J7L65n61J36M85q3n03K58p8j44O26o12K72J19l39L50k51j34l2J30
$$ plain form
6260 -123 -3 -184 205 -73 -136 -260 167 -103 13 229 -32 -268 160 -250 53 335 58 424 39 287
6280 287 279 -45 211 136 177 -86 -142 52 0 -228 -243 -286 2 7 -168 174 211 -187 57 81 -77 -175 -41 -123 64
6305 64 145 231 -99 236 90 -14 2 223 141 208 341 126 100 371 66 166 -58 -15 133 98 44 -92 71
6328 71 -113 176 -336 -140 49 31 -69 -9 -39 15 -30 -61 -69 -293 -97 40 -112 -165 18 13 78 -19 -40 2 71 -3
6354 -3 86 14 -108 331 45 -168 132 -43 35 -4 23 229 69 -285 299 65 85 171 275 204 -126 -2 58 266
$$ packed form
6260a23J20j81L89k78o3j24M27k70J16K16k61k36M28m10L03K82k77L66l85K48
6280B87ql24K56p5M1k63n6J94n2k28j5m3K88Nj75L42L7l98K44K4j58r8J34q2J87
6305F4Q1Q6l30L35j46j04J6K21q2O7J33k15k6K71l05J00k24M3J48l5n4j36J63
6328G1j84K89n12J96J89j8j00O0l0N4m5l1qk24J96J37j52n3J83nO5r7k1M2O9p4
6354cQ9p2j22M39k86k13L00j75P8l9K7K06j60l54N84k34K0Q6J04p1l30J24O0K08
$$ [...]
8191B9
##END NTUPLES=NMR FID
##END=
