##TITLE=1H_DE-77Fk_TFA
 CDCl3
 8 sc, 
 28.11.2024
##JCAMPDX= 6.0         $$ Bruker NMR JCAMP-DX V2.0
##DATA TYPE= NMR FID
##DATA CLASS= NTUPLES
##ORIGIN= UXNMR, Bruker Analytische Messtechnik GmbH
##OWNER= root
$$ XWIN-NMR		Version 3.5
$$ Thu Nov 28 16:05:41 2024 Russian Standard Time (UT+4h)  she@DPX200
##.OBSERVE FREQUENCY= 200.1315
##.OBSERVE NUCLEUS= ^1H
##.DELAY= (6, 6)
##.ACQUISITION MODE= SIMULTANEOUS
##.ACQUISITION SCHEME= undefined
##.AVERAGES= 8
##.DIGITISER RES= 18
##SPECTROMETER/DATA SYSTEM= spect
##.PULSE SEQUENCE= zg30
##.SOLVENT NAME= CD3CN
##.SHIFT REFERENCE= (INTERNAL, CD3CN, 0, 15.7039)
##AUDIT TRAIL= $$ (NUMBER, WHEN, WHO, WHERE, WHAT)
$$ ##TITLE= Audit trail, XWIN-NMR		Version 3.5
$$ ##JCAMPDX= 5.01
$$ ##ORIGIN= Bruker BioSpin GmbH
$$ ##OWNER= she
$$ F:/spectra/data/she/nmr/H-F/1/audita.txt
$$ ##AUDIT TRAIL=  $$ (NUMBER, WHEN, WHO, WHERE, WHAT)
(   1,<2024-11-28 16:04:12.96 +0400>,<she>,<DPX200>,
      <created by zg, POWCHK disabled, PULCHK disabled
       configuration hash MD5:
       00 E9 B6 7A A2 85 ED C7 34 08 36 98 17 FE 4E 26
       data hash MD5: 16K
       B2 86 52 8E 43 22 44 8B 68 CB 40 EE 5C 01 51 EA>)
$$ ##END=
$$ 
$$ hash MD5
$$ 67 75 87 40 DA FB 86 B3 14 BE B0 DE 9D 18 8E E6
##$RELAX= 
##$RELAX= 
##$RELAX= 
##$RELAX= 
##$RELAX= 
##$RELAX= 
$$ Bruker specific parameters
$$ --------------------------
##$DU= <F:/spectra>
##$EXPNO= 1
##$NAME= <H-F>
##$PROCNO= 1
##$TYPE= <nmr>
##$USER= <she>
##$AMP= (0..31)
100 100 100 100 100 100 100 100 100 100 100 100 100 100 100 100 100 100 
100 100 100 100 100 100 100 100 100 100 100 100 100 100 
##$AQSEQ= 0
##$AQ_mod= 1
##$AUNM= <au_zg>
##$AUTOPOS= <>
##$BF1= 200.13
##$BF2= 200.13
##$BF3= 200.13
##$BF4= 200.13
##$BF5= 200.13
##$BF6= 200.13
##$BF7= 200.13
##$BF8= 200.13
##$BYTORDA= 1
##$CFDGTYP= 0
##$CFRGTYP= 5
##$CHEMSTR= <none>
##$CNST= (0..31)
1 1 145 1 1 1 1 1 1 1 1 1 1 1 1 1 1 1 1 1 1 1 1 1 1 1 1 1 1 1 1 1 
##$CPDPRG= <>
##$CPDPRG1= <>
##$CPDPRG2= <>
##$CPDPRG3= <>
##$CPDPRG4= <mlev>
##$CPDPRG5= <mlev>
##$CPDPRG6= <mlev>
##$CPDPRG7= <mlev>
##$CPDPRG8= <mlev>
##$CPDPRGB= <>
##$CPDPRGT= <>
##$D= (0..31)
0 1.2 0 0 0 0 0 0 0 0.06 0 0.03 0 0 0 0 0.0002 0 0 0 0 0 0 0 0 0 0 0 0 
0 0 0 
##$DATE= 1732795452
##$DBL= (0..7)
120 120 120 120 120 120 120 120 
##$DBP= (0..7)
150 150 150 150 150 150 150 150 
##$DBP07= 0
##$DBPNAM0= <>
##$DBPNAM1= <>
##$DBPNAM2= <>
##$DBPNAM3= <>
##$DBPNAM4= <>
##$DBPNAM5= <>
##$DBPNAM6= <>
##$DBPNAM7= <>
##$DBPOAL= (0..7)
0.5 0.5 0.5 0.5 0.5 0.5 0.5 0.5 
##$DBPOFFS= (0..7)
0 0 0 0 0 0 0 0 
##$DE= 6
##$DECBNUC= <off>
##$DECIM= 24
##$DECNUC= <off>
##$DECSTAT= 4
##$DIGMOD= 1
##$DIGTYP= 9
##$DL= (0..7)
0 120 120 120 120 120 120 120 
##$DP= (0..7)
150 150 150 150 150 150 150 150 
##$DP07= 0
##$DPNAME0= <>
##$DPNAME1= <>
##$DPNAME2= <>
##$DPNAME3= <>
##$DPNAME4= <>
##$DPNAME5= <>
##$DPNAME6= <>
##$DPNAME7= <>
##$DPOAL= (0..7)
0.5 0.5 0.5 0.5 0.5 0.5 0.5 0.5 
##$DPOFFS= (0..7)
0 0 0 0 0 0 0 0 
##$DQDMODE= 0
##$DR= 18
##$DS= 0
##$DSLIST= <SSSSSSSSSSSSSSS>
$$ [...]
##$SUBNAM2= <"">
##$SUBNAM3= <"">
##$SUBNAM4= <"">
##$SUBNAM5= <"">
##$SUBNAM6= <"">
##$SUBNAM7= <"">
##$SUBNAM8= <"">
##$SUBNAM9= <"">
##$SW= 24.0689530833862
##$SWIBOX= (0..15)
0 0 2 0 0 0 0 0 0 0 0 0 0 0 0 0 
##$SW_h= 4816.95568400771
##$TD= 16384
##$TD0= 1
##$TE= 0
##$TE2= 300
##$TE3= 300
##$TEG= 300
##$TL= (0..7)
0 120 120 120 120 120 120 120 
##$TP= (0..7)
150 150 150 150 150 150 150 150 
##$TP07= 0
##$TPNAME0= <>
##$TPNAME1= <>
##$TPNAME2= <>
##$TPNAME3= <>
##$TPNAME4= <>
##$TPNAME5= <>
##$TPNAME6= <>
##$TPNAME7= <>
##$TPOAL= (0..7)
0.5 0.5 0.5 0.5 0.5 0.5 0.5 0.5 
##$TPOFFS= (0..7)
0 0 0 0 0 0 0 0 
##$TUNHIN= 0
##$TUNHOUT= 0
##$TUNXOUT= 0
##$USERA1= <user>
##$USERA2= <user>
##$USERA3= <user>
##$USERA4= <user>
##$USERA5= <user>
##$V9= 5
##$VALIST= <valist>
##$VCLIST= <CCCCCCCCCCCCCCC>
##$VD= 0
##$VDLIST= <DDDDDDDDDDDDDDD>
##$VPLIST= <PPPPPPPPPPPPPPP>
##$VTLIST= <TTTTTTTTTTTTTTT>
##$WBST= 1024
##$WBSW= 4
##$XGAIN= (0..3)
0 0 0 0 
##$XL= 0
##$YL= 0
##$YMAX_a= 274780
##$YMIN_a= -197938
##$ZGOPTNS= <>
##$ZL1= 120
##$ZL2= 120
##$ZL3= 120
##$ZL4= 120
##$ABSF1= 10
##$ABSF2= 0
##$ABSG= 5
##$ABSL= 3
##$ALPHA= 0
##$AQORDER= 0
##$ASSFAC= 0
##$ASSFACI= 0
##$ASSFACX= 0
##$ASSWID= 0
##$AUNMP= <proc_1d>
##$AZFE= 0.1
##$AZFW= 0.1
##$BCFW= 1
##$BC_mod= 2
##$BYTORDP= 1
##$COROFFS= 0
##$CY= 11.3945322036743
##$DATMOD= 1
##$DC= 2
##$DFILT= <>
##$DTYPP= 0
##$F1P= 15.6554695791079
##$F2P= 12.8336369535428
##$FCOR= 0.5
##$FTSIZE= 0
##$FT_mod= 4
##$GAMMA= 1
##$GB= 0.15
##$INTBC= 1
##$INTSCL= 1
##$ISEN= 128
##$LB= 0.24
##$LEV0= 0
##$LPBIN= 0
##$MAXI= 10000
##$MC2= 0
##$MEAN= 0
##$ME_mod= 0
##$MI= 1.114404
##$NCOEF= 0
##$NC_proc= 0
##$NLEV= 6
##$NOISF1= 3.799351
##$NOISF2= 2.8
##$NSP= 1
##$NTH_PI= 0
##$NZP= 0
##$OFFSET= 15.70392
##$PC= 1
##$PHC0= -26716.05
##$PHC1= 13.18744
##$PH_mod= 1
##$PKNL= yes
##$PPARMOD= 0
##$PSCAL= 0
##$PSIGN= 0
##$REVERSE= no
##$SF= 200.130013532006
##$SI= 16384
##$SIGF1= 3
##$SIGF2= 2
##$SINO= 400
##$SIOLD= 16384
##$SREGLST= <1H.CDCl3>
##$SSB= 0
##$STSI= 0
##$STSR= 0
##$SW_p= 3612.71676300578
##$SYMM= 0
##$S_DEV= 0
##$TDeff= 0
##$TDoff= 0
##$TI= <>
##$TILT= no
##$TM1= 0
##$TM2= 0
##$TOPLEV= 0
##$USERP1= <user>
##$USERP2= <user>
##$USERP3= <user>
##$USERP4= <user>
##$USERP5= <user>
##$WDW= 1
##$XDIM= 8192
##$YMAX_p= 0
##$YMIN_p= 0
$$ End of Bruker specific parameters
$$ ---------------------------------
##NTUPLES= NMR FID
##VAR_NAME=  TIME,          FID/REAL,        FID/IMAG
##SYMBOL=    X,             R,               I
##VAR_TYPE=  INDEPENDENT,   DEPENDENT,       DEPENDENT
##VAR_FORM=  AFFN,          ASDF,            ASDF
##VAR_DIM=   8192,          8192,            8192
##UNITS=     SECONDS,       ARBITRARY UNITS, ARBITRARY UNITS
##FACTOR=    0.0002076,     1,               1
##FIRST=     0,             0,               0
##LAST=      1.7004516,     0,               0
##MIN=       0,             -197938,         0
##MAX=       1.7004516,     274780,          0
$$ Real data points
##PAGE= N=1
##DATA TABLE= (X++(R..R)), XYDATA
$$ [...]
1972i4K25J91k58m78M15J70n23K82J72l46j00K95k06M16m38L90l02O53k83r2n0
$$ -94 131 322 64 -414 1 171 -352 -70 102 -244 -344 -49 -255 161 -277 113 -189 464 181 89 39
1993C9k53L05j28k5j70K00J94p3k26J06M1J89k18k36K8J60p7K20j99m6L21j25
$$ 39 -214 91 -37 -62 -232 -32 162 89 -137 -31 10 199 -19 -255 -227 -67 -144 76 -123 -169 152 27
2015B7k2q2P2j15M6R6l38K21P6k89J54L04j72J24n83L04O6R5M66n95L8J75L02
$$ 27 5 -77 -5 -120 -74 22 -316 -95 -19 -308 -154 150 -22 102 -481 -177 -111 -16 450 -145 -107 68 370
2038C70l72l36L23N2K41l27L28nl86R9J15J72l36J25N4k31K32j67N4l7K0K33j
$$ 370 -2 -338 -15 37 278 -49 279 274 -112 -13 102 274 -62 63 117 -114 118 -49 5 -32 -12 221 220
2061B20m9j93o6n4L5K98l70pK01O3J80k47Lj67J57j69K54J40j71K11m82N5M7L60
$$ 220 171 -22 -88 -142 -107 191 -179 -186 15 78 258 11 14 -153 4 -165 89 229 58 269 -213 -158 -111 249
2085B49l20O8J95J38m65J12L3o5n6K98k20k41M05k67J04J71p7J06m95K59k71O42
$$ 249 -71 -3 192 330 -135 -23 10 -55 -111 187 -33 -274 131 -136 -32 139 62 168 -327 -68 -339 303
2107C03k03J7k28L11j29J89m64q3M43l3n4k96J96K45j84n6m8m5J21n4M06n16M52
$$ 303 100 117 -111 200 71 260 -204 -287 156 123 69 -227 -31 214 30 -26 -74 -119 2 -52 354 -162 290
2130B90n54M36j86M01m77N4Q3M7J7k9K5N02n56p3K37n6m15Q0R1jK19l32p5L0J63
$$ 290 -264 172 -14 387 -90 -36 47 94 111 82 107 609 53 -20 217 161 -254 -174 -83 -84 135 -197 -272 -242 -79
2155g9K92l21R8k90J64K03j05q8J22J81m06L53j98mPr3L06k58J8K16j96J46k59
$$ -79 213 -108 -10 -300 -136 67 -38 -126 -4 177 -229 124 -74 -78 -71 -164 142 -116 -98 118 -78 68 -191
2178a91K23rl24M53k30J81K11l00R5O3k17r9K65m2lJ9j07R8j09R7J70k69J0M54
$$ -191 32 23 -301 152 -78 103 314 14 109 172 -45 -144 121 79 76 95 -12 86 -23 74 244 -25 -15 439
2202D39m13J97k99m7M11j18m2Q1k56K36j90p2j84L09K11j29m68J68L0m2L8n3L19
$$ 439 26 223 -76 -123 288 170 128 209 -47 189 -1 -73 -257 52 263 134 -334 -166 -136 -178 -140 -193 126
2225A26j50j18J24j29L63n77M63j25K17l9k90J78K32k09k35J37Qj21K19k25Q2
$$ 126 -24 -142 -18 -147 216 -361 102 -23 194 155 -135 43 275 66 -169 -32 -24 -145 74 -151 -69
2246f9lj12K35J16p5j3k70M17k31M4L02l24M7m1K22n02l0L0L60l15m6R1J03J04
$$ -69 -72 -184 51 167 92 79 -191 226 -5 39 341 17 64 23 245 -257 -287 -257 103 -212 -258 -167 -64 40
2270D0L8L57m35l91K65j79N1P77m88k24K15k77M17k26J44M9j11k57L47k97Q5Q3
$$ 40 78 435 0 -391 -126 -305 -254 523 35 -189 26 -251 166 -60 84 133 22 -235 112 -185 -100 -17
2292a7k52J43L6K36O8j86n1RK25l58j05L05Q9J34l47J76l45K30M8J98l2n40L02
$$ -17 -269 -126 -90 146 214 28 -23 -14 211 -147 -252 53 142 276 -71 105 -240 -10 38 236 204 -336 -34
2315c4K14k37J10j2J89l07N7l05L64k45R7J04n2N2l1M86n33L64n95K57O8PJN5
$$ -34 180 -57 53 41 230 -77 -20 -325 39 -206 -109 -5 -57 -5 -36 450 -83 281 -314 -57 11 18 19 74
2339G4j77q8K30k50p5K62Q3j1J68j68j86L60m90J61j39M5K92j53O4l92L22q9M0
$$ 74 -103 -191 39 -211 -286 -24 59 48 216 48 -138 222 -268 -107 -246 -201 91 -62 2 -390 -68 -157 -117
2362a17L40K7j12l18L9Lm6K45j15J08r2l38L59k30K79J45j03P4j46j7k3j69L75
$$ -117 223 250 138 -180 -141 -138 -184 61 -54 54 -38 -376 -17 -247 32 177 74 148 2 -15 -38 -207 168
2385A68L0l39J34j08j17K20L7j47r5L11k08K07O9J77k56p6j36J53J90l05N7R6
$$ 168 198 -141 -7 -115 -232 -12 25 -122 -217 94 -114 93 162 339 83 7 -129 24 214 -91 -34 62
2407F2oj16K7j56K1M6l9N37l71r2J97j91K23j85Q1j54R8l3r3L51kj72M5p7p2K52
$$ 62 56 -60 -33 -189 -168 -122 -161 376 5 -87 110 -81 142 -43 38 -116 -18 -51 -144 207 205 33 78 1 -71 181
2433A81j78q0K11l57P9lNL2J40K2p6p7K3J82qlJ01l08K61K87k05l09p2K28l22
$$ 181 3 -77 134 -223 -144 -147 -142 -110 30 52 -24 -101 -78 104 96 93 194 -114 147 434 229 -80 -152 76 -246
2458b46K53m2J07j64M0J70j08K9L6k11m9L37j6j27J75l8p1j00J24j8j91J98K26
$$ -246 7 -35 72 -92 -52 118 10 39 75 -136 -185 152 136 9 184 146 75 -25 99 81 -110 88 314
2481C14k74J10J78n48Q0m19O98k30N92l17j17j09k10J56k02N15j46P1j01o0M16
$$ 314 40 150 328 -220 -140 -559 139 -91 501 184 67 -42 -252 -96 -298 217 71 142 41 -19 397
2502C97l38N2l81M50j09M8qj95N87n56j68K37N0l29J87n3J7K5K46j91J04k00K59
$$ 397 59 111 -270 180 71 119 111 -84 503 -53 -221 16 66 -263 -76 -129 -112 -87 159 -32 72 -128 131
2525A31r6o3l12O31m33M79n43L3K10k81K46j17r2L02N4j27l12K71K00m92K48j35
$$ 131 35 -28 -340 291 -142 337 -206 -173 37 -244 2 -115 -207 95 149 22 -290 -19 181 -311 -63 -198
2547a98K30J3m6J45k49L4K04k50M0J86J17l94K35j25J98Kl60J63K01m07K93pk2
$$ -198 32 45 -1 144 -105 -71 133 -117 -77 109 226 -168 67 -58 140 142 -218 -55 146 -261 32 25 3
2570Cj58j55M29l65rL74l15M55m09j42K75J04j48n4j24K59P1R5k75J81J41m17
$$ 3 -155 -310 119 -246 -255 119 -196 259 -150 -292 -17 87 -61 -115 -239 20 91 186 -89 92 233 -184
2592a84L74l16j7M1R7j52L83P9l26o6jL29j50j26R1j56K59k63K22k63m2J41r2
$$ -184 190 -126 -143 -102 -5 -157 226 305 -21 -87 -88 241 91 -35 56 -100 159 -104 118 -145 -187 -46 -138
2615a38J04L7J9m7L51m87K79j67K62k00J61m73O11m80k6K42K99m15R6J19j15O4
$$ -138 -34 3 22 -25 326 -161 118 -49 213 13 174 -299 312 -168 -194 48 347 -68 28 147 32 96
2637I6k4jq5J48p1Mk20K16r9k42M14l35K0J73M2J24l51M12j47J90l64J33PJ72
$$ 96 72 71 -14 134 63 67 -153 63 -36 -278 136 -199 -179 -6 36 160 -191 221 74 264 -100 33 40 212
2661B12l27j59K10j30M63k06j81J41r1K31j25P3r3o4m4J41L8J18m0O1k21m0o6
$$ 212 -115 -274 -64 -194 269 63 -118 23 -68 163 38 111 18 -46 -90 51 89 207 167 228 7 -33 -99
2684i9o9k44K99J30J15j08k48j18M34qk51L47l52K26l21J06N6k34L57r6K61m59
$$ -99 -168 -412 -113 17 132 24 -224 -342 92 84 -167 180 -172 54 -267 -161 -105 -339 18 -78 183 -276
2706b76p9N03k53k30M86j83J47j86j0j96L96jO1k7m03O2K96j63O6P1j04J21J51
$$ -276 -355 148 -105 -335 151 -32 115 -71 -81 -277 119 118 179 152 -251 -189 107 -56 10 81 -23 98 249
2729B49k13J22Q1k7k99l9J19p7K09k69J95K59l49k01N9J16j13L1L18j59L01k03
$$ 249 36 158 239 212 -87 -126 -7 -84 125 -144 51 310 -39 -240 -181 -65 -178 -147 171 12 313 110
2751A10k20J03k45J42N3K28o21O76n19K27L6j18J44J48R3m71L56l04o9J32k71
$$ 110 -110 -7 -252 -110 -57 171 -450 226 -293 -66 -30 -148 -4 144 237 -234 122 -182 -251 -119 -390
2772c90K60%K5J67j54J06r3Q4%N7l56L94Q2k96J15n1L35k04m0j99K24j10J60j23
$$ -390 -130 -130 -105 62 -92 14 -79 5 5 62 -294 100 182 -114 1 -50 285 81 41 -158 66 -44 116 -7
2796gm7L12m20J4K0J51k38L53r6k85L53k00K66k13J21J6m01K51L02j41l04Q5J26
$$ -7 -54 258 -162 -148 -128 23 -215 138 42 -243 110 -90 176 -37 84 100 -301 -50 252 111 -193 -108 18
2819A8j76L56l46L85l90j09L16j23Q6k53J25K2k49M90k40j61L44J44K2m41K96
$$ 18 -158 198 -148 237 -153 -262 54 -69 17 -236 -111 -89 -338 152 -88 -249 95 239 261 -180 116
2840A16r3J9m8k11rJ56n3j50L74j50m68J37K32L90l28J67n49L81M27n53K44O0
$$ 116 23 42 -6 -217 -226 -70 -123 -273 101 -49 -517 -380 -148 242 -86 81 -468 -87 340 -213 31 91
2862I1n4N9j51J46k1p6K1J5k21J55K32n3q9m9J17l77K11q4J84k4J12l06K46k95
$$ 91 37 96 -55 91 70 -6 15 30 -191 -36 196 143 54 5 122 -255 -44 -128 56 32 144 -162 84 -211
2886b11K60P9j85ok30L63k21N3RO9O1J2k9l16L59j6P6m05J30L59n1k48L2R0k7
$$ -211 49 128 -57 -63 -293 70 -151 -98 -89 -20 41 53 24 -292 67 51 127 -278 -148 211 160 -88 -56 34 7
2911Gj71K75j84L00m26K70r3j71M83k80J7j84K36J80k24J79l76j2j8L87R9m7k5
$$ 7 -164 111 -73 227 -199 71 -22 -193 290 10 27 -157 79 259 35 214 -162 -174 -192 195 294 247 222
2934B22j62K37q5pj98r9K63K6n94L75k03J39J26kJ7qj41J6j6L97m84L81k97j05
$$ 222 60 297 212 205 7 -92 171 197 -397 -22 -225 -86 40 38 55 47 -94 -78 -94 303 -181 200 -97 -202
2958b02J83j60N8J63k69L11k85L89k97J50j56k61L62J25j37k7J97o1qk08JJ20
$$ -202 -19 -179 -121 42 -227 84 -201 188 -109 41 -115 -376 -14 111 -26 -53 144 83 75 -133 -132 -12
2980a2J70r2k53L89l17K00j17K5J74k2Oj88J88J7q7m8q1n1N3n4J0K17j64L5L2
$$ -12 158 66 -187 202 -115 85 -32 -7 167 145 151 -37 151 168 81 33 -48 -99 -46 -100 -90 127 -37 -2 30
3005C0m0J61j48j02j16K23j18p4J49N0J44oj89L37k58O0k66J8P6J6P5J4m80O62
$$ 30 -10 151 3 -99 -215 8 -110 -184 -35 15 159 153 -36 301 43 103 -163 -145 -69 -53 22 36 -444 218
3029B18p7l24J35K6K26K2k16j0Q0j29P1l77J88R0n8K5L35m5O9j71l19O3J70L56
$$ 218 141 -183 -48 -22 204 226 10 0 80 -49 22 -355 -167 -77 -135 -110 225 180 249 78 -241 -178 -8 348
3053C48l03J61l1L6j27k9Q2j5o9j14K87l21q5j44L35k45o4N28l56K72j05R6j61
$$ 348 45 206 175 211 84 55 137 122 53 -61 226 -95 -180 -324 11 -234 -298 230 -126 146 41 137 -24
3076b4K22j64j34L30l28j83K80l06K00j44K19K43j29J94k2Lj64j12qP0k5Kn8j34
$$ -24 198 34 -100 230 -98 -281 -1 -307 -107 -251 -32 211 82 276 254 257 93 -19 -27 43 18 20 -38 -172
3100a72J81l05L79j29Q5j61j45O45l08j23j46p6L31L3K86m10p4p4rK7K96m1j78
$$ -172 9 -296 83 -46 39 -122 -267 378 70 -53 -199 -275 56 89 375 -35 -109 -183 -192 -165 131 90 -88
3123h8k1M6k0L38l90j04K08J4l4q2M8K29k45K8k37L91J46k71J95m7l56Q3K36j37
$$ -88 -109 -63 -83 255 -135 -239 -31 -17 -51 -133 -85 144 -101 -73 -310 81 227 -44 151 104 -252 -169 67 -70
3147g0J0K18j27l31L26N8q0n2k27L0J87j35K46n2j58J03J42k51P1m2k98L14j56
$$ -70 -60 158 31 -300 26 84 4 -48 -275 -245 -58 -193 53 1 -157 -54 88 -163 -92 -134 -432 -118 -274
3170b74K10j75K52J90p9p0K1m42M96j14O5j72o1q6J97J40j32J76Q4j10p7m0j6
$$ -274 -64 -239 13 203 124 54 75 -367 129 15 80 -92 -153 -239 -42 98 -34 142 226 116 39 -1 -17
3193a7j41kJ38K8k90M35j96J50J74l99jj1J85l49M19o1j52N3J59J01R0k72j37
$$ -17 -158 -160 -22 6 -284 151 -45 105 279 -120 -121 -132 53 -296 123 62 -90 -37 122 223 313 41 -96
3216i6j97L70J7K0j43nK49n23P0J12K91j78jj06J19J52jm8J53m49J74j2k86M48
$$ -96 -293 77 94 114 -29 -34 215 -308 -238 -126 165 -13 -14 -120 -1 151 150 102 255 -194 -20 -32 -318 130
3240A30l88K83j06p6J93J9k73M17j53O3O0j56Ml1J90K77m95Q9r9k39N52k66J92
$$ 130 -258 25 -81 -157 36 55 -218 199 46 109 169 13 17 -14 176 453 -42 47 -52 -291 261 -5 187
3263A87r1j68P1n3Jp5K06R5l98K07k30K56K6j81N6K28o6l81L25k39L07p9m16O67
$$ 187 96 -72 -1 -54 -53 -128 78 173 -225 -18 -248 8 34 -147 -91 137 71 -310 15 -224 83 4 -412 255
3287B55j99J7J2q2j84l0K23l36M12K37l66M40n10L8k16K61K39j91M9M3m7l5k22
$$ 255 56 73 85 3 -181 -211 12 -324 88 325 -41 399 -111 -73 -289 -28 211 20 69 112 65 30 -192
3310a92K51l86L56k40O3M38l85o8J51N6k57L08n8j82J76N4n8j49j9J08p1k3L28
$$ -192 59 -327 29 -211 -148 290 -95 -163 -12 44 -213 95 37 -145 31 85 27 -122 -141 -33 -104 -127 201
3333B01L0k88j63K13J97k06k61M31j12K81l63J52l28L24pJ6k02J24k17J25J0j09
$$ 201 231 -57 -220 -7 190 -16 -277 154 42 323 -40 112 -216 108 101 117 -85 39 -178 -53 -43 -152
3355a52J76j91K12m36M93P0k2k62J20M3P3k05K88q5m2J09l08Q7J2k76K4N52l62
$$ -152 24 -167 45 -391 102 172 150 -112 8 51 124 -81 207 122 80 189 -119 -32 -20 -296 -272 280 -82
3378h2L19p1m93M15P9j22k71J13O2j73K10j13L61j13j21J27m38M51k48J83J76
$$ -82 237 166 -327 88 167 45 -226 -113 -51 -224 -14 -127 234 121 0 127 -311 140 -108 75 251
3399B51l90K8R3M1k0L5m4J69J07l71J55k37J42QO7p5J79J3j56mo9J06N8j03J44
$$ 251 -139 -111 -18 23 3 38 -6 163 270 -101 54 -183 -41 -33 34 -41 138 151 -5 -9 -78 28 86 -17 127
3424A27k95L04J03j95R3p2j39J65m46J05L32r1j53L74k13K13j92o1p1J2L49r7
$$ 127 -168 136 239 44 137 65 -74 91 -355 -250 82 -9 -162 212 -1 212 20 -41 -112 -100 249 152
3446A52o0J35m28M59j78Lkj71j46p9K74k11j74L04K12l15N0J62L2L2O0k78K7J07
$$ 152 92 227 -201 258 80 83 81 -90 -236 -315 -41 -252 -426 -122 90 -225 -175 -13 19 51 111 -167 -140 -33
3470c3M13l90J13j61K95l03M14m79M1m4K83j23j94K29j49L14j01k5m10L74J41
$$ -33 380 -10 103 -58 237 -66 348 -131 -90 -134 149 26 -168 61 -88 226 125 100 -310 64 205
3491B05p5r4j3mj2N7j83JK3J14N8k5O1l6J11j11J10k54J94j93j32K9K08L13o25
$$ 205 130 36 23 19 7 64 -119 -118 -95 19 77 52 113 77 188 77 187 -67 127 -66 -198 -169 39 352 -273
3516b73J85j43q4M18j98O6j05J92K1N9k27j48K80JM1j59K46j83N2J81l00l1j68
$$ -273 -88 -231 -315 103 -95 -29 -134 58 79 138 -89 -237 43 44 85 -74 172 -11 41 222 -78 -109 -277
3539b77N21j57j3l13M01p4l46N74l62O0k24R2J47k68R0L14j13Q6J38j22o7J31
$$ -277 244 87 74 -239 162 88 -258 316 -46 14 -210 -118 29 -239 -149 165 52 138 276 154 87 218
3561B18j86jr6j97K74K90n20J9K47K38j31j64j28J34J1n3L31j0m59J12po4J80
$$ 218 32 31 -65 -262 12 302 -218 -199 48 286 155 -9 -137 -3 8 -45 286 276 -183 -71 -78 -142 38
3584C8l12M71j37k51K63p3j15P9nJ79J66m69L57l17L69j27j8j1j95J06l61M29
$$ 38 -274 197 60 -191 72 -1 -116 -37 -42 137 303 -166 191 -126 243 116 98 87 -108 -2 -363 66
3606F6k44L6J05M91o77J08K46k27K77l99L44m41L36j16K96n22L72K98l14N9q0
$$ 66 -178 -142 -37 454 -223 -115 131 -96 181 -218 126 -315 21 -95 201 -321 51 349 35 94 14
3627A4J28j29n7j01j41j3L05j84l5J64J25j1J89k68O6j05q9N65l36l76J47J36
$$ 14 142 13 -44 -145 -286 -299 6 -178 -213 -49 76 65 254 -14 52 -53 -142 423 87 -289 -142 -6
3649fn0mj97L45k7L1k60L2L67k78L07r0j94j26L74j83M3l79L73r2j71l2n8L71
$$ -6 -56 -60 -257 88 61 92 -168 -136 231 -47 260 170 -24 -150 224 41 84 -295 78 -14 -185 -217 -275 96
3673I6j66K24j56k7K7L28m18K99n38R4M57m12K97j41M6J63k81J9O3j30K01n8p1
$$ 96 -70 154 -2 -29 -2 326 -92 207 -331 -237 220 -192 105 -36 10 173 -108 -89 -26 -156 45 -13 -84
3696h4K2J8l8O7Q1j1J48Ql26R7l53M98j71K50l20K00q5J26j78M3j06Q0MlJ54J29
$$ -84 -62 -44 -82 -15 66 55 203 211 -115 -18 -371 127 -44 206 -114 86 1 127 -51 -8 -114 -34 -30 -33 121 250
3722B50l05j14J87m46L13k07K38K36j04r3L24j84J43j26J44J8k87j1J63K29n39
$$ 250 -55 -169 18 -428 -115 -322 -84 152 48 -45 279 95 238 112 256 274 -13 -24 139 368 -171
3743a71J26J55M50m50%k68J99R9m9nO7j00j58L30k6m4n57L28p6O5L03L12k62k98
$$ -171 -45 110 560 110 110 -158 41 140 91 86 153 53 -105 225 199 155 -402 -74 -150 -85 218 530 268 -30
3767c0Q1k27j20J89K39k21l5J21N7J57J3n2k82o9J13O0r9J79k90RQ3K76k68J58
$$ -30 51 -176 -296 -107 132 -89 -124 -3 54 211 224 172 -110 -179 -66 -6 -105 74 -216 -207 -124 152 -116 42
3791D2K1J05l63L33j49O6l0n6j42L95j13N5o84M10N25j67j73R4j82J28l61L89
$$ 42 63 168 -195 138 -11 55 25 -31 -173 222 109 164 -520 -110 415 248 75 169 -13 115 -246 143
3813A43R2k7j90k77L44l72K5K86K7q6j82K67J06l77J75J41l04J51J18O4J19l46
$$ 143 235 208 18 -259 85 -287 -262 24 51 -35 -217 50 156 -221 -46 95 -209 -58 60 124 243 -103
3835a03J83O0l04K04K59k90Pj27J05k79n3J45J55r6j03L97l53O54l40J19j98o3
$$ -103 80 140 -164 40 299 9 16 -111 -6 -285 -338 -193 -38 -134 -237 160 -193 461 121 240 42 -21
3857b1m1L1K32k48O0K8J69J3k85k17J93k1l9K8j30M98l94K61j84J71J29P2l79
$$ -21 -62 -31 201 -47 13 41 210 223 -62 -279 -86 -107 -146 -118 -248 250 -144 117 -67 104 233 305 -74
3880g4j17J8J87R0k94K13J17k73K93J45l29j60K03o1J28m30L09l59N84k17J65
$$ -74 -191 -173 14 104 -190 23 140 -133 160 305 -24 -184 19 -42 86 -344 -35 -394 190 -27 138
3901A38l86J36J83J10k78J06J52j36J72pj04k81L55m04L08j95J88l76P3J91J38
$$ 138 -248 -112 71 181 -97 9 161 25 197 190 86 -195 160 -244 64 -131 57 -319 -246 -55 83
3922H3k19O5P7j3K65k61j46k05M07Q0m61L61oj3O8j22J34l38K56Q5j54K63n5m75
$$ 83 -136 -71 6 -7 258 -3 -149 -354 53 133 -328 33 27 14 82 -40 94 -244 12 97 -57 206 151 -324
3946c24O43l45j3J04n0mj57J97j22l70O46q1J64m49j96M71l8l01K85J20L3r2k7
$$ -324 319 -26 -39 65 15 11 -146 51 -71 -441 205 124 288 -161 -357 114 76 -225 60 180 213 121 94
3969I4j06Q4P8l40J69O5M6K9k29o5K63qQ3k48m2m0mL84k71J87q3K96n57K79j77
$$ 94 -12 72 150 -190 -21 44 90 119 -110 -175 88 80 163 -85 -127 -167 -171 213 -58 129 46 342 -215 64 -113
3994a13J49j70J50J20l4k70j14K92L9J39o1k44j77N19j9k03M0j63L5L0j53l4p3
$$ -113 36 -134 16 136 102 -168 -282 10 49 188 127 -117 -294 225 206 3 43 -120 -85 -55 -208 -242 -315
4017c15P5L86l20J78p0K10K30l68j45j35J45pL05k5l77L61k10K97l16J05P0m07
$$ -315 -240 146 -174 4 -66 144 374 6 -139 -274 -129 -136 169 144 -233 128 -82 215 -101 4 74 -333
4039c33O93m66j14L89k59K40p2J01l9r5J05Np2K1j87J02j89M28j73k11J26m17
$$ -333 360 -106 -220 169 -90 150 78 179 140 45 150 155 83 104 -83 19 -170 258 85 -126 0 -417
4061d17K44k44P75l41l1J44j33j17pJ32j65J11j52M98l49K48k35K83j82j58N15
$$ -417 -173 -417 358 17 -14 130 -3 -120 -127 5 -160 -49 -201 297 -52 196 -39 244 62 -96 419
4082D19o38L65R8l22L9K9J82j02qK21k0k84K18l7K7k41K57o44K75M01l01j07K69
$$ 419 -219 146 244 -78 -39 -10 172 70 62 283 263 -21 197 160 187 -54 203 -441 -166 235 -66 -173 96
4105I6j53j47N8J7j34M86J13j16n11L12K6Q9P3m36K68o9N84p04K63j18n8k11K13
$$ 96 -57 -204 -146 -129 -263 223 336 220 -291 21 47 136 209 -227 41 -28 556 -148 115 -3 -61 -272 -59
4128e9j56K55j07K60n6p5j15J85P3K39l72o5r4o8M3M12m17k06L41nK11m12L50
$$ -59 -215 40 -67 193 137 62 -53 132 205 444 72 7 -87 -155 -112 300 -117 -323 18 13 224 -188 162
4151A62m6j4R5l45J17k9L37l4k19K31l73K05p7k09j7M61k21J31l47K67k10P5K31
$$ 162 116 102 197 -148 -31 -60 277 243 24 255 -118 87 10 -199 -216 245 24 155 -192 75 -135 -60 171
4174A71k54LJ36j14o2J59J28j25m89O16J8j10J6j26j8j89K97N9J44l46QO0j57
$$ 171 -83 -80 56 -58 -120 39 167 42 -447 169 187 77 93 -33 -51 -240 57 116 260 -86 -78 -18 -175
4197a75k3p7K05R5j5j46k03Q6M34k47m7R0L43k18j62P1M6k26K62J31n53j06O66
$$ -175 -198 -275 -70 25 10 -136 -339 -253 181 -66 -113 -23 320 102 -60 11 57 -169 93 224 -329 -435 231
4220B31P9m68K18j13j15N2L10l83N24k60l43O34k06r3j12J34l34j29M11J19j90
$$ 231 310 -158 60 -53 -168 -116 194 -189 335 75 -268 366 160 67 -45 89 -245 -374 37 156 -34
4241c4P2J50j25l28J84K32R5l84k62M84J49l82J51j51j10M47j70K34r0k48J39
$$ -34 38 188 63 -265 -81 151 246 -138 -400 84 233 -149 2 -149 -259 188 18 252 162 -86 53
4262E3k16NoK59p3j9R7p5j85j38J68K6K76l3k22J02Nj91L9Q2j16N0J85j91K01
$$ 53 -163 -158 -164 95 22 3 100 25 -160 -298 -130 -104 172 139 -83 19 24 -167 -128 -46 -162 -112 73 -118 83
4287H3q2j96Q8K45n1Pk65M88l23J91l64J89O2j06jK69k32L3k06j8Lj0L22o2J45
$$ 83 1 -195 -107 138 87 94 -171 317 -6 185 -179 10 72 -34 -35 234 2 35 -171 -189 -186 -196 126 64 209
4312B09k03J21k62P9R3r1N5j85n2J81K70K95p74L85K80n72J58j34J14J74l21L45
$$ 209 6 127 -135 -56 37 -54 1 -184 -236 -55 215 510 -264 121 401 -171 -13 -147 -33 141 -180 165
4334A65m58N1K85j40O11m77K5j44J73l8L9k03J03L22l94P4m9O1l86K06o0L2J17
$$ 165 -293 -242 43 -97 514 37 62 -82 91 53 92 -111 -8 314 -80 -6 -55 6 -380 -174 -234 -202 -85
4357h5K5k78L50J11Rk9l05N0N4P4j18K59K50l97J8K78l65J95P4j35l35Q3K60m17
$$ -85 -60 -338 12 123 132 103 -202 -152 -98 -24 -142 117 367 -30 -12 266 -99 96 170 35 -300 -217 43 -374
4381c74K84R9l1j88L02O8j86J78r4l90M95j35K8l91J73J53l0k2J37k08J74k9j89
$$ -374 -90 9 -22 -210 92 160 -26 152 58 -332 163 28 56 -335 -162 -9 -39 -61 76 -132 42 13 -176
4404a76L60k18o0j8J69J46k40n5oj21J65J52P3K9j02k89K3K90k89J13J91n4J12
$$ -176 184 -34 -94 -112 57 203 -37 -92 -98 -219 -54 98 171 200 98 -191 -168 122 -167 -54 137 83 195
4427A95M0j27l5k10Q5K98o2m16L03pR2J71l85J5K58k45j12P5J97l6j68J44o2Q3
$$ 195 235 108 73 -137 -52 246 184 -232 71 64 156 327 -58 -43 215 -30 -142 -67 130 94 -74 70 8 91
4451I1k56K69p7j30lL44j40L7k52J66M44o31L1K97j84j38N5N2J40j06J17p0n8
$$ 91 -165 104 27 -103 -106 238 98 135 -117 49 493 -138 -107 190 6 -132 -77 -25 115 9 126 56 -2
4474bJ11k91R8J89j41k78J59K49j22J21k49L4L04q5J31o84N02O7r0J13n3p4J5
$$ -2 109 -182 -84 105 -36 -314 -155 94 -28 93 -156 -122 182 97 228 -456 46 113 23 136 83 9 24
4497B4o3n6RR4K8l71K86m5J45o1p7N1n0J13o6J69k12j43M28l63N05m47K37k74
$$ 24 -39 -95 -86 8 36 -335 -49 -94 51 -10 -87 -36 -86 27 -39 130 -82 -225 203 -160 345 -102 135 -139
4521a39l1K46k46L00N2j61J07j85l05M01J47l71K79k54R0j09K99r5R9k51M3oJ01
$$ -139 -170 76 -170 130 182 21 128 -57 -362 39 186 -185 94 -160 -70 -179 120 25 124 -127 -84 -90 11
4544A1l6J37J0J4r5j35K58k77n1l8L39j82J03J87l32Q6j06J50n2N2J38J32k03
$$ 11 -25 112 122 136 41 -94 164 -113 -164 -202 137 -45 58 245 -87 -1 -107 43 -9 43 181 313 110
4567A10k59M5N44k18q0k47K90n67K93K06k87K10P2R0l46R1K6j27J10j5j01K20
$$ 110 -149 -104 440 222 142 -105 185 -382 -89 117 -170 40 112 202 -144 -53 -27 -154 -44 -59 -160 60
4589F0k34J81J76j55L41n02l3L51k77K58j75J19k82K33o7j49P5J47rj30L97o62
$$ 60 -174 7 183 28 369 -133 -166 185 -92 166 -9 110 -172 61 -6 -155 -80 67 58 -72 325 -337
4611c37L43J93j91k71O4Q3J1Lj23K32K30j27j14R7j08k8L44m22L08K9k19J01j88
$$ -337 6 199 8 -263 -199 -116 -105 -102 -225 7 237 110 -4 93 -15 -43 301 -121 187 216 -3 98 -90
4634i0q3J48L5K1J05P4m99J54MJ63l5j00J16r1N7k1J91k61K33j34r0K6N7j92K13
$$ -90 -173 -25 10 31 136 210 -289 -135 -131 32 -3 -103 13 -78 -21 -42 149 -112 121 -13 -103 -77 -20 -212 1
4659AJ12j40O2J0K07j51l03K00J94n8N8k33j62L29k22M78m52k27K36K32j46r3
$$ 1 113 -27 35 45 252 101 -202 -2 192 134 192 -41 -203 126 -96 382 -70 -297 -61 171 25 -68
4681f8L3k1j10L18k27J78k14P3M5k94K60K60j5l43J43J3l62K25K63m38M61O0l24
$$ -68 -35 -56 -166 152 -75 103 -111 -38 7 -287 -27 233 218 -125 18 31 -331 -106 157 -281 180 240 -84
4704h4M2p2L6J84j86M94n61M47n43K68R6l4j1j54n1J32p7L09k40P8j89L2j03J3
$$ -84 -42 -114 -78 106 -80 414 -147 300 -243 25 121 87 76 -78 -129 3 -74 235 -5 73 -116 -84 -187 -174
4728a74N18m33j22J70J46p5l3k82P61n96J42k88L97p9m2k3R0P9k4k77J39o4L46
$$ -174 344 -89 -211 -41 105 30 -3 -285 476 -120 22 -266 131 52 10 -13 77 156 132 -145 -6 -70 276
4751B76j69Q3J88n75J38R3l20lJ52J49k26M41j95N5N4q7j10N7l05K00k6m1K29
$$ 276 107 190 378 -197 -59 34 -286 -289 -137 12 -214 227 32 87 141 54 -56 1 -304 -104 -130 -171 58
4774E8k21J97j68k16K68N6Q1j17Nj23J35r5j1M49k72L31k60m3j27l5J41J0k14
$$ 58 -163 34 -134 -350 -82 -26 55 -62 -57 -180 -45 -140 -151 298 26 357 97 54 -73 -108 33 43 -171
4797a71k9P5K42P7k60N1j64J26mqJ81P0q5k79P5j6L03L6k82J10j10L62k74n7m0
$$ -171 -200 -125 117 194 -66 -15 -179 -53 -57 -65 116 186 101 -178 -103 -119 184 220 -62 48 -62 300 26 -31 -71
4822g1j5J21j56J57p3M8k28n1L77j50k5L42k96mL3%n0O1kj05J37j04n2K76k78
$$ -71 -86 35 -121 36 -37 11 -217 -268 109 -41 -66 276 -20 -24 9 9 -41 20 18 -87 50 -54 -106 170 -108
4847a08M95o14J17k42K84L99m94K36j48p5N25o28M28k36j51K00J60n2k7j67J11
$$ -108 387 -227 -110 -352 -68 331 -163 73 -75 -150 375 -253 175 -61 -212 -12 148 96 69 -98 13
4868A3J83n5l80M02k56J32j82K04J90l36n5K1J60m68P09n07J60j7l9M39k75R8
$$ 13 196 141 -239 163 -93 39 -143 61 251 -85 -140 -119 41 -427 282 -225 -65 -82 -121 318 43 141
4890A41o0l8M5j37J6p9J70k68L11j42K31l17J69k36J49j37N03l95J03l23M89m1
$$ 141 81 43 88 -49 -33 -112 58 -210 101 -41 190 -127 42 -194 -45 -182 321 -74 29 -294 195 154
4912A54k32j58L78J70k14q1L5j62K48J5l60K41k18K2L8K31P3j32k78N94j26m98
$$ 154 -78 -236 142 312 98 17 52 -110 138 153 -207 34 -184 -162 -124 107 180 48 -230 364 238 -260
4934b60M67l42j26J14j64Q1J63M3j64L03n7j09J42k32L60l80L59k95p2Q7j5J58
$$ -260 207 -135 -261 -147 -311 -230 -67 -24 -188 115 58 -51 91 -141 219 -161 198 -97 -169 -82 -97 61
4956F1j09p6J05l4k7P7j12J55k4J23r3j73J38j1J1K16l35R5j05m0K67k63L41k36
$$ 61 -48 -124 -19 -53 -80 -3 -115 40 16 139 46 -127 11 0 11 227 -108 -13 -118 -158 109 -154 187 -49
4980d9j73L68j75l9J29K21l72J36P3k31q1K89Q4k20J88j68J3k23K56L0J39o3j50
$$ -49 -222 146 -29 -68 61 282 -90 46 119 -112 -193 96 180 -40 148 -20 -7 -230 26 56 195 132 -18
5003a8J0j05K24j17k76J66L50j97K44m85K94O9l70P2L08J6j8o21J69K26J12r5
$$ -18 -8 -113 111 -6 -282 -116 234 37 281 -204 90 159 -211 -139 169 185 167 -454 -285 -59 53 -42
5025d2L29m62L61n1o58M07K22j99m0p4n8J96J08j60J19j99J46L8q4J41j23K1l08
$$ -42 287 -175 186 135 -523 -116 106 -93 -133 -207 -265 -69 39 -121 -2 -201 -55 -17 -101 40 -83 -62 -370
5048c70K89k92K91J22J52j73J4j10j05J4J15J41m7O2L0L4o7m94N25k96M95k14
$$ -370 -81 -373 -82 40 192 19 33 -77 -182 -168 -53 88 41 103 133 167 100 -394 131 -165 330 116
5070A16k41J02l3L78m37J18K38j8k01l06J73j13J52M5j18J93n0k41P6L69l64P
$$ 116 -125 -23 -56 322 -115 3 241 223 22 -284 -111 -224 -72 -27 -145 48 -2 -243 -167 202 -162 -155
5092a55J32j49J11J37j51kJ66l55J29L78q1k62j87j89L45J87k82J99l9J3m1j28
$$ -155 -23 -172 -61 76 -75 -77 89 -266 -137 241 160 -102 -289 -478 -133 54 -228 -29 -68 -55 -96 -224
5114b24L93l21J65J55q2l05j3J71m4K60j1kj44oO6k82N7Q6M1K28l47L28j50Q7
$$ -224 169 -152 13 168 86 -219 -232 -61 -105 155 144 142 -2 -8 58 -224 -167 -81 -40 188 -159 169 19 106
5138A06J36J62n72k51N49l9nr4K57m89K79J62l51L17k15j3K30k04j53N8m6J80
$$ 106 242 404 -168 -419 130 91 86 -8 249 -240 39 201 -150 167 -48 -61 169 -35 -188 -130 -176 4
5160DN3J41j40k03L72Qj53k01J82k17J56K05J9j97n9j8k11M47m29K92K80l24J86
$$ 4 57 198 58 -145 227 235 82 -119 63 -154 2 207 226 29 -30 -48 -259 188 -241 51 331 7 193
5183A93n3k32J78l5j41j21M61j9l06R7J2J35J09P9p33P06n02K17P2qm28L10j06
$$ 193 140 -92 86 51 -90 -211 250 231 -75 22 34 169 278 357 -376 330 -172 45 117 109 -319 -9 -115
5206a15j32K31j94M35j92K4j92J77J12Q0J08l79J90r6O6q7l24N32m45L99j83O7
$$ -115 -247 -16 -210 225 33 57 -135 42 154 234 342 -37 153 57 123 36 -288 244 -201 198 15 82
5228H2j45L1J42L9L6l52l97M82K09l00J21J25j61o3L65k69K72m41KK17k12J99
$$ 82 -63 -32 110 149 185 -167 -564 -82 127 -173 -52 73 -88 -151 214 -55 217 -224 -222 -5 -217 -18
5250a8J1L19k55k87K13j85J26J77P7K44p28jK57M97n38K91j74k35K04j3r5J49
$$ -18 -7 312 57 -230 -17 -202 -76 101 178 422 -306 -307 -50 447 -91 200 26 -209 -5 -18 -113 36
5272C6j05K7Q5k6r4J84p7J21k44k52L40p3N8K49l30m1r6J94L14m42N2L80l90M64
$$ 36 -69 -42 43 17 -77 107 30 151 -93 -345 -5 -78 -20 229 -101 -142 -238 -44 270 -172 -120 260 -130 334
5296C34l41j7k2m1J84m73M33k15R9J99J9k52J89r7m6o9j70N12J4j64k62N9L24
$$ 334 -7 -24 -46 -87 97 -376 57 -158 -59 140 159 -93 96 -1 -47 -116 -286 226 240 76 -186 -127 197
5319A97o28J01K20K44o10N16p1K09k61K23n3k17K0J0rK50j33j20L71l10P8j31
$$ 197 -431 -330 -110 134 -476 40 -31 178 -83 140 87 -130 -110 -100 -109 141 8 -112 259 -51 27 -104
5341a04p6K71Pl5nQ1k36O4j01n0J94Q8k36K9L0p7J90l9o4m36N06J67k72o4K47
$$ -104 -180 91 98 63 58 139 -97 -33 -134 -184 10 98 -138 -109 -79 -156 34 -5 -69 -505 1 168 -104 -168 79
5366G9k05J76P0k48L66j69j30J13R6j58JQj84J32L09o7n3m02q5K34N49k74j89
$$ 79 -126 50 120 -128 238 69 -61 52 148 -10 -9 -1 -185 -53 256 189 136 -266 -351 -117 432 158 -31
5389c1J04j95L36n30L54r6J37m6j97L46k26kl7M7J0J98j38L0l1Q6l43J37J12M
$$ -31 73 -122 214 -316 38 -58 79 33 -164 182 -44 -46 -83 -36 -26 172 34 64 33 119 -224 -87 25 29
5413B9L9n5K24m81J12n2L29k59j07M49l21L70k65K08j35k92P3NJ18j74M24j27
$$ 29 68 13 237 -244 -132 -184 145 -114 -221 228 -93 277 12 220 85 -207 -134 -129 -11 -185 239 112
5435A12j91J0K20O9j65j17j91K41j9m1K28L9k56k59M61J28l21K85l21L00l06K25
$$ 112 -79 -69 151 220 55 -62 -253 -12 -31 -72 156 195 -61 -320 141 269 -52 233 -88 212 -94 131
5457A31j52J70K0L0p2n0l9q1M64k84n09J73K05R5q1k75M02j46R4o9L87n19N2m1
$$ 131 -21 149 169 199 127 77 38 -43 421 137 -372 -199 6 101 20 -255 147 1 95 26 413 -106 -54 -95
5481i5pqo9N22m62J19L7Km58O9K00L01J04n37J77L98j75j31k69L96n76M56j44
$$ -95 -102 -110 -179 343 -119 0 37 39 -419 -350 -150 151 255 -282 -105 293 118 -13 -282 114 -462 -6 -150
5504a50M19m69O8j65M40k01j7K09J73K97n43n7j64L78m20N81j58j99L7j57j07
$$ -150 269 -200 -132 -297 143 -58 -75 134 307 604 61 4 -160 218 -202 379 221 22 59 -98 -205
5525b05K98m17L78l9J41l56J49J84K46l35K07j28m20J24J52r5j2n0K74O6k57L39
$$ -205 93 -324 54 15 156 -200 -51 133 379 44 251 123 -297 -173 -21 -116 -128 -178 96 162 -95 244
5547B44k32L4k69n5J28R9l4j2J2j12K94L1j26m9M4j82K59j20j09L28j9j24j62
$$ 244 12 46 -223 -278 -150 -51 -85 -97 -85 -197 97 128 2 -47 -3 -185 74 -46 -155 173 154 30 -132
5570a32m04N60J61j69J84k52%l2j07K34O7J3J11k24o0K2J25j41J27m58L82P8j24
$$ -132 -536 24 185 16 200 -52 -52 -84 -191 43 110 123 234 10 -50 -28 97 -44 83 -375 7 85 -39
5593c9J80J55q1l15K47k64M22m48M4R0J9R0l40L97m5k61j2m8J36L91%m69M30l12
$$ -39 141 296 215 -100 147 -117 305 -143 -99 -9 10 100 -240 157 112 -149 -161 -209 -73 318 318 -151 279 -33
5617c3j04J90K06l89NM9J07j3o5n4J97l75J45J42jk29K57j17o1L43j17j81j45
$$ -33 -137 53 259 -130 -125 -76 31 18 -47 -101 96 -279 -134 8 7 -222 35 -82 -143 200 83 -98 -243
5640b43N31k15j3k37K52m88J61M57k61j68J34J06%j26J31PJ77j36J15l38K38R5
$$ -243 288 73 60 -177 75 -413 -252 205 -56 -224 -90 16 16 -110 21 28 205 69 184 -154 84 179
5662A79l5m40K4J62n5K30j5k8q7K19l00K78j12K9k52L45k62L11K5k50J15J50m48
$$ 179 144 -296 -272 -110 -165 65 50 22 -65 154 -146 132 20 49 -203 142 -120 191 216 -34 81 231 -217
5685b17N94o27P8L40k31J70J22r4k98L06k7k84L17r5l86j09M78k76J21M4O0L6
$$ -217 377 -250 -172 168 -63 107 229 135 -163 143 116 -168 149 54 -332 -441 37 -239 -118 -74 -14 22
5707B2j01K82l97J48q9j74O3J3m3M13j75n7M3K94o9j45J18l00L68k86K43rO3k33
$$ 22 -79 203 -194 -46 -135 -309 -246 -233 -276 137 -38 -95 -52 242 173 28 146 -154 214 -72 171 162 225 -8
5731hJ5k69L43j3k25K58m35M81m78K06LM8J25k30J35J1J40k71M6O4k4M1J61k01
$$ -8 7 -262 81 68 -157 101 -334 147 -331 -125 -122 -74 51 -179 -44 -33 107 -164 -118 -54 -78 -37 124 -77
5755g7L40k38j3J8J13j82K14k43j22MK36l9l22J67K87N2j54k08J81j27N01l85
$$ -77 263 25 12 30 143 -39 175 -68 -190 -186 50 11 -311 -144 143 195 41 -167 14 -113 388 3
5777Cq1K13m06p2J60K83KM4M9j86j79K78q8o2PL7n3N4K8j46M82l03r2j62L16n1
$$ 3 -78 135 -271 -343 -183 100 102 146 195 9 -170 108 20 -42 -35 2 -51 3 31 -115 367 64 -28 -190 126 75
5803G5k05L60o1r0RR4m30J67o8l6rJ21N7J77O9j1m83J21N4k70O56p7k42p6O0n3
$$ 75 -130 230 169 79 88 182 -248 -81 -149 -185 -194 -73 -16 161 230 219 -264 -143 -89 -359 297 220 -22 -98 -38 -91
5829i1jm4K79Kj77k0m3J43p4J96n1%k03l6k04JM34J23j18k14j00K70j51L35k68
$$ -91 -92 -136 143 145 -32 -52 -95 48 -26 170 119 119 -84 -120 -324 -323 111 234 116 -98 -198 72 -79 256 -12
5854a2J9O4O4j4k56M44m84K50j20K27k61j90O98m72K2j6J11l79L09j29r0J50J6
$$ -12 7 71 135 121 -135 309 -175 75 -45 182 -79 -269 429 -43 -21 -37 74 -305 4 -125 -215 -65 -49
5877d9K2n5%m6K27j98j49J04K14j4m42P91k99N6l23o9l0L58Q5j01o41K72L11M
$$ -49 -27 -82 -82 -128 99 -99 -248 -144 70 56 -386 405 106 162 -161 -230 -260 98 183 82 -559 -287 24 28
5901B8O8Rk6k4j28M7P3j49j34K23R7J31k25k74L27R8o9j05J8o1Q5J20q9J01l87
$$ 28 96 105 79 55 -73 -26 47 -102 -236 -13 84 215 -10 -284 43 141 72 -33 -15 -76 9 129 40 141 -246
5926b46L31j04n3J93j49N2l0n6q5J70j42L41j46K01q4J5j87p8k5j5j4O7m5J81
$$ -246 85 -19 -72 121 -28 24 -6 -62 -147 23 -119 222 76 277 193 208 21 -57 -82 -97 -111 -44 -89 92
5950I2P7k99J32j63L14n37N07p5j34j04L37K3m1j70J24j72J52Q6j07K68l44k5
$$ 92 169 -130 2 -161 153 -384 123 48 -86 -190 147 170 129 -41 83 -89 63 149 42 310 -34 -59
5972e9n9K48l20M70l17J56j57Nl6M66k42k84K32k14m7K47j02l7O7k53R6K32r8
$$ -59 -118 130 -190 280 -37 119 -38 -33 -69 397 155 -129 103 -111 -158 89 -13 -50 17 -236 -140 92 -6
5995fj21N1j15K14N2j71QJ60R4j58J28j3j85M40l79L37l72j2P4Q8j53J81m21J42
$$ -6 -127 -76 -191 23 75 -96 -88 72 166 8 136 123 -62 378 -1 336 -36 -48 26 114 -39 142 -279 -137
6019a37j14L73J8n47M73N6m21J94R2L8J29o2m18M17l82K73j43j40N2K43j36J56
$$ -137 -251 122 140 -407 66 122 -299 -105 -13 25 154 92 -326 91 -291 -18 -161 -301 -249 -6 -142 14
6041A4M1k25K23J7k4j3kQ7m41K94J34k45O0j02J25j39j1J88O3l42K03K63L8k90
$$ 14 55 -170 53 70 46 33 31 118 -323 -29 105 -140 -80 -182 -57 -196 -207 -19 44 -298 -95 168 206 -84
6065h4J6K85k11k78K79J07l17K17k18K34j97J17J00J29J97n96R6K66J2j53K06
$$ -84 -68 217 6 -272 7 114 -203 14 -204 30 -167 -50 50 179 376 -220 -124 142 154 1 207
6086B07j77j60K7j19K73k7l4l4o7K30l9j06J31k30j24L88P2J01o43L75L13n85
$$ 207 30 -130 -103 -222 51 24 -10 -44 -111 119 80 -26 105 -125 -249 139 211 312 -331 44 357 -228
6108b28J00L05m94M46J95k22k32j5L15J58r7k67O7O4j38k46K42K20m3k01j08l7
$$ -228 -128 177 -317 129 324 102 -130 -145 170 328 231 -36 31 95 -43 -289 -47 173 130 -71 -179 -216
6130b16K28r8M02n9l52J68Om2r0j25N96l68k25L06j37J38j62J35k71K44q2m6l7
$$ -216 12 -86 316 257 -95 73 79 37 -53 -178 418 50 -175 131 -6 132 -30 105 -166 78 -4 -50 -87
6153h7J15j38L57m11L33j33j76K78j50J64P1J22k74p3J06O4r0k01Q6R7L3Q4j35
$$ -87 28 -110 247 -164 169 36 -140 138 -12 152 223 345 71 -2 104 168 78 -123 -37 60 93 177 42
6176D2K31j69m29M76l31J30k1Q4J88m88N9J65P3q2L14k20k81K03j60K28q8J73
$$ 42 273 104 -325 151 -180 -50 -71 13 201 -287 -228 -63 10 -72 242 22 -259 -56 -216 12 -76 97
6198I7m9j63O3JK41k79J30j87N5J66j94L03r8j47J32k36O6L66o99M38J57n9j09
$$ 97 48 -115 -52 -51 190 -89 41 -146 -91 75 -119 184 86 -61 71 -165 -99 267 -432 6 163 104 -5
6221eJ09R3n82N06j12R1K5l38J89j28N17k35Jk62M3K54L2j68n5J08J02o15M89
$$ -5 104 197 -385 121 9 100 125 -213 -24 -152 365 130 131 -131 -88 166 198 30 -25 83 185 -430 59
6244E9j15J99m8j05m9L87k42j25N5J33R2o7k00J69R9k40N9J1p4k23K5Q0R7%N6
$$ 59 -56 143 95 -10 -59 328 86 -39 16 149 241 174 -26 143 242 2 61 72 -2 -225 -200 -120 -23 -23 33
6269C3J39k80J73j14L13r5j50l3j37N0R2j49M5J67j23J3r0N6J70j68j31L71o39
$$ 33 172 -108 65 -49 264 169 19 -14 -151 -101 -9 -158 -113 54 -69 -56 -146 -90 80 -88 -219 152 -487
6292d87K76O14l85j41j69K91J87k33k89L80j35K63j16mj12J6k6o7L07l6q4O9o
$$ -487 -211 403 18 -123 -292 -1 186 -47 -336 44 -91 172 56 52 -60 -44 -70 -137 170 134 50 119 113
6315A13Mm52J94J62l8N3J6J03n8K01l07J31m64K91j0k09J55L1p9L55n05L28k01
$$ 113 117 -335 -141 21 -17 36 52 155 97 298 -9 122 -342 -51 -61 -270 -115 -84 -163 192 -313 15 -186
6338a86l1M42l18l3k7K4M03k50k0rN1m5r5p5K93Q1k22L54n30J52k77M8K05Q4J1
$$ -186 -217 225 -93 -126 -153 -129 274 24 4 -5 46 1 -94 -169 124 205 -17 337 -193 -41 -318 -270 -65 19 30
6363C0j17L67j71k82L13n0j91N4qL10j72L18m13K9q7j32N41j61p1k27j40K99j34
$$ 30 -87 280 109 -173 140 90 -101 -47 -55 255 83 401 -12 17 -70 -202 339 178 107 -120 -260 39 -95
6386i5K0K73o03O12k63K96j89k49M76l23ML46m46J0K31j95K1N7rL0n0j0J76j48
$$ -95 -75 198 -405 207 -56 240 51 -198 278 -45 -41 305 -141 -131 100 -95 -74 -17 -26 4 -46 -56 120 -28
6410b8n0L5J67M4l77K6J33j10K77k1O9r8M5q7L67l51J00k66K80J36k14j34j31
$$ -28 -78 -43 124 168 -209 -183 -50 -160 117 96 165 67 112 25 392 41 141 -125 155 291 77 -57 -188
6433a88N1L90l42K76k32K8J43P3K27n74J08K77o5l88P9L92m31J2l8r2J96j57Q6
$$ -188 -137 253 -89 187 -45 -17 126 199 426 -148 -40 237 172 -216 -137 255 -176 -164 -202 -294 -98 -255 -169
6456a69L62k91M73l65j96J18J48j54K80o45K96Q4O8lj55K20K93l73n8J25ln1l93
$$ -169 193 -98 375 10 -186 -68 80 -74 206 -439 -143 -59 9 6 -149 71 364 -9 -67 58 55 4 -389
6479c89M42Q5k62l11N24p0J24l70L71k02K42M7k92p8M12l22K86j10k66L46k38
$$ -389 53 138 -124 -435 89 19 143 -227 144 -58 184 231 -61 -139 273 -49 237 127 -139 207 -31
6500c1J11k61M67k78j17K58k22K24Np8j20k1J53l69K58j5r2p9Q1R9K73k37n7K27
$$ -31 80 -181 286 8 -109 149 -73 151 156 78 -42 -63 90 -279 -21 -36 -128 -207 -126 -27 246 9 -48 179
6524A79j82j05P8J9M9r4L8J08K1J9j90K2p2j67N58j00l79k64O28k50p8K15k35
$$ 179 -3 -108 -30 -11 38 -56 -18 90 111 130 -60 -38 -110 -277 281 181 -198 -462 166 -84 -162 53 -182
6547a82j29K15J8o4K40K16j50L0k67o7P2K09k0l31K93p6M4J59k27k30K0K53J62
$$ -182 -311 -96 -78 -142 98 314 164 194 -73 -140 -68 141 121 -210 83 7 51 210 -17 -247 -227 26 188
6570A88K6k45o2O0J09k20Q9j4K47j25J02o8J05m21O31p16M66J23q4K81m79O6K46
$$ 188 214 -31 -93 -33 76 -144 -55 -69 178 53 155 87 192 -229 402 -314 152 275 191 472 -7 59 305
6593C05k09k46K70k66o3J10M0M50l75k69K02J42Qk48J55n2K94l34J20J5r7J9P9
$$ 305 96 -150 120 -146 -209 -99 -59 391 16 -253 -51 91 99 -149 6 -46 248 -86 34 49 -48 -29 50
6616E0k03J26O7J59k34MJ78j47Q7j66j6J57P4j91P5j24L94m44j24M47l49L89j22
$$ 50 -153 -27 40 199 -35 -31 147 0 87 -79 -95 62 136 -55 20 -104 290 -154 -278 169 -180 209 87
6639H7r9J64k41K89k75Q2l57N33k38j17K94k34n1J15PK74r0J13k54qj4l1n0k62
$$ 87 -12 152 -89 200 -75 7 -350 183 -55 -172 122 -112 -163 -48 -41 233 143 256 2 -6 -20 -51 -101 -363
6663c63R6J85R7j28J4M11k7l31K66k98j56K53k99K99K60k24Kk83L86j60k6j51
$$ -363 -267 -82 15 -113 -99 312 285 -46 220 -78 -234 19 -280 19 279 55 57 -226 160 0 -26 -177
6685a77L47k98J1J73o8J97j40k04L3K80m8j66K22l06M35j69R8k16m7j30J79k7
$$ -177 170 -128 -117 56 -12 185 45 -159 -126 154 106 -60 162 -144 291 122 220 4 -43 -173 6 -21
6707b1l01k73P85l51J75m0q8M9K01lk60K77j77n4J06J80K3l98K00m32N13k12J03
$$ -21 -322 -595 190 -161 14 -26 -114 -65 136 133 -127 150 -27 -81 25 205 228 -170 30 -402 111 -101 2
6730BJ22j79K8J09m02K72K72q6Rq2K45m90K30k13M54q5l36K74m80L08j33R6L69
$$ 2 124 -55 -27 82 -320 -48 224 138 147 65 310 -180 50 -163 291 206 -130 144 -336 -28 -161 -65 304
6753C04k83j22K41k72J37j1J75k51j0N0l0J79k8rk77K90j5L2j31k36J62L25j58
$$ 304 21 -101 140 -132 5 -6 169 -82 -92 -42 -72 107 79 70 -207 83 68 100 -31 -267 -105 220 62
6776F2j43L2L07q1j12J08k01j71K23Nj47J6p3J88OO6k73n8L57j51J24K04n47M90
$$ 62 -81 -49 258 177 65 173 -28 -199 24 29 -118 -102 -175 13 19 85 -188 -246 111 -40 84 288 -259 231
6800B31k20j1J55J62l04l66L66K58j88j39L17j19k22o7L8K45o3k2N8l51K53Nl2
$$ 231 11 0 155 317 13 -353 13 271 83 -56 261 142 -80 -147 -109 136 73 51 109 -242 11 16 -16
6823a6O3j66k19K74J96p9L73k34K8k65Q7K38k44k0J13k16pp1K72o7Rk07K33j9
$$ -16 47 -119 -338 -64 132 53 426 192 220 -45 42 280 36 16 129 -87 -94 -165 107 40 49 -158 75 56
6847E6m45K00N0J12q5L1j76k1J96L91r5k49L7L33l37K01j23j81L26j18K2j82q0
$$ 56 -389 -189 -139 -27 -112 -81 -257 -278 -82 309 214 -35 2 335 -2 199 76 -105 221 103 125 -57 -137
6870a37j6P3j4J74J45j57k01K70l52K05J77k7j22k24K23m7r3R7N5j38J11L7j02
$$ -137 -153 -80 -94 80 225 68 -133 137 -215 -10 167 140 18 -206 17 -30 -123 -26 29 -109 2 39 -63
6893f3L75l60k55N84k90j23J65R5j16j20j00N96o80K56J15j30r5J05J40p5J65
$$ -63 312 -48 -303 281 -9 -132 33 128 12 -108 -208 388 -292 -36 79 -51 -146 -41 99 24 189
6914A89j6n25J25M33o8k77J32J72l62K7J35q1L6j61M80j60j79J20r8o5J8J91k40
$$ 189 173 -352 -227 206 138 -139 -7 165 -197 -170 -35 -116 -80 -241 239 79 -100 20 -78 -143 -125 66 -174
6937a74P7M7J39m6j75P8K30M5k03J94j40n68O39J23n05pL36l10J90L56k47P8j97
$$ -174 -97 -50 89 43 -132 -54 176 221 18 212 72 -496 143 266 -239 -246 90 -220 -30 326 79 157 -40
6960d0J27j85K45q2j44Mj54R1p0K54J02j1j16M0l83j6P59n51M52j02j72R7k92
$$ -40 87 -98 147 65 -79 -75 -229 -138 -208 46 148 137 21 61 -322 -338 421 -130 322 220 48 145 -147
6983a47K38K1o3j77J1R3J39j83l9M4N5o5J33k61L45r5j17K20Q6l25jj11n2J94
$$ -147 91 112 49 -128 -117 -24 115 -68 -107 -63 -8 -73 60 -201 144 49 -68 152 238 -87 -88 -199 -251 -57
7007e7N4j15K65l19J60Q6M3M0M0m55K61L63m77J04k33J37J25O8o0j0j51J72J5
$$ -57 -3 -118 147 -172 -12 74 117 157 197 -258 3 366 -111 -7 -240 -103 22 90 30 20 -131 41 56
7030E6Q8m1j50l20K05J93k05L20m59J98L34j96j81rK65n32M87j11m2m7J67k9n2
$$ 56 144 103 -47 -367 -162 31 -174 146 -313 -115 219 23 -158 -167 98 -434 53 -58 -100 -147 20 -9 -61
7053f1mJ09o7J9Pj5q5M0J32j97R9j55K61j58J6J43l7K43o1j52j0K4N8K99q30N96
$$ -61 -65 44 -23 -4 3 -12 -97 -57 75 -122 -23 -178 83 -75 -59 84 47 290 229 77 67 91 149 448 -382 214
7079B14l46J14Q6j5r1Ml81L80j5R2j22L5N2J24O1l19Q2K04j58J11k30M62m11k7
$$ 214 -132 -18 68 53 -38 -34 -415 -35 -50 42 -80 -45 7 131 192 -127 -45 159 1 112 -118 344 -67 -94
7103i4q1N9k48K6M39j38J78m1j4L13o39M32j76J2j11nJ62n7oj43n1O2m3J45j96
$$ -94 -175 -116 -364 -338 101 -37 141 100 86 399 -240 192 16 28 -83 -88 74 17 11 -132 -183 -121 -164 -19 -215
7128b15J19pJ78n4j94P4L8k51K98J57k77l22K59K31k19O8R0J08Pj0l22M02j85
$$ -215 -96 -103 75 21 -173 -99 -61 -312 -14 143 -134 -456 -197 34 -185 -117 -27 81 88 78 -244 158 -27
7151b7R7q8p6J06j76n6K45O5j76J54j84J92n05R11m86Op9q3K12P8l4j65K8J20
$$ -27 70 -18 -94 12 -164 -220 25 90 -86 68 -116 76 -429 482 -4 2 -77 -160 52 130 96 -69 -41 79
7175G9l22M05q9j96K79q9o7l9n5J91j01Q2j97O8J38J75k74K7j33N0k04N50m54
$$ 79 -243 162 73 -123 156 67 0 -39 -94 97 -4 78 -119 -51 87 262 -12 15 -118 -68 -272 278 -176
7198a76L79K5K9j34l15L18n7j45j7K17L1k67J43K96k42q2K7n9K30j13j20K01k18
$$ -176 203 228 257 123 -192 126 69 -76 -93 124 155 -112 31 327 85 3 30 -29 201 88 -32 169 -49
7221d9q5K82j05J73k04J7j79K89k38J99L4k0l56m5K12pL16j29l59l01O41L46n73
$$ -49 -134 148 43 216 12 29 -150 139 -99 100 134 114 -242 -287 -75 -82 234 105 -254 -555 86 432 -141
7244a41J72o3k87K28L56k29j28k25J16M75m31O3N1J68o9j8M3j43k21J77K04j21
$$ -141 31 -32 -319 -91 265 36 -92 -317 -201 274 -157 -94 -43 125 56 38 81 -62 -283 -106 98 -23
7266b3K25l98J06j89J08K25N7j46J07m0Jk57k5K98p6L3j10J50p1Q1p4lj42r5J87
$$ -23 202 -196 -90 -279 -171 54 111 -35 72 32 33 -224 -249 49 -27 6 -104 46 -25 56 -18 -21 -163 -258 -71
7291g1L2N1k89L66N1j06K65k28l4q8n9J98j75N4j05J90J26k73l3K64p8j52J83
$$ -71 -39 12 -277 89 140 34 299 71 37 -51 -110 88 -87 -33 -138 52 178 -95 -128 136 58 -94 89
7314H9j07L27l38j87P4L09j64J04l10K35p4j8L01n05N43m21nl29M08J27r9k79
$$ 89 -18 309 -29 -216 -142 167 3 107 -203 32 -42 -60 241 -264 279 -142 -147 -476 -68 59 -40 -319
7336c19O69k87NN2k79L68R6m46J74J20p7j49J31j41J67k07K29P3O7l44K7N8K11
$$ -319 350 63 68 120 -159 209 305 -141 33 153 76 -73 58 -83 84 -123 106 179 246 -98 -71 -13 198
7359A98k30j21p1N4K15j62LK60k36O4L33j22j81L0k49K20m36K94M9l54N87l45
$$ 198 -32 -153 -224 -170 45 -117 -114 146 -90 -26 307 185 4 34 -215 5 -431 -137 -88 -442 145 -200
7381b00M34j04M5j75r3MM1k59K26k26N10O7m28j58L03q1J04k28R2J34q6J4L65
$$ -200 234 130 175 0 -93 -89 -48 -307 -81 -307 203 270 -158 -316 -13 -94 10 -218 -126 8 -78 -64 301
7404C01l83J80l8j95K82m35J48J41j86J00K34k17Q0o8k8K38j82J80k70K42J21
$$ 301 -82 98 60 -135 147 -288 -140 1 -185 -85 149 -68 12 -56 -84 154 -28 152 -118 124 245
7425B45k78L84o51J22M08l03Nj39J26K07N0l80K64J77j74KLno1l04J61K67l17
$$ 245 -33 351 -300 -178 230 -73 -68 -207 -81 126 176 -204 60 237 63 65 68 63 2 -302 -141 126 -191
7448a91K07J51j28O8M6j92o7L61l18P8J8j03k47L64J64k58qJ13k87L34k01P1j67
$$ -191 16 167 39 107 153 -39 -106 255 -63 15 33 -70 -317 47 211 -47 -55 58 -229 105 -96 -25 -192
7471a92jk5K55K00l45L24l00j07O7N4R9M5j50R5j03K63q7l8K6K9q9K56l12O9R1
$$ -192 -193 -218 37 237 -108 216 -84 -191 -124 -70 29 74 -76 19 -84 179 92 54 80 109 20 276 -36 33 124
7496A24l58k78N15J3K72l54K40J3j25k28J76M3r1K08j25K9k38k20M58J38K1p6
$$ 124 -234 -512 3 16 288 -66 174 187 62 -166 10 53 -38 170 45 74 -164 -384 74 212 233 157
7518A57n55L16K79j18J10l33K39j35L5L94Q3j92n60L70M3k80J35J39j42m22K30
$$ 157 -398 -82 197 79 189 -144 95 -40 -5 389 472 280 -280 90 133 -147 -12 127 -15 -437 -207
7539b07L40m1j99N0K17M7J94n40K82K8j42O6l71J85J38j17m0K40j85l34L39l5
$$ -207 133 92 -107 -57 160 207 401 -139 143 171 29 95 -276 -91 47 -70 -110 130 -55 -389 -50 -85
7561h5J46o9k02K29O4p9m4M8k65N01l94K12k09L21j23J41k41K51j65k6J58k62
$$ -85 61 -8 -210 19 83 4 -40 8 -257 244 -150 62 -147 174 51 192 -49 202 37 11 169 -93
7583i3K19l89J90nj24J13oj05J96j83N95l84J44r1j26M2j64Jp0k0L51r8L6K33
$$ -93 126 -263 -73 -78 -202 -89 -95 -200 -4 -187 408 24 168 77 -49 -7 -171 -170 -240 -260 91 -7 29 262
7607B62K3k2k21q1n53Q62l34m5j70J68J47j45l06N53j43K1J26k78M03n11K46O9
$$ 262 285 263 42 -39 -592 270 -64 -109 -279 -111 36 -109 -415 138 -5 16 142 -136 267 -244 2 71
7629G1l50K40K56k8j95j70J43o9j03L96k32K8J15n7j59M7J70j6L9k08n1J07J61
$$ 71 -279 -39 217 189 -6 -176 -33 -102 -205 191 -41 -13 102 45 -114 -67 103 87 126 -82 -133 -26 135
7652A35m20L71K48m74j79L89Q2n50M43j70K32n51M47jrK86r6m22K5O64n53k7L27
$$ 135 -285 86 334 -140 -319 70 152 -398 45 -125 107 -444 3 2 -7 279 183 -239 -214 450 -103 -130 197
7675A97o3k92J93K69o17M18m6j09j04J93q3J08K33k75kn6k76O92m26j3%J02r0
$$ 197 134 -158 35 304 -313 105 59 -50 -154 39 -44 64 297 22 20 -36 -312 380 -46 -59 -59 43 -47
7698d7j29Q8J09K79m89L07r2Q0k44N8k20J97M17l83K3R1K83j0L5l43kJ02j27K51
$$ -47 -176 -88 21 300 -189 118 26 106 -138 -80 -300 -103 314 -69 -46 45 328 318 353 10 8 110 -17 234
7722B34m02P6O5J26k93J92l9j59N8J31K7J12m39M6J37k14J16K75J04L6k66P4J68
$$ 234 -168 -92 -27 99 -194 -2 -41 -200 -142 -11 16 128 -311 -265 -128 -342 -226 49 153 189 -77 -3 165
7745A65j10K69o82J00Q3L77m23L0K21%j52m7K30l63M27o4K0n0k80L44j5j75k27
$$ 165 55 324 -358 -258 -175 202 -221 -191 30 30 -122 -169 61 -302 125 61 81 31 -249 95 80 -95 -322
7768c22K57K89l4l6M7k79L13m23L2L67l3k31K56k26R6J83k96J18k31m8L65K18
$$ -322 -65 224 190 154 201 -78 235 -188 -156 211 178 -53 203 -23 73 256 -40 78 -153 -201 164 382
7790C82k58j97N4k31K31K57om47pJ49m46O50kj26J34k57l7L80j70k13Lj09K05
$$ 382 124 -73 -19 -250 -19 238 232 -215 -222 -73 -519 131 129 3 137 -120 -157 223 53 -160 -157 -266 -61
7813f1j98K49K10j88k44M1L99k27m8m9J92j41M10k4l00j06M15j17k46p0J73J57
$$ -61 -259 -10 200 12 -232 -191 208 -19 -67 -116 76 -65 345 321 21 -85 330 213 -33 -103 70 227
7835B27l47K81k40ql2qK76k94J15k1R9k61J3R2J55J65j82m14K14M46n89J76K53
$$ 227 -120 161 -79 -87 -119 -127 149 -145 -30 -51 48 -213 -200 -108 47 212 30 -384 -170 276 -313 -137 116
7858A16l2Jp5J31l1j11q8j27J85o7m0M96n6j81Pq0j33K21J63l52l7K6M1j68o5
$$ 116 84 85 10 141 110 -1 -89 -216 -31 -98 -138 358 302 121 128 48 -85 136 299 -53 -90 -64 -23 -191 -256
7883b56M98j00k5LK2K19m93K48l52K05j17L45r6k10J96L10p9j57l5j83j3J78p6
$$ -256 242 142 117 120 142 361 -132 116 -236 -31 -148 197 101 -109 87 397 318 161 126 -57 -70 108 32
7906C2K3j95M22o8j73Q7J77l10O3m36M17l57K63N9N7k41K02J88k91K82l21K47
$$ 32 55 -140 282 214 41 128 305 -5 58 -378 39 -318 -55 4 61 -180 22 210 -81 201 -120 127
7928A27p9j6K45l76J70l4l5q7J04l9J65M3k81P2q6J63K33k23R8k33j08J78L8J4
$$ 127 48 32 277 -99 71 37 2 -85 19 -20 145 188 -93 -21 -107 56 289 66 164 -69 -177 1 39 53
7952E3J07j80L30n13N40k65j64N1m9Q6k44O22k21j57J25j19K0J71j85J11l1J20
$$ 53 160 -20 310 -203 337 72 -92 -41 -90 -4 -248 374 153 -4 121 2 22 193 8 119 88 208
7974B08O7l00j36k7J46j38L45l71O7J32L2M60o89L72k63J15m9j17K03j77J75j23
$$ 208 275 -25 -161 -188 -42 -180 165 -206 -139 -7 25 485 -204 168 -95 20 -29 -146 57 -120 55 -68
7996f8J95J44j36r7j97L07K0j26k02L83mj66j24J66k55n3j88K99K17k09K29j8
$$ -68 127 271 135 38 -159 148 168 42 -160 223 219 53 -71 95 -160 -213 -401 -102 115 -94 135 117
8018A17m1k45M4J87k6j14J71L3k99j83M80q7j27l00M72j3k32K53m41M40r2l0K11
$$ 117 76 -169 -125 62 36 -78 93 126 -173 -356 124 37 -90 -390 82 69 -163 90 -351 89 -3 -33 178
8041A78r6N9j19J39Rk4j26l09M23Lkk56mr5k5K63j83K93j72J96k08K12k91p4N22
$$ 178 82 141 22 161 170 146 20 -289 134 137 135 -121 -125 -220 -245 18 -165 128 -44 152 -56 156 -135 -209 313
8066C13k36m24L39J63j97L12l54K58m49L53M17n90l0J50o8L97j24l39M72m05K2
$$ 313 77 -347 -8 155 -42 270 -84 174 -275 78 495 -95 -125 25 -43 354 230 -109 363 -42 -20
8087b0m8J42k38L77k42k6M2J4Q0L49m24J61k84K93m90K87K52k63L30m99L1J96
$$ -20 -68 74 -164 213 -29 -55 -13 1 81 430 6 167 -117 176 -314 -27 225 -38 292 -207 -176 20
8109B0J8q6p7R2J67j42K53r7N2l36L50j10m40K57K14m22L83j59L00l7j99J11j29
$$ 20 38 -48 -125 -33 134 -8 245 148 200 -136 214 104 -336 -79 135 -287 96 -63 237 200 1 112 -17
8132a7r1M0J94j68l6j41J58q4N6M3J54k85K80j97j02P6R4j48L04r7k68J8M12k28
$$ -17 -108 -68 126 -42 -78 -219 -61 -145 -89 -46 108 -177 103 -94 -196 -120 -26 -174 130 33 -235 -217 195 -33
8156c3r6q5M79o62K51L95k57j23J19L52l89p6J3Kk23M21j79J72j86M2O2N7k85
$$ -33 -129 -214 265 -397 -146 249 -8 -131 -12 340 -49 -125 -112 -110 -333 88 -91 81 -105 -63 -1 56 -229
8179b29L90k48j23K65J7J73n1j33J96m38K99l43
$$ -229 161 -87 -210 55 72 245 194 61 257 -181 118 -225
8191b25
$$ Imaginary data points
##PAGE= N=2
##DATA TABLE= (X++(I..I)), XYDATA
0@%%%%QqQj6J6k4L2m0N6o4P2r1J15j36J60j92K24k59L00l48M01m59N25n98O81
$$ 0 0 0 0 0 8 0 8 -8 8 -16 16 -24 32 -32 40 -51 64 -72 88 -104 120 -139 161 -187 214 -245 280 -318 363
29C63p70Q67r76J093j226J370j524J697j888K097k325K574k850L156l492L868
$$ 363 -407 460 -516 577 -649 721 -803 894 -994 1103 -1222 1352 -1498 1658 -1834 2034
45B034m291M764n301N915o626P460q452R660j1166J3107j5715J9433k5207L5477
$$ 2034 -2257 2507 -2794 3121 -3505 3955 -4497 5163 -6003 7104 -8611 10822 -14385 21092
59B1092n9276K13201R9763l83031q9687O2876R2019L0257J37705Q3179q5685j88364
$$ 21092 -38184 175017 274780 -108251 -197938 -135062 -43043 -12786 124919 208098 122413 -65951
71f5951o3496K0309L9425O9232J35010L4944j22939j34585j73L3207J4M2590J18669
$$ -65951 -129447 -109138 -69713 -481 134529 169473 46534 -88051 -88224 -55017 -55003 -12413 106256
84A06256L3713j04877j03363o71J8085k860M5575R6773K0526q4771p4617K702
$$ 106256 139969 35092 -68271 -68942 -50857 -53717 -8142 88631 109157 24386 -50231 -47529
96d7529R212r175L6541P6049J3077o2450m6344o33p315m514M4961N4460j0706
$$ -47529 -38317 -47492 -10951 65098 78175 15725 -30619 -31252 -38567 -43081 1880 56340 45634
109D5634m6491r296P007k6371k1069M3081N6124q911m1987m597J1948k3939k4768
$$ 45634 -857 -10153 -3146 -29517 -50586 -7505 48619 39708 -2279 -6876 5072 -18867 -43635
122d3635K7490M2121K462j6725j600q064k9656r915K8364K4851k534j408R167
$$ -43635 -16145 25976 28438 11713 10113 2049 -27607 -37522 -9158 15693 13159 11751 20918
135B0918j4312l5684p889L0093K1066n763J67J1259j2626l1592o025K4177J5416
$$ 20918 6606 -29078 -36967 -6874 14192 8429 8596 19855 7229 -24363 -30388 -6211 9205
148I205k622L099P124j2467k3327l843J5990J0478J779O810L164j5021j6293J969
$$ 9205 6583 9682 16806 4339 -18988 -22831 -6841 3637 5416 12226 15390 369 -15924 -13955
162a3955J0549K228K914J1483J954j8395j3699P942J0960j014K14Q709J972j3196
$$ -13955 -3406 -1178 1736 13219 15173 -3222 -16921 -8979 1981 967 1181 9890 11862 -1334
176a334j1219M124Q809J614J670M841j616q541m168K475L03M65O292O216m539
$$ -1334 -12553 -8429 380 1994 3664 8505 6889 -1652 -5820 -3345 -3042 -2577 3715 9931 5392
191E392q138l49L198k331k619N716O890j769p000j212K189r27k517L370M926n94
$$ 5392 -2746 -3095 103 -2228 -4847 869 7759 5990 -1010 -2222 -33 -960 -3477 -107 4819 4225
207D225l246j176q60j493L41L610J891j302n95L02k156l901J317M759J073k053
$$ 4225 979 -197 -1057 -2550 -2209 1401 3292 1990 1395 1697 -459 -4360 -3043 1716 2789 736
223G36l87K167j776m774J22M220K141j472o70O50r03j652l54J334R08L76P11j102
$$ 736 349 2516 740 -4034 -3912 308 2449 977 307 957 54 -1598 -1952 -618 290 666 1377 275
241B75j987n07J835J196j372J96J592k28k643j235J972J334m51l46J177J50j673
$$ 275 -1712 -2219 -384 812 -560 -364 1228 1000 -1643 -2878 -906 428 -23 -369 808 958 -715
258g15j031L55J067J92M62J79j34j036R0j89l54N92J145M40j399p08N24O74o25
$$ -715 -1746 -1391 -324 -132 330 509 375 -661 -571 -760 -1114 -522 623 1063 -336 -1044 -520 154 -471
277d71n43J327R69p38j317l06R49j25l12O25M04M92p91k75m67j56P31L72m92k31
$$ -471 -1014 313 1282 544 -773 -1079 -130 -255 -567 58 462 954 163 -112 -579 -735 -4 368 -124 -355
297c55P35J65m41p09J05J325n22k39n25R18J19m47k47K89L76m43J22l7j40J23
$$ -355 380 545 104 -605 -500 825 303 64 -461 457 576 129 -118 171 547 104 226 189 49 172
317A72K08k49J82K25J01p62J39K03K7k92Q9J99L59j19n49J30K5j3j64K80k13M74
$$ 172 380 131 313 538 639 -123 16 219 246 -46 43 242 601 482 -67 63 88 75 -89 191 -22 452
339D52j77m75K42j91L07l3m50J13J09K90l58j66L58L85l26l10M35j17m86J06P3
$$ 452 275 -200 42 -149 158 125 -325 -212 -103 187 -171 -337 21 406 80 -230 205 88 -398 -292 -219
360b19J31M75m93K43l27J34J92L27m84k24L03R6k65n6j21K39k38k04N03N2l09
$$ -219 -88 387 -106 137 -190 -56 136 463 -21 -245 58 154 -111 -167 -288 -49 -287 -491 12 64 -245
381b45R5k88j56L46K96k30qK41l9k1O3o3l08O41n72l3K06P2M2j36j90M74k00O3
$$ -245 -150 -438 -594 -248 48 -182 -190 51 12 -9 54 -9 -317 324 -248 -281 -75 -3 39 -97 -287 187 -13 50
405E0k08J85Q9N9J48k53J11p6k93K81L3kq0q9J70j41J03l51L31k10M62k79o2J43
$$ 50 -158 27 116 175 323 70 181 105 -188 93 126 124 44 -45 125 -16 87 -264 67 -143 319 40 -22 121
429A21k80L88k10j86M38k08L80o90L31j6LO3r3k67Q3M20k74L6L20j83J4r2j89
$$ 121 -159 229 19 -167 271 63 443 -247 84 68 71 134 41 -226 -143 277 3 39 359 176 190 98 -91
452i1L40j63J31l43M12l01r8l1J28K04m09K50l9J7k29J83O9K9J71m4k04n4K12
$$ -91 249 86 217 -126 286 -15 -113 -144 -16 188 -221 29 -10 7 -222 -39 30 59 230 186 -18 -72 140
475A40j97k62L64j29Q1N8J17k05n9K3LL14m69J57M2J09j39j84K61j94K0N8j72
$$ 140 -57 -319 45 -84 -3 55 172 -33 -92 -69 -66 248 -221 -64 -22 87 -52 -236 25 -169 -149 -91 -263
498b63N95m14J36J91l24j42N63k46r0L6p6J47o8Jk22o8J72KJ44l11M08p24N03
$$ -263 332 -82 54 245 -79 -221 342 96 6 42 -34 113 45 46 -176 -244 -72 -70 74 -237 171 -553 -50
521e0k82M94j74L0P9N0n04rN21k40o0Q7K98j8j95l18K70MJ40k65J55l67N88j45
$$ -50 -332 162 -12 18 97 147 -357 -366 155 -85 -145 -58 240 222 27 -291 -21 -17 123 -142 13 -354 234 89
545H9k90J81j37K07q1j86J91K72k11M8k91J83M7P5l20K35J91j48j68K78J2k30
$$ 89 -201 -20 -157 50 -31 -217 -26 246 35 83 -208 -25 22 97 -223 12 203 55 -113 165 177 -53
567e3J85l14K4K79K48k19k48L08n16N47m64M05R5k19Q1m3J8j74kN0Q5m4J14p0
$$ -53 132 -182 -158 121 369 150 -98 210 -306 241 -223 182 277 58 139 96 114 -60 -62 -12 73 29 143 73
591G3j18k31J50J99L09n39r8K11N1Q2l54J83L83j70j40j01K27r7mj3p9K0n5P4
$$ 73 -45 -276 -126 73 382 -157 -255 -44 7 89 -265 -82 301 131 -9 -110 117 20 16 3 -76 -56 -111 -37
615c7N2k6j77J94O3k44N3K61J11k23R7J2k07R4k12J81j6j14L5J60j78J03R1k39
$$ -37 15 -11 -188 6 69 -175 -122 139 250 27 124 136 -71 23 -189 -8 -24 -138 -103 57 -121 -18 73 -166
639a66J92j6k45K66K3P5j55p4J48j36Q6K6l1L19p1l91J43L20n08K83j4K05j96
$$ -166 26 10 -235 31 54 129 -26 -100 48 -88 -2 24 -7 312 241 -150 -7 313 -195 88 74 279 83
662H3k2j57j59K50o4L0r7M1K42k68J21j5J07r6R2J16r8l16N35m07Q8J63j7J44
$$ 83 61 -96 -255 -5 -69 -39 -136 -95 147 -121 0 -15 92 -4 88 204 106 -210 325 -82 6 169 152 296
686B96m35J37K28j25k24K61k36K59j2o75N87N5j79j36P2K63j47L7m0J00J30k83
$$ 296 -139 -2 226 101 -123 138 -98 161 149 -526 61 116 -63 -199 -127 136 -11 26 -14 86 216 -67
708f7N0j99J82k1O8K2m3J61j02J05k73L41j35j67J40j9O4j00K85n78M61J20k80
$$ -67 -17 -216 -34 -55 13 35 -8 153 51 156 -117 224 89 -78 62 43 107 7 292 -286 175 295 15
731A5j3j38J73m9q6l53K77M81p73L08J67R1N3j79j05J33k32P4K82Rnqj11Pn0K39
$$ 15 2 -136 37 -12 -98 -451 -174 307 -466 -158 9 100 153 -26 -131 2 -230 -156 126 135 130 122 11 18 -32 207
757B07l09J95JJ78k91J7l52K32O8P7K4k4J07j98J7R1K41k59j21K64K19o32L61
$$ 207 -102 93 94 272 -19 -2 -354 -122 -54 23 47 23 130 -68 -51 40 281 22 -99 165 384 -248 113
780A13K61j31j92K8j43j36P8K19r2k72M50n49K97L00n1j10p7k11J01K62j36OJ58
$$ 113 374 243 51 79 -64 -200 -122 97 5 -267 183 -366 -69 231 180 70 -7 -218 -117 145 9 15 173
803A73m9l93M56l56J96j56K71k57P8Q4no6K4K7P9m43N4L82r0j31p8P5l8K32o1
$$ 173 124 -269 187 -169 27 -129 142 -115 -37 47 42 -24 0 27 106 -337 -283 99 9 -122 -200 -125 -163 69 8
828HLK1L3j89K13l3j06O4k7m5L45m0l51J02R4k13R0K4L53k62O5k72L88J65o99
$$ 8 11 32 65 -124 89 56 -50 14 -13 -58 287 247 -104 -2 92 -121 -31 -7 346 84 149 -123 265 430 -269
853b69L24J17n6J86l86L01J09k67l5M6k71J0O5NK91l51q7q9M55q2J43k40K25j33
$$ -269 55 172 116 302 -84 217 326 59 24 70 -201 -191 -126 -121 170 -181 -268 -357 98 16 159 -81 144 11
877A1K51p8m07M25l0J15j12l68N14k32k12K69J72k06m19N83j13R4k01l27K26J31
$$ 11 262 184 -223 202 172 287 175 -193 321 89 -123 146 318 112 -307 276 163 257 56 -271 -45 86
899H6q8o1J41j17l02L03k17M0N67n20J17P9k7Q7l4J79l61J21J22p1j21Q0j3M6
$$ 86 -2 -63 78 -39 -341 -38 -255 -215 352 -168 -51 28 1 88 54 233 -128 -7 115 44 -77 3 -10 36
923C6J28n5j40J19n0m5J35r0l7j37O8P9j5J63n0k90J67j94K83j80K40J53k50P
$$ 36 164 109 -31 88 38 -7 128 38 1 -136 -68 11 -4 159 109 -181 -14 -208 75 -105 135 288 38 45
947D5j51J48Jn9K98l49J28M4Om92L22j2L2L55m44P2p2L10k21K14k29J33O0q2k2
$$ 45 -106 42 43 -16 282 -67 61 105 111 -381 -59 -71 -39 316 -128 -56 -128 182 -39 175 -54 79 139 57 35
972C5j90L11q6k3J44m86L22K23m09nN8OO6Q3O8K86m87J47j80R1j22K29K17l99
$$ 35 -155 156 70 47 191 -295 27 250 -159 -164 -106 -100 -34 49 117 403 -84 63 -117 -26 -148 81 298 -101
996a01r9J72k02J16N3j69J99Q1j76K69n3k82M95n45J47J7j56K51N0j63J22k9K5
$$ -101 -200 -28 -230 -114 -61 -230 -31 50 -126 143 90 -192 303 -242 -95 -78 -234 17 67 -96 26 -3 22
1019B2K84k63j32M13k06r7k67L32r9n2J70m33J24j48K43Pr7J57R1l9j18J75k59
$$ 22 306 43 -89 324 118 21 -246 86 -13 -65 105 -328 -204 -352 -109 -102 -199 -42 49 10 -108 67 -192
1042a92O0N4J73k37K41k43PJ26l56K89j06K73l1j74p6K3K52m6k5j10L3oJ02j49
$$ -192 -132 -78 95 -142 99 -144 -137 -11 -367 -78 -184 89 58 -116 -192 -169 83 37 12 -98 -65 -71 31 -118
1066a18J67NR3k10J38N3j90q1k67L95m15N03J75k69m95P60m55j97L26J73l60N99
$$ -118 49 54 147 -63 75 128 -62 -143 -410 -15 -430 73 248 -21 -516 244 -211 -408 -82 91 -269 330
1088C30m45l7J88j96MK21Q5j43j24K53O1j10j44l4J85j56KR8m3K08K8l67O7k48
$$ 330 -115 -152 36 -160 -156 65 150 7 -117 136 197 87 -57 -91 94 -62 -60 38 -5 203 231 -136 -69 -317
1112c17R4K77j9j99K62k15K23o70O94N7j48J9J70J59p37L14J46l76K35K1j0k55
$$ -317 -223 54 35 -164 98 -117 106 -564 130 187 39 58 228 387 -350 -36 110 -266 -31 -10 -20 -275
1134b75J04R9J11l34K11J13j50J58q1K43J77k09k61k74N68k82R5J15m14K77L5
$$ -275 -171 -72 39 -295 -84 29 -121 37 -44 199 376 167 -94 -368 200 -82 13 128 -286 -9 26
1155B6l7j23J89k54J14J31l0j15N0k23L13j04J94j4k31J28J93j93j81N74n77N49
$$ 26 -11 -134 55 -199 -85 46 16 -99 -49 -272 41 -63 131 117 -114 14 207 14 -167 407 -170 379
1177C79k86r4J57k8j72J60r2j09q0J92K04m16J11L34m60L79k2k47L3J95k7p7k73
$$ 379 93 -1 156 128 -44 116 24 -85 -165 27 231 -185 -74 260 -200 179 157 -90 -57 138 111 34 -239
1200b39J55M32m69K24j47J28o3J55l86Q0rr9J63K04n2k6L40l13J66k40O3j35J35
$$ -239 -84 348 -121 103 -44 84 21 176 -210 -130 -139 -238 -75 129 77 51 391 78 244 4 67 -68 67
1223F7m1r3J41k38P2K81n7l85L95j64Q7J20k93rj32M68n19N28k54j32R1j7K99
$$ 67 26 -67 74 -164 -92 189 132 -253 142 -22 65 185 -108 -117 -249 219 -300 228 -26 -158 -67 -84 215
1246B15P5m69k9N58m47J08k96N25O7n30L50l57J79j41K87K01p79N42j67K5k01
$$ 215 290 -179 -208 350 -97 11 -285 240 307 -223 127 -230 -51 -192 95 296 -483 59 -108 -83 -284
1267b84N81k39O9n9k08J30N0j96J80J8o7J0j18L14k30k45L53j83j0j74N15j74
$$ -284 297 58 127 68 -140 -10 40 -156 24 42 -25 -15 -133 181 -49 -294 59 -124 -134 -308 207 33
1289C3Pq3l7q1O05p19K14m8J86l26M41M0p1j85J97n1K2j35N87o27k2O5J9nk28
$$ 33 40 -43 -80 -161 444 -275 -61 -109 77 -249 192 232 161 -24 173 122 144 9 596 -31 -53 12 31 26 -202
1314b02N37k92J97p6l68J4k15K63M2r8M47J33l09r5j85j01L64J80j33o1J46l8
$$ -202 335 43 240 164 -204 -190 -405 -142 -100 -198 249 382 73 -22 -207 -308 56 236 103 42 188 150
1336A50k99J99K70o55L70l17K50r6J10K2r6Q1n1j40j13M63j20k35K38k09mJ28
$$ 150 -149 50 320 -335 35 -282 -32 -128 -18 4 -92 -11 -62 -202 -315 148 28 -207 31 -178 -182 -54
1358e4j04K03q6j61K11j28R8K52j98k57L44m1J25k63k20L68J20j74P7j9j41q5
$$ -54 -158 45 -41 -202 9 -119 -21 231 33 -224 120 79 204 -59 -279 89 209 35 112 93 -48 -133
1380a33K27R7l96N52o86L83k71L25O8j08RO7p0J48k26j07j59L38K23n01L76k51
$$ -133 94 191 -205 347 -339 44 -227 98 166 58 67 134 64 212 -14 -121 -280 58 281 -220 156 -95
1402i5J35j37lj24L58j48k82M53m13m7L12K1j57k31RJ58J19L05oj27j54K48m45
$$ -95 40 -97 -100 -224 134 -14 -296 157 -256 -303 9 30 -127 -358 -349 -191 -72 233 227 100 -54 194 -251
1425b51J93J40m99M61L08m45n0j40N59k44m6q3J77l9l62N22n4l63J92mk9J44j34
$$ -251 -58 82 -417 44 352 -93 -143 -283 276 32 -14 -97 80 41 -321 201 147 -216 -24 -28 -57 87 -47
1448d7K66j9o9k29M5l25L78L1k43J32M4J40J66n9k74r9J24J72o2L21k70j21rr1
$$ -47 219 200 131 -98 -53 -378 0 31 -212 -80 -36 104 270 211 -63 -162 -38 134 72 393 123 2 -7 -98
1472i8K7J16j78K88P7k82p5k46J60K54l2J9l32J05K31K4K9L1k18J59J1j94K99
$$ -98 -71 45 -133 155 232 -50 -125 -371 -211 43 11 30 -302 -197 34 58 87 118 -100 59 70 -124 175
1495A75l6Q6l31J92j44J66M5L7m53L45k28J51K5j29Ql42M53k16J19J27k36M39
$$ 175 139 225 -106 86 -58 108 153 190 -263 82 -146 5 30 -99 -91 -433 20 -196 -77 50 -186 253
1517B53n40L97l62p0M11J33j19k00Ro3J25J03Q3j45k35K74K6K37j23k75L0J57
$$ 253 -287 110 -252 -322 89 222 103 -97 -88 -151 -26 77 160 15 -220 54 80 317 194 -81 -51 106
1539A06pn6Qk4k1j78K15k41K68j11J02M6j9j27j11j56N25l93K78q2k75M00l0j27
$$ 106 99 43 51 27 6 -172 43 -198 70 -41 61 107 88 -39 -150 -306 219 -174 104 22 -253 147 117 -10
1563a0J02K8j82pj83L20J51j15k1n0k12L28k48l4K28n5o60O79m03L32J74k97K16
$$ -10 92 120 -62 -69 -252 68 219 104 83 33 -179 149 -99 -133 95 40 -620 59 -344 -12 162 -135 81
1586H1kq4J07p3k4p4Q8j0p8Nq2p1M35j87nJ38j98K27j91r7l8O9OL28k13J84l86
$$ 81 79 -5 102 29 5 -69 19 9 -69 -64 -146 -217 218 31 26 164 -34 193 2 -95 -133 -64 -58 270 57 241 -145
1613a45J20K60l18N3J82m4k06j73L98l08R8P4N48p61K97Q3k05J52Pk55J00l18
$$ -145 -25 235 -83 -30 152 108 -98 -271 127 -181 -83 -9 539 -222 75 158 -47 105 112 -143 -43 -361
1635c61M04m5L1J28j2n20L6K34j67N40m44K41KJ78k38j07L4K96J75m54j33L8M32
$$ -361 43 -2 29 157 145 -375 -339 -105 -272 268 -176 65 67 245 7 -100 -66 230 405 -49 -182 -144 288
1658B88k80rl52L45J24l82O43j1l67q7R1j78K04j09J75m3j37K31j46R5n5j74J95
$$ 288 8 -1 -353 -8 116 -266 377 366 -1 -88 3 -175 29 -80 95 52 -85 146 0 95 40 -134 61
1681F1k24K89m9J28j95J17m48K87Q6N6O1k49J57K66l9l34N3J88m46M24n30M64
$$ 61 -163 126 77 205 10 127 -321 -34 52 108 169 -80 77 343 304 -30 23 211 -235 189 -341 123
1703A23j93N6J4Q1j28K55J2l03L1L5K4J38P0k99J77j23K14n17M56k07R2J00Q7
$$ 123 -70 -14 0 81 -47 208 220 -83 -52 -17 7 145 215 -84 93 -30 184 -333 123 -84 8 108 195
1726A95m1k48j33J03K70m21K10m4L92q27O43k31J84J65k9k08K56j99J40k17O3
$$ 195 154 -94 -227 -124 146 -275 -65 -109 283 -544 99 -132 52 217 188 -20 236 37 177 -40 23
1747B3l3K59k73K6K8m8q0K19q5K94n87m4L55j16K72k75J69Oj70L00k52j65M32
$$ 23 -10 249 -24 2 30 -18 -98 121 36 330 -257 -301 54 -62 210 -65 104 110 -60 240 -12 -177 255
1770B55k28J75j45J90l66M8n3p0K79q8l4J09k80K64m8K2n0J31P5k31R4L29m73
$$ 255 27 202 57 247 -119 -71 -124 -194 85 -3 -37 72 -208 56 8 30 -20 111 186 -45 49 378 -95
1793i5K05n4M2o9j28K57m23N11k7j72m2k70LJ89j22L5J84J03j04k39M59L1n30
$$ -95 110 56 98 29 -99 158 -265 246 219 47 5 -265 -262 -73 -195 -160 24 127 23 -216 243 274 -256
1816b56L26j75k16K66j20PN0L32J57n19K75k37J39K55j93j89K94J82o54K23J37
$$ -256 70 -105 -321 -55 -175 -168 -118 214 371 -148 127 -110 29 284 91 -98 196 378 -276 -53 84
1837H4p8N4k46M78k45j33j72L85p5J64R4m98J76l22K91L0lk4Q2j66K38k5m28K89
$$ 84 6 60 -186 292 47 -86 -258 127 52 216 310 -188 -12 -334 -43 -13 -16 -40 42 -124 114 89 -339 -50
1861e0N44m89J19k4O9p9j51L13n32J06M25k05r6R8K5j72k3L06k73j31L46J27p
$$ -50 494 5 124 100 169 90 -61 252 -280 -174 251 46 -50 48 73 -99 -122 184 -89 -220 126 253 246
1884B46j24n6J00j52jL2kj41J94j52j45K26K88k4K18o31K38O7j40P0k3l6Q5j91
$$ 246 122 66 166 14 13 45 43 -98 96 -56 -201 25 313 289 507 -124 114 181 41 111 88 52 137 -54
1908e4K14l43J83k71J41L74j23l41L38q2j80O7j3L67j85L23n42K07j94J43j61
$$ -54 160 -183 0 -271 -130 244 121 -220 118 36 -144 -77 -90 277 92 415 -127 80 -114 29 -132
1929a32j21Q3L34l0j54K57m08L90o8P0j56L72k98r8j75K80k69M8j32O00l28k3
$$ -132 -253 -170 164 134 -20 237 -171 219 151 221 65 437 139 41 -134 146 -123 -75 -207 393 65 42
1951D2j84J47J89J20l19l8J40q3J18k6l7Pr3l66M70k52J38j00K47j95J90L1l0
$$ 42 -142 5 194 314 -5 -43 97 14 132 106 69 76 -17 -383 87 -165 -27 -127 120 -75 115 146 116
1974A16k03K46k59J76O1k30m7L51r9k33j18J43L78k58J07k90K66k90k3L0Q4K31
$$ 116 -87 159 -100 76 137 -93 -140 211 112 -121 -239 -96 282 24 131 -159 107 -183 -206 -176 -92 139
1996A39j52j44J1J56l25N47k97p6j81J60K68J9j39J13j07j44O03o26L34j70Q9
$$ 139 -13 -157 -146 10 -315 232 -65 -141 -322 -162 106 125 -14 99 -8 -152 451 -175 159 -11 78
2017G8j10l38M95k51R7K24k93pj59J21K41j31n2J20J82k71J32m18L33l88O19k06
$$ 78 -32 -370 125 -126 -29 195 -98 -105 -264 -143 98 -33 -85 35 217 -54 78 -340 -7 -395 224 18
2039A8M1l67J6L84kk77J19j20J47J59p6k68J12J59j15K7j08rJ43K11j82m13M73
$$ 18 59 -308 -292 92 90 -187 -68 -188 -41 118 42 -226 -114 45 -70 -43 -151 -160 -17 194 12 -401 72
2062G2j8q7J70O3m97K35L74k86J6j29Q2j87L15q17P82j38J59m3N0J0k52J24l39
$$ 72 54 -33 137 200 -297 -62 312 26 42 -87 -5 -192 123 -694 88 -50 109 66 116 126 -126 -2 -341
2085c41M25L3J21k68p7m20N42j29J98J39l6n59J04J17k05M19k74M20k44r4J59
$$ -341 84 117 238 -30 -107 -527 15 -114 84 223 187 -372 -268 -151 -356 63 -211 209 -35 -129 30
2106C0M2K55n6n94N18n8qk04o7P1J91Jk83j07K80l20L78q2J8l0j19L99l97J70
$$ 30 72 327 271 -323 195 137 129 -75 -142 -71 120 121 -162 -269 11 -309 69 -13 5 -25 -144 255 -142 28
2130B8k13J8J67j10J42J52n3r8J59k93N0m7j09L72P7k09l97L60K27k12j78K41
$$ 28 -185 -167 0 -110 32 184 131 33 192 -101 -51 -98 -207 165 242 33 -364 -4 223 11 -167 74
2152G4Nk90K90%k75Q2k08M21j50J90m38J86k5M2J06M7J56j36j7l03J51K34k03
$$ 74 79 -211 79 79 -196 -114 -322 99 -51 139 -299 -113 -138 -96 10 57 213 77 60 -243 -92 142 -61
2175f1oL64l00J78j24j80j25L27l5k03J16K44j74k02L57lO2n12L88K25n29K45
$$ -61 -67 297 -3 175 51 -129 -254 73 38 -165 -49 195 21 -181 176 173 235 -277 111 336 -193 52
2197E2M2P9J75m25J27Kj05Q6Q2k91M9J32q2QN9q9N1R5M8j65j65P3L73m29K25L00
$$ 52 94 173 348 -77 50 52 -53 33 115 -176 -127 5 -77 -69 -10 -99 -48 47 95 -70 -235 -162 211 -218 7 307
2223C07m24J76k24M9O9l0o0K41j87J55k58K24Q5j13K32m78M98l44J72j66p4K32
$$ 307 -117 59 -165 -116 -47 -77 -137 104 -83 72 -186 38 123 10 242 -236 262 -82 90 -76 -150 82
2245H2k3J84k50l4K1j6J91r5J14j86l49M09j85O69l63j93J10l01l0J64O6J3J31
$$ 82 59 243 -7 -41 -20 -36 155 60 174 -12 -361 48 -137 532 169 -24 86 -215 -245 -81 -15 -2 129
2268A29k45QJ3J50r1j92j9M18j64k69L06j40J40p3J05k8k26J43p5j46L12l23M49
$$ 129 -116 -108 -95 55 -36 -228 -247 171 7 -262 44 -96 44 -29 76 48 -178 -35 -110 -256 56 -267 182
2291A82j1j56%m7r5K59m0OJ36j59m3j42L29n44L60L08q6n22M31k40K95l76K06
$$ 182 171 15 15 -32 -127 132 92 98 234 75 32 -110 219 -325 35 343 257 -265 166 -74 221 -155 51
2314E1q5J87j14k08K35K16j97l65M05L0m83K25J18Q6m06K89J41l65k16N89m2j83
$$ 51 -34 153 39 -169 66 282 85 -280 125 155 -328 -103 15 101 -305 -16 125 -240 -456 133 91 -92
2336i2m1J35j47J55l64L36k6k42K35mM18m42m2J99j78J00j53n0K30N6M26l42k56
$$ -92 -133 2 -145 10 -354 -18 -44 -286 -51 -55 363 -79 -121 78 -100 0 -153 -203 27 83 509 167 -89
2359h9m20P38l05j79L21j42j4J07k86P13l17L3m4p2M7J76k59J19k69K85J97k94
$$ -89 -509 229 -76 -255 66 -76 -90 17 -269 444 127 160 116 44 91 267 8 127 -142 143 340 46
2381D6n19N04J4J5o7L5J39j10m8J2J02j95j17K99j32l70L63k50J84m0J16m77K03
$$ 46 -473 31 45 60 -7 28 167 57 9 21 123 -72 -189 110 -22 -392 -29 -279 -95 -135 -19 -496 -293
2404b93M39r7k76M51L3k44j1j33L0J45j27j59K15K06l60RJ17J43o8L28k67K42
$$ -293 146 49 -227 224 257 13 2 -131 -101 44 -83 -242 -27 179 -181 -172 -55 88 20 348 81 323
2426C23k39k40L93k26j79K16j72K53r0K19q9k08k36J77J87k26J61n0N7J8k94L95
$$ 323 84 -156 237 11 -168 48 -124 129 39 258 169 -39 -275 -98 89 -137 24 -26 31 49 -245 150
2448A50j15K0J31j03k64M71j85j24Q4l43j08K91O7j83J41k3m08M62k10L08m48
$$ 150 35 55 186 83 -181 290 105 -19 65 -278 -386 -95 -28 -211 -70 -93 -501 -39 -249 59 -389
2469c89N12k00M2J16k01K37o0P8j11L11k86P0l10J88O9m9k0o2j19j15K65J49N7
$$ -389 123 -77 -35 81 -120 117 57 135 24 335 49 119 -191 -3 66 17 -3 -65 -184 -299 -34 115 172
2492A72N5n58M1J57K35k73P4M4KQ1j95K29N1P0j96K13l41k03P44k79l49L58p9
$$ 172 227 -331 -290 -133 102 -171 -97 -53 -51 30 -165 64 115 185 -11 202 -139 -342 402 123 -226 132 53
2515E3l75J73K80m4k5k52M14m81N78k60p0j90K44j15r7l1l1M65k87k9j49N28m86
$$ 53 -322 -149 131 87 62 -190 224 -257 321 61 -9 -199 45 -70 -167 -198 -229 236 -51 -80 -229 299 -187
2538a87J50m8o1o0K1M32n6k02J7m8J26k33J31p8J23N9l38K81l51N45l23J58k2
$$ -187 -37 -85 -146 -206 -185 247 191 -11 6 -42 84 -149 -18 -96 27 86 -252 29 -322 223 -100 58 36
2561C6J42j38n1J71k9J05qj32J01k17M88l96J24j29J3m4K69m86L54%k52j38K43
$$ 36 178 40 -11 160 131 236 228 96 197 -20 468 72 196 67 80 36 305 -181 173 173 -79 -217 26
2584B6J73k2j68L23l35M30m92J55n9j08P0J02J67j64j42j27J18L1j10Q5J29k57
$$ 26 199 177 9 332 -3 427 -65 90 31 -77 -7 95 262 98 -44 -171 -53 -22 -132 -47 82 -175
2606a75J33K58l66L7K30j62K29k46Q9Q9k07M06m22J68q7K19j23m0j65K00K3m27
$$ -175 -42 216 -150 -113 117 -45 184 -62 27 116 -91 315 -107 61 -26 193 70 30 -135 65 88 -339
2628c39M48j31l40J61K00n2j74OK64P3k70Q0J4Rk62K45R9m4j5r4J23J9J02l47
$$ -339 109 -22 -362 -201 -1 -53 -227 -221 43 116 -154 -74 -60 -51 -313 -68 31 -13 -28 -122 1 20 122 -225
2652b25K07j91j1K17Q4k20J03O8Rm36M80J53l13j36K45J28j69j77J24n6M7l9l1
$$ -225 -18 -209 -220 -3 81 -139 -36 32 41 -395 85 238 -75 -211 34 162 -7 -184 -60 -116 -69 -108 -139
2675a39J76j15O2J31l04K88M4l94J81J4J54q8o7q9J95j16j19K81k48L99k70N5
$$ -139 37 -78 -16 115 -189 99 143 -251 -70 -56 98 10 -57 -146 49 -67 -186 95 -153 246 -24 31
2697C1P5l01L42j21oj48O4pJ5j94O21k12j76j9k44N10k5r0o23L62K72M04j97m73
$$ 31 106 -195 147 26 20 -128 -64 -71 -56 -250 371 159 -17 -36 -280 230 205 115 -508 -146 126 530 333 -140
2721a40P3l7J42j8j63M84l06j44j27P11k80k70pr8K98P2k24Qk30M8J11J08j03
$$ -140 -67 -104 38 20 -143 341 35 -109 -236 475 195 -75 -82 -180 118 190 -34 -26 -256 -208 -97 11 -92
2744i2R4k12L16P0l07J26J36k01N2o9J88j37J17P7n90M10k27N5J93J12m91M32
$$ -92 2 -210 106 176 -131 -5 131 -70 -18 -87 101 -36 81 158 -432 -22 -249 -194 -1 111 -380 52
2766E2k16K90k02J75QJ4j71L23l08%J64j92K3K34n7J35k22q1k4K21j60J47o1k30
$$ 52 -164 126 -76 99 107 121 -50 273 -35 -35 129 -63 -40 194 137 272 50 -31 -55 166 6 153 92 -138
2790a38J00M5l17L64J96j08q9J81m20R3J60K18k64m6p5j90K61J88j88m4P1r6N7
$$ -138 -38 7 -310 54 250 142 53 234 -186 -93 67 285 21 -25 -100 -290 -29 159 -29 -73 -2 -98 -41
2813d1K85k90l47N53l50K01O8Qm19N85n55J250q92K5J55k44n1k1O7n6K91n00Q0
$$ -41 244 -46 -393 160 -190 11 79 87 -332 253 -302 948 56 81 236 -8 -59 -80 -13 -69 222 -278 -198
2836a98M9M7K05k92k5K52n08L71j03J83J66m54L47Qo7j97O4N43m88O0o5j7J58
$$ -198 -149 -102 103 -189 -214 38 -470 -99 -202 -19 147 -307 40 48 -19 -216 -152 391 -97 -37 -102 -119 39
2859C9J17j21P2l3pJ73K53l50q0j76j93L89k78L38r8r9J34j89l39L02L74m58J70
$$ 39 156 35 107 74 67 240 493 143 63 -113 -306 83 -195 143 45 -54 80 -109 -448 -146 228 -230 -60
2882f0J8J61J38k49j85P7m7N73m00K9j1j60L13l31O8j30P9J8K11M4K67n16J32
$$ -60 -42 119 257 8 -177 -100 -147 426 26 55 44 -116 197 -134 -66 -196 -117 -99 112 156 423 -93 39
2905C9O8J4l13K36Q3j23j2j22R1J0J53l5p1r7O0j34K21PP8kj74M2J82l68J3J00
$$ 39 107 121 -192 44 127 4 -8 -130 -39 -29 124 89 18 -79 -19 -153 68 75 153 151 -23 19 201 -167 -154 -54
2931e4K49k15O8l23m8N54m76K76q5j51l6L28M35q49O0M35m14L81L8o1q0K01k29
$$ -54 195 -20 48 -275 -323 231 -245 31 -54 -205 -241 87 522 -327 -267 168 -246 135 173 112 32 233 4
2954DM38j49n21Q0J9J10o9j1J76Q0k03J26J75l72q5P5J20l02M66n6j61L6J00K92
$$ 4 442 293 -228 -148 -129 -19 -88 -99 77 157 -46 80 255 -117 -202 -127 -7 -309 157 101 -60 -24 76 368
2978C68l13j2j4j08K94k80L79l67m3J94k14n4r6K34K64m77K07M62l08K0l82K24
$$ 368 55 43 29 -79 215 -65 314 -53 -96 98 -116 -170 -266 -32 232 -245 -38 424 116 136 -246 -22
3000b2J15k00k58J73O7L82n7k66j10j6j40L68j08J69l0l60L26k23L22l4n6n5j03
$$ -22 93 -107 -365 -192 -125 257 200 -66 -176 -192 -332 36 -72 97 67 -293 33 -190 132 98 42 -13 -116
3023a16QJ60J69q4p6j7o0k1L0J16Oo9j40M07r7j12L9j68K18k20J48M0k61N8O2
$$ -116 -108 52 221 137 61 44 -16 -37 -7 109 115 46 -94 313 216 104 143 -25 193 -27 121 161 -100 -42 20
3048B0j84K18k59J59m1J57L9j10R0q0k17L95Lj22M1R8r9j7J4k57J09NK7j28PK9
$$ 20 -164 54 -205 -46 -87 70 109 -1 89 9 -208 187 190 68 109 207 108 91 105 -152 -43 -38 -11 -139 -132 -103
3074a03J21J49l15%L3J98J35k76p4J29k27K54J01p0j46j33Q9J55k44k5K81O2q3
$$ -103 18 167 -148 -148 -115 83 218 -58 -132 -3 -230 24 125 55 -91 -224 -135 20 -224 -249 32 94 11
3097A1K44m03N08m96M2k29L41J60k33P6J51j78q7m4R0j59L74R9o26K56N63l64
$$ 11 255 -148 360 -136 -94 -323 18 178 -55 21 172 -6 -93 -137 -47 -206 168 267 -359 -103 460 96
3119I6o2j34M2L78m92K47p5l6k31Q9P9K58k9l46J78j57J64j52j33J27j4K50j46
$$ 96 34 -100 -58 320 -172 75 0 -36 -267 -178 -99 159 130 -216 -38 -195 -31 -183 -316 -189 -203 47 -99
3142i9K26j63J96k78K56m88L91o0K05p8K8j42n9P6M1l6m8r3L84j57l58j20L18
$$ -99 127 -36 160 -118 138 -350 41 -19 186 108 136 -6 -65 11 52 16 -32 -125 259 102 -256 -376 -58
3165e8J7J15J50k95j73K08L97l66M7q2LJ47pl6l8l6P6l69K66J15J21k32Q3l1J2
$$ -58 -41 74 224 -71 -244 -36 361 -5 42 -40 -37 110 103 67 29 -7 69 -300 -34 81 202 -30 53 22 34
3190C4L16o08J91Oq8K88k08j5J54j73J66r6j37M72k27J65k48J50j45L4k05o9K58
$$ 34 350 -258 -67 -61 -149 139 -69 -84 70 -103 63 -33 -170 302 75 240 -8 142 -3 31 -174 -243 15
3213A5J47k68J89J11m63N50k37n3k22K91LO3j76J81k18oJ57j32j1L0J24m1j8L3
$$ 15 162 -106 83 194 -269 281 44 -9 -231 60 63 126 -50 131 -87 -93 64 -68 -79 -49 75 34 16 49
3237D9n3M76k46k74J2j12R6J20L32j56j69k45L32qJ35m58L35k37k77M12J26j17
$$ 49 -4 472 226 -48 -36 -148 -52 68 400 244 75 -170 162 154 289 -169 166 -71 -348 64 190 73
3259G3o2J34q6Q5k99K27m6K83m90J06m7q3J27J97N2j25O4J8J39l80R0p1K80L8
$$ 73 11 145 59 144 -155 72 26 309 -181 -75 -122 -205 -78 119 171 46 110 128 267 -113 -23 -94 186 224
3283B24k1l36L56j74j8O4k74L07l50M02l2Mk43L03m19J52K29l45L30k59K81k48
$$ 224 203 -133 223 49 31 95 -179 128 -222 180 148 152 -91 212 -207 -55 174 -171 159 -100 181 -67
3305f7K84l10L2j71K58N2k03L09j67k85J52Q5J18m4j21j34M51k24k6K24l80L4
$$ -67 217 -93 -61 -232 26 78 -125 184 17 -268 -116 -31 87 43 -78 -212 239 15 -11 213 -167 -133
3327a33J38J41k13j7J22K8kpj31K62k91K08k93J68J29j20L3K16o7j40K8k57%K19
$$ -133 5 146 -67 -84 38 66 64 57 -74 188 -103 105 -188 -20 109 -11 22 238 171 31 59 -198 -198 21
3351B1l2k6j45J5M55k15m0J31L25n73k78K64M2J18k85L84k21R4m0j64L15m04K40
$$ 21 -11 -37 -182 -167 288 73 33 164 489 -84 -362 -98 -56 62 -223 161 -60 34 -6 -170 145 -259 -19
3374a9N4J97L8p6nl69M82o08M80j1k91L50j67q6J7N3j20J3P2K5J32l17J0J31J40
$$ -19 35 232 270 194 189 -180 302 -306 174 163 -128 222 55 -31 -14 39 -81 -68 4 29 161 -156 -146 -15 125
3399A25j05O5Qlj11K50n92K55M06k23p7l67L52j80P11n20p4j16N98n38L08l49
$$ 125 20 85 93 90 -21 229 -363 -108 298 75 -2 -369 -17 -197 514 -6 -80 -196 402 -136 172 -177
3421a77j93L79j12j63K30K3K39j6n53N24p4O8k44MM5Q1j1j25k55J4L37r2M3k53
$$ -177 -370 9 -103 -266 -36 -13 226 210 -343 181 107 175 -69 -65 -20 61 50 -75 -330 -316 21 -71 -28 -281
3445b81K90q2Q1Jp0O5j35P6K11j71m3j33K63K9O8jk78J16R9j18J2q8q8K30J86
$$ -281 9 -73 8 9 -61 4 -131 -55 156 -15 -58 -191 72 101 169 168 -110 6 105 -13 -1 -89 -177 53 239
3470B39k93J21K59k57K04r2r4kP4j12k10L0j59J73J82j54J57Lk60L27j66Q3J93
$$ 239 -54 67 326 69 273 181 87 85 159 47 -163 -133 -292 -119 63 -91 66 69 -191 136 -30 53 246
3493B46j04J02J45j84j74J37N9l85K6M0K26l92N46o2k81K83j44l2r4q3J86K8k19
$$ 246 142 244 389 205 31 168 227 -158 -132 -92 134 -258 288 226 -55 228 84 52 -42 -125 61 89 -130
3516a30l2K36j25P4l40K47J17J23q9k44M58m16k00M76m5k7q9K27m75M00l20K59
$$ -130 -162 74 -51 23 -317 -70 47 170 81 -163 295 -121 -321 155 110 83 -6 221 -254 146 -174 85
3538H5R3j41j73K20m0q2j97K12j8r0O15m43Q9j27r6j24jJ63J27j10l2N5j52J89
$$ 85 178 37 -136 84 44 -38 -235 -23 -41 -131 484 41 130 3 -93 -217 -218 -55 72 -38 -70 -15 -167 22
3562B2j53N5J28n4N7J1j51L38p74R25o55J64L94n21J13o9J08J37p4k58K73j58
$$ 22 -131 -76 52 -2 55 66 -85 253 -521 404 -251 -87 307 -214 -101 -170 -62 75 1 -257 16 -142
3584a42L39l37J57J7j18Q3J40O0k21j02J62M21m95k68J46O1K94k3j46K6J51k15
$$ -142 197 -140 17 34 -84 -1 139 199 -22 -124 38 459 -36 -304 -158 -97 197 174 28 54 205 -10
3606a0rj2q0j01K20o4n4M06m75J93m43L27J59j87J81N8l14M71m81K89r4J97l82
$$ -10 -19 -31 -111 -212 8 -56 -110 296 -179 14 -429 -102 57 -130 51 109 -205 266 -215 74 -20 177 -205
3629b05K4K02K40k21k29K84l09L65k40l96M02J75k0K8Q8k36o7JK56k4m1j05j7
$$ -205 -181 21 261 40 -189 95 -214 151 -89 -485 -83 92 72 100 188 -48 -115 -114 142 118 77 -28 -45
3652d5j6L37j11J01j45k88O19n02N7O7O3J9r5K43l11J01j72r5J26j6Q2L0J53m15
$$ -45 -61 276 165 266 121 -167 452 -50 7 74 137 156 61 304 -7 94 -78 -173 -47 -63 19 49 202 -213
3676b13k05L83J22r8L26n97N44j54k74J45J45k65M69r0j07p8j12J04j17J9J76
$$ -213 -418 -35 87 -11 315 -282 262 108 -166 -21 124 -141 328 238 131 53 -59 45 -72 -53 123
3697A23L30m32J85m01K75m1m05L56l7k48L66o0j40k10L21J78j33J1L4j38L41p0
$$ 123 453 21 206 -195 80 39 -366 -10 -47 -295 71 11 -129 -339 -18 160 27 38 72 -66 275 205
3719B05r5j53L01j87k86k03M91l7j49o3j12K44L17l80M8Q4r1m5K52k54K40j20
$$ 205 110 -43 258 71 -215 -418 73 36 -113 -176 -288 -44 273 -107 -59 25 -66 -111 141 -113 127 7
3741Gj30K66o2j94o6J33J46l2j90O6o1n9J59K05k49J36P2N6k6j26k42L52k69k68
$$ 7 -123 143 81 -113 -179 -46 100 68 -122 -56 -117 -176 -17 188 -61 75 147 203 177 51 -191 161 -108 -376
3765c76N53j17p5L00j17j86o9m3K57k54l0L67r6J29k69J13l04K23J83j80j48K85
$$ -376 177 60 -15 285 168 -18 -87 -130 127 -127 -157 210 114 243 -26 87 -217 6 189 9 -139 146
3787A46L8J50l12p8J32n1R2mm5j60Q4j31J88k61j3l1L89j45M7J24J21m16J46j23
$$ 146 184 334 22 -56 76 25 117 113 68 -92 -8 -139 49 -212 -225 -256 133 -12 35 159 280 -136 10 -113
3811a13R0j7K0l4k00L96j03l75N06k83K67k02J93j82m4J67j65L17j99k64M69l30
$$ -113 -23 -40 -20 -54 -254 142 39 -336 170 -113 154 -48 145 -37 -81 86 -79 238 39 -225 244 -86
3833h6J37k23n4M5J69J85k67M4K4K34l08M9k15N8j4R2J05J4k9Q0M3N1M8p6l17
$$ -86 51 -172 -226 -181 -12 173 -94 -50 -26 208 -100 -51 -266 -208 -222 -130 -25 -11 -40 40 83 134 182 106 -211
3858b11K21l0J99L06l15m4j2J02m37K59J54l90J45L2q6O7MPJ06N7K5l04J1R7M4
$$ -211 10 -20 179 485 170 126 114 216 -221 38 192 -198 -53 -21 -107 -40 -36 -29 77 134 159 -145 -134 -37 7
3883Gq2m5o1L13O6m29N50m33LJ02l8j41M35k37J96j61j56L88k26k47M3K9k24N45
$$ 7 -75 -120 -181 132 198 -231 319 -114 -111 -9 -47 -188 247 10 206 45 -111 277 51 -196 -153 -124 -348 197
3907A97o29P10j28l17K15j8P2k43Q0J42p7j98M04k31L9Jl4J08J83k21j44K70j97
$$ 197 -432 278 150 -167 48 30 102 -141 -61 81 4 -194 210 -21 18 19 -15 93 276 55 -89 181 -16
3930a6L01k34l1K5kJ38K9j1k81P7J06j72L55m73Q9L26o4j70P1j56n5O7q1M57m83
$$ -16 285 51 20 45 43 181 210 199 -82 -5 101 -71 284 -189 -100 226 162 -8 63 -93 -148 -81 -162 295 -188
3955a88J36k57L43j04j41M98l17J49l22K67j11J42K22M9m12j47Q1J47K7n9Q0O4
$$ -188 -52 -309 34 -70 -211 287 -30 119 -203 64 -47 95 317 366 -46 -193 -112 35 62 3 83 147
3977A47p3l46M80l88L13l02J13K90r0k47K9q3L63k76J9o5L38l96Q3K84m28K69
$$ 147 74 -272 208 -180 133 -169 -56 234 144 -103 -74 -157 206 -70 -51 -116 222 -174 -91 193 -235 34
3999C4O8Nm27M46j99K0j44J93l70N06Kj2j63k56L51k89N2K98r4Q5qk90o9j0M19
$$ 34 102 107 -320 126 -73 -53 -197 -4 -374 132 134 122 -41 -297 54 -235 -183 115 21 106 98 -192 -261 -271 148
4024A48p9j54q2N04l80o9L22k80N0k69M64p0j53l9Q7j8Q9j52k17J20jP6j66N54
$$ 148 69 -85 -167 337 -43 -112 210 -70 -20 -289 175 105 -48 -87 0 -18 71 -81 -298 -178 -179 -103 -269 285
4048B85l66J14K08l41K35l51J78n7l3Q4R1k98M41k76M97k53j46j6j68N03o23J84
$$ 285 -81 33 241 -100 135 -216 -38 -95 -128 -44 47 -251 190 -86 411 158 12 -4 -172 331 -292 -108
4070a08J63K49Jk21m72N63k74j38M38k87L34l26Q6j3J01k02K58N5j28j10R9K89
$$ -108 55 304 305 84 -388 175 -99 -237 201 -86 248 -78 8 -5 96 -106 152 207 79 -31 68 357
4092C57k60j90L61j67j2n13L32M65l44m9J31K7k42j06M99m57K89M6m69L13J15
$$ 357 97 -93 268 101 89 -424 -92 373 29 -20 111 138 -104 -210 289 -168 121 167 -302 11 126
4113A26j15l66K94K90m41K22j23L36k82R7L36o05N08l90K75j61k27J5N58k97n2
$$ 126 11 -355 -61 229 -212 10 -113 223 -59 38 374 -231 277 -113 162 1 -226 -211 347 50 -2
4134bL46m91l30K69L63j18K5r0P9k50J33jO8J52l42J11q8J51J76m07M14k52o3
$$ -2 344 -147 -477 -208 155 37 62 -28 51 -199 -66 -67 1 153 -189 -78 -166 -15 161 -246 168 -84 -147
4157a47L4j86M45o9j96R0o5o6j01M09j15o2J22K62n93Q03n80j54kN07k00L9m1
$$ -147 -113 -299 146 77 -119 -29 -94 -160 -261 148 33 -29 93 355 -238 565 -15 -169 -171 336 136 175 134
4180A34j63P9l8j06K2J74k11N00l90O1n4Q8p6k52M8M61l83K2L70l12rJ69m99L58
$$ 134 -29 50 12 -94 -72 102 -109 391 1 62 8 96 20 -232 -184 277 -106 -84 286 -26 -35 134 -365 -7
4204gR5m51P21k78o7p7mj38j79M34j12N8k30L19p7j90K05k24M00Jl3l82O9J98
$$ -7 88 -363 358 80 13 -64 -68 -206 -385 49 -63 -5 -235 84 7 -183 22 -202 198 199 166 -216 -147 51
4228E1K82j71k6r1J68M4J4j6L7m8j54N2k36j8L13m24K35LL19L3k76K28m33r8O2
$$ 51 333 162 136 45 213 257 271 255 292 244 90 142 -94 -112 201 -223 12 15 334 367 91 319 -114 -212 -150
4253a50K5j52L21p4j01J90P8p2k47M81q2j23o92O79N9k52l0K61k11J3J72K9l56
$$ -150 -125 -277 44 -30 -131 59 137 65 -182 299 217 94 -598 81 140 -112 -142 119 -92 -79 93 122 -234
4276b34L27k9k84L02K44l73Q1j87M5K06j3mj44r2N08n84M04J84l00m8j67K84k50
$$ -234 93 64 -220 82 326 -47 34 -153 -108 98 85 81 -63 -155 353 -231 173 357 57 9 -158 126 -124
4299a24L37j16j59Ok20L39J63r8Ok01mP0j98L79k10m60K75J09K38p0J65l79J13
$$ -124 213 97 -62 -56 -276 63 226 128 134 -67 -71 -1 -199 180 -30 -490 -215 -106 132 62 227 -152 -39
4322c9K2j1j74M47p51M39k37M82j89l16Q44q43L05J80j0p1l03j1K52%J7j48%J96
$$ -39 -17 -28 -202 245 -506 -67 -304 178 -11 -327 517 -326 -21 159 149 78 -225 -236 16 16 33 -115 -115 81
4346H1O1k59K53P1k16N0l88J53M9QJ57L2J48q5j50Kj28L10l16M88l08k57K85J36
$$ 81 142 -117 136 207 -9 41 -347 -194 -145 -137 20 52 200 115 -35 -33 -161 149 -167 321 13 -244 41 177
4370A77j49j41K31k91K88k70K08k08P5j15M2K49k85L42j96K23Ppj31k83J45L62
$$ 177 28 -113 118 -173 115 -155 53 -155 -80 -195 -153 96 -189 153 -43 180 187 180 49 -234 -89 273
4392B73l48Q0PJ97P4l47K13m6J0N5n3mj24q3K86l2j23J25k5p8LP2K87j17k04M6
$$ 273 -75 5 12 209 283 -64 149 103 113 168 115 111 -13 -96 190 158 35 160 135 57 60 132 419 302 98 144
4418A44j66j26P2j24K86P5m57J59J16j11NJ50J7k07J35j16K98l5j67j14M87R8
$$ 144 -22 -148 -76 -200 86 161 -296 -137 -21 -132 -127 23 40 -167 -32 -148 150 115 -52 -166 321 419
4440D19k94k94J20q2J13r7j34M18j40O1kk24K11n1q7M04n30L23j40j41K46j85
$$ 419 125 -169 -49 -131 -18 -115 -249 169 29 90 88 -136 75 24 -63 341 -189 134 -6 -147 99 -86
4462h6J83P1k52k00l5L13k52J32M14k04r2K06k75M82n62K63l79L18M33p53N85
$$ -86 97 168 -84 -284 -319 -6 -258 -126 288 84 -8 198 -77 405 -157 106 -273 45 478 -275 310
4483C10o12N00o9J66m30K09K64k33k12R7J81k23RK84n69J98K80j69Nn1M0K9j46
$$ 310 -302 198 129 295 -135 74 338 105 -107 -10 171 -52 -43 241 -328 -130 150 -19 -14 -65 -25 4 -142
4506a42K85j55K3k7J43j68J61L39m06J31k81L86m84L62o0k56j26N08n62l9M20
$$ -142 143 -12 11 -16 127 -41 120 459 53 184 -97 289 -195 167 107 -149 -275 233 -329 -368 52
4527E2M2K3k34k14L02k05K36M8j01J83k92J37R3l26L57k47M9L78j81l66R25n89
$$ 52 94 117 -117 -331 -29 -234 2 50 -51 132 -160 -23 70 -256 101 -146 -97 281 100 -266 659 70
4549G0k51J94J83j45m9l1L71n04L08R8m19K78j32j40J19K21p4l6J8O0P1m93K26
$$ 70 -181 13 196 51 2 -29 342 -162 146 244 -175 103 -29 -169 -50 171 97 61 79 139 210 -283 -57
4572e7o2k81M75k42j2J23L89k79l7l68L74K46l79j86P7J17k49M39m32M14p9r8
$$ -57 -119 -400 75 -167 -179 -56 333 54 17 -351 23 269 -110 -296 -219 -102 -351 88 -344 70 -9 -107
4594a07J38Mo0J56k92k09J85J62j11j9J35l96M02Oj89P0K04k60j12L74o9k55J05
$$ -107 31 35 -25 131 -161 -370 -185 -23 -134 -153 -18 -414 -12 -6 -195 -125 79 -181 -293 81 12 -243 -138
4617a38j24J46K08m4l10K21J59k77n8K65j98J55J85l14J19k55K77l9j67J57M14
$$ -138 -262 -116 92 48 -262 -41 118 -159 -217 48 -150 5 190 -124 -5 -260 17 -22 -189 -32 382
4638C82k75n3J56l45J00K11o3k50J93k83K51j00J06j2J37j41p1J08j12j19J86
$$ 382 107 54 210 -135 -35 176 113 -137 56 -227 24 -76 30 18 155 14 -57 51 -61 -180 6
4659Fl20N01p3j04jK34j09k05K26L3M2k37j47K48j05P7PJ13k96J85J2k88K51J42
$$ 6 -314 187 114 10 9 243 134 -71 155 188 230 -7 -154 94 -11 66 73 186 -110 75 87 -201 50 192
4683A92k31M5p0l95L24J5K54k15m8J07j35K39O0K8k5m54J04K70J05k38L75n11
$$ 192 -39 6 -64 -459 -135 -120 134 -81 -129 -22 -157 82 142 170 145 -309 -205 65 170 -68 307 -204
4705b04K68j52J95J30j73J07M8k70JK54r5l09M9J78L19l73k8Ok24J84j06R5K32
$$ -204 64 -88 107 237 64 171 219 -51 -50 204 109 -200 -151 27 346 -27 -55 -49 -273 -89 -195 -100 132
4728A32j50j06j8K23j58l9J11M4n9K3j3M8J20j40j21n7L65Rj6N2k88O6J0o8R4
$$ 132 -18 -124 -142 81 -77 -116 -5 39 -20 3 -10 38 158 18 -103 -160 205 214 198 250 -38 28 38 -30 64
4753F4k20K19j65K36KK4k96K95k52Q5R6j7J87k79L90m14m4K65k62K38j65K12k00
$$ 64 -156 63 -102 134 136 160 -136 159 -93 -8 88 71 258 -21 369 -45 -89 176 -86 152 -13 199 -1
4776aJ43q4J29R4o21L20J04K14m18M48l22K48k65k33K41ol0j69K31r4M5J8J22
$$ -1 142 58 187 281 -340 -20 84 298 -120 328 6 254 -11 -244 -3 -9 -39 -208 23 -71 -26 -8 114
4799A14m5R5k24l6l04j1K47K50q5O9j9Q7K48n69L55j11o2P0o1J04l93M20L2Nk31
$$ 114 69 164 -60 -96 -400 -411 -164 86 1 70 51 138 386 -183 172 61 -1 69 8 112 -281 139 171 176 -55
4824e5k02K32J74J2K0k25J66k10J16n4K6J5NJ11j18j12K09l11L31k76J07Q9j80
$$ -55 -257 -25 149 161 181 -44 122 -88 28 -26 0 15 20 131 13 -99 110 -201 130 -146 -39 50 -130
4847a30J79j05p9O5N7J06m5l8j88L71k10K31k01K14k03k00l5K01J55m23L96K02
$$ -130 49 -56 -135 -70 -13 93 48 10 -178 193 -17 214 13 227 24 -176 -211 -10 145 -278 118 320
4869C20l59R8l70L52J41K25k44K0k58q8R5q5J26R5N5l86J90J16O4j63K09l23J11
$$ 320 -39 59 -311 41 182 407 163 183 -75 -163 -68 -153 -27 68 123 -263 -73 43 107 -56 153 -170 -59
4892e9j10K77j68J0J07j94J77k02J79n6l08K23P7J16OO7J5k88K05l02L84q3k21
$$ -59 -169 108 -60 -50 57 -137 40 -162 17 -39 -347 -124 -47 69 75 142 157 -131 74 -228 156 73 -148
4915a48L42l11j00N67j14n54L4M31l05l3m2M52k49k8j61j24K44J42K29N0j68r4
$$ -148 194 -117 -217 350 236 -318 -284 147 -158 -191 -233 219 -30 -58 -219 -343 -99 43 272 322 154 60
4937F0P9l00K58j33J44j10J31Pk67Q5J4l30L57K41q6l42K71o8lj8j31K83j06j01
$$ 60 139 -161 97 -36 108 -2 129 136 -131 -46 -32 -362 -5 236 150 -192 79 11 8 -10 -141 142 36 -65
4961f5K79j53K5M05n60R3J48n0j10J52m0k06J04P0kj19N97l76k20k68J99K60k78
$$ -65 214 61 86 491 -69 24 172 122 12 164 124 -82 22 92 90 -29 568 192 -28 -296 -97 163 -115
4984a15N6j90M68Qk23J78L4l97J12J36J84j65J3j06J56m3l21M17k04M1l89L69
$$ -115 -59 -249 219 227 4 182 216 -181 -69 67 251 86 99 -7 149 106 -215 202 -2 39 -350 19
5006A9J01k76J77n2r0q8N58k67L80l67m45N87l17q3M57k04J62p7j46r6Q5k8j69
$$ 19 120 -156 21 -31 -121 -209 349 82 462 95 -350 237 -80 -163 294 90 252 175 29 -67 18 -10 -179
5029a79K27M8k71J12q8L52l13J6K13k19j04M31r3j95J05r8j1K84k18J02j62N16
$$ -179 48 96 -175 -63 -151 201 -112 -96 117 -102 -206 225 132 -63 42 -56 -67 217 -1 101 -61 455
5051D55k55p5j69Q7%N7j61n6j05K12N4o1P5j79M13j88j11J49o6n3k1J2j45J81
$$ 455 200 125 -44 43 43 100 -61 -117 -222 -10 44 -17 58 -121 292 104 -7 142 76 23 2 14 -131 50
5075E0k77J95J14j59J64q7k59p8K45jr0L24m57M14n1Pq8l97L81j09J71K36k76
$$ 50 -227 -32 82 -77 87 0 -259 -337 -92 -93 -183 141 -316 98 47 54 -34 -431 -50 -159 12 248 -28
5098b8K21n0j97n8J78K03m20M41l32K5K26l32k03L79Mr2R2k7O4k03K35n1M6r7
$$ -28 193 143 -54 -112 66 269 -151 290 -42 -17 209 -123 -326 53 57 -35 57 30 94 -109 126 75 121 24
5122B4j67K64j37J59rl5J11j75l19K29P7j40K20j14k81K67K10m03J24J28j70K33
$$ 24 -143 121 -16 143 134 99 210 35 -284 -55 22 -118 102 -12 -293 -26 184 -219 -95 33 -137 96
5144I6j88J17Kn3J03l4j88M53r1k43J7J20L2k45p1J85LJ55k74JM2pN31p90M55
$$ 96 -92 25 27 -26 77 43 -145 308 217 -26 -9 111 143 -102 -173 12 15 170 -104 -103 -61 -68 463 -327 128
5169A28p4n19K21L9j61L82J31k43o0L14l65J57K29j42R5J13m64K89k2k68J60k3
$$ 128 54 -465 -244 -205 -366 16 147 -96 -156 158 -207 -50 179 37 132 245 -219 70 48 -220 -60 -83
5191h3K06j02JL39k43l1p6N9J68j11k15K8L34n07j66O04k28k15J68J00o0P0L71
$$ -83 123 21 22 361 118 87 11 70 238 127 -88 -60 274 -233 -399 205 -23 -238 -70 30 -30 40 411
5214D11l62j21Jo4J78r4j9J98k90j74K7L27J38l04R2Ol9Q3J67j35L6j51O8L5K67
$$ 411 49 -72 -71 -135 43 -51 -70 128 -162 -336 -309 18 156 -148 -56 -50 -89 -6 161 26 62 -89 -21 14 281
5239B81l77j79k1M37R5m69M10j42M1n8j44J35j35O1q6L14k64L79j29K8o2o0Kl7
$$ 281 -96 -275 -296 141 236 -233 177 35 76 18 -126 9 -126 -65 -151 163 -101 278 149 177 115 55 57 20
5263B0J27m69M37Q6l02J91k60J25m7j2L01q6j99k08K77r1L43n4nP3k75K6j49K68
$$ 20 147 -322 115 201 -101 90 -170 -45 -92 -104 197 111 -88 -296 -19 -110 233 179 174 247 -28 -2 -151 117
5287A17K7j59J07k05K51n3j78j28L33j22Nk38N24n76L07j19l51M45J64kl03L92
$$ 117 144 -15 92 -113 138 85 -93 -221 112 -10 -5 -243 281 -295 12 -107 -458 -13 151 149 -154 238
5309B38n44K24J54l04K28J74k59J03J81l70R7P2J7j03O3p9J16J38m97N1L14L02
$$ 238 -306 -82 72 -232 -4 170 -89 14 195 -175 -78 -6 11 -92 -29 -108 8 146 -351 -300 14 316
5331C16k24l23j06K05P3K62k50Q0p8p7J56j90J18Qk0j12O4K48O4q3j71J99o1K17
$$ 316 92 -231 -337 -132 -59 203 -47 33 -45 -122 34 -156 -38 -30 -50 -162 -98 150 214 131 -40 159 98 315
5355C15r7j56k19M70l37l0K03j05j05KJ88J18n46q4O06k97P0j4j54J01L05N0l87
$$ 315 218 62 -157 313 -24 -54 149 44 -61 -59 129 247 -299 -383 223 -74 -4 -18 -172 -71 234 284 -103
5378a03K02j41J04k19j75J87J58o9j58J91J07R7j66q0M36l79J55n5k78K60J55
$$ -103 99 -42 62 -157 -332 -145 13 -56 -214 -23 84 181 15 -65 371 -8 147 92 -186 74 229
5399B29j73j59J1L33m26M75m48K12K2n3K63k74L6k67Q9J3J89l14N68k71k27L41
$$ 229 56 -103 -92 241 -185 290 -158 54 76 23 286 12 48 -219 -130 -117 72 -242 326 55 -172 169
5421A69j04J97k73L00l15N1k15L17Kk61J61k27J80j51J53l2K06m4j39L08k22O3
$$ 169 65 262 -11 289 -26 25 -190 127 129 -132 29 -198 -18 -169 -16 -48 158 114 -25 283 61 124
5443A24m5j88K55j1j31O2N3OK56n00P0J98k72K78j9p7P8j72LJ56j23k11q2J57
$$ 124 79 -109 146 135 4 66 119 125 381 -119 -49 149 -123 155 136 59 137 -35 -32 124 1 -210 -292 -135
5467a35J90O2l11M8k67K20J72j16k9M67r0k82K09M5k94J63j83j16K70K36j01j61
$$ -135 55 117 -194 -146 -413 -193 -21 -137 -166 301 211 -71 138 183 -111 52 -131 -247 23 259 158 -3
5489cO0k3j02R6Nl20K00P6j07O1K13j14k72L47k55R2L99k03jm60L39K43m94J1
$$ -3 57 34 -68 28 33 -287 -87 -11 -118 -57 156 42 -230 117 -138 -46 353 150 149 -311 28 271 -223 -212
5513b12L04M8r5j21M1k1k23J60RK19k22Q3J48j08L86l45j72M12l53j72K38p6K37
$$ -212 92 140 45 -76 -35 -56 -279 -119 -110 109 -113 -30 118 10 396 51 -121 291 -62 -234 4 -72 165
5536A65K7l24L46m49p1Q9L19p6J00J2n0L14l76J17n41N55m0L6m60R6n0M03O4l82
$$ 165 192 -132 214 -235 -306 -217 102 26 126 138 88 402 26 143 -398 157 117 153 -307 -211 -261 142 206 -176
5560a76J51J49j76m14K64J05n2M11m39J06K07m47K13J13k75M39n2k73N92l06l1
$$ -176 -25 124 -52 -466 -202 -97 -149 262 -177 -71 136 -311 -98 15 -260 179 127 -146 446 140 109
5581A09O2L6m52J7jN9j98J6N61j35J7o5J20j06l44M67j40j48q1K94m22J84L6l2
$$ 109 171 207 -245 -228 -229 -170 -368 -352 209 74 91 26 146 40 -304 163 23 -125 -206 88 -334 -150 -114 -146
5605a46R4k54O05m44J70j86K06k80K5M5M38n12N5K93r3j0m1M30l58l37K20K1J27
$$ -146 -52 -306 299 -145 25 -161 45 -235 -210 -165 273 -239 -184 109 16 6 -35 395 37 -300 -80 -59 68
5628F8O9k73P5Q3j92J77o9N7r6J53K07j41j91P4K1n1J21J0k2l78N13j54k12K45
$$ 68 137 -136 -61 22 -170 7 -62 -5 -101 52 259 118 -73 1 22 -29 92 102 80 -298 215 61 -151 94
5652I4J60n38O29l27M9m8K13k8k31K06l90K64j48J00N7p1j40j38M36l63J58P8
$$ 94 254 -284 345 18 67 19 232 204 -27 179 -211 53 -95 5 62 -9 -149 -287 149 -214 -56 22
5674B2J53j93n5j10L10k35J82o3K14k92J09k40K32j34R8Q4R0k17N6l4J2P3j20
$$ 22 175 -18 -73 -183 127 -108 74 11 225 -67 42 -198 34 -100 -2 82 172 -45 11 -23 -11 62 -58
5697e8K24n36J56K99j93j74K22K1j12P2O2L34k75J50J0l04R7L9J62m3l13K42n36
$$ -58 166 -370 -214 85 -108 -282 -60 -39 -151 -79 -17 317 42 192 202 -102 -5 34 196 153 -160 82 -454
5720d54O30q8j95j80Q1J60Q6n6r8L07l37M61m71P4l07M82l81L57Lk67k28O20l53
$$ -454 176 88 -107 -287 -206 -46 40 -16 -114 193 -144 317 -154 -80 -387 95 -286 71 74 -193 -421 199 -154
5743a54Q6J63l95M68k10P6J06j92J18j11l11M00J1J55m4P9j55j66K29J33j11k63
$$ -154 -68 95 -300 168 -42 34 140 -52 66 -45 -356 44 55 210 166 245 90 -76 153 286 175 -88
5765h8k19O43j33k56k85J86Q0K35k47O4L01k1k15k46K84j18j07L97l12L4j26J97
$$ -88 -307 336 203 -53 -338 -152 -72 163 -84 -20 281 260 45 -201 83 -35 -142 255 -57 -23 -149 48
5787D8J87k53m0j70K85K71j41l74K02J27j52J9j8K37k3k73q4K92n4M0j94L0j24
$$ 48 235 -18 -58 -228 57 328 187 -187 15 142 -10 9 -9 228 205 -68 -152 140 86 126 -68 -38 -162
5810a62r5N08k19O3k76L02L1k82jM42q1k42p7M77q20Q40j17j97J30k60L32m91
$$ -162 -257 251 32 95 -181 121 152 -130 -131 311 230 -12 -89 388 -432 408 291 94 224 -36 296 -195
5832a95KM46k13L6o8j10L7L9n6K93m63J44R0n5K63l36K18j04p3k8k8M4l3K97j82
$$ -195 -193 253 40 76 8 -102 -65 -26 -82 211 -252 -108 -18 -73 190 -146 72 -32 -105 -133 -161 -117 -150 147 -35
5857c5L40r1L4K6m58K23J3pO4k10J31M12m69Lj32L63l31R7J42k38Jl7M15k88J15
$$ -35 305 214 248 274 -184 39 52 45 109 -101 30 442 -27 -24 -156 207 -124 -27 115 -123 -122 -159 256 -32 83
5882H3o0j11l5O2M47l80O9l1O0k56J7J20j88K10n2j81K16L03j43k84M29j71J8
$$ 83 23 -88 -123 -61 386 6 75 44 104 -152 -135 -15 -203 7 -45 -226 -10 293 150 -134 295 124 142
5905A42j92P1K00l41J29j33K46l49L59k54j00J68N0q0J19n1j17J75j21K47l06
$$ 142 -50 21 221 -120 9 -124 122 -227 132 -122 -222 -54 -4 -84 35 -16 -133 42 -79 168 -138
5926a38K43j92n0J65J43k95Rl8k79R56Jp31Q5J21k01K59k59L93k39J18J27k30
$$ -138 105 -87 -137 28 171 -124 -115 -153 -432 524 525 -206 -121 0 -201 58 -201 192 -47 71 198 -32
5948c2N1J09m61K74L56n08M23k52j5L98l35q7Q5j91J90K40l21L00j63Q7K28k62
$$ -32 19 128 -333 -59 297 -211 212 -40 -55 343 8 -79 6 -185 5 245 -76 224 61 148 376 114
5970A14ml43L90k84Q5K95k13Lk96N8j43K41J7k2M21l89R9J32j03j73O8j41j0J40
$$ 114 110 -233 157 -127 -42 253 40 43 -253 -195 -338 -97 -80 -102 319 -70 29 161 58 -115 -47 -188 -198 -58
5994e8M2n8j39L7J55J53l7p0r2J03N6k7k35K51N2Kr0j55J28j90J19l5K02J72m14
$$ -58 -16 -74 -213 -176 -21 132 95 25 -67 36 92 65 -170 81 133 135 45 -110 18 -172 -53 -88 114 286 -128
6019a28M56m78K34R0j9q9l44M14k86M23k58K1O7k81K68m3k52K01Q9k33L13j53
$$ -128 328 -150 84 174 155 66 -278 136 -150 273 15 36 103 -178 90 47 -205 -4 85 -148 165 12
6041A2RJ04l20M2L03P8j38j85J47L10n75J06j42K55j1J54j72O8J0j33J79j30J25
$$ 12 21 125 -195 -153 150 228 90 -95 52 362 -213 -107 -249 6 -5 149 -23 45 55 -78 101 -29 96
6064I6k61kM58m19j25Q9p9N68j79q0M6l96K85j38kJ52p7N0J08P4l30M4J19J91
$$ 96 -165 -167 291 -128 -253 -164 -243 325 146 66 112 -284 1 -137 -139 13 -64 -14 94 168 -162 -118 1 192
6088A92j82k78J20m8J82j69P6Q4k45M03k60mP5K20j78M5K5l39q2N2K36mJ64Q2
$$ 192 10 -268 -148 -196 -14 -183 -107 -23 -268 135 -125 -129 -54 166 -12 33 58 -281 -363 -311 -75 -79 85 167
6112A67J01k46j5l4K29j57J61j8m7j60J4k56N38l85J35J06l59J73K42J08l61p3
$$ 167 268 22 7 -27 202 45 206 188 141 -19 -5 -261 277 -108 27 133 -226 -53 189 297 -64 -137
6134a37n2M33l64j64M50j71L5o2J28L07n87L69m37l41N77j37J07j70K45J26j63
$$ -137 -189 244 -120 -284 166 -5 30 -32 96 403 -184 185 -252 -593 -16 -153 -46 -216 29 155 -8
6155hJ7j24M13n16K46K19k18l06J29J72q2J04P2o1J76l23q7L78j31M4q5J34r2
$$ -8 9 -115 298 -218 28 247 29 -277 -148 24 -58 46 118 57 233 -90 -177 201 70 114 29 163 71
6178G1o2K65k76j85L49j45J86l06P5k98L76k76J06K66L98l80L5P9k5l03K89k86
$$ 71 9 274 -2 -187 162 17 203 -103 -28 -326 50 -226 -120 146 544 164 199 278 253 -50 239 -47
6200d7J4j08K66k01lOM12k26q3o5k1P5j3k36M87m33%%J69m3o2LJ5K06q2kJ11j64
$$ -47 -33 -141 125 -76 -79 -73 339 113 30 -35 -56 19 6 -230 257 -176 -176 -176 -7 -50 -112 -109 -94 112 30 28 139 -25
6228b5R1k92L33j12K91k42l28K82o4J55m5J56k31J39l21L70l09L32j96j88J93
$$ -25 66 -226 107 -5 286 44 -284 -2 -66 89 44 200 -31 108 -213 157 -152 180 -16 -204 -11
6249a1L5k14R5J92j02j06o2r5L17J02k04Pn7L65l58L4j6m5J52j33K1N0J61k38
$$ -11 24 -190 -95 97 -5 -111 -173 -268 49 151 -53 -46 -103 262 -96 -62 -78 -123 29 -104 -83 -33 128 -110
6273a10J46j63Q6o8j35q9K36R3L45k06j7k1k28J14oo9L56J26m54M21n19Q4K57
$$ -110 36 -127 -41 -109 -244 -333 -97 -4 341 135 118 97 -131 -17 -23 -92 264 390 -64 357 -162 -78 179
6296A79p7rj63K26K7j60l4j88r6K37P6j7LP6m3Nj75P0N4L6J22k01j84K00J45m52
$$ 179 102 93 -70 156 183 23 -11 -199 -295 -58 18 1 4 80 37 42 -133 -63 -9 27 149 -52 -236 -36 109 -343
6322c43N00j67m8Q2PR5n8n0M98n64K00j72l9K74j60q0rq6j06K06J71j3j59L1J81
$$ -343 157 -10 -58 24 31 126 68 18 516 -48 152 -20 -59 215 55 -25 -34 -120 -226 -20 151 138 -21 10 191
6347A91N2l87K51j10k55L36j05J35J11k66L56j82j73K1J04O4o6n1j37K45k54j00
$$ 191 243 -144 107 -3 -258 78 -27 108 219 -47 309 127 -46 -25 79 143 77 26 -111 134 -120 -220
6369b20J69L37m69L75j30k7n8r5j76K15K33j57p7K94j97k00M78p7j13K69m62N7
$$ -220 -51 286 -183 192 62 35 -23 -118 -294 -79 154 -3 -80 214 17 -183 295 218 105 374 -88 -31
6391c1j31o3L58k81k3K53l02R9J22j42K24K4j90L67k93L7l9q8J29K30m23N2j00
$$ -31 -162 -225 133 -148 -171 82 -220 -121 1 -141 83 107 -83 284 -9 28 -11 -99 30 260 -163 -111 -211
6414b11M21l54k0K50k57K01k87J31n9Q1m4R0M3PjJ86j98K84j85l85N06k78q5Q4
$$ -211 210 -144 -164 86 -171 30 -257 -126 -185 -104 -148 -58 -15 -8 -9 177 -21 263 78 -307 199 -79 -164 -80
6438h0L71k16n1k77J68P8J27k79L37m7K21l28n8N9r8J96mj35J07M5m87L15j37
$$ -80 291 75 24 -253 -85 -7 120 -159 178 131 352 24 -34 25 -73 123 119 -16 91 136 -351 -36 -173
$$ [...]
8191d4
##END NTUPLES=NMR FID
##END=
