##TITLE=1H_DE-77F2TFA
 DMSO-d6
 8 sc, 
 28.11.2024
##JCAMPDX= 6.0         $$ Bruker NMR JCAMP-DX V2.0
##DATA TYPE= NMR FID
##DATA CLASS= NTUPLES
##ORIGIN= UXNMR, Bruker Analytische Messtechnik GmbH
##OWNER= root
$$ XWIN-NMR		Version 3.5
$$ Thu Nov 28 14:54:50 2024 Russian Standard Time (UT+4h)  she@DPX200
##.OBSERVE FREQUENCY= 200.1315
##.OBSERVE NUCLEUS= ^1H
##.DELAY= (6, 6)
##.ACQUISITION MODE= SIMULTANEOUS
##.ACQUISITION SCHEME= undefined
##.AVERAGES= 8
##.DIGITISER RES= 18
##SPECTROMETER/DATA SYSTEM= spect
##.PULSE SEQUENCE= zg30
##.SOLVENT NAME= CD3CN
##.SHIFT REFERENCE= (INTERNAL, CD3CN, 0, 15.7039)
##AUDIT TRAIL= $$ (NUMBER, WHEN, WHO, WHERE, WHAT)
$$ ##TITLE= Audit trail, XWIN-NMR		Version 3.5
$$ ##JCAMPDX= 5.01
$$ ##ORIGIN= Bruker BioSpin GmbH
$$ ##OWNER= she
$$ F:/spectra/data/she/nmr/H-F/1/audita.txt
$$ ##AUDIT TRAIL=  $$ (NUMBER, WHEN, WHO, WHERE, WHAT)
(   1,<2024-11-28 14:53:50.43 +0400>,<she>,<DPX200>,
      <created by zg, POWCHK disabled, PULCHK disabled
       configuration hash MD5:
       00 E9 B6 7A A2 85 ED C7 34 08 36 98 17 FE 4E 26
       data hash MD5: 16K
       D9 06 8F A8 42 21 E7 BE 31 87 47 93 CB A6 87 01>)
$$ ##END=
$$ 
$$ hash MD5
$$ 2C 9C 07 62 1D BC 7F 2D B2 A6 64 8D D8 37 C8 4E
##$RELAX= 
##$RELAX= 
##$RELAX= 
##$RELAX= 
##$RELAX= 
##$RELAX= 
$$ Bruker specific parameters
$$ --------------------------
##$DU= <F:/spectra>
##$EXPNO= 1
##$NAME= <H-F>
##$PROCNO= 1
##$TYPE= <nmr>
##$USER= <she>
##$AMP= (0..31)
100 100 100 100 100 100 100 100 100 100 100 100 100 100 100 100 100 100 
100 100 100 100 100 100 100 100 100 100 100 100 100 100 
##$AQSEQ= 0
##$AQ_mod= 1
##$AUNM= <au_zg>
##$AUTOPOS= <>
##$BF1= 200.13
##$BF2= 200.13
##$BF3= 200.13
##$BF4= 200.13
##$BF5= 200.13
##$BF6= 200.13
##$BF7= 200.13
##$BF8= 200.13
##$BYTORDA= 1
##$CFDGTYP= 0
##$CFRGTYP= 5
##$CHEMSTR= <none>
##$CNST= (0..31)
1 1 145 1 1 1 1 1 1 1 1 1 1 1 1 1 1 1 1 1 1 1 1 1 1 1 1 1 1 1 1 1 
##$CPDPRG= <>
##$CPDPRG1= <>
##$CPDPRG2= <>
##$CPDPRG3= <>
##$CPDPRG4= <mlev>
##$CPDPRG5= <mlev>
##$CPDPRG6= <mlev>
##$CPDPRG7= <mlev>
##$CPDPRG8= <mlev>
##$CPDPRGB= <>
##$CPDPRGT= <>
##$D= (0..31)
0 1.2 0 0 0 0 0 0 0 0.06 0 0.03 0 0 0 0 0.0002 0 0 0 0 0 0 0 0 0 0 0 0 
0 0 0 
##$DATE= 1732791229
##$DBL= (0..7)
120 120 120 120 120 120 120 120 
##$DBP= (0..7)
150 150 150 150 150 150 150 150 
##$DBP07= 0
##$DBPNAM0= <>
##$DBPNAM1= <>
##$DBPNAM2= <>
##$DBPNAM3= <>
##$DBPNAM4= <>
##$DBPNAM5= <>
##$DBPNAM6= <>
##$DBPNAM7= <>
##$DBPOAL= (0..7)
0.5 0.5 0.5 0.5 0.5 0.5 0.5 0.5 
##$DBPOFFS= (0..7)
0 0 0 0 0 0 0 0 
##$DE= 6
##$DECBNUC= <off>
##$DECIM= 24
##$DECNUC= <off>
##$DECSTAT= 4
##$DIGMOD= 1
##$DIGTYP= 9
##$DL= (0..7)
0 120 120 120 120 120 120 120 
##$DP= (0..7)
150 150 150 150 150 150 150 150 
##$DP07= 0
##$DPNAME0= <>
##$DPNAME1= <>
##$DPNAME2= <>
##$DPNAME3= <>
##$DPNAME4= <>
##$DPNAME5= <>
##$DPNAME6= <>
##$DPNAME7= <>
##$DPOAL= (0..7)
0.5 0.5 0.5 0.5 0.5 0.5 0.5 0.5 
##$DPOFFS= (0..7)
0 0 0 0 0 0 0 0 
##$DQDMODE= 0
##$DR= 18
##$DS= 0
##$DSLIST= <SSSSSSSSSSSSSSS>
$$ [...]
##$SUBNAM2= <"">
##$SUBNAM3= <"">
##$SUBNAM4= <"">
##$SUBNAM5= <"">
##$SUBNAM6= <"">
##$SUBNAM7= <"">
##$SUBNAM8= <"">
##$SUBNAM9= <"">
##$SW= 24.0689530833862
##$SWIBOX= (0..15)
0 0 2 0 0 0 0 0 0 0 0 0 0 0 0 0 
##$SW_h= 4816.95568400771
##$TD= 16384
##$TD0= 1
##$TE= 0
##$TE2= 300
##$TE3= 300
##$TEG= 300
##$TL= (0..7)
0 120 120 120 120 120 120 120 
##$TP= (0..7)
150 150 150 150 150 150 150 150 
##$TP07= 0
##$TPNAME0= <>
##$TPNAME1= <>
##$TPNAME2= <>
##$TPNAME3= <>
##$TPNAME4= <>
##$TPNAME5= <>
##$TPNAME6= <>
##$TPNAME7= <>
##$TPOAL= (0..7)
0.5 0.5 0.5 0.5 0.5 0.5 0.5 0.5 
##$TPOFFS= (0..7)
0 0 0 0 0 0 0 0 
##$TUNHIN= 0
##$TUNHOUT= 0
##$TUNXOUT= 0
##$USERA1= <user>
##$USERA2= <user>
##$USERA3= <user>
##$USERA4= <user>
##$USERA5= <user>
##$V9= 5
##$VALIST= <valist>
##$VCLIST= <CCCCCCCCCCCCCCC>
##$VD= 0
##$VDLIST= <DDDDDDDDDDDDDDD>
##$VPLIST= <PPPPPPPPPPPPPPP>
##$VTLIST= <TTTTTTTTTTTTTTT>
##$WBST= 1024
##$WBSW= 4
##$XGAIN= (0..3)
0 0 0 0 
##$XL= 0
##$YL= 0
##$YMAX_a= 132664
##$YMIN_a= -156597
##$ZGOPTNS= <>
##$ZL1= 120
##$ZL2= 120
##$ZL3= 120
##$ZL4= 120
##$ABSF1= 10
##$ABSF2= 0
##$ABSG= 5
##$ABSL= 3
##$ALPHA= 0
##$AQORDER= 0
##$ASSFAC= 0
##$ASSFACI= 0
##$ASSFACX= 0
##$ASSWID= 0
##$AUNMP= <proc_1d>
##$AZFE= 0.1
##$AZFW= 0.1
##$BCFW= 1
##$BC_mod= 2
##$BYTORDP= 1
##$COROFFS= 0
##$CY= 11.3945322036743
##$DATMOD= 1
##$DC= 2
##$DFILT= <>
##$DTYPP= 0
##$F1P= 15.6554695791079
##$F2P= 12.8336369535428
##$FCOR= 0.5
##$FTSIZE= 0
##$FT_mod= 4
##$GAMMA= 1
##$GB= 0.15
##$INTBC= 1
##$INTSCL= 1
##$ISEN= 128
##$LB= 0.24
##$LEV0= 0
##$LPBIN= 0
##$MAXI= 10000
##$MC2= 0
##$MEAN= 0
##$ME_mod= 0
##$MI= 1.114404
##$NCOEF= 0
##$NC_proc= 0
##$NLEV= 6
##$NOISF1= 3.799351
##$NOISF2= 2.8
##$NSP= 1
##$NTH_PI= 0
##$NZP= 0
##$OFFSET= 15.70392
##$PC= 1
##$PHC0= -26719.68
##$PHC1= 11.38744
##$PH_mod= 1
##$PKNL= yes
##$PPARMOD= 0
##$PSCAL= 0
##$PSIGN= 0
##$REVERSE= no
##$SF= 200.130013532006
##$SI= 16384
##$SIGF1= 3
##$SIGF2= 2
##$SINO= 400
##$SIOLD= 16384
##$SREGLST= <1H.CDCl3>
##$SSB= 0
##$STSI= 0
##$STSR= 0
##$SW_p= 3612.71676300578
##$SYMM= 0
##$S_DEV= 0
##$TDeff= 0
##$TDoff= 0
##$TI= <>
##$TILT= no
##$TM1= 0
##$TM2= 0
##$TOPLEV= 0
##$USERP1= <user>
##$USERP2= <user>
##$USERP3= <user>
##$USERP4= <user>
##$USERP5= <user>
##$WDW= 1
##$XDIM= 8192
##$YMAX_p= 0
##$YMIN_p= 0
$$ End of Bruker specific parameters
$$ ---------------------------------
##NTUPLES= NMR FID
##VAR_NAME=  TIME,          FID/REAL,        FID/IMAG
##SYMBOL=    X,             R,               I
##VAR_TYPE=  INDEPENDENT,   DEPENDENT,       DEPENDENT
##VAR_FORM=  AFFN,          ASDF,            ASDF
##VAR_DIM=   8192,          8192,            8192
##UNITS=     SECONDS,       ARBITRARY UNITS, ARBITRARY UNITS
##FACTOR=    0.0002076,     1,               1
##FIRST=     0,             0,               0
##LAST=      1.7004516,     0,               0
##MIN=       0,             -156597,         0
##MAX=       1.7004516,     132664,          0
$$ Real data points
##PAGE= N=1
##DATA TABLE= (X++(R..R)), XYDATA
$$ [...]
1952d01J77K24l55K97K98j92l04L26l9K48l83R0J06k78j7J9M33m37L12l8P6k06
1974d4q1R9j58j29K31M6j42P8K5L98k84j36M12j93k68L29j41m73M84M0l07P3K4
1997a17K51k66p0J11n0L29n3k48K07j06N3j23L21j14j8J07k61k3J46k94L13j20
2019b5J98l72L96j43R3P3k72q1Q4K56j45O7j97l2K49K36j61m78K87K36p31L84
2041g8k60M63j27J7L6M5j23L45j28k56K22j39n1O4l46M11Ll00K46j4o8pm2N1k12
2066b48J59M43m29L26k23J43k51L0L3Q8j31K64k03k17L60k78J73k34Q1ln0J20
2088d7r6J78O3j2r8k47K51K4j08m11N92k58J63l83O31l47L18l60J27j77J49k37
2110b85M54k62K14k06j32L19k48L73j46j09J07j14P8J82l61M58j91k62o3K35l43
$$ y = [-401, -224, 0, -355, -58, 240, 48, -256, 70, 31, 279, -104, -14, 92, -186, -203, -184, 249, -188, 124, 86, 162, -44, -125, -26, -184, -313, -82, -36, -178, -100, -75, 323, 39, -97, 315, 122, -146, 183, 42, -431, 53, 93, -214, -141, -117, 134, -132, -202, -91, -141, 188, 135, -113, 94, -12, 41, -82, 239, 125, 107, 214, -47, -70, 76, -218, 95, -25, 173, -199, 197, 54, 147, 220, -52, -133, -49, 207, 62, 129, -68, -100, 149, 385, 224, -254, 33, 269, -462, -78, -338, 125, -2, 15, 51, 96, -27, 318, 190, -66, 156, 17, -34, 30, -316, 95, 98, -202, 44, 30, -38, -45, -87, -36, -248, -89, 354, -75, 251, 28, 171, -80, -50, -17, 71, -60, 204, 1, -216, 144, -134, 39, -195, -114, -117, -167, -47, -143, 35, 98, 86, -12, -259, -8, 16, -92, -503, 89, -169, -6, -389, 242, -105, 213, -147, -20, -197, -48, -285, 169, -93, 121, -85, -217, 102, -146, 227, 81, -28, 79, -35, 43, 225, -136, 322, 131, -131, -194, 41, -302]
2131c02M80j27R9K66l99J75k0K4k03P3J42q3L8l05K01k56K49P3k81lJ75j38J00
2154b2k02M30l34J7M89j40k93j2K88j20P8m10J60n2J42r9NJ01R6L8r4l4oj53M4
2179h3J30k58J7J06j70J09l1J75J0k3n3r7M4P6p3M07l95K1k11K60P96p88J01l00
2203b30L11Q2l28Q5K4K2n3M06n49L3J45J11J50K91k75j30j36J01M5n4l2p4r4L39
2227A90q1k28K68Kl00k12K11j21L44K2j41J4k13O9q3K26r7K51l16J12K92l03m3
2250a37j18j60M72O3o6Q5k35K19j57j04L58J11m81k6P4j74K42P1k34q0L20po3
2273b7j74P5J50K24l08n9Q2P5j93m6P7J14o5r2R2K42k45k74L92j06l1j00K45M16
2297D64j38j90l90N54o07M40Q1l45N56k73k97M63m77Mq6K86L13j68k02o6J22J72
$$ y = [-302, 178, 51, 150, 416, 17, 192, 172, 196, -7, 66, 208, 125, 163, -142, 59, -197, 52, 125, -156, -159, 16, -122, -22, -224, 206, -128, -111, 378, 238, -55, -67, 221, 101, 179, -231, -71, -123, 19, -80, -75, 26, 122, 160, 66, 32, 26, -127, -83, 47, -211, -194, -88, -258, -149, -180, -5, 5, -18, -71, -168, -124, -48, -121, 286, -109, -88, -299, -39, 757, -31, 70, -230, 81, 163, -165, -80, -56, -34, -87, 319, -230, -197, -52, 59, 209, 500, 225, 95, -41, 60, 105, 51, 19, -55, -149, 190, 109, -119, 149, 151, -149, -361, -150, -271, 73, 95, -46, -32, -245, -176, -259, -33, -130, 121, -195, -83, 209, -94, -137, -255, -415, 57, 120, 54, 139, -96, 123, -34, -138, 220, 331, -150, -176, -102, -276, -34, 37, -197, -277, 43, 36, -27, -201, -126, 24, 248, -60, -119, -37, 38, -155, -201, -124, -10, -75, -167, -75, 167, -78, -352, 40, -66, -97, -197, 48, 464, 326, 136, -254, 300, -307, 133, 214, -131, 425, 152, -145, 318, -159, -155, -241, 45, 358, 190, -12, -78, 44, 216]
2319B16n4q5o21R37k43l34L91k25j42j03K06q9M27m02K84l50N3L64r9n8k37R4
2341g0Q8J53J30k24j40N21m44j0l98O24o26N31j84P3n7L41r0j92j24r2J70j03
2363a23R6k66J61K82j37q6K41j11R7j86n3l84M38P0K61k49j29J48j72K64k61j08
2385b07J11R7j24M2k2L4L03j03j75J97M8k37jJ9J8J64r5L8K4k00j5k7j26K22J54
2410A39l93M09N3l15J15K64n88R3K95Q2k2l05L42l37o5K18K17q3l11K77m70M90
2432A05k05k8K96l74K71O5j1j13J12j76J33K0j09J21OJ10k16K3J10l52J21M4k16
2455b63J51J01k70P26n57L07l36K06q3N0J56k8p9l08M43L0k37j89K91l16J76j01
2477a30L40k37j30L31j0j7K6p8j04K21l75K07j55J48j05j18j99K22M22l59K39
$$ y = [216, 162, 77, -544, 393, 150, -184, 207, -18, -160, -263, -57, -146, 281, -121, 163, -187, -134, 230, 131, 73, -164, -70, 18, 171, 301, 77, -63, 458, 14, 4, -394, 230, -396, 135, -49, 24, -33, 308, 218, 26, -98, -190, -20, -123, -27, -293, -132, 150, 13, -73, 168, 57, 154, -32, -85, -469, -31, 39, 300, 51, -78, 70, -102, 162, -99, -207, -96, 1, -123, -81, -103, -69, 234, 131, -44, 153, 201, -36, -37, -18, 0, 164, 69, 107, 131, -69, -84, -111, -237, -15, 139, -254, 155, 208, -107, 8, 272, -316, -223, 72, 154, 132, -173, 169, -168, -233, -15, 202, 119, -192, 85, -385, 105, -100, -128, 168, -206, 65, 130, 119, 6, 118, -58, 75, 95, -14, 107, 113, 223, 7, 30, 140, -212, -91, -47, -263, -112, -11, -281, 445, -112, 195, -141, 65, -18, 32, 188, 160, 81, -227, 216, 246, 9, -180, 111, -205, -29, -130, 210, -27, -157, 174, 164, 147, 173, 95, -9, 212, -163, 44, -111, 37, -68, -186, -385, -163, 259, -100, 139]
2498A39j69m0K87j45k31J39j11J40L4jJ12l76M79O7p43J28K68j3k2M0K6m39N84
2521A53j18K03r1l10j40K56J60O6k82O4K56j87j00k97J99NK93l44j84K95j2lL04
2544A86m07J95K41n07L75K24k2k59J66P8j42j95j64P2J07j5j16R2R2p2J33k14
2566a52K18k4j12k6o1J10j88L48l3j71j6QN6J37j10N0j77J99K65l70J62l3k45
2589a65J02M4J95pm7m65M89q5p5j20L64o5k37m35K34K84j88J81r4j73L04m24K45
2612a38J88j35L74j97k36K85K31l02K2q8K88J0k22j24R7n3J26k47K60l61K58L71
2634D07l77P1j36j51L69n1J1o0J82Q5j65R0m94J22J55m28M31j16l96N29j58k8
2656a08N2L3J0J8j36K20M9j39j20j86J82M29l89j5K2M9P3O2j64l01J00K08J75
$$ y = [139, -30, -70, 217, 72, -159, -20, -131, 9, 43, 42, 154, -222, 257, 324, -419, -291, -23, -36, -58, -18, 8, -431, 153, 35, 238, 147, -163, -303, -47, 113, 179, -103, -39, 217, 30, -70, -367, -168, -163, 130, -214, -398, -103, -115, -118, 186, -221, -26, 215, -292, 83, 307, 285, 26, 192, 270, 128, -67, -231, -159, -52, -67, -183, -91, 1, -71, 62, -152, 66, 42, -70, -96, -157, -47, -235, 113, 80, -91, -107, -99, -43, 94, -16, 34, -143, 56, 321, -49, 113, 80, -165, -63, -19, 176, 169, 122, -343, 146, 61, -14, -134, 230, 165, -72, -507, -273, 11, -177, 4, -90, -263, 41, -383, -138, 50, -85, 289, 92, -144, 141, 372, 70, 92, 4, 292, 302, 80, -44, 53, 0, 126, -121, 139, -222, 36, 407, 30, 101, -35, -186, 183, 132, 143, 83, 265, 350, 185, 275, -219, -97, 58, -370, 61, -55, -451, 78, -80, -108, -56, -23, -13, 5, -131, 89, 138, -1, -121, -307, -125, 304, -85, -100, -78, -29, 44, 106, -58, -359, -259, -51, 124]
2679A24l80N03l41K13m02K93j83L66J93m86L8j52Q7K45k55K59j82L32k35l55K91
2700b7m3l03L97k30M64j9l74L37q1j66J38R8r6K2l47K39O5j63o9K39r9j44K19
2723E7j25M70k85n3J14l38L47k72L10j48k57M83l46k32L96j28j50K59p7k18L4
2744a59P9J39j10R2j09K32m03L57J5J9j12l5r8j91K36p4K63j12J96k96K06j44
2766iO6J90l74k44M47j05k15K00J15Q6k35J08pk03j45J27J26J97k12J22L7o2l01
2789b91K94k38Q1M18l55n0j9N48j14j22J8j14k38K05K61l84kj15K22kJ58j80J00
2812H1m4Pr8J04j03R4P6m9K65j41j76J32r2Q9k9J12l77L92m46L36j24k74p2K96
2836d1Q9j04J86k57J40k01J66K00l16q9K73O7j58J49J41m26K71Q4n7j05n7p%q2
$$ y = [124, -256, 247, -94, 119, -283, 10, -173, 193, 386, -100, -62, -214, -127, 118, -137, 122, -60, 272, 37, -318, -27, -70, -373, 24, -206, 258, 239, -135, 202, 121, -45, 93, 191, 95, 117, -230, 9, 74, -89, -158, 81, -18, -162, 57, -68, 402, 117, 64, 178, -160, 187, -85, 225, 77, -180, 303, -43, -275, 121, -7, -157, 102, 25, -193, -159, -80, 59, -51, 41, -68, 164, -239, 118, 133, 152, 40, 5, -93, -284, -48, -122, 141, 29, 225, -71, 135, -9, 57, 247, -127, -371, 76, -29, -244, -44, 71, 157, -78, 30, 23, -180, -325, -198, -72, 125, -87, 35, 72, 10, -291, 3, -235, -154, 264, -91, -141, -160, 388, 274, 152, 170, 56, -182, 23, 284, -100, -102, -217, 5, 3, 161, -19, 81, 37, 44, -54, 50, -53, 41, 117, 68, 333, 192, 16, 148, 56, 145, 116, 228, -149, 243, -203, 133, 9, -265, -337, -41, 48, -56, 130, -127, 13, -188, -22, 178, -138, -227, 46, 113, -45, 104, 245, -181, 90, 174, 117, 12, -45, -52, -52, -134]
2860a34Q8k8J23r7j12K98n21K20N4j59M77m94K35N6K21q1K21k58j20j64J40k45
2882b80M15k98L23k18k2K21k92lP1J41j91J23L32k15o0k77J62K81k22K44l59P
2904a17p1r0L69k86k9K20J14j52J94j33L64k84k72r9M65K99l78j60oK64k98k82
2926c68K31J40L8m25L27pR5jJ44k46j67Q5QL65k48J24l7MK81o33m0L91j90M3L85
2951B99l91J75J93k37K16J41l48j16j33J83k58L87r7m91P94j21k67K70Kn8k28
2972h5L86j44j64k19K16j42o8K46K6k91L55q0l25L43L2j68K62j90J2L14o49K20
2994a13L69j75j23Q2J24k83J78J31n35N71j05n1k72L89k23o1J34M17k79j23j54
3015a02J82j38p8o7Q0Q4k48M64k2J79l45L0q5J68k03J69O8k70L73j67J7L1n5j87
$$ y = [-134, -46, -74, 49, -48, -160, 138, -383, -163, -109, -268, 209, -285, -50, 6, 227, 146, 367, 109, -11, -175, -35, -280, 135, -163, 160, -58, -80, 141, -151, -154, -83, 58, -133, -10, 322, 107, 47, -230, -68, 213, -9, 235, -124, -117, -188, -278, 91, -195, -224, -4, 110, -42, 152, 19, 383, 99, -173, -272, 193, 492, 114, -46, -52, 212, -86, -368, -137, 3, 41, -384, -57, -64, 31, 30, 174, -72, -239, -154, -146, 219, -29, 95, 58, 62, 343, -290, -330, 61, -129, -86, 299, -92, 83, 276, 39, 255, 396, 48, -68, -201, -18, -276, 111, 14, -477, 317, 196, -71, 199, 201, 143, -85, 301, 157, -7, -226, -10, -152, -220, 26, 52, -239, 116, 36, -289, 54, 86, -82, 180, -10, 2, 316, -333, -113, 256, 81, -42, 40, 164, -119, 59, 190, -345, 226, 121, 70, -202, 187, -36, -97, 37, 454, 175, 52, -102, 80, -58, -136, -203, -123, -39, -287, 177, 155, 334, -11, 19, -66, 102, -101, 68, 136, -134, 239, 72, 89, 120, 65, -122]
3039a22K95k92L44l78k1M60l07m3J58J76k10k03j19K48jJ1J92j18k52J90L29k97
3061D0k18k6J01J97k46J92n0nj71K51m23L39J97q1J86j8n66L06J33l08J87n0j0
3084d3L82k11l9J11j51N9p0J5k95J75Q9l34M55M8m39R6L50j39l18M90j94J26m09
3107b46L0N06j99k05K66k00N4k47M61m3m68M94m16L90k1p4M9pJ72l55J2K35q2
3130A06Qj62R5j3m5M7K13j16j90K8J06P5k48l36L85j51K26j92K22O4k76L40N4
3153B40l98J65J35j53j34L79o8j26K87j73J11l9j44K2k3j93L69j14j00O4k83J23
3175e3N2p9j29J47j44J05J77j12k28K82jn0NL13j57l40J69K28j99L8K12k53N3
3198C6N3k23p6L11P9j41k83N38J03l26J3q3N9j26L38j01O7j96K28l26J23j41j9
$$ y = [-122, 173, -119, 225, -153, -174, 286, -21, -64, 94, 270, 60, -143, -262, -14, -15, -4, 188, 70, -182, 8, 337, 40, -178, -204, -103, 94, -152, 40, -10, -15, -186, 65, -358, -19, 178, 97, 283, 265, -301, 5, 138, -170, 17, -33, -43, 339, 128, 89, 200, 49, 108, 38, 53, -242, -67, 22, -312, 143, 191, -248, -152, 198, 59, -259, 231, 37, 163, -246, -216, 290, 91, -114, 152, -48, 6, -241, 220, 177, -291, 203, -213, 177, 156, 82, 131, 124, 296, -59, -47, 188, 106, 114, -48, 47, 34, -11, 36, 249, 133, -57, -29, 77, 152, -96, -432, -47, -198, 28, -164, 58, 122, -154, 186, 240, -158, 7, 142, -11, -145, 234, 166, 40, 327, 154, 265, 226, 82, 104, 81, -112, 257, 143, 43, 107, -176, -53, -1, -80, -209, -62, -206, -101, 76, -36, -264, 18, 17, -33, -28, 285, 128, -212, -43, 185, -14, 24, 236, -17, 36, 89, -134, -210, 101, 180, 39, -244, 294, 397, 71, 84, 1, 60, -66, 272, 171, 238, 42, 270, -56, 67, -74, -93]
3221i3n5j94J71K68k9m3mr4N82l10k32j18J87n4K66k35k29J65J56o8k75l2J33
3244a37k51M09j93M18l9l23J96k19L18k09K3k36K12p6L65n80K28J96o3j20j62
3265b43J80J91n8l30j42K21L38J56l24J50L5o9o1L6K02o43L27P8K2j41J86o01
3287d90M06K22j16K93l82N9J70j19J35N0N4q7J17o97J25L43k7o2l14K27r1l00
3309d84L47o5K83l13L54k10K26j12n7r0K99l43k10N33j05j39K21j86q6K7M61p02
3331c51K69K25j97J10L4M5q6j96K18K59Qk53J00j2j52j27pP2K92m87J20J43r0
3354f3J94j25k8q3j86K25L33l12M0J48p0o9J2K80r9o4K42p65R2J53j0R4P0R7%
3379A06o6j0Q6r4l08q7L44J6j85L78m5k77l3L78l33k39L5K39M55m66K07pm63L71
$$ y = [-93, -148, -342, -171, 97, 68, 25, 21, -73, 509, 199, -33, -151, 36, -18, 248, 13, -216, -51, 105, 37, -238, -270, -137, -388, 21, -172, 246, 207, -116, 80, -139, 179, -30, -7, -243, -31, -107, 258, -322, -94, 102, 39, -81, -243, -63, 128, 70, -260, -402, -181, 157, 313, -11, 139, 174, 105, 44, 80, 282, -361, -34, 44, 66, -75, 111, -490, -84, 138, 22, 315, -67, -8, 162, 43, 178, 228, 282, 195, 312, -385, -260, 83, 56, -6, -320, -93, -184, -484, -137, -202, 81, -232, 122, -88, 138, 26, -31, -121, 178, -165, -375, 158, 53, -86, 135, -51, -137, -110, 351, -351, -82, 143, -54, 56, 90, 135, 49, -147, 71, 330, 338, 85, 185, 173, 21, -106, -113, -41, 251, -236, -116, 27, -63, 131, 6, -22, -105, -291, -66, 267, -45, -5, 143, 73, 4, 16, 296, 197, 133, 375, -390, -298, -145, -155, -61, 9, 106, 106, 40, 30, 116, 22, -286, -373, -29, -13, -198, 180, 135, -142, -175, 203, -130, -369, -334, -95, 360, -106, 101, 94, -369, 2]
3403BP4k34K49j66K9J66k55R9n7J33l11L27J44k24J65L2j56K84n72M00j86J59
3425A02k5j33q3J37J77l28r9J44k00K78L05k03Qj73q4L45p9k93K23j05M7J52K7
3448A40q0mk79K77j0J3l1K05m23P1N7J57K0o1P4k43K48p5Mj49M4l63K04J17P6
3473a1j34J07L44k68j5r0O5J06m08K91j21K86j58r2K14k8jr5l07J61M12j87Q4
3496A55m86L69j17K41j05j5L7l43J59k7K55P6k08K77k08l16J7L05r8pP0k40J83
3519b6L31l47P9K58NN6o67N39j06l98k2L17M6O3m5J39n13L96l33N7K36j40O3l03
3543c15O15m26k1n1l3K51j44J30J54k28L73Lj67l41J28K55l50K10K00m13L14k96
3565a52r0L44k78O6J52q3j79K91j21j81O76l63nj0k74kK78j12N12p34J90K75m45
$$ y = [2, 76, -158, 91, -75, -46, 120, -135, -36, -93, 40, -271, 56, 200, -24, 141, 173, 17, 301, -271, 129, -57, 102, 77, -56, -139, -2, 175, -153, -252, -108, -308, -30, 275, 72, 80, -93, -177, 168, 89, -204, 19, -86, -39, 113, 140, 60, 56, -223, 54, 44, 57, 26, 231, -192, -121, -64, 93, 113, 52, 126, -117, 131, 56, 60, -89, -45, -408, -204, -87, -11, -145, -38, 306, 38, 23, -67, -2, 104, -304, -13, -134, 152, -6, -98, 116, 88, 87, -8, -315, -154, 258, 71, 155, -331, 38, -79, 162, 57, 42, 79, -264, -105, -132, 123, 199, -9, 268, 60, -256, -239, 66, -32, -39, 31, -209, -26, 305, -42, 37, 295, 300, 356, -311, 228, 122, -276, -298, 19, 65, 128, 83, 222, -291, 105, -228, -171, 65, -75, -12, -315, 300, -126, -147, -198, -231, 20, -124, 6, 160, -68, 305, 308, 141, -200, -72, 183, -167, 43, 243, -170, 144, -152, -242, 102, -176, -110, 42, -41, -220, 71, -50, -231, 445, 82, 77, 67, -207, -209, 69, -43, 469, -265, -75, 200, -245]
3588b45P8L06l2j68LK5J9O4O6l22M25J84p01j87O30m0l9j39J0K13j26k55K14K33
3612B16N9j21k75J16J46l73l7N73k86L19k23k0M0j41J83m05L22j63r2L68k92l3
3634a19o1L48j80j3J60k22K7n02P70m79L51j4l3j57n4K74o1j92K02J92j87J49
3656A99k43l09M16J14j49J46o8l72J67Oj5J42Q3k82K02l66M13jo5K32j80M8O3
3679A81M1n2j35j04m2K75k67R5R6m36M30O7k28R0j75K56j61p2K73k58J20j07n0
3702a63K42M9m39J68L19l51MK19l74K63l6j0J23q9J49j12K23K8k88L01n79M35
3724H2J1L8j00J31p5k13J57qLk36K03j0j83K86j18J0l19M38j13J72k84m33M75
3747h6J72K47l56L5K45pp65O93o35M29j97j12L18P8j76J09J40k96K22l84M05j61
$$ y = [-245, -167, 139, 107, -61, -58, -33, -14, 50, 116, -206, 219, 403, -298, -485, 145, 105, 66, -73, -63, 150, 24, -231, -17, 216, 275, 154, -121, -5, 141, -232, -269, 304, 18, 337, 114, 94, 134, -7, 176, -229, 93, -70, -162, 206, -86, -119, -180, 168, -12, -25, 135, -87, -60, -562, 208, -271, 80, 66, 33, -124, -178, 96, 35, -157, 45, 237, 50, 199, -44, -353, 63, 177, 28, 174, 106, -266, -99, -93, -108, 34, 117, -165, 37, -329, 84, 83, 18, 250, 70, 118, 181, 222, 170, 35, -69, -111, 164, -103, -8, 88, -348, 82, 149, -79, 11, -164, 92, -69, -141, 132, -126, -6, -113, -163, 79, 128, -311, -143, 176, -175, -171, 48, -326, -63, -99, -109, 14, -75, 74, -38, 185, 213, -75, 226, -353, 82, 93, 131, 31, 162, 87, -126, 31, 23, 26, -210, -7, -17, -200, 86, -32, -22, -341, 97, -16, 156, -128, -561, -86, 86, 333, -23, 12, 257, 250, -515, 178, -457, -28, -225, -337, -19, 59, -117, -8, 132, -164, 58, -326, 79, -82]
3769h2J55l17L15j80j73M91k74R1l39P4K55o3j80N23l31K04l21R3J85j68J16L7
3791A11k7K41k37j36l21M67O5l03K81q0L94p18L96Nj77K9M7l08R8L09l7n9J52
3814A92j99J9R8N9j65k28K14l41M74qm30K83rJ61l04K8jK16j77J28J24k11J34
3837E7K77K3k93J56j1l69K91k72J23L37l18K3l85M44j90K07j62n9J65O0l28K32
3859Hj5r9L60M5l93k13J09J78k9R6j11N1Q4p1m8J77l85L48l88RJ42M32m18J71
3883D0J31p3k68K47j26k8J5k3L32k52k06k8K44J65k87j04M92q8j17OJ43m03N21
3906C33k54J78n45J57J15R4J80j16k38j41K47Q4p5K7l83K39j4J8K02K69l85kn8
3929f8J27k44L38m21J74j75K05K44k61M5o0j5P1j47L21k23J15k4K22m5j1j11j94
$$ y = [-82, 73, -244, 71, -109, -282, 209, -65, 26, -313, -239, 16, -47, -227, 296, -35, 169, -152, -59, 126, -42, 74, 111, 84, 325, 88, -48, -369, 98, 163, -140, 141, 61, 455, -263, 133, 138, -39, -10, 37, -271, -173, 136, 99, 40, 192, -7, 12, 110, 169, 4, -224, -10, -351, 123, 115, -315, -32, -41, 120, -184, -156, -157, 59, -118, 10, 134, -77, 57, 334, 357, 64, 220, 209, -160, 131, -141, -18, 319, 1, 24, -361, 83, -107, 100, -62, -121, 44, 104, -224, 8, -7, -106, 254, 299, -94, -307, -198, -20, -49, 47, -64, -13, 71, 0, -48, 129, -256, 92, -296, -287, -145, 287, -131, 40, 171, 98, -170, 77, -49, -77, -62, -85, 247, -5, -211, -239, 5, 170, -117, -221, 271, 183, 66, 72, 215, -188, 333, 79, 257, -288, -131, -16, 78, 258, 142, -96, -237, 10, 94, 19, 46, -337, -98, -112, -94, 108, 377, -8, -10, -68, 59, -185, 153, -268, -94, -269, -64, 180, -81, -36, -96, -111, -40, -187, 134, -89, 26, 2, 224, 179, 168, 57, -137]
3952a37q6J67Q7K77m49J48P9k10K14m11L48j03K19m66L83l3J28l92N34l90p1M91
3974C27m28K3L49k29j81K18J18l79m6Q8J40J05k26K00l15K31L5j90j5K05k83M54
3996B01k08O4K0O2l88L01j47N19j98l01k65O84m21rk4K10J59r9k17K84l34j15
4018b22MK1J35J10k95L33j84J40J85l11K01k72J29J02J97j67J22j59P3j44N8k64
4040b08m9L14o9j28j67L11J31k62J32K41j13l01P8K2r8K66j55L4j28j58L57J20
4062A70k2n54K71N93l55P4j35J15J2R5n32L19N5j82K06J80n56J62J83j59M12n75
4084b23K95r2q9J01n7QK68j31n49O46k99j48N34j09j56m2j80L27j92L63l42j4
4106h1j9J33L83l66J98M3l81M65p7r6k78p8K50p7P8J77j18j1k0k82K24q2j77K72
$$ y = [-137, -223, -56, 31, 308, -141, 7, 86, -124, 90, -321, 27, -76, 143, -323, 60, 27, 155, -237, 297, -93, -164, 327, -101, -78, 271, 42, -139, 79, 197, -182, -228, -140, 0, 105, -121, 79, -236, -5, 30, -160, -175, 30, -253, 201, -7, 57, 77, 139, -249, 52, -95, 424, 226, -75, -340, 344, -77, -86, -110, 100, 259, 160, -57, 227, -107, -222, -218, -197, -62, 48, -247, 86, -98, 42, 227, -84, 117, -155, -26, 76, 273, 106, 228, 69, 142, -2, 56, -208, -257, 57, -12, -140, -307, 4, 135, -127, 5, 246, 133, -168, -90, -68, -166, 100, -55, -21, -149, -307, 50, 170, 148, -406, -135, 458, 103, 177, 42, 157, 169, 264, -268, 51, 106, -76, 130, 310, -246, -84, 99, -60, 352, -223, 72, -20, -109, -8, -65, -57, 211, 80, -469, 177, -122, -270, 264, 155, -1, -43, -223, 104, -88, 275, -67, -81, -100, 33, 416, 50, 248, 291, -90, 375, 298, 202, -76, -154, 96, 19, 97, 274, 156, 145, 125, -157, 67, -15, -192, 80]
4130H0j36j11J61j83N49k60O8j41j57L22k63O9J05O6n00M03n4Jm6j57K30j00j87
4153b41J77M2Ok7j58K94j17P1K3k12J6J76j42L69k36m9J7q9J23q3p9K0K1K21q8
4178E5j70j37K35o6Q2j6J45M4k75K15j87J09l46M50j1l37J66L05k60j89J98K45
4200B55k48Q6Jj19K65k25K26j91o8J77l90J43K1J01L1o0j71R8J16k05j39M56k02
4223d2Nl0K43J1k66l14M69L36k88jm31K95k2J19l18K32k07J14N1J87m3k63M88
4246C25p11L95M4p3p4l4K6q1q6K55P4J87j00k73O9R8M1j97j17J37K84j07J12J2
4270B06m97K13K03k51k2O4Q2K4j44J31ok65M02j52J26r1J28l1j34k9N5j66K20
4293F6j47K08J54j34k32k0Q1j30K74k04J10j78J37j26R1J42N6k58R6k17K64j37
$$ y = [80, -56, -167, -6, -189, 360, 100, 168, 27, -130, 192, -71, -2, 103, 169, -331, 72, 18, 19, -27, -184, 46, -54, -241, -64, -22, -16, -43, -201, 93, -24, 47, 70, -142, -126, 50, -92, 277, 41, -8, 9, -80, 43, -40, -119, -99, -78, 143, 55, -115, -252, -17, -83, -1, -17, 128, 172, -103, 112, -75, 34, -312, 138, 127, -210, -44, 261, 1, -188, 10, 255, 7, 93, 94, -25, 240, 15, 241, 50, -18, 159, -231, -88, -67, 34, 65, 5, -166, -68, 48, -157, -296, 160, -42, -37, -67, 176, 187, -79, -393, 76, 412, 124, 123, -308, -13, -35, 84, -234, -2, -209, -95, -44, 143, 100, -163, 325, -386, 9, 53, -20, -94, -128, -102, -183, -269, -14, 60, 247, 147, -126, -57, 41, 82, -115, -232, -95, 189, 82, 194, 206, -291, -78, 125, -126, -148, -84, -2, 22, -122, 9, 3, -262, 140, -12, 114, 23, 151, 120, -14, -43, 12, -154, 66, -81, 127, 281, 147, -85, -105, -24, -154, 120, -84, 26, -152, -15, -141, -50, 92, 148, -110, -14, -231, 33, -104]
4315a04J28j2l2o7N8K23l74N76k78Nj13M4J75k37R1j7n42P29m5l16k5L04p3k7
4339G1J23j90K84j86l72j03O14j37J16j33j25L8K91k03J67j55m44N45j72J5k9
4360A5K25l00J36q1P9N5j52J24k5K04k25k90J45P8j6l26J78N34k17k73J92k91
4382b31K55J59l26MJ69J44l46l26P17m73K95j51L03k41L41j89J41k48q6j15K71
4403F7P0J82n64N14J23m67K33j90Q2k85L24l63J67KJ71m91Q7K17J42n7J23j90
4425a03R3L30n07M85k35J36K7k26j62J9p0K42L2k52N62k64m6l04L07j79R5m0J26
4448F6pj79K49j95%j5P4k55L33L21n30j96L27Q8p5O0k11p3L58k0m3k29L10J60
4472C18m89M39l97K33M5j19K66k0k45j74J10J95l64J82K88l86J16j19K4M52j89
$$ y = [-104, 24, 12, -20, -87, -29, 194, -180, 396, 118, 123, 10, 54, 229, -8, 83, 66, -476, 253, 208, -108, -133, 171, 98, 71, 194, 4, 288, 102, -270, -373, 241, 104, 220, 87, -38, 0, 291, 88, 255, 100, -344, 201, 29, 44, 15, 240, -60, 76, -5, 74, 129, -23, 101, 76, 280, 55, -235, -90, -12, -28, -354, -176, 358, 141, -132, 60, -231, 24, 183, -143, -139, 30, 174, -172, -498, 219, -254, 41, -110, 193, -48, 293, 104, 245, -3, -89, -204, 67, 137, 319, -245, 269, 392, -75, 158, -32, 50, -235, 89, -274, -107, -105, 66, -425, -338, -121, 21, -36, 87, -103, -10, 320, -187, 298, 63, 199, 226, 0, -162, -143, -213, 29, 61, -191, 371, 107, 61, -243, 64, -115, -20, -60, 66, 59, -120, 129, -66, -66, -81, -7, -262, 71, 392, -138, -334, -7, 81, 6, 66, -145, -218, 140, 120, 77, -152, 158, 318, -171, 268, -129, 104, 149, 30, 296, 276, 31, -143, -33, 162, -202, -20, 268, -118, -2, -121, -97, 355, 166]
4493A66j3k49J4j21M1L93j60j19J44k04L00k70m4j9J26j40L71m5p1J43j79j92
4515a28k01O97k74L9k10j28J36j65J7M73J06m02L63m76K91j21J0r5J51J77l38
4536g8K90l68L05k48K90j82O4J76m00O0j91N81j92m33O60l33Q3Q1m2j0j18j5m
4559b4m9J21K50l37J23r5K85j92m41M11l35K67N3j03J27PK21j84O6k51J78k20
4581a22K32J59l67L00j95J33m55L87j90J53j88J71P0N6j42J50k58L36l06oK9k58
4603c11L69j22k88L45l93M59l0J22j1K2P6j46n7Lj88K74l06J34M9j23m0K14j23
4626g1r7R5M6J43m00L48l13J04J5m0J54r1K90k21j99o5J06M69j94j95K94m48K53
4649a7p3k69L46J12m4r6j63P1J87J68J04k56j90J12NJ77K8k60L8j23O8J4J69l67
$$ y = [166, 153, -96, -82, -203, -162, 231, 71, -48, 96, -108, 192, -78, -122, -141, -15, -155, 216, 171, 100, 243, 64, -128, -329, 368, 94, 133, -77, -205, -69, -234, -217, 256, 362, -40, 323, -153, 138, 17, 27, -68, 83, 260, -78, 212, -156, 149, -99, 191, 9, 73, 249, -151, -91, -282, 299, 107, -326, 334, 1, 84, 165, 123, 113, -5, -20, -24, -73, 48, 298, -39, 84, -11, 274, 82, -359, 52, -283, -16, 37, -66, 61, 68, 289, 105, 171, -80, 98, -122, 110, 269, -98, 202, 7, 140, -315, 72, -118, 35, -153, 18, 88, 144, 2, 152, -106, 230, -76, -82, -53, -311, 58, -64, -352, -7, -400, 59, 29, 151, 140, 162, 238, 92, 35, 38, -150, 124, -182, -48, 1, -122, -162, 52, -71, -168, -73, -27, 116, -284, 64, -249, -145, -130, -170, -16, -107, 183, -38, -237, -302, -196, 273, 79, -116, 178, -270, -17, -90, -359, -13, 99, 55, -41, -204, -133, 54, 222, 326, 70, -120, -8, -3, 174, 202, -58, -20, -143, -75, -61, 108, -259]
4673b59J74O26n14J1NP9p2k80L47k57M16n23L07Pj42K63k01l0o2j09Q1n0L7K51
4697A05l35N94l45n0K38o6j54K45k72l49K24Q3J27L27m11n6J34j83M14k85J42
4718A27l43K74k29J20j63J13l4K12l3l21M83k10m1J66l9J11j51j46l1K61J8l4
4740A10m02K49K46j97K57k40J22l6j10k5L4o2J52J4r9L6N43n59n5N0k18j66K27
4763a29K90l1j00J89J65l81l25J13K34p2n0l01K97P7O7Q0k70j82N27l12L2K45
4785A63k35m6P1J69pl65L18K2q7j0n5k2m6qL22k14M37k71m5j52Q7J76j06j06K
4810hk06J91J78n0l7j93K96m82J36J08J89l1nj63J24j25J72r7K9M9R6l08pJ29
4834a5n1j31M3QJ39K48l30J1K51k95J78k92J20n9L16j25P8k38j27M03n60L62M7
$$ y = [-259, -85, 541, 27, 38, 43, 122, 50, -230, 117, -140, 276, -247, 60, 67, -75, 188, -13, -43, -105, -214, -133, -183, -146, 105, -230, 364, 19, -31, 207, 141, -13, 232, -40, -389, -165, -82, 45, 372, -39, -95, 39, -144, 270, -15, 127, -216, 58, -171, -51, -214, -101, -135, 77, 44, -277, 206, -4, -45, 121, 82, 193, 42, -104, -135, 126, 144, 110, -292, -43, 203, 6, 263, 23, 145, 109, -1, -26, 8, -54, 98, 112, 13, 49, 592, 33, -22, 28, -190, -356, -129, 161, 130, 30, 219, 384, 3, -322, -209, 25, -47, -97, -398, -101, -24, 43, 123, -147, -329, 198, -114, -82, 163, -72, -118, -47, 122, 115, -250, 68, 90, 3, -7, -62, -84, -130, -138, 184, -30, 407, 136, 91, -61, 26, 202, 96, -10, -8, -214, -23, 155, 105, 68, -125, 171, -311, -175, -67, 122, 91, 86, -77, 47, -78, 94, -3, 26, 75, 171, -137, -144, -15, -66, -197, -154, -146, -7, 241, -89, -78, 173, -122, 56, -236, -116, -175, 141, 16, 94, -144, -271, 132, -428, -66, -19]
4857a9k26K12j76M8J92J78k20k32J51M00k11N2r0j4o7K8oj25M3J89K40K8l47K3
4881E1l7O1m8J80Kn67N45l2k22K46N0k40J48N7k30J35j04j00K13q2j74L15J99
4904C66l75J26j41M4J21p0Rp6K50m40M45k55r9m6L31k57j3k0M4J98m7k42L21L5
4928B09k31J85n44L56N7l1J77k00M46r6k79k20J60k10M63j26k73M58n55m3o1O27
4950B69l2j84N8k79M22m59J79k11M97j21K0j18k8J9J48k28j27K60j99j03K77q3
4972b3j16J43J84l60J10J3n2J48j6p2J31NJ04j06J25P2l60r9J7K6K26J37L1q7
4996A81q7l66L37k94r1L12J44j75k5j33J49J43Nj2J86j87k22M02j05l35o1O20
5018C86m67K2n3K20j66K6j84J70N3q6j2l2RK35l31L11no35M91k36L6J70k65M05
$$ y = [-19, -245, -33, -209, -161, 31, 209, -11, -243, -92, 308, 97, 149, 59, 45, -22, 6, 0, -125, -82, 107, 347, 375, 28, 51, 14, 75, 27, 207, 209, -358, 187, 155, -67, 179, 229, -11, 137, 194, -36, 99, -5, -105, 108, 26, -148, 167, 366, -9, 117, -24, 20, 141, 71, 80, 4, 254, -186, 259, 4, -95, -141, 190, -67, -80, -100, -56, 142, 95, -147, 174, 209, -22, 163, -381, -25, 32, 1, 178, -22, 424, 328, 49, -171, -11, -221, 242, 116, -157, 301, -254, -297, -358, 269, 237, 53, 111, -168, 254, -205, -26, -237, 260, 139, 159, 41, 13, 32, 180, -48, -175, 85, -114, -217, 60, -23, -139, 4, 188, -172, -62, -49, -101, 47, 31, -41, 90, 95, 199, 93, 218, 290, -70, -169, -152, -126, 100, 237, 268, 181, 94, -272, 65, -229, -320, -8, 136, -39, -64, -197, -48, 95, 100, 88, 274, 87, -135, 267, 162, -173, -234, 386, -81, -59, -112, 108, -58, -32, -216, -46, 7, -79, -91, -123, -114, 121, -210, 101, 96, -539, -48, -284, -248, -78, -343, 62]
5042F2j08m03M19k20M63k09k14J48l08K89K64j57J53j05mj56k7O7N9J52j77K8
5064A6J22n38L44M19l25j57K5R5M0m8rr2jJ64k16J66J09l27j38L27kJ42l07O8
5088a23J09j61M21n53K44L26m46K21j57Ko0L73k72M31n43p6N10r5L5k52L13l74
5110a27l1l02L62l3J15N1k38L69j77k19K60Q8l60L70j56q9P88p68k00L59J12m0
5132A34l22jK38k25K67J08k42l6j58L25l33k5K54%jj42J15M0j52J89L68o36O1
5155a74N6K83m0jp9j54K52j33O5K58k70n4j85N4R1R8r8r0P8J20P6Oj19O2k33L61
5181B30k34N0k01K43L0k08JJ28j56k8q8N1M16k82oj68N0J77Q2k3J19O8j08k43
5205a00J85J84j57M0q4j77L54l09j60K57l57L34R1qj9j5l5J39l5k59n3L97k80
$$ y = [62, -46, -449, -30, -250, 213, 4, -210, -62, -370, -81, 183, 26, 179, 74, 70, -86, -113, -46, 13, 165, -12, 16, 138, -400, -56, 363, 38, -119, -94, 1, 41, -7, -16, -108, -109, 55, -161, 5, 114, -213, -351, -24, -26, 116, -191, -123, -14, -175, 246, -307, -63, 263, -183, 38, -119, -117, -177, 196, -76, 355, -188, -264, 246, 151, 186, -66, 247, -127, -158, -460, -98, -131, -16, 35, -203, 166, -11, -230, 30, 118, -242, 128, -28, -117, 671, -97, -297, 62, 174, 134, -188, -189, 49, -176, 91, 199, -43, -79, -237, 88, -245, -270, -16, -16, -17, -159, -44, -4, -156, 33, 401, -235, -174, -118, 165, 125, 124, 45, -109, 143, 10, 75, 333, 63, 9, -176, -122, -31, 67, -31, -121, -43, 77, 153, 159, 40, 102, -131, 230, -4, 46, -155, 88, 118, -90, -89, 39, -117, -145, -233, -182, 234, -48, -54, -222, -172, 5, 87, 64, 183, 251, 143, -100, 85, 269, 112, 152, 68, -109, 245, -64, -224, 33, -324, 10, 101, 93, 74, 59, 24, 163, 128, -131, -184, 213, -67]
5228f7J02l24J98K69j85M5n1j24M2RJ88o6K26l16J33J41m49K46J20o2k98K12K72
5251B61k12m42L71J22l77K50j22J35j02j54K68N7J17j28j14K27q4j52l40J75J41
5272a03K5J83j25j16L40r8k32J72j75K29l34r2O15k68j00R0o1M00j39m51L86j16
5294C0m67J10L53k61L87j05R5k56K64j05m9j80R8K79J31l52Q1j87L23l14q6J81
5316c0m49M90r8j57L34j56l3J89j91K06j32N6J65J42k52j49R9J86l25N6K28j20
5338E9J23m74M83p9O2j86k59M24j70o4J13k29L16Q4k59k11K39K1k31M24l39L41
5360A88l41J18r9J38J09j35M7J84j37j54K10k20N8J53k65m6jL12j88j80J80K2
5382d7j61J67J91L0j21QK11l44K37k07J7k0K0J8K09p5k71K61J64R2n67K11J11
$$ y = [-67, 35, -289, -91, 178, -7, 38, -13, -137, -95, -86, 102, 36, 262, -54, 79, 220, -229, 17, 137, 75, -223, -11, 261, 49, -393, -22, 100, -277, -27, -149, -14, -116, -270, -2, 55, 172, 44, -70, 157, 73, -79, -419, -244, -103, -78, 105, -20, -136, 204, 106, -126, 46, -129, 100, -234, -326, 289, 21, -79, 11, -50, 350, 211, -240, 146, 30, -437, -327, 26, -235, 152, 47, 142, -114, 150, 45, -4, -184, -86, 193, 324, -28, 53, -134, 189, -125, -211, -30, -479, 11, -87, -244, 90, -66, -99, 90, -101, 105, -27, 29, 194, 336, 84, -65, 34, 220, -105, -49, 179, 59, 182, -292, 191, 112, 174, -12, -271, 153, -17, -81, 32, -197, 119, 203, -56, -267, -28, -7, -238, 186, -153, 188, -153, -35, -134, 4, 113, -22, 25, 209, 72, -82, 128, -92, -34, 119, -146, -192, -193, 119, -69, -249, -69, -47, -208, -41, 150, 180, 59, 67, 278, -66, 171, -36, -19, -39, -19, -1, 208, 133, -138, 123, 287, 379, -188, 23, 134]
5405A34k85J71m4j98M93m67M1N3J1j45N02j67k08j2L1J66j84K24j40K38K1m23
5427a88J37K32k1l29R0M59l66P1k38N05m37l9J2K23oj23m0K19j28l41L27j93l8
5450b12l5K26N2k3l18M70k69J62l93J89J51J00l19j47J46J50j07p0K75n4j34P9
5472h1R8l5K51m44J28j69M65k88J32J32l73O4K88k29l3r7M80o04M36j32J39L3
5494A61j04k49J7J09j42N0j45J75K14o0k79R2K71k42O2q5J15O1Ko7J73k05k45
5517c21J92K67j50L13j70k05K8KJ48j43Q8j74K86r8k67j74K77J64l88L70j33L07
5539B19l77J12R7%J36l13J81l1k53r7K6K54J59J13q7j0j10J12mj05k1Q8J62l59
5563a08j5J8L61ll53K17j21p1L29m44K07J08j1l08K41k35O4J88J22k16M6jL00
$$ y = [134, -151, 20, -24, -222, 271, -196, -155, -102, -91, -236, 266, 99, -109, -121, -90, 76, -108, 116, -24, 214, 235, -188, -51, 181, 160, -169, -79, 380, 14, 85, -153, 352, -85, -124, -112, 111, 105, -18, -58, 161, 33, -308, 19, -174, -212, -247, -21, 31, 8, -310, 160, -109, 53, -340, -151, 0, 100, -219, -366, -220, -70, -177, -247, 28, -26, -160, -81, 17, -18, 233, -211, -83, -252, 213, -75, 57, 189, -184, -120, 168, -61, -94, -191, 289, -315, 121, -11, 128, 161, 57, -192, -175, -66, -208, -158, -303, -128, 86, 26, -253, -161, 110, -132, -70, -155, -40, 21, 23, -44, 129, -76, -321, -129, 138, -12, 301, 131, -74, -46, -44, 104, -39, 49, -125, 161, 63, -204, -378, -101, 63, -325, 45, -88, 219, -158, -46, 51, 51, 187, -126, 55, 24, -229, -326, -300, -46, 113, 226, 139, 129, 19, 131, 127, 22, 1, 89, 251, -108, -123, -105, 256, 253, -100, 117, -4, -75, 254, -190, 17, 125, 114, -194, 47, -188, -124, 64, 186, -30, 16, 15, 315]
5586C15l99L53ok99J41j58j76K26k46J89N13p75M96l05K28n3J03K23m88L35m46
5607b29J64P8j23n0R7J32p3J30j15k42r4M32j4K40n27J43K66k44j7k99L45j21
5629a21R6K39n5n32L72k3k03J22k43K73K6k29K91M3O7k69L39j02l71J92K21j63
5651c0Q7K1J26k48K64l11K5J31l1J35m51J63M70m09M6P7K50k56j63k71J46N01
5673B72o63L71m3J74k14L01p9k77J94k08J34j53J81J11J0j28J29j35K8k17J44
5694f8J16J44jk8j87m5K90k4P1j09k9j78j10O1j30J09J1K76l7j58L13k45j2L11
5718C41l09k48k6J60r2m2J20R5J63Pj01J1K30l55l6K42R4m1l38L21j32r2p5M1
5742f2O6o0m0k46J54K80k44j19L83m25K96m3J07Q2k8j07m7R0k8j19M1K22p0L6
$$ y = [315, -84, 269, 263, -36, 105, -53, -229, -3, -249, -60, 453, -322, 174, -131, 97, 44, 147, 370, -118, 217, -229, -65, 13, -110, -160, -63, 69, -4, 126, 11, -231, -325, 107, 93, 333, -194, -51, 215, -29, -46, -345, 0, -121, -25, 214, 159, -373, -1, -24, -227, -105, -348, -75, -49, -278, 13, 56, 123, -146, 193, 91, -280, -88, 133, -30, 57, 78, 204, -44, 220, -91, -66, 65, 34, 169, -282, -119, 351, -58, -12, 65, 315, 59, -104, -375, -229, 272, -391, -20, -63, 111, -103, 198, 119, -158, 36, -172, -38, -191, -10, 101, 111, -17, 112, -23, 5, -212, -68, 48, 192, 191, 163, -24, -69, 221, 197, 268, 159, 130, -48, -158, -97, -227, -118, -107, 169, 132, -26, 287, 42, 30, 341, 32, -216, -242, -82, -174, -216, -96, -1, 162, 169, 68, 79, 309, -46, -82, 160, 254, 213, -125, 196, 64, -28, -103, -62, 4, -56, -96, -342, -188, 92, -152, -271, 112, -313, -17, -60, 47, 129, 101, -6, -53, 37, 9, -110, -69, 153, 83, 119]
5766A19l8m14N00l75K15J48l46M11L4j98j22J4J5N6k7M9J60j98l3L67m90k8J49
5789c2K09j75l1J14j29k26O25l75Q4r6PJ4l7n6L46k33k5K15L6j46J1j26l42N69
5813B01p1j48K6R2k89o0JM51k41K79p9Mk75K91K07o26M33k29K75j98k64J20L32
5836B32p8k10j61N44m45J87N1j49P3j07R9N5K00n9l27j01M8L48P1l44K2J05j44
5859i0J63k1J13l18L41j84p1p5J98m01j5K84K39j88J8n6J36O7o8l76L09m1j00
5882a36J80l83N63m51K49j2j53lL58j50P4m5M6k81K54l37K84J47q5k1K8K2k05
5905e7O0J40l80j19K14J52o2P5m0kj38J84l5K7J36k20K01j13j69lO1n3K47N8j97
5930c3j7J6Q4m2j86K82P3r6J67l02J82J51m84L31l38L14o4K4J3l6k62K54n0n0
$$ y = [119, 81, -333, 167, -208, 7, 155, -191, 220, 254, 56, -66, -52, -37, 19, -8, 41, 201, 3, -30, 337, -153, -181, -32, 177, 2, -29, 85, -44, -270, 355, -20, 64, -32, -25, -11, -48, -104, 242, 9, -16, 199, 235, 89, 100, -26, -368, 201, 130, -18, 8, 100, -189, -249, -248, 203, -38, 241, 162, 166, -109, 182, 389, -237, 196, -33, 242, 44, -220, -100, 232, 154, -56, -217, 327, -118, 69, 120, -29, 44, -63, 36, 91, 291, 232, -95, -196, -148, 200, 271, -73, -51, 54, -90, 73, 52, 165, -153, 188, 4, -67, -142, 56, -345, -360, -76, 163, -25, -7, -63, 73, 140, 72, -304, 5, -36, -136, 44, -339, 224, -227, 22, 10, -143, -146, 212, 62, 136, 91, 137, -144, 110, -227, 57, 204, 119, 98, 126, 148, -57, 3, 143, -237, -356, -142, 10, -52, 23, -17, -19, -157, 27, -8, 19, 155, -65, 136, 23, -146, -149, -88, -141, 106, 164, -33, -50, -34, 50, 8, -178, 104, 177, 81, 248, -54, 128, 279, -205, 126, -212, 102, 38, 62, 75, 39, -223, 31, -19, -69]
5954f9J48K95k76nk99K70J6j6R5j28j41L53k04J56k4l41L1j39L82j23l19K99K51
5977B12j71N0O7n12K72j6m6j18J83j59J44L38n8n31M54J31N4k37J8j67J48L6k39
6000a47L06k0j71M33l06k8k50J70p2k74L16K41Rq8r5r3k15J89M46l14r4J34m1
6023C6l21L63m6J43o3j96K25Q3k18M28n15J70J6o2J64m40K18K05R0j87J70k75
6045a2k98L3K30J48l47L95L9m64M42Q2l69L53J45k59k3j77n7K15R7k88k16K85
6067d6J92l56L30k30Nl1r8K11J47j48M4J12l41k25L46N8K99n98P40m76J81k56
6089a40r5O39k85p9M5k03K57j08j76L7j45K66q1J4j11K89J08l6k29K42o1j72J04
6112H0q5K14l89L14n7Q7m2j02O1K44k69j2L92l22j71p9L46l49rK17n53L58J13
$$ y = [-69, 79, 374, 98, 93, -206, 64, 80, 64, 159, 31, -110, 243, 39, 195, 171, -170, -139, -278, 104, -19, -338, -39, 212, 41, 91, 158, -354, -82, -98, -144, -262, -79, -238, -94, 244, 186, -345, 109, 240, 294, 57, 75, -92, 56, 92, -147, 159, 139, -32, 401, 95, 67, -183, -13, -85, -359, -43, 198, 207, 119, 24, -69, -284, -95, 351, 37, -57, 77, 36, -285, 78, 32, 175, 112, -84, 141, 224, 6, 434, -81, 89, 105, 43, 207, -233, -15, 190, 280, 93, 263, -12, -310, -277, -47, 101, -246, 149, 188, -276, 166, 248, -121, 232, 377, 118, 95, -82, -139, 76, 173, -115, -331, -46, 146, -210, 120, -110, -105, -136, -234, -23, 124, -24, 20, 132, -209, -434, -88, -30, 269, -329, 411, -65, 116, -140, -235, 404, 119, 40, 85, -118, 139, 31, -145, -108, -253, 13, -68, -54, -165, 124, 232, 196, -33, 209, 148, -24, 80, -5, 209, -180, 134, 77, 164, 122, 20, 81, 325, 56, 44, 436, 114, -57, -136, 210, -139, -148, 69, -484, -126, -13]
6135a3K53k96l5l15M36p5j39k16M26K91m12M30k85P3j15k00m2K03j67M05j44Q1
6157A44k75k07j9K16P9R2Q7o7j16j10j39K29J01J14m7J50r2k06l7L41n30K21K87
6180B16j84j88p4L6K97k48K34L33l33k50J46K36n90O37p2l4J36l29n1Nk34L91
6202H0o0J84j71j66k41M54j59L22j94j50K38p1R9k52J74j96rL41k90J44j87Q0
6224c0M2K8J72j06k75R6J56k71L59M6k46j1K85l81L1j14L91o5j82L24l65J19k66
6247b63N20N9n20k3L11j15j50J27J70l25m1O1ML04j17L23l14mJ20K7q2Qm5J7M8
6272A00k92j02N07p3k40M6J95k22J71k0P1j2k14j35L78J9O4k73r7k02K68M3K61
6295B41m63O7K37m9N3K64n58nM8j2K94J20k22K74k81j03K39j22J79k34l31L09
$$ y = [-13, 240, -56, -91, -406, 30, -45, -184, -400, 26, 317, -95, 335, 50, 123, 8, -192, -234, -31, -198, 207, 63, 144, -131, -338, -357, -141, -62, 30, 117, 50, -66, -176, -315, -86, 15, 129, 82, 232, 140, -66, -103, 238, -292, -71, 216, 32, -156, -230, -194, 103, -145, 89, 422, 89, -161, -15, 221, -369, 268, 196, 162, 298, -31, -82, -77, -311, 80, 20, 204, 33, -133, -374, 80, -79, 243, 49, -101, 137, 66, 165, -87, 87, -109, -118, 223, -67, 77, -110, -30, 12, 40, 212, 106, -169, -73, 83, -188, 171, 217, -29, -40, 245, -136, -105, -219, 172, 107, -75, 249, -116, 3, -263, 257, 316, -204, -227, 84, -31, -181, -54, 116, -209, -250, -189, -185, 119, 2, 325, 11, 7, 127, 154, 72, 80, 35, 52, 100, -192, -294, 213, 140, -100, -54, 141, -81, 90, 70, 141, 129, -85, -220, 158, 177, 241, -32, -129, -331, -63, -20, 241, -222, -155, 82, 33, 86, 350, -208, -213, -165, -177, 117, 237, 15, 289, 8, -95, 144, 22, 201, -33, -364, -55]
6317e5J60r4N8k55J0M18k95J19N6K61m31J80j44R3l70L26K42l15J68k03K53J41
6339C23l27k96K94J62l14J09K99l56J16j43K26K36l97J0Q0N7L2j3j54k01L60J81
6361B84l06J31J1K88n45J19J19j07k2O3K3l49J85L33N0m13O0L27l51M61l23K08
6383B46j99lq7l74J44L70k14J7K95R4q4j45j32RJ01n0k36L62j1l9J06j11q7K72
6407B44K45m93N9k71M02q2k30j15k04L43MO8J55k35j63N34k64p4J85Ql36L11j1
6430H0k92J30J19l89M45k40k09M33J30l88K21j43k60N66k19O3j12J25L6Nj64K90
6452B27N1k91j03O4qq0N7L48n56j96O27k37L7J18R7j35O3j35K59j5j0J2j02j16
6476b4Q8j61o5L16j54j75O7R1J90j40j17o2L2J08k2Jo4K93m05M3L94j31j23K03
$$ y = [-55, 105, 11, 69, -186, -176, 242, -53, 66, 122, 383, -48, 132, -12, 81, -289, 37, 279, -36, 132, -71, 182, 323, -4, -300, -6, 156, -158, -49, 250, -106, 10, -133, 93, 329, -68, -58, 22, 79, 111, 98, -56, -257, 103, 284, -22, 109, 120, 408, -137, -18, 101, -6, -28, 35, 58, -291, -106, 227, 277, -136, -76, 251, -100, 361, 38, 246, 47, 44, -43, -417, -273, 97, -117, -100, 195, 289, 205, 60, -72, -63, 38, -12, -248, 114, 103, 64, 170, 59, -28, 244, 489, -4, 55, -216, 186, 104, -126, -241, -445, -102, -98, -30, 125, -110, -273, 261, -3, -77, 108, 116, -220, 91, 80, -212, -82, 37, -352, 93, -147, -356, 77, 207, -181, 40, -103, -363, 203, -16, 47, -65, 60, 96, 101, -63, 227, 278, -13, -116, -52, -60, -140, -83, 265, -291, -487, 140, -97, -60, 58, 155, 20, 83, -52, 207, 192, 182, 194, 92, -24, 64, -97, -162, 154, 0, -175, -108, -17, 173, 33, -84, -146, -114, -6, -28, -27, -91, 202, -203, -160, 234, 103, -20, 183]
6500A83j97K27l31j12L43l21K11j24N7J81k38P3J31N5k90J94j91Q9O4k21j4L54
6522A23k36r6K49o8J15R1j91OQ0l21J61K04k65M70j08m58K64j40O1K42j8l67K34
6545C2J48k99j8L9%L9j1J29l71M59k42J54L11m29k00R6J75j8j67K87l7Q0k87L69
6569B39k30j93MK45j71J20lK31j59j05Oj37j53K02J11j5M4k8P7k31J69o6k11M82
6593B28l14p0rn0J81K46l17p1L06O8m89pL10J19o2L06l88J06J41l52K14O1K4m20
6617b39L14O2l12K15o8k2K19j86J65k04l3j73l3M69j34K2O8j25O6j58K3q2K52
6640A06m92J78L56L3k43J43j37J10O7k36N26l79J87k24o1K85j91k19J68K88k65
6661@oj1J70p6k12N38l00l13n3L3L96n18O96n59K97k37J71J25k96Q3J86j01k04
$$ y = [183, -14, 213, -118, -230, 113, -208, 3, -121, -64, 117, -121, -48, 83, 138, -152, 42, -149, -60, 4, -217, -231, 123, -113, -209, 40, -28, 87, 178, -13, -7, 73, -248, -87, 117, -148, 322, 214, -244, 20, -120, -59, 183, 165, -202, 32, 180, -119, -137, -98, -98, -59, -70, 59, -312, 147, -95, 59, 370, -59, -259, -163, 12, -6, -173, 114, 77, 157, -130, 239, 9, -184, -180, 65, -106, 14, 11, 242, 83, -22, -16, -153, -306, -104, 7, -8, 36, 8, 85, -146, 23, -43, -254, 228, -86, -156, -165, -215, -34, 212, -105, -176, 130, 198, -291, -298, 12, 131, 69, 375, -13, 93, 234, -118, 96, 157, 181, -239, 75, 137, -175, 40, -28, -50, 169, -17, 148, -56, -89, -262, -295, 174, 40, 62, 130, 5, 71, -87, -64, -146, 106, -386, -208, 148, 181, -62, 81, -56, 54, 121, -115, 411, 32, 219, -5, -66, 219, 28, -191, -23, 265, 0, -6, -17, 153, 77, -135, 403, 103, -210, -263, -230, 166, -352, 344, -215, 82, -155, 16, 141, -155, -72, 114, 13, -191]
6684a91L6o0J18j21N09p37M32l9k94M15j42n3J55O6p4L34o70K29K92j18j11j4
6706c8Q7J36j60m9o4J41N4j0m3j51J31j51n0L34l83J99N0K63j21l80R3J66j7P4
6730A11j37Q6M45o01K85p3P7o3m60P84m98j00K33L5m3j12j08l7J32K44j48k33
6752a81J86J01N0l39N18k18M1j43K36k35J02K23l77J10j11J32K0k54k38L23L33
6773B79l26j74r5O09j56k75K37j87J39j65K13j19J30J52k01m4j04j95K35L53k57
6794D9k7L8R8Jj69j9j84L22j86l10K72K68o4L6j53J25J22j67Kj49J82k04k1r8
6818b36L94l96L14o4k52P02p97J75J77q7j20J69RJ43k39R4k98K09j9K08l01J88
6840b7J23k33K79r1m3N1k20J63J21j87L72n01L09k15l3j21L10p2J89k55Q3M8m1
$$ y = [-191, -155, -215, -97, -218, 291, -446, -14, -53, -347, 68, -74, -127, 28, 94, 20, 354, -316, -87, 205, 87, -24, -38, 49, 185, 25, -24, -88, 53, 107, 97, 54, -97, 34, -117, -167, 167, -216, -17, 33, 296, 175, -205, -112, 54, 37, 111, -26, 60, 505, -96, 189, 116, 193, 130, -330, 454, -44, -144, 89, 124, 81, -31, -139, -176, -44, 200, 52, -181, 5, 106, 156, -183, 335, 117, 158, 15, 251, 16, 118, 341, -36, 74, -37, 95, 115, -139, -377, -54, 279, -47, -221, -316, 293, 137, -138, 99, -88, 51, -114, 99, -20, 110, 262, 61, 17, -87, -282, -47, 306, 49, 22, 60, 158, 159, -10, -29, -213, 109, -77, -387, -115, 153, 89, 125, -28, 97, 219, 52, 54, -95, 87, -117, -138, -236, 158, -238, 76, 12, -240, 462, -335, -160, 17, -70, -190, -21, -12, 131, -108, -14, -312, -103, -122, 86, -215, -27, 96, -137, 142, 51, 8, 59, -161, 2, 123, -64, 308, -193, 116, -99, -132, -253, 57, -15, 174, -81, 2, 50, 9]
6863Il5p3L07m73M03j92q1j7k5O7K32j00j47j91Q8R7M7K41j43o4j21P4J76k77
6887a98L62J24l69L67k65k22O2J92J15o9P9j13Q9j49k09J68N2j49O4M72o99n1
6909c47J76L89k40L32j91j88K20M5J30k06m20K18K05j46K98n05K78N2K01j03k10
6930a2K68m34J86N3K2N8l37M18m06K73J99l54L54m44J08K48k2k24L34n3k51PJ20
6953A11k43M4NK50j82KN0j47k6L68k46k63M94k9l42J9l9K34R3k15Ln9N6j59K12
6978ik1J48k61J66M94o07j42N88l95lK58p0j99M88l30j23k50J62J73l30K71J1
7000A9J57j76j37k6j92M18M7l69N59l67K87k30j43LK9K13l08J89k23K57j05K16
7022A18k68L48J6j50N2j39J68q7L2j16m51L91L44k29l85M00K8k30N01j12K8m66
$$ y = [9, -26, -99, 208, -265, 138, -54, -135, -152, -177, -110, 122, 22, -125, -316, -228, -131, -84, 157, 14, -50, -171, -97, 79, -198, 164, 288, -81, 286, 21, -201, -139, 53, 168, 99, 178, 65, 154, 5, -204, -36, 16, -133, -69, 403, -296, -347, -171, 218, -22, 310, 119, -69, 151, 196, 326, 120, -300, -82, 123, -23, 275, -230, 48, 100, 301, 198, -12, 256, -178, 8, 61, 83, 141, -196, 222, -184, 89, 288, -66, 288, -156, -48, 200, 178, -46, 288, 235, -16, -9, 111, -132, -88, -83, 167, -15, -13, 37, -110, -136, 232, -14, -277, 217, 188, -154, -135, -174, 60, 153, -62, -59, -118, -62, -221, -9, -30, 118, -143, 23, 517, -90, -232, 356, -39, -42, 216, 146, -53, 435, 105, -18, -268, -106, 67, -263, 8, 19, 176, 0, -137, -163, -355, 63, 110, -259, 300, -67, 220, -10, -153, -150, -121, 92, -216, -27, -250, 7, -98, 118, -150, 198, 214, 64, 116, -23, 145, 58, 90, -26, -477, -86, 258, 29, -356, 44, 72, -158, 343, 231, 259, -207]
7044b07J73n4m8M20k28Kk89K70R4j98p4lJ88L2P2j03L30j86l84K72l65L63l5k13
7068a71K12P6j03m9j2p9L23R7l80K06j98L89m56K71j50QJ32o2mk12lQ6L64j24
7092A61j54J52k35L43l53J61m0k38K38j55O0k63O07j47kk91K04j06p2J24K4K0
7114C8J64k58J48k13j20P9J78r4o7j2n7n6J32N16k62l87M01P8k62J84J88j88j96
7137f6j36J93L3p1r7J34n3MJ43qn1j86K68j29J50j85k43K58J49j29K70k75j94
7160b21o5J91J24MN0r6L93n75K35k25J17k21P82m52J14k77J06j1p7l0N2q6l2J6
7184a84Q6r1M32L3k41J34L9k75J24j63J96j25o7oM02o40K65J2p3K21r9J34k38
7207a24K68l14J82j30L62l22J22l0N0K7q3O0l0P9k98L62j38L50j94k99J24j92
$$ y = [-207, -34, -88, -136, 284, 56, 58, -231, 39, 133, -65, -139, -142, 46, 78, 150, 47, 377, 191, -193, 79, -286, 77, 42, -171, 41, 117, 14, -35, -47, -126, 197, 294, -86, 120, -78, 311, -145, 126, -24, -16, 116, 54, 50, -162, -165, -79, 285, 161, 7, 159, -76, 267, -86, 75, 35, -203, 35, -120, -60, -323, 284, 137, 135, -156, 48, -58, -130, -6, 18, 38, 202, -56, 92, -121, -241, -162, 16, -78, -145, -157, -214, -270, -138, 378, 116, -271, 130, 208, -54, 130, 318, 130, -66, -202, -9, 24, -47, -144, -10, -63, -59, 84, 76, 25, -161, 107, -22, 128, -57, -300, -42, 107, -22, 248, -27, -221, -286, -95, 29, 33, 83, -13, 380, -195, 40, -185, -68, -289, 493, 41, 155, -122, -16, -27, -104, -134, -82, -168, -200, -184, -98, -189, 243, 276, 35, 169, 208, -67, 57, -106, 90, -35, -102, -108, 294, -346, -81, -69, -142, 79, -20, 114, -124, 144, -170, 12, -118, 244, -78, 44, 14, 64, 91, 8, 68, 38, 117, -181, 181, 43, 393, 199, -100, 24, -168]
7229a68J9M01j89L7k0l04o3J70M04m23K40M3k52K61l48K22p4l3L51k42K12m60
7251b16N19m65J5R6k1j61L32k88P0K58j32J22j78J42j79J64n15J47O3L22k75J30
7273e0J03m61K39M74k81J95j60J40k74L81k41j59K26j75J2j85N2K29J82l23N32
7294D56k50k30L71m60J93L0k25J29o0%J79m1q3k52K59m23N44j44p2J07J57r3l76
7317b84K82ko0K34k71J16q2q6J07L3QN8O0j55L2n2J11P0k46Q7M8j25k62N18q5
7342E4M7J37k6l54Q2N4J13j2k53N23k96J35J0j98L65n19L27p7k30R5r4K47k72
7365a42j03M28k93o8M84j58r7j26M4k96N50l44p7qJ9j55K85j82K38j20K66l19
7387a74N33k58L4l32K66k86J60L16k59j30p1K56j98J11p1K57l46O59m48J11L3
$$ y = [-168, -149, 252, 63, 100, 80, -224, -287, -117, 287, -136, 104, 147, -105, 156, -192, 30, -44, -77, 274, 32, 244, -216, 303, -162, -147, -51, -72, -233, 99, -189, -119, 139, 7, 129, -49, 93, -86, 78, -437, -290, -227, 95, -180, -50, 53, -408, -169, 305, 24, 219, 59, 199, -75, 306, 65, -94, 132, -43, -31, -216, -164, 65, 247, -76, 456, 206, -24, 347, -113, 80, 110, -115, 14, -46, -46, 133, 92, 9, -243, 16, -407, 137, -7, -79, 28, 185, 92, -284, -2, -4, -64, 170, -101, 15, -67, -153, -46, -13, -5, 53, 113, -42, -10, -62, 49, 119, -127, -40, 8, -117, -379, 139, 54, 101, 238, 212, -142, -60, -6, 107, 95, -158, 365, 69, 204, 214, 16, 381, -138, 189, 112, -118, -23, -117, 130, -142, -245, 183, -110, -178, 306, 148, 51, -75, -31, -327, 223, -121, -198, -206, -187, -342, -57, -239, -1, -121, 145, -174, 359, 101, 135, -197, 69, -217, -57, 259, 0, -130, -201, 55, -143, -32, -103, 154, -192, 467, 19, 130, 163]
7408A63j58k0N6j81L66k89K11m78K47M9j05R2K31l69N9M94j87l83k5K67m6J96
7430A90Q9l10J18J74j63j17j61J44%j65J01M42l48J85j18J9k39J4J57k4J52k31
7452i1K20k63L95j90J66k42N14m25J6J67n51K33K2J74q3L54l57j06Q6j7pj11J07
7475A1k57J88M9J70q7r8J03j10K15K11l58j94k0o0L41j7J70p4q6M9l58L19p2q9
7499e4l1J13j11L7m7R7l4J49J76k42m09O54m02K02m5k41L0j11L63j13K7L59l12
7522E5r5l8L21k32r1J50J38k76L5l0j01K85l08M09k54J46j49L4j16K58k56K11
7544I6q2j12J06L9K11k31k62O6k36L69j97M20j78Q9Ko30M36k81M74j26k8O3OR4
7568A08q6o4J01Q3k18L65l35M0J41m89N95l73J28K30l53L61l25J72Nj16J75j79
$$ y = [163, 5, -15, 41, -140, 226, -63, 148, -330, -83, -34, -139, -47, 184, -185, -126, 368, 181, -202, -227, 40, -6, 190, 279, -31, 87, 261, 98, -19, -180, -36, -36, -201, -100, 342, -6, 179, 61, 80, -159, -145, 12, -12, 140, -91, 129, -134, 261, 71, 237, -5, 509, 84, 100, 267, -284, -51, -29, 145, 62, 416, 59, -47, 39, 22, 15, -96, 11, -246, -58, -9, 161, 74, -24, 79, -31, 184, 395, 37, -157, -177, -237, 104, 87, 257, 183, 97, 146, -212, 107, 35, -54, -85, 28, -83, -46, -93, 4, -30, 119, 295, 53, -356, 298, -104, 98, 53, -188, -158, -269, 94, -19, 8, 367, 55, -40, -78, 243, 11, -80, 70, 208, -68, -33, -63, -164, 121, -187, 222, -32, 114, -35, -1, -117, 141, -115, 96, 14, -98, 8, 47, 258, 27, -235, -169, -405, -36, -233, 187, 9, 98, 100, -530, -94, -375, 99, -27, -55, 8, 14, 108, 22, -42, 59, 142, -76, 289, -46, -6, 135, -354, 241, -132, -4, 226, -127, 234, -91, 81, 86, -30, 145, -34]
7590c4k8j10m0R3J3k1j11K63P3Q0j44P3J13rl07K76l55N22k66OK9J4jk9k35K32
7616I7O0p8j85J27P0k07R5J78k32M09m03l2K35k91J70J16l17J68O8k2J02j55j17
7639a44j11J78J66RK04k83J0j26K56J8l88K65J27m89L36J16L8k92l1L12k46lJ92
7662A14j29N3N2k85L96L6l10M6J68q5q6j9l4j23M27l83J15K44l45oKJ68J05l39
7686b18L66K33n17l5N76l28J83r0j19qp5k20R8k34L30q1J3K7j83L61k83J99J38
7709A33r0RJ47l76J80k08K57p8j57L95n1q6l13j39N71n37N05pN3k38J9N9k29L01
7733A20k08r4l2L16l45L13M5k73R1K57l77P8O8J09j25K16J06j15L0l37M07j57
7755I3j3J18m13%J1K86J75l2L7l25j33K44m12N66l58p4K36j15J31l6j12j11J58
$$ y = [-34, -62, -172, -212, -119, -106, -127, -238, 25, 98, 178, 34, 107, 220, 211, -96, 180, -175, 347, 81, 87, 116, 130, 129, 100, -135, 97, 157, 79, -106, 21, 91, -116, -21, 157, -75, 334, -69, -101, 134, -157, 13, 129, -188, -20, 48, 26, 128, -27, -144, -255, -77, 89, 98, 302, 19, 29, -97, 159, 177, -211, 54, 181, -308, 28, 144, 182, -110, -141, 171, -75, -78, 114, -15, 38, 90, -195, 201, 237, -73, -27, 141, 56, -30, -49, -83, -206, 221, -162, -47, 197, -148, -154, -152, 16, 121, -218, 148, 381, -136, -171, 405, 77, 260, 170, 51, 43, -32, -252, -154, -388, -58, -139, -126, -99, -282, 79, -204, -5, 133, 43, 52, 199, -177, 3, -205, 52, -26, -183, 212, 161, 75, -238, -377, 194, -343, 162, 155, 208, -30, -11, 48, -181, 120, -88, -182, -214, 102, -243, 70, 115, -158, -67, 190, -187, -109, -41, 68, -57, 159, 265, 150, 180, -157, 250, 93, 80, 198, -215, -215, -204, 82, 257, 225, 262, -63, -196, 48, -364, 202, -156, -230, 6, -109, 22, -14, -126, -237, -79]
7778g9K73k84J98m1rk25l63N17M8Qj42K15k71p2M15j89L04p08N55j86j56O23l11
7801A20k82L8R1L71j75j73j16J59J59l44K13j79K89l05J37K37J1k85r5J7j37J91
7823e8K1K65m27J90K82m97M19r2k77lL06j32L0k59J71J98j35n6K66l12q8J89k30
7846b29K43o4j92K06j14K29j5K41l11L0J87n53K65k8J15q5M3Q8P6k44J94P4j3
7869A43k45M8j38J42K80n01K67O1k08O0j57j1J93J31j42K79k31K80k97K66k12
7890Ho4J11l35N13lm36J23o7L51J02k01J49j31m97K11K41L5m7Nj69K37k64J41
7913A3K11k92M9J41O0J01l41mJ52J9Q9O9k88Q3j03J37j24j3J24l64K07l0K08l20
7937b16L64j16K58k35J11m12J69K94j88Pk34L2L2K90j62L57n71K02q7r2J4J35
$$ y = [-79, 194, -90, 108, 67, 58, -167, -530, -13, 35, 43, -99, 116, -155, -227, 188, -1, 303, -405, 150, -36, -192, 431, 120, -162, -124, -33, 338, 163, -10, -126, 33, 192, -152, 61, -118, 171, -134, 3, 240, 251, -34, -129, -112, -249, -58, -37, 228, -199, -9, 273, -224, 195, 103, -174, -177, 129, -3, 27, -232, -61, 137, 2, -54, 212, -100, -188, 1, -229, 14, -50, -242, -36, -150, 79, 64, 305, -6, 24, 211, -342, -77, -105, 10, -75, -32, 56, 132, -112, 82, 156, 143, -102, -54, -192, -50, 230, -271, -4, 57, -151, -91, -248, -259, -66, 65, -77, 202, -29, 251, -46, 220, 8, -56, 55, -280, 233, 230, -206, -83, -150, 201, 303, 102, 251, 120, -377, -166, 75, 110, 63, 68, -101, 136, -128, 13, 224, -68, -19, 122, 182, 283, -58, -62, 90, 109, 198, 267, -21, 62, -41, 96, -28, -41, 83, -281, -74, -104, 104, -216, 148, 32, 290, 55, 166, -246, -77, 217, 29, 36, -198, -166, -134, 156, -6, 351, -220, -18, -105, -197, -183, -48]
7959d8J54j26L75n0j50l56J13j16J6K12qR4j0K61l63j61P8n8L12j53R4N0k27J48
7983H1M1j23j16J66j71L26j69r9J90o9k59J94K19j99J65l45J24J45n1n5j36m2
8005a83k5L65l12K08k7n6l8Q7m30N70j07m9lOp7p8j03J34O8l3K26j20J27PO1l15
8031i7K25j74J1j88J88J41J1L8r7r9L6j91L62l54J57J16M4j76Q4pL0n0j91N71
8055C90m23K1K0k35K55K6j41J37l14n9M18J91n76M35k06NQ7o6J85n1j27J17m4
8078D5l01K82M0J00j11K55l62l2M8l19N58m84N07l55L37l41K76j94n2K37m5o5
8100B4J37m23K88j53r8N42k54n4J00j71o8L10m67J56J24L0k23K96jj80j8O53m21
8123A29k43L20l21QK18k22Q5K33k01k34N1K49k76P9j7J89N2j82N1J26j24P6m9
$$ y = [-48, 106, -20, 355, 305, 155, -201, -88, -204, -188, 24, 16, 110, 100, 361, -2, -163, -85, -143, 169, 16, 110, 160, -67, 81, 122, -1, -117, 49, -122, 204, 35, -64, 126, 57, -202, -8, 211, 12, 177, -168, -44, 101, 50, -5, -141, -183, -208, 157, -155, 53, 26, -30, -68, 19, -411, 159, 52, 3, 0, 6, -71, -149, -252, -118, -50, -83, 143, 23, 150, 157, 218, -97, 128, -46, -35, -223, -35, 106, 117, 155, 58, -41, -5, -196, 166, -188, -31, 85, 129, -47, 37, 30, 60, 10, -181, 390, -33, -12, 8, -227, 28, 54, -87, 50, -264, -323, 95, 286, -290, 145, -61, -56, 31, -35, 150, 99, -28, 89, 45, -256, 26, 66, 166, 55, 310, -52, -84, -36, -355, 203, -281, 226, -129, 208, -133, 143, -51, -103, 134, 89, 24, 161, -262, 26, -127, -225, 317, 63, 9, 109, -62, -130, 180, -287, -131, -7, 23, -200, 96, 95, -85, -103, 550, 129, -114, 206, -115, -107, 111, -111, -26, 207, 6, -228, -177, 72, -204, -125, -142, 47, 99, -83, -32, 94, -30, 46, -3]
8146cK50j07P4mq0P8j57k18L50q5j71n0L33j32P3l06M45k16k01J64NK7L16j9n97
8171b31N4J19O3J19j86R5l63K14L44l22m8P7M65l02l77N03n92L84r1Q3
$$ y = [-3, 247, 140, 214, 210, 130, 208, 51, -167, 183, 98, -73, -123, 210, 78, 151, -155, 290, 74, -127, 37, 42, 69, 385, 366, -231, -177, -58, 5, 124, -62, 33, -330, -116, 228, -94, -142, -65, 400, 98, -279, 224, -368, 16, -75, 8]
8191H
$$ Imaginary data points
##PAGE= N=2
##DATA TABLE= (X++(I..I)), XYDATA
0@%%%%%%%qJ6j6K0k8L2m0M8n6P2q8J04j20J40j65J93k24K57k93L34l81M34m92
30b61N54o23P00p83Q74r74J085j209J342j487J648j823K019k237K477k746L048
47A604l390L783m238M768n401O172p132Q368j0025J2380j6026K2479l7305J33187
61A09224K3440k66853k2408J24971J27269o307m2813p7230m7739K9636J04485
72E5675K7576o2461n8489P160L383J2573N7841M2401p4450r9199K0278J07580
84C9868L8320m9338n6490k2531R625N8486N6792k9900r0239k2624O2853M2231
96C7053j7593j0489N696l2017m0808L2922P4837J1816n7619m7025n233K4184M7088
109B2812L7757l0297p3592j6254N8139L8621k3042k3556O939j699j6758J1438
$$ y = [0, 0, 0, 0, 0, 0, 0, 0, -8, 8, -8, 12, -16, 16, -24, 24, -32, 40, -48, 56, -64, 76, -89, 104, -120, 137, -156, 178, -203, 231, -261, 293, -330, 370, -413, 461, -513, 572, -637, 705, -782, 866, -957, 1062, -1175, 1302, -1444, 1604, -1786, 1997, -2241, 2527, -2874, 3298, -3834, 4534, -5491, 6889, -9137, 13342, -23963, 109224, 132664, -134189, -156597, -31626, 95643, 89336, 46523, -30707, -78446, -48810, 55675, 83251, 20790, -37699, -30539, -27156, -14583, 43258, 85659, 11209, -87990, -67712, 39868, 78188, 28850, -27640, -50171, -40546, 17940, 74732, 44832, -45407, -68031, -5178, 37053, 19460, 8971, 14667, -17350, -58158, -25236, 49601, 61417, 3798, -43227, -48460, -24276, 22812, 60569, 30272, -43320, -59574, -1435, 37186, 14144, -9412, -2473, -4172, -20930, -9492]
121i492L1366k06k7246j2594L312M290J7825K4404j5629m8372o216M8519K5375
134C5336l0447k7040J2870J6730n098n034L647n443n501J0850R491r151p230R352
148C332j516k0182R21L2752J5219k7128k8206N382K1893J1130j193j0891j5022
161a3509l28J8651J0343j3760j0720J0183O109j4223p122J9743J5100j4252k0701
174a4486L38J4573R280K67r147j1187J022J5309O579j3924j0040J0703J1986p577
188C696j2784L408J1100M83p209k435L416M378J864o250r758K714J6256N833j5326
203f14j3418Q879J4635k285j1785k322P493M214k357l830j242K360M029j870p360
218e473k02J0802N503r520j1529M322J1618K576p300n925J744M808K640k985m993
$$ y = [-9492, 21874, 21668, -5578, -18172, -14860, -10570, 7255, 31659, 16030, -32342, -38558, 9961, 35336, 4889, -22151, -9281, 7449, 2351, -2683, 964, -4479, -9980, 870, 10361, 1210, -6020, 3332, 1816, -18366, -17445, 15307, 30526, 3398, -24808, -19426, 2467, 13597, 12404, 1513, -13509, -13837, 4814, 15157, 1397, -9323, 860, 6969, -7254, -14376, 5367, 20467, 6215, -14486, -14148, 425, 9705, 9972, 825, -10362, -9340, 5969, 12548, -1376, -11416, -713, 11273, 3696, -9088, -5680, 5420, 5903, -1306, -3741, -325, 4053, 5917, -333, -10091, -7377, 8879, 14712, -614, -14032, -5153, 9482, 7197, -4588, -6910, 583, 4797, 2440, -1390, -2632, -272, 3757, 1887, -5473, -5675, 5127, 10630, 1110, -10419, -6097, 5521, 8097, 797, -5128, -3384, 1424, 4064, 1079, -3914]
233c914J310O724J560q029m827P050O868l858q309M89Q076L022n857n077K64M955
249D47M199k235n416q10N396L515m481o002K196O485O76m489k665K809L569j096
265B098l955k210L120M994m0o092l357M675N476k224o102n41N437K347k864l361
281b599N77L070J838k638k863P67L851J585l468m039J926N351N55m541l222K361
297a489L638j45l077j391K160L095n98m403j552L725L558j612m361j33M129J753
313C297l151l413J320L888Q61k591k918J241L173Q75k843k526J713L236J71l432
329a099j349K360K446n00l614q07K444K711j363l005p61L247K176k315k832K24
345b037L537R51k480k362J308K834P18l147j609J535K223O7k537j276K242J851
$$ y = [-3914, -2604, 4120, 5680, -2349, -7176, -126, 6742, 2884, -5425, -4936, 3140, 6162, 305, -4772, -4508, 447, 4646, 2411, -3005, -3815, 1581, 5096, 615, -5387, -3191, 3294, 3970, -519, -3184, -375, 3194, 2098, -1857, -4067, -947, 4047, 4007, -2085, -5442, -767, 4709, 2485, -3617, -4158, 1279, 3626, 762, -2599, -2022, 1048, 2886, 248, -2615, -1848, 2003, 3588, 120, -3919, -1993, 3358, 3913, -628, -3850, -1489, 2149, 2004, -1073, -2464, -304, 2791, 2193, -2210, -3762, -37, 3521, 1909, -2452, -2585, 1544, 3297, 146, -3267, -1947, 1941, 2802, 211, -2707, -1466, 1707, 2582, -261, -2787, -1074, 2162, 2333, -1099, -2448, -88, 2358, 1858, -1756, -2563, -119, 2592, 1229, -1776, -2537, 710, 2886, 571, -2261, -2037, 1500, 2451, -29, -2391, -1083, 1751, 2469, -678, -2287, -752, 1471, 1538, -999, -2275, -33, 1818]
361A818n09k700l52J885J485q09k137j84K043J592j758j645j37K206J124k042
377a20k086J032K371M61k157j376J628J950o51k332o34J655J536j46k102k51J769
394E47J170j268j398n15J779P96p92j204K18J400L73j045j339J37K257K3j047
411I2j216M29K018l70j336j009J221J324n21j278Q0Q60P11p09j266M41O11O98
429G80n31j003M3J554K08r30r22K82R87L77j022n37L98Q76j89p50l69L95Q89J17
449F53j045k71R44P62m19j116j46L83P76l82p05j09J086K69m99r41K77Q48R5l45
469A15n85J90P64J28p78l62J84N97N90j097m28L14Q51K63r55m56P46L22r7r35
489f29N4R49Nj79q09P7O19O70m17r85J6J094J71q29l32O06K01Pp65R8M03L17j8
$$ y = [1818, 1309, -1391, -1743, 142, 1627, 818, -1319, -1503, 540, 2132, 374, -1271, -1408, 798, 1922, -120, -2206, -1174, 1197, 1658, -499, -1875, -247, 1703, 1052, -1280, -1914, -259, 1277, 1131, -971, -1222, 547, 1717, 449, -949, -1464, 315, 1111, 319, -885, -667, 733, 1106, 61, -1278, -1141, 1116, 1139, 92, -1124, -695, 1323, 953, -383, -1392, -171, 1153, 632, -646, -566, 294, 1005, 296, -970, -529, 82, 780, 249, -754, -711, 843, 1051, 121, -801, -519, 468, 845, -177, -714, -316, 560, 371, -379, -748, -353, 536, 653, -392, -663, 281, 1043, 624, -492, -638, -255, 521, 139, -566, -675, 411, 680, 181, -760, -483, 365, 460, 115, -470, -280, 484, 612, -166, -528, -344, 253, 843, -254, -682, -368, 483, 746, -209, -665, 81, 403, 306, -629, -575, 374, 379, 200, -609, -532, 87, 757, 340, -645, -629, 465, 636, -193, -525, 81, 282, 289, -476, -378, 25, 342, 324]
512C24m43j43N66o1j09n26q5P02O03m61q10M24P61l79o57l91J24O06J09r8n3k48
534b45R47k51p49m52R87K35k53m37l51Q45l48pj35K80o6mj8j93l71P70M18m84
556A18p13R2O78J91m68l92O93l26N80l84l73J17M81n9l58j04L94J90M3p41J45
577a96K86j36K21j40J77j4j9J25m24j00K59J92j32m68J2N31m01r7J01L45q1P8
599A19j09O8k2k01P12p40k43K91L89k13J53m89M36j69K10m0j02O3k49j90M81j95
621d0l2N79k38m39J57K83J00n34j12L37k9k6l4KJ38J73Ml37o10L96M12K91o88
644b47J7M22M4p3k99J48P14p07l34K70R1j71J70L91p83M46K53j2j39m36M30j61
666C4k13O0O6j36q6P5K07N1m19L71J66l49j42L16L54n29J06K47k5j43l55N00R2
$$ y = [324, -119, -262, 304, 243, 134, -392, -477, 225, 828, 367, -443, -19, 742, 363, -294, -685, -561, 45, 154, 56, 3, -245, 702, 451, -298, -750, 237, 472, 219, -218, -569, 276, -72, -79, -214, 66, 0, -4, -22, -215, -586, 184, 602, 118, -595, -503, 175, 366, -102, -494, 199, -127, 453, 69, -304, -187, 294, 235, -123, -227, 167, 357, 400, -341, -196, 90, -46, 175, 35, 212, 198, 179, 304, -120, -220, 39, 231, 99, -369, -357, 174, -227, -324, -223, 122, 41, 119, 10, 78, 56, -145, 567, -173, -416, -125, 264, 51, 204, -285, 151, -18, 192, 152, 50, 113, -136, -326, 155, -40, -72, 507, 269, -170, -13, 270, 370, -164, -276, 61, 32, 6, -28, -26, 112, 285, 289, -48, -658, -262, 150, 441, -247, -230, 192, 236, 163, -136, 12, 726, 19, -315, -45, 46, -125, 45, 436, -347, 99, 352, 340, 201, -235, 195, 34, -179, -119, -53, -189, -275, -200, 7, 58, -361, 10, 176, -173, -315, 1, 355, -174, -68, 179, 154, 11, -344, 156, 248]
689B48l00Q0M1j39Q4J4l59KJ91P2J06j18J03j49L11k69lO0J3K0j32j26J18j0J36
714fJ07J26k40J32K50n41J82j45O2k57J12K83l00J94j39M53l62J8o0M23j11j94
736a3J04j19K51m53K87j74J4k92M34j73J39J68l45L84k44o27P29J78m44K52k17
757a61J48K01k04J55o9Qj37L3K27k68K20K1k48j65M00k10O6j07K30KJ5Jn4j23
781a9k3K35l19l3P6K86QK0j08j24q1J13l0k85P3m1M33k42J89l72P0K29j24k31
805c00M32n2l2j98K24K15R3k44l97J96j7L12k13p1n5M73o82N42n35O31n30K18
827A0L3l11J69r9N00k20O3l52K15r8J54n79Q74p45M09K9L5j49K02j3l20Q6L90
850B83o9j01k84K46l7m1K93l88J51k40M75l94K12j30J63k02L5l53N79l29R1J97
$$ y = [248, -52, 28, 69, -70, 14, 28, -331, -329, -138, -66, 40, -78, 25, -124, 187, -82, -85, -25, -12, 8, -124, -250, -132, -142, -6, 101, 227, -13, 119, 369, -172, 10, -135, -73, -330, -218, 65, -235, -41, -180, 273, -89, -71, -131, 292, 181, -13, 91, -28, 223, -230, 57, -117, -103, -395, 39, -134, 5, 173, -172, 212, -32, -659, 70, 248, -196, 56, -161, -13, 188, -16, 139, 70, 78, -59, -26, 201, -67, 153, 174, -74, -239, 161, -49, 17, -90, 140, 142, 157, 158, 104, -19, -42, 193, -126, -159, -83, 203, 211, 231, 123, -1, -82, 31, 1, -284, -211, -252, 181, -61, 128, -244, -174, 55, -69, -300, 132, 80, 48, -150, 74, 289, 382, 138, -259, -63, -80, 232, 19, -52, -107, 366, -316, 226, -309, 322, -208, 10, 43, -268, -99, -198, 302, 82, 145, -207, 8, -90, 64, -515, 359, -386, 23, 52, 87, -62, 140, 127, -193, -107, 283, 214, 113, -171, 75, 38, -3, 290, -98, 53, -187, 288, -106, 106, -24, 139, -63, -28, -381, 198, -131, -40, 157]
872A57j45K31l59K68j84J92k04J41k16r8N7o7J63j50m9P6J0J58J14k41L80k02
894C2j64N31o30K3K87l40K58K86j46k65K13k84K03k1j34J16m20L64L3J02m4K7
916B7L25m77J30l71O69k78j1j68r0O01m02K03j70K59k55l5K60j24O9m79K02j32
938b47N50l68J36j38L47P1p1l62k11M33k8J01n27M42K0l06M05j84k37N64p11M99
960A78m05L80j83J19o7l46N11j70j23L29j68j69k13M98k1K3l96L0K29l8p5j3J76
983H6k36K6k4N4Q2M0n3j65r5K21k09P9j10N28n44L55k52K42k26m7N23o04L94M59
1007E24m81O2k29K15Q6m05K92j72J67k23J51J3j48M41m81K29J12L3P0r2k09Q4
1029C9j37R4qj10j0m7J49J64j67m4p1L3l4K85k86j9k10O77k08J8k15J40q3l7J44
$$ y = [157, 12, 243, -116, 152, -32, 160, -44, 97, -119, -217, -160, -227, -64, -214, -263, -187, -177, -19, 95, -146, 234, 32, -132, 399, -231, -208, 79, -261, -3, 283, 137, -128, 85, -199, 4, -17, -151, -35, -455, -91, -58, 44, 0, 27, 352, -125, 5, -366, 303, 25, 14, -154, -244, 357, -45, 158, -12, 247, -8, -43, 217, 93, 162, -317, -115, -247, 303, -65, 71, -67, 280, 351, 280, -82, -293, 140, 112, 213, -314, 128, 148, -158, 247, 63, -174, 390, -321, 178, -227, 153, -30, 89, 22, -324, 187, 17, -106, 223, 55, -114, -327, 171, 150, 173, -223, -193, 36, -2, -77, -90, 86, -150, -124, -148, -94, -12, 28, -25, -190, -285, -64, -273, -194, -304, 224, -320, 35, -217, 25, -201, -248, 275, -329, 65, 524, 43, 105, -124, 91, 177, -228, 64, -108, 59, -164, -13, 0, -148, 293, -188, 41, 153, 186, 256, 164, -45, 39, -98, -4, -12, -122, -132, -179, -30, 134, -33, -77, -148, -115, -149, 136, -150, -169, -379, 298, 90, 108, -107, 33, -50, -87, 57]
1054E7k59N52l61j33L2K49J64n75J62K03ml11rj10L59N95o12k59L55o7k50K26
1076Dl03K81K8J24k31J07L81o04J99l21M38P6k32J8K20l68L48k83O1J71k25J59
1098D8J42k66j51L46r8j10K64p3l2k62l7M44j57k24L48n4j68j46K79k48K22j13
1120d6J37q8R2l44M98k68k52K62J73m52K37L21m00M4p6L41k30nP2K19k15K08k94
1143f6n3OL60l4k35K13j49j2l82K69J65O9j01J45j51k44L60L04k30j94K6O2j09
1166A9J11l6k7k49K24J75j36l27K56o1K1K03j75J57l56m4J37o2J38K44l39l0J06
1189e1J80J7J1n9M8j25lj99K06k45J18k0J10J39l32J84l1J26J47m48M4J36J01
1212E4k9o0K10j08p0K78k15r8R6r8J86j82J65m05R0K44k68J96J48M4k64K8%J90
$$ y = [57, -202, 350, -11, -144, -112, 137, 301, -274, -112, 91, 87, -224, -233, -343, 16, 611, -1, -260, 95, 28, -222, 4, -299, -18, 10, 134, -97, 10, 391, -213, -14, -335, 103, 179, -53, -35, 185, -183, 165, -118, -57, 114, -111, 48, 190, -76, -227, 119, 21, -89, 175, 102, 70, -192, -229, 215, 58, -166, 182, 128, -40, -186, 93, -155, 67, -46, 91, 3, 95, -249, 249, -19, -271, -9, 164, -288, -51, 270, -130, -86, -162, 179, -51, -56, 16, 235, 20, 228, -66, -119, -113, 247, 213, -22, 191, 42, 30, -352, -83, 82, 151, 50, 195, 44, -200, 160, 464, 234, 40, 66, 128, 19, 130, 94, 67, -182, 42, 217, 81, -246, 10, -51, -30, 173, -2, 155, -201, -245, -108, -170, -32, 212, -127, -157, -51, 129, 146, 157, 98, 146, 21, 18, -181, 25, -220, -102, -122, -12, 127, -205, -21, -52, 74, 221, -227, -183, -47, 54, 25, -35, 175, 67, -3, 275, 60, -38, 58, -40, 146, -36, 129, -276, -186, 58, -210, -14, 134, 178, -86, -58, -58, 132]
1236A32j38l24J26M17k53j30N04l02J48O1l95J06L28j63n5j40J30l61M23M4j89
1257c1K57l19p7J03P3k30J21K68j13k23L09l07J2K88J09l29L5l9J34q1j40K84
1279A04J50k59M9k55J16K71l40M14j06k62R1l00L58k73L95k13J71l59M02K25n53
1300a74K85l53K73o2N4l9m2N9j50L3M65k81K3J24j21Pj23l50L35K15k2J12j19
1323A49l21J06O7j25q6L85k99j35L39j11R0l15J91OO8J04m24L52j83K78k16R8
1345A8M1j97o3QJ61K14j75O9j51Q1J70J68m35Q8R2k92Q4K88k50k4J08L7L61m60
1369e9K0p9K75Pj8l10J07R8K09k36k52J13K44m16k7M40r2J17k75J0J47o8n4J20
1393B1K21l24J93L9l28J49Q2J51l24J91K11Q3k67qm6K53k20j00l14L56L68l60
$$ y = [132, -6, -330, -204, 213, -40, -170, 334, 32, 180, 241, -154, -48, 280, 117, 62, -78, 52, -309, 114, 158, -31, 226, -93, -170, -67, 6, -224, -103, 165, 52, -171, 138, -169, -157, 131, 240, -89, -54, -93, 41, -40, -180, 104, 254, -5, 44, -211, -95, 176, -164, 250, 144, -118, -27, -327, 31, -242, 153, -60, 111, -248, 154, 379, -174, 111, -242, 31, -31, 23, -16, -58, 1, -149, -116, 349, 68, 91, 215, 94, 101, -22, -372, -37, 178, 156, 268, 149, -172, -66, 1, -124, -210, 175, -124, -259, 80, -31, 59, -256, -65, -59, 9, 113, -311, 41, -142, 136, -80, 18, 59, -138, -201, -193, -32, 182, 7, 76, -75, 6, 176, 344, -91, -3, 89, -203, -119, 169, -81, -105, 3, 40, 401, -59, -39, -118, 157, 164, 146, -164, -57, 41, 250, 14, -238, -125, 119, -297, -324, 116, 24, 141, -134, -124, 23, -45, -99, 21, 242, -82, 111, 150, -178, -29, 53, 204, -120, 71, 282, 365, 98, 90, 44, 297, 77, -23, -337, 19, 387, 27]
1415B7M2p8P5j05j72J79N0k67L57l06P1R2J2L30m48RM08n48K81l20J67O0L34k94
1439d4P4R7j73q5k36M45M0k63J29J06JJ48N5l05J72j19J02q1l19K47L8J6k34L03
1463A14K12m15M2j24N9J26o3L17l62J1Q3J02K11l3l69L6J21j89K64j03r0j85K27
1486hj22M48k0n49N21k97K0Jj57L38m1N5k87K36N9m19N17n34K16j87K4N36o22
1509b72M81n24L89k91M1L84k16K84l34J38J66j94q4p2L5L15j36L7k47K34k05R4
1531B3j91J57r0r7L59m7k58J84J0j77J26R5p0j50k04L31J07j34n8L35m06L09m17
1554b63L45j69k96Q49l21L0K02m54K4K11j19j43N0r4N7K88K0m11L2J6N62l43q2
1577il2j13K57j01m04J92K47k56N92n09J59k31J50NJ22q1K6j09L53m93K55j89
$$ y = [27, 69, -9, 66, -39, -211, -32, 18, -249, 108, -198, -127, -35, -23, 307, -141, -132, 276, -272, 9, -311, -144, -84, 250, -44, 30, 127, -46, -131, -367, 78, 118, -145, -16, 90, 91, 239, 294, -11, 161, 42, 144, 63, -256, -9, 29, 45, -189, 114, 326, -89, -47, -171, -112, 14, -49, 268, -94, -83, 0, 102, 313, 280, -89, -53, 68, -121, 143, 40, -50, -235, -8, -130, 318, 298, -251, 270, -27, -7, -6, -163, 175, 134, 189, -98, 138, 197, -222, 295, -239, -23, -210, -186, 350, -272, 209, -315, 74, -217, -176, 208, -8, 276, -58, 80, 246, 52, -32, -104, -69, 246, 110, 147, -100, 134, -71, 23, -168, -11, -101, -198, 161, 114, -144, 40, 50, -127, -1, 94, 24, -126, -330, 1, 108, -26, -84, 251, -155, 154, -263, 82, -87, -383, 466, 145, 175, 377, -77, -53, 158, 39, -104, -54, -148, -91, 197, 217, -194, -162, -146, 416, 73, -9, -41, -154, 103, 2, -402, -210, 37, -219, 373, -136, 23, -208, -58, -53, 69, -12, 14, -95, 258, -235, 20, -169]
1599a69K06j35M1j08K98O0k26l9J5L8PK2n8J07k93K08J31m0L0j44J73l47J40L56
1623B73q9l29J52J17j63k9M3r0R1L46j83oo6k4j88R4k93P11j80p9j83L34k34l2
1647gm03N98k66j32L70J48l25N9j84K52j47J69l20j24K06j42J63j4o1J16k84L19
1669iq9M3J13J71l04RP7p1K40o5k62J42j48K05P0l9J66k84nj92J93oJ87J9k6l33
1695a98J78n5n3M56l57Q5qmj35J38J32l5l02q9J08K25j0j88p0K62k22mJ89j03
1719f0K81l80K11k88J15P7j21K80l3J29k59K27k72k64N89k64r6L8m3J51j35J56
1741C9m01K75Q1L37m96o2K03J77k07J03k59J08L04k19J66L12k86k24P2M33k26
1762B30l24J52kl18J50J66J17j99K43l16K11k66L31l95J85n0Q5k00K79m7k92M20
$$ y = [-169, 37, -98, -57, -165, 133, 193, -33, -72, -57, -19, -12, 10, -48, 59, -234, -26, 105, 65, 95, -49, 124, -223, -83, 273, 184, -145, 7, 124, -39, -68, -25, -115, -24, 322, 139, 133, 67, 43, -145, -51, -344, 367, 187, 108, -75, 259, 25, -7, -410, 188, -78, -210, 160, 308, -17, 42, -142, 110, -37, 132, -188, -312, -106, -248, -85, -99, -160, -44, -328, -9, -98, -55, 58, 229, -75, -66, 11, -60, 180, 115, -147, -5, -153, 52, 122, 83, 249, -35, -40, -232, -39, -45, 142, 161, 135, -198, -20, -75, -128, 328, -29, 56, 48, 44, -91, 47, 179, 144, -158, -247, -139, 86, 76, -112, -182, 80, -142, -146, 43, -60, 221, -159, 52, -236, -121, -44, -165, 115, 82, 211, -48, 179, -93, -357, 232, -32, -128, -90, -133, 18, -117, 39, -362, -87, -6, 331, -165, -227, -24, 153, -54, 49, -210, -102, 202, -17, 149, 461, 175, -49, 23, 456, 230, -94, 58, 56, -262, -112, 54, 171, -28, 215, -101, 110, -156, 175, -220, -35, -85, 0, -200, 79, 32, -260, 160]
1784A60j87M56n81j1J40j20J48l1k96O21j50j70n7Q0j04k1J61m4J18k13L41n33
1806b93L17j0l6K86j36o4M23l27l81J83r5M08n4l55K4j38Q0o0K44J20k4L4o7r1
1830a2J64m19L41j85q4J08L0J8O7k07J50m9q3K01%m9J05k06m9j86N8K86m1J70
1854A28l99L20r3J35j89o0K23j18K72l03k35L71k2J04j75K72l88K24QP6k21J23
1876E3j48L07j80K93k07jo5p9J41k31K5J54r3J06j46m6j0o6RJ10r0L09m34K73
1900a6K92j74k07k1M48m35K53m5j77R5q4m2q1M82j21n12K21j0n3L32k61P6j37
1923a77K8N6Q3r5J04m2Pj40p6k2j74L49j31J14k3k04M35L05l54J82k28j26J23
1946fo0K02k0k85N0J71r7n5r3K00J58l86k10O66m04L10mJ39n59M97j6k10N8K02
$$ y = [160, -27, 429, -152, -163, -23, -143, 5, -26, -322, 299, 149, -21, -78, 2, -102, -123, 38, -6, 112, -101, 240, -293, 24, 14, -22, 264, 128, 64, 487, 160, -221, -38, -133, 275, 221, -134, -110, -248, -168, -228, 16, 136, 112, 146, 79, -12, 152, -267, 74, -111, -195, -87, -57, -39, 28, -179, -29, -78, -161, 40, 40, -9, 96, -110, -159, -345, -287, -1, -42, 128, -271, 49, -44, 91, -98, -158, 65, -53, 219, -84, -319, 52, 30, 134, -41, 231, -157, 67, 75, 151, -70, 53, -95, 212, 32, 325, 118, 117, 52, -27, 114, -117, -92, 62, -31, 75, -71, -117, -127, -193, -184, -74, -164, 145, -289, -16, 276, 102, -105, -126, 322, -113, 140, 95, -82, 13, -71, -113, -194, 288, 167, -345, -124, -134, -187, 145, -116, -40, -177, -149, -93, -10, -105, -1, -43, -36, -176, -252, -274, -448, -99, -230, -116, -139, -343, 92, 397, 43, 225, -3, -129, -6, -66, 136, 116, -169, -119, 52, -45, -100, -193, 7, 165, -221, -431, 235, -169, 141, 137, 276, -283, 214, 198, -12, 46, 248]
1970B48lj53l36N02j18m18L24J37n83K65J15k62L71ok83M1K14J6r7l76K47M03
1992B48k40R7k60J6K64N9l24N9j51J63N0L6K89k60l61M78o96K57L29o2L3K12p47
2015e11L37L47j35L1o7K22p44O30k38K92k35Q8j67M15l51J80q4N8k70N00k55j20
2037g7O3J8j54K80j87J3J66L9k06K05K9k40j56N7J36J32m04K52j83R4J47M0l53
2060b89K64J25k54M80l45n9j07R9Q4k52M75m42K12J50j24J14j43m1K80Q8k16j75
2082g6k1J97j37k28L35j08K19j32L0J25N3m10QN56n04j0J18K56j56k51L56l56
2104a36J44q4N7m9J58j17P0J55l75OJ22J62n8L8L1q2J55J21m54J11l08K79L92
2127C38n28P3K0J57k09L88m14M43k25n2Q5k37J92K6k8J04l13O49m21J06j97L52
$$ y = [248, 245, 92, -244, 258, 140, -278, 46, 183, -400, -135, -20, -282, 89, 83, -200, -159, 55, 71, -26, -402, -155, 248, 8, 105, -155, -139, 125, 184, -140, -81, -232, -69, -19, 17, 306, 46, -315, 163, -533, -276, 53, -9, 24, 236, -511, -174, 173, 38, 69, 2, 224, -520, 110, -128, 164, -71, 17, -150, 265, -86, 94, 10, 68, -202, 298, 43, -77, -14, 4, -150, 130, -57, -44, 122, 161, -45, 160, 189, -51, -207, -150, -14, 118, -286, -34, -217, -123, 24, 64, -289, -25, 100, -154, 326, -19, -78, -185, -86, -2, -254, 221, -221, -9, 141, 17, 131, -12, -53, 227, 315, 99, -76, -97, 100, -37, -265, 70, -38, 181, 49, 79, 204, 257, -153, -145, 411, -93, -103, 15, 271, 115, -136, 220, -136, 8, -76, -19, -68, 90, -27, 43, 198, -177, -171, -49, 113, 55, 93, 124, 42, 197, 318, -136, -25, -333, -54, 338, -190, -117, -97, 60, -149, 239, -175, 268, 43, -9, 76, -161, 31, 57, 29, 133, -180, 469, 48, 154, -43, 309]
2149C09k3r3j15j74J39k36J60K14k01l0K74N9j51k48K13k09J34Nj10L28k17j97
2171a69L31K43n22J25j90K10j51L51q2L5J05j93k65K49j25j07PJ52J69q4K12l45
2193d4J2Jo3J53J58l11K51j09j99n1j89O48m40J20m4J34j0j32r4L66l27J04K26
2216A60j17J06k29j44R6K81k20K24j96Q6k87J47J63k47rJ94N7J14l60J97j32R9
2238a7L8q5j48J17L7N10o77N37j88l38K25K54j26Rq7j63J85l21N77j40k35Q7K82
2261C33m95J35r4Q9M5J5j94J35l9K38j43n6q9m4q8P1K03o9m2j04L29j86J63qo
2286I9M1n12Q12m59J42Nn1j77L0oj09K57j64L4O8J94j12j79p6K89q4J90j9o3m3
2311A07k2P9K03l95j28M3J46J88q3n4J31m14r1M56o19M34M9J16j87J02J05J04
$$ y = [309, 286, 193, 78, -96, 43, -193, -33, 181, -20, -50, 224, 283, 132, -116, 97, -112, 22, 27, -83, 245, 28, -169, 162, 405, -117, 8, -182, 28, -123, 228, 146, 181, 286, 93, -172, 77, -48, -155, -148, 4, 173, 89, 301, -44, -32, -31, -94, 59, 217, -94, 157, 48, -151, -202, -391, 257, -183, -63, -107, 27, 17, -115, -209, 157, -170, -66, 160, 43, 149, -80, -224, -128, 153, -67, 157, -39, 47, -240, -93, 70, -177, -186, 8, 65, 179, -181, 16, -116, -17, 21, -64, -212, -95, -58, 452, -225, 312, 124, -214, 11, 265, 139, 148, 61, -102, 83, -238, 339, 199, -36, 51, 333, -162, -27, -121, -32, 13, 28, -166, -31, -70, 168, 25, -31, -120, -164, -252, -181, 22, -47, -89, -193, 136, -50, 113, 105, 99, 140, -372, 440, -19, 123, 128, 77, -100, -70, -76, -185, 72, -92, -58, 10, 204, 92, -87, -163, 126, 42, 232, 213, 150, 107, 85, 164, 367, -28, -156, -113, 33, 221, 138, 84, 215, -199, -290, 166, -453, -19, 30, 146, -41, 61, 166, 270]
2333B70k68K27o4j69q0K05j00J1p5K81k5j38o6o8P9J21k19q8L6J46k20L23J3l93
2357b61L56m7J79j55m6j52N9N6J2k27K98mJ9n16M33P6k99J01M0L81n25Jp2k0L69
2382E6L8j37K6j21J10K20k49q4J75J5J11j66q1M03k96m3l7J33Q3j35m0k56M58
2405A83n3m5K5l26pM47N8j91j2j51K86k93O9J79m57K73oM27m34j35J49M8j0j49
2429a25K53l31K08J11k42L44J1m89J65N6P7k99J61o6L74j28j62J29K38l05J86
2450A66Jl71k0M5J67m0J66r1j67P7J9m9K69l15R4R2N2j54L2p3l50L33J60j52M92
2475C83k77r9l09M53l13J10L19k26j40k56K98M0m8K33j02j65M6K54k26j41R4M59
2497C87n21J15J47k39l48M52J28k02K15m74J76J0J07j18r4L73j44K38l34j90N51
$$ y = [270, 2, 229, 165, -4, -84, 121, 21, 32, -43, 238, 213, 75, 9, -59, 20, 141, -78, -166, -130, 16, -204, 119, 132, -261, 95, 48, 227, 72, 26, -126, -67, -11, 1, -226, 72, 68, 87, -429, 4, 80, -219, -118, -78, 303, -222, -221, -293, -313, 56, 94, -43, -17, -138, -28, 192, -57, -141, 34, 49, 160, -6, -87, 316, 20, -23, -60, 73, 156, 21, -19, -275, 183, 130, 85, 110, -216, -223, 224, 282, 91, 79, -72, 214, -79, -10, 169, -288, -15, -21, 406, -28, -163, -14, 34, 24, -125, 128, -203, 5, 116, -126, 218, 229, -260, -95, -39, 38, -261, -100, -166, 208, 80, -82, 47, 285, -20, 166, 167, -204, -224, -179, -12, -52, 114, 23, -144, -67, -48, -97, 172, -143, -49, 43, 95, -59, -27, -100, -450, -117, 43, -109, 383, 106, 7, -302, 151, -162, -52, 267, 41, -99, -355, -57, -17, -65, 168, 66, -99, -53, 201, -25, -166, -72, 387, -134, -19, 128, -111, -459, -7, 121, -81, 134, -340, -164, -154, -47, -165, -259, 114, -30, 208, -126, -316, 235]
2518B35O5o68K99L29N8l06k4P9m83N62j19j89J32J18N8K41n51K69r5M8L7J25o
2541B14m86K92M1p0k28J22L21j44J5j77n0M77o45J33j0R4J62J92l09L65j23J9
2563B05o0o4N0p6l6LJ75k39L11j95pK19l00jL6J20K2l55M03j46j09j40M16m8m23
2588b39L96j65J63k55L05j45J76k78R0J54k83K83o43M88l23L07K80k57J60l48
2608a34K23J07n40K69J1j08O1J74J46n51M11J59J91n86J59r8K90j59k04K43r5
2629c1J07j77L49k3j31k42K74o9pJ11l62n7K48kR6j52k04K73k90M12j99j75M29
2652A78j66l8j03J07M14m93K9M15j38k34p6Q9N9J34m01L15m7o2K43J06j70o5J31
2675B27k44J37j80j56k7K27j26J04p5J93j30K06m56K48M55l25K2n5j81j02J92
$$ y = [235, 300, -368, -69, 260, 318, 12, -12, 67, -416, 146, 27, -162, -30, 88, 146, 387, -164, 105, 10, 58, 95, 220, 214, -272, 20, 61, -9, -237, -115, 206, 62, 77, -100, -150, 327, -318, -185, -195, -101, 61, 253, -56, 309, 186, 205, 145, 81, 131, 55, 19, 22, 197, -42, 269, 74, 67, 286, -14, -15, 21, 141, 163, -192, 211, 65, -44, -184, 232, 184, -239, 157, -8, 155, -100, 205, 60, 236, -42, 48, 202, -81, 202, -441, 47, -276, 31, 311, 54, 214, -134, 89, 196, -344, -75, -64, -172, -111, 63, 209, -342, 69, 228, 419, -167, -8, -106, 184, 25, -179, 64, -31, 76, -101, 248, 225, 94, -148, 126, 57, 50, 161, -201, -258, -10, -12, 84, -68, -272, 1, -289, 123, -76, -251, 178, 12, -26, -129, -22, 392, -101, -72, 343, 205, -29, -105, -16, 43, 177, -224, 91, 44, -18, 225, 331, 161, 96, 227, -17, 120, -60, -216, -243, -16, -142, -38, -113, 80, -50, 156, -300, -52, 403, 78, 100, 45, -136, -238, -46]
2696d6Pq2K61n44N80J14j31k80P2K27j05j18o0L46j82M8m41M39K8l3l72R4K10
2719C2j64k61L39J88j97K92R3j85l24M72m28pj24J66J38j50J17O1O3m3k22Q9M63
2742D08n91K08k01J77l29L23j49L6j9J91J2k03J12j8m6P9J58r3l33L60M38r66
2764d46L17lK60Q4n07J68K76k84K17j18J66J79k23Q2K09m28j27K82k50K55j06
2785CL8j82K42k54K1K35l71O45j50o05K56Q9k7j35J02j34R3J97qq5K11N3k67o6
2809i9K59j29k0j84L41m14M9J09K32l39J24L28m5n6k04m72L75J67J4Q9m29K04
2831a00N5J94M3k48K68r2OL9j53o4j28L88j75J10J36l46R4k3n0L6K75j08j80o1
2855h4j11K52p9J13N9k34O0m6j84M64k25j29J56Q1Pl10L37r6j68J98j92Q0J32
$$ y = [-46, -39, -121, 140, -404, 176, 290, 159, -121, -49, 178, 73, -45, -105, 241, 59, 107, -334, 105, 133, 100, -272, -178, 32, -132, -393, -54, 134, -63, 229, 322, 137, -187, 285, -143, -150, -274, -108, 30, -120, -3, 58, 121, 78, -144, -55, 408, -183, 25, -176, 1, -328, -5, -154, -118, -137, 54, 66, -137, -25, -43, -89, -10, 148, 55, -278, 82, 520, -446, -129, -132, 128, 212, -295, -127, 149, -135, 82, -36, 130, 309, 86, 168, 377, -51, -178, 104, -146, 109, 3, 41, -141, 101, -153, -132, 103, -268, 377, 227, -378, -122, -33, -60, -195, -93, -227, -134, 63, 55, -30, 181, 234, -33, -99, 160, 31, 11, -173, 168, -246, -197, -88, 144, -195, -71, 257, 212, 156, -48, -520, -145, 22, 36, 125, -304, -100, -45, 149, 192, -56, 212, 120, 126, 165, 12, -52, -180, 208, 33, 143, 279, -67, 27, 4, -46, -10, 265, 157, -23, -84, -195, 57, -22, 91, 150, -84, -24, -70, -254, 210, -15, -144, 12, 93, 100, -210, 127, 31, -137, 61, -131, -51, 81]
2878H1j80MK57m4j00J21O8l5m04J56Rl9L58n09J76P5N1J16j17j21L2J62J81p47
2902d49J63M13j25j95R2K77j91L9J04n3q0k83L67Rk79R2P3j8nJ20k39K15k31J57
2926b7J29j49j16K48J6p9Q2j86J10J59j96P2j84K72j95L08q0j44L1J0j11o1K65
2949A74K80m84J95l26J06nK1L7K64l42k38K45j64O6K16N8j54m0O1m26M63N9j41
2972g5K7k7j73M66j23L4k65m0K36J97l45J06O8J40k75K21j17j20M4j53M3K38m1
2995F6j07P9k42Q7M97l77J9J67k17n8PJ31L9l68J90J76k64M16j25j67J54J74r5
3018A82j26P4k84J0J0J16o2L5k97L27j9L18l11k1L58m93K58J27l04Q3k5q7J05
3041b6l34L31qJ47k56J48j39M2J5n2q7K04j42L32k2M20m47k4j94jQ3l71M95k0
$$ y = [81, -99, -95, 162, 118, 18, 139, 207, 172, -232, -76, -67, -106, 252, -257, -81, -6, 45, 161, 44, -77, -45, 117, 298, -449, -286, 127, 2, -193, -101, 176, -15, 24, 128, 75, -5, -288, 79, 88, -191, -99, -26, -44, -49, 71, -168, 47, -184, -27, 102, -47, -163, 85, 101, 22, 104, -82, 28, 187, -9, 63, -121, 151, -44, 264, 184, 40, 71, 81, -30, -91, 174, 454, -30, 165, -161, -55, -60, -39, -2, 262, -80, -318, -73, -237, -171, 45, 103, -51, -91, -30, -456, 7, 66, -75, -48, -75, -248, 218, 95, 129, -136, -176, 60, 257, -88, 18, 86, 226, -49, 172, 55, -65, -21, -174, -131, 107, 66, -41, 38, -204, -117, 380, 3, 22, 189, -28, -86, -79, 52, 91, -277, -87, 89, -175, 241, 116, -51, 103, 277, 182, 56, 130, -154, -144, -134, -18, -80, -45, -342, -15, -34, 284, -27, -48, 310, -183, 75, 202, -102, -19, -44, -131, -26, -360, -29, -37, 110, -146, 2, -137, -95, -80, -132, -219, -15, -157, 175, 153, 573, 126, 102, -92, -93, -10, -381, 114, 94]
3065I4l33M13J6l19L66l16K24K60n95K53k14J77j17P4J07j56k94M69j65J3j10
3086a53j71M04j14l02J32K75j47j14j3J36J06K74l01J9k02K58l28J12O6J01n2
3107a4M36l47J72k45q6k25L52K09l23k22K97J31l68O62n14L17m11J45q3J95k22
3128a44K88j53j6J09l21j13L73l51M28k89pM82j99n7q7K15m81N71k16O1j23J62
3150A32k05p0P0P2K01m13J26K24j1k49J58q3j05L38j33O6k51j19J43Q5K87m8k48
3173c3J14J41l27j99M01K0j43j06J22M9O5j05k77K69l16K58N1k34K33k62J61J09
3195iJ9O6J4q0J05l58Q2K11J02j85rl6p3J09K28J63n50J44N4o1J90%k16K70n05
3220c25J87L3K02k18L66k5l37KK11Nm39K33J48k53K13k35L73k18R8m61M55L10
$$ y = [94, -239, 174, 190, -129, 237, -79, 145, 405, -190, 63, -151, 26, -91, -17, 90, -66, -360, 109, -56, -43, -153, -324, 80, -34, -336, -204, 71, -76, -190, -203, -67, 39, 313, 12, 31, -171, 87, -241, -129, -63, 38, -14, 422, 75, 247, 2, -84, -309, 43, 252, -71, -293, 4, 135, -233, 429, -85, 232, -179, -34, -117, 78, -144, 144, -9, -25, 84, -237, -350, 23, -328, 100, -189, -196, 286, 87, 30, -57, 158, -323, 248, 32, 93, -30, 132, -73, -143, -73, -1, 200, -213, -87, 137, 126, -123, 35, -48, -153, 185, 52, 118, -133, -252, -109, -24, 263, 215, -33, 81, 222, -105, -304, 97, 117, -26, -132, -10, 39, 104, -1, -278, -9, -325, -67, -16, -250, -17, -279, -118, -9, 10, 76, 90, 10, 115, -243, -161, 50, 152, -33, -42, -78, -151, -42, 186, 349, -201, -57, -3, -64, 126, 126, -90, 180, -325, -138, -105, 97, -121, 245, 220, -117, -115, 96, 101, -338, -105, 43, -210, 3, -232, 141, -77, 21, -440, 15, 325]
3242C25l31K19l25nk54L04J66j6J09J3r6q0j32J44r4p4P5J30m47K73j27K95j78
3265a06J52j09K19o63J45Q6L1K91j78K97L0k23K55k05J89k3r4n24O04r2M4o26
3287e00R7L16O1PO5N3j11J58j59P5m3J37m55M08l30K56Q8j71n2K83j08j46m2P9
3311c4nk2j03K74l13MK82k28K62k76M94l00J18k56j29R4R1J77k4j96J3K06m9J5
3335I5j72L70m05K43l23m5L90j12P5n95O70k31P3n7k3j18R3j54M39k99J0k81J76
3358a81R5O4J54J1k28N4K63k14Q2J53k43J98r1l56L61N3J21m35P6j83l6L63O7
3381A48m7J59p1q4n6k21K75q2q8j21J61J50j02k19R8J10J90j80j8j6j3j52M09
3404B30O2l24J00K7P5K7k02rj25M8L54j47l97J92J5l41N88j39J50j67j59L79n88
$$ y = [325, -6, 213, -112, -117, -371, -67, 99, 83, 192, 205, 109, 29, -103, 41, -53, -127, -52, 78, -369, -96, -223, 72, -106, 46, -63, 156, -507, -362, -276, -245, 46, -132, 165, 195, -28, 227, 22, 211, 188, 94, -430, 174, 82, 126, -500, -403, -87, -26, -19, 46, 99, -12, 146, -13, 62, 19, 156, -299, 109, -221, 35, 123, -48, -100, 183, 75, -71, -113, -34, -39, -61, -164, 110, -203, -199, 83, -145, 117, -159, 335, 35, 153, -103, -232, -138, -47, 130, 106, -90, -77, 129, 80, 95, -77, 293, -112, 131, -192, -237, 153, 41, 116, -479, 191, -40, 33, -24, -47, -165, -72, -226, 213, -86, -76, -357, -181, -86, -22, 132, 143, -85, -31, 232, 18, 100, 253, 10, 208, 117, -239, 122, 175, 296, -139, -63, -246, -282, 81, 148, 101, 260, 189, 105, 49, -172, 103, 21, -67, -188, -27, 123, 21, -198, -100, 10, 200, 20, 2, -14, -27, -179, 230, 292, -32, 68, 95, 170, 197, -5, -14, -139, -91, 263, 116, -281, -89, -74, -415, 173, 34, 184, 17, -142, 237, -351]
3427c51N35L4m27J25K95j56R9j34Rl7l74P63j12n09N21k72J42k83J00q3J45P1
3449A01j90P8M08k24J94m32MK22K59o41P76m16m36L10RK34k20j90L19l28K79k95
3471a79J53p0M2K26l37J46K2j66r5K05J94k20M8Nj06n6R8K24r5J5j05K85r5m5
3495I4j08O8k29L11k82J30j98J90L28j57j19j19K13k50L23j84k37J25M90l17q8
3516a6j23L76k96l26P65m83M14n17K64n1M2J49l3l16K6N1j10K39N77m85r2J58
3538B13m97L00j82N72l24J92l73R5Q9M8k10K94l20K20l13J02J17l9K55k63q3K97
3560A90nl09K80r1N9j30J79oj17n73N24N26k15l36L08j85k13L32q6k70J25J10
3582I7k20m98N74R2j04J97j05j02J78m15m1K82M9j19j01N42k12l79M42m16K08
$$ y = [-351, 184, 218, -209, -84, 211, 55, 154, 20, 29, -8, -382, 381, 269, -240, 281, 9, 151, -132, -32, -115, 30, 101, -89, -11, 397, 173, 367, -65, -61, 161, 420, -221, 555, 139, -297, 13, 22, 256, 36, -154, 165, -163, 116, -179, -26, -96, -54, 172, -165, -19, 3, -163, -258, -53, 141, -79, -31, -26, -132, -188, -90, 134, 39, 54, -51, 234, 139, 94, -14, 54, -175, 136, -146, -16, -214, -24, 304, 147, 28, -91, 122, -128, 195, 11, -226, -101, 389, 72, -16, -139, 237, -59, -385, 380, -103, 311, -206, 58, 7, 49, 198, 165, -151, -125, -74, -184, 55, 632, 147, 55, 213, -284, 16, -166, 406, 82, 274, -99, -4, 85, 133, -77, 217, -103, 117, -196, -94, 23, -16, 239, -24, -107, 190, 185, -124, 156, 65, 124, -6, 173, 167, 50, -523, 1, 527, 312, -24, 284, 99, -114, 218, 132, -138, -13, 97, -123, -621, -47, 45, -59, 138, 33, -69, 109, -306, -347, -65, -16, -135, -236, 306, 94, -285, 157, -259, -51]
3603e1J5L10j44k70J87Op1O6j31kk8m8jJ0M32k14n0K18k41l42M68m8l5K6O5J8
3629A45j21M0j37k52M48j84M54n19j49N04j86j4n19P55m50L98k58O1j08k30J33
3650a89K37m5O5N0j46j09M02k41j68K14L2l28J21K27q0K6r8J47R2j88K35l50k1
3673a15K12J05k57l6J63k13M18l00K42k30O8j3k6PK15j8j7m10N66m37n5Q2K50
3696B01l16Q3k26L88k04J81Qj48L0j59R7M1r9l4J70j22K44k20r2Q9K04m93J58
3719b19K68q3K33o5k45j97K22J90J14m27K74m19L86J12j82K22l73n7M34k26J56
3740A18k30Rj93P1J40J65k84K31q7J49n5N4m7m1n0j4J68m0j28J25k13J91l8l04
3764c03O16k93N3j68K93j79r0n1j39K99J35k98J49j26k38K49n7p1P1J54J55k12
$$ y = [-51, -36, 274, 130, -140, 47, 53, -18, 48, -83, -85, -113, -161, -162, -152, 280, 66, 16, 234, -7, -349, 119, 71, 36, 62, 127, 145, 24, 64, -73, -325, 123, -61, 393, -126, -275, 229, 43, 29, -490, 265, -185, 213, -45, 16, -92, -322, -189, 48, 3, 68, 118, -28, -137, 265, 24, -144, 70, 102, -226, -105, 122, 42, 68, -30, 117, 209, 21, 256, -94, -115, 97, 202, -55, -91, 72, -141, 277, -23, 219, -11, 57, 44, 18, 25, 240, 222, 205, -205, 361, -76, -131, -49, 201, -115, -32, -258, 130, -74, 107, 115, -33, -3, -162, -65, -24, -123, -157, 13, -109, 135, -85, -177, -88, 116, -377, -219, 49, -34, 199, 134, -111, -308, -86, 104, 218, -209, 65, -354, 32, 144, -38, 184, -189, -246, 188, -38, 118, -112, -103, -296, -225, -85, 80, -204, 27, -60, 89, 34, 88, 41, 0, -50, -64, 104, 64, -64, 61, -152, 39, 1, -303, 313, 20, 73, -95, 198, 19, -71, -122, -261, 38, 173, -125, 24, -102, -340, -91, -148, -219, -148, 6, 161, -51]
3786e1J33J45J59l53R8k13j75L02k25N78m59J51j07j19L38l66MJ35l47L56Q1R9
3808A64m64J84q2R1J10p0K33m60M13m9l62L81j28J20j83P9N4k82K04L02k0j72
3830F3J84l82K87J84m27J24K07j94R6q1k05J99K91n28K92q3l5L16m61R3K01k49
3852a08J26J26l13M50k43K69k98M03m94J13k03K96n9k82J38K46q5j51pK52o3J78
3874B91l02j35K53k90L08J88l93J6J88l16N1j47K37J84K9k18J2J91k02n3K76l9
3896A29n5j22K96j09q3k67N42r28P22k52J7J82j2l5J3jp0l8J42J2J1J66l26N03
3920D37m81J40k63K12r4J16jl41L31R9l83L77N9j54Pk0p7k65N95k79M2K1L6j52
3944c8O6J77j03l83M64l00J76J23o8P9o1k79M6J2q1R7K78j88k01L70l18K23k2
$$ y = [-51, 82, 227, 386, 33, 131, -82, -257, 45, -180, 398, -61, 90, -17, -136, 202, -164, -160, -25, -372, -16, 65, 164, -300, -116, -198, -107, 3, -67, 166, -294, 119, 70, -292, 89, -39, 81, -102, -23, 31, -251, -47, 255, 235, 63, 247, -135, 152, 336, -91, 33, 240, 46, 142, 61, -144, 55, 346, -182, 110, 27, -8, 308, -153, -60, 141, -108, 18, 144, -169, 281, 38, 307, 9, 412, -82, 31, -172, 124, 65, -217, -79, 167, 82, -69, -76, 176, 113, 291, -11, -146, 107, -183, 125, 313, -80, -64, 124, -192, -141, -288, -51, 133, 162, -56, -44, 147, -55, -108, 168, 129, 74, -48, 248, 139, 56, -211, 331, -597, 125, -127, -110, 72, 60, 25, 38, 37, -33, -71, 71, 83, 94, 260, -66, 437, -44, 96, -167, 45, -49, 67, 66, -275, 56, 155, -228, 149, 208, 54, 61, 41, -36, -301, 294, 15, 57, 78, 114, -38, 28, 205, 102, -281, 183, -117, 59, 182, 114, 193, 132, -147, -101, -89, -170, -73, 205, 17, -184, 186, -132, 91, 69]
3967F9O7m52J43KK70k14O1M57m28QK45l36l3j01J59j4J53k01K26J13O0j60l69
3990b75K94K27k42K58m16M9N8l3K03K8O3l51L79l05J83o2J1k64L05m0r1Q1r8K54
4014B16l03N13k67k24l0J59l1l8J03l47K24j10L32j29j9k81K92j16K17j96q5Q8
4036c2O0q7L14l27J54j98JK53o2L3j56L33M8l99M33l82k22J75O7R9r4k19M71n96
4060c33L91j48J96l6o1L8q3J06l23L46J90k26K46l31j87K51j46J60K05l82n5J11
4082g1j25M7p9JL37k01k36K31R2J87K5j98J00L51n81J57j58O8l7q0O5K49k39L53
4106B58m02o8N5J13J40l7j62J01j64J53J8K01J79j94m05J60l5J61l0n34O37k36
4128i1j01J50j84K46r0j3J68k78N8J13j46J6N1J1K61k27L45o04L51J40m0K5l9
$$ y = [69, 136, -316, -173, -171, 99, -115, -54, 403, -25, -17, 228, -108, -141, -242, -83, -97, 56, -145, 81, 194, 254, 94, -275, 19, 246, 4, 262, -154, -105, -47, -80, 123, 151, 214, -137, 242, -63, 120, 58, 69, -195, 110, 70, -21, 60, -38, 216, -87, 426, 159, -65, -95, 64, 33, -5, 98, -249, -25, -135, 197, 68, 49, -232, 60, -56, 161, -35, -120, -32, 28, -59, 255, -72, 82, -116, -115, 138, 76, 109, -47, 286, 334, -65, 368, -14, -236, -61, 6, 105, 11, -208, 263, -333, 58, -90, 106, 70, 9, 47, -36, 70, -253, 93, 283, 57, 303, -28, -215, 36, -110, 50, 255, -127, -182, -71, -196, -149, -228, -227, 110, -91, -327, -96, -4, 183, 208, 10, 110, 461, -120, 37, -121, -53, -90, -170, -105, 144, -95, 258, -144, -212, -157, -44, 96, 59, -103, -2, -166, -13, 5, 206, 385, 191, -214, -54, -89, 72, 42, -492, 145, -91, -192, -42, -226, 20, -70, -83, 85, -193, -135, -22, -168, -152, -101, -90, 171, -56, 289, -315, 36, 176, 136, 161, 122]
4151A22k95J71M9k29K30j10L13L1m90R6K02NQ5Qjj43J42k32p4J51n8J16j51J38
4175G6k3J67k61j77L9K00p5J41m0M1l61M48J82q1l88J59j24J49j66J2P5j83L81
4198A91l27P2R0j03K45k93n2J47K28m84J86K98l37P0k31J85K03r0m3lQ3K60P1
4221C66m79K72j46K77m13j05L4L50j67J89k3q5J14j35P0n7j99J72k73n7L75l06
4243b26J25Q4n1L7L49j12l40K46l1m9j40q9O9q8K58Q4j11K35n78P6K29L9N6n0
4267B2L26m62l9K46j36K78m23Nj3O5J87k11M5K73K29m96J25J10J48j36k9j96p8
4290a60M8j40M22l20N76k72k8L6k54J73k47J38oK35k44K4K11j26Q1m5k76J8k2
4313a78K74n2j10j41N6l2N1J31o6j10L60N5k94K53k89J7j22J14k59J41K39j1N5
$$ y = [122, -173, -2, 47, -182, 48, -62, 251, 282, -208, -112, 90, 95, 180, 188, 187, 44, 186, -46, -120, 31, -27, 89, -62, 76, 53, 220, -41, -218, -179, 21, -54, 87, 47, 88, -273, 175, 357, 276, -112, 47, -77, 72, -94, -82, -7, -190, 191, -136, -64, 26, -77, 168, -125, -177, -30, 198, -286, -100, 198, -139, -69, -300, -115, 88, -2, -45, -48, 35, 295, 366, -113, 159, 13, 290, -123, -228, -194, 156, -11, 178, 155, 70, 184, 49, 119, 62, -137, 35, -238, -295, 80, -226, -101, -17, -68, -31, 318, 206, -134, 112, 81, 32, -108, -197, -128, -216, 42, 126, 15, 250, -328, -252, -23, 16, 72, 22, 348, -114, -153, 93, -43, 235, -188, -183, -196, -131, 56, -155, -110, 163, 392, -104, 21, 131, 279, 143, 114, -82, -160, -112, -252, 170, -150, 426, 154, 126, 162, -92, 81, -166, -28, -34, 201, -43, -19, 192, 66, 147, 102, -174, -156, -178, 96, 44, -66, -207, -151, -183, -132, -1, -67, -177, 183, 238, -56, 197, -92, -75, -197, -83, -342, -201, 38, 27, 82]
4336H2m31K68r8N59m33j6J3K64m3l13J11l16N08O7l33N9K7k36M16k20k2K22J21
4359B56n63N72m58L08k74j51J44J36L51n16M85k00L0j04K0J04j40K0L36o41m5
4380c30L63N4j00m4R7k35L28j89L81l87M0M11l77R4l3R5P3k13q4Q3K49j67l54
4403b45K36K00l2j60N9%J44j03r6J00K7l8j94L09j59j25L4K66l13n8M75m28O2
4426c9k4p0Rm17L53J21J11j45L53j5j11j9l03J42K84n60M8L21k89K71L53l52J02
4449A24l09J6K92j22J57j21P9j44j43J82Km2M3j82J30L49o3l52M59m64o0M14l69
4472a24M89n76K19%N0j48P7J77o4k16m8K62lj43p8j50J68K26j95m3k38L14K53
4495B09m06K71j25k26K47j35O4j07n2p1J02K46K6J85o0n4j45L54j33q7m4l8N6
$$ y = [82, -349, -81, -179, 380, -53, -69, -56, 208, 165, -148, -37, -353, 155, 222, -111, -52, -25, -261, 155, -65, -87, 135, 256, -307, 265, -193, 115, -159, -310, -166, -30, 321, -195, 290, 90, 120, 16, 36, 140, 0, 20, 356, -285, -330, 33, 87, -13, -57, 40, -195, 133, -56, 325, -62, -22, 389, 12, 106, 73, 168, 241, 28, -56, 27, 276, 109, -245, -9, 191, 159, -1, 58, 58, 202, 99, 3, 103, 130, 92, -102, 207, 48, -77, -43, 223, -90, -148, 327, -101, -39, -63, -133, -124, -541, -188, -67, 44, -101, 252, 237, 126, 107, -196, -54, 230, -330, -282, 39, -250, 21, 374, 22, 124, -185, -169, 123, 1, 158, 37, 116, -28, -171, 11, 13, -29, 14, -168, -38, 311, 248, -104, 355, -109, -169, 245, -124, 365, -211, 8, 8, 58, -90, -13, 164, 100, -116, -164, 98, 95, -48, -126, -276, -108, 118, -77, -120, -358, -44, 209, -197, 74, -51, -277, -30, -165, -101, -208, -260, -331, -229, 17, 43, 228, 168, 114, -31, 323, 190, 103, 59, 21, 77]
4518G7j24j93J36L3j39LlL68o8j28j75M24k31Q4j17J15L5j65j76K66Q3R8o82K72
4542b07J05J37m3k11K8l1K17L0p7m0M9RJ45p0O5k43K71k59J51q9J18K20j95N4
4566A34R4O1k16n11J48K91K13n14K21n6N14k43k34M25l42L04j50n04M34k22L70
4587B17k12J13J77n25J73o9L64N0j72L98n28J42k39m2L50m08J66O8l52ML71l1
4609A5l6j13J39n2j49n2L02M9l36N5J94L06j48l55M28p04M28J74k57J7K04q7l9
4632a7K2Oqj12rq8m5M10k02J14j58l9M20j26J01k6l13nR0L96p01M50l47N31n26
4657a82L74l03j05K99n6j97L94j15j78n0j37N66k90k76J30K9N47o02j85L84k9
4678A8K0l1j38K93J9m48L16K01m62K76K4J32k1j49j76J0j05L20L13p01L78k62
$$ y = [77, -47, -240, -104, -71, -210, -207, -210, 158, 90, -38, -213, 211, -20, 64, -53, 62, 97, -68, -244, 22, 105, 203, -479, -207, -102, 35, -8, -219, -191, -222, -5, 25, -52, -92, -43, -34, 111, 41, 106, -137, 134, -125, 26, -63, 55, 275, 80, 134, 228, 289, 73, -438, -290, 1, 214, -300, -79, -135, 379, 136, -98, 327, -15, 289, 139, -365, 69, -153, 217, 5, 118, 295, -230, -57, -126, 238, 288, 116, 514, -14, 128, -111, -153, 197, -211, -45, 23, -329, -325, 46, 15, -21, -134, 5, -47, -196, -248, 54, 103, -233, -178, 16, 322, 174, -181, 247, -457, -29, 145, -112, -95, 109, 22, -17, 5, 11, 3, -109, -118, -206, -251, 159, -43, 71, -87, -126, 294, 168, 269, 243, -70, -75, 15, 411, -290, 160, -187, 344, -182, 192, -111, -216, 83, 27, -170, 224, 109, -69, -119, -256, 310, 20, -256, -126, -97, 450, -152, -337, 47, 18, 38, 7, -131, 162, 181, -267, 49, 250, -212, 64, 88, 220, 199, 50, -126, -116, -221, 99, 412, -289, 89, -173]
4700a73L28k25K73M1n6j20j36M1L23k93j48L28Q4j10j02p1P2R8J19k42k45L57
4722A43m8k02L38N9m46k39L60K40K19l40r9Q7j37L5P0J79k29j21J4j04L51j96
4744f6J00k20J13NJ52K3n6q2K38j36p7O1q3m5M0o8j32n2M13k84O0m2j51J51J75
4769C7K40l51l41L49K10j8J56j07k05k8J89m64L03K13j20J02J74M5n44K79p7p2
4791c0J50k8j88J69K44k67K64n81N93o1o87K43M0J44j2l5K34Mk54k93J83J58j26
4814a36L58j27j10j62L6k63N30j92J18L5mq1J96l17J91N13o81j22J76j60P6K43
4836A17j8k12oJ32%k84J92J17J65k12j75L3K51j19j37J98M06n25L3J66NNk35J49
4860D6J8J79l63k4j10N69k49r5M2q1L48n91L41j30P1q2p4J83L7L5k67K17j44K41
$$ y = [-173, 155, -70, 203, 244, 188, 68, -68, -27, 296, 3, -145, 183, 267, 157, 55, -16, 56, 154, 273, 31, -214, 143, 95, -107, 231, 290, -156, -395, -35, 205, 424, 84, -15, 72, -65, -30, 40, 219, -10, -131, -117, -221, 130, -66, 34, -186, -73, -68, 84, 107, 51, -31, 207, 71, -6, 55, -28, -73, -33, -101, -233, -285, 128, -156, -96, -138, -289, -138, 37, 277, -74, -415, -66, 144, 126, 282, 175, -30, -58, 131, -333, -30, 183, 63, 165, 339, 384, -160, 119, 42, -30, 120, 92, -96, 73, 317, 50, 314, -267, 326, 265, -422, -179, -139, 5, -7, -42, 192, 196, -58, -351, -168, -10, -136, 222, 95, -15, -177, -141, -404, 126, -66, 52, 87, 83, 2, 198, -119, 72, 585, -96, -218, -42, -202, -126, 117, 99, -113, -119, 13, 13, -271, -79, 38, 203, -9, -184, -151, 100, -19, -156, 42, 448, -77, -44, 122, 127, 132, -103, 46, 64, 243, -120, -144, -254, 315, 66, -29, 13, -68, 280, -311, 30, -100, -29, -111, -185, -2, 35, 70, -197, 20, -124, 117]
4884A17j30j79K64J71R6l20k93K81L6q4j1L7q0K62k55K49m31N7K58J1o8j24L77
4907B41k21j58n7J35L05j99j08L88l75J79j62j87K49l4R2j56Q9J69j35k02J09
4928c8j26j02L99o4Q7j70K6J06m15L79k22K70k69K89l17K6m9K51j16J56j17l0
4950d6j13KJ92o9K12k97O4r4j14K24J25L9n14Q3P3K15j07R8qP8P3l1J18k25K9
4975GJ31k58p5J86j0j04L34k5k24%J94j74l08L10O6R8n2n9m04M00K41l01L27k49
4999E1j23O7j02J83J16l09K29k31QR6m2n0L96m06J55M7l68K08K64J39l81P2l7
5022a8m3L47l17K86l01K18m63L70J57l85J37K5K52k03Nk47K65j18J14r1P9j1j79
5045a21J66Q7J44l39N4l9Q2k38J63J9L0K8O7l96L22J89J61j81o2j45p3%J36j7
$$ y = [117, -13, -192, 72, 243, 339, 19, -274, 7, 43, -41, -52, -15, -95, 167, -88, 161, -270, -213, 45, 56, -12, -136, 241, 20, -138, -195, -60, 245, 46, -62, 326, -49, 130, -32, -219, 30, -4, 88, -68, 21, 190, 55, -147, -38, -164, -266, 133, 69, 156, -14, 12, 118, -297, 82, -140, 130, -139, 150, -167, -141, -190, 61, -55, 101, -16, -46, -159, -157, 35, -34, 178, -119, -55, -149, -263, -39, 86, 125, -389, -306, -233, -18, -125, -27, -35, 43, 116, 85, 203, -22, 7, 138, -120, -195, -9, -19, -123, 211, 186, -38, -38, 156, -18, -326, -16, 50, 148, 96, 37, -367, 33, 274, -27, 300, 51, -72, -5, -107, 76, 192, -117, 112, -119, -111, -15, -57, -107, 289, -117, 38, 85, -283, -75, 189, 328, -53, 19, -18, -61, 286, -31, 255, -46, 172, -291, 79, 236, -149, -12, 13, 265, 62, 67, -180, 85, -33, 81, -10, 69, 58, -121, 45, 132, 276, -63, -9, -48, 34, -204, -41, -22, 8, 36, 103, -293, 29, 218, 379, 198, 136, -9, -82, -82, 54, 37]
5069C7J4j6k0j0K09k86J01Q1j61J70j27J54n1M4J98j74l63J69m7J75m0L76n30
5092i7K93k63J31P6L1J02m41N81k98l36L78j95J39J60l22j45M49l29J72j39o3
5113a16K78ol18m0J93J13N0l77M92j02k78M96q06N29l47K48%k83M73j19q8K54
5135B46j93k80O55m15J42K28k03k24K01J69n00Q3K73k88n7J03K52k56O6k04J54
5156d8J38j52N2M2p8j19J41k54J64J54J67k05k9J59p0q6K2p9q4M03k31j06K16
5179A17m4n0n7NJ13J63j39p6j8l8m0Q4K84l85j7O4J62k3k1J1m06L61o2K10p3J96
5205C21l82q7j4N7J47j85K23j08l17M20j21j00K45k6m6j59N14l14R4l2k83J32
5227b1K6k98N64o3k69J59l58M64j69K84r5j00N1n25L14O7P8j02J94j12j85O5r4
$$ y = [37, 51, 35, 15, 5, 214, -72, 29, 110, -51, 119, -8, 146, 95, 139, 337, 163, -200, -31, -78, 97, 57, 433, -97, 196, -67, 64, 140, 171, 273, -168, 413, 115, -221, 157, -38, 101, 261, -61, -206, 243, -86, 86, -53, -116, 162, 156, -162, -202, -9, 104, 154, -223, 269, 167, -111, 385, -421, 108, -239, 9, 9, -274, 199, 80, -8, 246, 53, -227, 428, 13, 155, 383, 180, -44, 157, 326, -174, -91, 182, -106, -163, -60, 192, -64, 2, -202, -48, 90, -62, -10, 32, -46, -165, -24, -278, -114, 40, 207, 2, -27, 132, 62, -24, -2, -81, -165, 238, 7, -99, 117, 73, 23, -34, -29, 84, 247, 108, 32, 14, -24, -64, 20, 304, -81, -98, -34, 128, 105, 84, 95, -311, 50, -12, 198, 125, 321, -61, -148, -162, -105, 42, -143, 80, -28, -345, 75, -46, -146, 99, 73, 27, -132, 382, 68, 162, 130, -153, -21, 5, -293, 271, 208, -61, 98, -260, 204, 35, 319, 224, 124, 175, -350, -36, 31, 109, 7, 201, 89, -96, -31, -125]
5250a25J44O7O1j27j4j06L39k50J6q7K66j32j57M21n86M48l07M3K63j49l7l3J65
5273A23K00k17m4l5l37O5N42m1l86m1K67m9rM2o1j53L37l38o0K05K90k41j15J40
5297H4R6m49K14j84L30j43l06M79k53M21l76K03k18J67M4k27L03j13n7M8o1j23
5319a21K51k70L93k46J38mj8k45K80o4k28J80Q6l22J50R5k7K28n33K71k4l9J81
5342A12o4j55L22l56J14Q9k46K92j71m2J51J2Kn9J96k04m6J43k0j60K34k11j50
5365b17L81j0m80L23L5j55J40j06N2J54J13K80m19k99L59M3p0L6K17m35j04J96
5387C4j43J9J35J79j9Qj44j91l1m5J06j29K51L6p2l74L25K37O4k71K42k18J33
5410A32j57m34P07l45J72J95m07K26j14L23k13j87N24n37M31m89j42K40N4m1n2
$$ y = [-125, 19, 86, 147, 20, 6, -100, 239, -11, 5, -82, 184, 52, -105, 316, -270, 178, -129, -86, 177, 28, -9, -42, 123, 323, 106, 62, 27, -310, -245, 297, 256, -130, -171, 96, 47, 38, 80, 19, -134, 203, -135, -195, 10, 300, 59, -56, 84, 180, -269, -55, -239, 91, -52, -358, 121, -132, 289, -87, 116, -102, 65, 109, -118, 185, 72, 15, 63, 2, -121, 130, -140, 253, 7, 145, 141, 123, -122, 158, 94, -134, 46, 132, -190, -40, 55, 28, 256, -277, -6, -30, -69, 112, 48, -107, 215, -141, -27, 62, -184, 108, -63, -105, 46, 58, 60, 1, 197, -7, -53, 90, 70, -90, 144, -67, -217, 164, 154, -326, -3, 32, -123, 17, -89, -37, 117, 230, 510, 91, -208, 151, 194, 124, 160, 377, -58, -162, 34, -109, -90, 45, 224, 205, 213, 69, -122, -153, -198, -92, -221, 30, 66, -6, -380, -55, 182, 246, -25, 217, -1, 132, -25, -459, 248, -97, 75, 270, -137, 89, -25, 298, 85, -102, 422, -115, 316, -173, -315, -75, -21, -62, -114]
5431a14Q0Q1K23n80N29m6j75L8K6j58j46J32K37o5k56N81m43j08L46j42l7l4O
5454b5k9J46Q2m37L85m6j77J60r4j45K14L2j3N0J70k81P5k40j15L63Q6M2k4J32
5478C11l94K17k00M12m08J0K21p8K65m06K05J47k3m43q8P8K40j44m1J37m35N36
5500A19r5J19J24l02R4j70J5j43J67j0P6l15J76P4L40J56j21j06j85P3j44j39
5522a97K79j00K9O0N0l02K30j92P8J2K47l34RM08j68J29m82N5R8J38K04k22P0
5545I9k01L74n01M44o5n64M06jP8N2l17L35k83M62m74K21J10l3%J64k99%J5j06
5569h4K20k90L4p1J29K58j83j24N4L7K63l01OJ22j50n9N1J55lj17j98L04n18N96
5593A31L2k87L87j72K26k80J45l67J31lJ02m9j23p5K23K19k00j30P1N9m15K79
$$ y = [-114, -34, 47, 270, -310, 219, 173, -2, 36, 62, -96, -242, -110, 127, 62, -194, 387, -56, -164, 182, 40, 3, -31, -25, -54, 92, 174, -263, 122, 76, -101, 59, -35, -180, 34, 66, 53, 103, 273, -8, 67, -173, -288, 75, 161, 203, 179, 311, -83, 134, -66, 346, -62, -52, 169, 91, 356, -50, 155, 302, 279, -164, -252, -174, 66, -78, -119, 18, -417, 119, 24, 143, 267, -35, 59, -111, -96, -239, -72, -82, -6, -321, -145, -71, 269, 425, 304, 198, 13, 86, -58, -197, 82, -18, 11, 71, 121, -181, 49, -143, -65, -53, 194, -140, -131, 277, 109, 238, -244, -189, -91, 47, 251, 29, 99, -102, 272, -229, 215, 150, -414, -8, -9, 69, 121, -196, 139, -144, 318, -156, 65, 175, 142, 142, 306, 7, 7, 22, -84, 136, -154, -120, -191, -62, 196, 13, -111, -57, -20, 243, -58, -52, 70, -80, -139, -88, 67, 64, -53, -251, 53, -465, 131, 163, -124, 263, 91, 317, 37, 182, -185, -54, -57, 45, -4, -127, -202, 21, 240, 40, -90, -19, 40, -375, -96]
5615i6J16J48n88N02L6P9j73J28l27L02j20j62N4L31k51K84n11j54M91k5J8n7
5637B5k57O4L30l17L80q34N25k34L47k04J29k1K52j63K61l05r3L0kj04M63k6l31
5660h5L24l00J62q8J86l37J0L06l28J39J23j28p9Q9J6k04K29m03O47n11M21k06
5682a7P4J23j69J61K2L76p78J78J04j67K67R9l68J45k62M98k36k01K49r8j71M71
5704C00k69Mk22R1J81L5q6J02j22q2K26J00k59j40J79k13M39l10k81L34l5n7J07
5727B2l63M65l35O9R0M82o11J62K50j36K7j06k0pK35l25k76K95q3J14J11m15M61
5750A06r6j44L67j87K53j21j20J01r4L0j08l1o9J75k12O4K66k61M28r1J6J21m78
5773h5N4J80l4j57r7J76r6J23N6M3k70L2J42j58O9k00L36j1K13m26L01j05j41
$$ y = [-96, 20, 168, -420, 82, 118, 197, 24, 152, -175, 127, 7, -155, -101, 230, -21, 263, -248, -402, 89, 64, 82, 25, -232, -168, 162, -155, 225, -609, -84, -318, 29, -175, -46, -67, 185, 22, 283, -22, -115, -85, -87, -191, 272, 246, -85, 239, -61, 101, 13, 199, -138, -128, 178, -150, -11, 112, -16, -95, -6, 10, -194, 35, -368, 279, -232, 189, -17, 57, 180, 11, 172, 194, 570, -208, -30, 74, -93, 174, 273, -95, 50, -212, 286, 50, -151, 98, 0, -171, 300, 31, 35, -187, -96, 85, 120, 34, 136, 14, -68, 158, 258, -1, -141, 38, -175, 264, -46, -327, 7, -28, -85, 22, -341, 124, -211, -142, -52, 430, -181, -19, 231, 95, 122, 16, -4, -11, 224, -101, -377, -82, -165, -51, 60, -355, 106, 10, -134, 233, 46, 299, 178, 58, 159, 65, 95, -13, -44, -113, 62, -150, -86, 180, -81, 347, 256, 272, 393, -85, -31, 149, 115, -42, -139, 37, -59, 64, 120, 163, -107, -75, 67, -91, -22, -222, 114, 103, 316, -110, 191, 86, -55]
5796e5j7j6Q9K31j62m35L87l4j98K3R3k61M38k34K9J87j97J86j0r3l26N61J44
5819C30k09l19K07j41L69j43Q0n07J58L94j94k02J31k23L84l16J53k0L39l41j38
5840b08J19K15l38L30k07j1K81l93J19P1K36j04n99J88M87k13J28l27R4K00n8
5861A0Q0j08j8L0Jq7J02J12N0J45k9Nn39J14N4K04l63J15J96j46J96P7n54M21
5885F8j8N9j65p5J24n05L55M11j4k35k1J04J16n01P19k01j63j95K43j82m8PL49
5908B32r7j72K71j89l2N49p60K34K02j37j11j81J33K55k49J27p2K62j47l3N1k81
5930a45K74l71K37j97M35k97K7pj20J01R7J63j35K8J32l97L13o4J12j88n0J69
5952A17n2j10J67J22l30J51K20o92J96L46J33l74J4K00k09L60k29o8K51j61J81
$$ y = [-55, -72, -88, 1, 232, 70, -365, 22, -12, -210, -187, -94, -355, 83, -151, -122, 65, -132, 54, 44, -49, -375, 186, 330, 121, -198, 9, -132, 237, 94, 174, -333, -175, 219, 25, -177, -46, -269, 115, -201, -48, -68, 271, -70, -208, -89, 126, -212, 118, -89, -100, 181, -212, -93, -22, 214, 110, -489, -301, 186, -27, 101, -226, -132, 68, 10, 90, -18, -36, -6, -5, -92, 10, 122, 172, 317, 288, 293, -246, -132, -78, 126, -237, -122, 74, -72, 124, 201, -353, 68, 50, 109, -56, -131, -7, -512, -157, 254, 240, 5, -16, 88, 204, -297, 422, 221, 58, -137, 106, -76, -124, -117, 232, 135, -37, 234, 45, 13, 562, -198, 36, 238, 101, -10, -191, -58, 197, -52, 75, 3, 265, 118, 85, 136, -145, 129, -242, -5, -202, 233, -64, -37, -44, -164, -63, 34, 197, 62, 90, 222, -175, 138, 74, 186, -2, -52, 117, 65, -45, 122, 244, -86, 65, 285, -407, -211, 135, 268, -106, -92, 108, -101, 259, 30, -38, 213, 52, 233]
5973B33n1k46L65l56M2l4k03L02j7l4K33l66K96n7j04O7R3K9j45N2j3j53Ol58
5997d19N05L2j19l0l76N42Mk06j9L6k3J18K03k82J90j80J97k40O3K29j01k69O1
6020h4L74j6l45J70O8j32k76L70k76J8N7K38K0K6j82K95m15LL60j2j53J8j69K03
6044A60p2l01L08j57J29j08j32l0O5O9P1P8K28j52m95L11J29k26K6J43K02o4k7
6067A55m22K80K25l31J34j02J43k9r4M2m8J38R9N5k26J96k37k34Q2P8l5K04j63
6090i0j56k37J99K25L17k55J88l55p6J98K3m8L11m13J37k11L68J37j92J32k95
6111i3P3j13N25l03o8J39j18K75o58J78N41k92j37L32l11J02j3m5p9o6L53l41
6133a19K68k37j71L68j10Q9m8K72l44J11O1k2K1J3J97k10k8j41l21K75k0n7kJ93
$$ y = [233, 182, -64, 301, -55, -13, -47, -250, 52, 35, 1, 234, -132, 164, 107, 3, 70, 163, 192, 47, 99, 86, -67, -61, -419, 86, 118, -1, -31, -407, 135, 139, -67, -86, -50, -73, 45, 248, -34, 156, -24, 173, -67, -4, 225, 124, -145, -84, 290, 274, -71, 99, 167, 35, -241, 129, -147, -129, -72, 166, 186, 212, 30, 325, -90, -87, 273, 261, 108, 126, -43, 160, 88, -213, 95, -62, 67, -41, -173, -203, -138, -69, 2, 80, 308, 156, -339, -28, 101, -125, -99, 44, 246, 182, 155, -267, 13, 238, -93, 41, -61, 82, 53, -41, 1, -47, 91, 190, 245, 19, 215, -22, -256, -174, -96, -131, 73, -90, -246, -483, -284, -59, 258, 3, 191, -164, -240, -42, -19, -67, 244, -169, -32, -243, 125, 262, 70, 202, -93, -20, -133, 392, 89, 21, 160, 42, 317, -341, -163, 378, 86, -51, 281, -30, 72, 59, 14, -65, -131, 222, -119, 149, -88, -259, 109, -1, 88, 40, 312, -32, 79, 140, 118, 139, 152, 349, 139, 111, -30, -351, -76, -96, -153, -155, 38]
6157C8J89k30O1l49M02k10J30QO9K66l80J23p4K79k12m01L17j3r3J82M52n84k10
6180b40j17L83n8K0M0N3k08J22nj35K46o0n40N47j80J66j41PNL97j44l84K91j97
6204a32M47o0k27K38k06k52L87l7j39J83K14k35Q0k74q7J58K03j17m6q7j43J7
6226a15j0K32J29p5J06k62m63N43j18J65k58K18M7l52J56o0K68j10j22j61K31
6247a1j81P2P2j44J78K4j55L03P7J13k68M5j87OJ50l8J21J1k57M7J12p2L3J49
6271B00j71l0j28K90o9k82J20J27l82L11M0j34j01Jp1J81J19K73l08k04J58J22
$$ y = [38, 227, -3, 58, -291, 111, -99, 31, 39, 108, 374, -6, 117, 43, 322, 110, -291, 26, 13, -80, 102, 554, -30, -240, -357, 26, -32, -12, 28, 81, -127, -5, -10, -145, 101, 41, -499, 48, -132, 34, -107, -100, -95, 302, 158, -226, 65, -132, 315, 255, 28, 266, 60, -192, 195, 158, 19, 202, 416, 181, 261, -13, -100, 58, 261, 144, 98, 11, -132, -115, -125, 107, 236, 161, 267, 5, -458, 85, -33, 132, -126, 92, 139, -213, -57, -117, 151, 41, -81, -242, -11, -192, -120, -48, -192, -14, 10, -145, 158, 235, 348, 80, 125, -62, -56, 94, 56, 177, 188, -69, -22, 90, 18, 51, 200, 29, -1, -129, 161, 92, -190, -70, 57, -325, -14, 26, -108, -209, -208, -279, -98, 21, 294, -14, -218, -60, 62]
$$ [...]
8191I4
##END NTUPLES=NMR FID
##END=
