##TITLE=1H_DE-76k_d3Cl_TFA
 CDCl3
 8 sc, 
 28.11.2024
##JCAMPDX= 6.0         $$ Bruker NMR JCAMP-DX V2.0
##DATA TYPE= NMR FID
##DATA CLASS= NTUPLES
##ORIGIN= UXNMR, Bruker Analytische Messtechnik GmbH
##OWNER= root
$$ XWIN-NMR		Version 3.5
$$ Thu Nov 28 13:48:41 2024 Russian Standard Time (UT+4h)  she@DPX200
##.OBSERVE FREQUENCY= 200.1315
##.OBSERVE NUCLEUS= ^1H
##.DELAY= (6, 6)
##.ACQUISITION MODE= SIMULTANEOUS
##.ACQUISITION SCHEME= undefined
##.AVERAGES= 8
##.DIGITISER RES= 18
##SPECTROMETER/DATA SYSTEM= spect
##.PULSE SEQUENCE= zg30
##.SOLVENT NAME= CDCl3
##.SHIFT REFERENCE= (INTERNAL, CDCl3, 0, 15.7039)
##AUDIT TRAIL= $$ (NUMBER, WHEN, WHO, WHERE, WHAT)
$$ ##TITLE= Audit trail, XWIN-NMR		Version 3.5
$$ ##JCAMPDX= 5.01
$$ ##ORIGIN= Bruker BioSpin GmbH
$$ ##OWNER= she
$$ F:/spectra/data/she/nmr/H-F/1/audita.txt
$$ ##AUDIT TRAIL=  $$ (NUMBER, WHEN, WHO, WHERE, WHAT)
(   1,<2024-11-28 13:47:34.95 +0400>,<she>,<DPX200>,
      <created by zg, POWCHK disabled, PULCHK disabled
       configuration hash MD5:
       00 E9 B6 7A A2 85 ED C7 34 08 36 98 17 FE 4E 26
       data hash MD5: 16K
       DB 0E DA 02 D9 F2 10 A2 8A 6C 2F C2 9A FC F6 FD>)
$$ ##END=
$$ 
$$ hash MD5
$$ 3E E7 74 17 32 F4 1A F0 50 E9 DE 6D 33 39 BA DD
##$RELAX= 
##$RELAX= 
##$RELAX= 
##$RELAX= 
##$RELAX= 
##$RELAX= 
$$ Bruker specific parameters
$$ --------------------------
##$DU= <F:/spectra>
##$EXPNO= 1
##$NAME= <H-F>
##$PROCNO= 1
##$TYPE= <nmr>
##$USER= <she>
##$AMP= (0..31)
100 100 100 100 100 100 100 100 100 100 100 100 100 100 100 100 100 100 
100 100 100 100 100 100 100 100 100 100 100 100 100 100 
##$AQSEQ= 0
##$AQ_mod= 1
##$AUNM= <au_zg>
##$AUTOPOS= <>
##$BF1= 200.13
##$BF2= 200.13
##$BF3= 200.13
##$BF4= 200.13
##$BF5= 200.13
##$BF6= 200.13
##$BF7= 200.13
##$BF8= 200.13
##$BYTORDA= 1
##$CFDGTYP= 0
##$CFRGTYP= 5
##$CHEMSTR= <none>
##$CNST= (0..31)
1 1 145 1 1 1 1 1 1 1 1 1 1 1 1 1 1 1 1 1 1 1 1 1 1 1 1 1 1 1 1 1 
##$CPDPRG= <>
##$CPDPRG1= <>
##$CPDPRG2= <>
##$CPDPRG3= <>
##$CPDPRG4= <mlev>
##$CPDPRG5= <mlev>
##$CPDPRG6= <mlev>
##$CPDPRG7= <mlev>
##$CPDPRG8= <mlev>
##$CPDPRGB= <>
##$CPDPRGT= <>
##$D= (0..31)
0 1.2 0 0 0 0 0 0 0 0.06 0 0.03 0 0 0 0 0.0002 0 0 0 0 0 0 0 0 0 0 0 0 
0 0 0 
##$DATE= 1732787254
##$DBL= (0..7)
120 120 120 120 120 120 120 120 
##$DBP= (0..7)
150 150 150 150 150 150 150 150 
##$DBP07= 0
##$DBPNAM0= <>
##$DBPNAM1= <>
##$DBPNAM2= <>
##$DBPNAM3= <>
##$DBPNAM4= <>
##$DBPNAM5= <>
##$DBPNAM6= <>
##$DBPNAM7= <>
##$DBPOAL= (0..7)
0.5 0.5 0.5 0.5 0.5 0.5 0.5 0.5 
##$DBPOFFS= (0..7)
0 0 0 0 0 0 0 0 
##$DE= 6
##$DECBNUC= <off>
##$DECIM= 24
##$DECNUC= <off>
##$DECSTAT= 4
##$DIGMOD= 1
##$DIGTYP= 9
##$DL= (0..7)
0 120 120 120 120 120 120 120 
##$DP= (0..7)
150 150 150 150 150 150 150 150 
##$DP07= 0
##$DPNAME0= <>
##$DPNAME1= <>
##$DPNAME2= <>
##$DPNAME3= <>
##$DPNAME4= <>
##$DPNAME5= <>
##$DPNAME6= <>
##$DPNAME7= <>
##$DPOAL= (0..7)
0.5 0.5 0.5 0.5 0.5 0.5 0.5 0.5 
##$DPOFFS= (0..7)
0 0 0 0 0 0 0 0 
##$DQDMODE= 0
##$DR= 18
##$DS= 0
##$DSLIST= <SSSSSSSSSSSSSSS>
$$ [...]
##$SUBNAM2= <"">
##$SUBNAM3= <"">
##$SUBNAM4= <"">
##$SUBNAM5= <"">
##$SUBNAM6= <"">
##$SUBNAM7= <"">
##$SUBNAM8= <"">
##$SUBNAM9= <"">
##$SW= 24.0689530833862
##$SWIBOX= (0..15)
0 0 2 0 0 0 0 0 0 0 0 0 0 0 0 0 
##$SW_h= 4816.95568400771
##$TD= 16384
##$TD0= 1
##$TE= 0
##$TE2= 300
##$TE3= 300
##$TEG= 300
##$TL= (0..7)
0 120 120 120 120 120 120 120 
##$TP= (0..7)
150 150 150 150 150 150 150 150 
##$TP07= 0
##$TPNAME0= <>
##$TPNAME1= <>
##$TPNAME2= <>
##$TPNAME3= <>
##$TPNAME4= <>
##$TPNAME5= <>
##$TPNAME6= <>
##$TPNAME7= <>
##$TPOAL= (0..7)
0.5 0.5 0.5 0.5 0.5 0.5 0.5 0.5 
##$TPOFFS= (0..7)
0 0 0 0 0 0 0 0 
##$TUNHIN= 0
##$TUNHOUT= 0
##$TUNXOUT= 0
##$USERA1= <user>
##$USERA2= <user>
##$USERA3= <user>
##$USERA4= <user>
##$USERA5= <user>
##$V9= 5
##$VALIST= <valist>
##$VCLIST= <CCCCCCCCCCCCCCC>
##$VD= 0
##$VDLIST= <DDDDDDDDDDDDDDD>
##$VPLIST= <PPPPPPPPPPPPPPP>
##$VTLIST= <TTTTTTTTTTTTTTT>
##$WBST= 1024
##$WBSW= 4
##$XGAIN= (0..3)
0 0 0 0 
##$XL= 0
##$YL= 0
##$YMAX_a= 213513
##$YMIN_a= -157731
##$ZGOPTNS= <>
##$ZL1= 120
##$ZL2= 120
##$ZL3= 120
##$ZL4= 120
##$ABSF1= 10
##$ABSF2= 0
##$ABSG= 5
##$ABSL= 3
##$ALPHA= 0
##$AQORDER= 0
##$ASSFAC= 0
##$ASSFACI= 0
##$ASSFACX= 0
##$ASSWID= 0
##$AUNMP= <proc_1d>
##$AZFE= 0.1
##$AZFW= 0.1
##$BCFW= 1
##$BC_mod= 2
##$BYTORDP= 1
##$COROFFS= 0
##$CY= 11.3945322036743
##$DATMOD= 1
##$DC= 2
##$DFILT= <>
##$DTYPP= 0
##$F1P= 15.6554695791079
##$F2P= 12.8336369535428
##$FCOR= 0.5
##$FTSIZE= 0
##$FT_mod= 4
##$GAMMA= 1
##$GB= 0.15
##$INTBC= 1
##$INTSCL= 1
##$ISEN= 128
##$LB= 0.24
##$LEV0= 0
##$LPBIN= 0
##$MAXI= 10000
##$MC2= 0
##$MEAN= 0
##$ME_mod= 0
##$MI= 1.114404
##$NCOEF= 0
##$NC_proc= 0
##$NLEV= 6
##$NOISF1= 3.799351
##$NOISF2= 2.8
##$NSP= 1
##$NTH_PI= 0
##$NZP= 0
##$OFFSET= 15.70392
##$PC= 1
##$PHC0= -26718.67
##$PHC1= 18.58745
##$PH_mod= 1
##$PKNL= yes
##$PPARMOD= 0
##$PSCAL= 0
##$PSIGN= 0
##$REVERSE= no
##$SF= 200.130013532006
##$SI= 16384
##$SIGF1= 3
##$SIGF2= 2
##$SINO= 400
##$SIOLD= 16384
##$SREGLST= <1H.CDCl3>
##$SSB= 0
##$STSI= 0
##$STSR= 0
##$SW_p= 3612.71676300578
##$SYMM= 0
##$S_DEV= 0
##$TDeff= 0
##$TDoff= 0
##$TI= <>
##$TILT= no
##$TM1= 0
##$TM2= 0
##$TOPLEV= 0
##$USERP1= <user>
##$USERP2= <user>
##$USERP3= <user>
##$USERP4= <user>
##$USERP5= <user>
##$WDW= 1
##$XDIM= 8192
##$YMAX_p= 0
##$YMIN_p= 0
$$ End of Bruker specific parameters
$$ ---------------------------------
##NTUPLES= NMR FID
##VAR_NAME=  TIME,          FID/REAL,        FID/IMAG
##SYMBOL=    X,             R,               I
##VAR_TYPE=  INDEPENDENT,   DEPENDENT,       DEPENDENT
##VAR_FORM=  AFFN,          ASDF,            ASDF
##VAR_DIM=   8192,          8192,            8192
##UNITS=     SECONDS,       ARBITRARY UNITS, ARBITRARY UNITS
##FACTOR=    0.0002076,     1,               1
##FIRST=     0,             0,               0
##LAST=      1.7004516,     0,               0
##MIN=       0,             -157731,         0
##MAX=       1.7004516,     213513,          0
$$ Real data points
##PAGE= N=1
##DATA TABLE= (X++(R..R)), XYDATA
$$ [...]
$$ plain form
2337 183 128 240 61 380 85 62 59 194 48 609 -283 -1 173 -95 0 -16 9 241 362 -111 427 -282
2359 -282 205 214 -202 -263 409 -651 -915 -820 -341 -273 396 5 -361 372 -324 -640 -96 410 -373 281 -307
2380 -307 -241 244 214 -32 -57 -47 5 32 -50 -337 -14 -338 46 -429 -66 -185 -383 -197 196 98 86 -4 -105
2403 -105 -261 -53 -275 -426 13 -66 -97 36 -21 -108 -112 -574 -214 -138 -443 -49 154 -65 119 -158 -187 -181 -129 673
2427 673 75 602 19 -35 -183 -26 28 -131 162 -102 191 14 84 -170 111 138 -140 102 245 97 -147
2448 -147 -48 -12 2 275 246 257 53 83 135 124 127 198 -77 -375 238 287 22 187 89 318 366 51 -20 -90 259
2473 259 159 -39 56 262 109 66 366 41 231 -1312 -852 -261 -286 -176 597 -172 850 -317 -242 23
2493 23 -314 -57 -97 634 36 -194 -493 213 -1050 -193 -171 360 634 481 30 -460 -9 -860 482 -478
$$ packed form
2337A83n5J12j79L19k95k3lJ35j46N61q92K82J74k68R5j6K5K32J21m73N38p09
2359b82M87Rm16o1O72j060k64R5M79O8O69l91l66P33o96l16N44N06p83O54n88
2380c07O6M85l0k46k5J0N2K7q2k87L23l24L84m75L63j19j98J86L93r8j2r0j01
2403a05j56K08k22j51M39p9l1J33n7q7mm62L60P6l05L94K03k19J84k77k9ON2Q02
2427F73n98N27n83n4j48J57N4j59K93k64K93j77P0k54K81K7k78K42J43j48k44
2448a47R9L6J4K73k9J1k04L0N2j1LP1k75k98O13M9k65J65r8K29M8l15p1p0L49
2473B59j00j98R5K06j53m3L00l25J90j543M60N91k5J10P73p69J022j167P5K65
2493B3l37K57m0P31n98k30k99P06j263Q57K2N31K74j53m51m90M51q51J342r60
$$ plain form
2513 -478 -155 133 -192 72 100 96 -61 203 -254 14 -235 -69 474 -325 -72 328 -152 -224 -692 -286 549
2534 549 700 -119 137 129 -684 -48 -308 212 683 16 -34 -175 -268 -292 330 435 -203 -1067 -17 -139 529
2555 529 188 229 -113 -245 258 620 -256 -322 263 -482 -158 -424 259 -315 255 1112 -27 673 -343 108
2575 108 -285 66 141 -379 475 273 203 817 -192 -24 440 -175 310 510 -96 768 -148 -359 619 707 -595
2596 -595 497 946 63 14 -191 989 -321 157 84 176 1027 417 57 542 349 98 284 -131 -587 47
2616 47 321 -134 711 67 812 203 -214 74 103 193 -55 47 -72 136 68 0 -320 288 177 -84 -324 184
2638 184 598 232 653 -310 210 540 -60 -390 736 169 -734 643 -722 -1021 -3 399 114 241 -185
2657 -185 88 356 -162 -211 321 -29 -280 -259 -985 -1041 210 24 -944 515 181 -42 131 149 -39 183 -211
$$ packed form
2513d78L23K88l25K64K8mj57K64m57K68k49J66N43p99K53M00m80p2m68M06Q35
2534E49J51q19K56qq13O36k60N20M71o67n0j41r3k4O22J05o38q64J050j22O68
2555E29l41M1l42j32N03L62q76o6N85p45L24k66O83n74N70Q57j139P00j016M51
2575A08l93L51P5n20Q54k02p0O14j009J68M64o15M85K00o06Q64r16k11R78Q8j302
2596e95J092M49q83m9k05J180j310M78p3R2Q51o10l60M85j93k51J86m15m56O34
2616D7K74m55Q45o44P45o09m17K88K9R0k48J02j19K08o8o8l20O08j11k61k40N08
2638A84M14l66M21r63N20L30o00l30J126n67r03J377j365k99J018M02k85J27m26
2657a85K73K68n18m9N32l50k51K1p26n6J251j86r68J459l34k23J73J8j88K22l94
$$ plain form
2678 -211 -140 -13 305 216 43 447 -268 136 -75 -268 146 202 -76 291 156 374 -337 199 270 -27 332
2699 332 -46 109 -134 -46 426 174 433 756 -311 -68 176 5 190 -218 -156 684 271 122 190 310 553
2720 553 88 -108 131 -718 322 265 -201 -308 142 79 205 -50 -184 -132 23 -112 263 -40 -175 175 -77
2741 -77 31 134 159 -359 -116 90 331 -148 243 -514 -245 198 146 -182 -31 -242 182 -589 -441 119 333
2762 333 355 -351 -651 -121 284 -481 -61 -342 11 -81 300 -427 -287 -352 -1035 -377 -119 -206 110 -4 -147
2783 -147 -42 2 120 47 -170 173 -50 62 294 352 -224 -437 -44 -339 133 147 23 51 144 110 -139 -201 -323
2806 -323 13 113 7 128 -44 163 -40 -321 42 156 30 -19 -172 69 -19 269 119 -331 64 20 219
2827 219 488 -291 199 -498 252 -331 -107 -240 -584 -695 -238 -456 336 -119 83 578 -40 770 589 -386
$$ packed form
2678b11P1J27L18q9j73M04p15M04k11j93M14N6k78L67j35K18p11N36P1k97L59
2699C32l78J55k43Q8M72k52K59L23j067K43K44j71J85m08O2Q40m13j49O8J20K43
2720E53m65j96K39q49J040n7m66j07M50o3J26k55j34N2J55j35L75l03j35L50k52
2741g7J08J03K5n18K43K06K41m79L91p57K69M43n2l28J51k11M24p71J48N60K14
2762C33K2p06l00N30M05p65M20k81L53r2L81p27J40o5o83O58K58q7L16j14j43
2783a47J05M4J18p3k17L43k23J12K32N8n76k13L93k95M72J4j24K8R3l4k49o2j22
2806c23L36J00j06J21j72K07k03k81L63J14j26m9j53K41q8K88j50m50L95m4J99
2827B19K69p79M90o97P50n83K24j33l44j11M57k18P92m55K02M95o18Q10j81r75
$$ plain form
2847 -386 197 57 472 -826 -344 -375 -29 482 -179 565 -520 -462 -591 -154 772 201 -79 -1186 -184
2866 -184 685 134 550 102 169 206 687 11 1003 266 667 106 -332 831 553 -8 1463 1792 -1593 -1005
2886 -1005 78 447 -174 1471 736 418 1059 -369 -1107 -336 91 -710 240 19 434 -351 365 125 -31
2905 -31 -80 11 121 562 446 -269 113 808 171 -225 -180 -256 -836 43 536 -292 -16 -55 -339 479 107 -35
2927 -35 -252 253 -369 -294 -526 -824 -522 -100 78 -401 -228 501 -129 -213 317 -290 -67 381 -173 -298 321
2948 321 887 260 106 224 6 -400 285 -73 -52 21 -226 -255 -237 -307 -518 -117 32 299 274 -213 -267 -127
2970 -127 169 -24 -50 -165 -52 217 -35 -163 -261 39 381 -188 304 -112 170 135 -12 24 -3 -81 -165 171
2992 171 149 169 -385 116 -145 -108 -30 357 280 88 244 207 134 -58 138 -143 300 -71 226 273 -65 169 252
$$ packed form
2847c86N83j40M15j298M82l1L46N11o61P44j085N8j29M37R26n71k80j107J002
2866a84Q69n51M16m48O7L7M81o76R92p37M01n61m38J163k78n61J471L29l385N88
2886a005J083L69o21J645p35l18O41j428p38P71M27q01R50k21M15p85P16k40j56
2905c1m9R1J10M41j16p15L82O95o37l96M5p6n80Q79M93q28K76l9k84Q18l72j42
2927c5k17N05o22P5k32k98L02M22J78m79J73P29o30q4N30o07K23M48n54j25O19
2948C21N66o27j54J18k18m06O85l58K1P3k47k9J8p0k11M01J49K67k5m87n4J40
2970a27K96j93k6j15J13K69k52j28r8L00L42n69M92m16K82l5j47L6k7p8q4L36
2992A71k2K0n54N01k61L7P8L87p7j92J56l7p3j92J96k81M43l71K97M7l38K34Q3
$$ plain form
3015 252 -382 -368 424 -89 210 -41 255 205 -436 -316 292 272 -60 -95 -51 -319 52 96 -151 -45 -247 -47
3037 -47 22 78 148 102 -83 22 285 -19 -96 189 -18 49 7 -153 -55 137 -15 232 441 96 -41 49 147 -97
3061 -97 157 140 150 315 323 -121 109 -172 -289 16 -369 125 -124 423 -73 -33 271 -20 -61 -19 16 -224 142
3084 142 -79 18 29 332 80 267 57 47 101 -16 -169 143 103 214 -59 3 56 37 105 -100 -339 -47 309
3107 309 -22 -247 195 -69 -167 153 8 -54 44 380 96 -129 -13 123 27 267 107 -271 -192 -196 223 -507
3129 -507 -13 101 158 -116 -418 -202 173 -14 813 -124 339 2 -29 546 368 -106 -81 371 -41 -66 231
3150 231 -124 295 -2 -94 129 -87 -21 271 51 230 15 -130 -275 -59 85 176 -46 184 -151 -41 -649
3171 -649 170 -13 139 985 69 273 207 315 -27 566 336 -30 191 -471 473 -502 717 -468 -283 628
$$ packed form
3015B52o34J4P92n13K99k51K96n0o41J20O08k0l32l5M4k68L71M4k47J06k02K00
3037d7O9N6P0m6j85J05K63l04p7K85k07O7m2j60R8J92j52K47K09l45j37R0R8k44
3061i7K54j7J0J65Qm44K30k81j17L05l85M94k49N47m96M0L04k91m1M2L5k40L66
3084A42k21R7J1L03k52J87k10j0N4j17j53L12m0J11k73O2N3j9O8k05k39K92L56
3107C09l31k25M42k64r8L20j45o2R8L36k84k25J16J36r6K40j60l78P9mM19p30
3129e07M94J14N7k74l02K16L75j87Q27r37M63l37l1N75j78m74K5M52m12k5K97
3150B31l55M19k97r2K23k16O6K92k20J79k15j45j45K16J44R1k22K30l35J10o08
3171f49Q19j83J52Q46r16K04o6J08l42N93k30l66K21o62R44r75J219j185J85R11
$$ plain form
3191 628 96 -145 -131 843 746 -524 -427 -118 -37 -264 98 1020 10 405 -139 56 416 207 -413 -215 -289
3212 -289 -666 1016 601 -560 92 1069 649 -169 -207 -1023 -111 95 -873 -1382 -319 -455 379 -21 -483
3231 -483 710 -426 510 -99 -92 -482 139 618 131 -224 285 274 -323 336 -473 366 208 383 -987 443
3251 443 649 434 262 62 -55 726 259 -200 -81 393 78 518 -411 -134 -143 199 311 512 785 -106 128
3272 128 -573 -41 -98 -390 368 -42 -61 -372 -955 162 85 -142 131 137 -80 200 -290 -265 180 101 -146 38
3294 38 -15 -190 -236 38 -325 162 -126 68 -54 27 236 90 118 182 71 -238 -141 -219 125 211 -319 -215 -96
3317 -96 -386 552 50 -115 198 -34 -43 435 -475 406 -196 -527 -203 -53 242 -124 -468 760 -468 -151
3337 -151 -126 -1081 172 -530 -966 219 -344 -563 -405 -345 -469 -960 -115 332 102 -1080 0 835 223
$$ packed form
3191F28n32k41J4R74r7j270R7L09Q1k27L62R22j010L95n44J95L60k09o20J98p4
3212b89l77J682m15j161O52R77m20q18l8q16R12K06r68n09J063j36Q34m00m62
3231d83J193j136R36o09Pl90O21M79m87l55N09j1n97O59q09Q39j58J75j370J430
3251D43K06k15j72k00j17P81m67m59J19M74l15M40r29K77rL42J12K01K73q91K34
3272A28p01N32n7k92P58m10j9l11n83J117p7k27K73Ok17K80m90K5M45p9k47J84
3294C8n3j75m6K74l63M87k88J94j22Q1K09j46K8O4j11l09R7p8L44Q6n30J04J19
3317i6k90R38n02j65L13k32rM78r10Q81o02l31L24J50K95l66l44J228j228L17
3337a51K5r55J253p02m36J185n63k19J58O0j24m91Q45M47k30j182J080Q35o12
$$ plain form
3356 223 -507 401 -134 -96 9 275 135 104 -258 -116 -412 -226 -143 -130 -561 -304 14 56 -101 -8 -31 -190
3378 -190 11 61 183 190 167 -109 -315 -475 -70 107 -240 407 274 98 98 4 -92 142 28 -16 325 -46 25
3401 25 -146 -22 -273 123 49 601 -488 -102 -828 -54 97 173 79 -655 31 18 -72 140 -3 367 277 -67
3423 -67 -208 -135 28 51 -129 -114 166 -162 -97 238 -161 61 -247 176 -286 -86 -510 -113 284 2 -374 36
3445 36 -23 146 -53 -66 -26 -259 198 -43 -300 -82 218 -58 429 -121 -330 83 -332 -84 20 -66 127 126
3467 126 1 52 46 -221 186 -206 -26 -123 655 -214 -440 687 -318 445 6 418 -711 -271 -441 -99
3487 -99 -916 310 460 -213 -287 -828 422 370 -467 47 165 -1414 337 997 -553 -554 766 -404 303
3506 303 -20 -319 311 555 -181 29 -300 -566 219 1024 394 543 -609 451 -534 299 403 161 -10
$$ packed form
3356B23p30R08n35L8J05K66j40l1l62J42k96J86Q3J3m31K57L18M2j57R3k3j59
3378a90K01N0J22Pk3k76k06j60M05J77l47O47j33j76%r4r6K34j14m4L41l71P1
3401B5j71J24k51L96p4N52j089L86p26P74J51P6r4p34O86j3r0K12j43L70r0l44
3423f7j41P3J63K3j80J5K80l28O5L35l99K22l08M23m62K00m24L97L97k82l76M10
3445C6n9J69j99j3M0k33M57k41k57K18L00k76M87n50k09M13m15K48J04q6J93j
3467A26j25N1ok67M07l92J80r7P78q69k26J127j005P63m39M12j129M40j70L42
3487i9q17J226J50o73p4n41J250n2q37N14J18j579J751O60j550jJ320j170P07
3506C03l23k99O30K44p36K10l29k66P85Q05o30J49j152J060r85Q33J04k42j71
$$ plain form
3525 -10 -170 606 -551 -1136 316 321 -965 570 -489 109 379 -717 -402 -186 -457 -10 -530 366 -175
3544 -175 -215 1081 299 -697 737 147 1198 -518 -469 43 694 139 -198 17 -12 -34 -584 207 23 102
3564 102 -121 156 -37 -151 -116 -76 27 149 -107 -168 195 -267 90 -186 -86 -2 79 92 -172 81 245 158
3586 158 187 -96 -223 -121 29 -29 -72 1 68 4 -105 -95 -78 -207 -1032 430 26 160 -191 212 731 -488
3608 -488 496 -68 -203 357 347 -67 83 -97 20 366 -163 -247 -115 187 188 -53 -69 -287 -18 -17 170 258 155
3631 155 18 202 -330 -689 -213 -387 79 -78 194 50 -540 54 211 -698 260 -456 -175 30 -313 175
3651 175 -123 58 -363 267 20 -214 254 328 41 165 192 -41 52 -156 -9 -61 189 76 -103 -237 -164 -230
3673 -230 15 209 3 -72 -126 -187 22 -182 76 4 -132 287 -148 13 -12 -117 14 -225 -8 -134 -203 -197 -651
$$ packed form
3525a0j60P76j157n85J452Nj286J535j059N98K70j096L15K16k71M47n20Q96n41
3544a75m0J296p82r96J434n90J051j716M9N12O51n55l37K15k9k2n50P91j84P9
3564A02k23K77j93j14L5M0J03J22k56o1L63m62L57k76J00Q4Q1J3k64K53J64q7
3586A58K9k83j27J02J50n8m3P3O7o4j09J0J7j29q25J462m04J34l51M03N19j219
3608d88R84n64j35N60j0m14J50j80J17L46n29q4J32L02Jk41j6k18K69JJ87Q8j03
3631A55j37J84n32l59M76j74M66j57K72j44n90N94J57r09R58p16K81K05l43M88
3651A75k98J81m21O30k47k34M68P4k87J24K7k33R3k08J47n2K50j13j79j34P3o6
3673b30K45J94k06p5n4o1K09k04K58p2j36M19m35J61k5j05J31k39K17j26o9Om54
$$ plain form
3696 -651 159 292 292 181 -38 278 -118 538 181 195 455 250 549 -678 358 -289 -176 -292 -131 -721
3716 -721 -117 634 -419 981 138 -685 1063 71 -227 -618 1089 -328 146 666 -525 1711 -787
3733 -787 -1387 -92 306 -427 330 106 169 100 254 -104 10 24 290 28 -143 -88 114 156 -267 333 236 -13
3755 -13 -243 85 54 182 83 71 157 174 -176 85 98 -23 36 140 58 254 -141 -20 -18 38 -154 -240 56 0 -28
3780 -28 54 -22 150 268 264 -35 36 168 -382 188 339 -2 106 73 -122 0 173 206 -78 74 182 -45 263
3803 263 -93 183 -156 -125 -249 110 -73 135 -129 37 -354 450 252 484 -53 424 -379 -75 -350 -98
3823 -98 706 588 406 -126 200 653 781 -542 -88 192 679 354 579 -450 -467 121 -20 661 -7 -309
3843 -309 896 915 -122 732 329 -249 618 -192 57 -146 199 142 -6 -130 -297 -118 -153 128 126 205 -46
$$ packed form
3696f51Q10J33%j11k19L16l96O56l57J4K60k05K99j227J036o47J13j16J61n90
3716g21O04P51j053J400q43q23J748r92k98l91J707j417M74N20j191K236k498
3733g87o00J295L98p33P57k24O3o9J54l58J14J4K66k62j71N5K02M2m23O00r7k49
3755a3k30L28l1J28r9j2Q6J7l50K61J3j21N9J04q2J96l95J21KN6j92q6K96n6k8
3780b8Q2p6J72J18mk99P1J32n50N70J51l41J08l3j95J22J73L3k84J52J08k27L08
3803B63l56K76l39L1j24L59j83K08k64J66l91Q04j98K32n37M77q03L04k75K52
3823i8Q04j18j82n32L26M53J28j323M54K80M87l25K25j029j7N88j41O81o68l02
3843c09J205J9j037Q54m03n78Q67q10K49k03L45n7j48j24j67J79l5K81kP9k51
$$ plain form
3864 -46 -361 -29 54 18 165 14 -23 210 -266 -446 -111 -1023 -36 -306 -515 -224 13 400 195 779 -96
3885 -96 318 150 88 -275 215 142 141 83 -191 -71 297 -69 74 158 56 -124 769 87 149 322 191 -84 11
3908 11 -502 -176 188 -13 246 -228 -101 -174 -109 -171 9 61 -271 300 -275 -58 -93 200 -161 -220 -182 18 229
3931 229 -32 195 -184 166 -268 -120 172 406 327 483 667 103 -75 -27 -125 142 107 -9 10 141 -75 250
3953 250 -198 1 99 128 -136 -159 534 462 219 18 -553 181 207 -410 186 -350 -35 -399 36 866 185 -65
3975 -65 -756 -54 142 38 1123 412 -410 156 180 -5 -143 279 -304 -84 -399 -48 -106 147 54 -30 -272
3996 -272 465 -38 31 169 498 312 953 225 -654 693 217 -257 241 175 -85 382 -53 125 -104 210
4016 210 -240 480 51 -397 683 86 109 153 153 610 -41 -822 257 -1280 -276 -723 468 264 2 -37
$$ packed form
3864d6l15L32Q3l6J47j51l7K33m76j80L35r12R87k70k09K91K37L87k05N84q75
3885i6M14j68o2l63M90p3jn8k74J20L68l66J43Q4j02j80Q93o82O2J73j31k75R5
3908A1n13L26L64k01K59m74J27p3O5o2J80N2l32N71n75K17l5K93l61n9L8K00K11
3931B29k61K27l79L50m34J48K92K34p9J56J84n64j78M8r8K67l5j16J9J31k16L25
3953B50m48J99R8K9k64k3O93p2k43k01n71P34K6o17N96n36L15l64M35Q30o81k50
3975f5o91P02J96j04J085p11q22N66K4j85j38M22n83K20l15L51n8K53r3q4k42
3996b72P37n03O9J38L29j86O41p28q79J347m76m74M98o6k60M67m35J78k29L14
4016B10m50P20m29m48J080n97K3M4%M57o51p81J079j537J004m47J191k04k62l9
$$ plain form
4036 -37 449 -428 103 356 76 -15 -268 796 -32 776 193 -279 -560 355 -613 158 287 -75 520 410
4056 410 -86 868 -155 83 -302 -120 -20 -547 685 -74 393 556 130 652 -9 -64 150 -197 -316 702
4076 702 -284 178 -528 -110 178 319 373 -345 -249 447 -415 556 -520 -61 -486 261 -357 -316 726 19
4096 19 505 -240 -463 485 -716 -16 46 -82 480 -142 -237 -90 134 23 547 -152 -160 -737 934 -271 812
4117 812 -105 97 257 981 483 -505 -365 119 -933 -626 394 -26 -269 361 288 -246 -287 -302 367 250
4137 250 -229 191 171 -25 -141 -117 -6 199 -719 -72 699 240 -119 142 -117 -71 391 98 -68 284 -12
4158 -12 -227 390 81 124 -25 -229 64 22 180 97 -213 -10 343 5 141 -55 67 200 -14 137 -42
4179 -42 392 46 11 -49 453 28 831 355 167 707 -54 -506 15 -46 -905 -284 -533 -711 -266 -103 -431
$$ packed form
4036c7M86q77N31K53k80r1k53J064q28Q08n83m72k81R15r68P71J29l62N95j10
4056D10m96R54j023K38l85J82J00n27J232p59M67J63m26N22o61n5K14l47j19J018
4076G02r86M62p06M18K88J41N4p18R6O96q62R71j076M59m25P47o18M1J042p07
4096A9M86p45k23R48j201P00O2j28N62o22r5J47K24j11N24o99qn77J671j205J083
4117H12r17K02J60P24m98r88J40M84j052L07J020m20k43O30p3n34m1j5O69j17
4137B50m79M20k0j96j16K4J11K05r18O47P71m59l59K61k59M6M62k93j66L52k96
4158a2k15O17l09M3j49k04K93m2J58q3l10K03L53l38J36j96J22J33k14J51j79
4179d2M34l46l5o0N02m25Q03m76j88N40p61m52N21o1q59O21k49j78M45J63l28
$$ plain form
4200 -431 355 49 385 -152 -80 259 130 -128 163 578 -103 -439 -327 -845 608 302 174 92 67 -359 331
4221 331 -146 322 -198 881 889 -385 754 -673 -221 -66 -454 -202 -555 169 -148 -977 63 1081 -28
4240 -28 529 -198 102 128 431 -36 105 -132 -359 -6 -309 244 -58 106 -46 -31 946 39 -48 252 170 -114
4262 -114 -285 -130 -398 -59 -200 -7 475 -30 207 -263 -102 -176 -45 183 286 151 467 894 406 -222
4282 -222 39 -281 118 615 -35 223 -20 -425 76 -279 -45 123 -428 -345 -168 -58 -671 -124 109 -538
4302 -538 343 -114 -239 439 473 3 706 -264 -57 225 221 20 -19 -101 -135 -60 -17 61 -51 184 229 -266 121
4325 121 131 11 -173 -206 166 82 144 134 38 114 217 -90 -29 -26 29 31 -158 34 196 151 -243 304 -102 -170 92
4350 92 -137 893 226 335 575 -56 -205 -874 282 272 229 40 -222 90 161 -254 -74 -44 -132 -385 -186
$$ packed form
4200d31P86l06L36n37P2L39j29k58K91M15o81l36J12n18J453l06j28q2k5m26O90
4221C31m77M68n20J079Qj274J139j427M52J55l88K52l53P24l17q29J040J018j109
4240b8N57p27L00K6L03m67J41k37k27L53l03N53l02J64j52J5R77r07q7L00q2k84
4262a14j71J55k68L39j41J93M82n05K37m70J61p4J31K28J03j35L16M27m88o28
4282b22K61l20L99M97o50K58k43m05N01l55K34J68n51Q3J77J10o13N47K33o47
4302e38Q81m57j25O78L4m70P03r70K07K82mk01l9q2l4P5M3P8j12K35M5m95L87
4325A21J0j20j84l3L72q4O2j0r6P6J03l07O1LN5Kj89J92J62m5l94N47m06o8K62
4350I2k29J030o67J09K40o31j49o69J156j0m3j89k62L12P1m15J80L0q8k53J99
$$ plain form
4371 -186 11 -123 16 143 116 124 -157 -377 151 90 196 -404 -165 257 130 231 -280 294 -64 -149 -504 -269
4393 -269 224 359 189 -331 96 16 135 410 -168 39 448 -299 329 392 -693 360 -245 -420 38 72
4413 72 -312 63 297 233 258 -33 58 -35 -25 -121 12 -73 355 -294 228 232 247 -37 162 -399 448 -221 -155 69
4437 69 -59 137 -150 218 -185 222 -107 -52 117 206 26 68 -176 -20 -87 -294 -186 175 154 -150 -63 -78 -239
4460 -239 -177 74 28 -132 281 -247 -13 2 223 -198 251 316 371 -130 57 -100 -298 -43 -153 121 29 333
4482 333 -259 131 -37 292 -197 91 -18 92 -243 -213 74 270 -39 165 -49 24 83 233 -60 -218 -378
4503 -378 877 922 187 -503 -440 -519 545 777 -627 102 -247 771 263 1202 26 -713 308 482 -144
4522 -144 -56 1570 463 120 72 401 -482 -442 49 -155 -39 822 -919 387 493 -85 -533 1007 380
$$ packed form
4371a86J97j34J39J27k7Qk81k20N28o1J06o00K39M22j27J01n11N74l58q5l55K35
4393b69M93J35j70n20M27q0J19K75n78K07M09p47O28O3j085J053o05j75M58L4
4413G2l84L75K34o4K5k91R1r3J0r6J33q5M28o49N22MJ5k84J99n61Q47o69O6K24
4437F9j28J96k87L68m03M07l29N5J69Q9j80M2k44J56o7k07J08L61k1l04Q7j5j61
4460b39O2K51m6j60M13n28K34J5K21m21M49O5N5n01J87j57j98K55j10K74r2L04
4482C33n92L90j68L29m89K88j09J10l35L0K87J96l09K04k14P3N9J50k93j58j60
4503c78J255M5p35o90O3p9J064K32j404P29l49J018n08R39j176p39J021J74o26
4522a44Q8J626j107l43m8L29q83M0M91k04J16Q61j741J306J06n78m48J540o27
$$ plain form
4541 380 -711 -1074 -160 386 5 410 -153 -603 -193 314 -521 -138 477 589 -105 -484 -180 657 -248 353
4561 353 -224 37 24 -65 -2 106 -148 -76 -71 -48 169 -31 225 -200 164 -199 206 -676 293 -234 -57 -130 -459
4584 -459 -139 -517 30 -68 24 184 176 135 -40 252 -835 1105 506 -428 299 479 -551 -573 485 -242 -248
4605 -248 138 988 284 145 -146 933 359 761 176 -613 -203 428 250 65 -328 -99 -589 14 -217 -108
4625 -108 572 370 -216 -231 -1065 210 180 85 -272 -315 -551 503 83 -314 -431 185 -367 62 161 -11 -333
4646 -333 210 105 -86 39 -4 179 70 40 -131 -130 -93 2 85 -205 -4 -122 -255 -21 -187 323 521 599 -588
4669 -588 74 38 60 574 -506 -114 -822 -207 77 178 -533 -308 873 381 -421 36 756 13 200 29
4689 29 27 -109 -41 295 -206 79 217 -18 98 -318 19 -72 -7 98 -509 -194 9 -843 -140 -605 -146 -766
$$ packed form
4541C80j091l63R14N46l81M05n63m50M10N07q35L83O15J12o94l79L04Q37r05O01
4561C53n77K61j3q9O3J08k54P2NK3K17k00K56m25L64l63M05q82R69n27J77p3l29
4584d59L20l78N47r8R2J60qm1j75K92j087J940n99r34P27J80j030k2J058p27o
4605b48L86Q50p04j39k91J079n74M02n85p89M10O31j78j85l93K29m90O03k31J09
4625a08O80k02n86j5q34J275l0r5l57m3k36J054m20l97j17O16n52M29R9j72l22
4646c33N43j05j91J25m3J83j09l0j71JL7R5Q3k90K01j18j33K34j66N10J98P8j187
4669e88O62l6K2N14j080L92p08O15K84J01p11K25J181m92q02M57P20p43J87j71
4689B9kj36O8L36n01K85J38k35J16m16L37r1O5J05o07L15K03q52P03m65M59o20
$$ plain form
4711 -766 -456 -1344 -303 -838 117 342 -348 429 308 705 79 234 -506 502 -66 -829 -166 340 76
4730 76 -196 -27 -25 -222 -568 -11 12 253 -118 -211 119 -100 518 -247 18 -250 -151 153 158 -88 306 -12 277
4753 277 351 -106 -204 -76 -256 54 -88 -52 313 238 193 46 187 -405 -87 132 156 -167 866 -971 -188
4774 -188 244 -622 528 371 501 379 -350 326 485 -460 303 520 488 97 477 454 -46 96 272 -190
4794 -190 171 -34 463 -4 181 242 -587 310 195 224 447 -155 -221 -235 -283 -101 21 -147 -26 -74 -17 -75 -174
4817 -174 -280 191 162 -208 38 -73 13 -5 17 -131 65 62 77 7 272 -100 169 -74 -85 -16 225 163 -135 37
4841 37 -40 100 286 -154 22 121 429 228 190 169 26 132 -282 -243 54 288 187 -355 -32 35 -312 -228 -236
4864 -236 -18 117 286 60 290 -112 -68 3 -343 -292 -177 5 64 -322 215 -202 157 -106 149 0 62 35
$$ packed form
4711g66L10q88J041n35R55K25o90P77j21L97o26J55p40J008n68p63O63N06k64
4730G6k72J69Kj97l46N57K3K41l71r3L30k19O18p65K65k68R9L04Nk46L94l18K89
4753B77P4m57r8J28j80L10j42L6L65p5m5j47J41n92L18K19K4l23J033j837P83
4774a88M32q66J150j57J30j22p29O76J59r45P63K17l2l91L80k3n00J42J76m62
4794a90L61k05M97m67J85O1q29Q97j15K9K23o02o6j4m8J82J22j68J21m8N7n8r9
4817a74j06M71k9l70K46j11Q6j8K2j48J96lJ5p0K65l72K69k43j1O9K41o2k98J72
4841C7p7J40J86m40J76R9L08k01l8k1j43J06m14L9K97K34j01n42L23O7l47Q4q
4864b36K18J35J69k26K30m02M4P1l46N1J15J82N9l86N37m17L59k63K55j49O2k7
$$ plain form
4886 35 138 93 -442 -120 -128 98 -64 279 19 -129 -139 29 237 367 -380 17 81 -65 -62 33 129 270 64
4909 64 -84 -99 -176 -167 56 77 -92 7 94 -161 -100 344 297 -50 102 269 -56 245 237 -101 24 -92 61 86
4933 86 163 209 87 -104 170 90 -183 67 3 -63 90 478 44 94 37 -32 336 -72 -198 -409 -12 -40 29 -167
4957 -167 -134 53 184 460 -105 75 -57 305 -253 -55 -363 390 320 -1018 158 -70 -1029 1053 432 -144
4977 -144 328 100 -529 -242 -299 -284 44 -127 -117 -265 454 149 703 -60 481 169 186 -183 555 51 -630
4998 -630 639 228 -674 550 55 -703 -350 547 -59 -251 148 623 -283 -610 -188 333 806 -689 663
5017 663 415 -280 351 252 23 1055 -357 -38 -462 54 303 -979 388 124 598 397 36 676 1087
5036 1087 -590 -433 123 -585 -781 -294 -627 -87 34 -425 -70 -838 -488 -230 -76 -112 -562 343 235 -42
$$ packed form
4886C5J03m5n35L22qK26j62L43k60j48j0J68K08J30p47L97O4j46LR5R6J41k06
4909F4j48j5p7RK23K1j69R9Q7k55O1M44m7l47J52J67l25L01ql38J25j16J53K5
4933H6P7M6j22j91K74q0k73K50o4o6J53L88m34N0n7o9L68m08j26k11L97k8O9j96
4957a67L3J87J31K76n65J80j32L62n58J98l08P53p0j338J176k28r59K082o21n76
4977a44M72k28o29K87n7J5L28j71J0j48P19l05N54p63N41l12J7l69P38n04o81
4998f30J269m11r02J224m95p58L53Q97o06j92L99M75r06l27M22N21M73j495J352
5017F63k48o95O31r9k29J032j412L19m24N16K49j282J367k64M74k01l61O40M11
5036A087j677J57N56p08j96M87l33N40J21m59L55p68L50K58J54l6m50R05j08k77
$$ plain form
5056 -42 1092 120 -127 -184 -214 -689 537 -54 589 346 -473 -10 467 4 -501 206 180 -169 176 391 98
5077 98 -894 -1144 375 40 -3 555 481 310 -233 101 439 15 535 533 -723 -236 469 -440 35 569 -738
5098 -738 487 7 -21 269 140 -751 521 246 64 -205 207 -803 -190 119 -361 210 106 525 -901
5117 -901 94 -340 196 -317 -673 315 149 124 -31 11 9 -417 -283 10 -150 109 -255 127 -48 -142 -544 2
5139 2 34 926 59 387 351 261 -279 -132 319 -407 -301 273 310 -462 108 -590 78 -176 64 132 233 -106
5161 -106 -39 135 -154 311 -314 -88 141 323 -41 -149 -41 -23 441 -130 206 608 -491 8 -254 117
5181 117 556 -262 1 -998 150 -522 481 -50 -710 -344 330 -486 679 1327 581 420 385 293 -171 613
5201 613 -1004 -99 184 -644 -469 -453 21 -620 834 -190 -100 -533 401 -472 494 550 48 639 18 -286
$$ packed form
5056d2J134r72k47n7l0m75J226n91O43k43q19M63M77m63n05P07k6l49L45K15k93
5077I8r92k50J519l35m3N58p4j71n43L34L38m24N20kj256M87P05r09M75N34j307
5098g38J225m80k8K90j29q91J272k75j82k69M12j010O13L09m80N71j04M19j426
5117i01R95m34N36n13l56R88j66k5j55M2km26J34K93j60K59l64L82j75r4m02N46
5139BL2Q92q67L28l6r0n40J47M51p26J06N74L7p72N70o98O68k54K40O8J01l39
5161a06O7J74k89M65o25K26K29J82l64j08J08J8M64n71L36M02j099M99k62L71
5181A17M39q18K63r99J148o72J003n31o60L66O74q16J165O48p46j61l5r2m64P84
5201F13j617R05K83q28J75J6M74o41J454j024R0m33R34q73R66N6n02N91o21l04
$$ plain form
5221 -286 65 214 -216 715 -1450 -393 -9 386 -910 307 -768 -704 -461 -230 -246 352 698 -343 -728
5240 -728 -594 120 -836 -36 -49 596 -105 648 938 114 -114 184 -392 32 -219 -869 -86 -255 89 757
5260 757 -110 824 72 -897 539 137 835 -152 112 930 -604 -31 32 -331 -10 -108 39 -71 255 253 -89
5281 -89 -289 -27 -304 183 -92 -266 -47 -38 -94 -9 150 56 193 -141 25 -87 -35 56 18 -88 24 -48 -182
5304 -182 261 252 -162 -38 10 -13 44 108 -29 -100 -240 -1 -80 -92 175 -46 -82 -228 147 139 70 201 131 390 214
5329 214 -218 155 -112 -348 56 204 352 158 315 42 42 -149 -130 67 37 -44 -37 51 18 -93 -180 234 97
5352 97 -29 -99 166 58 -98 167 -82 -113 166 114 -207 72 48 121 43 324 44 12 88 -118 83 -146 43
5375 43 -171 -133 -59 -33 48 -12 -34 179 230 -79 74 -92 -143 -161 174 195 120 -100 -33 369 205 80 -45 153
$$ packed form
5221b86L51J49m30R31k165J057L84L95j296J217j075O4K43K31j6N98L46j041l85
5240g28J34P14r56Q00j3O45p01P53K90q24k28K98n76M24k51o50P83j69L44O68
5260G57q67R34p52r69J436m02O98r87K64Q18j534N73O3l63L21r8J47j10L26kl42
5281h9k00K62k77M87k75j74K19Rn6Q5J59r4J37l34J66j12N2R1l8j06J12p2j34
5304a82M43rm14J24M8k3N7O4j37p1j40K39p9j2K67k21l6j46L75qo9J31p0K59j76
5329B14m32L73k67k36M04J48J48j94J57k73%j91J9J97l0q1PQ8l3j11q7M14j37
5352I7j26p0K65j08j56K65k49l1K79n2l21K79k4P3p8K81k80l2P6k06K01k29J89
5375D3k14L8P4K6Q1o0k2K13N1l09J53j66n1j8L35K1p5k20O7M02j64j25j25J98
$$ plain form
5399 153 -48 8 -94 77 41 -16 92 -90 -16 -76 98 -281 356 -17 -18 -263 136 37 -322 -28 -102 101 -25
5422 -25 88 -13 98 153 -62 33 284 76 -57 -87 -140 -147 -114 297 -448 -17 -95 256 -146 10 197 45 -81
5445 -81 222 -44 -231 -63 -101 181 -165 59 -120 -73 221 -143 28 -28 120 221 -206 -110 -71 -73 -60 -148 -52 471
5469 471 -344 -11 102 78 3 147 -52 261 94 164 172 25 -67 123 304 -84 -194 -115 129 23 278 207 134
5492 134 -151 -145 20 51 -177 -218 170 -15 60 6 -88 -379 -320 722 944 318 -298 517 490 546 -154 -495 -354
5515 -354 -70 545 592 190 -272 344 995 385 718 -429 19 116 -458 245 209 547 -320 -428 70 264 651
5536 651 -176 491 12 3 -876 323 449 -23 -147 172 -131 -422 178 -126 285 -135 41 -291 -172 -165 90
5557 90 -42 -56 509 54 -347 137 30 57 -178 27 -319 -44 -159 9 375 -49 -292 107 -111 12 618
$$ packed form
5399A53k01N6j02J71l6n7J08j82P4o0J74l79O37l73jk45L99r9l59K94p4K03j26
5422b5J13j01J11N5k15R5K51k08j33l0n3pL3M11p45M31p8L51m02J56J87j52j26
5445h1L03k66j87J68l8K82l46K24j79M7K94l64J71n6J48J01m27R6L9kJ3q8R6N23
5469D71q15L33J13k4p5J44j99L13j67P0Qj47r2J90J81l88j10P9K44j06K55p1p3
5492A34k85OJ65L1k28m1L88j85P5n4r4k91N9J042K22o26o16Q15k7N6p00l41J41
5515c54K84O15M7m02m62O16O51o10L33j147M48R7n74P03l6L38q67j08M98J94L87
5536F51q27O67m79rq79J199J26m72j24L19l03k91O00l04M11m20J76l32J19PK55
5557I0j32j4N65m55m01M84j07K7k35K05l46K75j15J68L66m24k43L99k18J23O06
$$ plain form
5578 618 -7 354 -492 -493 -458 -408 11 -7 209 634 281 397 -742 103 -28 -169 -23 -589 -166 -216 -402 40
5600 40 -941 -269 -629 -770 -667 -477 -2 -232 746 539 265 -65 256 1235 1030 538 742 648 816 -298
5620 -298 176 -469 73 847 -448 399 -493 -1012 662 452 1189 -274 1 21 198 1030 1020 937 -133 -150
5640 -150 212 474 568 236 -424 -178 -256 -55 -791 -107 -326 -471 88 245 256 303 415 482 355 581 944 256
5662 256 190 241 392 -238 -691 -191 129 93 -463 946 328 -209 -292 -249 -861 55 -540 -308 344 71 -344
5683 -344 -244 157 -168 563 45 -96 46 -244 776 543 -707 287 -306 -376 93 -351 -243 1159 -286
5702 -286 -190 49 45 50 -49 1131 22 -4 791 -74 30 -334 155 285 203 -5 339 39 -426 353 -241 209
5724 209 -69 -280 -169 -31 -29 -182 56 -38 85 -316 71 -111 -65 -217 -569 346 -30 -758 451 449 -42 42
$$ packed form
5578F18o25L61q46jL5N0M19j8K16M25l53J16j139Q45j31j41J46n66M23n0j86M42
5600D0r81O72l60j41J03J90M75k30R78k07k74l30L21R79k05m92K04r4J68j114
5620b98M74o45N42P74j295Q47q92n19J674k10P37j463K75K0J77Q32j0q3j070j7
5640a50L62K62R4l32o60K46p8K01p36O84k19j45N59J57J1M7J12O7j27K26L63o88
5662B56o6N1J51o30m53N00L20l6n56J409o18n37q3M3o12R16n95K32O52k73m15
5683c44J00M01l25P31n18j41J42k90J020k33j250R94n93p0M69m44J08J402j445
5702b86R6K39mNr9J180j109k6P95q65J04l64M89J30q2k08L44l00m65P79n94M50
5724B09k78k11J11J38Kj53K38r4J23m01L87j82M6j52l52R15l76p28J209km91Q4
$$ plain form
5746 42 242 456 599 17 299 -234 -423 100 333 -144 -549 130 126 460 565 230 -141 582 -17 -136 901
5767 901 -610 563 640 -127 -192 -414 309 150 544 -806 590 -94 -915 258 -47 130 -49 -144 501
5786 501 205 -275 144 -132 182 -247 -157 -284 327 104 -152 -482 -143 -141 159 -28 -49 -185 18 1 373 -256
5808 -256 -188 -141 -18 580 83 -429 261 -639 -882 -166 -717 436 -481 -590 394 -292 -223 808 623 -567
5828 -567 798 -89 395 334 -649 300 64 421 761 391 427 -349 -545 -65 219 539 -394 74 -322 -152
5848 -152 -22 -156 -286 -225 -64 -416 457 -178 521 467 -65 199 153 -8 -662 -66 -263 -17 205 -173 -1
5869 -1 -2 -300 237 392 164 -86 720 -163 2 -144 -568 107 270 -66 132 9 -108 388 -88 -149 217 -72
5891 -72 -189 153 44 43 117 345 122 8 95 132 -8 359 -107 -137 117 -86 -177 -116 -152 -183 135 -194 83 -45
$$ packed form
5746D2K00K14J43n82K82n33j89N23K33m77m05O79mL34J05l35l71P23n99j19J037
5767I01j511J173P7p67o5k22P23j59L94j350J396o84q21J173l05J77j79r5O45
5786E01k96m80M19k76L14m29R0j27O11k23k56l30L39KL00j87k1j36K03j7L72o29
5808b56O8M7J23N98m97n12O90r00k43P16n51J153r17j09R84o86O9J031j85j190
5828e67J365q87M84o1r83R49k36L57L40l70L6p76j96M80K84L20r33M68l96J70
5848a52J30j34j30O1J61l52Q73o35O99n4n32K64m6j61o54N96j97K46K22l78J72
5869ajk98N37J55k28k50Q06q83J65j46m24O75J63l36J98j23j17M96m76o1L66k89
5891g2j17L42j09jP4K28k23j14Q7L7j40L67m66l0K54k03r1O1l6l1L18l29K77j28
$$ plain form
5915 -45 -383 -120 -210 -22 -74 -258 -523 -2 -160 -268 199 -115 273 103 -1611 -99 -404 1320 212 -113
5935 -113 -498 -422 500 -74 304 77 51 28 -250 -304 87 52 277 89 -108 -109 301 -117 -711 317 -79 162
5957 162 154 162 240 -169 183 88 -503 673 432 -328 346 -391 682 250 769 -54 574 262 8 151 -57
5978 -57 506 39 710 -1057 -414 -286 -481 -464 409 396 -71 -264 -709 7 346 517 -181 -300 429 21 124
5999 124 374 289 416 -150 -99 488 -117 259 103 221 -162 0 0 -212 115 -112 22 -6 -864 -390 -1025 -1670
6021 -1670 -1343 194 -36 -96 199 64 -245 422 -408 663 -164 -136 -230 172 605 555 -255 -341 506 436 636
6042 636 -197 142 213 248 -99 383 19 -772 -198 53 -919 681 480 85 32 -202 54 -264 46 -171 -119
6063 -119 -22 123 40 -40 -171 12 -69 -23 -52 -7 4 215 -18 1 127 28 -60 17 117 -68 267 -184 -54 165
$$ packed form
5915d5l38K63r0J88n2j84k65N21j58j08M67l14L88j70j714J512l05J724j108l25
5935a13l85P6R22n74L78k27k6k3k78n4L91l5K25j88j97jM10m18n94J028l96K41
5957A62qQP8m09L52r5n91J176k41p60O74p37J073m32N19q23O28l12k54J43k08
5978e7N63m67O71j767O43J28j95J7Q73j3m67j93m45P16L39J71o98j19P29m08J03
5999A24K50q5J27n66N1N87o05L76j56J18l83J62%k12L27k27J34k8q58M74o35o45
6021a670L27J537k30o0K95j35l09O67q30J071q27K8r4M02M33n0q10q6Q47p0K00
6042F36q33L39P1L5l47M82l64p91N74K51r72J600k01l95n3k34K56l18L10k17N2
6063a19R7J45q3q0j31J83q1M6k9M5J1K11k33J9J26r9q8P7J00j85L35m51J30K19
$$ plain form
6087 165 -16 -445 -13 -230 151 -219 -489 168 165 15 -567 496 -224 358 223 348 1065 371 -120 187
6107 187 -454 -538 746 -141 38 -19 -192 88 -50 168 -313 256 -29 -394 -267 129 -454 399 216 33
6127 33 25 604 -147 460 -126 -562 -117 93 445 108 380 66 97 -488 1242 683 208 464 834 -26 -601
6148 -601 -565 -294 162 -422 89 -593 401 683 342 -235 -274 -77 -930 -224 169 58 346 -174 -342 -605 -345
6169 -345 268 -249 88 381 930 -418 18 256 -305 924 -87 -667 -220 1169 916 582 -10 290 -385
6188 -385 -1258 -198 -120 -401 -184 95 -99 152 -550 140 -26 218 -1197 -219 430 -149 -516 799 642
6207 642 490 216 39 -316 151 268 -173 -94 170 -232 284 -1063 266 -67 -894 -1093 175 -805 -581
6226 -581 82 115 -221 232 180 -453 -14 -342 -279 -225 436 291 113 80 -242 -9 204 -81 -323 -469 236 163
$$ packed form
6087A65j81m29M32k17L81l70k70O57lj50n82J063p20N82j35J25P17o94m91L07
6107A87o41q4J284q87J79n7j73K80j38K18m81N69k85l65J27L96n83Q53j83j83
6127C3qN79p51O07n86m36M45K10L52l37K72l14L1n85J730n59m75K56L70q60n75
6148f01L6K71M56n84N11o82R94K82l41n77l9J97q53P06L93j11K88n20j68k63K60
6169c45O13n17L37K93N49j348M36K38n61J229j011n80M47J389k53l34n92L00o75
6188c85q73J060P8k81K17K79j94K51p02O90j66K44j415R78O49n79l67J315j57
6207F42j52k74j77l55M67J17m41P9K64m02N16j347J329l33q27j99J268r80K24
6226e81O63L3l36M53n2o33M39l28O3N4O61j45j78l3l22K33K13k85k42j46P05p3
$$ plain form
6248 163 -158 -8 -136 -41 -120 252 31 -69 136 22 -168 -147 131 -138 111 -143 223 -128 -42 144 -29
6269 -29 251 -356 212 -42 -183 -413 292 -473 -149 115 -550 82 46 216 496 449 1236 -220 164 634 -259
6290 -259 -92 26 284 -41 -119 73 2 136 -186 330 354 -39 7 691 -6 91 139 -171 -436 561 -48 259
6312 259 -224 218 21 -447 23 -143 -101 64 32 -59 -145 11 136 -88 22 -97 -43 136 89 77 238 258 -154
6335 -154 9 359 -3 -282 -351 -176 -19 -89 -115 -15 -225 117 168 195 -144 -508 -237 -10 -108 131 -111 170
6357 170 295 588 -450 704 -161 230 197 247 -21 633 62 205 -162 -503 -41 103 -38 -420 833 453
6377 453 345 -147 -432 -463 -308 200 -293 -193 516 25 2 -1173 78 -147 120 -402 -457 542 316 -48
6397 -48 142 28 64 62 -290 402 -429 -269 151 45 -100 -111 -468 -151 58 -47 -57 -137 -98 -71 81 223 -151
$$ packed form
6248A63l21J50j28R5p9L72k21j00K05j14j90K1K78k69K49k54L66l51Q6J86j73
6269b9K80o07N68k54j41k30P05p65L24K64o65O32l6J70K80m7P87j456L84M70q93
6290b59J67J18K58l25p8J92p1J34l22N16K4l93M6O84o97R7M8l10k65R97o09L07
6312B59m83M42j97m68M70j66M2J65l2r1q6J56J25k24J10j19N4J79m7j2J61K0m12
6335a54J63L50l62k79o9J75J57p0k6J00k10L42N1K7l39l64K71K27r8K39k42K81
6357A70J25K93j038J154q65L91l3N0k68O54n71J43l67l41M62J44j41l82J253l80
6377D53j08m92k85l1J55N08m93J00P09m91k3j175J251k25K67n22n5R99k26l64
6397d8J90j14L6kl52O92q31J60M20j06j45j1l57L17K09j05j0q0L9K7J52J42l74
$$ plain form
6420 -151 334 0 -74 116 -335 -301 -43 5 -190 155 48 43 -341 2 -204 -134 -139 94 -300 -67 -251 -119 215
6443 215 -42 170 -94 -72 182 198 116 4 145 -70 -88 -39 -39 -211 -134 300 -273 294 -55 16 -57 -7 -242 -149
6467 -149 -105 24 -349 -123 219 -202 70 -34 172 288 -50 272 335 -122 -41 -136 173 421 -13 15 162 -242
6489 -242 -311 -58 122 -55 -47 -29 -45 157 -23 110 43 -6 90 118 -230 -83 -43 238 276 -123 347 -97 282 -15
6513 -15 144 20 127 -35 -204 222 15 -67 154 159 -46 -23 36 267 1 199 -131 0 -19 -139 -33 85
6535 85 325 140 250 -73 -285 -176 475 176 379 -30 618 914 330 693 -311 517 394 391 569 -238 -42
6556 -42 56 -283 722 617 163 345 -350 173 220 334 38 259 -249 -234 170 55 -127 167 -185 35 -229
6577 -229 44 126 -45 107 -31 -105 64 186 -309 194 -50 31 22 261 -136 192 119 -1 332 143 -211 52
$$ packed form
6420a51M85l34p4J90m51L4K58M8j95L45j07nl84L43k06P0nK33l94K33j84J32L34
6443B15k57K12k64K2K54J6q2j12J41k15j8M9%j72P7M34n73N67l49P1p3N0k35R3
6467a49M4J29l73K26L42m21K72j04K06J16l38L22O3m57Q1r5L09K48m34K8J47m04
6489b42o9K53J80j77QJ8j6K02j80J33o7m9R6K8l48J47M0K81L8l99M70m44L79k97
6513a5J59j24J07j62j69M26k07q2K21Nk05K3N9K31k66J98l30J31j9j20J06J18
6535H5K40j85J10l23k12J09O51k99K03m09O48K96n84L63j004Q28j23lJ78q07J96
6556d2R8l39J005j05m54J82o95N23M7J14k96K21n08J5M04j15j82K94l52K20k64
6577b29K73Q2j71J52j38p4J69J22m95N03k44Q1rK39l97L28p3j20L33j89l54K63
$$ plain form
6599 52 217 50 265 180 139 110 -386 -164 77 -125 170 -47 -81 41 90 40 -101 -65 88 -55 234 485 -20
6622 -20 -18 -18 -41 157 -250 -99 -176 101 230 137 353 -460 -97 31 -131 -180 151 -45 -118 15 -70 175 -150 -235
6646 -235 42 159 241 199 49 -235 -108 -106 340 30 -6 -120 264 37 -62 -119 19 -1 143 -176 -110 112 -189
6669 -189 78 -163 368 290 98 107 96 -87 -357 -242 -26 64 86 -92 59 -11 38 22 122 142 -133 66 61 201
6693 201 -224 -151 -65 -184 43 -228 -78 -52 -193 -342 -159 14 91 -18 326 93 -125 99 -237 2 -32 73
6715 73 -380 -111 93 80 57 -124 54 26 -139 -10 54 -264 -409 -87 81 14 -16 -360 -143 -121 98 240 496
6738 496 -261 -924 -60 94 -506 -215 -522 -120 179 -265 -561 1010 79 187 -457 259 -49 235 535 309
6758 309 569 41 445 -644 659 -74 -579 -14 -180 1024 74 113 -65 -546 -303 426 629 96 -11
$$ packed form
6599E2J65j67K15q5m1k9m96K22K41k02K95k17l4J22M9n0j41L6J53j43K89K51n05
6622b0K%k3J98m07J51p7K77J29r3K16q13L63J28j62m9L31j96p3J33q5K45l25q5
6646b35K77J17Q2m2j50k84J27KM46l10l6j14L84k27r9n7J38k0J44l19O6K22l01
6669a89K67k41N31p8j92Rj1j83k70J15K16R0K2j78J51p0M9j6J00K0k75J99nJ40
6693B01m25P3Q6j19K27k71J50K6j41j49J83J73P7j09L44k33k18K24l36K39l4J05
6715G3m53K69K04j3k3j81J78k8j65J29O4l18j45L22J68o7l0l44K17K2K19J42K56
6738D96p57o63Q64J54o00K91l07M02K99m44k96J571r31J08o44P16l08K84L00k26
6758C09K60n28M04j089J303p33n05N65j66J204r50L9j78m81K43P29K03n33j07
$$ plain form
6777 -11 -45 -203 109 -401 332 313 -215 -484 -1278 356 -805 524 -673 -278 20 -177 -371 227 -14 -146
6797 -146 198 -128 74 -330 321 470 -57 -373 -283 280 160 71 133 95 276 7 -12 -84 -251 170 -97 -712
6819 -712 838 59 -253 109 -538 126 -63 -16 -132 61 -120 -314 1237 539 -274 -166 152 361 -58 151
6839 151 -381 361 101 -64 -155 195 -232 -1 98 157 -288 175 34 0 -201 618 -206 178 117 -218 128 -73
6861 -73 67 38 -22 -32 9 79 -23 9 321 478 551 -520 -497 -319 22 -46 10 -101 -62 271 17 177 32 -388
6885 -388 -10 -322 38 235 -15 -288 -23 -90 -88 84 -201 116 22 59 150 -7 261 67 -146 -105 -14 159 264
6908 264 -100 118 -404 81 -85 -148 -648 612 -318 196 -940 -231 -611 336 742 720 354 52 -629 -775
6928 -775 305 -291 257 -309 253 -216 -358 217 -442 -56 -76 5 -5 -264 176 7 31 73 64 -615 45 205
$$ packed form
6777a1l4j58L12n10P33j9n28k69p94J634j161J329j197L95K98j97j94N98k41j32
6797a46L44l26K02m04O51J49n27l16R0N63j20q9O2l8J81k69j9p2j67M21k67o15
6819g12J550p79l12L62o47O64j89M7j16J93j81j94J551o98q13J08L18K09m19K09
6839A51n32P42k60j65r1L50m27K31R9N9m45M63j41l4k01Q19q24L84o1l35L46k01
6861g3J40k9o0j0M1P0j02L2L12J57P3j071K3J78L41o8N6j11L9L33k54J60j45m20
6885c88L78l12L60J97k50k73K65o7KJ72k85L17r4L7R1j57K68j94k13M1R1J73J05
6908B64l64K18n22M85j66o3n00J260r30N14j136P09l80R47M06k2l66l02o81j46
6928g75J080n96N48n66N62m69j42N75o59L86k0Q1j0k59M40j69K4M2ro79O60J60
$$ plain form
6950 205 -170 46 405 13 -148 -237 -877 -284 355 -241 -288 -4 -259 233 52 235 208 -552 -205 562 128
6971 128 5 119 -350 485 -832 399 -20 -62 -535 -908 -525 -934 719 343 97 1098 -126 50 646
6990 646 329 -509 -411 398 -17 85 -358 787 -368 -30 -260 -33 69 95 83 105 376 52 -72 -211 69
7011 69 188 -173 -329 23 -128 -182 -201 -171 49 -78 -1 103 -29 164 -114 -105 -95 240 -189 83 266 86 -32
7034 -32 438 -93 51 97 -22 -211 202 64 -117 4 -95 -356 -12 -134 497 -174 519 52 -539 -482 213
7055 213 499 87 752 -369 -132 -165 -98 -40 1 34 54 -141 -208 -333 -180 539 83 73 183 103 40 -536 -249
7078 -249 -461 234 -321 76 -157 151 300 -276 36 -159 851 -528 43 155 -350 -209 553 299 -452
7097 -452 427 418 -133 468 213 185 253 253 -602 -236 199 65 144 159 -44 -173 428 175 522 20 52 90 -197
$$ packed form
6950B05l75K16L59l92j61q9o40N93O39n96m7K84k55M92j81J83k7p60L47P67m34
6971A28j23J14m69Q35j317J231m19m2m73l73L83m09J653l76k46J001j224J76N96
6990F46l17q38R8Q09m15J02m43J145j155L38k30K27J02K6j2K2K71l24j24j39K80
7011F9J19l61j56L52j51n4j9L0K20j27P7J04j32J93k78RJ0L35m29K72J83j80j18
7034c2M70n31J44M6j19j89M13j38j81J21r9k61L44j22O31o71O93m67n91N7O95
7055B13K86m12O65j121K37l3O7N8M1L3K0j95o7j25J53P19m56j0J10q0o3n76K87
7078b49k12O95n55L97k33L08J49n76L12j95J010j379N71J12n05J41P62k54p51
7097d52Q79rn51O01k55k8O8%q55L66M35j34P9J5k03j29O01k53L47n02L2L8k87
$$ plain form
7120 -197 266 -127 -112 112 -82 70 -378 42 -5 401 -301 180 589 203 62 20 -80 -259 -343 41 111 -58
7142 -58 165 -21 -76 117 139 -12 23 -36 166 95 26 19 545 -194 83 -263 -82 39 -252 -85 -136 -142 151 283
7166 283 245 266 55 -52 -114 152 -124 105 129 22 -36 198 3 -197 -1 60 93 98 157 -107 -2 154 230 -4
7190 -4 -13 88 224 -204 -129 4 -141 -152 -62 -232 -47 51 -231 3 283 83 -97 -46 115 -22 61 -67 -184
7213 -184 1 127 -171 -202 -97 -75 -135 -109 125 129 223 -131 94 -156 96 69 -64 -39 5 30 -98 297 113 28
7237 28 230 -259 -201 -57 7 299 181 -3 290 -11 -19 -35 -32 249 43 222 115 80 -111 -80 -111 -219 209 44
7261 44 -27 29 181 59 1057 -303 -222 104 -3 -23 -104 301 812 -317 -113 -650 1061 -21 876 -893
7281 -893 66 70 -185 447 -1465 324 -943 -85 381 66 -133 25 79 526 -35 936 1144 -95 -473 -1279
$$ packed form
7120a97M63l93J5K24j94J52m48M20m7M06p02M81M09l86j41m2j00j79q4L84P0j69
7142e8K23j86n5J93K2j51L5n9K02p1o9pN26p39K77l46J81J21k91J67n1oK93J32
7166B83l8K1k11j07o2K66k76K29K4j07n8K34j95k00J96O1L3NN9k64J05J56P6k34
7190drJ01J36m28P5J33j45j1R0j70J85R8k82K34K80k00j80N1J61j37Q3j28j17
7213a84J85J26k98l1J05K2o0K6K34MR4l54K25k50K52k7j33K5M4K5j28L95j84q5
7237B8K02m89N8J44O4K92j18j84K93l01qj6LK81k06J79j07l5j91L1l1j08M28j65
7261D4p1N6J52j22R98j360Q1L26j07k0q1M05N11j129K04n37J711j082Q97j769
7281h93R59Mk55O32j912J789j267Q58M66l15j99J58N4M47n61R71K08j239l78q06
$$ plain form
7301 -1279 397 636 328 1077 603 967 1536 928 -669 -1466 462 -306 107 713 420 -715 -534 442
7319 442 476 -925 -136 -311 -270 78 439 -1026 -163 266 452 -555 -342 989 89 927 -295 -346 1073
7338 1073 99 93 672 444 79 -61 -12 448 -438 590 97 -240 -80 984 -591 -112 -723 -789 -16 376
7358 376 619 -164 239 -1162 750 552 208 -554 -143 -55 940 874 328 1323 -842 -663 -159 123 1379
7377 1379 -1259 57 253 548 -883 12 -164 459 353 176 -1463 -988 -336 530 -726 -495 -190 -859
7395 -859 -209 -248 -1216 -241 621 741 1143 440 591 -774 -181 -137 135 -346 -530 27 595 -134 -394 -623
7415 -623 -617 -645 91 -415 -142 197 -207 877 -211 381 212 -73 430 86 -39 180 -118 -65 -57 -81 -142 -127
7437 -127 262 55 -112 -95 -23 -387 243 311 539 -409 574 -794 633 841 -237 562 -140 -392 -452 224
$$ packed form
7301a279J676K39l08P49m74L64N69o08j597p97J928p68M13O06k93j135J81R76
7319D42L4j401P89j75M1L48L61j465Q63M29J86j007K13J331r00Q38j222n1J419
7338A073r74oN79k28l65j40M9M60q86J028m93l37J60J064j575M79o11o6P73L92
7358C76K43p83M03j401J912j98l44p62M11Q8R95o6n46R95k165J79N04K82J256
7377A379k638J316J96K95j431Q95j76O23j06j77j639M75O52Q66j256K31L05o69
7395h59O50l9r68R75Q62J20M02p03J51j365N93M4K72m81j84N57N68p29k60k29
7415f23Ok8P36n06K73L39m04J084j088N92j69k85N03l44j25K19k98N3Qk4o1J5
7437a27L89k07j67J7P2l64O30O8K28r48R83j368J427K08j078P99p02k52o0O76
$$ plain form
7457 224 -554 85 54 -63 600 -8 -263 -81 69 -135 101 43 83 -415 459 -128 120 117 45 116 -97 -316
7479 -316 -183 -2 233 61 92 211 -25 -451 -143 -2 71 -35 11 -4 33 29 -16 209 -59 -254 538 -201 -46
7502 -46 -279 179 -113 477 20 -64 144 -85 -78 -179 66 27 39 -243 370 -217 -149 -158 -173 -36 -141 -176 -54 -252
7526 -252 178 83 107 -228 132 -128 -5 204 -86 -69 194 0 -287 52 96 -168 -1083 435 -142 -353 801
7547 801 -237 -659 -12 -156 -236 258 -25 -581 477 -688 -81 -64 5 -461 -440 106 -354 385 -22 189
7567 189 294 -54 27 98 -264 1044 -530 247 585 120 -748 224 -80 -354 51 223 537 -568 312 -75
7587 -75 62 -221 -108 -25 121 -490 -32 -475 -1239 -863 -244 868 -383 161 156 372 -188 -201 -64 187 -42
7608 -42 17 -49 10 22 38 351 90 198 201 21 34 155 214 -272 91 -204 -259 -192 -61 -179 -226 98 -43 258
$$ packed form
7457B24p78O39l1j17O63o08k55J82J50k04K36n8M0m98Q74n87K48lp2P1k13k19
7479c16J33J81K35j72L1J19k36m26L08J41P3j06M6j5L7mm5K25k68j95P92p39J55
7502d6k33M58k92N90m57q4K08k29Pj01K45l9J2k82O13n87O8rj5J37j05l5J22j98
7526b52M30r5K4l35L60k60J23K09k90J7K63j94k87L39M4k64r15J518n77k11J154
7547H01j038m22O47j44q0M94k83n56J058j165O07J7O9m66K1N46m60P39m07K11
7567A89J05l48Q1P1l62J308j574P77L38m65q68R72l04k74M05J72L14j105Q80l87
7587g5J37k83J13Q3J46o11M58m43p64L76O19J112j251N44nK16n60j3J37K51k29
7608d2N9o6N9J2J6L13k61J08Lj80J3J21N9m86L63k95n5O7J31j18m7L24j41L01
$$ plain form
7632 258 -106 79 72 -206 56 120 -61 129 -40 54 17 -269 196 61 -426 356 47 167 141 343 -379 -134
7654 -134 -45 -134 232 -38 -309 -133 -141 -354 55 47 28 -224 -17 9 -91 -55 232 -37 -142 254 -269 -279 140
7677 140 -418 256 200 115 71 150 -272 654 -167 -749 495 224 328 40 533 -265 -559 345 -660 721
7697 721 195 462 -311 118 188 -101 -202 78 198 189 -242 -245 -317 423 924 -526 -117 -326 38 -551 358 -841
7719 -841 -424 -29 -245 -1418 -905 652 229 1078 549 -331 228 -63 -1080 -44 13 -965 554 -62 -8
7738 -8 -211 -107 115 -734 -271 -262 277 31 -918 -55 -363 1225 391 179 400 760 -395 -379 252 -130 -850
7759 -850 -296 453 -111 -213 -144 -483 25 53 201 50 -119 121 432 411 241 -335 233 112 -273 33 33 -13
7781 -13 -196 11 -90 -31 136 265 -227 -164 148 159 -80 -149 -82 261 234 151 69 -171 54 -201 203 91 -87
$$ packed form
7632B58l64J85pk78K62O4j81J90j69R4l7k86M65j35m87P82l09J20k6K02p22K45
7654a34Q9q9L66k70k71J76qk13M09qj9k52K07K6j00L6K87k69j05L96n23j0M19
7677A40n58O74n6q5m4P9m22R26q21n82J244k71J04k88M93p98k94R04j005J381
7697G21n26K67p73M29P0k89j01K80J20rm31lp2P40N01j450M09k09L64n89R09j199
7719h41M17L95k16j173N13J557m23Q49n29q80N59k91j017J036N7r78J519o16N4
7738hk03J04K22q49M63RN39k46r49Q63l08J588q34k12K21L60j155J6O31l82p20
7759h50N54P49n64j02O9l39N08K8J48j51j69K40L11k1j70n76N68j21l85L06%m6
7781a3j83K07j01N9J67J29m92O3L12J1k39o9O7L43k7q3q2k40K25k55M04j12j78
$$ plain form
7804 -87 -79 173 -294 -26 85 21 -82 106 -102 -53 63 106 -22 25 -112 39 67 14 94 -217 -146 294 26 -44
7828 -44 396 -8 -275 -370 2 250 -32 41 40 -162 212 99 -280 -643 1171 -207 -746 410 5 -270 -15
7849 -15 -272 -189 282 388 -266 -430 419 -708 -700 -697 -265 -468 -295 1180 -62 -42 80 -76 905 574 220
7870 220 -442 -524 207 93 -29 131 -586 -171 488 -593 128 -135 -28 -303 -32 -228 52 625 227 410
7890 410 205 -20 -75 -69 171 299 -253 -79 416 199 774 -142 -1304 801 -146 -254 345 -384 -171 -185 501
7911 501 -432 -104 -273 -289 1120 489 -530 838 -187 -43 339 -203 619 1209 639 -129 -680 387 7
7930 7 -577 -660 250 508 456 -708 152 89 317 151 233 9 -1075 -187 -114 -534 -368 186 51 -30 -169 -211
7952 -211 385 10 139 -72 35 144 231 15 59 55 73 304 -42 -48 -20 -71 221 -5 -104 105 -193 227 -316
$$ packed form
7804h7QK52m67K68J11o4j03J88k08M9J16M3j28M7j37J51K8n3Q0l11P1M40k68p0
7828d4M40m04k67r5L72K48k82P3jk02L74j13l79l63J814j378n39J156m05k75K55
7849a5k57Q3M71J06o54j64Q49j127QLM32k03J73J475j242K0J22j56R81l31l54
7870B20o62q2P31j14j22J60p17M15O59j081P21k63J07k75K71j96K80N73l98J83
7890D10k05k25n5OK40J28n52J74M95k17N75r16j162K105r47j08N99p29K13j4O86
7911E01r33L28j69j6J409o31j019J368j025J44L82n42Q22N90n70p68n51J067l80
7930Gn84q3R10K58n2j164Q60o3K28j66Q2k24j084Q88P3m20J66N54j35q1j39m2
7952b11N96l75J29k11J07J09Q7k16M4mJ8K31l46oK8n1K92k26r9K09k98M20n43
$$ plain form
7975 -316 47 -213 197 162 -94 52 -93 296 243 68 -72 -143 40 233 131 -15 37 93 -495 644 -1796
7996 -1796 -137 104 166 -32 -355 450 69 98 -228 50 415 -519 1151 -133 19 216 -484 -560 64 461
8016 461 44 1371 -599 365 63 37 1061 -688 31 -1161 228 -728 475 -980 469 -61 -588
8033 -588 -777 -702 139 -547 -800 -354 205 -481 -314 -496 537 -1008 -279 -280 -102 -718 -175 192 158 -263 29
8054 29 89 297 51 474 -289 -346 945 -410 87 -599 542 -387 406 -218 539 136 451 -78 -543 407
8074 407 14 -4 249 42 -289 29 11 218 62 265 -155 160 46 -264 527 612 3 245 -508 374 -11
8095 -11 82 -408 324 538 -7 -382 13 170 -96 797 -52 -45 783 242 -138 -761 -554 315 -3 302 -515
8116 -515 -52 -617 25 -273 -237 -358 -72 -3 -396 -242 -202 525 -262 -525 1814 362 1005 194 -903 -268
$$ packed form
7975c16L63k60M10l5k56J46j45L89n3j75j40p1J83J93j02j46N2N6n88J139k440
7996a796J659K41O2j98l23Q05l81K9l26K78L65r34J670j284J52J97p00p6O24L97
8016D61m17J327j970R64l02k6J024j749P19j192J389r56J203j455J449n30n27
8033e88j89P5Q41o86k53M46N59o86J67j82J033j545P29jJ78o16N43L67l4m21K92
8054B9O0K08k46M23p63n7J291j355M97o86J141r29P93o24P57m03L15n29m65R50
8074D07l93j8K53k07l31L18j8K07j56K03m20L15j14l10P91Q5o09K42p53Q82l85
8095a1R3m90P32K14n45l75L95J57k66Q93q49PQ28n41l80o23K07Q69l18L05q17
8116e15M63n65O42k98L6j21K86O9l93J54M0P27p87k63K339j452O43q11j097O35
$$ plain form
8136 -268 -986 -378 -627 -371 -121 351 48 -77 -293 -113 -10 -1578 -29 395 375 150 -165 -394 -197 -72
8156 -72 94 130 -9 -73 438 -124 515 15 336 296 -29 33 -245 467 574 -556 -256 -322 -873 -308 21 -141
8178 -141 -43 522 -233 176 -273 79 472 -377 -158 300 355 -1219 -629
$$ packed form
8136b68p18O08k49K56K50M72l03j25k16J80J03j568J549M24k0k25l15k29J97J25
8156g2J66L6j39o4N11n62O39n00L21m0l25O2k78P12J07j130L00o6n51N65L29j62
8178a41R8N65p55M09m49L52L93q49K19M58N5j574N90
8191f29
$$ Imaginary data points
##PAGE= N=2
##DATA TABLE= (X++(I..I)), XYDATA
$$ plain form
0 0 0 0 0 0 0 0 8 -8 8 -8 16 -16 24 -24 32 -40 48 -55 64 -73 88 -104 119 -137 158 -178 204 -232 264 -297
30 -297 336 -376 423 -473 528 -587 653 -724 805 -892 989 -1095 1212 -1342 1487 -1650 1834
47 1834 -2042 2281 -2559 2890 -3286 3771 -4384 5188 -6290 7904 -10504 15409 -27932 129301
61 129301 213513 -36917 -70263 24534 140878 119564 71487 23538 5061 6343 76649 145307
73 145307 153722 84736 12316 -32868 -12849 66122 154199 142412 41122 -33386 6467 85585
85 85585 111820 76949 37051 4919 -13172 12616 90680 143588 107169 19524 -27113 -8062
97 -8062 33646 64148 75827 52299 -1093 -30209 9229 81341 104768 58617 -5473 -38759
109 -38759 -21488 24826 67437 70415 36414 -2272 -14424 -2530 24198 50596 49629 4056 -47418
$$ packed form
0@%%%%%%Qj6J6j6K4l2M0m8N6p2Q8j03J19j37J61j92K23k56K95l36L82m36M96n61
30b97O33p12P99q96J001j115J240j377J529j697J881k084K307k554K829l137L484
47A834l876M323m840N449o176P057q155R572j1478J4194j8408K5913m3341J57233
61A29301Q4212k50430l3346R4797J16344k1314m8077m7949j8477J282P0306O8658
73A45307Q415o8986p2420m5184K0019P8971Q8077j1787j01290p4508L9853P9118
85H5585K6235l4871l9898l2132j8091K5788P8064N2908l6419q7645m6637J9051
97h062M1708L0502J1679k3528n3392k9116L9438P2112K3427m6151o4090l3286
109c8759J7271M6314M2611K978l4001l8686j2152J1894K6728K6398r67m5573n1474
$$ plain form
122 -47418 -42121 20825 71939 55369 964 -29004 -20051 -2867 6117 15572 25011 9079 -27623
135 -27623 -38712 -3073 41132 39928 -4047 -44386 -46675 -13101 19271 28041 7658 -13927 -21263
148 -21263 -18291 -11744 2508 14447 2514 -32015 -50142 -23425 19232 31942 6929 -24110
160 -24110 -32521 -22591 -6137 7008 9164 -2358 -23223 -31136 -16940 5298 14252 4439 -16775
173 -16775 -31366 -29172 -9044 12132 14652 -3733 -23849 -27685 -14275 2165 8100 -770 -18479
186 -18479 -28779 -20549 -4847 3748 1812 -3477 -11926 -23873 -22901 -3248 12646 3716 -19954 -32204
200 -32204 -19839 366 5799 -2854 -13306 -18387 -17153 -16057 -10754 -1581 1060 -8886 -24130 -26262
214 -26262 -9755 7600 4329 -15209 -29457 -24552 -11044 -3359 -7441 -10430 -10664 -14115 -20209 -16286
$$ packed form
122d7418N297O2946N1114j6570n4405k9968Q953J7184Q984R455R439j5932l6702
135b7623j1089L5639M4205j204m3975m0339k289L3574L2372Q770k0383k1585p336
148b1263K972O547J4252J1939j1933l4529j8127K6717M2657J2710k5013l1039
160b4110q411R930J6454J3145K156j1522k0865p913J4196K2238Q954r813k1214
173a6775j4591K194K0128K1176K520j8385k0116l836J3410J6440N935q870j7709
186a8479j0300Q230J5702Q595j936n289q449j1947R72J9653J5894q930k3670j2250
200c2204J2365K0205N433q653j0452n081J234J096N303R173K641r946j5244k132
214b6262J6507J7355l271j9538j4248M905J3508P685m082k989k34l451o094L923
$$ plain form
228 -16286 -5934 -1809 -10157 -24824 -29715 -18459 -2365 1405 -8125 -21529 -21838 -17394 -12502 -12034
242 -12034 -10749 -11918 -15954 -19424 -14951 -6349 -2705 -7564 -16982 -24794 -23808 -13972 -4088 -3872 -12090
257 -12090 -17237 -14048 -9347 -6936 -8526 -11583 -14592 -16195 -14637 -8581 -2589 -51 -3082 -10969 -17459
272 -17459 -15051 -4925 -42 -5420 -12072 -10954 -2130 3017 181 -3788 -4609 -6603 -9964 -9865 -3928
287 -3928 3880 6218 1157 -5511 -6188 1006 6243 2061 -6642 -8234 -830 5495 5513 4689 5525 5560 369
304 369 -4759 -2888 3932 7911 4980 -191 675 6173 11869 9638 2469 -2830 -396 3580 4055 4849
320 4849 7557 10042 7395 2168 1407 4782 6650 5722 434 -1399 2942 9678 11841 8131 3310 1561
336 1561 2410 2265 903 2080 4930 5354 3831 2815 4016 6794 6402 2021 -3152 -3619 670 5959
$$ packed form
228a6286J0352M125q348j4667m891J1256J6094L770r530j3404l09M444M892M68
242a2034J285j169m036l470M473Q602L644m859r418p812R86R836R884K16q218
257a2090n147L189M701K411j590l057l009j603J558O056N992K538l031p887o490
272a7459K408J0126M883n378o652J118Q824N147k836l969q21j994l361R9N937
287c928P808K338n061o668o77P194N237m182q703j592P404O325J8q24Q36L5n191
304C69n128J871O820L979k931n171Q66N498N696k231p169n299K434L976M75P94
320D849K708K485k647n227p61L375J868r28n288j833M341O736K163l710m821j749
336A561Q49j45j362J177K850M24j523j016J201K778l92m381n173m67M289N289
$$ plain form
352 5959 5808 2627 1270 2071 2814 1113 -1280 -846 234 -54 -1313 -878 2716 5799 4554 -917 -5588
369 -5588 -4324 217 2282 -1275 -3555 -691 2776 2482 -867 -1508 159 -61 -3478 -5309 -2435 2565
385 2565 4706 1660 -2602 -2694 1056 2177 -936 -4329 -2593 1330 2488 609 140 3441 4420 1148
401 1148 -3272 -2622 1135 3846 2778 -332 411 3637 5659 4165 1056 15 2343 2819 1720 1224
417 1224 4047 7070 5849 2327 2259 3550 5675 4270 2284 1801 3158 6753 7087 6147 4023 5427
433 5427 5925 5301 2457 3411 5901 6696 6211 4068 5263 6644 8501 6027 3153 1806 3985 7060
449 7060 6573 4509 4338 6293 7166 4981 2901 3383 5227 4498 2141 1733 4350 7067 6733 4019 1051
466 1051 2406 4852 4016 1088 31 3000 4802 3368 999 1515 3358 4142 129 -2400 -669 2665
$$ packed form
352E959j51l181j357Q01P43j701k393M34J080k88j259M35L594L083j245n471m671
369e588J264M541K065l557k280K864L467k94l349o41J667k20l417j831K874N000
385B565K141l046m262r2L750J121l113l393J736L923J158j879m69L301R79l272
401A148m420O50L757K711j068l110P43L226K022j494l109j041K328M76j099m96
417A224K823L023j221l522o8J291K125j405j986m83J357L595L34r40k124J404
433E427M98o24k844R54K490P95m85k143J195J381J857k474k874j347K179L075
449G060m87k064j71J955Q73k185k080M82J844p29k357m08K617K717l34k714k968
466A051J355K446q36k928j057K969J802j434k369N16J843P84m013k529J731L334
$$ plain form
482 2665 3074 713 -1065 683 2795 2186 -1003 -2943 -1325 532 -187 -2091 -1703 1688 2417 -82
498 -82 -2415 -2808 -339 -220 -2156 -2980 -2539 -84 331 -435 -2317 -2124 -799 -1077 -3203 -3470 -2230 121
516 121 -183 -1924 -1824 -34 549 -740 -2102 -3935 -2634 -716 662 -418 -1532 298 890 46 -1346
533 -1346 -3377 -447 128 -987 -1533 -1060 1515 2510 1002 -1444 -1837 -230 823 -193 -1723 -512
549 -512 2142 2923 789 -812 541 1774 940 -1536 -2025 406 3073 2425 -73 -9 1846 2874 520
566 520 -1653 -1478 888 2183 5 -923 786 2746 2434 -972 -2473 -1099 734 124 -1282 -1460 681
583 681 1987 408 -971 -1851 -1194 -814 -1948 -3134 -1910 33 921 -879 -1967 -1813 -1637 -2101 -3329
600 -3329 -4102 -3281 -2388 -1169 -1630 -2624 -2684 -2338 -2793 -4406 -5594 -4780 -2784 -2648 -3274 -3645 -3001 -2291 -3009
$$ packed form
482B665M09k361j778J748K112o09l189j940J618J857p19j904L88L391P29k499
498h2k333l93K469J19j936q24M41K455M15p66j882J93J325k78k126k67J240K351
516A21l04j741J00J790N83j289j362j833J301J918J378j080j114J830N92q44j392
533a346k031K930N75j115n46M73K575R95j508k446l93J607J053j016j530J211
549e12K654P81k134j601J353J233q34k476m89K431K667o48k498O4J855J028k354
566E20k173J75K366J295k178r28J709J960l12l406j501J374J833o10j406j78K141
583F81J306j579j379q80O57L80j134j186J224J943Q88j800j088J54J76m64j228
600c329p73Q21Q93J219m61r94o0L46m55j613j188Q14J996J36o26l71O44P10p18
$$ plain form
619 -3009 -4720 -5955 -5230 -3866 -3367 -4444 -4174 -2842 -1823 -2966 -5350 -5890 -3941 -3442 -4527 -5899
635 -5899 -4239 -1755 -1144 -2889 -4693 -4233 -2685 -3381 -4758 -5256 -3361 -960 -735 -2943 -3008 -1623 -649
652 -649 -3079 -5018 -3976 -1468 -673 -1684 -2286 -986 665 -65 -1654 -3206 -2377 -578 -719 -1061 -1310
669 -1310 450 2061 1099 -679 -1542 -171 437 -166 -787 429 1724 2358 1805 1041 792 739 975 487
687 487 -93 970 2254 2800 2473 1149 1345 1845 1826 914 281 508 1899 2402 2543 1480 1808 2449 2218
706 2218 607 -503 128 2233 2118 1025 845 1881 2941 1909 -372 -625 384 882 860 -517 347
723 347 2340 2849 1206 -476 -378 991 784 -572 -1498 76 1996 1818 -171 -654 422 772 -297
740 -297 -2238 -1449 285 1477 655 -460 129 607 619 -734 -1747 -1148 425 133 -555 -599 728 1444
$$ packed form
619c009j711j235P25J364M99j077K70J332J019j143k384n40J949M99j085j372
635e899J660K484O11j745j804M60J548o96j377m98J895K401K25k208o5J385R74
652f49k430j939J042K508P95j011o02J300J651p30j589j552Q29J799j41l42k49
669a310J760J611r62j778q63J371O08o03o21J216J295O34n53p64k49n3K36m88
687D87n80J063J284N46l27j324J96N00j9r12o33K27J391N03J41j063L28O41k31
706B218j611j110O31K105j15j093j80J036J060j032k281k53J009M98k2j377Q64
723C47J993N09j643j682R8J369k07j356r26J574J920j78j989m83J076L50j069
740b97j941P89J734J192q22j115N89M78J2j353j013N99J573k92o88m4J327P16
$$ plain form
758 1444 262 -216 -795 -497 -61 80 -326 -356 798 1468 904 -234 -264 314 318 71 205 381 1180 1778
778 1778 1834 1052 672 763 1423 1050 -350 293 2061 1965 1687 1365 1501 1596 1772 683 945 160 1959 2668
798 2668 1622 1507 2705 3087 3153 1400 1078 1579 2518 2705 1403 1417 2983 3658 2709 1063 1597 2825
816 2825 2567 1653 973 2175 3329 2896 2027 1374 2092 2710 2100 532 408 1745 2728 2043 846 1745
834 1745 2159 2457 1456 692 -36 774 1115 700 595 961 1554 1533 363 -126 141 272 -140 -516 -100 232
854 232 879 604 -343 -356 -803 -211 -781 -1243 -930 -689 541 -49 -707 -1145 -1078 -757 -1021 -2113 -1872 -1313
874 -1313 -434 -935 -1448 -1663 -608 -564 -1670 -2250 -2590 -1382 -205 -1312 -2905 -1301 -145 -688 -1436 -2298
892 -2298 -1801 -1102 -1027 -2135 -2166 -655 250 95 -1738 -1436 -1098 -571 -1673 -1909 -1044 449 667 -546 -531
$$ packed form
758A444j182m78n79K98M36J41m06l0J154O70n64j138l0N78Mk47J34J76P99N98
778A778N6p82l80R1O60l73j400O43J768r6k78l22J36R5J76j089K62p85J799P09
798B668j046j15J198L82O6j753l22N01R39J87j302J4J566O75r49j646N34J228
816B825k58r14o80J202J154m33q69o53P18O18o10j568j24J337R83o85j197Q99
834A745M14K98j001p64p28Q10L41m15j05L66N93k1j170m89K67J31m12l76M16L32
854B32O47k75r47j3m47N92n70m62L13K41J230n90o58m38O7L21k64j092K41N59
874a313Q79n01n13k15J055M4j106n80l40J208J177j107j593J604J156n43p48q62
892b298M97O99P5j108l1J511R05j55j833L02L38N27j102k36Q65J493K18j213J5
$$ plain form
911 -531 -92 113 -298 -1498 -1924 -836 578 87 -184 -74 813 166 210 -815 -561 182 -9 92 -359
930 -359 92 1143 1070 284 -287 -222 -451 -114 -757 72 81 646 952 545 231 -176 -48 -246 -988 39 266
951 266 582 180 22 -382 -708 121 -230 -809 -1324 -428 580 320 -502 -385 -174 727 -987 -1804 -2082 -578
971 -578 -477 -365 -1446 -756 196 -807 -2148 -2791 -1248 -618 -1492 -534 -1418 -1144 703 -119 -2221 -1795
989 -1795 -934 -1056 -1318 -2465 -825 -460 -791 -1552 -1084 -1836 -1258 -1905 -2216 -2305 -1439 -715 -1012 -1362 -1511 -1075
1009 -1075 -955 -1394 -2103 -1826 -1141 -865 -733 -1234 -842 -655 -502 -884 -1350 -1381 -1090 -744 -400 -279 -437 128
1029 128 73 -246 -524 -818 -205 -237 -160 1 93 804 631 616 -411 -52 490 273 -217 -319 613 1132 1173 523
1051 523 69 759 975 574 56 -37 1352 1662 784 859 925 1424 1268 248 -48 920 1060 1139 952 827 1457
$$ packed form
911e31M39K05m11j200m26J088J414m91k71J10Q87o47M4j025K54P43j91J01m51
930c59M51J051p3p86n71O5k29L37o43Q29RN65L06m07l14m07J28j98p42J027K27
951B66L16m02j58m04l26Q29l51n79n15Q96J008k60q22J17K11R01j714q17k78J504
971e78J01J12j081O90R52j003j341o43J543O30q74R58q84K74J847q22k102M26
989a795Q61j22k62j147J640L65l31p61M68p52N78o47l11q9Q66P24k97l50j49M36
1009a075J20m39p09K77O85K76J32n01L92J87J53l82m66l1K91L46L44J21j58N65
1029A28n5l19k78k94O13l2P7J61R2P11j73j5j027L59N42k17m90j02R32N19M1o50
1051E23m54O90K16m01n18r3J389L10q78P5O6M99j56j020k96R68J40P9j87j25O30
$$ plain form
1072 1457 1737 1326 296 552 644 1040 590 849 1229 1300 1866 739 60 388 904 753 -31 8 857 1166
1092 1166 806 804 514 814 332 414 82 -320 325 791 373 70 126 267 395 115 -386 -458 -250 -29 70 -134
1114 -134 -116 -218 80 -49 -646 -650 -261 -33 -366 -440 -280 290 365 -111 -534 252 -367 -203 -595 -777 -642 165
1136 165 -112 -338 -199 114 470 36 -585 -354 384 643 -111 -28 542 1445 201 603 -555 -336 769
1155 769 -161 21 -154 614 1298 767 401 202 899 1716 518 197 853 785 675 973 -92 1215 1260 557
1175 557 749 831 872 928 1133 1155 965 1128 1191 798 649 1274 1017 1654 576 1199 880 1231 1231 588 807 395
1197 395 449 545 864 950 222 834 1090 915 764 157 25 213 567 22 482 478 876 306 -121 272 80 91
1219 91 -441 -395 -617 -185 210 -410 -635 -618 -211 -559 -482 -853 422 122 -829 -297 -956 47 -68 -1014 -1406
$$ packed form
1072A457K80m11j030K56R2L96m50K59L80P1N66j127o79L28N16j51p84L9Q49L09
1092A166l60kk90L00m82Q2l32m02O45M66m18l03N6J41J28k80n01p2K08K21R9k04
1114a34J8j02K98j29n97mL89K28l33p4J60N70P5m76m23P86o19J64l92j82J35Q07
1136A65k77k26J39L13L56m34o21K31P38K59p54Q3N70R03j244M02j158K19J105
1155G69r30J82j75P68O84n31l66j99O97Q17j198l21O56o8j10K98j065J307M5p03
1175E57J92Q2M1N6K05K2j90J63O3l93j49O25k57O37j078O23l19L51%o43K19m12
1197C95N4R6L19Q6p28O12K56j75j51o07j32J88L54n45M60mL98n70m27L93j92J1
1219I1n32M6k22M32L95o20k25J7M07l48P7l71J275l00r51N32o59J003j15r46l92
$$ plain form
1240 -1406 -1183 -298 -301 -818 -1040 -431 -132 -124 -937 -1058 -968 -439 -1020 -1174 -981 -261 -283 -586 -851 -868 -572 -763
1262 -763 -1079 -1083 -638 -380 -567 -414 -523 -655 -457 -549 -885 -858 -545 259 -149 -312 -92 1 -378 -663 -128 -675
1284 -675 -495 -749 -375 -66 -353 148 194 1035 222 -819 -235 938 51 -403 -316 788 624 -45 -675 74
1304 74 -961 -303 153 107 802 704 416 276 717 -380 931 436 -184 159 520 875 639 -244 450 955
1324 955 434 65 -683 73 149 381 172 -273 14 504 -74 -444 -733 -420 386 -250 -466 -233 149 524
1344 524 -454 -222 -364 -739 -581 -352 -394 -331 -349 80 -291 -439 -663 -668 -445 -790 -1625 -739 -778 -324 -672 -366
1366 -366 -359 -164 -1117 -256 -710 -1099 -869 -537 -700 -1220 -673 -178 -764 -818 -1444 -1105 -845 -1092 -413 -198 369
1387 369 555 729 336 -405 -291 -355 288 -1184 -583 -92 -289 -265 -296 -234 477 -166 -52 -103 -170 274 413 352
$$ packed form
1240a406K23Q85ln17k22O09K99Qq13j21R0N29n81j54J93P20k2l03k65j7K96j91
1262g63l16mM45K58j87J53j09j32J98r2l36K7L13Q04m08j63K20R3l79k85N35n47
1284f75J80k54L74L09k87N01M6Q41q13j041N84J173q87m54Q7J104j64o69o30P49
1304G4j035O58M56m6O95r8k88j40M41j097J311m95o20L43L61L55k36q83O94N05
1324I55n21l69p48P56P6K32k09m45K87M90n78l70k89L13Q06o36k16K33L82L75
1344E24r78K32j42l75J58K29m2O3j8M29l71j48k24nK23l45q35Q86l9M54l48L06
1366c66PJ95r53Q61m54l89K30L32j63n20N47M95n86n4o26L39K60k47O79K15N67
1387C69J86J74l93p41J14o4O43j472O01M91j97K4l1O2P11o43J14n1o7M44J39o1
$$ plain form
1409 352 122 0 221 352 -107 65 453 385 447 481 195 514 281 43 487 330 493 475 230 735 460
1430 460 665 451 310 337 640 560 547 405 734 706 782 989 673 378 800 550 575 342 213 310 578 828
1452 828 594 507 724 491 602 27 46 333 259 419 70 214 617 866 99 -83 51 152 110 68 -101 390
1474 390 413 413 -144 -139 186 -159 -106 -476 -145 37 497 -247 -351 -300 314 63 -658 -86 -489 -4 129 -95
1496 -95 -249 -110 187 -365 -558 -344 0 -84 -28 -366 -394 191 257 -167 -293 -164 277 241 -266 -50 365 -95
1518 -95 159 299 12 -159 165 -262 -17 25 -78 389 518 510 213 131 -147 58 -81 317 763 15 398 176
1540 176 252 391 300 471 172 389 247 681 716 391 -174 898 129 286 -97 687 698 709 209 202 485 676
1562 676 631 493 346 554 683 330 156 248 804 798 560 180 348 260 35 83 -569 821 1456 42 294
$$ packed form
1409C52k30j22K21J31m59J72L88o8O2L4k86L19k33k38M44j57J63j8k45N05k75
1430D60K05k14j41K7L03q0j3j42L29k8P6K07l16k95M22k50K5k33j29R7K68K50
1452H28k34q7K17k33J11n75J9K87p4J60l49J44M03K49p67j82J34J01m2m2j69M91
1474C90K3%n57NL25l45N3l70L31J82M60p44j04N1O14k51p21N72m03M85J33k24
1496i5j54J39K97n52j93K14L44q4N6l38k8N85O6m24j26J29M41l6n07K16M15m60
1518i5K54J40k87j71L24m27K45M2j03M67J29qk97q2k78K05j39L98M46p48L83k22
1540A76P6J39r1J71k99K17j42M34L5l25n65J072p69J57l83P84J1J1n00pK83J91
1562F76m5j38j47K08J29l53j74R2N56ok38l80J68q8k25M8o52J390O35j414K52
$$ plain form
1583 294 -481 113 105 244 -148 -72 -625 -95 -85 126 61 227 165 -346 -663 -453 -453 -159 -145 30 -266 -330 230
1606 230 -592 -454 -318 -514 -363 -486 -162 -413 -193 -207 -123 -424 -420 -650 -551 -406 -742 -620 45 -106 -524 -644
1628 -644 -524 -418 -476 -744 -727 -276 -266 -271 -592 -431 -431 -172 -660 -612 -616 -394 -190 -445 -705 -154 -243 58 -343 -205
1652 -205 -402 -811 303 -529 725 28 309 36 -467 -687 -344 248 -440 -245 -402 526 824 987 449
1671 449 194 -419 630 -781 -277 863 -100 557 -355 632 100 305 168 -2 -194 450 282 123 413
1690 413 104 -308 244 171 64 -7 286 234 -246 131 266 -38 136 102 107 -130 -1 176 -150 95 -200 150
1712 150 138 109 -523 -547 -99 477 -188 -257 328 -325 -225 -315 -183 -698 111 -615 -592 -653 -1014 -191 -530 -240
1734 -240 -944 -424 -43 288 -414 -790 -299 -685 -451 196 -634 289 -354 -55 -441 -432 -199 -382 -678 31 -223
$$ packed form
1583B94p75N94qJ39l92P6n53N30J0K11o5J66o2n11l17K10%K94J4J75k96o4N60
1606B30q22J38J36j96J51j23L24k51K20j4Q4l01Mk30R9J45l36J22O65j51m18j20
1628f44J20J06n8k68J7M51J0nl21J61%K59m88M8mK22K04k55k60N51q9L01m01J38
1652b05j97m09J114q32J254o97K81k73n03k20L43N92o88J95j57R28K98J63n38
1671D49k55o13J049j411N04J140r63O57r12R87n32K05j37j70j92O44j68j59K90
1690D13l09m12N52p3j07p1K93n2m80L77J35l04J74l4Nk37J29J77l26K45k95L50
1712A50j2k9o32k4M48N76o65o9N85o53J00r0J32n15Q09p26K3o1l61Q23l39K90
1734b40p04N20L81L31p02l76M91l86K34O47q30R23o43K99l86RK33j83k96P09k54
$$ plain form
1755 -223 -167 -142 -137 201 -68 -132 -27 -598 -350 -269 68 297 114 -70 -4 10 -113 -104 -114 431 83 -45 -74 634
1779 634 508 154 273 -169 -141 918 95 375 -248 -224 1023 119 531 519 235 270 289 553 183 418 393
1800 393 551 302 501 393 507 107 148 471 869 570 203 368 469 769 106 58 380 302 245 5 132
1821 132 269 545 940 186 120 296 237 -66 -28 410 470 447 2 -65 -137 417 170 263 -35 147 128 336 -119
1844 -119 -193 482 249 -399 29 263 39 135 -171 61 -93 -116 129 94 -262 -322 -366 -186 -234 15 4 87 -24
1867 -24 -151 -118 -551 -386 -202 467 -242 -25 -212 -322 44 -18 -249 -59 215 36 116 -283 -272 226 63 -218
1889 -218 -305 19 -69 271 78 39 26 55 -86 86 316 324 19 -56 -179 169 65 -108 239 -120 259 63 -112
1912 -112 221 -38 270 -77 -148 333 559 554 379 -56 385 451 204 186 266 37 514 314 476 533 852 -242
$$ packed form
1755b23N6K5NL38k69o4J05n71K48Q1L37K29j83j84O6J4j23Rj0N45l48j28k9P08
1779F34j26l54J19m42K8J059q23K80o23K4J247r04M12j2k84L5J9K64l70K35k5
1800C93J58k49J99j08J14m00M1L23L98k99l67J65J01L00o63m8L22p8n7k40J27
1821A32J37K76L95p54o6J76n9l03L8M38O0k3m45o7p2N54k47R3k98J82j9K08m55
1844a19p4O75k33o48M28K34k24R6l06K32j54k3K45l5l56o0m4J80m8K49j1Q3j11
1867b4j27L3m33J65J84O69p09K17j87j10L66o2k31J90K74j79Q0l99J1M98j63k81
1889b18q7L24q8L40j93l9j3K9j41J72K30Ql05p5j23L48j04j73L47l59L79j96j75
1912a12L33k59L08l47p1M81K26nj75m35M41O6k47j8Q0k29M77k00J62N7L19j094
$$ plain form
1934 -242 19 469 -42 536 597 924 170 456 336 281 70 -95 -164 91 -74 210 -25 -52 365 165 287
1955 287 15 -50 -293 -31 -145 100 239 61 719 -310 -272 -176 -412 -703 246 -613 7 -178 -323 -161 -461
1976 -461 -358 226 -273 -121 -388 -533 -219 50 -610 -211 -108 -691 -215 -626 -173 -42 -277 -143 -658 -586
1996 -586 -186 -418 -86 -254 -174 -91 85 -142 -352 -317 -300 -280 -523 -72 -115 -396 -316 -17 -372 -103 -158 -144 -102
2019 -102 -475 -46 -419 30 -84 -81 126 124 -9 -315 -337 -36 -298 -194 95 161 103 -185 -55 -4 -330 34 216
2042 216 15 -71 -119 299 140 94 62 303 395 120 215 61 -112 112 -152 -118 241 -66 -152 228 -58 198 366
2065 366 305 -279 152 321 -213 841 -210 65 386 189 179 -125 -119 -87 60 135 532 30 363 638 -926
2086 -926 671 -30 102 -117 -443 -620 -14 170 -189 403 198 220 36 -456 138 43 -1289 64 -206 -239
$$ packed form
1934b42K61M50n11N78O1L27p54K86j20n5k11j65o9K55j65K84k35k7M17k00J22
1955B87k72o5k43K62j14K45J39j78O58j029L8R6k36k91R49q59O20j85j45J62l00
1976d61J03N84m99J52k67j45L14K69o60L99J03n83M76m11M53J31k35J34n15P2
1996e86M00k32L32j68Q0Q3J76k27k10L5J7K0k43M51m3k81Q0K99l55K69n5J4M2
2019a02l73M29l73M49j14LK07kj33l06k2L01k62J04K89O6n8k88J30N1l26L64J82
2042B16k01q6m8M18j59m6l2K41R2k75R5j54j73K24k64L4L59l07q6L80k86K56J68
2065C66o1n84M31J69n34J054j051K75L21j97j0l04OL2J47P5L97n02L33K75j564
2086i26J597p01J32k19l26j77O06J84l59N92k05K2j84m92N94r5j332J353k70l3
$$ plain form
2106 -239 -219 58 25 -307 176 -627 -802 -345 -295 -188 749 -236 -336 -505 -317 -745 -139 -202 -750 -330 -186
2127 -186 207 -129 -259 -301 -373 -133 -80 36 -430 72 -48 -235 264 -505 200 310 448 -331 -568 -245 8
2148 8 -6 84 171 -298 -353 48 518 -181 163 -17 414 473 25 -293 639 906 -85 -14 19 659 7 -90 186
2171 186 390 -58 288 -22 544 30 121 111 576 639 192 -618 -465 577 -743 -565 -148 189 -558 -106
2191 -106 817 802 545 179 595 -422 -119 439 -231 637 -112 691 609 -220 182 -595 -1166 134 22 43
2211 43 754 -506 215 484 -447 47 133 -451 245 65 -108 214 -360 25 536 -539 71 -413 -432 55
2231 55 -360 -902 60 -17 -321 20 -137 -959 341 -485 -640 -412 -345 -197 -693 -36 -293 261 143 -26 -429
2252 -429 29 -215 -257 -82 -230 26 -62 0 35 -355 -68 33 -261 -34 -16 -123 270 -403 94 -216 136 74
$$ packed form
2106b39K0K77l3l32M83q03j75M57N0J07R37r85j00j69J88m28O06o3n48M20J44
2127a86L93l36j30m2p2K40N3J16m66N02j20j87M99p69P05J10J38p79k37L23K53
2148Hj4R0Q7m69n5M01M70o99L44j80M31N9m48l18R32K67r91P1L3O40o52r7K76
2171A86K04m48L46l10N66n14R1j0M65O3m47q10J53J042j320J78M17L37p47M52
2191a06R23j5k57l66M16j017L03N58o70Q68p49Q03q2q29M02p77n71J300j12K1
2211D3P11j260P21K69r31M94Q6n84O96j80j73L22n74L85N11j075O10m84j9M87
2231E5m15n42R62p7l04L41j57q22J300q26j55K28O7J48m96O57k57N54j18j69m03
2252d29M58k44m2J75j48K56q8O2L5l90K87J01k94K27J8j07L93o73M97l10L52o2
$$ plain form
2274 74 -249 -97 -135 -183 -22 58 -424 -538 -77 304 266 76 93 -186 -205 -280 141 -161 180 -84 482 256 367
2297 367 82 47 -216 -90 21 287 319 -16 98 673 104 325 508 -415 -711 128 315 -574 646 1117
2317 1117 337 8 -21 460 100 -350 -1014 -455 -228 -94 58 168 110 -80 -126 223 -118 -208 -313 -232 -217 77
2339 77 -264 -138 -264 -88 -191 471 -166 -266 -44 -132 -116 -691 133 -340 77 -161 -12 123 -518 -366 182
2360 182 -220 -311 9 -170 -111 -1005 144 -268 -640 -117 133 -670 -989 152 -362 -891 -297 716 -444
2379 -444 -189 -316 -58 -201 285 -14 -51 107 -63 -105 -246 -219 -34 -329 -260 -150 -9 -69 78 103 -154 -246
2401 -246 -84 -16 -164 157 -243 -306 -170 190 -246 -205 119 109 -469 -45 177 -77 237 -202 115 -331 28
2422 28 159 -75 -207 25 -298 161 61 -167 60 27 -159 -237 -109 118 137 40 49 -26 -57 60 222 300 -38
$$ packed form
2274G4l23J52l8m8J61Q0m82j14M61L81l8j90J7k79j9p5M21l02L41k64N66k26J11
2297C67k85l5k63J26J11K66L2l35J14N75n69K21J83r23k96Q39J87q89J220M71
2317A117p80l29k9M81l60m50o64N59K27J34J52J10n8j90m6L49l41r0j05Q1J5K94
2339G7l41J26j26J76j03O62o37j00K22q8J6n75Q24m73M17k38J49J35o41J52N48
2360A82m02r1L20j79N9q94J149m12l72N23K50q03l19J141n14n29N94J013j160
2379d44K55j27K58j43M86k99l7J58j70m2j41K7J85k95O9J10J41o0J47K5k57r2
2401b46J62O8j48L21m00o3J36L60m36M1L24j0n78M24K22k54L14m39L17m46L59
2422B8J31k34j32K32l23M59j00k28K27l3j86p8J28K27J9r7Rp5l1J17J62P8l38
$$ plain form
2445 -38 115 -176 442 -132 285 10 163 32 -82 253 -9 -172 -173 84 -74 -63 -65 204 -181 30 -252 101
2467 101 -8 -67 -384 -245 -301 -204 -267 -99 79 -226 -93 337 177 -766 432 -706 239 194 198 123 -79 -434
2489 -434 -337 56 258 -66 -476 98 150 203 68 -560 651 44 367 -685 -66 -29 1559 907 -226 94
2509 94 334 66 -771 -185 86 372 -797 420 -54 295 -300 -139 -5 -57 609 331 -966 -29 418 -37
2529 -37 -439 427 -274 221 413 935 -145 -539 437 546 464 -36 281 319 175 -4 204 227 -161 785 421
2550 421 325 -511 217 358 817 827 74 -89 503 235 96 74 190 195 740 214 -269 361 -36 42 -460 50
2572 50 -286 -81 -515 138 568 34 -232 185 -314 701 -258 4 -344 54 795 819 192 -211 397 846
2592 846 -362 -206 398 229 -32 343 -330 -1338 -841 -862 376 -190 62 169 872 395 -299 -489 32
$$ packed form
2445c8J53k91O18n74M17k75J53j31j14L35k62j63jK57j58J1kK69l85K11k82L53
2467A01j09n9l17J39n6R7o3J68J78l05J33M30j60r43J198j138R45m5Mp5k02l55
2489d34R7L93K02l24m10N74N2N3j35o28J211o07L23j052O19L7J588o52j133L20
2509I4K40k68q37N86K71K86j169J217m74L49n95J61J34n2O66k78j297R37M47m55
2529c7m02Q66p01M95J92N22j080l94R76J09q2n00L17L8j44j79K08K3l88R46l64
2550D21r6q36P28J41M59J0p53j63N92k68j39k2J16NN45n26m83O30l97P8n02N10
2572E0l36K05m34O53M30n34k66M17m99J015r59K62l48L98P41K4o27m03O08M49
2592H46j208J56O04j69k61L75o73j008M97k1J238n66K52J07P03m77o94j90N21
$$ plain form
2611 32 -380 61 -506 347 -820 106 87 -573 270 -301 298 -395 131 -88 -234 -1309 36 19 -317 -311 -71
2632 -71 -217 -39 223 -174 -505 37 -420 185 289 177 -629 -148 -201 -138 414 -26 -152 459 -668 123 275
2653 275 -84 26 -222 721 282 -608 1139 -112 372 -156 -156 228 -348 499 431 47 -506 -325 390 -174
2673 -174 115 169 -436 445 221 -8 20 181 -23 85 309 63 -126 307 -84 1 349 257 174 228 152 56 270
2696 270 23 93 -35 132 -80 -103 -23 368 -11 317 46 277 30 -267 -1195 215 -456 -269 123 -435 203
2717 203 427 162 -294 -22 -92 -123 -503 346 -596 -391 -553 32 -409 -72 -243 -241 -84 -225 6 -314 -194
2738 -194 -156 -349 -194 -273 -86 -73 -111 117 -108 -151 -158 -293 -15 -197 747 -406 -136 147 338 -163 -16 -759
2760 -759 46 956 944 -47 235 113 -77 -231 -102 105 -301 -3 34 -202 -307 18 55 129 65 -209 -609 -263
$$ packed form
2611C2m12M41n67Q53j167R26j9o60Q43n71N99o93N26k19j46j075J345j7l36OK40
2632g1j46J78K62l97l31N42m57O05J04j12q06M81n3O3N52m40j26O11j127P91J52
2653B75l59J10k48R43m39q90J747j251M84n28%L84n76Q47o8l84n53J81P15n64
2673a74K89N4o05Q81k24k29K8J61k04J08K24k46j89M33l91Q5L48r2q3N4p6r6K14
2696B70k47P0j28J67k12k3Q0L91l79L28k71K31k47k97r28J410o71J87L92n58O38
2717B03K24k65m56K72p0l1l80Q49r42K05j62N85m41L37j71KJ57j41K31l20J20
2738a94L8j93J55p9J87J3l8K28k25m3pj35K78j82R44j153K70K83J91n01J47p43
2760g59Q05R10j2r91K82j22j90j54J29K07m06K98L7k36j05L25L7P4o4k74m00L46
$$ plain form
2782 -263 15 235 373 -82 -143 -295 36 205 -93 458 -157 -159 -210 244 160 192 -186 -80 146 154 138 -12 122
2805 122 -27 239 -97 69 204 167 26 -19 -31 153 282 -186 146 422 254 -225 -83 -42 271 -56 -1 -684
2827 -684 -546 -96 -512 -388 77 -702 -418 1367 -343 -230 -109 -41 215 719 66 -128 -206 -242 117 -351
2847 -351 -85 -297 627 -258 434 -67 -207 61 -399 98 64 -344 -492 -186 118 -51 -21 261 42 97 -451
2868 -451 201 -395 -308 -84 -451 -1361 384 294 -222 -282 -774 70 -593 1424 938 -743 318 1671 -424
2887 -424 -73 105 1038 -528 458 -82 -79 312 -243 852 -621 1 81 392 -349 518 63 172 -506 927
2907 927 152 -84 203 -388 130 -243 133 504 -25 548 433 62 -383 -50 204 76 503 123 116 85 202
2928 202 -99 -93 388 -462 -244 265 -367 379 25 272 154 496 666 18 -101 -486 -969 315 338 413 -250
$$ packed form
2782b63K78K20J38m55o1j52L31J69k98N51o15kn1M54q4L2l78J06K26Qj6j50J34
2805A22j49K66l36J66J35l7j41m5j2J84J29m68L32K76j68m79J42M1L13l27N5o83
2827f84J38M50m16J24M65p79K84J785j710J13J21O8K56N04o53j94p8l6L59m68
2847c51K66k12R24q85O92n01j40K68m60M97l4m08j48L06L04j69L0K82k19N5n48
2868d51O52n96Q7K24l67r10J745r0n16o0m92Q44o63K017m86j681J061J353k095
2887d24L51J78R33j566R86n40LL91n55J095j473O22Q0L11p41Q67m55J09o78J433
2907I27p75k36K87n91N18l73L76L71n29N73j15l71m45L33K54j28M27l80pl1J17
2928B02l01OM81q50K18N09o32P46l54K47j18L42J70o48j19l85m83J284K3P5o63
$$ plain form
2949 -250 5 -297 -250 239 98 153 63 275 -2 -231 -247 -118 302 -314 -137 202 704 -325 -32 192 -238
2970 -238 452 -498 -20 -33 -308 201 -68 -217 31 -51 63 -244 145 85 150 -149 179 -228 -41 -332 -12
2991 -12 -362 183 18 -140 7 -192 -105 -243 -171 -244 -78 -9 200 -76 -58 -375 226 -184 68 606 245 -195
3013 -195 -420 -420 26 -111 -35 156 -178 -64 -262 -481 102 177 -8 140 224 101 464 -478 309 271 17 369
3035 369 31 -291 -414 -441 204 37 -77 -159 68 -433 -85 213 -275 -397 -352 283 210 -364 20 -77 387 425
3057 425 12 -173 -7 26 35 -48 -148 -167 -114 263 -247 253 -46 -43 -72 60 -121 -93 215 140 164 -349 495 206
3081 206 -385 123 102 -371 -141 -87 22 -149 75 190 -12 266 -188 -35 31 34 -266 -201 -247 50 238 -36
3103 -36 -281 -2 -73 -279 -19 176 8 -176 -104 169 -270 -8 -5 -55 -146 -84 50 227 -434 -156 201 -68 262
$$ packed form
2949b50K55l02M7M89j41N5r0K12k77k29j6J29M20o16J77L39N02j029K93K24m30
2970b38O90r50M78j3k75N09k69j49K48q2J14l07L89o0O5k99L28m07J87k91L20
2991a2l50N45j65j58J47j99Q7j38P2p3J66O9K09k76J8l17O01m10K52N38l61m40
3013a95k25%M46j37P6J91l34J14j98k19N83P5j85J48Q4j23L63r42P87l8k54L52
3035C69l38l22j23k7O45j67j14q2K27n01L48K98m88j22M5O35p3n74L84r7M64L8
3057D25m13j85J66L3Rq3j00j9N3L77n10N00k99Lk9J32j81K8L08p5K4n13Q44k89
3081B06n91N08k1m73K30N4J09j71K24J15k02K78m54J53O6Ll00O5m6K97J88k74
3103c6k45K79p1k06K60J95j68j84P2K73m39K62Ln0r1O2J34J77o61K78L57k69L30
$$ plain form
3126 262 -68 135 217 -226 145 -189 -109 -267 39 134 -604 -171 -94 29 306 -182 717 -309 397 504 362
3147 362 159 94 113 -150 253 -241 -15 -69 49 -110 67 -69 99 -367 69 45 301 108 -302 -52 -433
3168 -433 -237 -54 81 -615 425 -39 -536 307 937 -751 167 -618 -419 -344 136 370 -110 -445 438 661
3188 661 -681 499 39 333 614 -253 203 651 -273 -700 613 87 164 -448 -44 120 1141 -349 -199
3207 -199 -764 -533 -74 725 -675 292 -1500 -716 -110 -956 -272 -480 -69 -32 541 -236 176 -192 -71 -1185
3227 -1185 -880 -1099 560 -121 269 -424 5 90 170 -859 -5 -122 -440 -134 -161 -861 507 -125 134 -105
3247 -105 -163 -52 -339 -129 -68 -1917 -98 -775 164 1002 -884 865 160 -328 -306 532 214 79 634 -199
3267 -199 -263 193 257 37 210 -212 102 -254 -10 109 65 -430 295 68 185 -42 -113 -53 415 -119 234 -160
$$ packed form
3126B62l30K03Q2m43L71l34Q0j58L06R5p38M33P7J23K77m88Q99j026P06J07j42
3147C62k03o5J9k63M03m94K26n4J18j59J77j36J68m66M36k4K56j93m10K50l81
3168d33J96J83J35o96J040m64m97Q43O30j688R18p85J99P5M80K34m80l35Q83K23
3188F61j342J180m60K94K81q67M56M48r24m27J313n26P7o12M04J64J021j490J50
3207a99n65K31M59P99j400R67j792P84O06q46O84k08M11L7N73p77M12l68J21j114
3227a185L05k19J659o81L90o93M29Q5Q0j029Q54j17l18L06k7p00J368o32K59k39
3247a05n8J11k87K10O1j849J819o77R39Q38j886J749p05m88K2Q38l18j35N55q33
3267a99o4M56O4k20J73m22L14l56K44J19m4m95P25k27J17k27p1O0M68n34L53l94
$$ plain form
3289 -160 27 193 -49 -37 -119 317 177 199 61 43 380 -34 -24 125 91 -22 -52 68 -75 162 205 77 -134
3312 -134 206 -84 141 454 -249 218 -40 421 121 29 -24 583 220 13 390 254 -169 -228 22 -75 241
3333 241 -20 426 212 317 139 330 213 -916 -84 528 376 -210 -91 -441 309 607 508 1203 725 -14
3353 -14 618 412 -30 -42 94 242 125 22 -312 34 -202 -83 -219 -577 -99 16 -47 76 -88 -9 -187
3374 -187 256 35 -274 -110 121 315 10 -119 -129 56 62 164 109 167 69 42 217 200 261 82 33 169 -222
3397 -222 -133 221 -114 91 30 33 36 -20 27 449 308 457 426 216 484 -338 125 -320 2 223 238 282 284 -58
3421 -58 280 78 2 -132 9 -241 246 75 129 -240 -90 -72 230 77 35 68 59 -221 7 -357 47 -118 -81
3444 -81 246 349 43 36 -212 293 -34 14 211 61 -24 -190 315 190 166 -103 243 -367 -56 -206 1 -287
$$ packed form
3289a60J87J66k42J2q2M36j40K2j38j8L37m14J0J49l4j13l0J20j43K37M3j28k11
3312a34L40k90K25L13p03M67k58M61l00r2n3O07l63k07L77j36m23n9K50r7L16
3333B41k61M46k14J05j78J91j17j129Q32O12j52n86J19l50P50K98r9O95m78p39
3353a4O32k06m42j2J36J48j17j03l34L46k36J19j36l58M78J15o3J23j64P9j78
3374a87M43k21l09J64K31J94l05j29j0J85OJ02n5N8r8k7J75j7O1j79m9J36l91
3397b22Q9L54l35K05o1LLn6M7M22j41J49l1k10K68q22M63m45L22K21J5M4Kl42
3421e8L38k02p6j34J41k50M87j71N4l69J50J8L02j53m2L3rk80K28l64M04j65L7
3444h1L27J03l06pk48N05l27M8J97j50q5j66N05j25k4k69L46o10L11j50K07k88
$$ plain form
3466 -287 162 -106 -63 -112 184 -447 40 46 -34 -706 708 -710 -309 11 153 223 -454 -203 -308 -824 -190
3487 -190 903 -226 -19 478 852 567 255 -185 872 207 -127 636 -49 -719 968 -542 462 -225
3505 -225 569 547 495 95 -7 -597 -237 -531 912 -35 690 1027 -41 397 -233 -269 437 98 315 -829
3525 -829 65 -716 -375 -355 41 1232 -391 -43 527 -9 233 -233 -316 247 -78 -1056 220 229 376 28
3545 28 140 344 565 1252 -372 7 -523 959 -159 -347 0 -26 81 -312 14 -216 -599 -137 138 316
3565 316 -192 132 142 -76 92 192 -118 156 -94 -271 193 26 143 179 118 295 87 188 61 -507 54
3586 54 -133 2 70 30 -118 -70 99 11 -313 59 -283 627 11 795 278 111 -245 -93 -644 220 228 -122
3608 -122 28 -352 -73 153 56 92 -1089 -34 248 -326 -321 -483 0 -357 44 221 262 136 -287 98 -210
$$ packed form
3466b87M49k68M3m9K96o31M87Oq0o72J414j418M01L20J42P0o77K51j05n16O34
3487a90J093j129K07M97L74k85l12m40J057o65l34P63o85o70J687j510J004o87
3505b25P94k2n2m00j02n90L60k94J443r47P25L37j068M38o30l6P06l39K17j144
3525h29Q94p81L41K0L96J191j623L48N70n36K42m66q3N63l25r78J276RJ47l48
3545B8J12K04K21O87j624L79n30J482j118j88L47k6J07l93L26k30l83M62K75J78
3565C16n08L24J0k18J68J00l10K74k50j77M64j67J17L6o1J77k08J01j27n68N61
3586E4j87J35O8m0j48M8J69q8l24L72l42R10o16P84n17j67l56J52n51Q64Ql50
3608a22J50l80K79K26r7L6j181J055K82n74Nj62M83l57M01J77M1j26m23L85l08
$$ plain form
3629 -210 -120 -298 133 164 -95 246 58 -107 -335 -66 -472 -416 -136 474 332 261 246 228 -341 -143 -87 97
3651 97 92 -89 543 641 -135 -192 -1 -185 -132 73 -22 57 -331 144 -203 0 -274 -55 -92 -91 -68 53 -346 -46
3675 -46 120 54 -36 218 98 -194 -119 -20 -187 125 -169 258 98 56 -268 -210 -529 -71 -10 -45 133 -378 -125
3698 -125 -593 159 -63 -370 150 -386 -660 419 -160 -602 -551 -63 -792 -639 -801 -1384 -320 -368 -627 -168
3718 -168 289 -419 -673 569 540 90 -276 -550 1238 491 -909 -195 824 396 379 1101 -307 607 -257
3737 -257 30 -100 -210 273 -41 173 -129 -13 -24 -270 75 -38 -3 113 -230 187 -129 -248 554 226 357
3758 357 -265 -137 -48 -62 89 137 -107 237 150 -104 78 -116 304 106 144 -510 66 -42 135 196 66 -33
3780 -33 316 -327 -239 -81 197 -333 -62 -67 182 -34 -91 -166 -16 127 -116 -117 -72 110 -406 -39 73 -26 34 -80
$$ packed form
3629b10R0j78M31L1k59L41j88j65k28K69m06N6K80O10j42p1j5j8n69J98N6J84
3651I7nj81O32R8p76n7J91j84N3K05r5P9l88M75l47K03k74K19l7JK3J21l99L00
3675d6J66o6r0K54j20k92P5R9j67L12k94M27j60m2l24N8l19M58O1l5J78n11K53
3698a25m68P52k22l07N20n36k74J079n79m42N1M88p29J53j62n83J064m8k59M59
3718a68M57p08k54J242k9m50l66k74J788p47j400P14J019m28j7P22j408R14q64
3737b57K87j30j10M83l14K14l02J16j1k46L45j13L5J16l43M17l16j19Q02l28J31
3758C57o22J28Q9j4J51M8k44L44q7k54J82j94M20j98L8o54N76j08J77O1j30r9
3780c3L49o43Q8J58K78n30K71nK49k16n7p5J50J43k43jM5J82n16L67J12r9O0j14
$$ plain form
3804 -80 276 -83 -36 -4 -27 -125 -159 -33 -11 162 -248 -25 16 39 152 -147 94 151 717 -531 -497 -36 296
3827 296 283 -492 214 -37 -196 -180 -514 600 862 269 -199 357 -89 390 328 -302 590 93 -490 -148 298
3848 298 -420 593 240 108 -88 -94 -78 -74 -345 271 10 180 212 72 32 -52 -88 -14 -102 186 -548 -65 21 49
3872 49 15 -177 188 20 -185 0 -12 195 -523 424 249 1026 -372 280 466 -44 29 -345 -1 -46 213
3893 213 -261 -78 4 704 201 590 -20 9 -128 -629 -112 -497 -62 202 -299 -529 -22 -513 273 -78 -390
3914 -390 47 39 -374 44 3 490 32 -255 118 -97 -89 11 -118 123 -74 94 276 -151 -73 242 -99 -24
3936 -24 -258 269 -190 -119 -351 665 4 441 -88 -747 114 60 184 -209 121 -118 11 65 -240 56 52 -2
3958 -2 -70 -500 -364 -311 -118 757 860 -1254 381 603 473 136 860 492 -550 -451 840 -454 -850 -495
$$ packed form
3804h0L56l59M7L2k3r8l4J26K2J73m10K23M1K3J13k99K41N7N66j248L4M61L32
3827B96j3p75P06k51j59J6l34J114K62n93m68N56m46M79o2o30Q92m97n83L42M46
3848B98p18J013l53j32j96oJ6Mk71O16k61J70L2j40m0q4l6P4q8K88p34M83Q6K8
3872D9l4j92L65j68k05J85j2K07p18R47j75P77j398O52J86n10P3l74L44m5K59
3893B13m74J83Q2P00n03L89o10K9j37n01N17l85M35K64n01k30N07m91P86l51l12
3914c90M37qm13M18m1M87m58k87L73k15QJ00j29K41j97J68J82m27P8L15l41P5
3936b4k34N27m59P1k32J016o61M37n29o59Q61n4J24l93L30k39J29N4l05K96mn4
3958bo8m30J36N3J93Q75J03k114J635K22j30l37P24l68j042R9J291j294l96L55
$$ plain form
3978 -495 242 497 281 133 194 303 100 45 52 99 -240 23 31 135 -107 805 -5 -161 -123 428 -127 3 -285
4001 -285 -247 274 -122 -593 498 -448 55 534 495 94 426 268 -67 -53 316 197 -399 -160 -306 58 -152
4022 -152 263 838 -442 184 139 839 -1015 49 -446 -393 -448 758 150 404 -109 295 467 -462 659
4041 659 -1261 927 -846 -341 53 -99 194 288 -285 101 654 -677 721 -601 20 -58 -355 -51 -715
4060 -715 -446 36 529 -3 -3 -261 387 36 -18 -499 132 105 -44 830 17 209 -161 140 -47 -363 188
4081 188 78 69 -413 465 -106 -189 143 581 -750 140 1074 172 -121 153 25 340 224 241 -403 196 -360
4102 -360 581 -259 -1142 92 188 -902 376 318 888 218 -213 196 317 -614 -183 -299 603 891 111 -312
4122 -312 126 100 -536 61 364 -28 -525 800 -213 -109 -330 -217 469 -119 6 -192 109 -8 459 121
$$ packed form
3978d95P37K55k16j48O1J09k03n5PM7l39K63QJ04k42R12q10j56L8N51n55J30k88
4001b85L8N21l96m71J091r46N03M79l9m01L32j58l35J4L69j19n96K39j46L64k10
4022a52M15N75j280O26m5P00j854J064m95N3n5J206o08K54n13M04J72r29J121
4041F59j920K188j773N05L94j52K93R4n73L86N53j331J398j322O21p8k97L04o64
4060g15K69M82M93n32%k58O48l51n4m81O31k7j49Q74q13J92l70L01j87l16N51
4081A88j10rm82Q78n71q3L32M38j331Q90R34r02k93K74j28L15j16J7o44N99n56
4102c60R41q40q83J234R6j090J278n8N70o70m31M09J21r31M31j16R02K88p80m23
4122c12M38k6o36N97L03l92m97J325j013J04k21J13O86n88J25j98L01j17M67l38
$$ plain form
4142 121 138 154 171 -279 416 -281 -74 -30 -423 -81 -270 -106 -305 -232 261 253 344 -98 -100 159 -358 -449 -310 367
4166 367 117 521 179 284 -1 60 -100 341 219 100 112 -435 42 97 600 -11 -474 133 382 168 357
4187 357 -560 -600 360 681 -925 -506 575 -165 -318 -102 -1174 417 697 54 1072 -253 20 447
4205 447 -43 63 469 420 -202 -413 -80 -12 64 219 916 560 -33 -32 32 992 -347 533 -261 411 -620
4226 -620 473 237 104 -381 -169 -277 -485 273 -599 -92 -379 -261 9 255 266 -43 406 -242 46 408
4246 408 -189 -21 377 139 260 158 0 309 198 214 190 -180 -59 -245 -66 -18 167 124 30 127 -106 -38
4268 -38 -20 -23 602 28 -47 -121 -294 41 258 -27 -192 138 -19 223 241 -210 -504 -267 -250 -154 -356 -93 -618
4291 -618 -100 0 94 -433 554 492 399 -17 -98 225 -28 130 -84 190 -460 18 -422 -5 274 809 81
$$ packed form
4142A21J7J6J7m50O95o97K07M4l93L42j89J64j99P3M93qR1m42kK59n17r1J39O77
4166C67k50M04l42J05k85O1j60M41j22j19J2n47M77N5N03o11m63O07K49k14J89
4187C57r17m0R60L21j606M19J081p40j53K16j072J591K80o43J018j325K73M27
4205D47m90J06M06m9o22k11L33O8P6J55O97l56n93JO4R60j339Q80p94O72j031
4226f20J093k36j33m85K12j08k08P58q72N07k87J18K70K46J1l09M49o48K88L62
4246D08n97J68L98k38J21j02j58L09j11J6k4l70J21j86J79M8J85m3r4R7k33O8
4268c8J8lO25n74p5p4j73L35K17k85j65L30j57K42J8m51k94K37J7R6k02K63n25
4291f18N18J00R4n27R87o2r3m16q1L23k53J58k14K74o50M78m40M17K79N35p28
$$ plain form
4312 81 2 -353 299 158 -173 -593 -339 -50 -232 -66 -183 337 -150 -379 62 -267 65 -190 -121 186 71
4333 71 388 -16 -163 -124 -218 -158 -68 -56 68 116 151 325 -225 272 -602 47 -938 36 806 402 -613 147
4355 147 1425 1 227 191 51 -146 -292 -135 -24 56 93 -66 145 -98 27 45 -157 59 -106 -436 348
4376 348 -21 48 -478 -197 -62 -324 -140 208 106 -149 -10 54 351 -158 -308 -745 339 -229 -373 -36
4396 -36 1029 301 -3 -124 101 474 329 31 -129 -206 437 -141 -220 -115 309 124 -323 -358 130 211 163 -178
4418 -178 -173 70 -391 131 80 320 -289 -83 29 35 43 257 253 -327 -23 -94 511 -265 -7 28 -244 -279 -45 -228
4442 -228 -16 194 224 298 -87 -43 -26 87 -125 189 -15 -124 2 -250 30 -2 82 -69 19 -68 -10 -55 107
4465 107 -65 114 -47 52 15 135 113 75 331 183 334 155 418 -104 142 21 168 277 -231 26 -39 -287
$$ packed form
4312H1p9l55O52j41l31m20K54K89j82J66j17N20m87k29M41l29L32k55O9L07j15
4333G1L17m04j47L9r4O0R0J2J24M8L5J74n50M97q74O49r85R74P70m04j015P60
4355A47J278j424K26l6j40j97j46J57J11Q0L7j59K11k43J25J8k02K16j65l30P84
4376C48l69O9n26K81J35k62J84L48j02k55J39O4K97n09j50m37J084n68j44L37
4396c6J065p28l04j21K25L73j45k98j60p7O43n78p9J05M24j85m47l5M88Q1m8l41
4418a78NK43m61N22n1K40o09K06J12OQK14mn80L04p1O05p76K58L5k72l5K34j83
4442b28K12K10L0P4l85M4J7J13k12L14k04j09J26k52K80l2Q4j51Q8q7N8m5J62
4465A07j72J79j61R9l7J20k2l8K56j48J51j79K63n22K46j21J47J09n08K57o5k48
$$ plain form
4487 -287 -37 363 -372 -194 -230 -215 211 104 306 87 -453 158 264 523 -87 -206 237 -503 78 1165
4507 1165 -38 -215 -404 -306 91 -635 -265 658 86 -469 -507 -1205 -441 -359 -1024 -356 425 585 -543 287
4527 287 -124 282 201 289 -163 -635 209 -17 -710 5 -9 195 459 146 -71 -509 -672 -211 -463 19 1054
4548 1054 156 235 -702 343 -126 -255 -814 -674 -116 -482 -51 -266 484 128 398 -320 -41 95 31 96
4568 96 39 -299 263 -173 75 -25 -111 142 325 -303 221 -50 219 -1 -587 162 -141 631 250 -77 -37
4589 -37 200 -82 -64 37 207 -332 332 -425 -73 -629 -403 681 126 453 454 -450 569 851 773 243 -757
4610 -757 513 -34 120 -722 36 136 -239 541 754 -540 46 -931 240 366 -157 -161 335 782 -282
4629 -282 160 -28 -85 -235 248 -55 -662 546 247 -266 87 49 -141 -202 -145 -366 -7 -157 -95 -174 147 -190
$$ packed form
4487b87K50M00p35J78l6J5M26j07K02k19n40O11J06K59o10j19M43p40N81J087
4507A165j203j77j89R8L97p26L70R23n72n55l8o98P64Q2o65O68P81J60j128Q30
4527B87m11M06q1Q8m52m72Q44k26o93P15j4K04K64l13k17m38j63M61k52M82J035
4548A054q98P9r37J045m69j29n59J40N58l66M31k15P50l56K70p18K79J36o4O5
4568I6n7l38N62m36K48j00q6K53J83o28N24k71K69k20n86P49l03P72l81l27M0
4589c7K37k82J8J01J70n39O64p57L52n56K26J084n55L27Jr04J019K82p8n30j000
4610g57J270n47J54q42P58J00l75P80K13j294N86r77J171J26n23mM96M47j064
4629b82M42j88n7j50M83l03o07J208k99n13L53l8j90o1N7k21L59j50O2p9L21l37
$$ plain form
4651 -190 305 -192 -191 138 -326 108 209 -125 -172 -374 -19 -35 -109 -120 17 -28 -228 195 -59 -215 -377 552
4673 552 157 365 -106 293 437 18 -115 -787 -765 -55 261 95 -401 73 185 -75 320 -296 -310 -35 53
4694 53 -28 50 -221 -28 6 299 67 311 570 387 -203 685 -233 -271 -1026 -9 -407 809 592 604 261
4715 261 185 377 -327 -197 -132 457 -754 -249 36 -241 645 -1002 -351 -387 -119 650 -104 -443 12 -413
4735 -413 -576 130 -62 -271 -187 110 -310 -145 94 271 -156 5 129 310 219 207 129 -33 -238 -4 -15 457
4757 457 -31 43 216 -254 -375 -15 -128 107 -218 145 79 561 -214 -202 113 446 321 -177 66 -275 -581
4778 -581 234 781 -784 639 -267 -705 -389 87 1200 558 -198 -143 -1149 -810 -885 -628 430 35 137
4797 137 -225 -355 452 355 -282 -71 126 -216 250 -157 -181 161 -188 171 98 -19 2 126 -223 68 134 84
$$ packed form
4651a90M95m97JL29m64M34J01l34m7k02L55j6p4j1J37m5k00M23k54j56j62R29
4673E52l95K08m71L99J44m19j33o72K2P10L16j66m96M74J12k60L95o16j4K75Q8
4694E3q1P8k71J93L4K93k32K44K59j83n90Q88r18l8p55J017l98J216k17J2l43
4715B61p6J92p04J30O5N89j211N05K85k77Q86j647O51l6K68P69p54l39M55m25
4735d13j63P06j92k09Q4K97m20J65K39J77m27J61J24J81r1j2p8j62k05K34j1M72
4757D57m88P4J73m70j21L60j13K35l25L63o6M82p75J2L15L33j25m98K43l41l06
4778e81Q15N47j565J423r06m38L16M76J113o42p56N5j006L39p5K57J058l95J02
4797A37l62j30Q07r7o37K11J97l42M66m07k4L42l49L59p3j17K1J24l49K91O6n0
$$ plain form
4819 84 -256 114 -259 89 -138 243 -230 11 -13 -182 30 137 71 -46 -115 -20 -329 54 -60 17 93 428
4841 428 36 6 -22 -514 -38 48 49 -70 197 36 19 20 22 -26 104 -38 326 -206 53 116 -24 -142 47 274
4865 274 -179 103 30 76 372 188 9 41 -183 -79 222 334 245 -34 -438 -111 203 -7 -67 -261 24 11
4887 11 -230 -50 -181 -57 222 -57 65 -17 -133 300 162 -192 38 -20 168 66 -76 365 -94 73 -17
4908 -17 -212 106 136 -80 -25 26 86 48 116 -58 89 -34 -38 -98 285 24 -321 -162 -44 189 -96 192 -373
4931 -373 -145 85 115 39 -4 102 139 -64 70 -149 44 -25 -108 271 -3 -238 -13 -46 -164 -130 288 -69 -206
4954 -206 -188 -187 319 182 46 -58 228 -182 168 -75 -124 143 -558 -532 -93 -17 369 -505 -175 -315 -122 -10
4976 -10 -1372 667 -1121 113 1357 -88 1052 -337 -1218 -409 1170 -526 175 319 642 -1119 -7
$$ packed form
4819H4l40L70l73L48k27L81m73K41k4j69K12J07o6j17o9R5l09L83j14P7P6L35
4841D28l92l0k8m92M76Q6Jj19K67j61j7JKm8J30j42L64n32K59O3j40j18J89K27
4865B74m53K82p3M6K96j84j79L2k24J04L01J12q9k79m04L27L14k10o0j94K85j3
4887A1k41J80j31J24K79k79J22q2j16M33j38l54K30n8J88j02j42M41m59J67r0
4908a7j95L18L0k16N5N1O0l8O8j74J47j23mo0L83k61l45J59J18K33k85K88n65
4931c73K28K30L0p6m3J06L7k03J34k19J93o9q3L79k74k35K25l3j18L4M18l57j37
4954b06J8JN06j37j36j04K86m10L50k43m9K67p01K6M39P6L86q74L30j40J93J12
4976a0j362K039j788J234J244j445J140j389q81Q09J579j696P01J44L23j761J112
$$ plain form
4993 -7 -1353 -569 -251 -435 -504 -505 -444 1354 -469 -1072 -96 -288 -327 -195 -1087 428 116 53 646 -690 81
5014 81 -1081 477 -553 -293 -936 706 -28 -24 1446 -31 18 440 780 115 155 -414 -646 -194 971
5033 971 -47 494 1007 73 -129 384 513 612 -102 -554 -167 -545 -436 457 -48 9 104 444 668 259 42
5054 42 302 -361 606 49 64 2 553 -360 950 1669 -1172 663 -1054 -212 636 578 419 -358 -475 -18
5074 -18 634 211 457 -12 1853 -61 21 709 74 273 -75 730 291 -275 -100 1871 -676 -42 97
5093 97 947 -587 -616 195 -516 -554 786 -528 -913 -216 -355 -614 500 694 810 151 -189 234 -529 -344
5113 -344 864 729 -789 740 361 367 428 384 151 -612 -179 -87 48 63 188 -103 -315 6 59 147 -199 27
5135 27 -146 -284 223 329 152 -216 94 306 153 106 -436 -20 974 153 203 248 -226 -48 -3 227 -229 70
$$ packed form
4993gj346P84L18j84o9jO1J798j823o03R76j92l9J32q92J515l12o3N93j336P71
5014H1j162J558j030K60o43J642p34MJ470j477M9M22L40o65M0n69k32M52J165
5033I71j018N41N13r34k02N13J29R9p14m52L87l78J09Q93n05N7R5L40K24m09k17
5054D2K60o63R67n57J5o2N51r13J310P19k841J835j717Q42Q48n8j59p77j17M57
5074a8O52m23K46m69J865j914Q2O88o35J99l48Q05m39n66J75J971k547O34J39
5093I7Q50j534k9Q11p11l8J340j314l85O97j39k59J114J94J16o59l40M23p63J85
5113c44J208j35j518J529l79OO1m4k33p63M33R2J35J5J25k91k12L21N3Q8l46K26
5135B7j73j38N07J06j77l68L10K12j53m7n42M16R94q21N0M5m74J78M5K30m56K99
$$ plain form
5157 70 347 -60 258 120 339 112 45 26 -68 -27 305 -56 284 216 339 -44 -114 -530 513 -35 -113 249
5179 249 0 111 138 37 -1083 632 329 -740 286 42 257 221 -790 550 385 -348 -597 -240 -151
5198 -151 398 378 -95 236 219 -79 -54 -159 -182 -158 -676 660 36 -221 260 891 -570 298 -453 92 307
5219 307 -456 245 718 -712 -1427 -765 -360 759 285 620 201 299 -33 188 -108 207 553 -761 -71
5238 -71 310 1158 -158 -507 -119 493 -745 4 369 -43 340 716 526 -395 306 -721 798 472 44
5257 44 -653 142 97 -87 736 555 273 68 191 -45 213 392 395 -583 129 195 -610 646 255 -310 -238 -123
5279 -123 -161 -362 192 20 -39 -97 24 253 -53 -198 -18 -67 -57 -163 223 -65 46 1 70 -133 -152 353 29
5302 29 -97 -35 -108 -151 -47 29 222 121 23 -195 343 174 310 -120 236 -68 116 116 169 -158 181 -174 224
$$ packed form
5157G0K77m07L18j38K19k27o7j9r4M1L32l61L40o8J23l83p0m16J043n48p8L62
5179B49k49J11K7j01j120J715l03j069J026k44K15l6j011J340j65p33k49L57Q9
5198a51N49k0m73L31j7k98K5j05k3K4n18J336o24k57M81O31j461Q68p51N45K15
5219C07p63P01M73j430p15O62M05J119m74L35m19R8l32K21k96L15L46j314O90
5238g1L81Q48j316l49L88O12j238P49L65m12L83L76j90r21P01j027J519l26m28
5257D4o97P95m5j84Q23j81k82k05J23k36K58J79Lr78P12O6q05J256l91n65P2J15
5279a23l8k01N54j72n9n8J21K29l06j45J80m9J0j06L86k88J11m5O9k03j9N05l24
5302B9j26O2p3m3J04P6J93j01r8k18N38j69J36m30L56l04J84%N3l27L39l55L98
$$ plain form
5325 224 -395 154 -9 -338 184 -188 -85 -92 -86 177 28 -97 -47 -140 -75 -172 -30 134 168 -242 105 -290 -112
5348 -112 232 149 47 325 -20 -55 -232 -197 -80 -97 -16 226 49 128 110 -242 -100 107 105 -293 -75 -78 -147 60
5372 60 -9 -45 -165 -118 -191 -139 -277 1 -138 236 31 -134 17 -48 -167 -71 11 -152 -226 -33 -133 -225 -164 10
5396 10 -22 -214 -205 -388 12 88 -230 7 -54 119 16 -155 -63 27 -77 17 -173 -31 -92 -109 -17 -77 -119 -14 62
5421 62 -122 -400 -81 -198 -29 98 -85 -94 242 161 -361 76 134 102 172 111 124 2 -28 448 -311 131 18
5444 18 57 -183 -307 140 131 92 -200 -210 -100 -142 -42 -9 436 -99 227 301 -75 51 -378 207 59 101 56 67
5468 67 -206 -155 17 -10 -22 40 18 20 -95 59 -71 185 26 104 -83 -75 278 -114 31 52 194 56 68 268
5492 268 -31 46 208 -143 128 102 49 10 261 39 209 -38 463 316 -93 -216 -344 -496 -260 -886 341
$$ packed form
5325B24o19N49j63l29N22l72J03pOK63j49j25N0r3O5r7J42J64L4m10L47l95J78
5348a12L44q3j02K78l45l5j77L5J17j7Q1K42j77P9j8l52J42K07kl98K18lo9K07
5372F0o9l6j20M7p3N2j38K78j39L74k05j65J51o5j19R6Q2j63p4J93j00r2O1J74
5396A0l2j92Rj83M00P6l18K37o1J73j03j71R2R0j04R4j90J42o1j7R2o0m2J05P6
5421F2j84k78L19j17J69J27j83rL36q1n22M37N8l2P0o1J3j22l0M76p59M42j13
5444A8L9k40j24M47rl9k92j0J10m2J00L3M45n35L26P4l76J26m29N85j48M2m5J1
5468F7k73N1J72k7j2O2k2Kj15J54j30K56j59P8j87QL53l92J45K1J42j38J2K00
5492B68k99P7J62l51K71k6n3l9K51k22J70k47N01j47m09j23j28j52K36o26J227
$$ plain form
5513 341 9 91 -335 391 -670 -896 -25 255 -1172 511 585 -773 -304 148 -228 241 235 -318 -189 141
5533 141 657 -621 -676 -110 -227 429 -273 -182 487 -316 97 -59 -91 -151 -174 -75 8 222 38 137 -65 -9 -103
5556 -103 330 506 305 483 30 -45 -33 289 -118 446 -82 210 -7 145 -109 193 -79 57 -42 144 -346
5577 -346 33 -78 -431 505 -434 -25 95 -14 269 -494 -963 55 -266 -113 268 327 88 -492 96 -185
5597 -185 818 483 215 -733 1242 857 716 1033 -179 -431 322 10 -78 152 -547 -177 357 -87 -133 1252
5617 1252 -30 496 822 -112 903 674 -418 1152 133 581 1075 -393 -850 -407 729 231 80
5634 80 314 -533 588 210 543 -531 305 -171 -21 525 300 159 380 100 -688 186 -593 110 -152 -317
5654 -317 -413 -649 569 295 556 -646 -236 674 -567 -248 659 436 -71 180 -420 -42 573 -339 567
$$ packed form
5513C41l32Q2m26P26j061k26Q71K80j427J683P4j358M69M52l76M69on53J29L30
5533A41N16j278n5N66j17O56p02R1O69q03M13j56l2o0k3R9Q3K14j84R9k02N6r4
5556a03M33J76k01J78m53p5J2L22m07N64n28K92k17J52k54L02k72J36r9J86m90
5577c46L79j11l53R36r39M09J20j09K83p63m69J018l21J53L81N9k39n80N88k81
5597a85J003l35k68r48J975l85j41L17j212k52P53l12q8K30o99L70N34m44m6J385
5617A252j282N26L26r34J015k29j092J570j019M48M94j468m57M43J136m98j51
5634H0K34q47J121l78L33j074Q36m76J50N46k25j41K21k80p88Q74p79P03k62j65
5654c17r6k36J218k74K61j202M10R10j241L19R07k23n07K51o00L78O15r12R06
$$ plain form
5673 567 -82 -425 205 -270 51 -450 -84 -181 -138 355 -193 -137 -28 -221 -494 -450 -168 -566 48 -140 -282
5694 -282 -54 -460 65 1036 -534 -307 428 -264 -9 501 48 343 167 -93 70 135 229 54 133 -80 312
5715 312 -547 113 -175 -64 295 -175 -19 360 -146 -190 88 7 139 -50 -11 81 -125 -127 302 -471 68 -358
5737 -358 423 253 302 -93 296 958 -252 -182 103 269 56 470 232 -673 474 -186 -676 -337 427 226
5757 226 -1058 -475 -105 422 296 357 1074 -35 -97 374 -152 490 436 135 -123 228 209 506 -492 1141
5777 1141 -383 570 425 -301 1110 -996 93 -386 526 771 186 -296 -6 249 -13 322 107 -191
5795 -191 -65 -34 -91 32 -154 61 325 86 60 -18 -134 124 159 -22 103 53 -310 -356 -180 510 -13 -273
5817 -273 5 460 4 267 599 229 919 406 821 650 227 110 169 988 757 -608 -215 -479 -395 -505
$$ packed form
5673E67o49l43O30m75L21n01L66r7M3M93n48N6J09j93k73M4K82l98O14j88j42
5694b82K28m06N25R71j570K27P35o92K55N10m53K95j76k60J63O5R4j75P9k13L92
5715C12q59O60k88J11L59m70J56L79n06m4K78q1J32j89L9R2k06kM29p73N39m26
5737c58P81j70M9l95L89O62j210P0K85J66k13M14k38r05J147o60m90L39P64k01
5757B26j284N83L70N27j26O1P17j109o2M71n26O42n4l01k58L51j9K97r98J633
5777A141j524R53j45p26J411k106J089m79R12K45n85m82K90K55k62L35k15k98
5795a91J26L1n7J23j86K15K64k39k6p8j16K58L5j81J25n0l63m6J76O90n23k60
5817b73K78M55m56K63L32l70O90n13M15j71m23j17N9Q19k31j365L93k64Q4j10
$$ plain form
5837 -505 623 -200 -305 -34 657 171 246 -467 126 267 170 480 281 108 224 -98 -302 37 -2 311 450
$$ packed form
5837e05J128q23j05K71O91m86P5p13N93J41r7L10j99j73J16l22k04L39l9L13J39
$$ [...]
8191F93
##END NTUPLES=NMR FID
##END=
