##TITLE=1H_DE-76k_d3Cl
 CDCl3
 8 sc, 
 27.11.2024
##JCAMPDX= 6.0         $$ Bruker NMR JCAMP-DX V2.0
##DATA TYPE= NMR FID
##DATA CLASS= NTUPLES
##ORIGIN= UXNMR, Bruker Analytische Messtechnik GmbH
##OWNER= root
$$ XWIN-NMR		Version 3.5
$$ Wed Nov 27 14:03:49 2024 Russian Standard Time (UT+4h)  she@DPX200
##.OBSERVE FREQUENCY= 200.1315
##.OBSERVE NUCLEUS= ^1H
##.DELAY= (6, 6)
##.ACQUISITION MODE= SIMULTANEOUS
##.ACQUISITION SCHEME= undefined
##.AVERAGES= 8
##.DIGITISER RES= 18
##SPECTROMETER/DATA SYSTEM= spect
##.PULSE SEQUENCE= zg30
##.SOLVENT NAME= CDCl3
##.SHIFT REFERENCE= (INTERNAL, CDCl3, 0, 15.7039)
##AUDIT TRAIL= $$ (NUMBER, WHEN, WHO, WHERE, WHAT)
$$ ##TITLE= Audit trail, XWIN-NMR		Version 3.5
$$ ##JCAMPDX= 5.01
$$ ##ORIGIN= Bruker BioSpin GmbH
$$ ##OWNER= she
$$ F:/spectra/data/she/nmr/H-F/1/audita.txt
$$ ##AUDIT TRAIL=  $$ (NUMBER, WHEN, WHO, WHERE, WHAT)
(   1,<2024-11-27 14:02:31.90 +0400>,<she>,<DPX200>,
      <created by zg, POWCHK disabled, PULCHK disabled
       configuration hash MD5:
       00 E9 B6 7A A2 85 ED C7 34 08 36 98 17 FE 4E 26
       data hash MD5: 16K
       4F 30 62 D4 DF 62 21 8D 4A BA 2F 00 DD 6D 08 4E>)
$$ ##END=
$$ 
$$ hash MD5
$$ 4B 13 A5 11 C0 2B D4 0A B9 F6 91 A8 BE E4 10 72
##$RELAX= 
##$RELAX= 
##$RELAX= 
##$RELAX= 
##$RELAX= 
##$RELAX= 
$$ Bruker specific parameters
$$ --------------------------
##$DU= <F:/spectra>
##$EXPNO= 1
##$NAME= <H-F>
##$PROCNO= 1
##$TYPE= <nmr>
##$USER= <she>
##$AMP= (0..31)
100 100 100 100 100 100 100 100 100 100 100 100 100 100 100 100 100 100 
100 100 100 100 100 100 100 100 100 100 100 100 100 100 
##$AQSEQ= 0
##$AQ_mod= 1
##$AUNM= <au_zg>
##$AUTOPOS= <>
##$BF1= 200.13
##$BF2= 200.13
##$BF3= 200.13
##$BF4= 200.13
##$BF5= 200.13
##$BF6= 200.13
##$BF7= 200.13
##$BF8= 200.13
##$BYTORDA= 1
##$CFDGTYP= 0
##$CFRGTYP= 5
##$CHEMSTR= <none>
##$CNST= (0..31)
1 1 145 1 1 1 1 1 1 1 1 1 1 1 1 1 1 1 1 1 1 1 1 1 1 1 1 1 1 1 1 1 
##$CPDPRG= <>
##$CPDPRG1= <>
##$CPDPRG2= <>
##$CPDPRG3= <>
##$CPDPRG4= <mlev>
##$CPDPRG5= <mlev>
##$CPDPRG6= <mlev>
##$CPDPRG7= <mlev>
##$CPDPRG8= <mlev>
##$CPDPRGB= <>
##$CPDPRGT= <>
##$D= (0..31)
0 1.2 0 0 0 0 0 0 0 0.06 0 0.03 0 0 0 0 0.0002 0 0 0 0 0 0 0 0 0 0 0 0 
0 0 0 
##$DATE= 1732701751
##$DBL= (0..7)
120 120 120 120 120 120 120 120 
##$DBP= (0..7)
150 150 150 150 150 150 150 150 
##$DBP07= 0
##$DBPNAM0= <>
##$DBPNAM1= <>
##$DBPNAM2= <>
##$DBPNAM3= <>
##$DBPNAM4= <>
##$DBPNAM5= <>
##$DBPNAM6= <>
##$DBPNAM7= <>
##$DBPOAL= (0..7)
0.5 0.5 0.5 0.5 0.5 0.5 0.5 0.5 
##$DBPOFFS= (0..7)
0 0 0 0 0 0 0 0 
##$DE= 6
##$DECBNUC= <off>
##$DECIM= 24
##$DECNUC= <off>
##$DECSTAT= 4
##$DIGMOD= 1
##$DIGTYP= 9
##$DL= (0..7)
0 120 120 120 120 120 120 120 
##$DP= (0..7)
150 150 150 150 150 150 150 150 
##$DP07= 0
##$DPNAME0= <>
##$DPNAME1= <>
##$DPNAME2= <>
##$DPNAME3= <>
##$DPNAME4= <>
##$DPNAME5= <>
##$DPNAME6= <>
##$DPNAME7= <>
##$DPOAL= (0..7)
0.5 0.5 0.5 0.5 0.5 0.5 0.5 0.5 
##$DPOFFS= (0..7)
0 0 0 0 0 0 0 0 
##$DQDMODE= 0
##$DR= 18
##$DS= 0
##$DSLIST= <SSSSSSSSSSSSSSS>
$$ [...]
##$SUBNAM2= <"">
##$SUBNAM3= <"">
##$SUBNAM4= <"">
##$SUBNAM5= <"">
##$SUBNAM6= <"">
##$SUBNAM7= <"">
##$SUBNAM8= <"">
##$SUBNAM9= <"">
##$SW= 24.0689530833862
##$SWIBOX= (0..15)
0 0 2 0 0 0 0 0 0 0 0 0 0 0 0 0 
##$SW_h= 4816.95568400771
##$TD= 16384
##$TD0= 1
##$TE= 0
##$TE2= 300
##$TE3= 300
##$TEG= 300
##$TL= (0..7)
0 120 120 120 120 120 120 120 
##$TP= (0..7)
150 150 150 150 150 150 150 150 
##$TP07= 0
##$TPNAME0= <>
##$TPNAME1= <>
##$TPNAME2= <>
##$TPNAME3= <>
##$TPNAME4= <>
##$TPNAME5= <>
##$TPNAME6= <>
##$TPNAME7= <>
##$TPOAL= (0..7)
0.5 0.5 0.5 0.5 0.5 0.5 0.5 0.5 
##$TPOFFS= (0..7)
0 0 0 0 0 0 0 0 
##$TUNHIN= 0
##$TUNHOUT= 0
##$TUNXOUT= 0
##$USERA1= <user>
##$USERA2= <user>
##$USERA3= <user>
##$USERA4= <user>
##$USERA5= <user>
##$V9= 5
##$VALIST= <valist>
##$VCLIST= <CCCCCCCCCCCCCCC>
##$VD= 0
##$VDLIST= <DDDDDDDDDDDDDDD>
##$VPLIST= <PPPPPPPPPPPPPPP>
##$VTLIST= <TTTTTTTTTTTTTTT>
##$WBST= 1024
##$WBSW= 4
##$XGAIN= (0..3)
0 0 0 0 
##$XL= 0
##$YL= 0
##$YMAX_a= 169071
##$YMIN_a= -51025
##$ZGOPTNS= <>
##$ZL1= 120
##$ZL2= 120
##$ZL3= 120
##$ZL4= 120
##$ABSF1= 10
##$ABSF2= 0
##$ABSG= 5
##$ABSL= 3
##$ALPHA= 0
##$AQORDER= 0
##$ASSFAC= 0
##$ASSFACI= 0
##$ASSFACX= 0
##$ASSWID= 0
##$AUNMP= <proc_1d>
##$AZFE= 0.1
##$AZFW= 0.1
##$BCFW= 1
##$BC_mod= 2
##$BYTORDP= 1
##$COROFFS= 0
##$CY= 11.3945322036743
##$DATMOD= 1
##$DC= 2
##$DFILT= <>
##$DTYPP= 0
##$F1P= 15.6554695791079
##$F2P= 12.8336369535428
##$FCOR= 0.5
##$FTSIZE= 0
##$FT_mod= 4
##$GAMMA= 1
##$GB= 0.15
##$INTBC= 1
##$INTSCL= 1
##$ISEN= 128
##$LB= 0.24
##$LEV0= 0
##$LPBIN= 0
##$MAXI= 10000
##$MC2= 0
##$MEAN= 0
##$ME_mod= 0
##$MI= 1.114404
##$NCOEF= 0
##$NC_proc= 0
##$NLEV= 6
##$NOISF1= 3.799351
##$NOISF2= 2.8
##$NSP= 1
##$NTH_PI= 0
##$NZP= 0
##$OFFSET= 15.70392
##$PC= 1
##$PHC0= -26714.83
##$PHC1= 11.58745
##$PH_mod= 1
##$PKNL= yes
##$PPARMOD= 0
##$PSCAL= 0
##$PSIGN= 0
##$REVERSE= no
##$SF= 200.130013532006
##$SI= 16384
##$SIGF1= 3
##$SIGF2= 2
##$SINO= 400
##$SIOLD= 16384
##$SREGLST= <1H.CDCl3>
##$SSB= 0
##$STSI= 0
##$STSR= 0
##$SW_p= 3612.71676300578
##$SYMM= 0
##$S_DEV= 0
##$TDeff= 0
##$TDoff= 0
##$TI= <>
##$TILT= no
##$TM1= 0
##$TM2= 0
##$TOPLEV= 0
##$USERP1= <user>
##$USERP2= <user>
##$USERP3= <user>
##$USERP4= <user>
##$USERP5= <user>
##$WDW= 1
##$XDIM= 8192
##$YMAX_p= 0
##$YMIN_p= 0
$$ End of Bruker specific parameters
$$ ---------------------------------
##NTUPLES= NMR FID
##VAR_NAME=  TIME,          FID/REAL,        FID/IMAG
##SYMBOL=    X,             R,               I
##VAR_TYPE=  INDEPENDENT,   DEPENDENT,       DEPENDENT
##VAR_FORM=  AFFN,          ASDF,            ASDF
##VAR_DIM=   8192,          8192,            8192
##UNITS=     SECONDS,       ARBITRARY UNITS, ARBITRARY UNITS
##FACTOR=    0.0002076,     1,               1
##FIRST=     0,             0,               0
##LAST=      1.7004516,     0,               0
##MIN=       0,             -51025,          0
##MAX=       1.7004516,     169071,          0
$$ Real data points
##PAGE= N=1
##DATA TABLE= (X++(R..R)), XYDATA
0 0 0 0 0 0 0 0 0 0 0 0 0 8 -8 8 -8 8 -16 16 -16 24 -24 32 -32 40 -48 53 -59 68 -77 88 -96 110 -124 138
34 138 -155 173 -190 213 -237 263 -292 322 -359 393 -439 485 -539 600 -668 751 -846 958 -1094
53 -1094 1266 -1488 1786 -2213 2878 -4067 6878 -30032 10056 37226 -35446 -33393 15534 20758
67 20758 -35428 -51025 -21823 1980 189 4435 7590 8202 14324 23394 2934 -25388 -15071 23015
81 23015 29908 13178 20703 48616 44308 13413 3942 18891 21370 14763 24300 40436 36029 25734
95 25734 37188 51573 36374 11225 17987 40697 38164 19669 26073 53044 58170 36412 21521
108 21521 27318 34880 32128 25334 22974 29270 42315 47348 34151 19795 26940 40311 27575 3735
122 3735 8034 35878 42080 21814 13579 27687 32301 16145 4724 9178 15995 16055 15438 16250 14097
137 14097 13462 15929 13849 3166 -3166 3150 9935 6780 947 4282 9682 8721 2086 -2050 -3776
152 -3776 -2685 784 1086 -4847 -6928 1325 8704 1073 -11608 -9667 2031 1142 -11644 -14472 -1743
167 -1743 6272 -187 -9116 -6820 373 941 -6048 -11746 -9381 -1359 3112 -1783 -7394 -2418 6069
182 6069 3306 -7304 -9656 -1145 3929 16 -3300 500 6107 7024 3674 11 -1287 1933 5199
197 5199 3705 709 2893 9373 12324 7787 2874 3501 8096 8806 4853 2137 6691 13683 14321 9152
213 9152 5716 9101 13171 10083 3643 3427 10496 15901 13233 7210 7870 14047 15271 7017 1948 5798
229 5798 12398 12087 6805 6098 11107 14674 10898 4226 2210 5707 9080 6561 2558 4072 9709 11328
245 11328 5705 578 1080 4082 3211 -414 -1988 1122 5346 5677 1292 -2785 -2173 446 -1499 -6771
261 -6771 -8117 -2828 1601 -178 -5003 -6238 -3226 -2437 -7721 -12872 -11494 -5942 -3597 -6886 -10258
276 -10258 -7883 -4222 -6094 -12804 -16076 -12454 -7708 -8409 -12645 -12548 -7394 -5322 -9605 -15443 -15884 -11875
292 -11875 -10542 -12830 -14564 -11552 -6962 -6184 -10290 -14507 -13425 -10607 -11188 -14350 -14455 -9393 -4893 -6185
308 -6185 -10226 -11527 -9174 -8269 -10606 -13525 -12399 -6840 -3519 -5105 -7924 -7404 -4328 -4584 -9400 -12332
324 -12332 -8556 -3196 -1642 -4579 -5340 -1911 499 -2520 -7819 -8475 -4131 -687 -1535 -3416 -1377 2684
340 2684 3488 -740 -5265 -4272 -487 324 -1420 -2078 2140 5876 4722 355 -2093 -263 1560 284
356 284 -1719 -593 3543 6775 4823 897 -43 2077 3072 -339 -2921 -65 4983 6541 3297 1374
372 1374 2566 4155 1859 -1987 -3236 744 4357 4569 1573 1112 3553 4682 533 -3686 -3411 878
388 878 2886 580 -496 1881 4674 3461 -1012 -3865 -2255 386 155 -1555 -1151 2047 4606 2453
404 2453 -2319 -3311 -926 475 -1263 -3547 -1209 2995 3982 1179 -1945 -1468 476 -227 -2701 -3661
420 -3661 -313 3527 3904 955 -1064 852 2441 -19 -3289 -2671 1858 4223 2887 1153 1707 3852
436 3852 3982 241 -2056 -499 3352 4265 2659 1429 4411 6568 4882 604 -564 2384 4720 3732
452 3732 1703 3319 7022 7885 5239 1948 1931 4563 5003 3388 1927 4686 8230 8315 4926 2997 4462
469 4462 5819 4749 2271 2523 6023 7911 7218 4631 4064 5643 6059 3825 1380 2231 5715 6779
485 6779 5091 3129 4187 6875 5447 1737 -12 2259 4902 4648 2283 2325 4898 5706 3293 144
501 144 -467 1848 2833 1562 -382 765 3992 4165 804 -1406 -506 1349 523 -1835 -2182 612 2784
518 2784 1940 -930 -2109 -667 291 -1725 -3651 -2987 -87 1336 -618 -2376 -1761 191 -360 -2949
534 -2949 -5058 -3138 -648 -569 -2359 -2635 -1143 284 -1054 -4193 -4908 -2742 -587 -1967 -3418 -2599
550 -2599 -37 739 -1819 -4143 -3662 -1368 -994 -2975 -3891 -1414 1211 412 -1560 -3377 -2141 -455
566 -455 -1458 -3297 -3115 110 2022 217 -1789 -1843 269 -74 -2360 -3130 -1749 877 1511 -95 -1091
583 -1091 253 1412 630 -2327 -2942 -1217 1429 869 -1114 -542 1780 2413 -56 -2216 -2149 -182 621
600 621 -580 -1446 -78 2641 2185 -467 -2370 -1455 -192 -440 -2192 -1800 205 2016 809 -2166 -2067
617 -2067 -995 -516 -2335 -3570 -2514 269 855 -608 -2432 -1852 -651 -1841 -4232 -4655 -2692 -320
633 -320 -340 -2267 -2713 -1228 -706 -2543 -5076 -5010 -2559 -1154 -1965 -3003 -2611 -805 -511 -3464 -5175 -4647
651 -4647 -2350 -2125 -3763 -3588 -1769 -233 -1491 -3827 -4806 -3568 -2679 -3548 -4133 -3442 -834 346 -1364
668 -1364 -3258 -3456 -1573 -1973 -3300 -4083 -2348 396 581 -1055 -2069 -1174 -499 -1351 -3287 -3083 -972
685 -972 1041 1001 -571 -451 930 1247 -1028 -2371 -1570 824 1629 491 316 1908 2788 2134 -359 -919
703 -919 -2 1676 1798 747 1087 3404 4084 2503 227 144 1978 2610 1169 862 2197 4179 4690 2341
721 2341 1151 1408 2647 2136 842 550 2576 4416 3931 2253 1648 2572 3035 1112 274 900 2951
738 2951 3863 2857 1526 1806 3119 2444 681 -153 717 2651 2530 1727 1343 2213 3185 1615 -398 -727
756 -727 632 1480 1265 52 1052 2534 2385 1045 -765 -324 434 808 -231 -685 594 2481 1725
773 1725 -98 -1054 -270 698 -329 -1349 -920 1004 1675 1153 -769 -519 397 665 -741 -1908 -959 1365
791 1365 1254 139 -539 415 1443 223 -832 -1633 -279 1236 1323 148 -114 1431 2117 770 -1011
808 -1011 -679 740 1522 740 -138 842 2331 1978 513 -354 230 1402 1241 15 416 1831 3066 1977
826 1977 713 460 1223 1724 1028 -215 633 2529 3094 1632 659 1258 2108 2074 404 121 956 2129
844 2129 2566 1312 803 1330 2132 1817 -115 -128 972 1777 1179 351 1025 1887 1786 897 -490 -157 1018
863 1018 786 -147 -537 880 2167 1064 -728 -1174 -245 626 -685 -1446 -1114 343 1138 -79 -1456
880 -1456 -920 -440 -696 -1871 -2604 -1403 7 46 -1168 -1769 -1437 -807 -1649 -2798 -2969 -1598 -1036 -1403
898 -1403 -2093 -1722 -783 -787 -1820 -3559 -3038 -1953 -1682 -1817 -2435 -1478 -751 -887 -2371 -3190 -2256 -1555 -1732
917 -1732 -2891 -2785 -786 -354 -1385 -2245 -2660 -1988 -1607 -1839 -2356 -2083 -427 474 -1064 -1847 -1479 -775
935 -775 -1035 -1989 -2324 -1192 449 -87 -695 -1162 -128 -149 -978 -1958 -2051 -329 448 -215 -951 -300 753
954 753 574 -842 -1580 -561 297 412 -119 -15 717 1270 1050 -526 -886 -90 623 94 -397 32 1528
973 1528 1963 709 -498 -426 588 289 -328 -1170 559 1544 1182 334 -152 211 582 -158 -813 -1163 477
992 477 1337 648 -402 -400 723 258 -925 -1447 -987 203 458 -258 43 268 743 186 -1375 -1715 -922
1011 -922 -40 -12 -556 -505 261 676 -244 -1451 -1501 -499 -285 -779 -900 -220 869 534 -475 -1347 -1010 48
1031 48 -275 -1176 -1139 225 1050 865 -281 -878 -123 192 -497 -1128 -899 731 1189 375 -449 425 722 592
1051 592 -182 -916 344 1217 915 323 524 1443 1545 551 -335 -111 621 1364 1227 724 1065 1957 1980 1079
1071 1079 220 720 1383 1338 796 895 1917 2529 2076 1067 507 1405 1748 1277 919 1261 2321 2646 2221
1090 2221 1095 1178 2064 2156 869 844 1530 2168 2620 1459 1112 1422 2017 1179 541 374 1241 2125 1471 1003
1110 1003 1022 1777 2040 894 64 174 1024 1320 559 289 839 1628 1411 197 -518 38 465 169 -261
1129 -261 -41 643 1239 442 -458 -593 64 437 -871 -743 -478 477 592 -362 -596 -808 -386 -617 -1502 -1486
1149 -1486 -289 310 189 -899 -841 -454 -359 -1099 -1805 -1471 -382 77 -721 -1171 -966 180 -73 -883 -1748
1168 -1748 -1110 -399 -212 -984 -891 -336 -234 -306 -1176 -1274 -861 -523 -598 -923 -721 38 262 -299 -853 -804 130
1189 130 35 -937 -1095 -64 305 -61 -120 -637 -364 262 -332 -913 -854 10 456 203 -496 -81 419 219 -282
1210 -282 -843 -239 135 502 -20 -271 -429 919 641 -281 -795 -313 165 -157 -515 -142 358 314 44 -1092
1230 -1092 -797 -99 -337 -583 -755 -344 372 278 -387 -647 -430 -139 -405 -1294 -1523 -548 226 -165 -837 -1307
1250 -1307 -401 -208 -874 -1678 -1404 -732 -290 -471 -1009 -819 -19 -435 -1498 -1693 -1176 -498 -955 -1085 -1223
1269 -1223 -676 168 -701 -1455 -1716 -1055 -614 -886 -1075 -506 -201 -233 -747 -1328 -822 -535 -975 -872 -1071 -275
1289 -275 180 -46 -424 -486 -514 -174 -656 -899 -428 -76 537 159 -499 -67 78 251 -403 -964 -123 425 563
1310 563 153 257 350 1072 270 34 -139 232 957 654 532 371 1241 1437 506 -150 132 1083 932 1137
1330 1137 655 968 1572 1526 681 288 650 1267 751 425 737 1540 2097 1396 667 813 946 1144 933 964
1350 964 890 1649 1629 1199 976 987 1061 1168 301 383 954 992 855 438 685 1101 797 356 80 239 784 745
1372 745 569 381 1199 1000 977 264 -275 494 502 434 180 67 622 756 207 -87 -309 -148 478 23 -295
1393 -295 -22 731 698 210 -481 -420 -99 -92 -391 -174 141 556 520 -149 -362 -76 -23 -95 -533 -479 -249 185 239
1416 239 -189 -133 232 535 -191 -833 -159 113 -59 -276 0 358 617 416 -365 -20 -228 560 350 -26
1436 -26 133 748 835 518 134 383 317 797 23 -4 229 902 971 23 343 -29 511 472 -163 -242 391 713
1458 713 560 303 564 358 774 -179 -529 7 447 501 389 99 180 379 319 -156 -458 118 -3 166 -129
1479 -129 -148 466 535 115 -713 -678 -46 65 -308 -564 -190 265 288 -285 -537 -605 -35 -441 -735 -1060 -257 208
1501 208 -480 -680 -878 -500 -455 -783 -1216 -1429 -490 -224 -639 -1091 -639 -413 -957 -856 -1078 -1117 -148 -613 -913
1522 -913 -805 -921 -297 -861 -1168 -1129 -927 -657 -768 -1188 -618 -684 -368 -671 -1204 -794 -737 -749 -906 -939 -634 -363
1544 -363 -346 -932 -732 -476 -551 -527 -809 -849 -81 109 -124 -450 -400 -258 94 -441 -883 -402 313 123 -223 -291
1566 -291 -15 227 197 -101 -433 -68 515 342 -310 363 432 509 170 -321 -199 271 267 263 329 306 624 647 250
1589 250 -294 310 344 249 153 18 532 894 524 138 132 161 529 57 -27 199 698 963 275 72 233 296 233
1612 233 -227 -407 237 415 522 361 -155 377 377 140 -356 -357 299 344 186 26 370 204 -46 -195 -443 -356
1634 -356 37 16 45 -163 195 552 135 -529 -343 -98 -185 -184 -280 -287 277 530 487 -137 -398 113 -155 -267 -176
1657 -176 9 479 59 -139 -245 -332 274 -292 -131 -151 204 448 602 -18 231 525 505 92 -229 -266 377
1678 377 602 709 134 610 810 571 342 -65 453 573 625 285 404 570 743 845 277 275 430 555 265
1699 265 361 688 1051 836 722 247 63 472 769 592 73 675 993 944 663 397 413 714 497 292 260
1720 260 447 828 384 333 663 680 461 173 -310 112 398 498 341 68 461 121 108 -243 -96 30 283
1741 283 177 -225 169 293 221 178 -278 -209 -175 -80 -109 -639 -305 364 -37 -636 -605 -390 -83 -547 -510 -327 182
1764 182 -235 -702 -326 -863 -207 -295 -594 -808 -626 137 -148 -377 -827 -229 -101 -373 -647 -773 -598 -545 -531
1785 -531 -450 -462 -494 -41 -205 -658 -265 -293 78 -559 -498 -238 -105 -84 -285 -543 -279 -159 -162 -231 -414 -100 22
1808 22 -27 -118 -104 -518 -106 -520 -637 -392 125 199 210 176 -380 152 162 -247 -354 117 292 338 201 67 117
1831 117 262 -140 -241 -269 -11 116 -82 98 336 5 155 8 -280 16 -113 468 -210 -47 69 341
1851 341 30 -273 -712 -197 421 -134 -304 -459 30 140 208 -263 -370 124 -307 -47 -719 -405 -34 -192
1871 -192 -707 -789 -114 -357 -124 -457 -917 -111 -250 -8 -800 -218 -76 97 -480 -881 -319 -124 -240 -567
1891 -567 -264 -513 -60 -182 -224 -417 -272 -77 -470 -641 -402 -86 117 -23 -582 -249 -170 -223 -161 -349 -176
1912 -176 -120 25 93 -232 -187 126 65 -145 -441 -50 627 547 -24 -478 -50 -23 -115 -206 -371 -259 364 190 -139
1935 -139 120 353 169 396 37 2 147 344 568 335 502 440 557 204 525 280 544 110 215 266 397
1956 397 618 665 370 277 225 613 615 136 562 557 752 116 -255 583 671 399 39 314 372 439 437 467 216 495
1980 495 138 24 -50 64 283 509 89 334 232 -104 267 -199 -16 -74 501 174 160 228 15 122 86 -88
2002 -88 -46 1 342 78 25 -176 22 257 41 -145 -222 94 233 -313 -246 137 126 281 -48 -506 -259 -250 -287
2025 -287 -350 224 -75 -171 35 -56 -310 53 115 -229 -214 -222 229 140 276 -132 -223 227 -113 -331 169 39 -166
2048 -166 -50 213 -30 279 146 -306 234 -133 350 142 17 -251 146 343 376 5 -364 -56 -32 426 -211
2069 -211 59 63 488 -7 205 4 -42 130 48 245 -15 212 425 180 -97 -4 169 524 -96 144 -173 231
2091 231 -129 -20 177 150 336 101 0 -117 -131 312 462 -50 453 46 174 -191 -222 -11 -57 -18 -296 -182
2113 -182 -66 316 185 -96 -317 -126 -360 -65 -222 -710 -153 -17 -278 -182 -205 -206 -428 -189 -552 -345 -205
2134 -205 -263 -73 -399 -349 -43 -243 -331 -213 -112 -282 -304 -176 -328 133 -281 -334 -519 -495 -678 -191 -491 -256
2156 -256 -75 -130 33 -339 -521 -396 -183 -97 -236 -317 25 -39 -89 -249 -102 -102 5 -104 -544 -329 179 -243
2178 -243 210 -47 167 153 -54 -156 -260 -265 264 96 -27 141 390 241 -52 -86 83 281 14 200 179 473
2200 473 177 4 67 -257 146 204 196 61 111 203 71 242 159 -48 37 168 59 151 177 131 251 371 207 35
2224 35 453 90 209 325 464 470 153 -109 16 -17 231 -130 61 -60 -25 61 330 150 56 -412 -42 -164
2246 -164 -185 67 198 181 179 156 -125 214 186 -192 -465 32 202 -75 61 -120 153 312 28 -168 188 176
2268 176 -205 33 -141 181 106 -237 -223 -582 -73 -33 230 -174 -200 121 195 50 221 150 348 -23 21 -26 64
2291 64 243 12 -30 -142 -284 298 101 229 89 54 311 310 207 105 141 235 -5 137 148 97 377 -179 216
2314 216 392 258 476 -2 228 350 250 406 77 -19 478 424 399 228 -142 248 406 230 83 273 189
2335 189 367 -85 243 46 230 78 102 77 -240 47 189 -24 -77 268 157 90 19 -112 269 -44 229 -16
2357 -16 300 -102 -129 -177 -23 107 -30 110 35 -67 -367 92 -87 -46 -354 -155 -189 143 -69 -135 -144 206 -105
2380 -105 -153 -134 -346 45 -363 -214 207 -218 10 -329 -172 -84 -188 -8 -404 -555 -84 244 -242 -240 -197 -118
2402 -118 -192 -94 -109 -406 -258 -458 -83 -328 -225 70 -146 -284 -329 97 -379 -226 -472 -90 -44 -64 -132 -136 17
2425 17 258 86 11 -429 75 -3 -51 107 171 -199 184 82 -277 -49 13 125 117 93 41 -56 268 289 -307 -327
2449 -327 10 -10 375 84 98 202 -22 -148 -19 -307 169 -68 -134 91 221 302 169 113 129 248 15 -142
2471 -142 -31 -220 107 141 163 -9 -24 441 61 30 -126 -24 124 -293 -240 47 -61 -32 -78 98 -380 -345 -360
2494 -360 -37 74 -228 15 3 -351 -36 -391 -182 -107 -119 -194 -214 -33 -129 -339 -17 -90 -181 -247 -110 -159 -267
2517 -267 -450 -70 16 -22 -216 104 28 -310 182 81 24 -115 -219 118 -468 -60 -133 -40 188 79 100 -39
2539 -39 -93 143 86 158 -126 48 248 272 80 4 182 36 -84 97 44 -132 72 240 174 -112 101 2 275
2562 275 3 223 34 -39 377 36 218 417 409 59 -63 282 307 -81 348 268 -97 30 -144 140 261 74
2584 74 187 306 124 20 59 113 115 462 257 268 121 81 7 92 463 81 107 -190 56 78 -105 -155 -39 138
2608 138 111 91 38 23 112 148 -84 179 -99 -173 88 -137 -215 50 263 -13 -78 -23 -268 -84 -140 48 -180 3
2632 3 53 -42 -18 -271 -38 -356 87 40 326 110 221 -48 -218 82 9 387 -103 18 69 117 -49 -114 -259
2655 -259 -85 229 95 77 97 -171 120 290 125 -48 303 -41 -25 -128 -320 -173 280 -164 85 -227 -114
2676 -114 28 74 39 -125 27 204 97 -133 -60 226 194 119 144 -3 82 220 9 -16 222 -271 -86 -1 57
2699 57 368 -165 -414 -297 -228 -224 192 -80 -15 -27 15 -99 70 -204 175 205 -80 78 -197 135 46 -107 -64
2722 -64 -9 135 -19 -36 287 -59 191 134 -41 -248 -226 112 -119 1 -3 293 1 -178 -3 -152 106 -194
2744 -194 -389 -24 123 -226 -165 -9 -131 -389 -89 -61 -17 -156 -123 7 -124 -283 -364 -64 -179 36 -238 -221
2766 -221 -104 -123 -240 -73 146 -304 -112 -202 -69 -78 20 -297 109 -145 26 5 -100 -120 -316 -379 7 -219 -377
2789 -377 88 -155 166 181 20 -248 211 105 -308 -183 131 155 27 260 269 285 -130 -16 64 144 108 193 -21
2812 -21 -161 39 -17 195 210 154 29 8 214 190 65 45 341 215 -240 -67 -125 438 387 305 -83 280 206 262
2836 262 109 82 6 244 12 146 -51 106 97 151 194 -138 39 139 -219 91 -42 87 -172 222 160 -128
2858 -128 184 -86 233 -178 316 -60 313 359 -121 -319 152 195 -345 -166 -48 -48 225 -103 223 157 -140 -151
2880 -151 -126 -33 -360 181 -264 76 -291 -257 -251 -77 152 21 -483 -276 214 -263 122 18 -114 -169 -54 118
2902 118 -63 -161 99 96 497 194 -11 -59 123 -111 -211 -6 45 67 -17 -246 16 271 223 79 -12 114 58
2925 58 137 299 -42 236 124 -91 19 47 447 -14 16 193 -106 176 -42 29 -310 -248 111 191 155 -60 113
2948 113 207 154 307 397 407 -71 -9 -64 85 96 53 13 -37 209 133 72 100 -327 153 166 442 238 -290 13 -247
2973 -247 -94 12 0 -116 57 197 -138 131 48 -29 215 102 -188 -119 56 -152 -92 -77 307 -72 -81 -39 -89
2996 -89 -98 -26 -65 404 -191 -26 -157 -43 -345 -131 285 -67 -35 -74 49 -87 441 27 -46 104 -379 -219 -251
3019 -251 -196 44 52 -211 -28 -56 -49 -107 259 -112 -112 10 -35 -131 -167 178 0 -216 -197 60 239 -79 24 -39 -104
3044 -104 -172 26 -194 -198 52 -245 192 2 2 -39 -37 257 -106 -167 96 -55 -116 266 -206 -147 125 68 378 121
3068 121 -20 -21 -334 99 197 346 -233 -16 -144 -330 112 78 148 206 235 -164 193 150 -105 16 30 147 -152
3091 -152 -213 51 132 -261 94 -283 -52 -92 -37 1 349 -48 -132 48 130 -123 80 -69 -58 45 74 -103 84
3114 84 92 -155 -218 -64 -7 79 204 255 -269 26 208 38 -179 -72 -132 -377 -244 -42 -56 -437 -2 -248 -77
3137 -77 -22 -47 -286 -43 -4 -179 -4 -411 109 55 65 -315 249 -155 -8 166 -17 -80 185 140 -280 270 -101
3160 -101 66 -174 92 40 -186 -47 -351 276 -24 114 138 146 306 168 -196 -70 198 -151 -188 172 377 -27
3182 -27 59 -132 163 -83 20 64 -247 -2 174 -48 137 -58 183 45 -88 -106 -173 305 -103 125 101 9
3204 9 79 392 34 208 22 -144 -188 101 161 107 -46 87 -10 144 105 340 283 123 -11 98 254 -34 291
3227 291 -19 -135 96 -33 -71 288 -44 -204 -21 214 -86 -167 -33 6 -53 -65 -145 172 -15 105 28 -259
3249 -259 -69 -30 -112 143 201 7 -18 97 -7 -205 -18 128 -73 -142 -166 77 -135 -44 145 193 86 -526 -1
3272 -1 290 -224 173 340 -35 -256 17 68 -19 147 162 -192 -173 -60 41 294 -201 46 -18 -108 -55 134 45
3295 45 -177 36 -89 46 -46 -135 -282 187 -241 34 -358 -296 212 123 107 133 29 -121 179 169 -84 110 212
3318 212 -48 82 76 136 -216 17 8 -2 190 -106 -177 115 330 -150 120 1 -286 8 190 -54 22 -66 -101
3341 -101 73 243 -336 22 342 21 -228 -173 34 -47 172 -71 40 -231 -112 -298 73 91 216 -308 -330
3362 -330 186 -1 88 -71 -127 48 -62 -160 -277 -147 -10 -125 53 -173 -55 98 -9 -264 139 68 -53
3383 -53 124 88 -109 -52 309 61 -61 -32 73 -296 -182 -79 -22 -157 22 33 -289 -375 -332 99 241 -86 138
3406 138 -97 -55 -106 166 -412 -314 -106 -4 -312 -205 -97 -59 79 -155 57 -120 302 152 -208 93 -55
3427 -55 -13 184 -105 -82 207 110 -57 -30 -248 83 -181 -177 58 -335 -17 -84 22 -7 -307 -194 72 -258 -196
3450 -196 32 -526 220 79 -191 -68 -88 351 62 96 234 162 18 174 -30 346 265 38 33 -145 265 -52
3472 -52 300 79 46 173 187 -34 49 112 -179 -21 98 210 -141 -61 131 -72 -147 92 241 43 130 -179 -60
3495 -60 -17 184 231 -162 -73 130 -207 66 86 38 -217 -138 -197 177 131 -97 -138 239 178 -64 -199 -100 -177 -130 -55
3520 -55 173 134 120 23 -22 -163 170 128 -167 278 -246 26 -80 86 258 21 -152 -123 9 618 85 264
3542 264 -218 3 0 -165 83 -162 105 -253 99 282 -61 247 -36 -17 2 26 -271 99 -90 165 25 -227
3564 -227 -280 16 -51 169 -98 -119 369 73 -63 -48 57 209 395 116 160 -115 68 -184 159 8 -49 -274
3586 -274 -47 241 -169 -339 -5 -145 -112 -3 227 -26 -223 25 18 79 -37 277 153 -204 222 189 -113 -191
3608 -191 17 110 196 35 226 114 276 305 174 -286 164 -89 -428 114 178 -341 114 -109 1 67 176 35
3630 35 -88 154 82 -175 -227 82 -247 4 131 -44 -167 -17 -114 -369 234 -292 -131 83 350 -242 -184 34
3652 34 -75 134 -163 139 -165 106 -1 -116 -127 27 -157 -22 109 53 186 -230 -102 70 318 -255 34
3673 34 22 -41 335 25 -229 -137 199 -28 98 411 76 31 145 256 265 138 -38 -126 -165 -32 -99 -32 -58 170
3697 170 -118 -64 105 188 530 131 152 -57 200 216 -299 -190 25 -67 88 -84 54 152 -60 260 215 -178
3719 -178 96 65 20 15 -227 151 98 -359 -312 -37 259 126 35 -138 76 191 -49 23 -56 32 -100 -271 37
3742 37 62 -395 -56 9 -271 -169 183 99 92 196 200 177 60 6 -37 210 -5 9 -14 120 266 -138 125 100 -106
3767 -106 268 153 98 344 124 -134 -52 125 59 98 -116 152 -150 -96 -154 -9 198 -63 -204 59 -3 -14 -156
3790 -156 48 -2 124 22 146 102 -26 325 63 -110 -133 -104 293 130 -138 27 42 -214 5 97 -123 6
3812 6 75 -272 11 -101 -2 143 -29 66 -99 126 -273 -167 63 -233 162 357 -43 38 27 91 233 141 -96
3835 -96 -72 147 -79 1 263 154 -122 -22 49 -74 -31 216 359 -507 136 193 220 -110 -305 -133 145 -44
3857 -44 228 9 -167 -143 -254 -116 -47 -91 293 103 240 2 -208 208 28 159 131 -231 -167 -45 64 38
3879 38 20 -99 -175 -153 -72 136 -195 -250 -342 121 -60 54 19 138 -157 -13 -158 -138 193 -279 159 -161 84
3902 84 171 59 97 -104 65 154 -209 11 -56 -321 11 75 70 -235 65 -54 403 42 -205 -96 391 -309 -65
3925 -65 277 -316 42 170 -127 35 -99 -195 -104 -170 120 143 184 16 82 75 43 -236 -3 19 35 -274 -170 -61
3949 -61 50 -92 56 127 -70 -167 41 9 36 -43 94 -255 195 -37 76 -97 69 188 82 -134 34 180
3971 180 127 58 263 -49 -271 18 109 -178 -70 150 113 72 -25 -82 24 -275 325 -232 289 118 15 -80 17
3994 17 -205 242 260 -103 -25 -102 -387 2 103 27 -12 60 149 109 -6 135 134 202 -219 -49 -7 64 4 240 -221
4019 -221 -37 -242 -141 -283 -261 -39 -174 -261 -74 22 -303 16 -28 -390 46 -378 23 267 20 -352 -46
4040 -46 -96 378 -132 -136 82 -101 44 74 248 -207 235 -7 -465 49 -109 -43 35 -37 130 15 -9 -142 -71
4063 -71 -374 -60 -263 216 9 14 65 346 -8 117 70 -269 60 58 -38 4 53 105 -54 47 -118 197 202 -10
4087 -10 235 20 84 -199 -348 -96 -70 -274 206 35 -81 107 6 56 163 136 242 -101 9 80 51 99 -5
4110 -5 -14 -99 -27 5 19 253 -50 100 -64 -154 -94 -112 -44 -90 214 299 -10 83 231 -329 200 -189 -112 -323 -129
4135 -129 374 -485 185 21 77 -148 -170 65 -100 46 -29 10 -192 310 -43 222 173 203 10 -302 64 104
4157 104 -137 -172 -197 -214 177 128 121 136 238 -11 60 -112 -92 11 93 55 70 78 147 64 383 232 55 11 -178 -203
4183 -203 -51 326 -134 -84 -47 113 -90 -50 -12 -5 257 -4 97 -236 -241 92 106 8 141 -75 -168 -77 67 171
4207 171 30 6 43 -213 -240 43 -222 -26 -212 210 92 271 -65 26 -170 138 -79 172 -356 -39 -174
4228 -174 -74 -43 -360 -37 25 -39 305 97 92 91 -170 195 225 104 -115 -161 34 -291 -71 -126 205 237 152 -273
4252 -273 -14 -247 -287 -36 359 38 -158 219 12 67 -228 -200 59 19 -126 115 72 -43 -19 -23 11 -74 -127 31
4276 31 -80 257 -2 -186 -22 -178 153 -156 75 145 -194 168 -14 108 188 79 23 59 121 34 -154 40
4298 40 -243 246 -63 -91 -169 33 -148 -182 55 -158 4 -172 139 -87 -223 -198 -159 -228 71 -58 162 -25
4320 -25 -45 44 30 94 -7 79 148 -162 -1 -77 -177 40 -194 93 22 86 340 2 -79 -139 -331 26 -111 -147
4344 -147 -247 -164 -218 -17 -113 -253 -5 -5 68 -265 170 15 -391 -124 33 52 -11 -189 -113 -83 73 87 36 324
4368 324 -187 -37 -240 244 77 -48 34 -90 29 -113 65 -291 102 299 136 -84 -313 98 167 -15 -220
4389 -220 105 30 -40 190 103 -13 -78 21 301 87 14 -49 -11 163 -70 101 174 83 -65 153 -53 33 -95 -212
4413 -212 98 276 -8 107 -101 -196 -104 -284 -21 -75 -120 185 131 125 50 103 -74 -106 182 72 -132 -5 -45 69
4437 69 186 75 -256 -102 24 93 -207 -35 4 161 279 221 -87 156 -44 -192 130 -92 83 -32 224
4458 224 -19 -33 169 175 -39 -105 275 -166 92 -257 -213 -163 109 75 146 101 -32 -139 114 -26 -41 -146 217
4481 217 267 92 75 71 -77 278 14 -156 -20 -283 -290 -55 -98 -292 0 22 -179 224 111 186 141 -173 143
4504 143 183 -45 -27 345 98 -212 77 20 -321 -140 120 -13 -42 80 -50 97 84 -25 119 219 -420 32
4526 32 86 248 -96 -191 20 -75 31 157 57 -191 -83 28 -52 58 5 6 -15 98 67 215 -139 -57 -47 -190
4550 -190 -111 178 142 -108 -61 -14 158 -156 -166 268 376 107 78 -8 -7 -123 53 63 -328 -53 -67 103 -247 315
4574 315 135 -20 38 157 346 -46 121 49 -199 104 527 161 114 -46 5 90 -253 67 -86 14 271 -226
4596 -226 76 64 -208 141 350 208 -87 -101 73 -54 -81 -155 -57 -64 -15 -66 240 99 -57 -90 44 -62 -25 -109
4620 -109 -222 -61 84 64 -174 21 21 161 -157 -115 -62 -107 -86 151 -255 -134 -68 -35 146 77 -96 -13 71 -258
4644 -258 13 -78 -466 6 53 27 0 76 338 78 -134 -148 226 -76 -18 -81 -91 -63 137 -132 227 -91 207
4667 207 93 52 221 -122 -53 158 152 15 -74 227 123 -248 145 60 -157 218 272 -428 115 155 -89 -7 128
4690 128 9 125 68 34 -201 -8 -66 69 149 -81 111 -311 -30 -164 98 -43 151 127 193 7 -122 39
4712 39 176 111 -25 7 34 149 1 -342 67 77 289 66 96 28 174 56 -120 -177 183 3 -52 9 33 -65
4736 -65 61 -78 482 214 -64 146 26 8 143 221 132 121 97 161 27 -204 79 -96 -307 72 -16 43 -38
4759 -38 -245 -20 76 60 113 -146 -349 -16 -99 -174 2 452 -205 -245 -132 314 -1 -96 165 -109 111 114 43 252
4783 252 -185 23 14 120 72 -123 112 4 209 30 -17 322 -50 32 -72 -176 182 10 297 -90 -231 -151
4805 -151 207 120 84 -240 -266 73 286 -233 -119 175 112 -311 126 90 136 13 166 25 142 -312 -10 409
4827 409 199 -311 85 81 -161 42 -182 -337 90 97 -109 87 -88 102 -117 -349 54 181 231 -111 22 -96
4849 -96 -159 469 460 -186 -362 199 33 71 -245 -312 -271 -279 -65 -16 -184 -33 -120 62 168 -30 -130 -154 134 -26
4873 -26 37 315 301 355 -118 -29 118 -83 -66 102 -296 -26 21 -186 -6 -158 -63 -248 267 160 142 141 -81 -24
4897 -24 -55 88 -72 -75 -119 6 -176 -57 192 -119 78 73 -3 -446 203 69 59 80 100 -236 2 -140 130 127
4921 127 -11 -6 -337 -21 -9 70 239 106 -19 358 74 -50 246 20 -108 11 127 -86 15 170 -4
4942 -4 9 -277 -127 -41 8 -159 -108 18 -78 151 86 275 -30 43 -230 238 -208 -69 -63 -163 -205 211 237 55
4966 55 -286 208 173 7 201 125 -10 170 -21 158 90 -267 490 215 53 7 21 419 -128 -504 -273 -240
4988 -240 -28 -90 84 -88 -125 -389 32 21 -232 -8 -144 -358 98 -71 -50 -121 -235 452 117 79 -151 -176
5010 -176 18 278 148 -28 80 49 -320 -84 65 -26 181 135 -50 -93 -15 -116 127 -35 391 -292 34 124
5032 124 103 43 81 120 46 -94 34 76 219 -25 106 -19 -292 -90 108 326 -53 -89 70 12 54 32 -14 284
5056 284 45 -20 -128 90 281 -34 -294 45 -316 34 -179 -117 -90 119 184 -6 -104 260 -188 -41 369 198
5078 198 183 106 207 65 -135 -281 134 123 -177 149 167 50 442 279 252 169 10 109 6 156 -90 146
5100 146 351 -71 186 -72 10 130 -117 384 82 -272 76 78 35 -192 -13 -102 -70 -91 186 -151 -110 -68 115
5123 115 -370 -272 327 521 -1 -85 -122 327 -67 -92 -30 -202 -187 -91 -442 -80 30 -103 -26 301 105 285 245
5146 245 -149 -29 -42 -179 -27 -341 -57 164 85 156 -208 -26 -88 -196 269 -33 8 -132 -213 31 -110 -438
5168 -438 156 -136 92 -134 -108 200 46 85 -40 -91 -41 -352 -87 17 -264 250 143 -104 -17 230 72 153
5190 153 -55 224 -60 225 -36 191 215 168 330 -124 -31 2 -286 365 -179 97 -309 94 -139 -6 7 -125
5212 -125 60 -213 86 417 26 151 98 -24 -5 194 -76 -109 382 -73 -44 86 -359 -31 37 40 -138 77
5234 77 273 -364 -29 -81 186 292 -88 26 -196 96 -19 108 207 -76 -196 292 -208 390 -44 -239 -174
5255 -174 113 -92 -159 25 231 -15 181 -69 33 -242 -252 -109 310 -56 -77 -61 -487 -162 -199 -82 -71 77
5277 77 -91 42 -125 59 -60 122 167 -98 69 -11 -223 -152 -280 -72 -34 -125 -335 -95 -105 389 -186 -161 129
5300 129 204 -81 -174 9 153 -88 127 68 -204 38 -264 -24 -136 427 -169 -110 52 -38 147 -313 -96 -74
5322 -74 31 355 68 177 -53 303 -161 45 -45 -96 176 -105 -52 163 -35 -186 47 -61 383 -147 24
5343 24 -56 -111 53 223 -74 46 -228 -351 295 169 -446 36 -55 -98 61 -44 -131 149 198 282 273 230 269 -36
5367 -36 26 -100 71 110 -104 147 545 -76 91 125 159 -351 377 89 116 299 -136 152 -112 -116 -73 2 -111
5390 -111 -196 -210 -14 -81 -84 108 201 -108 -335 -18 -22 -303 -46 104 -23 -9 -40 69 6 89 206 -130 -261 38
5414 38 -141 213 92 -5 391 -107 -320 -98 319 -62 -120 -160 -71 -48 2 213 124 -48 -11 75 69 -54 -236 -132
5438 -132 -101 -184 133 33 232 -47 272 -52 -106 9 -72 89 -195 142 -90 124 -4 132 -32 4 100 112
5460 112 -273 22 -382 -42 313 -160 58 6 -112 -160 97 105 -315 291 -78 105 188 29 -7 -253 43 164
5482 164 -55 -190 78 -115 48 113 165 40 119 388 201 -313 -288 -29 35 -131 -75 -111 135 77 -65 -187 -94
5505 -94 14 -127 68 -203 323 112 -26 -212 -43 -178 4 -57 255 55 -230 305 -213 -201 -168 -331 163
5526 163 115 -38 60 -214 172 -223 -2 14 48 -9 -335 -84 3 -3 -16 -32 126 45 69 -121 59 -207 -135 106
5550 106 -53 3 75 262 50 156 26 281 -57 -283 -174 0 42 27 69 81 -30 31 65 -117 139 -67 -151
5573 -151 -306 32 226 -114 60 -116 264 196 -167 115 -224 -56 -11 237 -69 17 345 100 18 -113 -112 159
5595 159 -345 84 -227 88 97 -119 -87 -43 183 91 154 -306 44 202 297 157 42 -47 209 -173 109 -175 -108
5618 -108 -149 42 65 360 -70 -81 -138 -134 116 -177 -105 -32 -130 -20 -113 -190 48 -74 69 -243 -310 85 -130 -51
5642 -51 -200 -87 -148 -41 55 -175 -274 184 -61 -426 -77 -88 366 -55 83 175 76 174 -196 130 -248 115 23
5665 23 -214 -8 -172 68 102 100 330 324 -73 97 145 -133 -42 -418 181 121 -20 -175 136 -51 58 -133 98
5688 98 177 -143 -170 -227 -64 -126 45 173 9 -352 -208 -159 15 153 76 330 103 -309 -23 208 -239 -105
5710 -105 -114 0 -32 0 -61 -321 -19 82 24 -6 196 194 295 68 351 -96 47 75 -32 -2 -13 278 137 145 -128
5735 -128 202 113 127 27 12 -49 -237 -106 -48 17 -310 -249 68 40 -73 -373 -21 -114 -103 56 -14 27 -278 64
5759 64 -87 -16 -25 -112 -187 -54 -160 -136 119 64 130 22 225 -166 74 198 -25 -12 18 223 199 -356 112 -163
5783 -163 89 25 -75 32 -139 103 7 -9 -82 124 -106 45 0 -13 -93 -27 -31 -80 164 -102 0 -170 368 77
5807 77 -57 199 -1 58 78 67 -28 -191 -249 83 16 226 25 -150 206 216 31 -96 -6 -44 142 -190 52
5830 52 38 -25 -88 251 128 -88 6 93 435 -293 32 373 -102 -119 -59 -88 -70 -65 -138 -61 -266 -35 87 -121 31
5855 31 -210 -109 -177 110 -190 232 15 120 81 204 85 2 -219 -79 24 -171 9 136 110 34 235 35
5877 35 1 74 201 154 205 123 -258 131 -56 -321 -104 32 20 40 236 56 -57 -173 297 291 -13 -126 -206 26
5901 26 -80 53 -333 -305 -265 39 70 8 160 -33 130 74 -215 279 -166 -121 70 181 109 -19 128 -50 106
5924 106 1 -1 -71 -71 288 173 15 146 -39 -51 128 -148 194 76 -67 51 32 224 -127 29 143 63 43
5947 43 216 -99 349 402 -107 114 69 110 -71 -12 -64 -136 208 250 -324 158 -50 -17 372 156 154 53 -252 -72
5971 -72 117 -191 148 35 102 -46 167 145 -45 -154 -30 18 -123 260 -10 160 -39 95 46 204 -14 -22
5993 -22 369 10 18 107 162 -55 -232 -32 86 51 -141 185 158 129 85 79 -301 -152 -314 -31 -75 -7 -116 137
6017 137 239 -33 219 199 34 132 -87 -88 -32 24 -27 -263 -56 -215 -95 -282 -260 27 88 181 162 29 13 154
6041 154 295 -9 -96 -178 -361 237 -241 -150 127 -141 -19 286 -228 55 -28 -106 -153 37 15 41 154 -222 -31
6064 -31 -284 110 136 240 261 6 158 -118 -2 -115 118 151 -180 -262 -141 6 -123 -87 -65 50 18 -112 -42
6087 -42 106 -455 -174 -375 110 -4 -24 88 -88 -52 54 -204 -172 -336 -289 4 11 157 -15 70 6 -38 -39 -138
6111 -138 -29 19 274 -90 -472 -26 -58 10 -48 -293 37 303 218 375 -36 475 249 -22 -224 -115 123 71
6133 71 112 104 -62 -95 349 -112 -69 68 64 -184 281 93 -151 40 -197 14 -318 196 -40 -306 -119 -138 -176
6156 -176 -257 141 -130 -77 -215 -111 54 -223 28 -285 -214 -189 -85 80 -157 -245 11 134 -137 -160 -9 237
6178 237 33 156 292 169 285 -73 -254 143 -147 75 12 226 128 191 53 35 -81 -54 46 -39 -4 -23 292
6201 292 176 -202 17 187 65 333 -387 -147 -21 -97 -176 -278 -89 -17 166 -241 -71 151 48 190 -117
6222 -117 -106 -5 278 23 154 109 -252 -163 79 -45 268 -58 338 25 -38 326 -97 113 -156 -201 -18 140
6244 140 -62 -54 83 -88 237 213 4 -219 -72 -85 -42 111 21 -74 -24 105 7 195 -265 161 -334 141 -142
6267 -142 -183 -52 -13 -158 12 61 -45 213 103 73 -105 8 208 -108 -291 5 91 55 -155 -14 351 -144
6289 -144 29 26 33 130 -229 163 -176 89 -91 -232 -202 111 172 202 94 297 66 214 -147 -222 418 327 212
6312 212 140 -16 -58 -89 -154 24 211 150 -47 46 -124 467 125 50 -349 19 64 -458 452 140 99 -247 -192
6335 -192 -13 27 -210 -83 -2 144 -39 -268 178 -120 -204 210 134 243 353 13 81 11 241 278 101 -101
6357 -101 -44 101 -200 179 -161 -77 -189 262 -181 -36 -273 219 -107 -209 -18 -193 299 -114 -9 -111 -281
6378 -281 -200 -26 -188 125 96 -96 114 58 -113 -193 3 247 -266 -227 -243 -233 142 -101 -43 -201 152 -216 -300
6401 -300 123 -165 116 102 105 -30 -72 -112 3 209 78 -72 164 128 349 51 -211 167 -251 29 152 175
6423 175 11 158 109 110 -38 -501 -280 -161 -65 54 60 -120 -101 236 -230 -203 -91 83 -132 -39 272 215 131 78
6447 78 121 -20 63 158 150 -128 130 4 -182 66 315 -167 -98 33 185 -47 -133 12 -217 6 -42 -77 388
6470 388 208 -342 160 432 325 -215 -96 -138 395 -391 -33 -81 134 197 18 85 -257 149 241 25 62 350
6492 350 139 17 70 -88 10 -27 147 43 -350 17 -272 -217 -189 164 157 -27 -1 -201 -46 49 253 142 158
6515 158 -92 -130 -29 -40 22 213 1 118 -96 -297 125 -157 218 71 -2 83 -107 3 98 97 195 130 -69
6538 -69 -64 -45 -308 -234 -13 -158 157 62 -15 -132 -344 -27 -195 76 -283 -67 156 45 -64 -115 -67 -33 -108 15
6562 15 140 6 104 -64 -113 -382 -109 31 62 -182 107 -46 -300 24 -230 155 -86 -23 -104 386 196 -172
6584 -172 164 -35 109 -29 -60 7 63 -57 -164 9 114 63 -268 -26 199 -192 -54 90 38 -45 139 -263
6606 -263 -168 -420 5 -8 93 -5 -11 -193 -15 61 230 52 -62 212 -172 -339 -408 123 -45 17 350 -50 -168
6629 -168 48 96 143 -99 -2 -78 70 129 -26 -192 -33 -176 16 -187 -169 133 47 101 -52 -10 104 118 82 -356
6653 -356 -249 -115 24 261 106 256 -28 -112 154 -52 -141 60 -277 -105 151 -278 262 -104 -300 -124 53
6674 53 -50 289 -262 -55 -71 -197 13 -258 242 -153 192 70 -107 -82 50 -34 81 156 -188 -74 129 117
6696 117 -162 -101 -24 -234 112 104 -235 51 31 94 26 87 -127 91 174 -260 -13 440 -261 -202 224 -132 -50 -2
6720 -2 79 -101 229 31 1 -25 326 195 -52 47 -82 288 82 -167 -112 95 140 -67 113 391 43 -93 254
6743 254 67 162 65 158 155 -81 -209 1 118 -7 -241 44 2 -136 193 63 88 65 -158 -282 -94 2 -172
6766 -172 393 276 111 181 210 -136 12 -15 -57 -141 -201 162 199 -23 -164 95 201 133 122 -120 194 -362 71
6789 71 84 -56 52 215 270 69 -217 -231 -241 384 -56 -36 9 -147 306 -124 -108 24 94 -172 -362 -37 -283
6812 -283 90 -149 100 251 84 143 -44 -10 -29 -31 54 -261 -236 9 50 161 28 -111 394 280 -80 -142 -34
6835 -34 90 96 18 87 43 -38 -59 27 203 53 80 282 47 -54 -145 484 123 267 -202 395 -46 -181 95 213
6859 213 410 32 -164 -266 -112 -361 -6 -11 -243 -375 -47 159 180 226 3 75 -8 18 473 -377 -41 -99 121
6882 121 -322 -11 92 51 -11 209 157 -92 131 121 -57 -164 -72 -84 96 -71 -150 -123 -90 -116 212 -26 -73 -246
6906 -246 86 51 -156 257 78 -146 41 -185 -109 181 -153 24 -104 85 -76 -91 111 69 -200 137 -195
6927 -195 -110 40 18 -125 143 38 55 279 180 -112 -39 63 -167 313 72 -77 19 23 -73 -23 139 -79 487
6950 487 -53 1 -10 -292 191 168 276 -93 -227 -314 61 50 -187 19 -13 12 -134 203 368 319 355 111 -127
6973 -127 -181 -217 236 -143 63 31 41 -84 36 -164 157 294 2 -2 13 48 46 210 -194 -70 -94 -15 -358 282
6997 282 -49 -125 174 -199 239 155 -192 163 -148 314 -4 48 -11 -116 -159 205 -161 -61 -53 63 -53 -4 109
7020 109 238 245 216 -187 301 277 -110 60 -157 164 75 -27 -243 -224 401 -352 -28 -117 255 32 33 32 71 -48
7044 -48 54 -132 10 276 -48 247 241 -343 -270 16 128 -115 -67 -26 -221 52 56 -56 -221 194 -11 166 -25
7067 -25 284 -75 -16 -6 -350 2 -18 191 64 3 -108 -48 7 31 -227 389 256 105 98 187 219 148 76 124 117 -46
7093 -46 50 37 -425 109 5 -87 285 278 148 -90 65 -144 -45 37 88 -108 189 19 222 255 14 61 -15 19
7117 19 226 4 137 -210 -193 49 136 233 -292 -42 -224 264 -135 -170 309 -175 274 -300 -150 122 103 24
7139 24 20 79 324 -113 125 -197 -77 57 -68 125 -286 -4 148 167 58 -101 215 110 165 219 147 -131 -92
7162 -92 14 101 -36 -252 -125 178 143 315 -8 -45 190 171 340 -51 -13 146 155 120 290 -211 -261 23 -74 306
7186 306 -93 -231 4 -58 88 -43 -164 111 -145 -67 9 128 569 -110 302 53 6 -347 394 -218 -194 330
7208 330 238 96 149 177 51 93 187 68 -125 -242 -91 251 -201 75 -265 48 -12 283 142 -48 -194 231
7230 231 -95 -140 206 82 -12 -77 -93 -77 104 5 -79 17 169 124 302 154 -262 -224 -236 61 239 171 127 83 -179
7255 -179 35 163 148 32 397 -62 59 11 107 -28 204 -123 -159 -21 -195 256 84 -59 -90 -45 -27 51 -102
7278 -102 -121 93 -131 -142 125 -58 -243 -245 -126 138 153 103 -99 -10 105 -23 116 159 17 -43 -201 -95 -101 -87
7302 -87 33 -76 -37 -74 -106 508 233 -316 -166 36 -155 47 197 16 92 191 -47 -155 123 56 -154 -44
7324 -44 -87 169 -211 -177 17 110 237 240 -47 134 150 212 244 -43 -629 -84 -101 -35 162 33 -48 -77 10 208 186
7349 186 69 44 -24 -123 -32 235 61 117 107 -133 86 251 -198 -73 -95 191 -328 -140 48 -169 -51 -48 -125
7372 -125 -389 82 191 -249 -51 -4 164 182 90 2 34 -149 -59 50 195 156 -80 10 240 112 -282 148 95
7395 95 204 -146 92 19 59 -278 -87 169 175 -176 153 -172 -524 227 -65 47 51 -311 85 -187 229 132 -48
7418 -48 42 -144 15 -100 90 71 -86 101 -99 -94 225 -130 -138 -20 -128 679 -166 156 162 162 30 219 -75 -121
7442 -121 -104 -57 239 221 39 -90 -99 -20 -258 102 11 56 82 -62 -84 284 -73 -65 36 228 48 -117 252 -92
7466 -92 63 -64 -73 85 54 20 244 17 -146 102 123 -461 151 -133 228 43 -37 187 -156 -47 23 90 -236
7489 -236 31 -103 29 178 -25 -188 -110 247 53 215 256 310 54 -205 -175 55 111 67 -180 -355 105 -328
7511 -328 -11 70 -12 -87 55 229 -211 -520 -275 224 -151 93 -71 10 22 -334 133 -108 270 -181 -179 232
7533 232 166 188 86 329 180 232 -123 19 47 108 -116 64 190 85 -123 106 -52 375 -142 139 -83 -164
7555 -164 -32 -391 536 144 237 -105 -120 -77 80 170 52 9 -261 -51 59 199 -95 -61 182 -372 183 -130
7577 -130 14 231 58 84 -192 81 110 -220 -61 156 -144 304 49 190 60 -233 -75 153 214 233 118
7598 118 -121 -65 107 -112 136 125 -3 -33 -61 75 -20 17 38 97 60 -63 114 96 -97 18 -69 -272 -196 -52
7622 -52 49 -40 -496 -68 81 109 -119 -209 53 -114 68 -24 -437 -136 -228 -360 286 -63 -92 116 166 -135 -330
7645 -330 223 -99 -122 22 294 176 50 21 13 -77 -129 103 72 196 -119 -16 -39 -69 -153 -66 6 -44 117 193 -193
7670 -193 -56 -118 -524 106 113 98 -24 386 119 295 36 -255 126 331 85 -195 -158 -216 -393 130 211 77
7692 77 -307 302 537 -291 136 -268 122 -23 16 -124 -382 141 -333 249 -22 -170 -21 -219 142 -117 -153
7713 -153 258 66 -159 92 -108 333 -19 -156 210 -145 -134 40 106 -191 178 -175 -35 -139 89 -194 -309
7734 -309 111 -492 229 96 26 24 204 -18 123 -238 10 306 40 36 -43 81 -219 -15 -169 35 -357 80
7756 80 -262 -124 19 -201 -32 -68 43 60 -225 -110 232 4 55 154 312 -303 -169 170 -107 -159 -24 46
7778 46 -11 -90 -74 8 -48 -23 260 55 -69 262 -85 183 -20 -23 65 23 59 -187 20 -48 -141 27 -211 98 23
7803 23 -249 285 52 227 -198 115 -330 -73 11 210 -18 -108 114 32 -64 192 -31 219 389 250 -99 -156
7825 -156 101 -116 -108 89 -11 -266 34 -25 62 39 -193 -30 281 -77 99 249 -262 127 152 29 265 -268
7847 -268 -68 210 130 -65 -50 98 -77 162 130 -27 -49 311 157 70 -60 8 -101 -109 -13 72 -252 8 -171
7870 -171 -89 43 84 -170 -98 22 -281 -168 439 -5 -314 -81 20 -182 254 -91 -13 135 -45 328 23
7891 23 189 34 -222 -27 -78 185 230 112 -301 55 189 -69 49 143 -1 -9 129 -99 171 -189 49 54 -4
7914 -4 -20 134 128 -367 87 -37 -11 -120 -176 -19 -61 -130 163 179 44 243 239 -242 -34 193 137 -101 66 -95
7938 -95 -147 -257 -144 144 -10 -273 108 -106 99 34 -210 -2 217 -257 105 109 -113 88 -25 -80 50 95
7960 95 -214 165 -198 212 17 -495 -281 -145 -327 -155 302 194 77 261 213 387 -20 7 -133 -263 -22
7981 -22 261 202 75 94 -67 -215 -31 264 -84 414 -44 119 305 -52 304 219 102 296 27 -52 155 292
8003 292 87 310 63 -71 -31 66 -268 536 -67 -200 -154 -295 -285 -56 -18 -169 1 -50 168 280 27 138
8025 138 133 -90 -73 417 182 297 288 -17 238 -145 513 123 -205 15 1 -250 -99 -23 -62 20 -104 -130 -171 -163
8049 -163 -120 -116 -141 207 -168 319 120 109 -153 64 -121 34 137 89 212 -106 -59 -17 -152 142 92 21 -181
8072 -181 -194 90 258 -96 71 -19 -57 73 202 121 167 117 -134 -240 56 123 417 155 119 -88 135 218 -49
8095 -49 87 89 -17 26 -33 -32 -51 -285 189 -200 99 -165 -199 152 19 -97 116 -48 210 -53 -141 58 221
8118 221 174 10 115 143 -168 -302 139 140 -160 127 -93 -359 -112 238 24 -148 234 87 -12 -164 -103 -45
8140 -45 121 -125 6 49 -298 66 -113 -44 -66 -303 -33 -77 -124 -24 186 144 -168 179 -202 57 271 -69
8162 -69 307 -36 -19 326 395 16 -60 384 -93 -257 68 -83 -157 91 274 -79 46 -83 173 123 -8 178
8184 178 54 30 47 44 -141 185 53
8191E3
$$ Imaginary data points
##PAGE= N=2
##DATA TABLE= (X++(I..I)), XYDATA
0 0 0 0 0 0 0 0 0 -3 8 -8 8 -8 16 -16 24 -24 32 -33 41 -48 57 -65 79 -89 105 -120 136 -153 174 -196 220
31 220 -249 277 -310 347 -387 429 -477 528 -587 649 -718 797 -881 978 -1083 1203 -1340
48 -1340 1499 -1682 1901 -2161 2482 -2887 3419 -4150 5222 -6959 10252 -18751 89442 169071
62 169071 35190 27963 64978 74842 17861 21497 66456 96896 78046 68605 61741 56009 50362
75 50362 53665 36899 21595 39095 77601 76947 49328 44457 62581 50151 16853 11293 35099
88 35099 42293 34026 38117 49052 39282 23963 28495 37800 20323 -1330 9381 33914 29272 9138
102 9138 12621 33927 29951 1025 -12794 -1175 9948 5469 -1782 -1118 5114 11572 9051 -7558
116 -7558 -20003 -11965 360 -10341 -29531 -19651 7744 8440 -17203 -26818 -11398 -6502 -22542
129 -22542 -31456 -20191 -9806 -11276 -14282 -14771 -16479 -17819 -16650 -18152 -25475 -27326 -17510 -9327 -13019
144 -13019 -18854 -15302 -10627 -13119 -19514 -21622 -19256 -14682 -11122 -10920 -14725 -14536 -7312 -2818 -10828
159 -10828 -21253 -15864 -3327 -3713 -14768 -14975 -597 5976 -3477 -12374 -7804 274 81 -6459 -9351
174 -9351 -3642 4859 6852 720 -3742 1029 7640 3854 -5895 -5342 5052 10034 4633 796 4868
189 4868 9442 7356 2525 -587 867 4674 7275 5682 3029 5134 9954 9946 3443 -1287 933 5740
205 5740 5776 1171 -30 5079 9601 7133 84 -2982 604 4059 404 -5188 -3589 3926 6840 1120
221 1120 -5337 -3921 1061 456 -7285 -11234 -4961 1320 -566 -7220 -7827 -3564 -2201 -7329 -13119 -12850
237 -12850 -7690 -4487 -7809 -11209 -9490 -4458 -5569 -12290 -16621 -13641 -9674 -10275 -13088 -13454 -9215
252 -9215 -6327 -8277 -13391 -16243 -14139 -11047 -12236 -15406 -14474 -8764 -5111 -8964 -14403 -14225 -10391 -9768
268 -9768 -14049 -16013 -12438 -5914 -4539 -8954 -11908 -9567 -6277 -8321 -13752 -13861 -7947 -2623 -4139
283 -4139 -7674 -6933 -2574 -1707 -6813 -10905 -8553 -2643 -504 -2999 -3842 -357 2920 1312 -3737 -6146
299 -6146 -2677 797 1229 -1487 -237 4778 7255 4436 -400 -803 2247 3894 1627 320 3179 8430
315 8430 9781 6405 2410 3157 5822 5568 1641 1111 6252 11292 10202 6082 4715 7584 8068 4352
331 4352 1054 2272 7611 10406 8576 6006 6591 9862 8055 3134 58 2694 7464 8061 5811 4929
347 4929 8234 9735 6846 1173 340 3451 5813 4488 3100 4279 7661 8801 4613 310 108 3062
363 3062 3722 1226 261 3559 7722 7112 2035 -697 1081 2711 615 -2066 -1210 3300 6427 4900
379 4900 916 146 1983 2388 -1348 -3983 -1076 3774 4929 2599 815 1785 3740 1512 -2979 -3030
395 -3030 332 3425 3252 1267 1396 4561 5062 1760 -2524 -2035 1555 3627 1950 796 3248 6571
411 6571 5438 1675 -1002 371 2995 2808 799 1345 4863 7354 6010 2046 523 2684 3980 2093
427 2093 30 1806 6854 7846 4784 2180 2987 4785 4238 795 -285 3059 6784 6650 3671 2611
443 2611 4365 5677 3184 -415 -140 3640 5633 3798 2237 3216 5380 4861 1282 -1361 -89 2422
459 2422 3199 1443 727 2436 4812 3057 -869 -2573 -356 991 8 -2051 -856 2167 3235 720
475 720 -2755 -2361 -980 -1019 -3222 -4719 -2542 659 919 -1811 -3990 -3187 -1391 -2788 -5923 -6297 -3031
492 -3031 -503 -1985 -4301 -4163 -2293 -2304 -5052 -7616 -6413 -3458 -2156 -4240 -5331 -3862 -1553 -2628
508 -2628 -6349 -7808 -5588 -3020 -4120 -5959 -5128 -2451 -1340 -3563 -6288 -6302 -4298 -2977 -4619 -6050
524 -6050 -4420 -1423 -597 -3189 -5308 -4389 -2287 -2882 -4934 -5315 -2610 -283 -828 -2735 -3210 -1548 -643
541 -643 -2100 -4708 -3915 -1036 587 -883 -2591 -1215 833 347 -2475 -3895 -1973 398 384 -1118
557 -1118 -1302 911 2403 888 -2179 -2628 -420 971 -13 -1559 -429 2397 2731 485 -1861 -1352
573 -1352 692 260 -1520 -1905 241 2930 2047 61 -1070 -231 1023 -136 -2558 -2046 592 2358
589 2358 1212 -1068 -714 995 820 -1816 -3516 -1885 363 1055 -395 -1494 -21 1394 111 -2676
605 -2676 -3869 -1729 122 -268 -2056 -1412 583 1571 -892 -3164 -3175 -1301 -1018 -2367 -2947 -1030 1370
622 1370 1007 -1015 -2862 -1937 -552 -1338 -2849 -3048 -135 1826 866 -1215 -1909 -389 -531 -1575 -3011
639 -3011 -1746 716 1880 981 -434 63 1176 725 -1712 -2567 -742 1964 1913 728 505 2236 3056
656 3056 1015 -1167 -1020 959 2444 1345 935 2167 4122 4165 1803 15 720 2374 2620 1491 1558
673 1558 3778 5167 4759 1959 1068 2453 3236 2413 1139 2063 4675 5763 4254 2580 2078 3641 3740
690 3740 1688 875 2514 4996 5372 3370 2937 3283 3985 2844 865 278 2312 4108 3643 2511 2758
707 2758 4015 3901 1818 -326 302 2547 2922 1803 1360 2455 3657 2900 613 -551 -202 1416 1215
724 1215 59 272 2384 3250 1585 -617 -599 194 795 -240 -1018 130 1671 2219 140 -1201 -795
741 -795 233 -377 -2012 -2485 -305 1366 952 -868 -946 -94 355 -1476 -3013 -2597 -640 822 -389
758 -389 -1260 -664 570 -25 -1688 -2597 -1947 -402 -50 -799 -1286 252 1048 51 -1972 -2193 -841 -108
776 -108 -876 -1078 -508 918 1477 -131 -1723 -1296 -251 283 -958 -1574 106 1760 1294 -509 -1039 -91
794 -91 645 -255 -1171 -931 1234 1737 1333 -179 97 1220 978 30 -1335 -617 1235 1514 221 -191 852
813 852 1583 749 -919 -1408 -155 928 583 -258 -506 1098 1551 310 -1373 -997 -211 489 -370 -1001
831 -1001 -423 1340 1171 -591 -1536 -1029 -90 -879 -1880 -2046 -397 596 -289 -1461 -1585 -833 -824 -1551 -3151
850 -3151 -2414 -591 -96 -1332 -2131 -1604 -982 -1202 -2751 -3462 -2542 -1228 -1230 -2043 -2464 -1269 -696 -1838 -3302
869 -3302 -3485 -2093 -1393 -2245 -2876 -2454 -1097 -655 -2363 -3254 -3122 -2025 -1541 -2726 -3061 -1554 -65 -464
887 -464 -1698 -2617 -1983 -1323 -1629 -2950 -2261 -470 26 -1197 -1718 -910 -332 -433 -1361 -2256 -1245 189
905 189 594 -643 -939 -142 900 269 -1469 -1482 -318 681 655 -201 33 1145 1568 70 -632 -496 639
924 639 886 483 57 1068 2153 1938 423 -103 931 1502 1092 72 771 2087 2767 2263 715 890
942 890 1189 1410 568 -319 692 1713 2646 1427 974 1252 2055 1298 -9 -291 829 2011 1857 1067
960 1067 740 1652 1955 654 -544 -213 850 1377 830 565 700 1805 1609 27 -936 -123 698 453
978 453 -353 -234 926 1608 1056 -386 -1054 -121 333 -165 -591 -282 1224 1383 313 -495 -308 611 -146
997 -146 -923 -751 103 1258 1096 104 -88 452 648 -89 -1255 -1114 441 1275 1052 132 288 1014 1026 -226
1017 -226 -914 -332 625 827 572 227 1148 1828 978 -190 -468 -30 909 693 350 654 1755 2101 1286
1036 1286 182 -102 1002 1222 719 539 1247 1845 2261 1369 533 1148 1543 1149 494 261 1538 2548
1054 2548 1906 898 1091 1674 1570 518 40 560 1720 2327 1261 1011 1202 1828 1376 150 -352 408
1072 408 1364 1123 600 702 1028 1172 524 -175 -582 311 709 302 -264 189 1072 1015 70 -1000 -711 -2
1092 -2 61 -790 -812 22 514 248 -1095 -1252 -616 -471 -754 -1648 -1365 -268 140 -461 -1449 -1054 -797 -704 -1903
1113 -1903 -2358 -1771 -239 -789 -1512 -1529 -1109 -656 -1346 -2051 -2143 -1523 -769 -1110 -1584 -1409 -689 -756 -1413 -2366
1133 -2366 -1618 -1246 -905 -1456 -1790 -1032 51 -210 -1573 -1840 -1296 -1063 -1215 -1392 -1627 -736 -18 -371 -1426
1152 -1426 -1380 -709 -282 -1465 -1600 -952 53 123 -427 -800 -452 -283 -238 -1078 -922 -382 354 183 -137 -365
1172 -365 219 521 7 -978 -755 443 516 68 -492 224 723 868 -131 -717 -247 642 240 -235 -8 444
1192 444 1076 632 -634 -166 61 274 -296 -656 -151 599 920 139 -488 -135 570 236 -731 -894 -171 545
1212 545 204 -105 -362 -156 542 158 -917 -1186 -367 249 -117 -558 -357 410 162 -446 -1313 -858 -283 73
1232 73 -528 -828 80 478 -115 -938 -1298 -607 -70 -442 -911 -659 293 392 -211 -895 -636 -454 -278 -793 -1236
1253 -1236 -431 339 514 129 -461 -122 45 183 -912 -418 13 1060 471 83 -316 646 745 271 -228
1272 -228 -329 465 776 330 326 615 1314 1171 202 -19 344 708 1266 870 490 1373 1771 1149 647 360 817
1293 817 1447 678 366 1451 1636 1482 1237 727 728 1364 1322 750 713 1171 1878 1652 1166 1037 1209 1477 917
1314 917 537 625 834 1677 1321 835 1237 1429 1218 327 194 261 1029 1339 865 584 1184 1238 865 125 -84
1335 -84 341 1165 454 288 446 1273 901 571 -368 -238 -4 190 51 -180 -11 500 775 -365 -603 -356
1355 -356 20 92 -637 -755 228 787 33 -918 -415 102 -220 -764 -1214 -858 -294 275 -362 -512 -408 -92
1375 -92 -381 -1096 -1372 -745 20 43 -652 -781 28 -318 -433 -1116 -1039 -951 -102 -512 -897 -106 497 116 -666
1396 -666 -974 -516 -157 -189 -678 -582 112 323 115 -292 -638 -313 -5 -336 -689 -485 422 580 85 -457 -434
1417 -434 155 211 -395 -334 -142 662 560 24 -257 -71 268 -185 -471 -470 -208 239 184 -607 -15 105 477 -201
1439 -201 -496 -10 351 487 -247 -247 440 419 66 -623 -553 -325 181 -620 -492 -115 194 194 -249 -623 -764 -240
1461 -240 -298 -556 -1154 -581 -294 62 -791 -961 -934 -446 -716 -756 -1328 -846 130 -300 -747 -636 -521 -540 -991
1482 -991 -1181 -1344 -701 -335 -922 -937 -493 -487 -232 -960 -1330 -813 -703 -650 -828 -860 -279 -33 -803 -561 -1106 -598
1504 -598 -220 -527 -935 -431 97 334 -473 -808 -575 -137 -253 -486 -543 89 120 285 12 -446 137 -19 35
1525 35 -245 -429 424 147 240 320 244 508 512 212 -1 260 61 507 515 269 751 931 717 11 12 578 740
1548 740 460 102 801 927 1317 792 638 839 744 414 425 239 838 1467 825 851 660 560 896 404 575
1569 575 329 945 873 929 528 219 609 823 671 10 419 579 871 524 120 413 608 506 -29 -157 -178
1590 -178 342 245 174 -69 753 550 302 -85 -193 455 293 -345 -299 204 350 589 -398 -169 -291 189 -493
1611 -493 -361 -114 86 390 183 54 18 226 113 -265 -458 -112 302 501 25 107 -235 445 134 -294 -299
1632 -299 -331 261 210 135 71 185 121 169 -344 -296 -7 -75 -247 13 216 424 353 -41 -382 -165 199 421 76
1655 76 -210 289 854 500 177 175 511 400 351 65 162 735 909 353 272 180 406 455 243 102 275 572 816
1678 816 566 193 300 345 529 -176 -63 312 419 470 480 -219 636 343 -96 -344 -418 105 406 468 151 63
1700 63 339 118 -548 -614 -158 294 31 -684 -92 -3 -124 -202 -174 -102 -337 -19 -277 -757 -44 -91 134 -194
1722 -194 -632 -492 -440 -448 -607 -727 -227 -59 -152 -625 -726 -498 -565 -748 -747 -805 -119 -219 -449 -827 -566 -477 -476 -590
1746 -590 -786 -771 -236 -78 -441 -576 -567 -248 -387 -646 -892 -405 -504 -404 -524 -817 -262 121 -488 -693 -577
1767 -577 -47 -467 -412 -416 -332 100 -6 -335 -525 -406 56 -238 -463 -232 171 247 131 -144 -226 -145 365 -114
1789 -114 -291 -165 70 276 -186 -551 -78 386 243 -201 -295 415 406 238 28 232 452 474 36 93 -249 165
1811 165 38 206 21 85 530 385 167 173 142 16 0 -61 213 109 630 268 -9 -49 217 318 -163 -178 -348
1834 -348 293 325 -67 -105 -170 610 185 -458 -370 -71 -5 105 -204 -78 151 113 -365 -749 -206 -274 -111 -134 -308
1857 -308 -216 -30 -120 -204 -154 -316 242 191 -73 -189 -68 253 232 -452 -31 35 15 -114 -266 -62 21 227 54
1880 54 -94 108 271 182 -5 -221 -143 131 337 288 131 197 559 114 -359 -65 486 679 414 328 333 518 545
1903 545 33 -20 115 302 621 183 90 8 550 877 166 361 325 632 320 161 458 312 581 733 400
1924 400 214 342 873 124 -9 399 305 582 311 399 262 360 350 119 118 532 575 614 154 417 403 311 328 -164
1948 -164 24 363 68 79 488 286 592 311 -95 -204 -160 410 299 26 181 -226 503 177 21 -148 14
1969 14 98 -167 -349 -848 260 137 -331 -339 -67 -426 182 -339 -493 -157 101 202 -10 -420 82 -417 -457
1990 -457 -486 -105 -205 -366 -401 -227 -189 -258 -121 -470 -331 -271 -485 -230 -271 -41 -48 67 -81 -109 -362 -587 -188
2013 -188 -274 -584 138 -66 -119 -288 -338 -561 229 -267 -162 -565 -328 258 -72 37 -414 -240 133 -178 -125
2034 -125 -61 123 443 205 -178 46 -231 105 -185 -34 -65 87 426 72 190 302 120 -91 29 -157 -83
2055 -83 141 367 125 260 113 480 358 274 -361 -38 291 34 60 -167 349 -121 74 -98 -10 74 -85 -310
2077 -310 -327 35 48 26 -218 -39 224 -182 -86 -507 -353 64 -57 -10 -179 -132 -470 -534 -438 -499 -490 46 -95 -147
2101 -147 -342 41 -128 -87 -585 -523 -315 -194 -160 -750 -680 -24 -148 -187 -225 -680 -303 -404 -329 -619 -320 -282 -86
2124 -86 -443 -247 -398 -199 187 -405 -413 -23 14 -62 -454 4 107 -304 -221 -333 -251 219 -281 -101 -171 -17 -5
2147 -5 -1 -186 -219 206 347 -13 393 66 -125 281 221 -162 6 209 117 383 20 272 478 453 133 219 308
2170 308 644 417 16 96 190 586 -20 323 248 112 378 154 140 272 655 791 306 228 426 393 136 54
2192 54 -52 484 90 98 47 171 226 85 446 159 51 20 -160 -27 -2 221 460 277 214 -389 -86 265 230
2215 230 -132 361 73 138 -108 226 322 -203 140 -61 16 79 199 418 23 44 -202 -265 -182 172 -295 -217 110
2238 110 26 -358 -525 64 10 -98 183 -53 -74 314 -137 -312 69 99 156 95 -442 -291 -78 49 -102 -202
2260 -202 -277 87 -222 96 -94 -201 272 -9 169 -156 91 165 73 390 -101 153 155 288 -144 204 208 257 -87
2283 -87 60 165 188 5 -31 86 181 398 126 -31 33 48 228 12 10 -36 385 354 83 244 -45 239 -50
2306 -50 -11 -199 137 158 243 -101 118 94 307 -5 110 -152 286 -19 340 169 76 107 539 46 365 30
2328 30 392 166 -253 -198 -333 -11 -89 -34 -200 -26 -283 -249 -264 -16 -8 -1 -283 -324 -473 -98 -86 -104 -320 -138
2352 -138 80 -409 -186 -237 -302 -155 -203 -335 -217 -128 72 -121 -20 -289 -280 35 -611 -540 -341 30 -91 -26 -376
2375 -376 -124 -151 -258 -265 -219 -187 26 -109 -50 -258 -43 -120 -216 -269 -282 -70 -136 -438 14 -16 -49 -14 -119 62 405
2400 405 -155 11 161 -331 294 201 165 90 -80 147 172 65 -116 -180 337 -118 155 37 -74 33 -4 -21
2422 -21 -281 54 50 -126 118 76 -10 211 207 117 190 -113 282 499 -22 78 105 126 60 24 -5 -27 166 272 129
2447 129 -301 223 -48 -293 -133 -4 73 83 -441 -237 -138 351 -97 -175 196 107 314 -139 -313 -43 -16 -116
2469 -116 45 -307 -146 162 18 -334 2 -356 -212 -202 138 -186 -49 -18 43 79 -136 -62 -165 -431 -327 -157
2491 -157 -306 -142 -239 -116 -178 -346 33 66 118 1 128 -44 152 -292 -168 -53 -58 287 39 -34 100 502
2513 502 -176 280 91 -205 97 131 142 179 242 78 1 72 103 39 53 -219 91 121 -6 192 220 343 268 337
2537 337 547 418 319 150 205 195 246 378 292 -40 106 189 332 274 -114 263 144 337 162 -27 178 61
2559 61 161 128 147 138 181 380 -225 -2 154 412 -107 -349 -161 142 333 172 -136 -19 211 96 104 58 -81
2582 -81 -246 122 -61 -130 -39 -19 255 186 206 -99 37 154 26 99 -158 89 -170 -155 -155 -100 -292 -306 -254 -86
2606 -86 70 380 -300 -211 -326 -205 -146 -37 70 -178 -222 -448 -121 26 -127 69 -16 -58 32 -106 214 -95
2628 -95 59 -224 269 -135 -60 -113 -204 -195 124 -178 50 -98 -174 -19 -144 -72 -239 419 -92 42 50 118 114 379
2652 379 115 -72 -6 -164 26 114 -65 -63 -147 -77 -37 -63 13 75 -14 -145 -182 189 212 101 -215 89 249 -12
2676 -12 -46 -259 318 148 -23 -251 335 328 -121 -37 -256 -128 26 -84 132 -137 -21 95 99 -81 -328 7
2698 7 133 -128 34 163 51 124 -501 -3 -450 -194 -134 -205 -330 -279 62 127 -171 -26 -162 -211 -45 -114 -165
2721 -165 18 148 -392 -313 14 -254 21 -247 -43 -307 -58 -8 313 -68 -19 12 -42 197 18 -6 -220 -321
2743 -321 -150 -130 10 -240 -53 65 86 -188 6 103 -85 -342 -147 -112 -144 -205 -34 21 -306 29 -114 159
2765 159 49 227 -14 -70 -371 218 543 139 104 -56 173 52 321 2 109 -113 313 -131 75 111 -52
2786 -52 180 151 7 120 407 -52 -182 15 386 73 -87 147 321 61 143 57 -16 157 141 307 -59 417
2808 417 189 -65 392 -126 229 189 403 -87 -196 84 66 117 138 166 193 -103 1 -47 -243 236 60 -182
2830 -182 347 15 118 107 7 -93 -95 5 -129 -27 161 -9 -120 138 -53 198 -3 69 -83 6 -115 165
2852 165 -9 23 215 -117 141 29 -80 -127 257 -124 -304 -247 -120 175 -103 -111 -152 -80 -178 19 86 73 213
2875 213 -86 235 -234 -382 75 -29 -218 93 137 -109 20 -293 -124 -252 127 331 46 -93 242 345
2895 345 68 -17 148 237 -237 111 -258 79 203 26 58 -65 -168 -44 -7 -71 152 -248 146 -291 401 55
2917 55 69 350 173 -129 -139 -343 63 -67 200 -234 379 287 148 214 7 424 148 238 -84 187 81 -251
2939 -251 350 41 -341 -42 -6 -66 35 232 -23 68 -387 -206 -313 -137 -60 -196 -6 262 -28 -53 -311 -107
2961 -107 -349 -102 46 11 -180 -313 166 -100 99 19 -209 -234 -34 -200 -292 -367 -115 -219 -177 43 -75 -53
2983 -53 -216 51 -113 57 -358 -76 -314 -274 -98 -223 -159 -187 -179 66 107 -220 -255 -114 173 -212 95 133 -389
3006 -389 -87 21 -300 49 -249 189 -299 -374 -309 123 260 260 -421 -30 -25 15 -148 -56 181 157 -107 -194 114
3029 114 -180 188 45 207 -106 -168 -71 -285 84 85 -37 204 60 -77 -107 206 277 95 85 186 -91 183
3051 183 -99 263 177 156 8 41 81 -194 -96 273 59 -233 83 -93 52 55 -84 101 -54 108 -130 -48 20
3074 20 94 114 8 -60 -77 1 -278 56 -141 63 307 -57 -211 536 -107 230 38 -38 127 241 201 -11 -30
3097 -30 -202 -53 -25 155 124 -186 69 215 58 15 -154 -34 -21 -92 4 -46 -136 -133 -47 126 -140 177 -155 124
3121 124 70 -80 240 4 -253 63 -394 -110 -19 262 -338 -236 -44 -176 282 -8 351 88 -25 -285 119
3142 119 -166 -41 144 -422 111 215 106 53 212 79 -74 29 307 30 -111 57 -146 85 -156 244
3162 244 72 165 59 301 19 112 35 2 359 -42 200 55 442 -354 -117 273 271 102 147 160 308 -10 18
3185 18 -66 -21 134 -86 43 -2 278 243 -124 -135 183 243 -135 323 190 172 -148 -27 -198 -24 175 342 -138
3208 -138 80 60 162 -119 -221 263 25 -36 191 127 3 221 51 103 -341 -72 -126 -247 150 261 -3 248
3230 248 -36 -167 88 -241 -117 -153 -351 -209 15 114 -76 -144 -25 -234 -96 31 -275 -61 -294 -332 -47
3251 -47 -251 -194 -50 -64 -342 -18 80 10 -148 27 100 -258 62 25 -70 -50 -226 146 -69 128 -75 245 148
3274 148 -53 -200 128 -30 -288 256 70 241 148 -1 132 -96 96 173 -44 57 130 -313 -219 -37 35 182
3296 182 -247 -109 -160 169 184 -223 27 -327 19 -123 144 143 -212 -42 -159 -259 -99 -82 234 -170 212 -63
3318 -63 131 -246 -47 228 -32 -262 81 -203 -59 -179 -133 165 -39 -123 -181 99 -401 -39 -285 -149 -65 -117
3340 -117 -64 -71 188 -261 -34 -405 -105 -140 52 83 -85 138 104 -191 5 -341 160 326 58 -5 16 -100 -7
3363 -7 -41 151 24 -112 -48 78 -102 -22 -160 63 122 216 -55 -254 -83 72 -46 81 -6 4 119 66 163 -342
3387 -342 42 71 67 -39 -42 151 114 -320 -54 -32 -345 122 78 -10 -68 73 -111 -178 67 -29 -194 125 -111 121
3411 121 125 -238 -103 -48 -105 176 247 -25 164 -154 -151 553 108 50 -263 61 379 -77 33 -140 -250 17 -8
3434 -8 -232 78 177 182 -213 69 118 -130 -75 32 1 153 170 110 280 -62 -30 -353 144 172 13 243 -176 -264
3458 -264 67 -229 -35 -179 130 -173 235 -90 -145 -137 -175 32 182 -199 -209 1 -121 100 -443 -63 52 2
3480 2 -153 -340 108 -239 62 98 48 97 -353 288 194 -126 265 -251 -29 -154 -173 63 -90 84 -131 -237
3502 -237 33 -45 -245 -161 99 -112 -64 -18 -94 -449 127 -172 -219 127 201 125 204 -69 -220 -235 -431 114 -39
3525 -39 -89 200 393 -489 -298 -185 -150 -78 -43 -68 144 67 -15 -170 -162 88 -21 -58 27 -100 81 235 -265 75
3549 75 -28 210 48 63 179 -215 -149 231 124 -91 -92 -45 -59 212 -280 177 -160 -17 -17 270 221 3 9 -274
3573 -274 215 -108 -201 46 170 -33 178 -38 177 -102 -425 315 -188 -200 63 116 -218 -228 -112 -165 -129 151
3595 151 -272 134 -148 102 -100 -327 -129 -136 -144 15 -19 439 -55 -8 15 -337 31 -279 -49 -178 36 211
3617 211 336 187 72 374 -344 -157 -219 -294 277 -161 119 -114 19 1 -17 193 -305 -258 132 -280 -75 -25
3639 -25 60 264 -65 155 -235 108 10 -122 20 31 -93 277 169 -131 -61 -214 138 77 -61 -282 200 73
3661 73 384 165 -11 -30 142 243 -174 -61 -426 25 151 -143 -58 79 -139 70 109 -21 97 133 283 117
3683 117 56 -52 -34 8 -107 -294 13 63 -209 42 -25 -173 -190 248 196 -106 112 60 231 128 -199 51 -108
3706 -108 -261 -300 155 133 98 14 -104 -86 -144 -277 -63 -213 254 345 -167 -484 93 95 -171 -163 427 80 248 239
3730 239 -4 -332 -42 -89 -13 17 -127 129 51 -173 -162 -199 -105 154 85 -119 -162 2 89 -130 -418 -24 38 8
3754 8 -240 61 72 118 20 -138 121 -71 353 238 33 68 287 162 -101 -69 83 362 -303 -131 51 -21 157
3777 157 187 83 -102 -113 128 -2 -5 27 25 -138 27 49 101 -419 -173 147 -155 -264 104 178 -90 -110 -75 79
3801 79 44 121 -300 104 294 228 -8 145 -217 81 -84 -282 102 -206 300 54 86 310 186 -63 108 -18
3823 -18 -238 125 122 3 -206 -70 237 59 -177 -128 49 157 86 73 49 -287 158 -80 -54 -163 -132 155 45
3846 45 -10 -90 -300 191 89 -36 -247 -297 260 -169 271 192 25 29 -29 266 -226 243 -140 27 130 208 234
3869 234 -83 -38 -354 -2 168 34 95 -177 -210 -8 69 -17 -12 -149 100 -147 15 -76 -83 234 11 37 -214 34
3893 34 -193 216 207 420 38 -68 -24 360 241 18 121 59 471 -350 34 169 -32 113 127 -35 175 -85
3915 -85 -35 70 20 -51 0 -58 151 168 158 119 70 294 -29 189 -36 -201 -53 -168 136 -240 89 52 90 -18
3939 -18 41 93 70 11 -176 188 75 167 62 -3 -245 -203 -241 3 98 -95 -35 -204 -60 88 -78 182 -129 -69
3963 -69 -136 -140 -387 -129 89 -171 -281 -259 -65 -52 89 -253 330 79 42 92 173 -199 55 -149 -8 -187 -254
3986 -254 -31 160 -449 -151 201 -26 130 -106 145 215 -4 220 -320 156 -119 -316 -221 -50 156 -143 109
4007 109 143 -15 251 70 74 -81 98 -27 -14 176 30 -48 -122 406 163 137 -83 -47 -63 -26 -8 -56 196 355
4031 355 -21 408 -96 -15 -19 30 215 375 13 72 169 100 -98 -180 167 -135 -58 132 205 127 51 -181 110 -8
4055 -8 -42 -73 -121 -306 -123 372 7 147 233 7 -226 -123 55 131 115 -102 -28 87 124 -24 -36 164 -1 -202
4079 -202 -113 31 160 -10 -38 200 14 25 -9 -12 -275 -46 -265 231 45 -38 64 226 173 89 41 25 -175 119
4103 119 173 -161 -69 -64 -35 -170 -223 -330 -45 62 167 118 -121 -330 -177 -18 -171 182 -133 -44 6 -46 33 140
4127 140 -163 185 183 -206 -104 -168 121 125 -183 -93 -213 -95 217 174 -90 -214 400 40 152 20 -152 -222 -125
4150 -125 -55 140 135 -401 -239 -59 -87 108 81 -113 145 -168 259 129 -274 12 28 135 82 45 -89 -49 78
4173 78 142 278 -18 196 39 -155 27 175 166 -105 347 292 -35 -397 121 -217 18 148 -10 85 175 -188
4195 -188 -135 -6 -44 179 -171 -150 25 -51 85 149 -42 -282 -51 88 -83 198 -280 47 260 -124 -152 196
4217 196 152 19 -136 -364 -183 -59 137 93 93 -111 84 99 149 47 49 295 -61 201 -101 290 20 -31 -78
4240 -78 225 282 -136 182 -184 -191 -62 101 54 -54 -72 -109 -55 96 -125 220 -171 5 111 75 -12 -318 -273 104
4264 104 89 -326 303 -112 151 -232 -24 -245 75 100 56 -114 67 -174 157 -8 -4 90 2 373 223 9
4286 9 114 116 -36 130 244 198 -101 74 -92 -21 206 -92 -69 116 -52 249 136 25 -60 -47 115 -66 -136
4309 -136 -292 -111 -111 305 272 -180 169 -71 20 -71 -94 -323 -154 101 -128 254 -131 -124 130 -91 -61 -244 300
4332 300 261 78 84 -60 -91 385 -291 -300 218 56 -148 177 -138 95 57 -289 -389 11 498 209 -131 204
4354 204 43 130 -85 86 83 -107 116 34 156 -27 4 -153 136 -74 177 60 64 78 11 7 -112 -179 -49 -89
4378 -89 84 191 95 -213 -229 184 161 -73 -41 -32 -1 -192 -70 283 18 -149 -92 218 -380 -197 -89 132 74
4401 74 106 99 171 -252 -18 -86 152 212 -110 -261 -18 -32 61 -125 16 -92 51 184 32 -2 93 -346 -256 157
4425 157 210 37 -32 -252 -142 133 164 16 -82 234 -54 167 -100 -184 -64 1 -215 -78 26 -73 -286 110
4447 110 262 -92 29 -57 -42 93 -104 -226 -10 105 24 -109 -162 73 -146 60 -364 278 334 214 -57 429
4469 429 -11 -38 99 -213 259 -21 262 70 -236 222 47 -14 -189 323 -40 -61 -237 160 -364 -4 -122
4490 -122 -325 343 224 326 -9 255 84 -57 -204 -26 80 13 -252 216 -183 -192 2 318 -236 27 324
4511 324 -28 90 -493 -280 113 -50 -36 31 -105 -42 -115 63 -8 -125 34 -156 -223 355 -372 -67 -50 145
4533 145 -42 138 114 171 -151 -47 -224 -293 132 80 -126 -283 157 91 286 191 -253 313 -242 173 -28 -90
4555 -90 -220 -669 75 334 -52 -1 -164 -15 58 25 -20 5 -83 97 9 -90 50 72 171 -160 -44 262 -53 10
4579 10 -200 118 27 -240 43 -145 94 55 225 -128 -316 144 -13 4 -320 -349 -165 -162 -450 -214 28 -64 -20
4602 -20 20 293 213 82 -47 -141 247 -424 -364 -327 147 373 -49 58 153 10 32 163 -308 -61 -46 169 -350
4625 -350 -131 11 -34 -104 -255 187 55 155 57 -44 -150 -163 -265 -174 39 15 -82 231 -135 -135 57 -204 -120
4648 -120 -4 -299 42 251 105 155 56 -25 -37 -372 384 245 -262 92 -62 -211 39 173 -47 -26 15 -72
4670 -72 117 275 209 64 38 -136 -105 -97 -11 217 98 142 121 21 21 9 -11 -75 -71 -132 262 29 -43 191 -109 93
4696 93 -76 107 -107 -143 47 11 -68 -55 -188 117 116 197 -199 -35 -119 -226 149 12 76 -54 -22 73 -46 -11
4720 -11 59 -328 -158 46 -241 -109 -118 -209 128 -87 -286 85 -264 -70 -132 -142 -107 425 -237 -26 42 -274 159
4743 159 184 12 -124 37 -93 44 103 73 -106 -297 -176 33 146 -86 69 -124 240 351 89 -180 -179 245
4765 245 46 230 301 148 128 6 39 -35 -98 91 26 273 62 -118 -15 83 -19 123 13 -74 -323 284 81
4788 81 167 67 69 32 -178 -140 230 203 -74 89 40 53 127 -35 195 -48 -60 5 34 69 -197 293 -58 -28 212
4813 212 -54 102 411 273 -80 73 -69 -100 -13 -205 -113 193 -129 -325 36 -259 69 218 63 -34 349
4834 349 -366 99 64 -154 285 33 -71 -217 -62 31 154 114 29 -215 -136 -41 13 222 100 -266 -56 -196
4856 -196 13 23 -193 -68 205 -160 -71 -108 64 183 -85 -286 37 -56 14 -30 145 -100 17 -29 -167 9
4878 9 209 4 219 -9 84 200 -345 -140 -260 -66 51 -215 100 -327 145 59 -36 -13 -151 64 20 -164
4900 -164 124 293 5 35 139 40 58 40 272 -13 17 152 -158 366 2 -54 -169 79 87 -219 -87 21 202
4923 202 -230 49 35 204 -18 -254 -169 -11 143 -14 87 82 92 -148 -109 157 124 204 -564 -85 -76 179 75
4946 75 116 88 22 346 -34 -38 110 -101 60 77 156 -102 -8 -77 -156 -186 -320 136 -134 211 32 -19 134 463
4970 463 -5 -148 -207 53 64 45 158 -73 153 -124 87 411 164 220 -106 -51 218 -107 -159 -570 -179 155
4992 155 -115 -188 301 71 -24 -27 139 109 172 190 -257 94 168 211 14 -145 46 145 -15 -64 87 -149 -36 -51
5016 -51 -152 -121 -215 -114 65 294 -199 100 -157 79 -61 103 90 20 -128 74 81 -275 -78 -257 -32 -82 -178
5039 -178 -163 -132 -57 80 34 103 159 -245 -248 -25 -63 -140 96 85 137 131 21 -137 241 126 53 3 18 48 121 189 144
5066 144 -159 -159 -99 132 233 -11 99 -173 -355 88 -85 -16 6 -50 -116 142 -54 -136 140 190 173 267 74 57
5090 57 199 -362 68 -107 9 20 -32 -79 -112 32 -26 -56 24 248 202 58 15 86 -227 -30 -134 -74 -142 -65 -70
5115 -70 -10 109 -21 -37 -102 85 137 81 -72 159 207 -181 249 -358 -301 298 -104 209 98 -22 -95 -64 295
5138 295 33 177 69 66 240 164 -49 -126 13 -220 68 208 -129 -22 34 273 -186 59 -65 155 -58 47
5160 47 -69 19 -13 -257 201 -154 -218 -242 181 -188 -199 166 307 -289 -25 77 -250 8 105 -206 -44 72
5182 72 170 9 -22 -9 -123 66 66 -149 92 -89 -104 198 -27 -151 -165 116 -69 145 124 224 -39 65 -165
5205 -165 33 -3 181 89 -170 -70 219 -272 1 -26 113 93 314 -44 248 -340 43 -250 -37 16 -178 181
5227 181 30 -220 -260 269 -76 -69 43 148 -9 99 -166 -27 261 74 -32 -110 -195 -206 -177 37 -141 36
5249 36 276 -88 -316 278 -146 -116 -4 -32 84 -119 -78 123 214 76 48 -159 -295 269 -96 73 71 -90 13
5272 13 -60 17 139 -265 102 -7 -54 -143 -16 126 169 -11 106 146 -116 257 -124 -66 -31 -25 -91 54 -25 14 -55
5297 -55 -31 -75 99 431 203 -117 -7 107 -38 162 -63 104 -1 -279 169 19 22 -32 -335 440 -116 50
5319 50 -27 256 -136 192 83 -307 103 -113 -43 -167 -32 56 -61 -46 36 295 36 -63 -145 -278 375 -301 -87
5342 -87 161 -271 -90 133 -127 -111 -361 -109 -86 119 -136 -66 -180 -178 4 -140 -81 -232 -237 141 -14 -155 180
5365 180 -27 -192 470 -21 122 -55 -94 81 34 -113 161 77 -103 154 124 151 265 -43 -95 198 2 -236
5387 -236 231 -66 181 30 136 -307 309 -74 2 -135 -50 93 -281 -44 -66 24 -168 243 207 -60 -147 8
5409 8 155 -39 -110 -10 -205 -210 122 20 -70 213 -175 -42 132 204 -326 -119 -68 -9 234 162 -28 -297 -72
5432 -72 -75 -4 -153 -92 37 -174 -39 -74 189 -268 -77 -26 -187 -140 -263 -29 -1 270 -135 -72 41 6 -100 -444
5456 -444 2 13 -128 97 -57 300 51 -252 -51 -187 -157 328 -318 -173 -122 143 -74 364 -85 -2 118
5477 118 -319 -241 -233 81 -449 122 19 -47 -90 -70 -101 -35 -130 -111 43 -173 -11 38 80 100 42 312 131 16 101
5502 101 108 54 174 -141 -43 281 390 302 -18 -30 -392 163 239 184 -17 -311 -71 85 6 -153 2 -177 -20
5525 -20 -213 316 -206 -183 -178 157 -219 -137 -42 -484 50 133 32 -79 346 113 -147 12 305 -62 44 25 46
5548 46 -23 8 -1 49 182 -116 55 194 -26 142 57 -176 101 -50 74 -225 -40 -106 -440 236 -179 234 113
5571 113 -11 185 69 -15 65 126 328 111 216 165 221 -146 -156 37 166 250 -161 -144 -269 -16 -53 -36 104
5594 104 -236 281 74 395 -33 -183 29 -23 -187 57 68 28 27 181 -99 36 267 -45 -127 54 -44 162
5616 162 -89 -55 87 58 -150 243 -79 -3 295 -110 -158 -170 -2 -188 -1 11 246 315 126 134 121 104 26 318
5640 318 -29 72 -58 -178 160 149 100 -99 217 -81 -275 -154 250 -73 79 -149 93 -12 107 216 -186
5661 -186 224 47 328 85 -181 -36 3 -70 -14 43 94 184 -265 279 -61 288 81 -227 -8 -304 104 -108
5683 -108 -397 21 204 149 362 -1 91 -66 -5 -185 -12 250 -69 -46 288 183 20 340 -154 -31 -29 -9
5705 -9 -99 -141 -279 266 -176 301 5 -112 122 38 -63 309 362 161 81 -59 161 -183 -4 87 -115 212 146
5728 146 -41 -16 47 -37 361 109 26 -110 96 -155 -74 132 13 307 94 -28 -13 75 207 -24 -47 -41 -56 -47
5752 -47 170 -81 -380 150 422 209 31 122 36 25 -49 148 -186 193 500 142 104 -223 129 90 169 -34 8
5775 8 -468 69 -142 -193 109 -307 -143 40 23 132 -273 204 -23 -149 341 84 -75 -77 -22 -152 -95 -273 78
5798 78 -96 -28 34 142 -74 78 86 -15 158 -304 -243 73 64 -58 -128 27 99 -315 -39 -109 -174 108 217 -31
5822 -31 77 149 -261 160 36 -274 260 43 218 -33 76 215 16 31 272 -94 -122 -54 203 141 83 14 -8
5845 -8 -80 -83 -154 -186 65 145 -22 -189 179 152 330 -247 -6 26 -76 92 -291 147 191 342 332 -164 -189 63
5869 63 -227 464 75 -111 -248 -46 -133 -60 361 -126 -207 -21 -248 106 136 -73 -326 -86 126 -42 142 -172
5891 -172 7 -18 169 286 95 -267 -79 199 -217 -74 126 86 120 387 139 -78 -54 -93 -70 150 92 92 270
5914 270 58 -21 293 44 242 7 97 -18 -121 27 204 -41 89 -108 246 -119 -394 225 494 167 -175
5935 -175 -6 121 6 -141 34 25 -52 57 -181 48 -130 -2 -178 -377 -142 101 -182 -44 -44 -102 -27 172
5957 172 66 242 23 92 -48 72 -11 61 -51 139 28 129 105 -207 16 -437 54 -34 -117 44 -222 -5
5979 -5 77 -64 -23 10 274 -111 -50 -61 1 122 -257 53 -12 8 159 297 -180 -112 430 -50 119 -202 77 79
6003 79 258 -18 -161 -142 30 -9 44 -232 134 -36 179 -270 -97 -8 -110 -80 -111 -194 118 -46 -396 72 -147
6026 -147 -89 22 -310 5 -63 20 -177 122 -63 -38 98 9 -25 -178 -85 337 121 -61 -18 -234 -174 -68 -95
6049 -95 108 -115 207 -211 -230 277 57 81 41 -17 195 123 -130 -10 -336 -371 13 42 -14 90 -38 32 126 -370
6073 -370 144 5 145 -132 -108 -17 -22 -211 -143 -83 -117 114 127 41 117 258 28 133 -47 -242 41 25 -202 122
6097 122 83 -228 -358 -25 -305 201 288 -69 54 -24 -42 -108 -73 -182 -27 37 -359 122 15 -91 -150 -313 168
6120 168 217 -403 11 212 -116 -197 -34 -95 -101 -441 -6 -22 -69 -54 -41 -91 184 140 229 -31 -62 290 -98 -342
6144 -342 -53 -75 -39 19 42 -113 -241 77 -115 0 129 178 -55 -65 -12 -198 112 -232 -27 247 -181 -25
6166 -25 -121 98 186 -232 227 295 70 311 -159 196 16 108 -311 -152 -116 347 -302 127 303 203 -10 -158
6188 -158 187 -239 -10 -79 -171 220 -87 -142 -131 124 -170 -146 191 -58 71 -127 -22 -17 15 -4 237 -201 29
6211 29 -259 -25 297 33 23 -82 -380 -78 -227 -81 7 8 99 -71 86 285 -418 73 71 -113 94 -50 47
6234 47 -56 -181 -46 134 189 -333 25 281 -285 -25 288 351 163 -86 95 -44 178 248 -34 370 -134
6255 -134 61 192 54 -99 148 60 -292 -42 245 -25 -154 -38 -267 44 -28 58 -317 241 -249 -52 -35
6276 -35 -208 92 324 -170 -130 -108 104 28 30 -132 -47 63 -37 -77 -47 -40 135 -88 -162 25 54 -143 211 149 -14
6301 -14 -173 24 -69 56 51 40 -32 138 237 1 -143 -9 -204 -31 -308 -232 110 61 -90 112 -111 -46 121
6324 121 -177 104 32 171 -189 -139 191 10 7 190 -235 52 -121 10 26 -50 -349 213 -256 155 156 -60 52
6347 52 35 60 361 54 -94 34 -47 117 140 45 -87 -82 -100 64 -212 281 -149 85 -21 23 -207 -224 -157 197
6371 197 128 182 387 88 49 260 -110 -319 62 -289 -197 -243 204 -193 61 -9 -49 -26 277 142 212 138 17
6394 17 -77 69 -25 -6 56 -229 91 28 187 31 2 162 104 -176 -56 -243 25 -100 44 183 -188 150 123
6417 123 -235 -263 -79 19 -149 -69 79 -29 -418 -190 -289 -392 160 291 -171 128 -200 -10 -26 8 73 -164
6439 -164 332 -83 -129 -183 -61 -143 -238 -176 133 -79 135 268 -65 294 -191 -266 60 288 -132 -86 -76 249 -95
6462 -95 48 277 -29 -22 35 -118 -161 -387 163 228 -12 -66 -17 -130 -219 -74 -160 -355 137 -203 -190 102 6 -308
6486 -308 -63 22 138 -351 -303 -125 83 -287 -153 -86 -301 23 -146 131 39 53 -70 66 -226 294 -133 -131
6508 -131 -56 -335 -73 79 72 -106 -264 130 -86 19 98 168 156 -67 -116 -64 141 -81 42 -177 -186 -341 261
6531 261 93 75 74 -67 -17 229 -2 16 6 181 106 279 -211 -19 -75 250 113 186 -248 297 83 90 62 -6
6555 -6 -134 30 85 -62 -100 -84 -90 43 50 -46 85 25 25 111 16 84 -164 352 16 116 -92 68 -69 41 17 152
6581 152 -112 -9 36 187 39 -106 -131 -38 192 -15 64 -84 -187 -229 -180 269 2 232 -60 143 -82 387
6603 387 4 222 -158 -137 -365 -16 -1 23 296 -18 -81 99 -340 37 -141 -306 122 -61 0 -262 -25 -144
6625 -144 51 87 -152 -31 136 -13 95 -11 -144 143 170 -5 -16 -96 194 23 -223 389 -392 -56 47
6646 47 143 -7 -88 -181 3 157 185 52 -293 286 207 75 -263 211 129 -182 -106 203 -33 -205 -43 -343 -197
6669 -197 171 338 -77 -273 221 -115 105 69 225 81 95 31 -71 -93 -130 -251 -89 3 -134 -136 -176 246 -24
6692 -24 104 106 -177 -149 17 203 -49 620 42 -157 35 -182 240 -25 -221 193 -49 -28 74 69 398 139
6714 139 -42 -4 185 86 96 258 66 -20 205 -34 87 -2 57 -131 76 -222 39 8 116 -213 -120 -26 -23 -242
6738 -242 -116 215 -209 -116 50 156 -38 -193 -136 -77 198 -28 -146 -217 -306 127 25 -239 -1 -4 -24 -91 331
6761 331 10 206 234 78 209 42 55 156 6 29 35 -93 -95 -261 48 -80 168 -299 -138 -51 -224 94 10
6784 10 204 51 -118 227 148 -119 62 -283 -131 -154 -210 -121 -138 25 98 -157 -15 2 -92 2 132 -39 246
6807 246 81 -12 294 13 -173 -86 19 54 -95 187 -179 127 -315 304 114 -102 -45 -220 56 -85 332
6828 332 -78 80 165 -63 -100 -107 -201 38 -48 143 9 154 -35 -230 -61 -186 -197 -124 -104 68 304 81 -48
6851 -48 315 23 -324 17 -73 -187 17 54 101 131 83 84 12 -19 -163 -94 178 -23 61 -45 131 -304 -239 -164 90
6876 90 -155 91 99 235 63 60 63 -162 24 -23 -215 -215 -6 140 -146 97 171 153 108 106 271 181 -223 8 -12 -49
6902 -49 -390 220 106 -2 -38 7 30 20 55 221 -173 -217 131 168 -188 -137 -317 358 104 -88 -113 299 54
6925 54 -120 31 -28 67 -48 86 -51 166 290 258 -47 130 102 -52 120 92 -25 185 -114 149 -157 65
6947 65 274 222 -230 82 255 -48 -304 -281 -90 261 100 125 82 109 -43 14 255 237 -27 29 27 106 -76 -174
6971 -174 -200 -87 -81 -115 376 123 -162 28 179 39 -352 129 -73 -170 -126 -47 -125 -350 -223 -84 129 -189 -94
6994 -94 101 238 -270 -475 140 3 -5 -100 -24 405 -400 -217 97 -55 281 -3 128 -188 -206 177 91 -196
7016 -196 25 318 120 14 37 -106 89 12 67 -319 136 31 -200 -353 -66 -218 165 -252 208 152 348
7037 348 -52 0 -93 -161 -78 -103 64 -188 93 -34 215 70 -40 -130 293 93 66 -124 -192 124 8 -166 118
7060 118 -40 -335 -288 276 250 10 488 -14 -72 -277 40 -155 -21 -77 24 163 27 -125 73 353 279 -113
7082 -113 -83 175 -50 386 13 -32 -7 211 100 28 128 -78 101 -36 8 328 73 75 -190 -1 -87 -81 -19 34
7106 34 179 -178 64 -85 -226 -6 -175 6 184 -176 181 2 95 -138 -166 273 -138 263 -31 5 -133
7127 -133 -61 -274 179 -7 -180 -163 277 257 170 26 -35 -33 31 -79 -175 214 105 68 164 253 -144 -113 144 -45
7151 -45 326 77 -161 -134 244 273 127 -118 -174 60 -131 -184 465 -116 57 -211 -61 -406 110 192 -408 113
7173 113 -99 -95 221 -11 -178 191 126 -97 346 -116 -297 92 27 53 -246 -257 101 -57 -104 387 316 -141 -46
7196 -46 17 112 237 144 -239 -12 -34 -142 -201 96 -165 126 136 -30 -159 -44 21 8 -47 -116 -31 -11 122 113 -437
7221 -437 -162 162 -177 301 446 211 -144 -170 203 -183 135 145 -185 -30 -47 -169 -156 387 198 -158 15
7242 15 76 -199 323 -202 258 -2 -193 -28 5 401 -167 -8 294 20 -214 -204 -125 73 -91 1 -95 1 -342
7265 -342 161 -163 36 -234 -52 -203 -417 416 324 -91 -411 190 -155 121 -257 -132 119 175 24 -92 -57
7286 -57 -116 -27 54 -210 -185 70 290 172 253 137 25 127 -122 -133 67 -280 -14 64 73 -115 174 -147 74
7309 74 21 68 257 172 246 110 -11 -6 177 -41 105 140 89 -38 52 -17 -90 64 -155 367 11 -41 -85 -17 275
7334 275 -94 86 121 63 -134 214 113 -53 -161 113 18 123 -190 158 -112 -9 -39 -209 246 229 -78 229
7356 229 -265 -70 -109 -44 -20 -182 223 167 216 -47 168 2 -21 -321 -142 -28 -31 176 -121 -111 67 -120 113
7379 113 1 47 -12 -88 111 208 -75 203 38 -16 30 -36 -102 -78 169 62 226 42 49 110 79 342 120 60 -154
7404 -154 348 114 75 5 -16 8 59 91 83 141 -117 -244 109 -15 258 -30 -244 -15 -204 -221 -255 28 52 -48
7428 -48 209 91 -23 58 -579 70 79 45 -148 -163 57 296 -10 -95 -170 103 -35 -89 -232 -168 -137 118 -166 -85
7452 -85 -239 75 -9 282 39 25 -67 -179 -73 184 -46 -146 210 112 -173 -19 159 203 -214 133 -194 -265
7474 -265 180 127 -232 -252 49 229 3 18 167 -149 -140 100 -101 210 320 36 98 206 95 166 16 54 -110
7497 -110 468 -201 -14 20 5 -321 -229 24 -14 -59 -114 -118 -194 19 120 317 174 -4 -122 108 -63 -142 -176 -102
7521 -102 -103 12 -198 -282 -295 -58 220 -107 102 174 -85 80 61 159 -141 -240 -63 -227 166 -240 228 -1 -143
7544 -143 -155 89 -258 -376 241 -16 141 115 73 266 -255 94 251 -44 -125 15 59 141 189 -128 -200 -205 -33
7567 -33 323 62 50 17 149 259 258 -129 277 -103 -415 -80 -258 -186 42 -110 -10 174 138 18 -72 6 36
7590 36 168 101 416 -95 15 -55 -453 125 163 136 75 8 -19 -45 -124 86 146 14 -197 -127 287 -23 -139 387
7614 387 72 274 93 -197 465 -101 -21 -199 -79 -20 9 -209 -162 -109 211 -140 -180 -179 -93 62 -119 -24 -287
7637 -287 144 420 -79 -217 -225 -234 -115 -157 73 75 7 138 -186 -125 97 127 185 82 -22 -154 128 -193 65 88
7661 88 40 -337 -51 110 -381 120 115 274 22 -98 263 -2 353 55 -219 61 -165 384 -119 300 -166
7682 -166 131 424 -247 95 155 -91 48 58 -194 -94 -207 149 168 16 -27 370 -68 232 204 -182 66 134
7704 134 22 -120 93 135 -216 -7 -117 -141 -2 88 224 -98 -140 182 79 97 -196 238 -84 -234 283 46
7726 46 -321 -16 93 -347 288 -67 -38 -264 185 -14 -63 189 180 125 -65 -213 57 -80 165 207 186 52 -206
7749 -206 80 -385 302 1 119 -106 -110 65 61 -150 -207 150 -2 293 -41 17 -154 -123 -524 172 273 -331
7771 -331 80 47 91 77 138 107 -47 237 -14 -243 232 -137 9 -149 -305 -341 30 -12 174 -7 174 123 5
7794 5 -162 -274 -18 80 -81 -65 -176 10 -6 121 57 -47 152 431 -89 7 -216 151 -147 143 -136 -155 -189
7817 -189 -221 -278 -163 -62 -389 -50 -31 122 106 11 -167 -106 -43 365 -84 -114 279 -155 79 -392 -301 -27 -154
7840 -154 -166 -232 -47 159 -463 208 -99 89 -17 124 -413 148 -117 -339 -82 -131 52 -177 -96 -105 -38 69
7862 69 -398 -72 138 93 257 -6 114 -1 123 -43 55 -92 108 174 -267 -37 183 345 28 -55 114 -241
7884 -241 320 44 35 15 -227 192 -174 -271 -163 142 -80 -248 -256 -44 119 -20 -71 -29 195 83 -56 -158 16
7907 16 -203 128 -150 -197 272 -28 -153 137 223 20 -359 102 -215 -134 242 26 -31 251 -104 32 309 203
7929 203 12 57 119 -81 21 121 101 91 -17 -246 -84 59 4 25 297 19 -196 118 -121 -44 192 -1
7951 -1 185 -4 -259 172 -5 -60 78 -50 81 -143 -80 129 129 262 -56 -119 -203 -82 -129 -116 -349 -114 -192 37
7975 37 143 103 19 42 -68 48 -146 -310 -7 169 -81 -199 -221 -422 -127 -57 50 68 -181 81 -276 -62
7997 -62 62 118 -18 446 -199 48 33 -77 -171 -39 282 41 -101 -345 -161 -76 198 -184 -182 218 189 -113 -187
8020 -187 70 -9 21 14 -152 340 72 203 -249 -113 -2 269 138 341 7 -43 105 -75 353 49 -14 12
8042 12 249 -50 -295 -195 65 324 103 -64 -154 -36 -118 -21 299 -70 -21 361 -40 -184 159 11 81 -235
8064 -235 358 -205 35 108 -88 185 -27 -360 20 -77 -220 136 -200 -156 -1 319 -50 -314 -14 -208 -145
8085 -145 -119 119 -120 91 -191 -4 33 -104 5 125 68 -103 89 -179 -150 173 126 127 -239 129 -201 145
8107 145 161 -86 151 -33 114 410 416 123 259 -290 -139 9 -252 86 162 65 -101 -14 -64 7 293 70 -91
8130 -91 222 74 -220 136 -140 136 277 -90 34 -231 -76 52 321 -25 -167 101 103 -359 135 -292 -170
8151 -170 246 -40 -203 -138 51 -401 176 -65 -213 -11 -99 394 15 109 133 63 219 161 427 -160 168 28
8173 28 -12 99 202 -19 146 15 -163 286 -131 161 36 -155 -138 25 -165 -356 -5 208
8191B08
##END NTUPLES=NMR FID
##END=
