##TITLE=1H_DE-76H_2_PH9
 D2O
 8 sc, 
 13.1.2025
##JCAMPDX= 6.0         $$ Bruker NMR JCAMP-DX V2.0
##DATA TYPE= NMR FID
##DATA CLASS= NTUPLES
##ORIGIN= UXNMR, Bruker Analytische Messtechnik GmbH
##OWNER= root
$$ XWIN-NMR		Version 3.5
$$ Mon Jan 13 14:44:15 2025 Russian Standard Time (UT+4h)  she@DPX200
##.OBSERVE FREQUENCY= 200.1315
##.OBSERVE NUCLEUS= ^1H
##.DELAY= (6, 6)
##.ACQUISITION MODE= SIMULTANEOUS
##.ACQUISITION SCHEME= undefined
##.AVERAGES= 8
##.DIGITISER RES= 18
##SPECTROMETER/DATA SYSTEM= spect
##.PULSE SEQUENCE= zg30
##.SOLVENT NAME= CDCl3
##.SHIFT REFERENCE= (INTERNAL, CDCl3, 0, 15.7039)
##AUDIT TRAIL= $$ (NUMBER, WHEN, WHO, WHERE, WHAT)
$$ ##TITLE= Audit trail, XWIN-NMR		Version 3.5
$$ ##JCAMPDX= 5.01
$$ ##ORIGIN= Bruker BioSpin GmbH
$$ ##OWNER= she
$$ F:/spectra/data/she/nmr/H-F/1/audita.txt
$$ ##AUDIT TRAIL=  $$ (NUMBER, WHEN, WHO, WHERE, WHAT)
(   1,<2025-01-13 14:42:43.65 +0400>,<she>,<DPX200>,
      <created by zg, POWCHK disabled, PULCHK disabled
       configuration hash MD5:
       00 E9 B6 7A A2 85 ED C7 34 08 36 98 17 FE 4E 26
       data hash MD5: 16K
       EC 27 C9 BF 4A C2 0B 1E 67 79 EC 7B 42 00 34 50>)
$$ ##END=
$$ 
$$ hash MD5
$$ 6D 8A DD AC 22 A5 74 02 88 9E 3C B1 4D 91 A2 F0
##$RELAX= 
##$RELAX= 
##$RELAX= 
##$RELAX= 
##$RELAX= 
##$RELAX= 
$$ Bruker specific parameters
$$ --------------------------
##$DU= <F:/spectra>
##$EXPNO= 1
##$NAME= <H-F>
##$PROCNO= 1
##$TYPE= <nmr>
##$USER= <she>
##$AMP= (0..31)
100 100 100 100 100 100 100 100 100 100 100 100 100 100 100 100 100 100 
100 100 100 100 100 100 100 100 100 100 100 100 100 100 
##$AQSEQ= 0
##$AQ_mod= 1
##$AUNM= <au_zg>
##$AUTOPOS= <>
##$BF1= 200.13
##$BF2= 200.13
##$BF3= 200.13
##$BF4= 200.13
##$BF5= 200.13
##$BF6= 200.13
##$BF7= 200.13
##$BF8= 200.13
##$BYTORDA= 1
##$CFDGTYP= 0
##$CFRGTYP= 5
##$CHEMSTR= <none>
##$CNST= (0..31)
1 1 145 1 1 1 1 1 1 1 1 1 1 1 1 1 1 1 1 1 1 1 1 1 1 1 1 1 1 1 1 1 
##$CPDPRG= <>
##$CPDPRG1= <>
##$CPDPRG2= <>
##$CPDPRG3= <>
##$CPDPRG4= <mlev>
##$CPDPRG5= <mlev>
##$CPDPRG6= <mlev>
##$CPDPRG7= <mlev>
##$CPDPRG8= <mlev>
##$CPDPRGB= <>
##$CPDPRGT= <>
##$D= (0..31)
0 1.2 0 0 0 0 0 0 0 0.06 0 0.03 0 0 0 0 0.0002 0 0 0 0 0 0 0 0 0 0 0 0 
0 0 0 
##$DATE= 1736764963
##$DBL= (0..7)
120 120 120 120 120 120 120 120 
##$DBP= (0..7)
150 150 150 150 150 150 150 150 
##$DBP07= 0
##$DBPNAM0= <>
##$DBPNAM1= <>
##$DBPNAM2= <>
##$DBPNAM3= <>
##$DBPNAM4= <>
##$DBPNAM5= <>
##$DBPNAM6= <>
##$DBPNAM7= <>
##$DBPOAL= (0..7)
0.5 0.5 0.5 0.5 0.5 0.5 0.5 0.5 
##$DBPOFFS= (0..7)
0 0 0 0 0 0 0 0 
##$DE= 6
##$DECBNUC= <off>
##$DECIM= 24
##$DECNUC= <off>
##$DECSTAT= 4
##$DIGMOD= 1
##$DIGTYP= 9
##$DL= (0..7)
0 120 120 120 120 120 120 120 
##$DP= (0..7)
150 150 150 150 150 150 150 150 
##$DP07= 0
##$DPNAME0= <>
##$DPNAME1= <>
##$DPNAME2= <>
##$DPNAME3= <>
##$DPNAME4= <>
##$DPNAME5= <>
##$DPNAME6= <>
##$DPNAME7= <>
##$DPOAL= (0..7)
0.5 0.5 0.5 0.5 0.5 0.5 0.5 0.5 
##$DPOFFS= (0..7)
0 0 0 0 0 0 0 0 
##$DQDMODE= 0
##$DR= 18
##$DS= 0
##$DSLIST= <SSSSSSSSSSSSSSS>
$$ [...]
##$SUBNAM2= <"">
##$SUBNAM3= <"">
##$SUBNAM4= <"">
##$SUBNAM5= <"">
##$SUBNAM6= <"">
##$SUBNAM7= <"">
##$SUBNAM8= <"">
##$SUBNAM9= <"">
##$SW= 24.0689530833862
##$SWIBOX= (0..15)
0 0 2 0 0 0 0 0 0 0 0 0 0 0 0 0 
##$SW_h= 4816.95568400771
##$TD= 16384
##$TD0= 1
##$TE= 0
##$TE2= 300
##$TE3= 300
##$TEG= 300
##$TL= (0..7)
0 120 120 120 120 120 120 120 
##$TP= (0..7)
150 150 150 150 150 150 150 150 
##$TP07= 0
##$TPNAME0= <>
##$TPNAME1= <>
##$TPNAME2= <>
##$TPNAME3= <>
##$TPNAME4= <>
##$TPNAME5= <>
##$TPNAME6= <>
##$TPNAME7= <>
##$TPOAL= (0..7)
0.5 0.5 0.5 0.5 0.5 0.5 0.5 0.5 
##$TPOFFS= (0..7)
0 0 0 0 0 0 0 0 
##$TUNHIN= 0
##$TUNHOUT= 0
##$TUNXOUT= 0
##$USERA1= <user>
##$USERA2= <user>
##$USERA3= <user>
##$USERA4= <user>
##$USERA5= <user>
##$V9= 5
##$VALIST= <valist>
##$VCLIST= <CCCCCCCCCCCCCCC>
##$VD= 0
##$VDLIST= <DDDDDDDDDDDDDDD>
##$VPLIST= <PPPPPPPPPPPPPPP>
##$VTLIST= <TTTTTTTTTTTTTTT>
##$WBST= 1024
##$WBSW= 4
##$XGAIN= (0..3)
0 0 0 0 
##$XL= 0
##$YL= 0
##$YMAX_a= 852916
##$YMIN_a= -968202
##$ZGOPTNS= <>
##$ZL1= 120
##$ZL2= 120
##$ZL3= 120
##$ZL4= 120
##$ABSF1= 10
##$ABSF2= 0
##$ABSG= 5
##$ABSL= 3
##$ALPHA= 0
##$AQORDER= 0
##$ASSFAC= 0
##$ASSFACI= 0
##$ASSFACX= 0
##$ASSWID= 0
##$AUNMP= <proc_1d>
##$AZFE= 0.1
##$AZFW= 0.1
##$BCFW= 1
##$BC_mod= 2
##$BYTORDP= 1
##$COROFFS= 0
##$CY= 11.3945322036743
##$DATMOD= 1
##$DC= 2
##$DFILT= <>
##$DTYPP= 0
##$F1P= 15.6554695791079
##$F2P= 12.8336369535428
##$FCOR= 0.5
##$FTSIZE= 0
##$FT_mod= 4
##$GAMMA= 1
##$GB= 0.15
##$INTBC= 1
##$INTSCL= 1
##$ISEN= 128
##$LB= 0.24
##$LEV0= 0
##$LPBIN= 0
##$MAXI= 10000
##$MC2= 0
##$MEAN= 0
##$ME_mod= 0
##$MI= 1.114404
##$NCOEF= 0
##$NC_proc= 0
##$NLEV= 6
##$NOISF1= 3.799351
##$NOISF2= 2.8
##$NSP= 1
##$NTH_PI= 0
##$NZP= 0
##$OFFSET= 15.70392
##$PC= 1
##$PHC0= -26569.52
##$PHC1= 5.387441
##$PH_mod= 1
##$PKNL= yes
##$PPARMOD= 0
##$PSCAL= 0
##$PSIGN= 0
##$REVERSE= no
##$SF= 200.130013532006
##$SI= 16384
##$SIGF1= 3
##$SIGF2= 2
##$SINO= 400
##$SIOLD= 16384
##$SREGLST= <1H.CDCl3>
##$SSB= 0
##$STSI= 0
##$STSR= 0
##$SW_p= 3612.71676300578
##$SYMM= 0
##$S_DEV= 0
##$TDeff= 0
##$TDoff= 0
##$TI= <>
##$TILT= no
##$TM1= 0
##$TM2= 0
##$TOPLEV= 0
##$USERP1= <user>
##$USERP2= <user>
##$USERP3= <user>
##$USERP4= <user>
##$USERP5= <user>
##$WDW= 1
##$XDIM= 8192
##$YMAX_p= 0
##$YMIN_p= 0
$$ End of Bruker specific parameters
$$ ---------------------------------
##NTUPLES= NMR FID
##VAR_NAME=  TIME,          FID/REAL,        FID/IMAG
##SYMBOL=    X,             R,               I
##VAR_TYPE=  INDEPENDENT,   DEPENDENT,       DEPENDENT
##VAR_FORM=  AFFN,          ASDF,            ASDF
##VAR_DIM=   8192,          8192,            8192
##UNITS=     SECONDS,       ARBITRARY UNITS, ARBITRARY UNITS
##FACTOR=    0.0002076,     1,               1
##FIRST=     0,             0,               0
##LAST=      1.7004516,     0,               0
##MIN=       0,             -968202,         0
##MAX=       1.7004516,     852916,          0
$$ Real data points
##PAGE= N=1
##DATA TABLE= (X++(R..R)), XYDATA
$$ [...]
1894B3l86K68J99m9k03J39k72L64J22l12L49k99p1M34o08M5J84K40J4%n98O08
1916A91j08l3K7j02J8Q2o9L33m34o7L43n11M59n49L66j03O24m18M5m93M98L26
1938D25l00n2o6J6o4J14j47k0p2N03m79N3KL36j28R3k04L43k01l33L80J36k94
1961D1oK9l3N2L04l08J40l17o6J64l11K58Kk7L7n2J99L9j03K74o09K18J25n9%
1986ij02nK75j38Q4k38K49k62K35j2k96M03j16j94L04Nj30k13L28J34m4l72K78
2009A64j00l02N4J11J08K99k71M3j46P7j96L31m03L31M1l09K48l68K08Q6k33L78
2031A51l14K48N0l14L41o03L82K17o5j93p9L30k26Q6Q5jM5o4j88K68j15j64L35
2054B12j68l79M24o0o0j21J25J35j35R2k30PM59m48P7J07n0Jn9O4l4m19M74J30
$$ plain form
1894 23 -363 -95 104 55 -148 -9 -281 83 205 -107 242 -57 -128 306 -302 -257 -73 167 181 181 -417 191
1916 191 83 50 77 -25 -7 75 6 339 -95 -162 181 -330 129 -420 -54 -157 467 49 94 -399 99 425
1938 425 125 73 7 23 -41 73 -74 -94 -166 337 -142 -89 -87 249 121 214 10 353 152 -181 199 335 41
1961 41 35 64 31 83 387 79 219 -98 -164 0 -311 -53 -51 -78 -41 -93 106 145 42 316 -293 -75 50 -9 -9
1986 -9 -111 -116 159 21 105 -133 116 -146 89 77 -219 184 68 -126 178 183 53 -160 168 302 258 -114 164
2009 164 64 -238 -184 -73 35 334 63 106 -40 37 -159 172 -231 100 141 -168 80 -288 -80 6 -227 151
2031 151 -163 85 135 -179 162 -441 -59 158 93 -100 -179 151 -75 11 96 95 140 76 -112 156 41 -123 212
2054 212 44 -335 89 29 -31 -152 -27 108 -27 65 -165 -158 301 -147 -70 37 -13 -12 -71 -7 -41 -460 14 144
2078A44j27l1j85L18k46J32j32r2m1J8M28k08l18N15m27K48j44L08k66K8j80K10
2100d8ol3j38L19k4k91K39r0J14J4m46K06l3L74p1j15N9L95k79m5Q3L8k51l6J47
2125H2p9K15k49QmJ63o7lL2k90J30Q8j54M2L12j61J09o6j18L18j83l35L52K75
2149D17l64m1j21L10k05O8J81j95K5J72k96k6K4P0j5l40L88K60n7j8l40J55j44
2172i2J80R0j82P9j21J20l54L36k65L15Op6K98k57o2k58N1R3k33M50n9k4k3j33
2196a21J83j58R5j13M52m58J48o3N8L2j09L13j33J35k17m9k57M85j90k08K06K93
2218C24l27J34l7j01J31k83K95J8j71Q8j11j78K92r3p8k03K17o5Q4J37Q8l44J17
2241f6J9Q8j29J98l08L52j43k02J55K36o6j03k47L58k96K5N2J60k56L89j43J14
$$ plain form
2078 144 17 -14 -199 119 -127 5 -127 -219 -260 -242 186 -22 -340 175 -252 -4 -148 160 -106 -78 -258 -48
2100 -48 -54 -87 -225 94 70 -221 18 -72 42 56 -390 -184 -217 157 86 -29 30 425 146 101 184 222 -29 -65 82
2125 82 3 218 -31 -23 -27 136 69 66 98 -192 -62 26 -128 -86 226 65 174 108 -10 308 125 -210 142 417
2149 417 53 12 -109 201 -4 64 245 50 75 247 -49 -75 -51 19 4 -336 52 312 255 237 -103 52 -92
2172 -92 88 178 -4 75 -46 74 -280 56 -209 106 112 36 334 77 15 -243 -192 -99 -332 118 59 35 12 -121
2196 -121 62 -96 -1 -114 338 -120 28 -35 23 55 -54 259 126 261 44 -5 -262 223 33 -175 31 324
2218 324 -3 131 94 -7 124 -159 136 154 -17 71 -40 -218 74 -19 -97 -300 -83 -148 -64 73 161 -183 -66
2241 -66 -47 41 -88 110 -198 154 11 -191 -36 200 134 31 -216 142 -154 -129 -77 83 -173 216 73 187
2263A87m8k34r3j30L20K30q7j14k14j80M88j50o0q9L76k98K57j48p4J88j00L37
2285C64m33J85j90K50j9j92jk23J95Kq3K93j49j40J36p2J47J58l83J87j03K6Q4
2308C9L13j51k93JN7J45l65M07j07j36k28P0J66J66k39L73k30k23K35k3K05l53
2330a71O7P0q2j01M14K9j65l3l6j69J36K09l6j94o6Q2L38k34j20L58m18J36R7
2353A11l03J76k60J59o8K22k64K7J68n1J85j01J15l1J94n8k71J58p2j36P9l6O
2376e1L9K1r1J35n6J04k43K00m22N8M85k79j6L2NK53p6J01m94N19j06o7j60M28
2400C19l83j55N1oR6j26J84p3PJ84M6j64l6K6J08l06L79j59j37K55q9M7l47L37
2424E8N3o8j82J15l9j44M39o9j68k2J35p2K76m26K65j82Qj39L36m0k5J3j51j0
$$ plain form
2263 187 139 -95 -188 -318 2 232 145 31 -183 -363 125 -25 -85 -174 202 -96 161 13 -61 127 27 364
2285 364 -69 116 -74 176 157 -35 -36 -259 -64 -62 -145 148 -1 -141 -5 -77 70 228 -155 32 -71 -45 39
2308 39 352 201 -92 -91 -34 111 -254 153 46 -90 -318 -248 -82 84 -155 218 -12 -235 0 -23 182 -171
2330 -171 -104 -34 -116 -217 197 226 61 28 -8 -177 -41 168 132 -62 -128 -46 292 58 -62 296 -122 14 111
2353 111 -192 -16 -276 -117 -185 37 -227 -200 -32 -83 102 1 116 85 279 221 -50 108 36 -100 -21 -57 -51
2376 -51 -12 9 -82 53 -3 101 -142 58 -364 -306 179 -100 -116 -84 -79 174 98 199 -295 224 118 51 -109 319
2400 319 -64 -219 -168 -174 -78 -204 -20 -93 -86 98 144 -20 -56 -30 78 -228 151 -8 -145 110 21 68 -279 58
2424 58 111 43 -139 -24 -63 -207 232 163 -5 -27 108 36 312 -114 151 -31 -23 -162 174 134 109 122 -29 -39
2448c9np1J36n0j05L1o9L6K76k55P9J45J84k76Rj84O2k2Q4k35R5K33j09P7R6j62
2474c9J94l52K48P8j58j64K61j43j4J12j22J98k28J65k31K12JJ74M6j41l97N03
2496B03k19J04k96K57j30K23k45K01J38m03M37l80J4K83l07L4J25Q1l28J43p3
2517a38L30k75J67j01r1N64m47Q2j60j14J37N7r6o0K58j34J07p7n0J66j07J34
2539A52j03k36K67K11l54m21J93L55K70m89J66k79M71j40k00J97j36K14r4J21
2559A65j69j19J33J48l22p9L11r6j71O0o0L53k29m41N39K47k73N8j4K5M9k28m
2582a17K25n55L25m47O23J0l33L82O2m10K67j58J68L51m57M9l7J64M9k88K80K21
2604C74l70j85J14J94Q3o8l18j50J95L43o9j71K62M1n48O66j64k74R8K4l32P0
$$ plain form
2448 -39 -44 -115 21 -29 -134 -103 -172 -136 140 -115 -36 109 293 17 26 -158 -96 -118 -34 -269 -174 59 -50 27 123 -39
2474 -39 155 -197 51 129 -29 -193 68 -75 -89 23 -99 99 -129 36 -195 17 18 192 238 97 -300 203
2496 203 -16 88 -208 49 -81 142 -103 98 236 -167 270 -110 -96 187 -120 -86 39 120 -208 -65 -138
2517 -138 192 -83 84 -17 -108 456 9 91 -69 -183 -46 11 -85 -145 113 -21 86 9 -41 125 18 152
2539 152 49 -187 80 291 -63 -484 -291 64 334 -155 11 -268 203 63 -137 60 -76 138 44 165
2559 165 -4 -123 10 158 -164 -243 68 -28 -199 -139 -199 154 -75 -516 23 270 -3 55 41 66 115 -113 -117
2582 -117 108 -447 -122 -569 54 64 -269 113 175 -235 32 -126 42 393 -64 -15 -52 112 161 -127 153 374
2604 374 4 -181 -67 127 210 142 -176 -326 -131 212 143 -28 234 275 -273 393 229 -45 53 77 -255 -185
2626a85M12k22k16J33l6K18l39L16O5l28J04j08J64J03j21QJ85J19l79q1J63j44
2648a69K64P3l33R7O8K48r0r5l3l2j07N0M4J20K03l90K26Pj90l39P22l10j26j01
2672a93L45j69J82k05j36O22n37K60k21J06o2O4J43k99K50j38j82N47n34K32J34
2693B09on6k86J01L57j68j1p2k35L2K90k56M2M3N6j36J39k30L51j99Q0K11m86
2716b30J11L44ql59L2K74m76J94J11O1q5m3N4O3J87k37K77K80q98M85j09J6P9
2739A23j63J37n5J76j31j65k1N4K10j70K70k17o5QK65%l08m8O0qj11J43j44K12
2763E2N3j66O7M54n74L26m04K75j50J49J48l17L79m15J22K95j78r6m5j96M13j73
2785A9k7m8j66o0K24j29K26J39j96q8L39n9r6pj8q1O0p9J49J54m99K37k34K89
$$ plain form
2626 -185 227 5 -211 -78 -114 104 -235 81 146 -182 -78 -186 -22 81 -40 -32 153 272 -107 -188 -25 -169
2648 -169 95 168 -165 -68 0 248 158 63 30 -2 -109 -59 -15 105 308 -82 144 151 -39 -378 344 34 -92 -193
2672 -193 152 -17 165 -40 -176 446 -91 169 -52 54 -8 56 199 -100 150 12 -170 377 -157 75 209
2693 209 203 147 -139 -38 319 151 140 68 -167 -135 155 -101 -59 -16 40 -96 43 -187 164 -35 45 256 -230
2716 -230 -119 225 217 -142 -110 164 -312 -118 -7 54 -31 -74 -20 43 230 -7 270 550 -348 137 28 44 123
2739 123 -40 97 42 218 87 -78 -99 -45 165 -5 265 48 -17 -9 256 256 -52 -100 -40 -48 -159 -16 -160 52
2763 52 105 -61 6 460 -114 212 -192 83 -67 82 230 -87 292 -123 -1 294 116 20 -25 -221 192 19
2785 19 -8 -56 -222 -282 -58 -187 39 178 -18 -106 233 174 78 71 53 -28 32 -47 102 256 -243 -6 -240 49
2809D9m2l03J54l6O9M3j70L19J78l99j02J70j25R6J69n7k8J29o5R3j62j85M84
2832B79m64N88m73j8j40l2J15Q6J75k98K56O0L27n43kK13m4k44p9K16J83n1N6
2855A66k95j11K51j24k67J49R2J47n1R2Q9Q3j2J4l34j81j2L47j14k72k0M43L59
2878D39n35J00n8J95n4K3k76L73j92j21J97j96j10Nk17M86j92M6q7J73n9O2n0
2901d8k77M56P5l69P7L7j96M59k79L10j78j10J44J50k41J50j5k39K1p1J45j71
2923a70L44j42j00J88k51p8K8o9M81l02L5n12M26R3J02K31m90J23p6MK57jm05
2946b84M43p5l91N82m02J60k72J77m8J23n0O0P6k55M09k94k17L66j18J28k63K40
2968I5r1J41om5R0j02n5M5J48l79J79L1k26L45J71m84O2j40P1Q3j19L16k37j24
$$ plain form
2809 49 7 -296 -142 -178 -109 -66 -236 83 261 -138 -240 -70 -195 -99 70 13 -15 114 49 142 -20 -205 279
2832 279 -185 403 -70 -88 -228 -260 -145 -59 116 -182 74 134 461 -82 -84 129 85 -159 -238 -22 161 110 166
2855 166 -129 -240 11 -113 -380 -231 -139 8 -43 49 138 221 209 223 -111 -292 -304 43 -71 -343 -363 80 439
2878 439 -96 4 -54 141 87 110 -166 207 15 -106 91 -105 -215 -210 -427 59 -133 -87 -174 -1 -60 2 -48
2901 -48 -325 131 206 -163 -86 -49 -245 214 -65 245 67 -43 101 251 10 160 145 -94 -73 -144 1 -170
2923 -170 174 32 -68 120 -131 -209 -181 -250 231 -71 -36 -548 -122 -29 73 304 -186 -63 -139 -135 122 121 -284
2946 -284 159 84 -307 275 -127 33 -239 -62 -110 13 -37 23 99 -156 253 -41 -258 108 -10 118 -145 95
2968 95 4 145 139 94 184 82 27 72 220 -159 20 51 -175 170 341 -143 -81 -221 -150 -67 -186 130 -107 -231
2992b31K63J18j64Qk99L78j91K01j7k58L6J06K46k57R1q2j02J85q4oJ3K36p5k93
3016a78N02l00o7K43m21L67k33K01p4k1Lj01N3L5m5j39J63O0j33R6l19J49R1J26
3040E8l8k31J91L5j55J23K9m2k4l74M03q7K60K68j99o9k82J92rM7l75M05K96m04
3064A8p9j06N20m62K23Q0J41m06L32j52j44K34k8k81J71O9k55J11j83L80j7o2
3086A04j21J61J00n9k37j26M16j71j57j13J56J59J32k15l74Q34m53j23N33o44
3106a98K13M0N2j80l0R9J16k6J01n5k09L0L23l03q5L51l95R1K11n5j02r2l5Lr3
3131b28m7L50j59k2j59J80M7j03N9J11r3K2J46k41Q9j6k2l5L79m76L06j12j76
3154b00N9k8K67p1K13pl11l6O8J99J5k62M04m49K97kJ3J4k42L00m34J77q0L6L55
$$ plain form
2992 -231 32 150 -14 -6 -305 73 -118 83 66 -192 -156 -50 196 -61 30 -52 -154 31 -53 -59 -46 190 115 -178
3016 -178 324 24 -43 200 -221 146 -87 114 40 19 22 -79 -26 9 -36 -175 -12 48 -85 11 -308 -159 -68 58
3040 58 20 -211 -20 15 -140 -17 12 -30 -54 -428 -25 -112 148 416 217 148 -134 58 49 96 -279 126 422 18
3064 18 -61 -167 353 -109 114 194 335 -71 261 109 -35 199 171 -110 61 130 -125 -14 -197 183 166 104
3086 104 -17 144 244 185 -52 -178 238 67 -90 -203 -47 112 244 29 -345 489 36 -87 446 -198
3106 -198 15 55 107 -73 -103 -4 112 86 187 132 -77 -47 276 -27 -112 239 -156 -65 146 91 -11 -103 -138 -135 -228
3131 -228 -275 75 -84 -106 -265 -85 -38 -141 -82 29 -64 -42 104 -137 -48 -64 -86 -121 258 -218 88 -24 -200
3154 -200 -141 -169 98 27 240 233 -78 -114 -46 153 168 -94 310 -139 158 156 169 183 -59 241 -193 -16 -96 -60 295
3179B95k24k27J57Q4l74J72K49j16J38k4j66MJ05k95N5p1K71m1K79l64K89N0k12
3202C4K39n56L54k87m7M47l41M05m1m28J13R1n8j07%L16M4k45K49j30qqr0J13
3226E9P2j10j47r6K75j38K01mj78R9n7L8J52K8R2l65p2J07l2O0k20K98k61Q3J0
3251a06L81m10M78m76M8J75j70K9k04K88Q9j85J36k9J78k28K13l21j4L51j67k35
3273a79q4M71l61P8r2J32qJ32K92m53N7m7O6j87J51O3o1k57K29J85o5J51l85O6
3297a06R0%p4R5J5l0J5Oj73L61j50L77n10K20l4n9M1J68k49j22j14L38j41P3p4
3322c7k04L62j06K26l33K90k91l36K85J42K40l3j91Kj70m3N14k62k20K19k25K08
3344C7k1J55j74J74l17L46k6j30j44J82O8k23J64J13k62m8L57R0j68j35J18k66
$$ plain form
3179 295 71 -156 1 85 -289 -117 132 16 154 130 -36 -32 73 -222 -167 -238 33 -8 271 -93 196 246 34
3202 34 273 -283 71 -216 -263 184 -157 248 207 -221 -108 -17 -75 -182 -182 134 178 -67 182 52 44 36 -54 59
3226 59 131 21 -126 -222 53 -85 116 112 -66 33 -24 14 166 194 286 -79 -151 -44 -76 -16 -236 62 -199 -116 -106
3251 -106 275 -135 343 -133 -85 90 -80 -51 -255 33 122 -63 73 44 222 -6 207 -114 -128 223 56 -179
3273 -179 -263 208 -153 -75 -167 -35 -43 89 381 -72 -15 -62 4 -183 -32 31 -30 -287 -58 127 62 213 -172 -106
3297 -106 -16 -16 -90 5 20 -10 5 11 -162 199 49 426 -84 136 102 43 84 252 3 -119 -233 105 -36 37 -37
3322 -37 -241 121 15 241 -92 198 -93 -429 -144 -2 238 205 14 16 -154 -197 317 55 -165 54 -171 37
3344 37 16 171 -3 171 -146 200 174 44 -100 82 150 -73 91 204 -58 -106 251 341 173 38 156 -110
3366a10P5j56M05j80QL9K2k62J64R4p4k4j18J82k20P1Q9J69q7k17J81p5j3l69
3390d06M00J40k15m9j6o4K35j59L67j31j29j19q6L79Q4j95K45m87L14j29q2J39
3412C6O1J20m28K16j32R4L5o6J55l2j32J97j84L5o8J16Q0m12J18K09L5p6KJ3n6
3437f4k47J96L75m19j10J74j71J99r0M8j01N47l25R4Nj41j76K89j09j03K75J5
3459A61j61J5K4LR5l15K15l6O3m3k31M53K19k08p1j37j13k6k1L9M13l4k93J19
3483A30k10r8K20O8j56k81J98Q9L26l93K1J94R7j10j15K38k50J34k54J12n9m8
3505a47K64l8n44N33k41p7P49l67p0j93J95L88m67q8R5j84J05k6O9M6J29k91L46
3528A86k65M48l93m6J05J49j15j46J7N7l8J25R4j55k52J79j92j04N07m6j67K4
$$ plain form
3366 -110 -35 -191 214 34 42 81 103 -159 5 99 25 1 -117 65 -155 -84 5 174 87 -130 51 -24 -37 -406
3390 -406 -6 134 -81 -130 -146 -210 25 -134 233 102 -27 -146 -232 147 231 36 281 -206 108 -21 -103 36
3412 36 97 217 -211 5 -127 -33 2 -64 91 59 -73 124 -60 -25 -93 23 103 -309 -191 18 53 -23 -21 -8 -64
3437 -64 -311 -115 260 -159 -269 -95 -266 -67 -157 -109 -210 337 12 106 111 -30 -206 83 -26 -129 146 161
3459 161 0 15 39 42 137 -178 37 1 64 21 -210 243 462 254 183 46 -67 -93 -114 -75 338 304 11 130
3483 130 -80 -178 42 110 -46 -327 -129 -40 286 -107 -86 108 205 95 -20 218 -32 102 -152 -40 -99 -147
3505 -147 117 79 -465 68 -173 -250 499 132 62 -131 64 452 -15 -103 -8 -192 -87 -113 -44 2 131 -160 186
3528 186 -79 369 -24 -70 35 184 69 -77 -60 -3 -41 84 178 23 -229 -50 -242 -346 161 115 -52 -28
3550b8o8K17r7P6O5k26r0M9K20r4K21j38p8J04m3Mj60J29j66J25N7rj58R8J92
3575B02j97J83k12J48J01j16Jk0j49m9K98j10P8k19J99q8l30J61OK01k8j91mJ71
3599C6j15J47J85l36k7k89P42l31k39J68k32M98j31p3Q4J3m5j59O5q2J11J23k76
3622a63R5N0P4j62R9K21k36o6O8k6J80m16N40k43J43j46p6J36J3N8k22K37R8q3
3646A73j82K99l04l61K71J3J02K55l26K01j87J2q0j5K35l02M99o19P8K81j06L4
3668b9j3J14J4m0K4k26L47j88J17k86M09m08N0M34k10R4l7L1N8l91L18j76l8P7
3692D5j18J5K6j19K8K34j30j61K69r2M3m80M71m6l2M6N03n30K13m52N2J53N3K5
3716A6J73J9l18M34k70NJ46J05m99J51j18J60J19l04J95J16k18K18k90R0J12K11
$$ plain form
3550 -28 -96 121 24 100 165 -61 -151 -102 118 24 245 107 29 133 90 94 -66 63 -103 22 79 70 -88 10 202
3575 202 5 188 -24 124 225 109 110 90 -59 -108 190 80 158 -61 138 50 -280 -119 -113 88 60 -131 -135 36
3599 36 -79 68 253 -83 -110 -399 343 12 -227 -59 -291 207 76 3 87 100 55 -104 -39 -121 -10 113 -163
3622 -163 -68 -18 56 -106 -7 214 -22 -88 -20 -46 134 -282 258 15 158 12 -64 72 85 143 -79 158 256 173
3646 173 -9 290 -14 -375 -104 -91 11 266 -60 141 -46 -34 -114 -129 106 -196 303 -316 -238 43 -63 -29
3668 -29 -42 72 86 46 70 -156 191 3 120 -166 243 -165 -115 319 109 203 166 197 255 -136 182 6 -32 45
3692 45 -73 -58 -32 -151 -123 111 -19 -180 89 -3 40 -440 31 -15 -47 -1 502 -28 185 -267 -215 -62 -9 16
3716 16 189 208 -110 324 54 59 205 310 -189 -38 -156 4 123 -181 14 130 -88 130 -160 -70 42 253
3738B53m50J47pK79r6j67J29r2J52l58L11J47m99M51m6j27k34J4K38N6k53j9Q5
3761h6J97q7j40J11J56j18l77N25j56l6m7K33m06M59k21J36l11J24P2J25J55k72
3783C6m19L41N1J13r9j33L03k93J50M2K5j4M2r8l35K70j65j5K06j61m5J76K97
3806B75j24j35N0k41K63j07m2J20p0l7j9K84J12l55l4J47ql38L23k12J06QJ36
3829A02Q9l41J30K27j01r9n4K19j27j56r8M36j00k21J88OK9Lj56R6R1lj45k58
3853b43J36p3J08J57m7J4k2k4n7l5k09O32k64j54j2P3J10J98n9p8Q3k05q6j65
3877b22J74o3K77j19P3j04k05J36K00Pj1n6o5j05oK60n07J56n7N8J36j05K01O0
3901A13l9j85O2n9J79j7r4Q2O0J91n32r7M01j45K02L02n61L64k01K5K17m10j23
$$ plain form
3738 253 -197 -50 -57 222 126 -41 88 -4 148 -210 101 248 -251 200 154 27 -207 -193 45 101 -152 -171 -86
3761 -86 111 24 -116 -5 151 33 -344 181 25 -11 -58 175 -231 228 7 143 -168 -44 28 153 308 36
3783 36 -383 -42 9 122 23 -110 193 -100 50 92 117 103 145 47 -288 -18 -183 -198 8 -153 -198 -22 275
3806 275 151 16 66 -175 88 -19 -61 59 -11 -48 -67 217 329 -26 -60 87 79 -259 64 -148 -42 -34 102
3829 102 191 -150 -20 207 106 7 -47 172 45 -111 -209 227 127 -94 94 100 129 132 -24 72 163 160 15 -243
3853 -243 -107 -180 -72 85 38 52 30 6 -51 -86 -295 337 73 -81 -93 -20 90 288 229 151 234 29 -57 -222
3877 -222 -48 -111 166 47 120 16 -189 -53 147 154 143 87 22 -83 -89 171 -336 -180 -237 -179 -43 -148 53 113
3901 113 74 -111 -49 -108 71 54 -40 42 102 293 -239 -336 65 -80 122 424 -137 227 26 51 268 -142 -265
3924b65K76M1j36J53J90j78J7m05K00J81qK6O8l1j87K43k26J88j53QK04l61L53
3947A98n46M72j48K65j68j75M42l47j88L43R4K5r5l47M68k94k15N90j13j58j61
3968e8j25J34L44k25qj38L5L19m70J72r7M09k21l08M9lK4N34l72L69k26j97J0
3991d9M8N3LL7j16o5J48n8j1j17L19l20N25p00K04J26k54M95k64J37j15j8J07
4014A15k43Q3J48N7k77N2M80m44M93k54j75J11l61L18Q2j80Q7j1J08k93J03n6
4036e7K29j60j55j76K05k9J23k63K16M5K54o8j54j21K61j38k43J84O1M5J1k18
4058a48K56K00l91L4j07O7K21P5j74J05k62J1L60n3q6k12j30K13o4j3j2L98m55
4081a67J19l7K8k32L86L8j81K28m6j36k28J21R4K5j24N37o72J08J61l12m8J34
$$ plain form
3924 -265 11 52 -84 69 259 81 98 -307 -107 74 66 92 160 129 -58 185 -41 147 -6 2 206 -155 198
3947 198 -348 124 -24 241 73 -102 340 -7 -195 148 242 267 172 -175 293 -1 -216 374 261 103 -58
3968 -58 -183 -49 295 70 62 -76 -41 278 -192 -20 -117 292 71 -237 -188 -191 -167 367 -5 364 138 -59 -49
3991 -49 -1 52 55 92 -24 -89 59 1 -10 -127 192 -128 397 -303 -99 27 -227 268 4 141 26 8 115
4014 115 -128 -45 103 160 -117 -65 415 -29 464 210 35 146 -215 103 185 5 92 81 189 -104 -1 -57
4036 -57 172 12 -143 -319 -114 -143 -20 -283 -67 -22 232 164 10 -111 150 12 -231 -47 14 59 70 -148
4058 -148 108 308 -83 -49 -156 -89 132 207 33 138 -124 -113 247 194 108 -104 -234 -21 -85 -98 -110 288 -167
4081 -167 -48 -85 -57 -289 97 135 -46 182 136 0 -228 -107 -13 12 -112 425 -247 -139 22 -290 -338 -204
4103b04L81Q8k96rJ0N4L21l47O7k14m6N7R7k67L52k53L02j20jn1J39j23M4R5P4
4128A50j92K96k07K3N4l09RK4J46k38N30n28J45J29M09m55k46P78l98j52K32m71
4150b71L27n0k19J63j5j59L42n03L89N5K6P8k43J15j64j8J41j40L13m8j30Q8l97
4173c20K67qJ93j28R7l0L6j24j31L50Jk41M0J18Q4k9O4J7K6n30L51j33J13j66
4197h3L24k03J65j44L2l30P0m3M6L50r9j7k58k3M64l55L54n75L28J06j78q3J20
4220c2N1O3Q6lM8l20l8J25M7K61m49K68p5r2j92ml3N51m02j76j4L36l2J77j46
4245Ek07L62k19J15MJ28l89L14j56J92J37m69M14o27J0J91KK01O1r7R0n4r2M09
4269C25n26K88k68Q7J16k6q8j69K68K5J18l36L53M6k00j57l7M1K92J59l57oM8
$$ plain form
4103 -204 177 265 -31 -40 -30 24 345 -2 65 -149 -195 -138 -41 -308 44 -209 93 -27 -28 -79 60 -63 -19 76 150
4128 150 -42 254 47 70 124 -185 -176 -152 -6 -244 286 -242 -97 32 441 -14 -260 518 120 -32 200 -271
4150 -271 56 6 -213 -50 -65 -224 118 -385 4 59 85 163 -80 35 -129 -147 -6 -146 167 119 -11 77 -320
4173 -320 -53 -61 132 4 101 71 107 -17 -148 202 203 -38 2 120 204 175 239 256 282 -248 103 -30 83 -83
4197 -83 241 38 203 59 91 -239 -169 -212 -166 184 85 68 -190 -213 251 -104 250 -325 3 109 -69 -152 -32
4220 -32 19 82 168 165 213 -107 -145 -20 27 288 -161 107 32 -60 -252 -256 -289 262 -140 -316 -330 6 -26 151 5
4245 5 -202 160 -59 56 60 188 -201 113 -43 149 286 -183 231 -396 -386 -195 -193 8 69 -28 62 8 -84 325
4269 325 -201 87 -181 -94 22 -4 -92 -261 7 32 150 -186 167 213 13 -144 -181 -140 152 311 -46 -52 -4
4292dkk7j57M25k10n0j08K07r0J04o7l11Q6J63K85k35K55n03K60j20J94j54K3
4315c6K7l8q9J17p8j61O1l4K43l49L87j87J06k34K09Q7P2j84K59j21j12m0J74
4338G9l48L37j30K7j33K59k56kJ8M9K73l68j27M76J55m02K68j48k58L06L9j64
4360e0K96j71J18j54j91Q7L75j2r3k9k02L21k34L35n78nK01r3K31r0j42L30k85
4383c5N5L1jk0J20k36m4K76l92K71j76L2K3J13n19P64Qk64j31j9J79k79J57J48
4407F1J62j29k8k63L74m4K2l5k87M47j68J38k8k56Q3k9K29l35J23j8j07K05j9
4430I8J27j94K21j25k83p8K15k03K34J2k53K60j38J28O4m01L08n5r2K26J94m98
4452b33K91n5L35o19L7L46q2n4J0R2j21L62k77k97K97K61k79k45M39l9j9Nj58
$$ plain form
4292 -4 -6 -33 -190 235 25 -25 -133 74 -16 88 21 -290 -204 -41 244 9 264 -239 21 -99 95 -59 -36
4315 -36 -9 -47 -136 -19 -97 -258 -197 -231 12 -337 50 -137 -31 -265 -56 31 103 -81 178 57 -55 -95 79
4338 79 -269 68 -62 -35 -168 91 -165 -167 -149 -100 173 -195 -322 154 309 -93 175 27 -231 75 114 -50
4360 -50 246 75 193 39 -152 -65 310 298 205 176 -26 295 61 396 -182 -187 14 -79 152 62 -80 250 -35
4383 -35 20 51 50 30 150 -86 -130 146 -246 25 -151 -119 -96 17 -502 262 270 6 -125 -144 35 -244 -87 61
4407 61 223 94 66 -197 177 133 155 120 -167 280 112 250 222 -34 49 20 249 -86 37 19 -88 117 98
4430 98 225 31 252 127 -156 -234 -19 -222 12 24 -229 31 -107 21 85 -316 -8 -63 -155 71 265 -233
4452 -233 58 3 338 -281 -244 102 20 -34 -24 68 -53 309 32 -265 32 293 14 -231 208 169 150 155 -3
4475cj74L38k41K7L56k64k93MP9M99k04j27j29K27k21nL62j54j65k75M21lj97
4498a42K71K7j39k05L23j93L51k74J31l9k1m8o8r7K95j39k45L24j52J00l32M06
4520A34j55O7l60K06K10j55L8j76J74o0K2k51J23K14L6k16L56j20j17K26j94m1
4542c9p2K64l63M95m50J54j14J98j29J38P0j6j4r4K32l20j62o9O07k13j56K04
4564A51j58k8J59l07J08k9l6K62l4k34N24n60K32r3J01J74m24K50l6p6L0j6K32
4587A92Q6l40L04j88k76M09n4o4L7k99L35k15K98o7o5j76J15k0L2m6r0N9K13j13
4611F7R5J05k19R8k68j81J45L05k71K95k86K26j49J50k08j70J75L38l37j69L90
4632A31l43K30j19J06J85J3m82J54N9j15K31j92J38L35m99K85p6p2M08o36K24
$$ plain form
4475 -3 -177 161 -80 -53 303 39 -254 -250 -171 328 124 -3 -132 95 -126 -131 231 77 -88 -363 58 55 -142
4498 -142 129 156 17 -188 135 -58 293 19 150 111 90 42 -26 -123 172 33 -212 112 -40 60 -272 134
4520 134 -21 46 -314 -108 102 -53 -15 -191 -17 -77 -55 -306 -183 31 67 -149 207 87 -30 196 2 -39
4542 -39 -111 153 -210 285 -165 -11 -125 73 -56 82 152 136 122 28 260 -60 -222 -291 316 103 -53 151
4564 151 -7 -35 124 -183 -75 -104 -140 122 88 -146 378 -182 50 -43 58 232 -192 58 22 -54 -24 -40 192
4587 192 278 -62 242 54 -222 187 133 69 106 -193 142 -73 225 158 93 -83 32 12 44 -2 -92 -33 180 67
4611 67 162 267 48 146 -122 -303 -158 147 -124 171 -115 111 -38 112 -96 -266 -91 247 -90 -259 131
4632 131 -212 18 -101 5 190 203 -279 -125 -66 -181 50 -142 -4 331 -168 117 41 -31 377 -259 -35
4653c5J57N7j68k31jJ34o2O5L52k57o8J29L8j38l9o0L52j07l50L91l7j28pK82
4677B69k35M8r6l2j45jQ4K7J64k04J65K39k23K0m1QJ60k4j17k30J93m9K2j97J30
4702f5J55K50p9J14j87l39N17o59L69k6k63K96j29r8J78l66L81K01j38l52J94
4723d6L1rj04Q1j6K40N7J39j72l71K79o5Q9J1r9J12j93j50O2J30L00j39j49J16
4747A34l40PN5L2j86N2R8J97O4j08k27J77j96L55K3K1j52m9Q2J41Pm4k57L36l05
4772h3J66on8L5j43P7j19N5K9R0N8K49l71J02K5k75K53RM9l33L53j02M0Nk17l1
4798a43K53j10K77n57N20N4m53j84J50J28J9L77n26J93k55M42j85j24m0oJ04o5
4820a31K97k97K5P4J02j79O1M3k0K2J13l97J75K24j71K58m21K42M1j21q8M64k08
$$ plain form
4653 -35 122 179 11 -220 -221 -87 -149 -84 268 11 -57 72 110 -28 -67 -127 225 118 -232 159 122 -6 -13 269
4677 269 34 82 -14 -46 -191 -192 -108 -81 83 -121 44 283 60 80 39 47 207 183 66 -164 29 -20 2 -195 -65
4702 -65 90 340 261 375 188 -151 366 -293 76 50 -213 83 -46 -144 34 -332 49 250 112 -240 -46
4723 -46 -15 -24 -128 -47 -63 177 234 373 201 -170 109 44 133 144 45 157 -36 -186 -124 6 306 167 18 134
4747 134 -206 -199 -144 -112 -298 -246 -148 49 113 5 -222 -45 -241 114 137 158 6 -43 39 180 187 143 -114 222 -83
4772 -83 83 77 19 54 -89 -12 -131 -76 -47 43 101 350 -21 81 106 -169 84 93 142 -191 162 60 100 105 -112 -143
4798 -143 110 0 277 -280 240 294 -159 -343 -193 -65 -46 331 -195 -2 -257 185 0 -124 -164 -170 -66 -131
4820 -131 166 -131 -106 -32 70 -109 -48 -5 -25 -3 110 -287 -112 112 -59 199 -222 20 61 -60 -148 316 108
4843A08k04k29N68m57j16M48q4L61l28q8j92L45j02q4L4P7K7j3j05l27L02k6M79
4866C94l72K29l54J66M0L5m51L07k34J87J6J12K44k70j9J3m54M90j33R2n7j79
4888a98J02j50M60k09Q5j26J7O4K07m94K49K12j24J08k79KJ88j61K27k47N1K46
4910B30j75l80PN49m51J27m5L4K02N3j36P8L7J03m21K13k6l25L74Q6k45M72j95
4933A66n36N28J59m01K71r9k52K29j82L7J94k35K70k73J9N2j86K37j1J80j11k31
4955a75K98k24j57L28k00K75pK09m79M41l58L17j81j09l2l0J02K4P8l63M68r0
4977A35l62M14l56J16on5K04j44M9o5J75l38o5K88Nk47K53k00K1J00P7K02m7j88
5001c4k05J82j05J66L80m28n7K24j81R8j90J65R6n9o9k9J86j22l1M3k31n8M58
$$ plain form
4843 108 -96 -325 243 -214 -330 118 34 395 67 -21 -213 132 30 -54 -20 57 84 71 -34 -361 -59 -85 394
4866 394 22 251 -103 63 103 138 -313 -6 -240 -53 -37 75 319 49 30 43 -411 79 -54 38 -19 -198
4888 -198 -96 -246 214 5 90 -36 -19 45 252 -242 7 219 95 203 -76 -74 114 -47 180 -67 -16 230
4910 230 55 -325 -318 231 -220 -93 -138 -104 98 151 15 93 130 233 -188 25 -1 -326 48 134 -111 361 166
4933 166 -370 158 317 -84 187 88 -164 65 -117 -80 114 -121 149 -124 -105 -53 -239 -2 -13 167 56 -175
4955 -175 123 -101 -258 70 -130 145 138 347 -132 309 -49 268 87 -22 -54 -84 18 42 120 -243 225 135
4977 135 -227 187 -169 -53 -59 -114 90 -54 -5 -70 105 -233 -298 -10 -5 -252 1 -199 -178 -78 -1 201 154 -34
5001 -34 -239 -57 -162 4 384 -44 -101 123 -58 40 -150 15 111 52 -17 -46 140 18 -13 30 -201 -259 199
5024A99k18m7M0R8m07M81J8k63J32j22L22j07o0k10J71Ql33J93K81j62Jk5J75
5047A65J18p41N04p0J72pj50j80M2L06n7l4J42k87j09L3K7p4L16j18j97K37j2
5070B6J62j27p8j06K11l29M10l23K26j00k13L79j20Nk16J49K07k51J48n9J45o9
5092G7m6N6J45j43r6l70O70k86L0J08J84l39j95L73j60K4K25j63k86K04j78L93
5114B27k27K75j75j40j17J68p6N0L32Om75K6J08l68O62k87m9M8l1P9k65J49j11
5137a91L14m14K72J00j14J25m1J85k02r0K44J8q5l82M43p6p1J28O0Q0n83L46l14
5160b48J73N5K51l96L77j27R5j01j74J41J7o3k4j7k93J77K16L10k61j44j33J99
5182C0j20K25l49K13R3jn7P0K14m60J80p4K34j62j0QJ08k06q0o9J50r1O4L71n44
$$ plain form
5024 199 -19 -66 -26 72 -335 146 164 -99 33 -89 233 126 66 -144 27 35 -298 -105 176 14 15 -10 165
5047 165 283 -458 46 -24 148 141 -9 -189 -147 159 102 68 210 -77 -186 -153 -126 -200 116 -2 -199 38 26
5070 26 188 61 -17 -123 88 -241 169 -154 72 -28 -241 138 18 23 -193 -44 163 -88 60 1 146 77
5092 77 31 87 232 89 -7 -377 293 7 37 145 329 -10 -205 168 8 32 257 94 -192 12 -166 227
5114 227 0 275 100 -40 -157 11 -65 -15 317 323 -152 -126 -18 -386 276 -11 -60 -12 -43 36 -229 -80 -191
5137 -191 123 -291 -19 81 -33 92 51 236 34 -56 188 206 121 -261 182 106 35 163 223 303 -280 66 -248
5160 -248 -75 -20 231 -165 212 85 180 79 -95 46 63 0 -24 -41 -334 -157 59 369 108 -36 -169 30
5182 30 -90 135 -214 -1 92 91 34 104 318 -142 38 -36 198 36 26 34 142 -64 -144 -213 -63 -154 -90 281 -263
5207b63K73J30j53J30j27l13K97K02m5j74J46j98J64j65J35j97J62J04r6R3q9
5228A6J80k45J2L66q8m44L2L45q6K4j37k7M15l44J2j06j93lM23j06l0R9j83O1
5252gj5J81k20L06q1r1l40L24k72j64M68o0q0J37k3J68l06J54p7Q6j15k68O5K68
5276C8j32N3j64M14J01k24l21K67j98k6K14j26J23O6q8o7K34q1J68m42M37k94
5298d8K05j99k70L60J4l4PJ56j15j12m9J05l39J14K16K50k97L3J50j48L40k50
5320H9N2j64n5k1M4J9L33k69k00K17k23mJ67J58n5N9k23N4J93l55M53k41j34K85
5344A79k83m4K25k34m9K47J23j72K55m59K97k51O5N15l86l60K56j76L18j63j7
5365a14M24m27L53k50K4M9m0l93J29K28J11m49M06j23O4JK49k61MJ30k83M51m83
$$ plain form
5207 -263 10 140 -13 117 -10 -323 -26 176 131 -43 103 -95 69 -96 39 -158 4 108 12 105 16
5228 16 196 -49 -37 329 241 -203 -171 174 88 112 -25 -52 363 19 31 -75 -268 -271 152 46 16 115 -68 -7
5252 -7 -22 159 -61 245 164 73 -267 57 -215 -379 89 29 -51 86 63 231 -75 79 2 88 -27 -295 -230 38
5276 38 -94 -41 -205 209 310 86 -235 32 -166 -192 22 -104 19 85 -3 -70 164 83 251 -191 246 -48
5298 -48 157 -42 -312 48 62 28 35 191 76 -36 -85 20 -319 -205 11 261 -36 -3 147 -1 339 89
5320 89 141 -23 -78 -99 -55 -36 297 28 -172 45 -178 -182 -15 143 88 147 -76 -22 171 -184 269 28 -106 179
5344 179 -104 -148 77 -157 -206 41 164 -8 247 -212 85 -166 -101 414 28 -332 -76 -252 66 -97 -114
5365 -114 310 -117 236 -14 10 59 19 -374 -245 -17 94 -355 51 -72 -8 -7 242 -19 -15 115 -168 283 -200
5388b00J66R2l94J13K11r8K78k37j30PJ02j9r9L36j7l48L15k43L38k50L4J99j38
5411A8m3O1kj3M1k06K53j96L16l66J29r3J17j08J7J32l4o2j24mJ15l45J13L60
5435G6l8rp3P9o9j64J44M0j22k17K01K71O6j90j6J32k26pK12k58Q3lo4L78l1j37
5461E8k64M08r4N0P7k59Q8q1K6r2J29j0J56q3n83M61K40n55J16J22P8P1K8rj03
5486b5J08Lj72Q5J23j65L41j94r9k81L65m8J84j75O6J23l13r7K53l8RN9K0j51
5510a9j35j0lK31l0q2J61o3k14J74K38l51n5Q2om0K83n8j13J79k55O8J16o1K5
5535F2k43K40k50J0J9P7J06J66m63R5M8k47L53j03L54l84L44k17K96l92k51J87
5557a93L64J97l77R1K0j73K99l63J9J15n4K08K0k30J95J64l50j71L3L24Q2k23
$$ plain form
5388 -200 -34 58 -336 -223 -12 -110 168 -69 -199 -192 -90 -109 -208 128 111 -237 78 -165 173 -77 -43 156 18
5411 18 -25 36 34 21 62 -144 109 -87 229 -137 -8 -101 16 -92 -75 57 23 -39 -163 -167 -52 -397 -284 76
5435 76 38 29 -44 35 -34 -198 -54 -14 -136 -353 -152 119 185 -5 -21 111 -115 -122 90 -168 -85 -88 -152 226 195 58
5461 58 -206 202 108 158 235 -24 64 -17 9 -83 46 36 192 109 -474 -13 227 -328 -212 -90 -12 59 87 78 -25
5486 -25 83 86 -86 -1 122 -43 298 104 5 -276 89 41 225 50 116 239 -74 -171 82 44 53 112 132 -19
5510 -19 -154 -164 -167 64 34 -48 113 50 -164 10 248 -103 -158 -76 -82 -122 161 103 -10 169 -86 -18 98 37 62
5535 62 -181 59 -191 -181 -162 -85 21 187 -276 -181 -133 -380 -27 -130 224 -160 184 -33 263 -129 -380 -193
5557 -193 171 368 -9 82 102 -71 228 -135 -116 -1 -55 153 173 -57 138 302 -48 -219 -186 138 220 -3
5579cl04L33q3J07J75l3j20J86l0n9l25L06l43k9L75nk88p9k2L56m7n1R5k0k60
5604a68P5M20o56K44K0K04l6P9l4L5Q0m13K4J86J4k3K9oO2l38L92j01J98m43K8
5629a28M40k04q5L8l58lJ1O40n17K74N2p67O54M2o7K89J00n23M5j74K26j64J55
5652b4q1K9J64j03J0J31j00k07L27j26K27j96l9J44k5m0P3k55pJ04K4k61n2L84
5676A01l9q2J61j09R9q7l84L32J02m5RK47l9m04J72j8J76n67L65qR4j00p9J03
5700@J44j96J03o0R5o3j33R9O3k34J40M18l59q6J51j73q2J41k0J56K8R8k66K72
5724B36o71N95l92K77j9k4L21j20n2k07j8j70J33J37l7L31l26J10P8k8J58k50
5746F2J00j43%R6j90K19k59j34K87K8j07J84j89j47J11k2JL45j95N5l50k1K74
$$ plain form
5579 -3 -307 26 -57 50 225 192 72 258 228 169 -156 150 -193 -222 153 148 -140 -219 -241 115 68 17 112 92 -168
5604 -168 -93 327 -329 -85 -65 139 103 182 148 183 263 -150 -126 60 74 51 80 74 136 -202 190 89 287 -156 -128
5629 -128 312 108 23 61 -297 -300 -289 351 -166 108 160 -607 47 89 22 311 411 -112 -67 -241 -15 -179 -24
5652 -24 -105 -76 88 -15 -5 126 26 -181 146 20 247 51 12 156 131 91 164 -91 -98 6 30 -231 -283 101
5676 101 62 -20 141 32 131 44 -340 -8 94 49 58 305 266 -138 34 16 192 -375 -10 -18 76 -24 -103 0
5700 0 144 -52 51 -9 86 23 -110 -11 52 -182 -42 376 17 -69 82 -91 -173 -32 -52 104 132 230 -36 236
5724 236 -435 160 -232 45 26 2 323 203 151 -56 -74 -244 -111 26 -11 320 -6 104 182 154 312 62
5746 62 162 19 19 115 -75 144 -115 -249 38 66 -41 143 -46 -193 -82 -104 -103 242 47 102 -248 -269 5
5769EL9M7nJ9k67J9j07N23m28J81J5j75j85M87nq3J12l19K39l80K35O1k60M23
5793A91k04L3k48L31P7j80J79j54j18J65M35n22L15l14K42m55j41J52K82K64m79
5814a49M1J64k10O0M04p14L08M40j87K1j17k91L41k41J79NJ2K46j73M38n65k24
5836b12J26J14ok10j80M94j00o0r0J89J46j42J81o28L01j29J56j1j12K20l4O4
5858G7l6j88K62k51l3L75j39k11M25l77J16o1P0L00n69L80j29p6k08L80n8K79
5880C28k40k73N46m49J00P6j9K81n47J85k60J84K96p6O2k74J14M4l9l44N57k16
5902C6L56k73j88O7P8j52Q7K74k68j43j03N07l71r9L48j01j95J50L03n06r8J58
5924a33L5M24l9j01r4k18J92kr1j60J87k25K93J89l14k08M89k10J44K27m99J27
$$ plain form
5769 5 44 91 86 105 -162 -143 -250 273 -155 26 41 -134 -319 168 163 80 192 -127 112 -268 -33 28 -232 191
5793 191 -13 20 -228 103 180 0 179 25 -93 72 507 -15 300 -14 228 -227 -368 -216 66 330 -149
5814 -149 -108 56 -154 -94 310 -404 -96 344 157 178 61 -230 111 -130 49 54 66 312 139 577 12 -212
5836 -212 -86 28 22 -188 -368 126 26 -34 -124 65 211 69 250 -378 -77 -206 -50 -61 -173 47 13 77
5858 77 41 -147 115 -136 -169 206 67 -144 281 -96 20 -41 29 329 -240 140 11 -65 -273 107 49 328
5880 328 88 -185 361 -88 12 88 69 350 -197 -12 -272 -88 208 132 194 -80 34 78 39 -305 252 36
5902 36 392 119 -69 -2 76 -76 11 285 17 -126 -229 278 -93 -192 156 55 -140 10 313 -193 -291 -133
5924 -133 -98 326 287 186 92 -126 66 64 -27 -187 0 -225 68 257 -57 -265 224 14 158 385 -114 13
5946A3m0q9J37N3k28K55m92K04L11j59L1K01p2j09m5j62r0J57j00J80J39k23J69
5969D1n4J29P2N9j49m35O03l61K07m29L05l05L22j37R3q8K13N8l2J0K22q5r9o1
5993I9q2K92n23L22j1j4o7r2J0K11m6j20k92M45j96J87L00o64K02q2L02l03q3
6016b05J61MJ18k05Mj06K52p0k5j15L32r9N2j79K69l42J91J17q2%k29L28J26l45
6040d8o7J00J98l04J18pr7N4o5K50p8j65n0K83k8J38j82k74K62Nl47M86j98P9
6064F3l2jk34K3K53j69M08n52K02L2q9j93K03L9j88J95j9O4q5J99Rk03J40Q4J36
6089B85j67l81J54K31j75M5o3J63q8J22Ql51J7m3L23k64NK03K07RL4m36K39K41
6113C18k57K3k29K36r9L24k21k00jn7J92N0j6o7L56n82L58l62M8K51n3lj51K49
$$ plain form
5946 13 -27 -116 21 74 -154 101 -391 -187 124 -35 -4 197 125 16 -29 -191 -281 -124 -224 -44 95 -128 41
5969 41 -13 116 188 247 98 -337 266 -95 112 -317 -12 -317 5 -132 -39 -127 86 144 112 122 344 259 160 99
5993 99 17 309 -214 108 97 83 16 -76 -66 145 99 -21 -313 132 -64 123 423 -241 -39 -121 181 -122 -205
6016 -205 -44 -40 78 -127 -123 -229 23 -47 -72 -187 145 46 98 -81 188 -154 37 154 72 72 -157 171 297 -48
6040 -48 -115 -15 183 -121 -3 -10 -107 -53 -118 132 54 -111 -161 122 94 232 50 -224 38 43 -304 182 -16 63
6064 63 31 30 -204 -181 72 -97 311 -241 -39 -7 -96 -289 -86 -47 -235 -40 -59 5 -80 119 128 -75 65 149 285
6089 285 118 -263 -109 122 -53 -8 -71 92 4 126 134 -217 -200 -243 80 -184 -179 24 231 240 274 -162 77 318
6113 318 61 84 -145 91 -8 316 95 -105 -106 -163 29 79 63 -4 352 -230 128 -234 -186 65 12 9 -142 107
6137A07k43K88n0j44Q2k19M87m17K20k44K05j53K60k53R7K62k05l37J82J79j89
6158h5J94k59K62m71L22J51n29N18j77j13L75l33L7L4K59j47K70n6K9n91L58j75
6180a27p0K36n6J37l0J7j89Q2j65N0L68k60l18M23k57K11j88K64R9k22L88k27
6202A66k55m73L62J77p2K04j60K66k17L16m09o0J49J44l34L03j98L44m00K90m46
6223c03K93K21j62J56n43M53k75J25N89o48k10M40l18K2J14K62j79Lo4Q2m1n9
6245d2M6M0k9J03k73j84M77q6r4m7Pn1L09l98K53l18K20K35k70K54k02Q6N8k19
6269a25K76J6k57j5P7k98Q69o50L07k85j05L6J77k78K03L8j12J60Q6k13%K98l3
6292A72k66m8J79k84M2L4l1J02MM09o32K98J43j55l53K19L40l12K13pNK26l50
$$ plain form
6137 107 -136 152 102 -42 40 -179 308 -109 111 -133 72 -81 179 -74 23 285 80 -257 -75 104 -85
6158 -85 109 -150 112 -359 -37 114 -415 103 -74 -187 188 -145 -108 -74 185 38 308 252 281 -310 48 -127
6180 -127 -197 39 -17 120 90 107 -82 0 -165 -115 253 -7 -325 98 -159 52 -136 128 227 5 393 166
6202 166 -89 -562 -200 -23 -95 109 -51 215 -2 314 -95 -155 -6 138 -196 107 -91 253 -147 143 -303
6223 -303 -10 211 49 205 -338 115 -160 -35 554 -94 -304 136 -182 -160 -46 216 37 40 -24 58 17 -42
6245 -42 4 44 15 118 -155 -339 138 52 -42 -89 -82 -133 176 -222 31 -287 -67 168 -102 152 -50 36 94 -125
6269 -125 151 167 -90 -105 -28 -326 543 -107 200 -85 -190 -154 23 -255 -52 -14 -126 34 120 -93 -93 205 172
6292 172 -94 -142 37 -247 -205 -171 -202 -100 -96 313 -319 -21 122 -33 -386 -167 173 -139 74 67 72 298 -52
6315e2K84J37q3l79J80K55l20L8j35j37J41M31L8k99j98J5P2J89j57K31k40j59
6337a48j26K25j6K81l42l4j22K0M17k97L07k10Q4j12J14J12r1J0j53K51j64j75
6359a69J16J23k59K56P6m46L14P0j66j38L30j56l7J52k57K76K02n2q0k35K85l99
6381a94P7J07k06K66j65J84j38J46l17Q7L48k54K70k83P1k59K23Q4J3P1l85J44
6403a10j13M5M61m12M7j55J67N3o2K51J75n07J37j55K71K8j66p7R0q6K59j91j87
6426b37K76R2j75p4L09r4j07j13K29l77O10n8n66K27J49j60j00j5M47n21L84k32
6448a06L6J17J5K01m11J45N2R3k21L98j9m09j25K83J78l42J25p9n5J52k7L79l01
6471G9Q2j67j19L24l10J56m4k74J6K11K50k93L1R0o9K8Q3j79p9q1J51L75n52J69
$$ plain form
6315 -52 232 369 286 -93 87 342 22 60 -75 -212 -71 360 398 99 -99 -84 -12 177 20 251 11 -148
6337 -148 -274 -49 -65 216 -126 -160 -282 -262 155 -142 165 -45 39 -73 41 153 62 72 -81 170 6 -169
6359 -169 -53 70 -189 67 143 -303 11 81 -85 -223 107 -49 -86 66 -191 85 287 235 155 -80 205 -194
6381 -194 -117 -10 -216 50 -115 69 -69 77 -240 -153 195 -59 211 -72 -1 -260 -37 47 60 131 -254 -110
6403 -110 -223 -178 283 -129 -82 -237 -70 -17 -79 172 347 -160 -23 -178 93 121 -45 -122 -32 -118 141 -50 -237
6426 -237 39 131 -44 -118 191 97 -10 -123 106 -271 339 281 -285 -58 91 -69 -169 -184 263 -258 126 -106
6448 -106 -70 47 62 263 -148 -3 49 142 -79 319 300 -109 -234 49 227 -115 10 -69 -124 28 1 380 79
6471 79 161 -6 -125 199 -111 45 1 -273 -257 -46 204 -89 -58 32 -37 -9 74 -105 -184 -265 -114 261 -291 -122
6495a22k1K42j1k68L25j44o6J4J95q0j43J17K09J29m78K25qk46J06J25N1ll79
6518b31M3j03L39j97Q2P8L18Om23K21m25Q4J26j20k3J14j54P6J12K07j38J08k32
6541a32j1j4pj36K43K42r5j22J76K18o24N28n04m1K17n4K99k35j85J99n0j2OJ45
6565E1j56K55j41l8K92j14m9j70K36j04J50j08j53Qj6J76L6k89J85J9k05K59q8
6588C6o7J52p9K3l5r2J06n0n2Q8l31K94O4j99k9K71m44L96q3k8L17n12J40M5K24
6613A55O1j69r2L49l74k7k7L6j38L66j97MQ2J26k89j50K18q6J02J91k67K62j87
6636e1Q5r2K19j61r6l0J59M5k07j53J93J05J2K5J1k6nk00L0J99n3j77nN18k43
6661A02o9r5K40j09j92j41O14l88M01l96n1J94j20L7k22J96k41N47j71l13R8k3
$$ plain form
6495 -122 -143 99 88 -180 145 1 -65 -51 144 64 -79 38 247 376 -102 123 115 -131 -25 100 151 148 -231
6518 -231 -188 -291 48 -149 -67 11 329 335 -88 133 -292 -208 -82 -202 -225 -111 -265 -189 -77 130 -8 100 -132
6541 -132 -143 -157 -164 -300 -57 185 90 -32 144 362 -262 266 -238 -279 -62 -116 183 -52 -237 -38 -88 -100 -94 51
6565 51 -105 150 9 -29 263 149 100 -70 166 62 212 104 -49 -41 -57 119 155 -134 51 70 -135 124 36
6588 36 -31 121 42 65 30 -62 44 -6 -58 30 -301 -7 57 -142 -171 100 -344 52 -31 -59 258 -254 -114 -69 155
6613 155 216 47 -45 304 -70 -97 -124 -88 -226 140 -57 -53 29 155 -134 -284 -66 -152 -50 141 -126 136 -51
6636 -51 34 -58 161 0 -96 -126 33 78 -129 -282 -89 16 28 53 64 38 33 -167 -137 62 9 -168 -173 345 102
6661 102 33 -62 178 69 -123 -264 350 -38 363 -33 -84 110 -10 27 -195 1 -240 307 136 -177 -79 -102
6683a02J68k92J37L5k41J83J07j0m65K61K31j8K0J9J80r7M3j75J77R0l47M10k30
6706H4Q7m51K77L24o61M81O9m80P7K96k20J88l28R0O8l4P7O0P3j5J21k78M14k47
6730G2n8J13l22J84N12o39K71J67J21m46O7n0J67P9P3k34r0nJ39j97k36N17m03
6753a98L88o8n7m2O3J80l92l1M6J30L15o59K05r7K67o1J58J91k16L7l17LL11J58
6777C14j16l96J87p0K34r4k95K97r7R1j51L3J34p0K83K55o45R8K30l24J08j71
6799a65j03R1L63k71j18P33m04l7j38K92l23R6J03K08l90P2l2l05M86k05J51p1
6821C3Pj6q3q0R6j48L14Q0k01K53l05J84L1j74K07k64J09r5l3J05J96k88j47R8
6845a21rK35k63O7L51k92k34K37Q3j41J56J60j50j51o4P3j72J82L14l19Q7r1k67
$$ plain form
6683 -102 66 -226 -89 -54 -295 -112 -5 -15 -480 -219 12 -6 14 33 213 116 159 -16 161 251 -96 314 84
6706 84 171 -280 -3 321 -340 141 210 -270 -193 103 -117 71 -257 -167 -99 -133 -56 4 77 62 183 -95 319 72
6730 72 14 127 -195 -11 501 -138 133 300 421 -25 42 -8 159 238 311 77 -13 -18 121 -76 -312 205 -198
6753 -198 190 122 65 23 86 266 -126 -157 -111 19 334 -325 -120 -217 50 -11 147 338 122 159 -158 -155 156 314
6777 314 198 -198 -11 -81 153 59 -236 61 -36 55 -96 -63 71 1 284 539 -106 -8 222 -102 6 -165
6799 -165 -268 -177 186 -85 -203 530 126 89 -49 243 -80 16 119 327 -63 9 -23 -328 158 -47 104 33
6821 33 40 24 -59 -139 -43 -191 123 203 2 255 -50 134 165 -9 198 -66 43 -52 -85 20 216 -72 -219 -121
6845 -121 -130 105 -158 -91 260 -32 -266 -29 54 -87 69 229 79 -72 -136 -63 -235 -53 261 -58 29 -62 -329
6868c29K83J44k62M37k64j97k4J9j64K71K18l34k8j21N15n19K66L37l18J66j69
6889g3J12J31j14k40J90j0m4n6L46k63K76Jq1m2m66M02r9j7K0j78R6Q8L8j08J83
6914I2n2m0j62j06L71J25n1p2j42R7q3J49l78MM85m01K29k8J26j39M5kJ15k93
6938a11L97l41o1j04J18J88j57j1R1K47q6j63J14qj08K46n65L42L9J73Q0j53k75
6961a08J97n47O66j87K07j80R3j02j19R5m9j84K31l8l08J25L91j35n9K34j93j92
6983a62m25N26K12P6l39N6RK19l95P4K98k58K39jj41j39K95j42J08j71NJ29r1
7006a8K5k62M21k58J38o9L97k86l00ML23j5P2m4l8j03M3O8r5M2j00o6l7M16m04
7031a46K87p1l84O63l07J60k63J80j13N3j8J47J00n08J43K17J78m69J17J4J4R0
$$ plain form
6868 -329 -46 98 -164 273 9 -188 -212 -193 -357 -86 132 -202 -230 -351 164 -355 -89 248 -70 96 -73
6889 -73 39 170 56 -184 6 -4 -48 -104 242 -21 255 256 175 133 -333 69 -30 -47 -27 -205 -109 -21 17 -91 92
6914 92 40 0 -162 -268 103 228 177 105 -37 60 -23 126 -252 -248 237 -164 65 37 163 24 69 67 182 -111
6938 -111 286 -55 -116 -220 -102 86 -71 -82 9 256 170 7 121 113 5 251 -314 28 67 240 320 167 -108
6961 -108 89 -458 208 21 228 48 141 39 -80 15 -34 -218 13 -25 -333 -208 183 48 -11 223 30 -162
6983 -162 -587 -61 151 227 -112 -56 -47 172 -223 -149 149 -109 130 129 -12 -151 144 2 110 -61 -56 73 -18
7006 -18 7 -255 166 -92 46 -23 374 88 -212 -208 115 100 172 128 90 -13 30 98 3 45 -55 -121 -158 258 -146
7031 -146 141 70 -314 349 42 202 -61 119 6 59 41 188 288 -220 -77 140 318 -151 -34 -20 -6 84
7053H4j40oL20l89N4J85J38k62L83j73j57Mo6J44jL46n40j95N59l59K74L8k64
7076b3N7K58m74K33k18j46L09J31l74J50K90m91K65L96l93J92l39L16J67k80O3
7097H9l55J73%L37M5j52l19K79k3K3k10k47K16L04J58m89K8J67R0l38J07L20j83
7120B0J3k3J69J58m66l4J46K1L99n61O1O7j42J14P7o9r8L23l66K55k62R4J78N
7144G9l4r7L32r5j87J5j19N0L38j85n7k05L09m39L42j05n6n1N5M36k16r7N7J90
7168B60k27L26k16N1l13M0P1J03Ok88j9L39j54p7J6N4q6J63M1O3j95J77k25J52
7192F2R8j88N1R6j37j31K53R2M3j31n6l49N94l40L01k97k2kL55m87K67l11K80
7215D1K5l01k3K17K22j08j88KJ98k37j15J24k45L51K40m26K24K24k51J72l4q7
$$ plain form
7053 84 -56 -62 258 -131 -77 108 246 -16 367 194 37 41 -25 119 118 464 -76 -271 288 -71 203 241 -23
7076 -23 34 292 -182 51 -167 -313 -4 127 -247 -97 193 -298 -33 363 -30 162 -177 139 306 26 89
7097 89 -266 -93 -93 244 289 137 -182 97 74 97 -113 -360 -144 160 318 -171 -143 24 114 -224 -117 203 20
7120 20 33 10 179 337 -129 -163 -17 4 403 -158 -97 -30 -172 -58 19 -50 -148 175 -191 64 -198 -104 74 79
7144 79 45 -52 280 185 -2 13 -106 -56 282 97 40 -165 144 -295 47 -58 -114 -165 -110 326 110 13 70 260
7168 260 33 359 143 194 -119 -79 -8 95 101 -187 -206 133 -21 -98 -82 -28 -114 49 90 153 -42 135 -90 62
7192 62 160 -28 23 119 -18 -149 104 196 239 108 52 -297 297 -43 258 -39 -61 -63 292 -195 72 -239 41
7215 41 66 -235 -258 -41 181 73 -115 -113 85 -152 -267 -143 -388 -37 203 -223 1 225 -26 146 112 25
7237B5q2j2j72P64l94j54Q1O4J2l62J59k60K12J39P3k45K9p6M11o87J98K08J81
7260A12K42l66K0K55m55l1J45M2N9N8J16j54k47j0j02N70m11M0J93K38k31k50
7282a67P2J17j82p0K70K5n65N58N0k77J73Q5l65N46j07m99O01l65M4L4J22j44
7304d4l77N98Nk28K37j93rJ56j09n03N05Q7J9M7M4j14L6j13K16J79k92j82j81
7327b16K36J09j76J89j94K90j90J61j06J63j48j27j8j3j03J03L19k61P0J52k77
7348c7J9L32l34p2J28j98R0mm2K27rl09N13l54j26M83k87L96k65k90J83j86K98
7371A56k78m3K70l46K04K64r6k20K31j14J1k70M18j3j30p4K28L9m14J52j23L6
7393a12J59K9K23k62j60J5j4J88K60M7k89o1j05j3L72l23k00K44j37J78L2O9q8
$$ plain form
7237 25 -57 -69 -241 523 129 -25 56 120 132 -230 -71 -331 -119 20 93 -152 -123 -199 212 -475 -277 -69 112
7260 112 354 -12 8 263 -192 -223 -78 -36 23 81 197 43 -204 -214 -316 254 -157 -117 76 314 83 -167
7282 -167 -95 22 -160 -230 40 65 -500 58 108 -169 4 89 -276 270 163 -336 265 -100 -56 -22 100 -44
7304 -44 -421 177 182 -46 191 -2 -11 145 36 -467 38 125 144 191 235 121 157 44 260 439 147 -35 -216
7327 -216 20 129 -47 142 -52 238 48 209 103 266 118 -9 -27 -40 -143 -40 279 18 88 240 -37
7348 -37 -18 314 -20 -92 36 -162 -72 -76 -118 109 100 -209 304 -50 -176 307 20 416 151 -139 44 -142 156
7371 156 -122 -165 105 -241 -37 227 131 -89 142 28 39 -231 187 174 44 -30 198 237 -177 -25 -148 -112
7393 -112 47 76 299 37 -123 -108 -122 66 326 373 84 23 -82 -95 277 -46 -246 -2 -139 39 71 140 52
7416E2K28n32K73K0Lj36R9j42J02J57m60M75k64J62m9P2j79J18p6J44k92K38j18
7439a05K97k77K89j20j20O4J54l98n6J70j11J70K61n36J74j70J31m6K94k20J22
7460c3j39M82l43N8p6l40P66k60N9l11q5J64R4k98K38J73M50p22N4l00M25n3M6
7483D9k59K95k29rL19l08K18p2k66L76j84K02m37O07l36KL2q5QL10m6k07J16K31
7507C27O1l76L90n95K17j19K54l81J39k04N36j52k87J8L75o5l22J61K66j15k19
7528i1J24j57L08l73L74k25J27r3L1k21L61k07R0J04q8l29O40l09j59j25j1j86
7550d15L95k0j7J16j10J98rq9J07j55k46K36j28M05j74j32r5q4l4J99L80n46K83
7573F5J97m3l9L3j7r2j18J87k16k28M04j0qo27K91K54k64K19l36P41k15n1k53
$$ plain form
7416 52 280 -252 21 41 44 -92 7 -135 -33 124 -336 139 -125 37 -12 60 -119 -1 -77 67 -225 13 -105
7439 -105 192 -85 204 84 -36 28 182 -216 -272 -102 -213 -43 218 -318 -144 -314 -183 -229 65 -155 -33
7460 -33 -172 310 -33 25 -51 -391 375 115 174 -137 -222 -58 36 -262 -24 149 599 -123 -69 -369 56 3 49
7483 49 -210 85 -144 -153 166 -142 76 4 -262 114 -70 132 -305 302 -34 -32 0 -85 -77 233 187 -20 96 327
7507 327 388 12 402 -193 24 -95 159 -222 -83 -287 249 97 -190 -172 203 138 -184 -23 243 128 -91
7528 -91 33 -124 184 -189 185 -40 87 -6 25 -196 165 -42 48 152 64 -265 375 66 -93 -218 -229 -415
7550 -415 -20 -40 -57 59 -51 147 138 49 156 1 -245 -9 -137 268 94 -38 -133 -217 -251 -52 328 -218 65
7573 65 262 219 180 213 196 104 -14 173 -43 -271 133 123 115 -512 -221 33 -231 -12 -348 393 178 127 -126
7596a26L86k13q7q1M22l02j57J92k03K37j38L41k3k08j07J17j93K94j78J12k16
7617a31K78R8j53l1rO8l78m6J05P1J09L3j50K6K38l22J30j00K52j05K64l04l6
7640i3K07p7P6p1k0o4M6L52m24K61j50K81o6j49j19J30M3k66J9r2K48L72o36L19
7664A27J08m26K40l1L53m70K77l76J94M09o01R8n6j99K88j46M2J49L9J26j87J23
7686H1r9L9J64k91N2j02O4K98K1J85m46L17j37J30j51r4J5r4j27L8M5P6j20K02
7710F6K57n48J35R7J30k48Q1J04R5nm8j52Q6l02L91j24k90K64J88r4L9L8j80J42
7734A22j57R3j26J4p4o1L72L1l1l47J90l61K16K22k77M83m34m0J67J46k60q3P2
7757a23K03k0K6j72j1j44L3J40L2j32L88j96q1J27J93n07J80O9L29n95K03m6j49
$$ plain form
7596 -126 260 47 -40 -121 301 -1 -158 34 -169 68 -70 271 248 40 -67 50 -143 151 -27 85 -131
7617 -131 147 245 92 61 52 120 -258 -304 -199 -128 -19 14 -136 -110 128 -194 -64 -164 88 -17 247 -57 -93
7640 -93 114 37 113 42 22 -42 4 356 -68 193 43 324 258 109 -10 120 163 -103 -84 -176 72 444 -192 127
7664 127 235 -191 49 18 371 -99 178 -198 -4 405 -196 -98 -154 -353 -65 -211 -169 -20 19 145 -42 81
7686 81 -18 21 185 -106 -54 -156 -92 206 227 412 -34 283 146 276 125 31 46 -48 -175 -137 -92 -16 -136 66
7710 66 323 -225 -90 7 137 -111 -30 74 169 164 116 -36 50 -252 139 15 -275 -11 177 83 122 160 -20 122
7734 122 -35 58 -68 -54 -128 -189 183 214 183 -164 26 -335 -119 103 -174 309 -125 -165 2 148 -112 -195 -123
7757 -123 80 60 86 -86 -97 -241 -208 -68 -36 -168 220 24 -57 70 263 -244 -64 5 334 -261 -58 -104 -253
7780b53L96j04l89L37J14j48m89M40rj19K53q4K47j14m6l20L40j94M72l85l31
7801c86M17K64l00j4L28m58k2O2J70k7j03J34J96k45O3Q8nj30j71j93N53m67K36
7824a0K54l86L44m27J00L13l60j28N65k0k92k3J2K80m00J27k08K68m0K71j83J01
7846A58l16l4J94j85J56j97K87rn7L4K78k58o3J45o8l57K01P8p3j20L18l64J3
7869b39M00k70J67q9p1j55J38J21M0m4K51k59J10P2m09J46K36j67k60O11k39j37
7891d7L58j27j91LM9n5L1K0J41O4l49J25j13O3r1K97j61J60R4l67p0K60k30n2
7915a88j3j09P7M59j18j64L7J27J95k16O6k12L2P8l08J60L3K46mk59R2m4qj92
7939b33K86j54J75j37O5j51l9K91L57n17l3k7K52k09M4P7M6l92L53j58ln3J39
$$ plain form
7780 -253 143 39 -350 -13 101 -47 -536 -96 -105 -224 29 -55 192 78 32 -288 52 -142 330 -55 -386
7801 -386 31 295 -5 -19 309 -149 -171 -109 61 34 -69 65 261 16 79 167 162 32 -139 -332 221 -246 -10
7824 -10 244 -142 202 -225 -125 188 -172 -300 265 245 -47 -70 -58 222 -178 -51 -259 9 -31 240 57 158
7846 158 -158 -192 2 -183 -27 -224 63 54 -3 31 309 51 -12 133 65 -292 -91 -13 -86 -206 112 -252 -239
7869 -239 161 -109 58 -31 -102 -257 -119 2 42 -2 249 -10 100 172 -237 -91 145 -22 -282 329 90 -47
7891 -47 311 184 -7 -4 45 -10 21 41 182 246 -103 22 -91 -28 -119 178 17 177 271 -96 -166 94 -136 -188
7915 -188 -201 -310 -233 226 108 -56 -19 108 303 87 153 -59 -27 51 -257 -97 -64 182 178 -81 11 -33 -41 -233
7939 -233 53 -101 74 -63 2 -149 -188 103 460 -57 -90 -117 135 -74 -30 47 93 -299 54 -104 -107 -160 -21
7962b1L4k64K67m6j17P7J25K94m75L09k96J04j56K64o7k32L67k29K80k67Q4l9
7984dm1J31l0l32L75r1o2N5j7L71m45l1M3j16J04j02r1L77n9kqJ44j06J15J06
8009B84j97k25N8O1j59K23l2j52j00M90j49r6j98R8J54l8n4J52M7k31L00m21L83
8032A98J46k75n69M81J68k01J5R9J81j94m21M04k5k24J82J00l91o0Q37l13j56
8053a8J92M3l36K5L92l10k80L77m84N48l94J92L0l8J73j31j7L57k97J95j08j00
8075A1J85k40o4K64k53M71m82R1j40k1L06r7m1j20J29l58M23Pk23L18j3K4l6k27
8099h6K48j84j46K22k3R1k0k96L07j57Q4j70L22P2l26L3j24K04N3p8r0j20L19
8122A35k84J80J43k30J92j38J31j30k7j7K56Pk74q7R6k4j71M0o1K56M5O2l87L70
$$ plain form
7962 -21 13 -251 16 -30 -147 -70 55 349 -126 183 -113 -9 -165 99 32 -200 167 -62 218 -49 35 -4
7984 -4 -45 86 56 -276 99 8 -54 1 -16 355 -90 -121 -78 -194 -90 -192 -283 94 35 33 25 169 63 178 284
8009 284 87 -138 -80 -19 -178 45 13 -139 -239 251 102 6 -192 -94 60 22 -32 120 167 -64 236 -185 198
8032 198 344 69 -500 -19 149 -52 -37 62 243 49 -372 32 7 -217 -35 65 -326 -386 451 138 -18
8053 -18 174 217 -119 -94 298 -12 -292 85 -399 149 -245 -53 -23 -61 112 -19 -36 321 24 219 111 11
8075 11 196 -44 -108 156 -97 374 -108 -17 -157 -178 128 31 -10 -130 -1 -359 64 71 -152 166 153 177 141 -86
8099 -86 162 -22 -168 54 31 122 102 -194 113 -44 40 -130 192 264 -62 -29 -153 51 104 26 -64 -184 135
8122 135 -149 31 174 -56 136 -2 129 -1 -28 -45 211 218 -56 -143 -47 -71 -242 -202 -263 -7 38 100 -287 83
8146H3KJ40j08l38Q5L16l67L79m17J62J29O1K1k39o7O6M35l90J71k89NK26r2L
8170b3l17N89L4l7j67J70n55N06j74k01J15L91j89k03K74l34J48j17k73M51Q9
$$ plain form
8146 83 85 225 117 -221 -136 180 -187 192 -225 -63 66 127 148 -91 -158 -92 343 -47 124 -165 -160 66 -26 -23
8170 -23 -340 249 283 246 79 249 -306 200 26 -175 -60 331 142 -61 213 -121 27 -90 -363 88 177
8191A77
$$ Imaginary data points
##PAGE= N=2
##DATA TABLE= (X++(I..I)), XYDATA
0@%%%Qk4K4k4M0n6O4q6J18j36J68k16K56l04L75m46N18o13P18q27R61j112J268
26F74j448J656j876K119k397K698l024L389l790M224m704N235n809O440p140P905
42D152q748R689j0732J1891j3203J4691j6378J8332k0624K3336k6628L0725l5964
55a9461M2950n2806O7849r3924J51685m93730K31012J019341l91045o49036n40740
66g27905L79096Q86566J58108q13058m97412J93276P26765L86035n54200p43248
76f05977J30829O59823M40894l50251p50973q3014O61923M23854j82299o14088
86b69279l46196N33127O53822k09808n88405k50658K74549N79752J10987n89751
96a01860l88431K49529M91592K26229l92113n60902J25076N77357K22752l15670
$$ plain form
0 0 0 0 0 8 -16 8 -16 24 -32 32 -54 64 -72 96 -120 136 -168 207 -239 279 -334 384 -443 518 -594 674
26 674 -774 882 -994 1125 -1272 1426 -1598 1791 -1999 2225 -2479 2756 -3053 3387 -3753 4152
42 4152 -4596 5093 -5639 6252 -6951 7740 -8638 9694 -10930 12406 -14222 16503 -19461
55 -19461 23489 -29317 38532 -55392 96293 -397437 -166425 852916 461871 -187165 -727905
66 -727905 -348809 537757 695865 -117193 -614605 -421329 305436 691471 137271 -605977
76 -605977 -475148 184675 625569 275318 -475655 -558669 103254 527108 344809 -269279
86 -269279 -615475 -82348 571474 361666 -226739 -477397 -202848 376904 487891 -101860
96 -101860 -490291 -240762 250830 477059 84946 -475956 -350880 226477 449229 133559
106A33559m87974n0160N15733L33215k64230m35092j34985L48673M51390j20922
116B89207n09078j63394K98256L86351L6494m30836l09389K49949M06141P8281
126C31982l19315l72389J08695M63979J39029l11358l27209J5880L74201K48593
136C52088k38309l58322k6844K86742K87087r3088l97774j28497K96179K89038
146B68300m5627l25650k07930K15835L33997M99k86653k23383J11043L35827R8384
157B74642k73770k49980P2090K85040J57508j92652k91375R932K68456J82168
167B42059j16967k88317p8455K51341K25135q7434k63911j15938J84750K50977
177B03240k5158k51297j44060J26201K44599N1711k25229j93676R3225K37572
$$ plain form
106 133559 -354415 -404575 111158 444373 180143 -254949 -389934 -41261 410129 289207
116 289207 -219871 -383265 -85009 301342 337836 -93000 -402389 -152440 253701 331982
126 331982 12667 -359722 -251027 212952 351981 40623 -286586 -270706 103495 352088
136 352088 113779 -244543 -271387 15355 302442 209354 -188420 -316917 -20738 268300
146 268300 222673 -102977 -310907 -95072 238925 239424 -47229 -270612 -159569 176258 274642
157 274642 872 -249108 -177018 108022 265530 72878 -218497 -208565 59891 242059
167 242059 125092 -163225 -241680 9661 234796 147362 -116549 -232487 -47737 203240
177 203240 178082 -73215 -217275 -91074 153525 205236 -19993 -213669 -120444 117128
187A17128Q5258j71905k16855L1245K34199J20933j35070k13295k5678K03593
197B9553J65362r5539k18726n9276J68335J80262m1668k08672r8780J31811J89148
208A41810P316j87238j37423R4939J96717M1699j60534j55158N0617J89216P9561
219A61522j30791j66618J0411J71048J10936r3098j74291k7920J52485J31596
229A45280n8075j68658o1505J23736J46529j9574j59114q9835R3892J53151J4956
240A20783j42048j12267O2841J52224M4155j17228j27338K7608J46612P0938r2573
251C3707j33521m552J30998R6099o6581j36886k9101J10623J08520l2950j33001
262e6645n7348R2160J16382n772j20142p9779O6415J23679J7280j05036r1826
$$ plain form
187 117128 202386 30481 -186374 -155129 79070 200003 64933 -148362 -174040 29553
197 29553 194915 99376 -119350 -178626 -10291 169971 128303 -80369 -179149 -47338 141810
208 141810 149126 -38112 -175535 -80596 116121 157820 -2714 -157872 -107255 81961 161522
219 161522 30731 -135887 -125476 45572 156508 63410 -110881 -138801 13684 145280
229 145280 87205 -81453 -142958 -19222 127307 107733 -51381 -141216 -47324 105827 120783
240 120783 -21265 -133532 -70691 81533 125688 8460 -118878 -91270 55342 126280 33707
251 33707 -99814 -104366 26632 122731 56150 -80736 -109837 786 109306 76356 -56645
262 -56645 -113993 -21833 94549 88777 -31365 -111144 -44729 78950 96230 -8806 -100632
273a00632L7090J21020M5158r0279j02181J5120J09262O5573o4999j11052r007
284h4927J00393P7103m1755j07170l4305Q5247Q9959k1075j00867n2768O4392
295b5773R8610O32r4052o3316M3242R5250K6523q1325p9769K7584R2291L8951
307G8848o0466q5875K288Q8617N5639m8011q5412j5105P4906O7351k8143q4470
319c9833l1783O0226P5623r397q1238m3778M6788P4212J0641o9828n9826L1595
331c6598P8512K0629n8107o2241J0759P3119L8909m7386o8361j315O5137M7682
343F0739l1128o9356j6584N6206N5729j6158o8015k8946M6252N8751k789n8924
355a4223m1925L2358O3590R638n4372m5633J9125N9081K4021m3837n3549P282
$$ plain form
273 -100632 -63542 57478 102636 12357 -89824 -74704 34558 100131 35132 -75920 -84927
284 -84927 15466 92569 50814 -56356 -90661 -5414 84545 63470 -37397 -90165 -25773
295 -25773 72837 73469 -20583 -83899 -40657 54593 81116 -209 -79978 -52394 39897 78848
307 78848 18382 -67493 -65205 23412 79051 31040 -54372 -69477 5429 72780 44637 -39833
319 -39833 -71616 -11390 64233 54836 -26402 -70180 -23392 50820 61461 -8367 -68193 -36598
331 -36598 41914 62543 4436 -57805 -47046 26073 64982 17596 -50765 -52080 13057 60739
343 60739 29611 -39745 -56329 -123 55606 39448 -28567 -57513 -11261 47490 44701 -14223
355 -14223 -56148 -23790 39800 49438 -4934 -50567 -31442 27639 51660 7823 -45726 -38444
367c8444N6341L2269l3157n4503n312M9790L9524j9991n5058j7455M3402M5156
379D2562j0867n0432k6146L1810M9081K025m8086l3060K3491M7714J1843l9552
391C83m0104J2156M8304K0132l2752m2134K356M2633K8323k2753m4361p869L8702
404C016L3733j4657m2782j5171L0754L7187m660m0326k3276K4521L8401L312l5028
417d976k8538J5355L8991J1554l0708l1707P380L6367J8313k3121l4884n98L4029
430G457K3492j6879l4456q228K9236K7889r614l3502j4174K3032L0197j667l1457
443h674j9609J7351L0819N177k7505k4182J0912L0539J1046k2661k6790M476K9310
456A0209J5447j7548k7334k333K5517K0701j1988k8042p586K1601K3082m880k7159
$$ plain form
367 -38444 17897 50166 17009 -37494 -42806 6984 46508 26517 -28541 -45996 -2594 42562
379 42562 31695 -18737 -44883 -13073 36008 38033 -10053 -43113 -19622 28092 39935 383
391 383 -39721 -27565 20739 40871 8119 -34015 -31659 10974 39297 16544 -27817 -35686 3016
404 3016 36749 22092 -20690 -35861 -5107 32080 27420 -12906 -36182 -11661 26740 30052 -4976
417 -4976 -33514 -18159 20832 32386 1678 -30029 -22649 13718 32031 8910 -25974 -26572 7457
430 7457 30949 14070 -20386 -28614 622 28511 18897 -14605 -28779 -5747 24450 22783 -8674
443 -8674 -28283 -10932 19887 25064 -2441 -26623 -15711 14828 25874 3213 -23577 -19101 10209
456 10209 25656 8108 -19226 -21559 3958 24659 12671 -15371 -22957 -1356 21726 16846 -10313
469a0313j3288J7861K4664l6k4065j7247J2161K5629N213k1448j9907P226K4373
482A0823J0366j7612k1783J817K2615J4274j2268k3290k863J9941J7340p670k2807
495a1117p924J6815J9754l561k1227j1322J1934K1224J603j9369j4837Q781K0385
508A1139N781j6188j6944M437J9480R304j2742j8200J41J7919J2100q786j8583
521a1142l933J5522J4683n233j7784p316J2378J5905p48j7215j0442R815J6308
534A0798K438j4820j2452N608J6719N507j2414j4139K592J5372Q457r136j5099
547a0569j337J4501J0706o620j4870m185J1797J2530l417j4266o396R250J3044
560A0168q0j3132q952O609J3727K478j1780j0020L718J3570M795r541j1580J428
$$ plain form
469 -10313 -23601 -5740 18924 18888 -5177 -22424 -10263 15366 20579 -869 -20776 -13550 10823
482 10823 21189 3577 -18206 -16389 6226 20500 8232 -15058 -17921 2020 19360 11690 -11117
495 -11117 -19041 -2226 17528 13967 -7260 -18582 -6648 14576 16179 -3190 -18027 -9246 11139
508 11139 16920 732 -16212 -11775 7705 17009 4267 -13933 -13792 4127 16227 7441 -11142
521 -11142 -15075 447 15130 9897 -7887 -15203 -2825 13080 12332 -4883 -15325 -5510 10798
534 10798 13236 -1584 -14036 -8428 8291 13798 1384 -12755 -10163 5209 13666 4530 -10569
547 -10569 -11906 2595 13301 6681 -8189 -12374 -577 11953 8536 -5730 -12126 -2876 10168
560 10168 10088 -3044 -11996 -5387 8340 10818 -962 -10982 -7264 6306 11101 1560 -10020 -8592
574h592J2559P319p045j2314j740J1211R319m945j2634l261R239J0511k251j1753
588d377o252P518J1453n0j0746p232N083J1392K436r121q701K241J1004M838p280
603B206j0105O69R854O878n747j0204j700Q739P776l125r955l781P082R045j262
618F370r483n508N577R531P27q518o785L634R435K765p021q231K033R063M566
633H155n995q486k84Q761N148m050q101j979O663P100k240q717k945N649P366
648F045n7p914n550N037P527J319o722o182K346Q104K425n692o547P37P512M572
664F960n148o885n96O724N166k648p677k294O078N755j029p081l426M252O789
679D940r9o126m188K258P542J065n540m919J371O204L323m880n722L80N861L759
$$ plain form
574 -8592 3967 11286 4241 -8073 -9813 1398 10717 5772 -6862 -10123 -884 9627 7376 -4377
588 -4377 -10629 -3111 8342 8292 -2454 -9686 -4603 6789 9225 104 -8597 -6356 4648 9486 2206
603 2206 -7899 -7230 2624 9502 3755 -6449 -8149 590 8366 5241 -4714 -8495 -1413 7632 6370
618 6370 -3113 -8621 -3044 6487 7214 -1304 -8089 -4455 4980 7745 724 -7507 -5474 3589 8155
633 8155 2160 -6326 -6610 2151 7299 3249 -4852 -6831 -168 6932 4692 -4025 -6970 -1321 6045
648 6045 5988 -1926 -7476 -2439 5088 6407 -315 -6497 -4151 3953 6378 686 -5861 -5124 2388 6960
664 6960 1812 -5073 -5669 1055 6221 3573 -4104 -6398 -320 5435 4406 -2675 -6101 -1849 4940
679 4940 4841 -1285 -5473 -3215 4327 5392 -148 -5067 -3696 2508 5831 951 -4771 -4391 1470 5229
695E229k683o614j050N756M379k361n617k041M288N529j009n739l140L182N697
710C806N91n579l963K461N775J289m055n021J556N548J997l239n058n1N160L770
726D987l067n197o15M026M498j534n722j422L230M667m46m911k823K840M854K71
742C636l982l761J516N362Q17l341l865J47N111K660k996m894K70M260K904j683
758B161m946j110M125L592r38m841j960K987M207n4m566k458K162M361Q32m079
774e25l379J816L981J760l191m013R64M008J979k043l979l53L527L015j710l556
790a699j793L058L912p60m308j749K326L872j01l693k482J821L646Q60k816l359
806c265Q86M191J465k567l426%L654K365j757l661n98L231K271j060l256j471
$$ plain form
695 5229 2546 -4068 -5118 638 5017 2656 -2961 -5002 -714 4815 3806 -1933 -5073 -1891 3806
710 3806 4397 -1182 -5145 -2684 3091 4380 325 -4696 -3140 2408 4405 1166 -3892 -3943 1217 4987
726 4987 1920 -3277 -3892 134 4632 3098 -2624 -4046 -816 3851 3405 -1506 -4329 -1489 3365 3636
742 3636 -346 -4107 -2591 2771 3588 247 -3618 -3471 1640 4300 1304 -3590 -3320 940 3844 2161
758 2161 -2785 -3895 230 3822 2884 -1957 -3917 -930 3277 3223 -1343 -3801 -1639 2722 3554 -525
774 -525 -3904 -2088 1893 3653 462 -3551 -2587 1421 3400 1357 -2622 -2975 552 3567 1857 -1699
790 -1699 -3492 -434 3478 2718 -1590 -3339 -1013 2859 2758 -935 -3417 -1596 2050 2910 94 -3265
806 -3265 -2379 1812 3277 710 -2716 -2716 938 3303 1546 -2115 -2713 518 2789 1729 -1527 -2998
822b998K709L107m30l475k159J901L786L48l207k119Q18L364J301k871k746P28
838a943L141J760j909l471J46K541K592j539l244p72K817K619q63l197j494K128
854f88L222m05k848j707J370K910L48k454k306J091K985R74k162k543j23L193
870H57K061k103k791j15K418K041p84k886j041J975K542k70k985j591K077K550
886A955N4k481k292J485K826P23k002k405L12K793J365k222j800k28K364J848
902B295j312k782l45K105K189o58k529j015J327K465K03k669j273R18K373N75
918A867j980k071R17K541Q81j977j828N6K169J567j633k240oK374J224r89k531
935a659l72J886J913P8k461j341J865J829j75j952j626J055J863O30j412j987
$$ plain form
822 -2998 -289 2818 2388 -1087 -3246 -1345 2441 2789 -418 -2537 -1719 1645 2946 75 -2671 -1943
838 -1943 1198 2958 1049 -2422 -2276 265 2857 1318 -1926 -2698 119 2738 1875 -1322 -2816 -688
854 -688 2534 2129 -719 -2426 -1056 1854 2202 -252 -2558 -1467 1518 2492 330 -2213 -2336 857
870 857 2918 815 -1976 -2091 327 2368 1584 -1302 -2343 -368 2174 1904 -1081 -2672 -595 1955
886 1955 2009 -472 -2764 -1279 1547 2270 268 -2137 -1825 968 2333 111 -1689 -1917 447 2295
902 2295 983 -1799 -2144 -39 2150 1492 -1037 -2052 -725 1740 1943 -726 -1999 -1081 1292 1867
918 1867 -113 -2184 -1267 1274 2155 178 -1650 -1594 575 2142 509 -1731 -1737 637 1861 872 -1659
935 -1659 -2031 -145 1768 1846 -615 -1956 -91 1738 1563 -389 -2015 -960 903 1533 121 -1866
951a866R14J718R84j440j826L5J808J465r77j904k95J600J438n55k063m97Q93
968e68J891K72j885j615J131J997J43j522j615P42J876P70j390j689q4K147J015
985A616j028k002pK054N99m61j889m4J190J613n71j658r09R58J906j32j501j486
1003a752J103J837J87j396j265M14J426Q38r32j884n9J685J110p12j623K0J258
1020B55J062p43j372n65J436J177l07j676p28J159J305J62j368j010P17J450K86
1037A240j197j619Q09J246R15j490j020j12J482J128r70j448k32J096J572m85
1053I15j538o44J225J221l9j616j017R82J497J71j343q12j0J905N69j282j217
1070a033K13J533O68r08j367m81J693Q81l40j879r4O73J922o78j381o20O99J769
$$ plain form
951 -1866 -952 766 1750 310 -1516 -1481 327 1792 815 -1089 -1384 216 1654 1099 -964 -1461 -568
968 -568 1323 1595 -290 -1905 -774 1223 1366 -156 -1771 -1029 847 1617 227 -1462 -1546 601 1616
985 1616 588 -1414 -1421 633 1232 771 -1118 -1162 28 1641 1070 -588 -1497 -539 1367 1235 -266 -1752
1003 -1752 -649 1188 1375 -21 -1286 -872 554 1392 460 -1424 -1483 202 1312 600 -1023 -1003 255
1020 255 1317 574 -798 -1363 73 1250 943 -733 -1461 -302 1003 1165 -203 -1213 -496 954 1240
1037 1240 43 -1576 -767 479 1394 -96 -1116 -1228 254 1382 412 -1036 -1268 -172 1400 915
1053 915 -623 -1267 -42 1179 1140 -476 -1493 -511 986 1157 -186 -998 -1008 897 1466 184 -1033
1070 -1033 -820 713 1381 473 -894 -1375 318 1199 859 -1020 -1114 -441 1481 803 -578 -1198 -499 1270
1088A270m07q64r76M42R00N43j125q99N77J191N55j186q24N7J308Q10j023j306
1106i57j6J056Q44l74j107p12J235R45k18q65r45Q54J070K44j122r83L09J591
1124H49J24o44j289J77J308M89o62r07k19P35J020l59j045m17P81R74l62r31j48
1143e26K24Q90J97r08r47M98J075K13q54q76L23J470P6o78j082J55J183O37n44
1162E26j210J02P95P68k93j166J4O05N66M7j100m54K42J186J69q28o93M44R11
1181F31L15p31j003J11J035L71m79p93j8P42K27J02j190j82R53N18l78o81l92
1200h42O72P55j9o57m98O2Q49L22p37j044P49Q32j28j95q73jJ177O5k82o82l40
1221h15J273M0r6p13k77N83P31l9r74l29P17N50r0o01q35L71R01L33p13o87K15
$$ plain form
1088 1270 863 -1 -977 -535 365 908 -217 -1116 -539 652 1207 21 -803 -746 562 1372 349 -957
1106 -957 -973 83 927 553 -554 -1266 -31 914 696 -169 -1114 -260 810 1054 -68 -1051 -742 849
1124 849 973 329 -960 -783 525 1014 352 -555 -774 -39 981 622 -423 -840 -59 915 553 -378 -526
1143 -526 -302 588 785 -123 -1070 -572 503 716 -138 -1014 -691 779 855 177 -905 -750 433 1070 526
1162 526 -684 -582 213 981 688 -478 -464 141 707 754 -346 -800 -558 628 797 -31 -724 -280 631
1181 631 946 215 -788 -677 358 729 250 -543 -561 181 408 510 -680 -862 91 609 231 -450 -842
1200 -842 -170 585 566 -91 -589 -527 322 644 -93 -1137 -388 444 316 121 -752 -753 424 489 207 -475 -815
1221 -815 458 498 402 -311 -588 -5 726 687 -287 -616 101 651 561 -40 -875 -504 397 730 17 -670 -455
1242d55J008Jn85m06j93Q74N31k35j011j90Q00L54J9j054rP70N66k90o15n98L77
1263c41P71k4m85n69K69M14O48l52j052j53J088L23l06o05m5N83L21l3n50m20
1283e18L25O34k07l12p34L45P65On05l42R0P11N62p07p53M07L83L80o01l46M19
1304BJ59K86l13m78k33Q05P18n18m10k58J38N47l40j79p50N72L64L19n00n19N57
1325c1M33j62oo99K46M89L10m13n23k38P70K74k41m31j23L57N44l57m04k91K19
1346b77P44p6p36j75N48j0L17m32k30O0M57N6k24n04K38Q99m77O8n47J58L65J67
1368C89j16o74O0L57K06J07p73JJ99L81R1l69k47M23Q2K28m21l08L04L01K77j77
1390C21p84K12M01K35k97m11J72J90N96l53l59l34L55J62K47o29l17N10K49K60
$$ plain form
1242 -455 553 554 -31 -437 -630 244 775 540 -471 -661 139 493 512 -542 -551 219 785 495 -120 -718 -341
1263 -341 430 406 -79 -648 -379 35 683 331 -721 -874 214 537 231 -374 -419 164 485 452 -98 -518
1283 -518 -193 441 234 -78 -812 -467 298 304 -201 -543 -453 258 820 113 -640 -233 150 530 -71 -417 2
1304 2 161 447 134 -344 -577 228 946 428 18 -240 -102 445 105 -74 -824 -252 112 431 -69 -588 -31
1325 -31 402 240 234 -465 -219 270 580 167 -356 -594 176 450 209 -222 -345 12 556 199 -205 -496 -277
1346 -277 467 391 -345 -520 28 18 335 -97 -327 -267 190 246 22 -482 -244 655 178 246 -301 -143 222 389
1368 389 273 -401 -341 16 222 329 -444 -443 -244 137 228 -141 -388 35 117 345 -76 -384 -80 221 498 321
1390 321 -463 -251 150 385 88 -323 -151 39 635 282 -77 -411 -56 106 353 -276 -593 -83 166 426
1410D26l31l92N7O78j09l62l50K74K65J00k3j77p09R88k1l83L9k23O2K89R8k25
1432b9n08K51N80Km76k58M45J02pk85k02K70K05L83m06m49J93K91N00n12o1l43
1454c14K36L96J55n79K65l25N03q3K4p71M86P9J08l28j27K27K55l4k54j39j75
1475c95M36j99J72q8k0J38L58l91K1j29J2J82O5j91l78M38Q0J2l70L05j01L2O95
1498F84q18l35P5P25M5m18l93K68M19J87o68J68m69M59N57j08l71q8j7M62p7o83
1520c96K16K96K84m25L4q3k25L76M67k72o83K13J24M38p8n80K80K75J29k63j56
1541b9LJ16J77k01J4n6N1J85J35m06j45L4L24J36n54N5J47O92o55L08n59PK81
1564F0J99r4n63J91Q6L75m3l87O1P1K24p7k95J5L31K66q2m45J70L7k2M4J58l08
$$ plain form
1410 426 95 -297 -240 438 329 -33 -383 -109 156 256 233 56 -653 335 314 -69 -30 -253 -191 98 196 -29
1432 -29 -537 -286 294 296 -180 -438 7 109 102 -183 -385 -115 90 473 67 -382 -189 102 602 90 29 -314
1454 -314 -78 318 473 -106 159 -166 337 254 278 -493 -7 72 180 -148 -275 -48 207 173 -81 -220 -395
1475 -395 41 -158 14 -74 -94 44 402 11 32 -97 -85 97 162 -29 -407 31 111 123 -247 58 -43 -11 684
1498 684 -134 -469 -394 331 376 -42 -435 -167 252 439 -229 -61 -530 -71 486 378 7 -81 -98 364 287 -396
1520 -396 -180 116 400 -25 9 -74 -299 77 544 272 -411 -198 -74 364 286 -294 -14 261 390 127 -29
1541 -29 -26 90 267 66 80 24 75 260 395 -11 -156 -122 202 338 -216 -161 -14 678 23 331 -228 -221 60
1564 60 259 165 -398 -207 -121 254 211 -176 -115 -44 180 103 -192 -177 154 420 338 -107 63 100 78 122 280 -28
1588b8j76L17L64p00M4L80k24K23m5l75j68O02R2k70m54L36j96N58j30l41o2j92
1610d45N14L81l72r1k6N07k91j48k83J17L01m0l8j93p6K00L24k22m33J18O2oN7
1633h3J11l62J54M01k4k71m84N23Q3J46k22k50o4k0L78R8L0j99K91k01k69j93
1655d27j6N37j65P0j23r8M40j24nL4k44o6N10o2j12m61K44L53l50L01l35J51K09
1678B61j24k80J30r1J77o6K18n65Q2K24M20k71km08M58oJ40j32k95L54J30k12
1700A42j18r4k58M77m1l05o0L46O6m5k77K52n04L93J41j21J18k87M59m74M32m13
1722a71q3R4L28j67n9n2L06l48M19k8l79K44q8L88n16m5J41K9%Jk7p0K2o9R7j03
1748a36L97l15J0j3k74M89k96L26Rr5k20L54J46k67l99L38O1J41j05k99M3J51
$$ plain form
1588 -28 -204 113 477 -223 -179 201 -23 200 155 -220 -388 214 306 36 -418 -82 -278 280 150 -191 -253 -445
1610 -445 69 450 78 -13 -39 468 177 29 -254 -137 164 124 86 -107 -183 17 341 119 -314 -196 -134 -140 -83
1633 -83 28 -334 -180 221 197 -74 -558 -35 48 194 -28 -278 -342 -362 16 114 144 -55 236 35 -234 -427
1655 -427 -443 94 -71 -1 -124 -222 218 94 89 123 -121 -187 323 261 149 -312 -68 285 -65 236 -99 52 261
1678 261 137 -143 -13 -104 73 7 225 -340 -258 -34 386 115 113 -295 163 157 297 165 -130 224 354 142
1700 142 24 -70 -328 149 108 -197 -257 89 155 110 -167 85 -419 -26 115 -6 112 -175 284 -190 242 -171
1722 -171 -254 -160 168 1 -58 -110 196 -152 267 239 -140 104 16 404 -112 -157 -16 13 13 14 -13 -83 -61 -130 -33 -136
1748 -136 261 -54 -44 -57 -331 158 -138 188 197 102 -118 236 382 115 -284 54 115 256 151 -148 -105 46
1770D6J91O6m49n5J16L83k56k23r9M53j86M48n92l5k4J86K11j91l53L83O4L15
1792C99o00K60N9k51J72O8O0j54k94L12k84K43K6n8Q3o9J42l27N3K0L58k74K62
1815B06l84l7L48k35L51m79L38j2k41J74k69N8j2J27%L9J12oM5k04K41j41l17
1838b98N83m29K59k5J47k35J21l7j08O5N0k10j31K69o8j47J98K69k42K5M11l92
1860G5J17j18q3N7J42k13Q8j25K95m47J94k09J08O9K75k19l2l7K45m49L24k20
1882a63K67l69M76J80m27j47L05N5n7j83m6l23M02K48l04n9J10R4LJ3J6j57j35
1905b01K66J01k09j66m1M37k25J21j88K62p5l60J87m8L37m1K1k3m39J77J57J79
1927B29j45L34k46j82K2k7K93j33j05J85j43m2N07o73o2M14m56J96p2p5R5j96
$$ plain form
1770 46 237 303 -146 -201 -85 298 42 -181 -280 173 -13 435 -157 -192 -216 -30 181 -10 -363 20 84 399
1792 399 -201 59 118 -133 39 107 167 13 -281 31 -253 -10 16 -42 41 -28 114 -213 -160 -140 218 -56 206
1815 206 -178 -215 133 -102 249 -230 108 96 -145 29 -240 -182 -194 -67 -67 -28 84 78 123 -81 160 19 -298
1838 -298 285 -144 115 90 237 2 123 86 -22 43 93 -117 -248 21 -47 -194 4 273 31 56 467 75
1860 75 192 74 -9 48 190 -23 65 -60 235 -212 -18 -227 -119 -50 225 6 -26 -63 182 -267 57 -163
1882 -163 104 -265 211 391 -36 -183 122 177 120 -63 -109 -432 -30 218 -86 -145 -35 59 62 75 91 -66 -201
1905 -201 65 166 -43 -209 -250 187 -38 83 -105 157 82 -278 -91 -139 198 157 178 155 -284 -107 50 229
1927 229 84 418 172 -10 12 -15 278 145 40 225 82 40 547 -126 -188 226 -230 -34 -106 -181 -86 -282
1949b82K63o7o6K83o8J1l42M73j64J9j71K47j22K5L5k2l33L68J4P5k42j76N7L75
1973A90l40r9L8k77N43N5J30l61j05K45n6J24L8l39J26L9J71O0j47K18k65Qk6
1996c0O2M5k12J06p1O8r8J18J65j7j82j9K4K36n12M51k94K09K13k97J55K1q5J18
2020A74n8j96K31Nl41M3K87J29k90q6j6K98m49L33k21M65m25K6r8K12q5j48j5
2043b25J39K81L1l01K5J22O8L2N0j13q5J3K41l10l63M33KL7N9k38L16m21M31o7
2067A57k22J82j64J29j34P8j3j57L17l09L04r6j27o1L57l52K27p3k53M99k67P3
2089I5J48l38K37k57N5j19K54K0r2n8j1jj1o2L41L3j42K1O2q7p9j6J54l63K64
2114D8n4r1Q2p2K85q8n31N76k11q8J21k8m22N37J02j71L16o42L98m85L31K89k6
$$ plain form
1949 -282 -19 -86 -152 131 63 74 -268 205 41 60 -111 136 14 39 74 52 -281 87 101 176 -66 -242 -185 190
1973 190 -150 -249 -211 -488 55 110 240 -121 -226 19 -37 87 125 -214 -88 -49 122 182 35 253 -12 -4 -30
1996 -30 32 77 -135 -29 -100 -32 -130 -12 153 136 -46 -65 -41 195 -317 134 -160 49 262 -35 120 141 56 174
2020 174 116 -80 151 156 -185 -142 145 274 -16 -102 -118 180 -269 64 -157 308 -117 -91 -189 23 -62 -210 -225
2043 -225 -86 195 226 -75 -50 72 140 172 222 109 24 37 278 -32 -395 38 40 77 136 -102 214 -207 224 157
2067 157 -65 117 -47 82 -52 26 13 -144 173 -136 168 72 -55 -116 241 -111 116 43 -210 289 22 95
2089 95 243 -95 142 -115 -60 -179 75 95 3 -55 -66 -67 -78 -140 201 234 92 113 175 88 9 -7 147 -216 48
2114 48 -6 -97 -15 -87 198 110 -421 155 -56 -144 -23 -51 -473 64 166 -5 311 -331 67 -418 -87 202 176
2137A76l60J03K0K11m6Q1l9k60K84r9l20J38k91Q27o68M71m38Q3j8r5J39j44M52
2160B07k59j22m3K31J79l06j69K10k4K13k41J88j84J98O4r7j7J05N3l42R4J03
2182D1k95K48j01J51r1P8K7K44l1n94N12l47L06m74M55J39L3k59j49K24l20N75
2204C72j68j07K34l76J66p2L8R7k18k82K90j24K84o2N0l0M3k8k09n4K0J05j76
2227b07L90l59j29M34q8J2M3j89R0k44J5L79k59J8j05J74Or5K62j76J06l8j05
2250f5K28l1k90p8K33j36O5k26L00j28J14K62j64q8K56p1j13j5K4k86Pk55N29
2273G2N3k58L73k78m96Q36o66L71k6L33l58P3J00l23K37MK46l33J76l5m37K26
2295a10K50p9k73M29k85K17j54P5j17m6J73j77N9j2o1k49O18j64p7r6r9J46M6
$$ plain form
2137 176 -184 -81 -61 150 104 185 146 -114 170 71 -249 -111 -402 425 -243 228 -210 -127 -145 -240 -101 -245 207
2160 207 -52 -174 -217 14 193 -113 -282 -72 -96 117 -124 64 -120 78 142 45 28 133 186 -156 -62 41
2182 41 -254 -6 -107 44 -47 31 58 302 271 -323 189 -158 148 -326 129 268 301 42 -107 117 -203 372
2204 372 204 97 331 -45 121 49 87 184 -34 -316 -26 -150 134 72 122 92 135 107 -102 -156 -136 -31 -207
2227 -207 183 -176 -305 129 41 53 96 -93 -3 -247 -232 147 -112 -94 -199 -25 -19 -114 148 -28 78 40 -65
2250 -65 163 132 -158 -236 -3 -139 -74 -300 0 -128 -14 248 84 -4 252 181 68 53 77 -209 -202 -457 72
2273 72 125 -133 240 -38 -534 302 -364 7 -19 314 -44 29 129 -194 43 47 293 -40 136 101 -336 -110
2295 -110 140 61 -212 217 -68 149 -5 70 -47 -93 80 -97 -38 -50 -111 -360 258 94 17 -79 -178 -32 14
2318A4j00J5K42k50J12j65L61p7J05p9n50M63k85M03k32n1P3k3j83J71J24Rj40
2341d3J83k57K76j31k41K81j07n9k5j85K74K49j51m7k34K94l08L32Q3p5O8J55
2363C32j75j46P8J46k39K5j56oK55j57L1J27k43nM95m30J31J86R8k02n6r2n8p8
2387a39pj2J44J21n7K5J62k03j18K10k81j19N63j75O0j91J44J69o00K07J37N8
2409I8j79J30O5k60j9j30M23K06n02O3N9N11m57l7J49K1l83J89N6j17L2M57j08
2432B67l08M2J74j67J2m9j93K82M0k61Q1P9j64J59J35l5K6n2j41q6R0O0J45n5
2456H1k94L4J08M9J53o1j74j56J46N1j12L15j96K59m40j2K10k9K07k1k05M6M67
2479D26m44K71m51J21M16o71N88m44k27L43j32J68J87o1%J24l40P8j22j9J58J1
$$ plain form
2318 14 -86 -71 171 -79 33 -132 229 152 257 178 -372 91 -194 209 -23 -74 -1 -24 -207 -36 88 97 -43
2341 -43 140 -117 159 28 -213 68 -39 -98 -123 -308 -34 215 64 17 -217 77 -231 101 184 109 177 332
2363 332 157 11 89 235 -4 21 -135 -141 114 -43 -12 115 -128 -133 362 -68 63 249 347 145 89 -3 -61 -139
2387 -139 -146 -158 -14 107 50 75 237 34 -84 126 -155 -274 289 114 174 -17 127 296 -304 -97 40 98
2409 98 -81 49 114 -146 -165 -295 128 334 -168 -105 -46 465 8 -29 120 141 -242 -53 3 -114 -82 375 267
2432 267 -41 1 175 8 20 -29 -222 60 100 -161 -80 -1 -165 -6 129 94 120 68 -73 -159 -69 -9 136 81
2456 81 -213 -179 -71 -22 131 70 -104 -260 -114 -63 -175 140 -56 203 -237 -249 -39 -68 139 118 -87 -41 426
2479 426 -18 253 -198 -77 339 -332 256 -188 -415 -72 -204 -36 151 90 90 214 -126 -48 -170 -189 -31 -20
2501b0j47K20K02J36j99k8j99K78p0l57J78j28Q8M2J93j4m64M36k31M31R4l12
2523A29J78n22K36J81l60J4J85K24k56O2l5j12L31r5J5l14J38n7L0J50j77J75
2545A20k77J50q1L9MK86pk39o0M17k29l1O7j01o4o7J89N0ln38N92j59q8K9J31
2570A30k30K55j5r1k62L19l90K13J49J28q5j25k64L26p0k12q0N3N70n64N47l08
2592fl23J97J09j3o1J56r6j1r6J33K9j28K56j99l4J88k27L41l29K86m36L86Q5
2615B07k99M09m43O4m5k3k69N42m13L82l11L02m43K01J62m6j03m1L54q4p1r2j14
2638a74K77k2p5K4j67L18j18J06l72K37K75j31k52J36P9k13P9k24N00l98K68p3
2660H0k91K83j91m5M32l05j51M96l41m2j16L69n79M51Q2j55R9m8k6Lr3o3L37j43
$$ plain form
2501 -20 -167 53 255 391 192 164 -35 243 173 -184 -6 -134 -46 -4 189 175 -289 147 -84 347 441 129
2523 129 307 -215 21 202 -158 -144 41 265 9 71 36 -76 255 160 175 -139 -1 -58 -28 122 -55 120
2545 120 -157 -7 -88 -49 -45 241 234 -5 -65 352 123 92 159 58 -6 -73 116 166 163 -375 217 58 -30 -1 130
2570 130 -100 155 140 49 -213 106 -284 -71 78 206 121 -4 -268 58 -12 -224 -304 -251 319 -245 302 -6
2592 -6 -329 -132 -23 -36 -97 59 -37 -48 -144 -11 18 -110 146 -53 -87 101 -126 215 -114 172 -264 122 207
2615 207 -92 317 -126 -62 -107 -130 -399 143 -270 112 -199 103 -340 -139 23 -23 -126 -167 187 103 32 -60 -174
2638 -174 103 81 6 30 -137 181 63 169 -203 34 309 178 -74 62 141 -72 7 -217 283 -115 153 80
2660 80 -211 72 -119 -164 268 -37 -188 308 -33 -75 -191 178 -401 50 132 -23 76 28 2 5 -88 -151 186 43
2684D3l9o3L7n1L05o3k94J85J7j30K57j52j58L35m41O7K19j17Q5r5L0K30k54O9
2708B2K97n11J78N6M47n21k27O7J26K42l92K71j95Q3K35l65L80Q5o17L61Kq0J28
2731G2l47R9M91o22O36m21K52k64K49q1j08OP4J88l10j9q9K48j05l0M4k8j52q7
2755c04N47l51J94k06l3J66r7J90J56l89o8K92J6k91J23K98j92l18J45J21K2J64
2777A85j3k14R7k92J11O7J09j18J54k45J21K34m20J08LK7K94m01P1K49J45l22
2799e0L7Q3j4R2k38J36R2n3n49N26l01J05L14m50N11l19J13j02J21j72J63k6j03
2822h4J49j32M88j93j55j00j0J74n7j9N0o5K0Q6l59J38P3j10j21N70m43K6M1l69
2846d02N41k49L9k01M70j60Q1l51J91L1N9J53j99j42K9J62k31Q2K03l7K85j07
$$ plain form
2684 43 4 -59 -22 -73 232 169 -125 60 77 -53 204 52 -106 229 -212 -145 74 -43 42 -53 -23 207 -47 22
2708 22 319 -192 -14 42 489 -32 -259 -192 -66 176 -216 55 -140 -57 178 -187 193 278 -339 22 24 -56 72
2731 72 -275 -176 315 -307 329 -92 160 -104 145 64 -44 -38 36 224 -86 -105 -194 54 -51 -81 -37 -65 -217 -304
2755 -304 243 -108 86 -120 -153 13 -84 106 262 -127 -195 97 113 -178 -55 243 51 -267 -122 -1 21 185
2777 185 172 -42 55 -237 -126 -59 50 -68 86 -159 -38 196 -224 -116 -113 -86 208 -193 -122 127 272 -50
2799 -50 -13 70 56 148 -90 46 138 85 -464 62 -239 -134 180 -270 241 -78 35 -67 54 -118 45 19 -84
2822 -84 65 -67 421 228 73 -27 -37 137 80 61 111 46 66 152 -207 -69 4 -106 -227 343 -100 -74 -33 -402
2846 -402 139 -110 -71 -272 198 38 119 -232 -41 -10 49 202 3 -139 -110 52 -179 -97 106 69 354 247
2868B47m94J50K33m34R8JM8M85j82l02O7J36j81L25n7k14j86L87j48k48K34j71
2890b06K63o4p7K01P1k76p9L70k13J44k99N7L01p1k08P8K64l79K10L5k49J64J73
2913B10k04o3n4K30p0o0P6k10j17K37O4R3Q3j87J39k25j53K91o3J21j82J63M9
2936A68k5k76M5L02k25J07J58l89K39j00j87K55j20K86k38j84J89j14R2o9J33
2957D7J6j34K98k40J02j16L83k99K33m68r2L44j28K81k05j19j72J99K75n9l43
2978a97J00k21J22J86Lj11p3j13J45K7L44j92J80k26L51o58M39l26L2K77o2j85
3000a58k53O16j78n5j91J22K82k80K74j80m08M74M5k14J57L9N0k49k4j32O95m27
3022Erj2N6k14K50j21n4j48M19k5k27M61j95K2l11J25k8k06K72P5lJ09k60j6j61
$$ plain form
2868 247 -247 -97 136 -298 -200 -199 -151 334 152 -150 -83 53 -128 197 140 -74 -260 127 -21 -269 -35 -206
2890 -206 57 -7 -84 117 188 -88 -167 203 -10 134 -165 -108 193 122 -86 -8 256 -123 87 122 -127 37 210
2913 210 6 -57 -111 119 49 -11 65 -145 -262 -25 39 132 215 28 167 -58 -211 80 17 138 -44 119 168
2936 168 143 -133 -88 214 -11 96 254 -135 104 4 -183 72 -48 238 0 -184 5 -109 -17 -86 47
2957 47 63 -71 227 -13 89 -27 356 57 290 -178 -270 74 -54 227 22 -97 -269 -70 205 146 -197
2978 -197 -97 -318 -196 -10 -7 -118 -191 -304 -159 -132 212 20 200 -26 325 -333 106 -220 -188 89 27 -158
3000 -158 -411 205 27 -28 -219 -97 185 -95 179 -1 -409 65 110 -104 53 92 142 -107 -131 -263 432 5
3022 5 -4 -16 40 -174 76 -45 -99 -247 172 147 -80 381 186 208 -103 22 -6 -212 60 135 132 241 -19 -35 -196
3047a96N27m95L95m01J38K25m69K45K16l4j92J79j96J93K26m33Q2k1p1q6p0N13
3069B75k15l4n0j06M91k41l43M00k66n2j51L17j62J4K50l91L60p3j18j31L37l28
3091b17L19K01l27J6j44J93j68J01J95j66Q2j50K4J6J18l27N29j53j76J7q0k4
3113a21P8M25j24m64K74K53k28j73M91l64J88k28J25k75L26j88j3K47j17m74O46
3134B84j58l3j4j36K44m35N92k60K7J70n82K7L94j54RJ05J29l9l85J43L0J62m32
3157c12N62l34J12k01J69j00J56k9q9J24j60L32j20pk37Q7k85M66j7j34k42L84
3179A25k59K16k61P5LJ48L1Kj13q5J4L14j09n14L69k33L20l5m4n4K90j91R2o0
3203D1j73r0M40k61R7m0K22j87J14j56q8l4K06k46J78L30l11j00k36K97J89j84
$$ plain form
3047 -196 331 -164 231 -170 -32 193 -276 -31 185 151 -41 138 -58 135 361 -72 10 -11 -82 -168 -238 275
3069 275 60 26 -24 -130 361 120 -223 177 -89 -141 -292 25 -137 -123 127 -264 96 23 -95 -226 111 -217
3091 -217 102 303 -24 -8 -152 41 -127 -26 169 3 85 -65 -41 -25 93 -234 295 142 -34 -17 -97 -121
3113 -121 -43 382 258 -206 68 321 93 -80 411 47 235 7 132 -143 183 -5 -18 229 112 -362 284
3134 284 126 93 79 -57 187 -248 344 84 111 281 -301 -274 120 -34 -25 80 209 170 -215 -72 -42 120 -312
3157 -312 250 -84 28 -173 -4 -104 52 23 -66 58 -102 230 110 103 -134 -47 -332 134 117 -17 -259 125
3179 125 -134 82 -179 -104 -101 47 78 80 -33 -118 -104 210 101 -413 -44 -277 43 8 -36 -90 200 9 101 41
3203 41 -132 -222 218 -43 54 14 236 49 163 7 -81 -115 91 -155 23 353 42 -58 -294 3 192 8
3225HK66n12M49j42p9k7O0J4J86j75n6J36k17l9K70l6k57L84j35k05N3j54kM04
3249A94j69J50k27j6j25K51k65j5oM4Q8K4J29O3k20O0J16k09j02K90p8P5p8J47
3273A21j72K73j71L5m2k6J76q5j19NJ45m20J28M95n77J86J29J49k61r8P5L4l13
3296c33K86j50Q3k44L41j24j15M85j93k24K93J0j61J39j27M09k01k08k19K67k87
3317b73M85q01L27L00P0j42J39j67k1P0J03j60j28O4L9q5M6L16l30K55k84J11
3339f6Q4O3l71K05M1PK35l83K45k96L06r0k68O16m70L35n6j70k42N26o85N95J35
3362B96k92K29o8j6n05J23L2K85j07n28M88K50l54j85K27K35k4K35n85L23Q3m2
3384A00n3L4J67l65J92j26K53k30n1K13J96k85p7L1q1L32k90J48J85J7k98QK90
$$ plain form
3225 8 274 -238 211 69 -10 -37 23 37 223 48 -8 128 -89 -128 142 106 -151 233 98 -107 -54 -208 -210 194
3249 194 25 175 -52 -68 -193 58 -207 -222 -228 -184 -96 -72 57 120 -100 -40 76 -133 -235 55 -23 52 -26 121
3273 121 -51 222 51 86 44 18 194 109 -10 -5 140 -280 -152 343 -234 -48 81 230 -31 -129 -54 -20 -333
3296 -333 -47 -197 -114 -358 -17 -141 -256 229 36 -188 105 115 -46 93 -34 375 174 -34 -253 14 -273
3317 -273 212 -589 -262 38 108 -34 105 -62 -83 -13 90 -70 -198 -134 -95 -180 -134 182 -148 107 -177 -66
3339 -66 18 81 -290 -85 -44 -37 198 -185 60 -236 70 -20 -288 328 -142 193 137 -33 -275 251 -434 161 296
3362 296 4 233 165 149 -356 -233 -201 84 -23 -551 -63 187 -167 -352 -125 110 86 321 -264 59 142 100
3384 100 47 81 248 -117 75 -51 202 -28 -79 134 330 45 -32 -1 -82 250 -40 108 293 310 12 20 310
3407C10m47J10m9K5J66J62j99j33R6L10l64L03m89L72k81j59M99o4o1n8o3L87
3429C73m16p4J76Q3l4k48K01L6Lj22q2K12o0q1k6J91j95O0L93l99Q0n3k98J14
3453a66N0K54Lm60N18K2j05J4j13J82k16j30M99n65L03m1LJ23j28J19m64j1L07
3476bJ91n45L56K9P4j15r7mJ74j11L88k95k12J50n5J14q9J34N5K96l21k06J11
3499B0J43l02J12J67P5k02J04Qj9R7j36j71k8K43%p7j95k97N09J99r9m7m77K93
3523h0j78M07m2JPR6k54K01m59J78J4j5l7P2P2oQ7m0J69J42k35k66J25R9qK4j00
3550b6J17q7M60k72k50p6J36M46l34J7j82P5l34L99k18j07M31j80L52k46k38K23
3572A06l97Q6M10j74j65L5l42L92K20l99K68J55j94J50Ml88K57p1K96k98n9J71
$$ plain form
3407 310 -137 -27 -76 -51 115 277 78 -55 41 351 -13 290 -199 173 -108 -267 232 168 107 49 -14 373
3429 373 -43 -117 59 142 108 -140 61 97 100 -22 -104 108 48 -33 -59 132 -63 -3 390 -9 71 18 -280 -166
3453 -166 -116 138 141 -319 199 221 116 130 17 199 -17 -147 352 -213 90 49 52 175 47 166 -298 -309 -2
3476 -2 189 -356 0 29 103 -12 -109 -113 61 -50 338 43 -169 -19 -74 40 -49 85 140 436 115 -91 20
3499 20 163 -139 -27 140 215 13 117 125 106 203 67 -104 -132 111 111 34 -161 -458 51 250 151 104 -373 -80
3523 -80 -258 149 107 108 115 211 -43 158 -301 -123 -109 -124 -161 -89 -17 -23 64 24 193 335 100 -166 -41 58 50 74 -26
3550 -26 91 4 464 192 -58 -134 2 448 114 131 -51 24 -310 89 -129 -236 195 15 367 121 -117 106
3572 106 -291 -205 205 31 -134 -99 -441 -49 171 -228 40 195 1 151 155 -233 24 -47 249 -49 -108 63
3594F3M2j67k66N61m13p8K98J16l22O9L90l13J26nk81J09L80o29M15l29L12j27
3616d9J3k2J27L86n44q9J71j84K16K90j40M2l79M37K92o00K17k15n6J90j66L16
3638B53l36P6O4k60j1L57n7k50J58k28L79k82K61k39Q2J8j53L12l1Q5q1j40J61
3661A38k58M3j4J91j14J15l38K56l0j29J32J59j67q8Q5k36R7K40j08J0K01m04
3683b19J53L8K32l49Q9j40L21l25j33M46m40M75NL9k06O4K31k90J84j57k9j15
3705a26o9N9K79m5j99J20k11K61j22J49k00L6J7K13k82j48K19o7Oj7M49j90l10
3728a78K21k06N19m02J29j31P9nJ94j77Q0k85M62l36K42k91K06k26j04J41M54
3749C86k36N2j48j5J06k08o0n1K44l00M20j19j14J85J5o9l15o6L5M65n31O44Q5
$$ plain form
3594 63 105 -62 -328 233 -180 -258 40 156 -166 -97 293 -20 106 101 -180 -71 309 -320 95 -234 78 -49
3616 -49 -36 -58 69 455 -89 -178 -7 -191 25 315 175 217 -162 275 567 -33 184 -31 -87 103 -63 253
3638 253 -83 -7 57 -203 -214 143 86 -164 -6 -234 145 -137 124 -115 -33 -15 -168 144 113 198 117 -23 138
3661 138 -120 -77 -91 100 -14 101 -237 19 -11 -140 -8 151 -16 -104 -19 -255 -158 82 -26 -16 185 -219
3683 -219 -66 -28 204 -145 -56 -196 125 -200 -333 113 -327 148 153 192 -14 50 281 -9 175 18 -11 -126
3705 -126 -195 -136 143 98 -101 19 -192 69 -53 96 -104 -68 -51 162 -120 -268 -49 -116 -110 -127 322 132 -178
3728 -178 43 -163 356 -46 83 -48 31 26 220 43 123 -162 300 -36 206 -85 121 -105 -209 -68 386
3749 386 150 202 54 39 145 -63 -123 -174 70 -230 190 71 -43 142 157 88 -227 -293 -258 207 -324 320 405
3772D05l38m4O6P4k18l7J9J41k38J81Pm9J83k40J39J41l00L01j01m3m2p3J00k6
3796Hq1n5K56o9J15k83j11K32m4j36J64P4p4O1Q4M0k99J73q4J96J1l43Q7K13k51
3821a16J31j57J04nN6L5J9j04r7J44k60J31K90j68j60L14j61P8M8k30O1k27K51
3844b3j8R2o8J7PJ00j46n9J29k05J8K82k92j14J75N2o0L04l95L97p1p7L59n57
3868a53M03k62M1Mr0J89L07p22K80k23L57o6l0K50k75k91N82j24o9r5o4J33K46
3891C28m57k68P2L72k88J25j1K92P2l32J65j56J04p7J9J12P6k92J5J01j48J34
3913d2j02L33r4K39q9k23K62l62m6R5k00K76kK96l06k7k7J48n9j24J01j45J08
3936A0m41M68R8m4j32Q6l74M7J79K12m7k6j00LJ60J18k89J28k31m7L40O6Q9l92
$$ plain form
3772 405 67 23 89 163 -55 -92 -73 68 -170 11 18 -31 152 -88 51 192 -108 193 92 49 7 -66 34 8
3796 8 -73 -128 128 59 174 -109 -220 12 -32 -168 -4 70 -4 57 141 181 -118 55 -29 167 178 -165 -78 135 -116
3821 -116 15 -142 -38 -43 13 48 67 -37 -134 10 -250 -119 171 3 -157 157 -4 74 122 -108 -47 -274 -23
3844 -23 -41 51 -17 0 7 107 -39 -98 31 -174 -156 126 -166 -280 -105 -53 -113 191 -204 193 122 45 404 -153
3868 -153 250 -12 29 33 -57 132 439 -283 -3 -226 131 65 35 285 10 -281 301 177 108 13 -51 82 328
3891 328 -129 -397 -325 47 -241 -116 -127 165 237 -95 70 -86 18 -59 -40 72 148 -144 -129 -28 -176 -42
3913 -42 -144 189 95 334 245 22 284 -78 -124 -29 -229 47 45 341 35 8 -19 129 70 -54 47 -98 10
3936 10 -431 37 135 91 -41 45 -329 -282 -103 109 62 36 -64 -61 99 217 -72 56 -175 -222 118 184 273 -119
3960a19J10n1J15l6R7K01k78J44k30M75l18p6j10M17l90r2J61j76L97l59J0J74
3982F6k15J85j91M3M3J94K4j10k73J06M79k27l8J44n20N24m4m30K95o5K54m92
4004b48J63J16j33K96l10Q6m54N84j88K0O5J37k27P8M0m1r3o5J5M4k3j41L51n14
4028d42N12l09J63K05k21K60j98Om9M07m18M1P5r8K46k96L80k97J07r6j53J69
4050fj31R5q3J37r9K13O3j76p2j49K35k7j07L4K40k56J57l53K59NK49k81K20p4
4074I3N7N7k98J04K81k15K6k27J21q1J39mk43K11%J51r1J41l26K04J38l9k68K47
4098A78jO1k64L31l87L5M56m39R0m26P28m79n5O81l16l43j12N6j6M08l8j47n8
4121e7j28K37K29j1k35o5L4k24J99Mrk55M91l07M4j23Q7K9Q7q6R2m8J91k54k05
$$ plain form
3960 -119 -9 -60 55 19 116 317 39 183 -47 428 110 34 -76 341 -49 -141 20 -156 241 -118 -108 66
3982 66 -149 36 -155 -112 -69 125 149 39 -234 -128 351 124 86 230 -290 234 190 -240 55 -10 244 -248
4004 -248 -85 31 -102 194 -116 -30 -484 100 -88 -68 -3 134 -93 -15 25 -16 -109 -174 -159 -115 -138 -279 72 -442
4028 -442 70 -239 -76 129 -92 168 -30 -24 -73 334 -84 -43 32 -66 180 -116 264 -33 74 -22 -175 -6
4050 -6 -137 -42 -125 12 -87 126 189 13 -59 -208 27 0 -107 -73 167 -89 68 -285 -26 -21 228 -53 167 93
4074 93 150 207 -91 13 294 79 105 -122 -1 -82 57 53 -190 21 21 172 81 222 -104 100 238 199 -69 178
4098 178 177 238 -26 305 -82 -47 409 -30 60 -366 362 -117 -172 509 193 -150 -262 -206 -222 186 148 1 -57
4121 -57 -185 52 281 270 35 -30 4 -220 -21 -17 -26 -281 210 -97 -53 -176 -89 -60 27 -59 33 -15 176 -78 -283
4146b83K96R8j17r4K35l40N9J64K60k90k76L87P7l36r8K22M41k61m3k75j10Q3
4168b01N7K04k1J57j41j50J43KK23l79M19m10l61N73j67n7K35j85J58j1O0j12
4190C6K93j63k17K4p3j82K25N1kK5J18k01o0K25n2k81J25J6k0N8j34K55L12l55
4214B3q2M71j81k21j49N2j92pJ28K8J1J26K50l55j13J85M3N2j23J64R6J3r1l92
4238b64L52j59o7K00j28O9R3q8r8R1k3J36k17n3J53J09p8r2M85k57p4k6j76J58
4262D6%K33m67J47n7L1k48L44j68J97j66q3L3j18J72jO1j50k71J26N35K1m05J77
4286a1j40L21k01j1N1J29K12o14M43k1j46J88j17r8M29m11J12rJ21q0k27j40L02
4309H2J68k85K14L4K8k24m8pK01P4r9r9O1j20k47K88R9n89L42J38k7k5n7M10k23
$$ plain form
4146 -283 13 111 -6 -100 135 -205 -146 18 278 -12 -288 99 176 -160 -258 -36 405 144 101 -174 -284 -201
4168 -201 -144 60 39 196 55 -95 48 50 273 -106 313 -97 -458 115 -52 -109 126 -59 99 88 148 36
4190 36 329 166 -51 -27 -100 -282 -57 -6 -8 17 135 -66 -126 99 47 -234 -109 -93 -113 -55 -189 66 378 23
4214 23 -59 412 231 10 -139 -87 -279 -286 -158 -130 -119 7 257 -98 -211 -26 17 69 -54 110 206 219 128 -264
4238 -264 88 -71 -138 62 -66 3 96 8 -90 1 -22 114 -103 -156 -3 106 28 -64 421 164 90 64 -112 46
4262 46 46 279 -188 -41 -98 -67 -315 29 -139 58 -108 -191 -158 -276 -104 -105 -44 -194 -465 -339 196 217 -188 -11
4286 -11 -151 170 -31 -42 9 138 350 -264 179 158 12 200 83 -15 414 3 115 106 227 147 -80 -220 82
4309 82 250 -35 179 213 241 17 -31 -38 163 237 138 39 100 -20 -267 21 120 -469 -127 11 -16 -41 -98 312 89
4334H9JJ26j09k10J45q7r5j42J77j1J27J16J31m40J45L64l04k39J38L59m20M74
4356C35n44L18j0k11J46L5n2j62J12M5K11l85J30J76l29j3L04J4O2N5k02j8j6
4379AN5K90k00J70k94j84j12O4K44J73Mj70j59Q8r3R7Q2O8k18L37j52n0Q4j64
4403c9P2l21M87m34L43k6j38M7N0n1j60J73J78k60j9k05L09r5m6K84k75k58N91
4426B07m33Q5J1K03M8k46K7k25L70k89L14K19m54K56j15j3N9J46k39M7J44m07
4448b85N38j46j17N3L24k82Q8m00K69Q3j43j14L92m92K84J65j03j55m09L76k38
4469c12L48k2m0K22j05j24l8P0k15j36N22k27L2j42M71l47M36m58Q9Mk5K26l73
4492a44n6K41R8M9j86j57K09Q3j61K00l09J33K57j56j70j3O7J11R9k37K79m09
$$ plain form
4334 89 90 216 107 -103 42 -45 -140 -282 -105 -116 11 127 258 -182 -37 327 23 -216 -78 281 -139 335
4356 335 -209 109 99 -112 34 69 17 -145 -33 12 223 -162 -32 144 -185 -198 106 120 182 237 35 17 1
4379 1 56 346 146 316 22 -162 -274 -210 34 207 211 41 -118 -30 -123 -26 56 124 -94 243 91 41 125 -39
4403 -39 33 -288 199 -235 108 82 -56 -9 41 -10 -170 3 181 -79 -98 -303 6 -89 -135 149 -126 -384 207
4426 207 -226 -141 -130 73 121 -125 -98 -323 47 -242 72 291 -163 93 -22 -35 24 170 -69 -22 122 -285
4448 -285 253 107 -10 43 367 85 173 -227 42 125 -18 -132 260 -232 52 217 114 -41 -450 -74 -312
4469 -312 36 14 -26 196 91 -33 -71 -1 -216 -352 170 -57 -25 -167 304 -43 393 -65 24 28 3 229 -144
4492 -144 -200 41 139 188 2 -155 54 137 -24 176 -133 0 257 101 -69 -82 -15 96 195 -42 237 -172
4514a72PJ62J34l19M02l68K01l02K58j65K90j83R8n1RJ14k60M87m83O3L07O6n9
4537B36m32L26o0j74j00LPL59k81J19j62J17n5q1K20k32L85j95q4J30l25R9J58
4560b2J27j81J61m3p2j53J65K00lm61K01P8J4J56k11K87k16J22j92J74k54J15
4582hj47P0R0j22nK51J75k99k26K00k78R8M10k3j67l92N55j59j82L30n67L22j07
4605a81P7P5J70k42nj47Q4P9J15N3k69J43J5M4j66R1J1j6K32m7P0j52J31j7J97
4630C45J0o94M04n1j3J36k93O39m55m33L78MQ9J54k06k39K99l03J12P9J76o3N5
4653A30k80K99k38j53L00R2J27k74n4l8J58J31k46J33J39k71N2j68O7L37j14j16
4675A3j57J30M52l84j2r9k33K76M7l7n9M1O3j04N2M8nj43R7R1j02L43k72j30o
$$ plain form
4514 -172 -165 -3 131 -188 214 -154 47 -255 3 -162 128 -55 43 -8 1 115 -145 342 -141 -78 229 295 236
4537 236 -196 130 70 -104 -204 -201 -194 165 -116 3 -159 -42 -97 -178 42 -190 195 0 -84 46 -279 -180 -22
4560 -22 105 -76 85 42 -30 -183 -18 182 179 -282 -81 -3 11 167 -44 243 27 149 -43 131 -123 -8
4582 -8 -155 -85 5 -117 -122 129 304 5 -221 -21 -299 -201 209 186 19 -373 182 23 -159 171 -396 -74 -181
4605 -181 -104 -29 141 -101 -106 -253 -169 -90 25 78 -191 -48 -33 11 -155 -64 -53 -69 163 116 186 34 165 148 345
4630 345 355 -339 65 14 1 137 -156 483 28 -405 -27 -23 66 220 14 -225 74 -229 -117 -38 138 75 130
4653 130 -150 149 -89 -242 58 150 277 3 -51 -89 69 200 -46 87 226 -45 7 -161 -94 243 129 13
4675 13 -144 -14 438 54 42 -57 -290 -14 33 -4 -63 -22 41 -63 -11 37 32 -111 -14 77 -25 318 46 -84 -90
4700i0K99k65Jm1R4j38J17N9k8j81N81l19J98m67L06j24k6K24l62K35j76J50j74
4723a27K32k68L87k22r7J39K52l5l90L07j83l83K56n7J42R2n2J7J98P3k32R0k71
4746a32K06j96K10K27m21L19n75J45K13n9J41l49J76J34K06k99R3J38k98K50o1
4767F8L0j02k53M36j85J65j10qj20J76m4k63P2L9K27n00M13K09r8j32K14j33k09
4790a08m40O07j95l08K57J72j7J6k1r1J09m7m1J18j79K53k25K78o3l66M55m6l00
4813a82L50J2J20k69m27L13J27J92j81n9m9K0j26j16mO78m37l0p4P2M0J09k89
4836b10J97L06o08L72l28M79j39l69M39j03j34K73j28l6k7K52j04j54QJ36j39
4857a7J83n7m3R9n0j64L95l17k16J37k5K25k59mK46j57J8K49m57P10p07J75j12
$$ plain form
4700 -90 209 -56 -55 -96 -2 -140 -23 36 8 -173 408 89 287 -180 126 2 -24 200 -162 73 -103 47 -127
4723 -127 105 -163 224 2 -95 44 296 261 -129 178 -5 -388 -132 -189 -47 45 -7 10 208 281 49 139 -132
4746 -132 74 -122 88 315 -106 213 -362 -217 -4 -63 78 -271 -95 39 245 -54 39 177 -121 129 68
4767 68 98 -4 -257 179 -6 159 49 41 -79 97 53 -210 -138 -99 128 -372 41 250 152 20 234 101 -108
4790 -108 -548 59 -136 -444 -187 -15 -32 -16 -37 -128 -19 -66 -107 11 -168 85 -140 138 75 -291 164 118 -182
4813 -182 168 180 300 31 -396 -83 44 236 55 -4 -53 -33 -159 -275 -279 399 -38 -68 -142 -70 -30 79 -210
4836 -210 -13 293 -315 57 -271 208 69 -300 139 36 -98 175 47 11 -16 236 132 -22 -14 122 -17
4857 -17 166 109 66 165 115 -49 346 29 -187 -50 -75 150 -109 -113 133 -24 -6 243 -214 496 -211 -36 -148
4880a48N5K4k45K52j10J07K70m07K22j30MM4N0N5q3K5rJ23j26o8J36j5N4k56L4
4905a42M66k31j8n3L05n51K60J70l9k90K17k36J33J42p1J4L59j76l00p3M4m8L51
4928B33k03Q4k5o2pq5L37l51n0K00J28m50O18m10L12j72m0j34R0L8L3j93pJ56
4952D0n1q3K16Ll18M54q6k73K42k23J66q3K4Q7j80Q6j21K47j50Om6NN8J20l67
4977b27K80J69k1l46Q5K36j75J08j13J46J10k80k57J5N00k54j43J77k26K49N0
4998H3M0N7pp6k77P92p71J06L54m77N66k82j97M99o32L00l7J23J21l98O21p37
5020b29P4Q8n5K51m24J00J18k55N97n05L83J3k5j81Q2j30K73RJ31k87j83L01m64
5043c18K15m8j12L99k38J56R4m53L58m62J56K51r0PM78n28J52j79l8R2o9j0P9
$$ plain form
4880 -148 -93 -69 -314 -62 -172 -65 205 -202 20 -110 -106 -62 -12 43 -40 -15 -24 99 -27 -95 41 26 80 -176 -142
4905 -142 324 93 75 22 327 -224 36 206 167 -123 94 -142 -9 133 62 76 435 259 -41 -114 -70 -118 233
4928 233 30 114 89 27 20 -65 272 -79 -129 71 199 -251 367 -43 269 97 57 -77 13 51 84 -109 -116 40
4952 40 -11 -94 122 125 -193 261 175 -98 144 -79 87 4 28 115 -65 21 -100 147 -3 3 -43 -38 20 140 -227
4977 -227 53 222 201 -145 -60 176 1 109 -4 142 252 -28 -285 -270 230 -24 -167 10 -216 33 83
4998 83 123 180 173 97 -180 612 -159 -53 301 -176 390 108 -89 410 -222 78 41 164 285 -113 508 -229
5020 -229 -155 -67 -122 129 -295 -195 -77 -332 265 -240 143 156 131 -50 32 -98 175 184 315 28 -155 146 -318
5043 -318 -103 -151 -263 136 -102 54 148 -305 53 -409 -253 -2 -92 -85 393 -135 17 -162 -200 -108 -177 -187 -108
5066a08K03O3j28k4J47l60K80j3K5rk71L52j07J26J85k87l47L02j22n5K02l9J53
5089A68j00j0p7J29j78M5L50o29K47J45j64m6J90K7j61l59N39O0n8J0ok0m13O61
5113C50l24O7l1j99k79J30N43o9J35rl55J94q9j78J23p3J85RL9o4J10k15M8l35
5137b87M09J04k44J30J83j22l37r7J40L03j93Q4j46K57j9l82L48J2k26Rk14K85
5159cO4K47k67n1j06K43j27j22p6L10l1k01P2j57R8M67j07n47L39L20k04l80L72
5182A53k58n5L3L61j68R6N1j68N3l02j66K26L31j95l9o1L46o03M01m8m4M30j89
5205A85j64p2l7J93j81K25k6k92Q7j47L60K07k88l5J42k0o1k5k80P0K76j47M1
5228A1l31J74M67k87p7J14J50p2k51J50q8J03j93J75J01L0k33q7J94j15o7J48
$$ plain form
5066 -108 95 158 30 6 153 -207 73 60 85 76 -195 157 50 176 361 74 -273 29 -93 -148 54 15 168
5089 168 68 58 -19 110 -68 -23 327 -302 -55 90 -74 -120 70 97 -64 -423 116 176 118 128 122 102 -311 350
5113 350 26 93 62 -137 -416 -286 257 188 323 314 -41 153 64 -114 9 -64 121 130 169 105 215 0 48 -287
5137 -287 122 226 -18 112 295 173 -164 -261 -121 182 -11 73 -73 184 165 -217 131 143 -83 -74 -288 -3
5159 -3 61 308 41 -10 -116 127 0 -122 -198 112 81 -120 -48 -205 -107 360 253 -294 45 365 161 -219 153
5182 153 -105 -160 -127 234 66 162 213 45 98 -204 -370 -144 187 -8 -47 -108 238 -365 36 -12 -56 374 185
5205 185 21 -51 -88 105 -76 149 123 -169 -82 -229 131 338 50 15 157 137 76 51 -229 -159 117 -30 11
5228 11 -320 -146 321 34 -43 71 221 149 -102 48 -40 63 -130 45 146 176 -57 -144 50 -65 -132 16
5250A6p5J47q6J68k65P6K3J63k19L67m47j50K29n6j23L42kr5J1J60q0K61n00L13
5274A78o16Q36n54J39j33o6L01j19J62l66J58K44l34J10J02K93k20m82L93j00
5294g4M5j11L8j63K94j84M80m43j13K74O8l24L58r3l93L15K59l85J45J74%k76
5316a09J02J83m04K67M8L78o50L48O4k73r9K14R7k91j01O5o0L20L8J34n08J74
5338f3M5K08k65L21k88j85L61j80K08k2k08K60k33K10l2l72M56j3m46O2K10p9
5360d5M4l16M77j79j99M34M5J08m77J54k72L07l20L39J27k65LK02j53J61l4k9
5382A12O5j78J75k11J72q2k21K60r7m1j04M6K10k2L06l16j24j14K42K4m17R5Q5
5405a35K01k60J70K65k48L4K08j83J49l16k62L52Q5k7j52M27l68j18M99m42J03
$$ plain form
5250 16 -59 88 2 170 -95 -19 4 167 -52 315 -132 -282 -53 -109 -232 110 108 13 24 184 104 365 -135 178
5274 178 -438 398 -156 -17 -150 -216 85 -34 128 -238 -80 164 -170 -60 42 335 115 -367 26 -74
5294 -74 -29 -140 -102 -265 29 -155 325 -118 -231 43 111 -213 145 52 -341 -26 233 -152 -7 167 167 -109
5316 -109 -7 176 -228 39 87 465 -185 163 227 -46 -145 69 166 -125 -226 -161 -221 99 137 271 -237 -63
5338 -63 -18 190 -75 246 -42 -227 134 -46 162 140 -68 192 -41 169 137 -235 221 208 -238 -176 34 -45
5360 -45 -1 -317 160 -19 -218 216 261 369 -108 46 -226 81 -239 100 227 -38 -35 167 14 175 141 112
5382 112 177 -1 174 -37 135 53 -168 92 -5 -46 -150 -104 106 84 390 74 -50 -164 78 102 -315 -220 -135
5405 -135 66 -194 -24 241 -7 27 235 52 201 -115 -377 -25 60 33 -119 308 -60 -178 321 -121 -18
5426a8KJ16j84J00j2n2m0R6m5L10k55K9J93m8j83k2K75j35k74K36j98L6r4p4J58
5451h3J57P3j13N8k37O0Q5J90l07k20MJ63m4R5J05J01K64p36N03j97R6J04j79
5474e8j3K68j68o9j57K33J15m07L29Pr1K92k41j26j98J82L85m13K19J09l8l16
5496a56P9jj56L3K48j65q9j08M06n1J2m01N28k20P5K81J6k70K59l42l2K69j79
5519C6L75n85L18o1M8J6J95j87k06J38o1R5l83J92j57L60l28L58k78L00j43J48
5541A90j09r5J15q7k28L16k35K68q5m79R12l74j49L88l13q1j97K21p7L42n54M57
5563A46P5l89P9J41j66o2L1Q4K35j82J50k06J0L45m69P8K14j47J18q3j12R9l61
5586c72K42M07m04Q7O5Q8k56Q7K20J93l84J50R5j20m0l2j55J40O1p9J81k74K15
$$ plain form
5426 -18 -16 100 -84 16 4 -48 -88 8 -37 273 18 47 240 192 9 -13 262 127 -147 89 -109 -73 -167 -241 -83
5451 -83 74 147 34 92 -145 -85 0 190 -117 -337 -333 -170 -214 -119 -14 87 351 -385 118 -79 17 121 -58
5474 -58 -71 197 29 -40 -197 36 151 -256 73 80 -11 281 40 -86 -284 -102 283 -130 89 198 160 -156
5496 -156 -77 -78 -234 -201 47 -118 -207 -315 91 40 52 -349 179 -41 34 315 331 61 320 -22 -54 215 36
5519 36 411 -174 144 83 131 147 342 155 -51 87 26 121 -262 -70 -227 133 -195 163 -115 185 42 190
5541 190 81 -14 101 14 -214 102 -133 135 50 -429 483 109 -40 348 35 -46 -243 -22 -99 243 -311 146
5563 146 221 -168 -89 52 -114 -176 -145 -61 174 -8 142 -64 -54 291 -178 -100 114 -33 85 2 -110 -11 -372
5586 -372 -130 277 -127 -40 25 113 -143 -56 164 357 -27 123 218 98 58 26 -129 11 72 -7 174 -100 115
5609A15j13p5j38J34L86k33m1j14j4L87pm90J58J42j86j35J25J0J26J03j84l1
5631g5K67k91l05N73j63K2l32K87m5ok63P13m05l1J6J63l3J8k08L9k5K37n7J13
5655B09k3O5l35R0M38l99K00j56j59J2L64j34n96N96p1j77k52O01r6n00L18n0
5677e5r7N74l09N3o6l63J78j6J70J2j6K49m87R6L35j42j11J06k68J14R8M7k02
5700a00K21L9l35K8K10j67K89l27J16K93k29n6p4K37n96M45J71p0O0O0M1n47M52
5723A61q7k68J78J31j81o5J30J7%j90J26k13m9L15j28L66J23p69L97q6K29l09
5745a72K32%L1k82LJ8j59M4M18j18K72m45K83j54j22L8J07J45l27J94J40j68j70
5768a92K9L19m10L10m0PJ97N9j44JK7r8M4n2p6j12k37M50J84k62j78L51j52m44
$$ plain form
5609 115 2 -73 -211 -77 309 76 35 -79 -93 294 287 -203 -45 97 -89 -224 -99 -89 37 140 -44 -75
5631 -75 192 -99 -404 169 6 28 -304 -17 -62 -68 -331 382 -23 -54 -38 125 92 110 -98 -59 -84 153 96 209
5655 209 186 251 -84 6 444 45 245 89 -70 -58 306 172 -424 172 101 -76 -328 273 177 -323 -5 -55
5677 -55 -152 422 113 166 100 -263 -85 -101 69 81 65 314 -173 -77 258 116 5 111 -157 -43 55 102 -100
5700 -100 121 160 -175 -147 63 -104 185 -142 -26 267 38 -18 -92 145 -451 -6 165 95 155 215 256 -291 161
5723 161 74 -194 -16 115 -66 -131 -1 16 16 -174 -48 -261 -310 5 -123 243 366 -403 -6 -92 137 -172
5745 -172 60 60 91 -191 -188 -170 -329 -285 133 15 287 -158 125 -29 -151 -113 -6 139 -188 6 146 -22 -192
5768 -192 -163 156 -254 56 16 23 220 279 135 136 163 65 109 57 -19 -131 -368 82 266 4 -174 177 25 -419
$$ [...]
8191A7
##END NTUPLES=NMR FID
##END=
