##TITLE=1H_DE-76H_2_PH10
 D2O
 8 sc, 
 13.1.2025
##JCAMPDX= 6.0         $$ Bruker NMR JCAMP-DX V2.0
##DATA TYPE= NMR FID
##DATA CLASS= NTUPLES
##ORIGIN= UXNMR, Bruker Analytische Messtechnik GmbH
##OWNER= root
$$ XWIN-NMR		Version 3.5
$$ Mon Jan 13 15:56:00 2025 Russian Standard Time (UT+4h)  she@DPX200
##.OBSERVE FREQUENCY= 200.1315
##.OBSERVE NUCLEUS= ^1H
##.DELAY= (6, 6)
##.ACQUISITION MODE= SIMULTANEOUS
##.ACQUISITION SCHEME= undefined
##.AVERAGES= 8
##.DIGITISER RES= 18
##SPECTROMETER/DATA SYSTEM= spect
##.PULSE SEQUENCE= zg30
##.SOLVENT NAME= CDCl3
##.SHIFT REFERENCE= (INTERNAL, CDCl3, 0, 15.7039)
##AUDIT TRAIL= $$ (NUMBER, WHEN, WHO, WHERE, WHAT)
$$ ##TITLE= Audit trail, XWIN-NMR		Version 3.5
$$ ##JCAMPDX= 5.01
$$ ##ORIGIN= Bruker BioSpin GmbH
$$ ##OWNER= she
$$ F:/spectra/data/she/nmr/H-F/1/audita.txt
$$ ##AUDIT TRAIL=  $$ (NUMBER, WHEN, WHO, WHERE, WHAT)
(   1,<2025-01-13 15:54:45.57 +0400>,<she>,<DPX200>,
      <created by zg, POWCHK disabled, PULCHK disabled
       configuration hash MD5:
       00 E9 B6 7A A2 85 ED C7 34 08 36 98 17 FE 4E 26
       data hash MD5: 16K
       C7 7C C4 26 19 42 73 C0 7F FD 0B DD 9C F3 42 28>)
$$ ##END=
$$ 
$$ hash MD5
$$ 87 1D B3 14 AD 89 22 61 C0 01 12 D3 CC D2 97 CE
##$RELAX= 
##$RELAX= 
##$RELAX= 
##$RELAX= 
##$RELAX= 
##$RELAX= 
$$ Bruker specific parameters
$$ --------------------------
##$DU= <F:/spectra>
##$EXPNO= 1
##$NAME= <H-F>
##$PROCNO= 1
##$TYPE= <nmr>
##$USER= <she>
##$AMP= (0..31)
100 100 100 100 100 100 100 100 100 100 100 100 100 100 100 100 100 100 
100 100 100 100 100 100 100 100 100 100 100 100 100 100 
##$AQSEQ= 0
##$AQ_mod= 1
##$AUNM= <au_zg>
##$AUTOPOS= <>
##$BF1= 200.13
##$BF2= 200.13
##$BF3= 200.13
##$BF4= 200.13
##$BF5= 200.13
##$BF6= 200.13
##$BF7= 200.13
##$BF8= 200.13
##$BYTORDA= 1
##$CFDGTYP= 0
##$CFRGTYP= 5
##$CHEMSTR= <none>
##$CNST= (0..31)
1 1 145 1 1 1 1 1 1 1 1 1 1 1 1 1 1 1 1 1 1 1 1 1 1 1 1 1 1 1 1 1 
##$CPDPRG= <>
##$CPDPRG1= <>
##$CPDPRG2= <>
##$CPDPRG3= <>
##$CPDPRG4= <mlev>
##$CPDPRG5= <mlev>
##$CPDPRG6= <mlev>
##$CPDPRG7= <mlev>
##$CPDPRG8= <mlev>
##$CPDPRGB= <>
##$CPDPRGT= <>
##$D= (0..31)
0 1.2 0 0 0 0 0 0 0 0.06 0 0.03 0 0 0 0 0.0002 0 0 0 0 0 0 0 0 0 0 0 0 
0 0 0 
##$DATE= 1736769285
##$DBL= (0..7)
120 120 120 120 120 120 120 120 
##$DBP= (0..7)
150 150 150 150 150 150 150 150 
##$DBP07= 0
##$DBPNAM0= <>
##$DBPNAM1= <>
##$DBPNAM2= <>
##$DBPNAM3= <>
##$DBPNAM4= <>
##$DBPNAM5= <>
##$DBPNAM6= <>
##$DBPNAM7= <>
##$DBPOAL= (0..7)
0.5 0.5 0.5 0.5 0.5 0.5 0.5 0.5 
##$DBPOFFS= (0..7)
0 0 0 0 0 0 0 0 
##$DE= 6
##$DECBNUC= <off>
##$DECIM= 24
##$DECNUC= <off>
##$DECSTAT= 4
##$DIGMOD= 1
##$DIGTYP= 9
##$DL= (0..7)
0 120 120 120 120 120 120 120 
##$DP= (0..7)
150 150 150 150 150 150 150 150 
##$DP07= 0
##$DPNAME0= <>
##$DPNAME1= <>
##$DPNAME2= <>
##$DPNAME3= <>
##$DPNAME4= <>
##$DPNAME5= <>
##$DPNAME6= <>
##$DPNAME7= <>
##$DPOAL= (0..7)
0.5 0.5 0.5 0.5 0.5 0.5 0.5 0.5 
##$DPOFFS= (0..7)
0 0 0 0 0 0 0 0 
##$DQDMODE= 0
##$DR= 18
##$DS= 0
##$DSLIST= <SSSSSSSSSSSSSSS>
$$ [...]
##$SUBNAM2= <"">
##$SUBNAM3= <"">
##$SUBNAM4= <"">
##$SUBNAM5= <"">
##$SUBNAM6= <"">
##$SUBNAM7= <"">
##$SUBNAM8= <"">
##$SUBNAM9= <"">
##$SW= 24.0689530833862
##$SWIBOX= (0..15)
0 0 2 0 0 0 0 0 0 0 0 0 0 0 0 0 
##$SW_h= 4816.95568400771
##$TD= 16384
##$TD0= 1
##$TE= 0
##$TE2= 300
##$TE3= 300
##$TEG= 300
##$TL= (0..7)
0 120 120 120 120 120 120 120 
##$TP= (0..7)
150 150 150 150 150 150 150 150 
##$TP07= 0
##$TPNAME0= <>
##$TPNAME1= <>
##$TPNAME2= <>
##$TPNAME3= <>
##$TPNAME4= <>
##$TPNAME5= <>
##$TPNAME6= <>
##$TPNAME7= <>
##$TPOAL= (0..7)
0.5 0.5 0.5 0.5 0.5 0.5 0.5 0.5 
##$TPOFFS= (0..7)
0 0 0 0 0 0 0 0 
##$TUNHIN= 0
##$TUNHOUT= 0
##$TUNXOUT= 0
##$USERA1= <user>
##$USERA2= <user>
##$USERA3= <user>
##$USERA4= <user>
##$USERA5= <user>
##$V9= 5
##$VALIST= <valist>
##$VCLIST= <CCCCCCCCCCCCCCC>
##$VD= 0
##$VDLIST= <DDDDDDDDDDDDDDD>
##$VPLIST= <PPPPPPPPPPPPPPP>
##$VTLIST= <TTTTTTTTTTTTTTT>
##$WBST= 1024
##$WBSW= 4
##$XGAIN= (0..3)
0 0 0 0 
##$XL= 0
##$YL= 0
##$YMAX_a= 757332
##$YMIN_a= -866991
##$ZGOPTNS= <>
##$ZL1= 120
##$ZL2= 120
##$ZL3= 120
##$ZL4= 120
##$ABSF1= 10
##$ABSF2= 0
##$ABSG= 5
##$ABSL= 3
##$ALPHA= 0
##$AQORDER= 0
##$ASSFAC= 0
##$ASSFACI= 0
##$ASSFACX= 0
##$ASSWID= 0
##$AUNMP= <proc_1d>
##$AZFE= 0.1
##$AZFW= 0.1
##$BCFW= 1
##$BC_mod= 2
##$BYTORDP= 1
##$COROFFS= 0
##$CY= 11.3945322036743
##$DATMOD= 1
##$DC= 2
##$DFILT= <>
##$DTYPP= 0
##$F1P= 15.6554695791079
##$F2P= 12.8336369535428
##$FCOR= 0.5
##$FTSIZE= 0
##$FT_mod= 4
##$GAMMA= 1
##$GB= 0.15
##$INTBC= 1
##$INTSCL= 1
##$ISEN= 128
##$LB= 0.24
##$LEV0= 0
##$LPBIN= 0
##$MAXI= 10000
##$MC2= 0
##$MEAN= 0
##$ME_mod= 0
##$MI= 1.114404
##$NCOEF= 0
##$NC_proc= 0
##$NLEV= 6
##$NOISF1= 3.799351
##$NOISF2= 2.8
##$NSP= 1
##$NTH_PI= 0
##$NZP= 0
##$OFFSET= 15.70392
##$PC= 1
##$PHC0= -26569.52
##$PHC1= 5.387441
##$PH_mod= 1
##$PKNL= yes
##$PPARMOD= 0
##$PSCAL= 0
##$PSIGN= 0
##$REVERSE= no
##$SF= 200.130013532006
##$SI= 16384
##$SIGF1= 3
##$SIGF2= 2
##$SINO= 400
##$SIOLD= 16384
##$SREGLST= <1H.CDCl3>
##$SSB= 0
##$STSI= 0
##$STSR= 0
##$SW_p= 3612.71676300578
##$SYMM= 0
##$S_DEV= 0
##$TDeff= 0
##$TDoff= 0
##$TI= <>
##$TILT= no
##$TM1= 0
##$TM2= 0
##$TOPLEV= 0
##$USERP1= <user>
##$USERP2= <user>
##$USERP3= <user>
##$USERP4= <user>
##$USERP5= <user>
##$WDW= 1
##$XDIM= 8192
##$YMAX_p= 0
##$YMIN_p= 0
$$ End of Bruker specific parameters
$$ ---------------------------------
##NTUPLES= NMR FID
##VAR_NAME=  TIME,          FID/REAL,        FID/IMAG
##SYMBOL=    X,             R,               I
##VAR_TYPE=  INDEPENDENT,   DEPENDENT,       DEPENDENT
##VAR_FORM=  AFFN,          ASDF,            ASDF
##VAR_DIM=   8192,          8192,            8192
##UNITS=     SECONDS,       ARBITRARY UNITS, ARBITRARY UNITS
##FACTOR=    0.0002076,     1,               1
##FIRST=     0,             0,               0
##LAST=      1.7004516,     0,               0
##MIN=       0,             -866991,         0
##MAX=       1.7004516,     757332,          0
$$ Real data points
##PAGE= N=1
##DATA TABLE= (X++(R..R)), XYDATA
0@%%%Qq%qQqJ6j6L0l8M0n6O4q0J01j14J38j62J86k18K50k90L30l71M24m78N41
30B89o11O83p67Q57r56J066j182J314j459J615j791J980k192K429k689K985l318
47a747L698m138M646n250N978o874Q014r509J1577j4631J9600k9076N3499k33583
61a97796o69195O8591L77425M17171M20700L40436j15267m99034m83338k30311
71e70618k9626K46343M84925M09475M4160k29246l36813l58662k25773J12154
81d53681L63105L44096J83692J0419k17637l70683k63386K944J67069K23251K54788
92B43977J69922p8954k76326k62708j31280J1163J72995K71264J85486q006j32933
103A64600j77945j90386j06824Q2810K11365J77139P8251r732j17954k02274j48007
$$ y = [0, 0, 0, 0, 8, 0, 0, -8, 0, -8, 8, -8, 22, -16, 24, -32, 32, -48, 53, -61, 77, -85, 101, -117, 133, -157, 173, -198, 226, -252, 289, -322, 361, -406, 451, -505, 561, -621, 693, -766, 849, -942, 1038, -1154, 1275, -1414, 1571, -1747, 1951, -2187, 2459, -2791, 3187, -3687, 4327, -5182, 6395, -8236, 11364, -17712, 35787, -197796, -866991, -798400, -420975, -3804, 416896, 757332, 642065, 143031, -340307, -570618, -600244, -353901, 131024, 540499, 584659, 355413, 18600, -340062, -565835, -453681, -90576, 253520, 437212, 447631, 229994, -140689, -404075, -401131, -234062, -10811, 243977, 413899, 334945, 58619, -204089, -335369, -324206, -151211, 120053, 305539, 297533, 164600, -13345, -203731, -310555, -227745, -16380, 160759, 239010, 229278, 111324, -90950, -238957]
114b38957P645J17674J42856J33086O8632o4480j64201j41194m8811L0141R5117
125f2492J35821R9874j276q6076j15892j03001m0922N7519J22408J02625L7238
136A45826k5613q0556j07852o9656J1927P2094Q6024P1041K5119m6023r1068p6397
148h5134k6383K1784O2870Q2920N2823j1979n9686o8867n2045j3427L9121O9738
160A1735N5801J7337j9059m9013o1814l8571R608M7836N3432L8393Q049l0780
172D2954n3261m4186j3213J8350M1016M5826K6095r507l5606m0806k8616m607
184e5561K3972M0537L3648J0083j4913l2996l5744j8608Q937K7669L1818K0645
196C9487K079j8660l0288k5459p390J2422K5504K5965J3265o154k1265k4526j6149
$$ y = [-238957, -231312, -113638, 29218, 162304, 230936, 166456, 2255, -138939, -187750, -157609, -62492, 73329, 173203, 171927, 85851, -30041, -133042, -173964, -116445, 5963, 108588, 145826, 120213, 39657, -68195, -137851, -125924, -53830, 32194, 103235, 128354, 82331, -8737, -85134, -111517, -89733, -26863, 56057, 108880, 96901, 37215, -31652, -83697, -97124, -58003, 11735, 67536, 84873, 65814, 16801, -45013, -83584, -73976, -26140, 27292, 65685, 73734, 42954, -10307, -54493, -67706, -49356, -8340, 37486, 63581, 54074, 18468, -22338, -50954, -55561, -31589, 8948, 42596, 52679, 37766, 4770, -30974, -49582, -40645, -12976, 18842, 39487, 41566, 22906, -7382, -32841, -40231, -27809, -2305, 23660, 36925, 30771, 9506, -15020, -31169]
209c1169o59J5489K3199J8764M682r882j9647j9154r484M935J5764J8784J2290
222B3912r3j1924j7449j3781l849Q418J4715J4291O652m223j1777j3829r290R66
236a7261R239J2195J0166K346n805j0898j0653m664L352Q758J0433O021p08o425
250F096r389p073j791M698P760P591L182k170o669p389m324L85N119O478M736
265G240J624l347n826n374k344J482M974M879L440l94l484m758l313j008K141
280d068M013L998J491q31l127l965k393P4K884L040K616N94j560k835k703j263
296d035R32K310K287J949m37j303k277j996o94J133J852K303J124p02j462j922
312i38j273o11J183J787J805M77k46j711j272q83n01Q30J734J373M35p30j345
$$ y = [-31169, -31828, -16339, 6860, 25624, 30306, 20424, 777, -18377, -27861, -22926, -7162, 11622, 23912, 23819, 11895, -5554, -19335, -23184, -14766, -51, 14240, 20892, 16669, 4892, -8937, -18227, -17261, -8022, 4173, 14339, 16685, 10880, -18, -10671, -15335, -11983, -3225, 7208, 13229, 12521, 6096, -3293, -10366, -12157, -7459, 301, 7892, 11074, 8904, 2235, -5154, -9478, -9093, -3974, 2504, 7240, 8864, 5517, -309, -5683, -8027, -6545, -1571, 3308, 6748, 6354, 2870, -1888, -5201, -6209, -4068, -55, 3943, 5434, 4603, 1476, -2489, -4882, -4808, -1924, 1116, 3732, 4326, 2766, -69, -2772, -4035, -3103, -793, 1494, 3443, 3006, 1703, -574, -2570, -3264, -2131, -279, 2024, 3148, 2446, 984, -938, -2211, -2822, -1639, 148, 1953, 2430, 2184, 473, -799, -1682, -2183, -1353, 381, 1754, 2189, 1459, 114]
329A14j208p04l8J184J253Q34K78l53j157r60j091M20R89Q26J184n8m31j029j006
348i53n51K26O03J155P69M37p08j059r95n49N84N60J079P72J56p73j008p40l34
367a329J64R61J032Q38l63n69j166n78m32K72J071J140K07l65m37j182n54j90
385a480N56J319N41M04o29m80j027l80L26N32Q64N76l78l03p69o54j87L72J054
404B57M62M33l47p44m59q54L62M90P06O88J55p70m82o21k60L53R23L65L84j62
424H79p09l78o65KN92N92M13J46l34n07n73n76J4Q29R01K30k1m81p68l17l00K
446a029R63O07M70j46m21o10j005N37K15R44L35k45L62p77q52l56Q5L30J044N25
466I76Ko48n98o38j94M37J42J131J28J81l95q93l90k20L72O41M98L87n91J63j038
$$ y = [114, -1094, -1798, -1836, -652, 601, 1435, 1713, 1360, 203, -757, -1848, -1428, -439, 387, 1571, 1513, 1082, 53, -953, -1504, -1278, -675, 480, 1249, 1686, 978, -81, -1076, -1625, -1041, -481, 598, 1370, 1526, 753, -255, -995, -1329, -1165, -204, 828, 1666, 1303, 734, -432, -1010, -1442, -1170, -99, 1041, 1248, 883, 446, -736, -1290, -1480, -924, 395, 936, 1340, 711, 231, -796, -1176, -850, -318, 546, 1122, 744, 441, -328, -982, -1169, -797, 257, 719, 1152, 805, 61, -398, -1252, -890, -400, 306, 994, 1149, 379, -103, -724, -984, -631, 292, 657, 1041, 879, 170, -208, -873, -871, -279, 313, 726, 872, 538, 31, -542, -1118, -1104, -275, 626, 856, 835, 354, -414, -731, -1031, -1029, -66, 541, 1011, 865, 444, -166, -1171, -634, -419, 525, 860, 615, 977, 200, -652, -1008, -923, -593, 451, 976, 978, 330, -268, -906, -1100, -663, -521, 610, 738, 919, 524, -369, -759, -979, -607, 34, 532, 919, 328, 491, -547]
487e47j96k37N93P56L40K21l97p11q46J89J02O93L95K87j27n2q71rm43K86N56
508a8M21M59k61k17o51j37j76L13L42M59L25Nq37m20m85N25N8O12K69K63k35o88
530g4n40o4J27P28K16O0M59q43j82n20pQ2O58N06j83K01n60m64j2m24O05K00L20
553B89J30j73l02k13k97J38nO73J19J07r7n76k39j14M16K88N8K75jm90m9m80L22
576b21k62N19L75Nk46j5l40m33J18J07N09K64J32j72p60K39k18K10P6M17o8J8
598B54k13j49k78m4M50j66M47o8j8m7m80J5j03J59M56R6M40n57l05l4j72N07k53
621f3L11L96k88k48j29j93l73M65J77rJ79j6l07j72p3K05K86q4J42M4M3l47l81
644d35L1N0M02J86R4n0l5l93j25l01L83j6K86n8L1j44j24j81M41Q4QJ38k77L04
$$ y = [-547, -743, -980, -387, 369, 709, 930, 533, -178, -1024, -835, -733, -40, 355, 642, 515, 463, -408, -417, -860, -574, -18, 403, 862, 601, 384, -267, -404, -580, -267, 75, 534, 859, 864, 27, -393, -878, -353, -295, 317, 586, 849, 614, -74, -614, -678, -551, 177, 393, 453, 912, 69, -113, -633, -640, -558, 100, 606, 423, 624, 64, -400, -412, -836, -231, -31, 289, 419, 246, -56, -269, -566, -428, -433, 240, 359, 466, 369, -207, -446, -560, -144, 144, 202, 477, 476, -14, -63, -543, -221, -483, 36, 411, 416, 170, 155, -185, -618, -500, -393, 116, 380, 512, 340, -420, -181, -399, -189, -113, 304, 236, 254, 41, -108, -386, -430, 20, -146, 301, 233, 215, 168, -312, -297, -400, -241, 215, 311, 751, 194, -111, -145, -317, 190, -63, 248, 644, 356, 108, -21, -214, -587, -122, 55, 46, 225, 209, -98, -270, -343, -138, 148, 64, 206, 250, 293, -54, -435, -404, -354, 48, 234, 328, 278, 243, -150, -275, -576, -193, -209, 77, 19, 50, -94, -218, -399, 42, 126, 134, 272, -5, 299]
668B99k90k33J11k81M55n1L35k75j0j47k76J40k6J81O4L11j04j84k58m3J5K69
690Bn3R8O9J6r8r3k6k34M29M1J16J8l56J8J8l88L36M24l75L78l06m1p7k14J87
715a11K47K28k4k1j34l09m2r3K47J03L9J92l14N44o97R8k01K50J6L3K26J14m20
738b9l93J33N7K18K57k45L87l98R4m26L7K27j3K63j9L73n56Mk30j10K60K14K02
761C07k03L07m10l35j24j4L59J9L86p1k2j93m48n0N4M11K40O5j71j09n5J43l75
784b89r4M99L03J04m06j46J81m16K99K66k7N5j74k47r4j20jJ68J97K43k16J13
806A98j93Q9k22j46L46j11L51j77J22k81J76l21k99M01J95K51m53K4j04l07K04
827b57L73J61p0j11R5n03l5L43k43K33L40q6j22J51l52l61M30K8J51J9M9o5q8
$$ y = [299, 9, -224, -113, -394, 61, 10, 345, 70, 60, -87, -363, -223, -249, -68, -4, 307, 203, 19, -239, -282, -267, 2, -51, 47, 116, 132, 34, -59, -85, -319, 110, 151, 267, 285, -71, -53, -35, -423, -87, 337, -38, 340, 34, -7, -84, -298, -111, 136, 364, 340, 319, 185, -124, -166, -259, -12, 91, 130, 322, 8, 552, -145, -47, -248, 2, 18, 51, 277, 391, -29, -422, -289, -232, -14, 243, -2, 385, -13, 81, -345, -308, -81, -94, 169, 150, 523, -33, -29, -259, -369, -109, 105, 307, 104, 411, 1, -334, -458, -472, -113, -94, 292, 221, 199, 6, -442, -492, -438, -27, 213, 278, 107, -2, -57, 86, -289, -383, 116, 419, 523, 117, -29, 152, -264, 35, 301, 274, 329, 155, -92, -186, -306, -307, -139, 58, 301, 85, 198, 5, 94, -128, -274, 72, -39, 312, 135, 257, -24, 152, -169, -468, -67, 128, 379, -74, -50, -154, -461, -257, 116, 277, 207, 96, 191, -312, -347, -4, -247, -14, 326, 240, 118, 269, -83, -444, -14, 14, 165, 184, 233, 168, 80]
850H0j43Q9J44J00k49K4K4P9k03mj29J45K4K87J47n15j66K09R9k33K1M37k64J92
874A95L7m76O1j44N50k31K68j91p8Jj43J27p7oK87j66J74J4k97j94J52k07K47
897i7K79k35R6m42J25L68qk60R6J31k05r8K38O2K08o6Qj48J44nk29q9j20K33q7
922a01M54k34K0lk39J02n6k13L37k17J65k7K56L6m88K62n0j8m8K29p36P26q7q6
946a6J2j03K42k15L1n5n7K6L54o9q4p2j20o0K01j26K98k46j06R6j36J88k01M11
970A93l55M56k69mM0j87J87k26J44M2j19J23P5p3J90k67m2Q8k7L21l85Q4k20Q2
994a49L9K83j05Q1j09q1j21j03Rl7L80P9J29l23Q9j59J93k30J74L6p2j6j09J80
1018E8k58K74J11j34J38l31J05J48k46L2mQ2J06k0R4LR3l32R9j95M3n1K65j13
$$ y = [80, -63, 26, 170, 270, 21, 45, 69, 148, -55, -59, -188, -43, -19, 268, 415, -100, -266, -57, 42, -191, -170, 267, 3, 195, 232, -244, -183, -327, 223, -8, 260, 69, -9, -8, -151, -24, -101, -107, 180, 14, 188, 202, -95, -289, -137, -344, -97, 182, -53, 43, -399, -274, 94, 86, -174, -78, 53, -152, -250, -12, 50, 258, 192, 200, 52, 196, 191, -38, -127, -247, -14, -101, 353, 119, 139, 136, -103, -1, -57, -270, 67, -150, 15, -12, 244, 280, -208, 54, 4, -14, -62, 167, -569, 157, 70, -16, -4, -107, 135, -80, -49, -104, -161, -135, 219, 150, 66, -6, -126, -186, 15, -111, 187, -59, -165, -69, -205, -17, -218, 193, -162, 294, 25, 21, 61, -126, 61, -165, -21, 21, -98, 25, 100, 27, 217, -50, -92, -4, -31, 290, -95, -11, -231, -149, -110, 173, 68, 149, 40, -41, -162, -265, -256, -293, 87, 166, 295, -28, 61, -98, 95, -135, 39, 75, 3, -13, -122, 58, -200, 74, 185, 51, 189, -142, -37, 111, -135, -103, -107, -25, 81, 61, 155, 158, 251, -81, 18, -177, -134, -185, 80, -33]
1042c3m6J95k1l03J29J74K52l17j38L13k84j91J41J30k3J51j12j44n4J29j80J50
1064h2J55j18K38l96J74K43j37k23j23N08n13J98QM97k30k44j84L45m67K18J68
1085C5o8P1K5k49J09j71M0M86l70R5J6k29J00K29r9N7Pk2l91J94o0kK20n8J47
1110A12J69M0m14P1l74K86L3j03M02l22m7J57j79Q6l24N88j72j0L85k93Ll00M6
1133a60R6k04K17j41K53j22J72m3k68J71k11M12J72j58k10L3j07%O8J2q7J96k38
1156a47j19K17R4j4j38o3J02O4J60k11r7J12K70k45K78n48PO1K11J32j47j53J27
1179d7N5k42J41n9J48k58J62J67p7J08l47J05J84K8j17N0P3Rj04K14k43K47R2
1202B89j99l14L54m07L6j7J03N05l61l7J05j46Q6K11r2j52K21N3l02j36K4P1J01
$$ y = [-33, -79, 116, 95, -208, -79, 95, 347, 30, -108, 205, -79, -270, -129, 1, -22, 129, 17, -127, -181, -52, -232, -82, 73, -45, 193, -203, -29, 214, 77, -146, -269, 239, -274, -76, -68, 429, 199, -45, -229, 116, -351, -133, 35, -33, 38, 63, -186, -77, -248, -208, 278, -92, 3, 19, -210, -110, 119, 20, 77, 84, 62, -329, -135, -195, -197, 23, -35, 112, 281, 321, -93, -22, -396, -110, -77, -180, 222, -100, -147, 10, -169, -83, -407, 181, 9, -1, 384, 91, 94, -206, -160, -64, -268, -51, -192, 61, -61, 111, 68, -200, -29, -240, 172, 344, 186, -24, 9, -98, -98, -30, -18, -105, 91, -147, -266, -49, 45, 31, -107, -170, -68, -4, 156, -55, -152, -40, 230, -15, 263, -285, -278, -217, -6, 126, -21, -174, -47, 8, -234, -93, -152, -4, -262, -100, 67, -10, 98, -249, -144, 40, 68, -49, 1, 74, 83, -21, 193, -50, 197, 289, 90, -224, 130, -277, -241, -258, -155, 350, -11, -48, 57, -89, -3, 208, 116, -36, 185, 238, -64, -200, -176, -105, -4]
1225dP6k8j77K69o6m54L47J02k34L70k76K99J31n12J13N3k16K72k71N9n5K06J86
1248A90j66j47K03n9qJ2M2k01K94n2J18j57j0k87N14j47M2P3k01j50J39q3j83
1271b24K73l38L30k06j44L20l38L28j76K7L56l53K78Q5l59J44j15J64l62L85J56
1292B31j09l04K25O4k7l6K70k05Lk61L40l41L13j14pk67J95M34m06kq8P6m8k37
1316c01K72j41J40q0j48L17j44qR3j97k61N80j81R6p9J95k82J13Q2p4J25k80J7
1339a46N4J51J10k06K20RK2r3j58j38J46K55k66q7j83L60m5lr1j53K61K37l63
1362a07N0q7K27Q1l29J0r1K5L62l5j27K30n85N58j44j06k89K94J66l54J61p4L9
1385a25n4L0J51o4j6L76k41m43L00qL16j36k21j6L40m39J90K52k53r2M4P6Q7j54
$$ y = [-4, 72, 44, -133, 136, 70, -384, -37, 65, -169, 201, -75, 224, 355, -157, -44, 9, -207, 65, -206, -147, -202, 4, 190, 24, -123, 80, 21, 13, 25, 67, -134, 160, 108, 226, 69, 59, -228, 286, 139, 181, 254, 53, -97, 42, -41, -224, 49, -289, 41, -165, -309, 11, -327, 1, -175, -148, 208, -145, 133, 218, -141, 3, -112, 52, -310, 75, 231, 122, -182, 43, 107, 80, 44, 314, 109, 112, -149, 191, -150, 163, 49, 42, -225, -30, 404, -2, -4, -92, -16, -64, -301, -29, -170, -30, -110, -258, 59, -85, -93, 0, -197, -458, 122, -59, 37, -42, 153, -129, -16, 66, -8, 117, -163, -146, -92, 59, 169, -37, 183, 192, 214, 121, -37, -175, -29, 226, -40, -127, -310, 50, 5, 2, -89, -242, 19, 256, -107, -57, -144, 83, 164, -165, -155, -246, -221, 141, 106, -21, 209, -376, 182, 38, -68, -357, -63, 103, -251, -90, -164, -125, -179, -149, 2, -62, -78, 298, 57, -386, -86, -94, 222, 86, -135, -151, 189, -250, -60, 192, -61, -153, -109, -33, 54, -100]
1409a00K2j36L68l25J35K00N8k41O7j62K12l48M90k02j25J64P1P5l44K07j68L80
1431B98R7m99J84P8m42L35j58N8k00L64J36q8k92R2k09M8M3p4L64k90J68k62J6
1454b33K11qq1K72lJ5j18j8j59L10l9j5Kk43K18j02J93o88N66Q6J0J68l38L9k05
1479a60L96j88K75Q9o59K45O6n82N42J46l63J23L10r1p3j38n4K11l64K10J69j37
1501b7j10R3K51k72N46l41j44j30M5J33K55n86o7N75m39R2M20l03J90r5m4k96
1523b54K88M7l7K03o9j25k1q1q4K27k02J79l76K45J04L8n3L55j37j74k81K92m07
1546c23K8N11k59j78K98N9q8r1j9n2L14n2r0j00j67J7L73m24J31J14L5k72P36
1569E01m05k05j42K94P8jk30j7L66l09K17l56N03k51j67PR7k42J69J40j28L12
$$ y = [-100, -78, -214, 154, -171, -36, 164, 222, -19, 48, -114, 98, -250, 240, 38, -87, 77, 148, 223, -121, 86, -82, 298, 395, -104, 80, 158, -284, 51, -107, -49, -249, 115, 251, 163, -129, -37, -246, -198, -155, -229, 135, -155, 13, -249, -233, -22, -30, -111, 161, 158, 173, 55, 37, -122, 188, 149, 134, 136, -107, 111, 9, 202, -486, 80, 166, 176, 344, 6, 45, -160, 236, 48, 323, 412, -247, -2, 64, -518, 24, 170, -193, -70, 240, 149, 76, -62, -116, 95, -269, -59, 110, -27, -137, -44, 207, -65, 481, 140, -4, -134, -89, 44, 299, -287, -354, 221, -218, -126, 294, -9, 181, 86, 42, -254, 34, 81, 44, 247, 178, 53, 32, -49, -133, 94, -108, 71, -305, -60, 44, 82, 29, 384, 247, 73, -208, 84, -323, -295, 216, -43, -221, 77, 136, 48, -43, -62, -114, 200, 148, 58, -42, -209, -192, 181, -243, -112, 2, 37, -235, 501, 96, -109, -251, 43, 121, 120, -110, -127, 239, -70, 147, -209, 294, 43, -124, -117, -20, -262, -93, 47, -81, 231]
1591B31l3j62J92j58J84l92K78k66K28j45K1L04m47K5p7M55k70J43R9l04l9K78
1613A45j2k60J15j38Q9L3r3K30j00P6J05K30o55R3J28O2P7n2k26j80M3M75j09
1636G6k00K14l82K97Q4Q0j86O2r6j70Q5n4K54k38J92n7J09j94j59M70j54M7j74
1659i4K25q1O9j09M6k78J81N5k67K14L71k39j22j19l0M19j84j25K14l31K92k66
1681a59K36J84m89L09k61M60k44k73J00r4K00K3J53r4K61k67r3k6J33p1j79k03
1703c94M03j86J24K68q5o6J12j36j97J57k77K27L09j93j78K40k24K69k09K41p00
1724d95K23N43l82j49J61J03p8J14p4K81l02j95M15m6kj88K2j9r1J63K50l08L
1747e1j28K03j02l2j98N03l31P6J38N6k41Qo3N15m84J15J87J31n21P59o37r2K72
$$ y = [231, 198, 36, 228, 70, 254, -138, 140, -126, 102, -43, -22, 282, -165, -140, -217, 238, -32, 111, 210, -94, -133, 145, 133, -127, -12, -150, -61, -28, -121, 109, 9, 85, 190, 420, -235, -142, -14, 48, 125, 73, -153, -333, -290, 185, 76, -124, 90, -292, 5, 89, 169, -17, 45, -51, -221, -136, -190, 64, -174, 18, -39, 70, -124, -283, 187, 33, 80, -94, 131, 50, 119, 10, 56, -222, -41, 14, -253, -39, 332, 93, -29, -148, -178, 241, 57, -68, 146, -185, 107, -159, 77, 261, -228, 81, -180, 280, 36, -237, -137, -231, -31, -8, 145, 51, 312, 45, -48, -74, 59, -12, -191, -394, 9, -177, -53, 215, 130, 64, 176, 40, -157, 0, -277, -50, 259, 66, -112, 128, -96, 173, -36, 205, -495, -272, 271, -111, -260, -99, 4, -74, 40, -34, 247, -55, -250, 165, 119, 117, -71, -49, -68, -159, 4, 254, -54, -51, -179, 24, -78, -110, -308, 195, -136, -60, 78, 134, -107, -99, -162, 353, -131, -16, 171, 302, -219, 540, -97, -189, 83]
1770H3j11j48j44L53k23L37j6j59J90n39L04J41j48L1J01r1j30J29l4J7K8l0R4
1793C5q9N9K29nl13N6j8K84k49k63M78L0n70M37l2r2K15j48Q8k89L2J56j73k2
1817a64L27K5l3K23m22l05O05j05k01K81n50O77m00K27l6L6N5j79k79M67M7k4
1839B72j90j68J1j28J10o3q0J90J33p2K79j1k56j94K01M7k00J64j35j12L44l1
1861A11p9K70k80k42N03m13J44j13K55k35j18K88k45j45P37l74k81K93J53j81
1881D8l9J76l38n2o4N87l54R8j03J60m51M0K48K0j7J40k33L90k22l84N40j80k75
1904b65L77O6M9l48r2L8L20R0j80K66j38J49or17M59J37J86pm09L85j92L6N8j68
1928a06L34k23k27K46J18M6l91L04j86P5n7K0K53l4p2N4j92L81m94L43j17j4m0
$$ y = [83, -28, -176, -320, 33, -190, 147, 131, -28, 162, -377, -73, 68, -80, -49, 52, -39, -169, -40, -74, -57, -29, -59, 35, -54, 5, 234, 229, -84, -28, -46, 238, -11, -274, 204, 234, -336, 101, 69, -23, 192, 44, 132, -157, -125, 31, -142, -164, 163, 188, 155, 378, -44, -349, 256, 151, -50, 231, -319, 358, -42, 185, 149, 185, 240, 61, -218, 249, 296, 272, 82, -86, -75, -203, -93, -156, -236, -46, 87, 15, 294, 283, 27, -167, 34, 81, -119, 45, -90, -202, 142, 111, 32, 302, 22, -220, 283, -130, 14, -99, 156, -79, -197, 91, -154, -299, 438, 64, -217, 76, 229, 48, 9, 185, -153, -205, -269, 318, -36, 62, -41, 119, -332, -292, -44, -24, -41, 99, -134, 256, 34, -350, 190, 10, -265, 112, 178, 227, -121, -213, -175, 145, 235, 55, 321, 183, 332, 326, -591, -132, 5, 191, 184, -225, 160, -32, 4, 62, -106, 228, 5, -222, 24, 142, 188, -203, 101, -85, -10, -67, -47, 206, 172, 100, 154, -38, 343, -151, 192, 75, 61, 21]
1951B1k93K83K63n25K21j4K01j73j83J3J54J26j73J22K78l61J14j54M9J30l60
1972b61K82p2L17l40k2R0m65M89J88m55N10m31L50ll54N19l44J11J1j3M1j96J47
1995I9j14K24r2o25N15j36K4J83J78k92M2l8L15j31l93K58j41J40j20K59m08L99
2017A46l67M21l72J67J73k53l4j22M00R5l69j05J34j27Pp7M88k98n3Po2J40k09
2040b70K51K82m88M38m75N20m78M4RJ78j46n3J59M13n9l15K67m27oO7K49m64M13
2063A09k83k9L46m41M39k36m0q8K18k96L31L23k44j33M5k7J04K28l92Q5j99p9
2085b59P9L42l31K21q0l34L63j6O0k96J68k4J76O5l35m4N20j03P5q7l88M41n8
2108A55Q0j81o7o9K15J33m61L37k94pL53l75L12j74j01M6J37j66R5j74P4K91k26
$$ y = [21, -272, 11, 274, -251, -30, -44, 157, -16, -199, -186, -32, 94, -79, 43, 321, -40, 74, -80, -31, 99, -261, 21, -51, 266, -74, -96, -6, -471, 18, 206, -249, 261, -170, 180, 177, -177, 342, -2, 109, 120, 107, 148, -48, 99, -15, 209, 117, -508, 7, -129, -105, 78, 256, -36, 6, -32, 283, 152, -241, 17, -124, 16, -104, 155, -253, 146, -221, 200, -172, -5, 168, -85, -119, -241, 159, 254, -115, -220, -86, -213, -206, -283, 205, -93, -146, -139, -201, -61, -270, -19, 263, -225, 213, -262, 258, -220, -176, -167, 11, -135, -188, -29, 384, 325, 10, 277, -150, -156, -89, 160, -304, 109, -174, -203, 143, -298, 141, -95, -135, -223, -5, -301, 30, 353, 109, -24, 21, -6, 98, 326, -66, 19, -180, -259, -180, 162, -169, 52, -28, -362, 1, -15, 45, -251, -83, -107, 69, 134, -201, -245, 275, 172, 247, 160, -228, 213, 155, 235, 54, -13, -82, 133, 266, -195, 142, -152, -159, 194, -181, 131, -43, -144, -98, 39, -127, -32, -206, -132, 159, -67]
2131f7L38k10J60l2k24L25k64K34k82o1k7j7J99M7m22J20j45J68J21K6o2J24J22
2154A71n09P11k20j7k55M14j04k64k38K6J86M13m78o4L14k38L54J36k95K27l88
2175a18K24J00Q2q1k16O0K2k7M1J46l71l9n1M22Mk81j34J99n9K79j63M3j78J04
2199Hj17J30k68K87R4j58o7m3J12L81l65J8o1L55l98o7P5J51j21j7J77r9n6j28
2223a77K77K06l22j26N3J25Pm5j25J42L14l78K43l99J73j32L17r0j42L31l65O4
2245d9L17k18J51p4J49j07k7M4j27N8j84q9M61po2k57L45n07k9J51n5L90m47M24
2269B51k98P7J6j14J68j22l5J76L6N2j77j01J46j23K01nm32K93j71K60n7N8l0
2292F9k74L44k12K21o1J09p5p9j57M3J41q6K12k68K94k43M57m03m0j84P2p1L21
$$ y = [-67, 271, 61, 221, 189, -35, 290, 26, 260, -22, -83, -110, -127, 72, 119, -303, -183, -328, -160, -39, -13, -75, 49, 171, -338, 373, 153, 136, -119, 295, 191, -73, -311, -285, -99, 314, -164, -228, 86, -152, 202, 338, 43, 270, -118, 106, 206, 288, 207, -9, 51, 73, 46, 87, 233, -138, -177, -228, 194, 198, -83, -217, -18, -77, 202, 39, 82, -96, 8, -109, 21, -247, 40, 134, -24, -91, -134, -22, 359, -6, 12, -49, 306, -92, -159, -84, 67, -54, -71, 106, 7, -49, -177, 100, 306, -16, -142, -89, 36, 43, -2, -127, 15, 329, -49, 194, -205, -32, -164, 153, 63, -79, 252, -113, -49, 268, 50, 201, 127, 276, 169, 142, 186, 59, 117, -67, -156, 305, 298, 236, -21, 324, -183, -212, -61, -116, 274, -173, 251, -47, 30, 46, -68, 100, -22, -57, 119, 155, 207, 30, -71, 75, -48, 153, 148, -284, 9, -162, 98, 41, 99, 69, -205, 139, -73, 148, 87, 196, 121, 42, -115, -72, 69, -17, 195, -73, 221, -22, 435, 32, -8, -192, -120, -191, 130]
2315A30k01M0m71M36J52m9J47m18J04J73J06j21o7j72%J84k22P4L02k75J5M32
2337B99j96j52K26k53j2J08l99K20L95l02J25k3p9j38K33r0j59K72N8l72L61j44
2359b2P1n5K66m53O52n92K91qJ20l70l4J05K62P1m85O3K54Km88L78k59l6L43m1
2383C5k92K14OP0k19Q5J1M9L13jL6l20OK40j77k9k07K53N1O4j62q2l3K52m09m
2409b50J58LJ21J22j66j60R5M21o17K85l65K54J85l39L10K13j17R8k64k27L14
2430G4l44J49j93J74n8q4K54R6L1k17K84o11O22l23K21l71K70J25j40K79m57J
2452b18M91l17m0j36L32m4j27k76J10K28j63J15q7L10r5m2LM8Nk70K18L7m9P3
2476A06q6J32l63M71j33j39j05j8L76n37P6P5J67J23k54J54J64j26j11M90r53
$$ y = [130, -71, -31, -502, -66, 86, 37, 184, -234, -130, 43, 149, 28, -39, -211, -211, -27, -249, -175, 127, -148, -133, 299, 103, -49, 177, -76, -88, 20, -379, -159, 236, -66, 59, 36, -43, -181, 52, -38, -197, 75, 133, -239, 122, -22, 49, -6, 260, -193, 459, -133, 158, 150, 270, -100, -134, -29, 233, 304, -181, -118, 136, 138, -350, 28, -231, -267, 76, 35, -257, -43, -37, 33, -186, -101, -90, -41, 272, 271, 307, -13, -7, 233, 56, 27, -180, 73, 124, 188, 26, -56, -89, 163, -246, -250, -92, -89, 32, 154, -12, -172, -77, 344, -273, 12, -353, -99, 86, -253, 57, 270, 153, 251, -13, -240, 74, -270, -121, -314, -140, -198, -282, -28, 68, 99, -118, 166, -445, 177, -146, 75, -296, -26, 99, -41, 238, -219, -218, 273, -44, -84, -220, 112, 68, -59, -335, -225, 3, -160, -45, -132, 178, 83, 41, 44, 92, 97, -173, 45, 82, 33, 106, 20, 152, -211, 260, 127, -12, -117, -135, 241, -296, -220, -145, 22, 145, -109, 45, 209, 83, -28, 462, -491]
2497d91M97M1j06M0r4M81l25n3l77K27P1K80m90L24l8m0k52M27k24K60k7l82M88
2520B37l74K47k38L4J69k87K59k66M4K22O6j44O26p31L38j66j36L3J71k81K34
2541E7J59j15J03j13k84KJ98K22j62L58l30j37j82J11j28L84j33l26L95l03J82
2562d2K99j70J39j78q0J52N8k76J36M4k52L52q9J10j30P7j18K13k0j51J57k48
2584a7l9J81l81K85K92k99K12j05m40J80K78l84L60L4k30L40r9m43L28k69K54
2605C8K0j91k1P8J50p7k04L60j69jj41q6m1J11L67k29K05j76K21j7k83q1o1M0
2629a88j0PL35j70K92m25J46k02N1j56K30K01k78J08J46R8m58L36j17J98J22l39
2651g3K95n30L11P0o3M2n9R4k98M0K84r5R5k68L47m31j65M78j85J71l65l8J85
$$ y = [-491, 6, 47, -59, -19, -113, 368, 43, -10, -387, -160, -89, 191, -299, 25, -13, -53, -305, 122, -102, 158, 131, -251, 237, -137, 110, -128, -94, 75, -212, 47, -219, -175, 47, 113, -31, 595, -136, 202, 36, -100, -67, 104, -177, 57, 216, 101, 204, 91, -193, -191, 7, 229, 67, 425, 95, -42, -224, -113, -241, 143, 10, -316, 79, -224, -42, 257, 87, 226, 48, -32, 120, 178, -98, 38, 82, -170, 182, 93, 203, 73, 150, 32, 245, 225, 74, 231, -17, -56, 125, -256, 29, 321, 22, 234, 129, -311, -131, 147, -237, 123, 157, -73, 267, 168, -275, 53, -216, 38, 58, -133, -154, -76, 74, -3, -207, 153, -16, -17, -158, -244, -285, -174, 193, -36, 169, -7, 214, 197, -86, -167, -228, -188, -198, -191, 144, -26, 266, -159, -13, -215, -164, -320, -90, 111, -167, -59, 87, 185, -273, 63, -54, 144, 266, -73, 222, -308, 3, 73, 10, 52, -7, 87, -211, -171, 113, 18, 113, -155, 192, -239, -404, 74, -111, 60, -305, -343, -158]
2674a58K4l75L50L16l36L30k08mJ97j48o0J75N1Mo5o0j0r7L56l50P2J01J19k5
2698A99m00K23K10k36j59L18k12O0J84J16m60K86q0k70k10L41K55l35J74j17J1
2719a02n8M57n85M64l15R9j15J77k58K25L88k97L6k24J4N5j09J29O5J2k36O11
2741D33m72L7Jm04P24l43R4m5P8l25J18K32k41R6n06L92J61L7L4l28O5L26R6L6
2765B96l48K74n62K86K36P8k32r0K27J30l46K2j13J90J51m17L11j67q9K27J00
2786A64l75L01l92J78J83l45K76j69M47r9j89k85K53K77j83o8j05J40J24k2k42
2807a31K87k01j64J32K9k59M8L34k81M18J53n40J66nj12J33l15L03K87q9l64L7
2829a34k61Q2M38pn3J61r9j59j6k9J64k61K50J03k13P3R2K81l94k65K57k50K23
$$ y = [-158, -134, -509, -159, 157, -179, 151, -57, -61, 136, -12, -72, 103, 154, 158, 93, 33, 23, -74, 282, -68, 4, 105, 224, 199, -201, 22, 232, -4, -163, 155, -57, 3, 187, 303, -157, 129, 49, -221, -431, -90, 165, -170, 4, -113, -102, -160, 297, -288, 176, -139, -40, -155, 22, -236, -11, 377, 80, 116, -108, -94, -39, -148, -19, 46, 58, -178, 433, -39, -2, -1, -405, 319, -24, 70, 25, 103, -222, -104, 128, -113, -17, -523, -131, 30, 67, 101, -227, -162, 164, 260, 296, -52, 222, -340, -54, 182, 260, 28, -62, 165, 295, -51, -29, -142, 48, 199, -218, 93, -74, -163, 64, 164, -211, 90, -302, -124, 59, -286, -10, -179, 268, 169, -20, -305, -52, 225, 42, -26, -131, 9, 133, 111, -131, 156, -45, -209, -77, -48, -307, -259, 75, -206, 212, 365, -175, -9, -14, -126, 7, -308, -5, 282, 193, -171, -134, -395, -313, 125, 118, 65, 226, 127, -32, -48, -77, 87, -174, 76, 179, -34, 39, 131, 412, 18, -247, 10, -240, -17]
2852a7K9J00J73m71k7L45j40j08j17O03m74K45j54l9J94j87l1N20m88q4M5j6J76
2875G7jj7K6k34J12J00J20n74L75j6K02k8m94M94j17j7k42L56N0l32L50m63L04
2898C1l8p4q1r2K62NL10l46j89l2K59N5J94j52j58j16J14J06k26N3K41m9J17k21
2922b7M4p1J49l02J25j24K61J96j97J86m59L73l36K72r4M55m12k39K77k11J69
2943C5P2k66M80k23j25P7k80L59p0q3J93j95J36j34J57k64p5K2L22p4K44l28N9
2966C9j48J63j45K48k46J63K18m30K14J79l42L26m34L3N4J73N8j80L1K11Q8m62
2988a89K83k7k21J17j21L64p3j22l82M07M0j86qk6K91j76N1j03J14m4j63J41Q3
3011E0N0k83J1Q2J03j03O7O8J2j84K92n55L11L78j72l00K88j31K4J28m35L41k08
$$ y = [-17, 12, 112, 285, -186, -213, 132, -8, -116, -233, 370, -104, 141, -13, -52, 142, -45, -76, 444, -44, -128, -83, -99, 77, 76, 59, 85, -149, -37, 63, 183, -391, -16, -32, 170, 142, -352, 142, 25, 8, -234, 122, 172, -160, 190, -273, 31, -7, -81, -162, -254, 8, 13, 323, -23, -212, -244, 15, 70, 264, 112, -46, -162, -48, 58, -168, -115, 126, 77, 194, -27, 17, -54, 95, -207, -82, -206, 55, 251, 54, 240, -219, 154, -182, 90, -4, 451, 39, -200, 77, -134, 35, 107, -159, 321, 98, -27, 50, -230, 129, 59, -24, 169, -26, 110, -24, 133, -131, -206, -184, 138, 64, 308, -20, 39, -109, 54, -91, 157, -89, 74, 292, -138, 76, 255, -87, 239, -195, -162, -108, 65, 123, -57, -26, 185, 273, -189, 94, 67, -154, -37, -158, 206, 133, 11, -371, 36, 76, -110, -118, -144, 147, -29, 22, -81, 33, -11, -174, -33, 50, 100, -183, -172, -90, 13, -90, -23, 45, 57, -127, 165, -390, -79, 299, 127, -173, 115, -16, 8, 136, -299, 42, -166]
3034a66L4L31k78J51J05R6n07J72K83l74L08l28L91k02N2o6k81N39m61J95N1K42
3056B87o83N72j30k44K07M3j63K70m2k34M60o19L72m5J70l1k12l8J80J12m42J73
3078c7m1k93O09m37J88N6J35j28M1J36k23R5j81J89k5j39Kj47Q7j81K77j13J01
3101b9J0J97m1k56L0J31q4J55j48K28k91m7k3R1p8l5q8L25Q0j4J25l38j6J52o
3126C0p2K67j8n78L64L7l72N87p8j55l49L73j9K08Or0j30N4o3k43K22L18k08k93
3150b02L7m1L29l18K14j2l3q9k5M69m6j42k08L38l56K60j37M7p9j22l01L71k9
3173g5k78K64L13k26P8p1j45J25o7J40k61J36k57L1K25p3k2J98j59m4R6K2J44
3196I4k31J57l1l15K04J17l1K2J37l45K43K26l42q1L62J26k72l64J62rJO8j98
$$ y = [-166, -132, 199, -79, 72, 177, 273, -234, -62, 221, -153, 155, -173, 218, 16, 68, 2, -279, 260, -201, -6, 45, 287, -396, 176, 46, -198, 9, 52, -111, 159, 117, -117, 343, -276, 96, 51, 221, 190, -22, -60, 120, 232, -210, -37, -78, -371, 238, -199, -11, 45, 180, 52, 93, 229, 6, 101, -80, 109, 84, -55, -53, -200, -113, -294, -17, -130, -29, -19, 178, 137, -119, -89, 42, -42, 113, -35, 193, -98, -145, -168, -77, -155, -190, -278, 47, 127, 113, 238, -100, -116, 36, 30, -42, 225, 207, -371, -7, 30, -342, 245, 167, 12, -337, 36, 17, 225, 231, 141, 11, 65, 2, -241, -19, 299, 91, -202, -165, -206, 123, -195, 19, 7, -26, -115, -140, 329, 283, 141, -67, 271, -85, 175, 38, 85, 6, -116, -417, -46, -75, -353, -89, 224, -2, 76, 5, -140, -15, -82, 58, -203, -67, -324, -293, -68, -141, -163, 35, -124, -168, -72, -50, 94, -137, 20, -11, -326, -122, -5, -36, -14, 123, -222, 21, 247, -95, -176, 186, 312, 40, -324, -162, -171, -170, -102, -300]
3219c00L71p8L06n67LP4L41l79N89m62j68K59rJ59j04J23l74L20n7j11J78k20
3241a06Q8k3K2P7Q3j02k25L32j5k27K47k03m8J15L04k66K40k74k23K90Q2rj13
3264D6j2M0P0l30N8J52L3j80J61Kl2j05j8J34k66K06L32m02K25m9J55k15K75o
3288B74l15NM7J71m73L2K98j25k4JJ66K23m84K52l14K65K28l54pJ17j82J81J61
3311A43l11O6q2L66j30k3J43j60J31j91mJ66pn2o2J11J24m10M8O8O0J98O6k40
3335A8J90m64K24p1pL78p6r9j33M9J77j56J35l72J23K10j18J47k89P0N5J40J89
3358C20m37j25K38o9k0o9J01L47l47J13k11M86m04q7K22J0k82l10J02O06mj68
3380A2L9j30k08K05J62J3k01k1k7J60l85Q9L65j15J56q5j07K64j33L09o25P3o4
$$ y = [-300, 71, -7, 299, -268, -265, -191, 150, -229, 360, -102, -270, -11, -20, 139, 35, 158, -216, 104, 47, -64, 114, -106, -18, -41, -19, 58, 141, 39, -186, 146, 131, -96, 151, -52, -100, 15, 319, 53, 293, 19, -204, 86, 168, 159, 46, 34, 74, 144, -186, -128, 24, 57, -123, 38, 40, 8, -97, -115, 19, -247, -41, 291, -111, 114, 65, 220, 5, 280, 274, -41, -36, 11, 182, -291, -259, 39, -86, -110, -109, 57, 280, -204, 48, -266, -1, 227, -127, -134, -17, -199, -18, 143, -168, -102, -184, 182, 52, 29, 172, 12, 143, -48, -52, 114, 107, 55, -7, 104, 228, -182, -134, -66, -6, 192, 258, 18, 208, -256, -32, -103, -110, 268, 192, 93, -40, 9, 186, 30, 165, -207, -84, 126, 8, 155, -134, -64, -9, 131, 320, -117, -242, -4, -73, -93, -162, -61, 286, -61, 52, -159, 327, -77, -164, 58, 68, -214, -524, -422, 184, 180, 12, 51, -79, -287, -82, 80, 93, -108, -129, -156, 4, -381, -292, 73, -42, 114, 29, -78, 186, 53, 362, -263, -190, -254]
3403b54L14q9n9K30n0NN4k31L4K28k98J66l4l02K88l08K91R8l18K83m9J38pk60
3427a30J29J15l9J80j77K3j90R0j56M22l5j21m83L28r5L71o7m04M87j54l4K33
3449B93n80L52J01n0p7J47j26k10L72k3j29K29m31M1N1j01j12O8j3M5J97q7j48
3472a91L47k46J82J48j03k30K43K2m20J82kNJ53o4n7K05Oj48rJ8R8l9l24J77j03
3497a50J76P0%j72L47l78J15K6M1l5p8K04j79K61j29j00j28K86k46J9P1O9k46
3520a56K69l65M41j68m1Q1J49k27O4Kk95J08M1K8M65n30N3p1n8j4K12Q8k34j79
3544c37J85J05J70L7l15j2j2K60p3K2J60k81L17l63K16J21k42j30K38l41L02J94
3566B21l49k8M2J22j22M1J00N8l67L92j04J85j27Oj20K31r2m9R2KO7m00J09K49
$$ y = [-254, 60, -29, -88, 142, 92, 97, 151, -80, -46, 182, -116, 50, 16, -286, 2, -306, -15, 83, -235, 48, -1, 137, 130, -130, -1, 114, 75, 255, 78, 101, -89, 1, -155, 267, 232, 111, -372, -44, -139, 232, 165, -239, 248, 94, 60, 293, -287, 65, 166, 116, 39, 186, 60, -150, 222, 199, 70, 299, -132, -91, -40, -141, -253, -185, -198, -153, 44, -43, -191, 156, -90, 92, 240, 137, -93, 150, 172, -248, -66, -68, -63, 90, 26, -31, 174, 180, 32, 23, 41, 139, 100, -224, -47, -150, 26, 96, 96, -76, 271, -107, 8, 34, 75, 40, -38, 166, -13, 248, 119, 19, -109, 177, -69, -50, 21, 90, -156, 113, -252, 189, 21, -20, 61, 210, -17, 47, 49, -246, -138, -97, -69, 396, -134, -81, -152, -210, -224, -12, 76, -158, -337, -152, -47, 123, 160, -155, -167, -179, 81, 8, 30, 190, -91, 226, -137, 79, 200, -42, -172, 66, -275, 27, 221, -128, -156, -114, 8, -114, -73, 27, 85, -282, 110, 6, 191, 64, 70, -50, 181, 89, 40, 132, 134, 201, -199, -90, 159]
3590A59j83J55k3j94J31k14j1J12oL25l02K90J11l17j03M9p8N4m3j49J51P2l92
3613d06J06K63o0k15K43J77k4k69O6j9M58k06l58N94O4j65j30K1k61q3j8J97R6
3636G1k97J9K34o0l6k81M00J85j62J01k92N8N8M8O0j23J73n5k41J0K75j76n5J75
3660H9L3j11J04o1Jk01M35k97j68J56l8J16mK46j98j06m50K89K39j98K17n2j35
3683i4PJ05j89L1L2M9J54l2j85K47J99k52j57J8l83K35K11lJ26J49j8k81l5P3
3707GM6Q3j22l5k4q1M28q7l39K67o8p1J7K1J31j60o1J29J2l7r8j59L13ORK55m36
3734e4N1K35k16j5K87j99k42l0k7J79o0J16K3k9l6p8k8PP8J10O8J30Pl43p9K37
3760I2R0l92L17pJ94j73j42n3K5l0P6j21m4J43Kj28J7L47m03K00P7j77r8M94k53
$$ y = [159, -24, 131, 108, -86, 45, -169, -180, -68, -74, 251, -51, 239, 350, 33, -70, -21, -99, -45, -88, -237, -86, -14, -406, -300, -37, -97, -312, -69, 108, 84, -185, -119, -138, 320, 114, -244, 350, 414, 249, 119, 140, -121, -204, -222, -25, 71, -226, -207, 27, -33, -69, -350, 50, 235, 73, 174, -118, -60, -2, 46, 106, -17, 156, 101, -140, -130, 145, -31, -86, 89, 122, 11, 115, 54, 55, -146, 289, -8, -176, -20, -58, 58, 54, 300, 102, -4, -454, -165, 74, -124, 93, 41, -94, -87, 18, -171, -140, -108, -59, 95, 63, -122, 125, 324, 72, -85, -67, -450, -215, -4, -7, 119, 268, 250, -31, -66, 7, 53, 136, 14, -21, -45, -126, 302, 215, -124, 143, 75, 4, 21, 42, 173, 13, -48, 81, 93, 56, -42, -201, 112, 118, 127, 382, -54, -3, 232, 16, 1, 288, 89, -153, -183, -210, -31, -91, 25, 48, 19, -17, -95, -123, -116, -38, 72, 140, 270, 277, -66, -145, 92, 182, -210, 107, 100, 294, 121, -21, -74, -49, -79, -3, -124, -168, -25, -23, -151, -134, 213, -190, 10, 87, -90, -188, 306, 53]
3785E3O8k66K45J14l87J94j4mk55K71j11k25M73rk64k8L39k83j40K31L13m71J58
3808Bj38K08r8k8J60j72J29JJ89k44j35K83j17m4J8m37L73j29L1P4J17Q3J05l98
3832a67J52O9k14J00K40j39J90j86J22l17r9M05k53K06l9q5J14k6l15m8K98J9
3854B7q5m7L13o7l15Q5R5q6K7p1L39l93k49K89K40l65L92k10K12j90K8n0r3K27
3878E3K4m6K86n14L71l15N5j08L44j33j36L17k36j00J83j51J01J51j89Q7l30K89
3900Cj60M20k43J8j94j02K28L0m17N38p3N0k32K24p8q9K98m59J48k04M73o7n51
3923d39M74O0m2j94P3L74k78L7k84J64P7J8J88m12K44L72k93j42N02l69R6k22
3945Dj00l9J86k6M8J63j12j53R0k40O0Qj23K15j85Q4J8l3J11p7J31J49K5l01k
$$ y = [53, 121, -145, 100, 214, -173, 21, 7, 3, -252, 19, -92, -317, 156, 147, -117, -145, 194, -89, -229, 2, 315, -156, 2, -136, 72, -26, -54, 106, -66, 63, 64, 253, 9, -126, 157, 40, -4, 14, -423, -50, -179, -148, -74, 43, 126, 231, -167, -15, 54, -160, -60, 180, 41, 231, 45, 167, -150, -249, 156, -97, 109, 70, -15, 99, 73, -242, -290, 8, 27, -58, -105, 208, 141, -174, -89, 6, -80, -53, -124, 215, -178, -427, -138, 102, -263, 129, -81, 131, -59, -31, -81, -174, 53, 77, 31, 317, -197, 174, -141, -86, -194, 150, 17, -119, 198, -38, -138, 45, -106, -5, 146, -43, 44, -286, 3, -157, 263, 20, 38, -156, -258, -30, 0, -417, 121, 48, 98, -134, 90, 12, -77, 221, -238, -90, -294, 179, 112, -439, 35, 95, 53, -141, -68, 306, 28, 65, -219, -55, 22, 40, 228, -184, 60, 432, 139, -3, 499, 130, 226, 4, -96, -135, 51, 25, 73, 236, 124, -29, 61, -179, -119, -111, -234, -19, -204, -120, -102, -135, -24, -101, 30, 179, 204, -97, -99]
3970i9K91j85K9r6J56J6k91K79j90P7J27Q4k90j47L07K58k04l64L78k91m7J78
3992b4M6J24L6l74N37l24J62m6l76J68K30j97J85K0l27K31k3L8m04LL19k59L66
4015A11k42J45k75L21J70m1j06j69J72p3K33l01L6p5P4J81k32J42Q9Q3m85M55
4037B13k21j68K72l84N24k13j83K03m0k22K85n3J45j53k57J34k4J72q7M7j07k28
4059c45J73J7K39mj68J41p0k73R0J49m3O0j0j04K34L4J71k71j83L1L30k13J91
4082A76j60l22M06L36m83MJ82q4k31L64k09J26l46K49q4j20K29k52K40PlJ95k22
4105bj07K7J77O4j06j88K91m52L17P5n8j65R4J13n4k04L52l01J15M9l3R3k80M75
4129B92k94k54P20l81n9J00q4Q7j70k12O4J74r8K3k8M5J03J36j5M6n77M41q5K0
$$ y = [-99, 192, 7, 36, -60, 96, 112, -179, 100, -90, -13, 114, 198, -92, -239, 68, 326, 122, -242, 136, -155, -202, -24, 22, 146, 182, -192, 345, 21, 183, 137, -239, -71, 159, -38, 147, 167, -160, 71, 48, 86, -318, -315, 4, -255, 111, -131, 14, -261, 60, 230, 189, 83, -86, 86, 13, 246, -55, -19, -94, -20, 161, -71, 71, 160, 243, -242, 213, -8, -176, 96, -288, 236, 23, -160, 43, 3, -219, 66, 13, 158, 5, -252, -118, -142, 30, -57, -10, -117, -345, -172, -155, 84, 80, -88, 53, -17, -290, -200, -51, -94, -34, -44, -148, 86, 120, 291, 20, -163, -132, 198, -15, 176, 16, -306, 100, 436, -47, -43, 139, 55, -176, 188, -21, 105, -241, 8, -76, -196, 33, -219, 21, 28, 25, 220, -2, -109, -82, 95, 159, 53, -135, 156, -296, 21, 96, 38, -127, -33, 80, 26, -178, 174, -127, -12, 37, 4, 97, -183, 292, -2, -256, 464, 83, 24, 124, 40, 127, -43, -255, -191, -17, -115, -92, -120, -75, 28, 164, 149, 195, -382, 59, -26, -6]
4153fP8k13J30J65j27n3N5j10N4J98j17m97L48j52K40j63J22Q6l01J76K64P1m42
4176a94K50k46J66L17m35K77q3K9L31n03j5K26k43j39L0L33k0j84nJ89m52L52
4198a9p3O29n38J09J07l19O6j31Q7k4O8M31n34J56K8p5P0j7rN5Q7j14J65p5j48
4223a8q8R6j27J06J89k78P1rK02j40l38L60Q3L16p33N01l00K82j78k64J62k03
4245c08L85l82K32M5L4l58L46q1J8l10K66j35K93Q4j29j70J45K21m02K29m8L3
4267HK1K41m07j36K39K83k74M0k82J74J3M6j29L64q2j26j11J51j22Rj35K94j15
4290c6j11q9K22O8m64M12J48K28j83k06N27l89j46J44L4p8k4L3j41J40oj6r3J78
4314A52lM6l62K34m1L2l29J92J05j29J80P3J47m13K15jm43L38J04N8j10M6l2L7
$$ y = [-6, 72, -141, -11, 154, 27, -26, 29, -81, -27, 171, 54, -443, -95, -247, -7, -170, -48, 38, -263, -87, 177, 248, -194, 56, -190, -24, 293, -142, 135, 52, 81, 412, -91, -106, 120, -123, -262, -232, 101, 81, -103, -108, 81, -371, -19, -92, 537, -1, 108, 215, -104, -38, -169, -82, -106, -38, 393, -141, 15, 43, -32, 38, 21, 12, 67, 154, 40, 205, 130, -18, -106, -10, -137, -31, 158, -120, -49, -58, 144, 4, -334, 26, 109, 425, -308, 193, -107, 175, -3, -267, -105, -308, 77, -305, -73, -28, 6, -352, -6, -87, -69, -379, -113, -248, 45, 129, 0, -170, -25, 196, -206, 23, -25, 8, 29, 270, -137, -273, -34, 249, -25, 15, -267, -93, -80, -34, -163, 201, 119, -7, -118, 33, -89, -80, -215, 79, -36, -147, -236, -14, 54, -410, 2, 150, 378, 195, -11, 516, 127, -19, 125, 159, 81, 57, 90, -51, 89, 83, 67, -26, 152, 149, 195, -167, 67, 26, 58, -271, -79, 26, -103, 77, 150, 297, -116, 99, 98, -345, -7, 97, 155, 45, 91, 59, 96]
4338I6q0K10j73O7l9k23L04k82Q1j03n0J46j95P1K66r8o3l5J61k49p7K90K38l97
4362a34J34L15m97J50q4O2J84R8j21j70J47PM3k40J69Q2k48J88q3l3j58o9M77
4385B19l07j14J94K07j14j81J5N1k70N33j72J27m06J84lJ67l38J15K10j35j18
4406a36J20L61r2j57l91L59n8j86K57j5p0j34j12N87k41k30n5J69n6r7l09N38
4428E2nk31K39J42j50j19J84m09K57N6j31K76k66K6K97m8j37k13J30j2K60k28
4450c0K28q5r5j78M41j01j96l64K59q4j8j81L29k8j73L96l97K72j05K29r2q6J39
4473H0r3k6J35k73M93k15k16K57j15O6j13k15J41K85k5j40j41K81j90L0q0j97
4495b71K64k92K71J7L87m11Q2k42P8K96J12l23k14K94l89L65N1m20M95J39k13
$$ y = [96, 16, 226, 53, 120, 81, -142, 162, -120, -39, -142, -192, -46, -241, -170, 96, -2, -65, -100, 61, -188, -265, 25, 263, -134, 0, 315, -182, -32, -116, -54, 130, 228, 107, -63, 84, 91, 134, -106, 63, 145, -103, 85, 2, -31, -189, -258, 219, -88, -202, -8, 199, 85, -96, -81, -30, -300, 233, 61, 188, -218, -34, -37, 130, -208, -93, 117, -18, -136, -16, 345, 253, 96, -295, 64, 6, -180, 77, 62, -8, -142, -254, 333, 92, -138, -193, -24, -80, -177, -486, 52, 47, -184, 55, 197, 47, -72, 112, -297, -40, 16, -115, 161, -105, -79, 218, 170, 33, -180, -50, -62, 198, -30, 198, 113, 18, -160, 281, 180, -16, -380, -121, -205, -223, -404, -75, -103, -276, 120, -277, -5, -110, 119, 27, -59, 80, -13, -39, 96, -177, 316, 101, -115, 142, 27, 93, -20, -235, -94, 191, 166, 26, -115, 166, -24, 6, -74, -271, -7, -299, -28, -11, 376, -35, 47, -195, -117, 179, 291, -32, -246, 48, -341, 24, 75, -345, 150, 289, 76]
4516G6p7K49l25R0J89k5j62p3k8K4O5K89l69j23L01J2j57R9o4%l91N35P5k86n
4541h1K09l47M36j69k0N2o7k7J20j27J09k28K64l52K96j12k99J78M67n48J99K
4563d5P2J19l37J37j17j05L46k65J73J00nr5k6J22Q3j56k26K43P6k19J45J6J19
4586A55j69j06J54n2j52J21l1O9K72k36L47l53j86K73J03l02M3k65M18K03l65
4607e9j59J32J62l38L35M5K56l85J69o01L45J87m28J72j6L57j62j29J5Q0K19o6
4629A31o8p4j16J77M2l87K76J92k17L77l28j60O1l89O74l98l7J19j49Q0J03K20
4651A29J37J02k41j1j58j75R5l86K68K00K66m46R8K59j09j02r1K01l4J18k37M13
4673B96j88j67K37q4l85N11k69j60L10n1k07J17L26R2j88Jk04K18m40L12JJ54
$$ y = [76, -1, 248, -77, 13, 202, 177, 15, -58, -86, -62, 3, 292, -77, -200, 101, 113, -44, 55, -9, -9, -400, 135, 210, -76, -81, 128, -219, 217, 48, 28, 80, 13, -14, 106, -21, 88, -140, 124, -228, 68, -44, -343, -165, 302, -246, -47, -45, 27, 146, -191, -54, -171, -276, 70, -195, -22, 78, 73, -22, -48, 74, 157, 1, -225, 18, 94, -125, 20, 36, 155, -14, -120, 34, -18, -170, -49, -80, -11, 261, 25, 372, 19, -167, 106, 209, -93, -50, -315, 103, 306, -59, -218, -86, 76, -262, 73, 118, 374, -11, 158, -443, -98, 89, -339, -167, -183, 174, 12, -117, -102, -22, 197, 131, 63, -11, -127, 50, 92, -295, -19, 173, -44, 333, 5, -155, -94, -483, 191, -207, -244, -125, -274, -194, -91, 129, 266, 368, 127, 116, -42, -217, -122, -508, -240, -40, 226, -220, -122, 137, 28, -74, -165, 36, 2, 120, -117, 296, 108, -59, 178, 94, -291, 220, -49, -209, 101, 50, -157, -40, 286, 378, 190, 191, -13, 205, -235, 77, 78, 232]
4695B32k14N9m09M07K39l68j85K99l8l48L97M9l65J72n2J51j48M4J00K32k51L8
4717D1m10K23K76j89p5N2j06MP5K32r6J37j88J19J62k10P9n35K11L45j29O6j01
4740a7j29L57r4K6j98j5m17K97J65r8K76q1l20p3K39K40k69l0%K85q2J32k81o3
4764a50j0J51K97k45K64k11k02Q2k51L33Q1oQ0j00j77q0M25l07J3M2J37j69l1
4787c4j13J70j59K2Q9j39L19m85O7J08Q7J64J31m91m3q9M48j66J22j67m3M52j83
4810F7l11J01j36K07J38J76m00K64P6j29p2j08M71l71o7L83k80k66L85j08K01
4831B21m71QN53l01J85k16J42j81j58M19l92J35J04j87K07p9l8j64j76L25j94
4852b58J36J47J37j65K23l41M7m5Rk52R8N52k44q6Ok7K30k7j45Q7l72P8K56N1
$$ y = [232, 18, 77, -332, 75, 314, -54, -239, 60, 22, -326, 71, 120, -245, -73, -125, 26, -122, -78, 22, 254, 3, 41, -369, -146, 130, -59, -134, -82, -188, -184, -109, 123, 27, 164, -24, 95, 257, 47, 126, -409, -198, 147, 18, 84, -17, -146, 211, 117, 143, -55, -70, -487, -190, -25, -123, 153, 72, -248, -321, -82, 158, -111, -141, -141, 144, 62, 194, -87, -150, -160, -9, 288, 43, 307, 96, -106, -24, -275, 58, 139, 133, 213, 113, -64, -144, 281, -26, -13, 29, 166, -3, -34, -147, 23, -136, -114, -25, -164, 155, -330, -263, -155, -68, 96, 227, -264, -307, -396, 52, -114, 8, -159, -202, 250, 67, -244, -143, -279, -72, 66, 242, -158, 106, 182, 53, -19, -127, 344, -27, -94, 289, 9, -257, 128, 20, 221, -250, -242, 311, 10, 195, -21, 121, -60, -218, 201, -191, -56, 48, -139, 68, -11, -49, -213, -389, -64, -258, -122, 25, 162, -3, 220, -121, -74, -119, -110, -362, -264, 288, 44, -42, -36, -63, 167, 140, -5, 82, -290, -212, 44, 95]
4876I5M5m22J99K50k98O9P9P3j71M4j39J49j57Qk3J19pJ04J05m27L92l26L28j61
4900g2O8J80j36J33k64O5pN4K2k55L06l76K25j48J43Q3k9K5k3M9k31L8k34K90
4924i4j03M73l24J45k25L04j02k20K87p1k63J27l2K39l29K81J96l74J01p8l2K26
4946A32j47Q2k90J55J85K49o00K07o9j8J1k36L81k9n7K97k51P4J51l65K75j32
4968EJ75k34J77k21o7k1L8M34k12p5j95J60J11Rn1k54L56l30L1J80J7m64L43J90
4992A02j19J3J88n70M37q3M29m06j07M36k01n7J9o1j52QJ18P1MK78m03j22K08
5015C0k74L22j78n1L94n70L18j02J2K11l25J66J23k51Q2k15J73p3J89L50l42J47
5037A36k27K1O6j04j24N40o20J32K07N1j22j73K70m25M85k26M62n51K08J40J9
$$ y = [95, 140, -282, -83, 167, -131, -62, 17, 90, -81, -37, -176, -27, -184, -176, -199, -80, -87, 17, 122, -305, 87, -239, 89, -72, -4, 176, 40, 173, -91, -26, -33, 21, 43, -212, 94, -282, -57, -205, -62, 21, -8, 17, -6, 43, -188, -150, -384, -94, -197, 276, -48, 97, -128, 176, 74, -146, 141, 70, -193, -66, -98, 141, -188, 93, 289, -85, 16, -62, -94, 132, -15, 67, -223, -68, 117, 366, -234, -27, -96, -114, -103, -339, 42, 13, -44, 253, 2, 76, 227, -138, 137, 5, 180, -54, 123, -98, -165, -186, -148, 286, 74, -1, -196, -36, 75, 84, 33, -221, 135, -195, -164, 16, 33, -431, -88, 102, -17, -4, 184, -386, 51, -32, 397, -9, -116, 320, 119, 62, 81, 20, -132, -124, -6, 65, 69, 347, -56, -178, 30, -244, 78, -100, -151, 243, -327, -9, -111, -99, 112, -213, -47, 76, -175, -93, -308, -135, -208, -19, 331, -11, 136, -91, -70, -4, -108, -232, 308, -312, -180, 27, 78, -44, -217, 53, -372, 113, -113, 349, -202, 6, 146, 165]
5058A65k53K50k96N3K18j67l95M64L4j88j7J42J90k04J34J69k74O0q0J63j64%
5080DK50l05k05rm2R7j51rL44k04K6k0k22M00r1J81j87M6L4J58lp2P0j21j80L74
5106A63k8j63K6l5J02k14J26R6Q9P4l85J75o7K48l29r8L37l48L1J70n8q4j08K68
5130a2l8o7J71j78j0nN0J33M7j49L1J60J9k40J94k91L19K37r4m56L10R0n73J06
5154b46J92P0p9J09n9k97K51R9L63l50j66o6J26J32j12j15L83l12%J48J31k49
5176d7J81k67K34r5M6j7N1lNj24J89R7m09N59m17k54M18L6m37J48l9j54M56k79
5200a22pJ69J34j11j90K12L19k03k98j2R4K14N3k49k97p9L61J80k85j18K61J37
5222A63J46k89O7O8k30K35Lk91K35k8M2k49K43O2l16K23j66L34j19k36k1J05J06
$$ y = [165, -88, 162, -134, -81, 137, -30, -425, 39, 73, -115, -132, 10, 200, -4, 130, 299, 25, 85, 5, 168, 4, 4, 254, -51, -256, -265, -307, -210, -361, -370, -26, -230, -204, -224, -446, -46, -137, 44, -143, -97, -63, 95, 92, 20, 90, -31, -211, 163, 135, -28, -2, -37, 65, -149, -23, 73, 162, 236, -149, 26, -41, 207, -122, -220, 117, -231, -200, -30, -88, -172, -280, -12, -50, -117, 54, -124, -134, -139, -89, 44, 91, -58, -27, 133, 152, -88, 106, -185, 134, 371, 277, -179, 131, 221, -352, -246, -54, 16, -63, 46, -13, -310, -59, 40, 403, 53, -113, -179, -53, 79, -33, -148, 235, -77, -77, 71, 202, -47, 134, -133, 101, 6, 52, 35, 86, 83, 88, -36, 153, 250, -159, 400, -17, -271, 147, 183, -254, -106, -145, -299, 157, -122, -129, 40, 174, 63, -127, 85, 404, 201, -97, -109, -15, 199, 252, 3, -294, -373, -12, 168, -117, -235, 26, 163, 309, 20, 87, 155, -75, 160, 163, -128, 107, 79, 121, -128, 115, 177, -139, 84, -82, 252, 133, -103, -124, -19, 87]
5245H7N6m32J01J68k25J63L30l04J93j59j63J40j11q6j4J12j18M83l34k1J24j17
5267a27mJ13K71K1m63l5L55p8R6K55n44L21j17P6n7Nj28k31L58k74q2L61q4L2
5291D0Q9j77r9oJ20K4k45L45j12j14K73q0L00j94j19Q0j72J57R1l27K80o21O37
5314A70k94K99n7k26J25l46M60m66M58j09j22M19o37L38o5mK03k94L57k85J64
5335H8j99K20k00K49N6j93L2k63N76m31M34l04Q2j3j33k80J85j43J10j62N15j30
5357I6k01P4j43L04nj43j32k8J34Q3r7K67k93R7j04J54l16M63j80k06J53R9j00
5380b4k01K26k54R5J09N9K63k89P1J84m98J94k2k9K62k33KK59j58j21J93l28J97
5403d3K3M2K15l59J73o9K1K3J8k5P1j14j45K02N6K83n75J96l2k6l19M12J63k04
$$ y = [87, 143, -289, -188, -20, -245, -82, 248, -56, 137, -22, -185, -45, -156, -242, -256, -144, -262, 221, -113, -134, -10, -127, -131, -18, 253, 274, -189, -224, 131, 53, 149, 404, -140, 181, 64, 140, 83, 88, -40, -271, 87, -187, -269, 92, 8, 40, 129, -48, -147, -153, -33, -9, -254, 91, -21, -135, 138, 58, 358, 164, 45, 125, -47, 110, 201, -126, 154, -467, 170, -124, 175, 118, -108, 17, -329, 131, -335, 123, 14, -108, 311, -326, 12, -53, -57, 146, -148, 209, -76, 88, -111, 109, -91, 158, 214, 21, 53, -210, 366, -65, 369, 65, 147, 134, 1, -279, -94, -237, -127, -289, 226, 96, -105, -31, -174, 130, 125, -18, -150, -178, -44, 39, -58, 209, -84, 13, -91, 63, -253, 210, 30, -176, -23, 76, -24, -225, 1, -253, -158, -49, 10, 273, -16, 55, 239, -259, -65, -87, -116, 146, -87, -85, 174, 16, -105, 88, -240, -43, -20, 22, 237, -122, 51, -18, 3, 26, 44, 19, 90, -24, -169, 33, 89, 372, -203, -7, -39, -65, -384, 28, 191, -13]
5427a3J53J38J0k6k88j98R4J21j68L02p9k15J89R8o8Q2k26J52J76l91j91L88J76
5450B16k90P0K0k7J8K9j53O1J33jq2K02k43q6J36K28k86j97L23l62L94k15L1J28
5474D7k03K80j83K09l63j3L19k16J40Q7k34NqJ13o9J2J14J62l8n28N84o3r2J41
5498B03j68j34l27K12L22J01j68P9k45J35o6K04r8OK22k34o1l8K68p9o6k19L4
5521a17J94j92J3l5J52p5QK26P0k06L1k4Pj56K9Q4k28o6K73P3j93m6J26K1K77
5546B46o9k45l6J19j29Q7J36K10m82j50O14k68N2k05M27k96J40j2k62KO18q59
5568c62M18j63J62R4k6r9Rj24K95j37K81m60J36oJ79l05P5M7k50K86j32p2J83
5591B9l7JJ98l24j76K48R5K8k64L76k2k91p3L30j81qj39K16q6j3J74J70l72n2
$$ y = [-13, 140, 278, 288, 262, -26, -224, -130, -9, -177, 125, 46, -169, 20, 118, 50, 132, -94, 58, 234, -157, -348, 40, 216, -74, -4, 16, -11, 7, 36, -117, -56, 77, 76, -6, 196, -47, -133, 3, 231, -55, -252, 71, -291, 103, -112, -81, 47, -156, 124, -59, 150, -213, -226, 93, -123, 17, 104, -130, -125, -133, -20, -89, -77, 37, 199, 161, -367, 217, 154, 62, 203, 35, -99, -426, -214, 108, 209, 41, 120, -125, 10, -56, 148, 50, 56, 278, 44, -17, -55, 213, 134, 68, -151, -117, 77, -115, -102, -137, 15, -60, -52, 174, 244, 38, 69, 45, 52, -104, -75, 9, -219, -285, -12, 61, -132, -178, -52, -31, 246, 177, -68, -104, 15, -114, -27, 109, 319, -163, -313, 301, 33, 85, -120, 307, 11, 151, 139, -123, -121, 497, -362, 56, -107, 55, 149, 123, 24, 33, -91, 204, 67, 348, -112, 24, 18, 197, -108, -33, 14, -236, 50, -82, -154, 29, -8, -7, 191, -133, -309, -61, 34, 62, -202, 174, 152, -139, -212, 118, -63, -71, -210, 6, -80, -93, 81, 251, -121, -173]
5615a73o4L14j44J39J5R2k87M5j23L31R8l76J51J91k51j86P0K46l53K00K15L5
5637A85RN0k72l48O02k96J73J18l55K93l29L27k90L17n9k36j51J96R3k79L74P
5659A29k05K74k91J2n0Q4K48M9l13R1qKJ54k90M9j18J55J02Oj14N43p84q3K95
5683f3M7l9J14m72L50J9j53J09k86L12M1J26J41j59m04K88qK11k2k61L46k03k69
5706b35K66J19l7l67O4O13l52M8K15m45J34j5Rj21K63q7K48m24L9R2k33J94j03
5729a15L10l60K55j44J01L7O0k73j79P75n50j57L05m2R8O9k11K56k55l14J32L28
5751A26r9j53K26p7o9k6K12j22J52k06k33K90j1L0l26N68k81J13K6J68l79J47
5773G6J54m41M12m9k62L74m01P7O5k19K31J78p2j96J45k5j21K94l72%P3j23J14
$$ y = [-173, -237, 77, -67, 72, 87, 179, -108, -63, -186, 145, 243, -133, 18, 209, -42, -228, -158, 88, -265, -65, 150, 185, 194, 244, -28, -376, 226, -70, 103, 221, -134, 159, -170, 157, -133, 184, 125, -111, -262, -66, 27, -252, 122, 129, -76, 198, -93, -81, -131, -47, 201, 250, -63, 28, 20, 22, 176, -114, -65, -183, -28, 74, 80, -34, 509, -275, -358, -63, -16, -55, 59, -413, -63, -44, -197, -88, -374, -62, -21, 105, 246, 87, -317, -29, -37, 174, 152, -109, 237, 34, -235, 31, 150, 113, -254, -190, 423, 71, 119, 334, -111, 23, 8, 17, -104, 159, 72, 320, -104, -65, 27, -206, -12, -115, 195, -165, 90, -54, 47, 84, 144, -129, -308, 467, -83, -240, 65, 23, 121, 190, -21, 235, -20, -334, -202, 126, 27, -126, 100, 23, -46, -72, 140, 18, 170, -36, -269, 21, 10, 40, -286, 282, 1, 114, 140, 308, -71, 76, 230, -211, 201, 152, -110, 264, -137, -60, 5, -214, 17, 195, 123, -73, 72, 47, -74, 220, -152, -152, -79, -202, -88]
5796h8j0L67K3m71K21k1l71N49k28j18J20J17j55K17j97P3j23O3J04l33K32M2
5818A3J35j11O7k6J89k23o8m00N94k48k11M84k54K2j24j0K25j46l15O15R5m85
5840a82J19q1K42k08j43K76j60k4Q9Q4p9P9J6KM5J00k77P2R6k5j55K00n1J36p1
5865A00J10j22l8j21R3J49k99Q1J0K18j58j37K47J40j0j60l28J57k70L21o6J56
5887G3m5j16J88l26L07j42J4k11J77j27K21q9k46L91j87m9L25k34R6R4p4q9l1
5910h0J64k09L32m62K56n0L8K66m13J25j91J97L3N2m01O01l77K06j13j59K87K1
5932A23m77M86l89L14L9N3k01J93j25o1M39n55K2M3j0q8K58k98K02J21j33J17
5954G3o8p5K5o2J69j47M38l32n8N58m58j46K88j66Q4k94o7K18n9J0M2J02l19M82
$$ y = [-88, -98, 269, 292, -179, 42, 21, -350, 199, -29, -147, -27, 90, -65, 152, -45, 28, -95, -32, 72, -261, -29, 13, 148, 37, 104, 78, 267, 44, -24, -424, 170, -78, -289, 195, -59, -37, -161, -171, 54, -92, -407, 208, 303, -182, -63, -144, 98, -110, -253, 23, -137, -161, -72, 12, -67, 12, 28, 30, 75, 175, -102, -30, 66, 41, -114, 86, 35, 171, 100, 210, 88, 50, -71, 22, 171, -128, -47, -37, 181, 23, -114, 133, 273, 263, 103, -225, -68, -338, -17, -83, 73, 28, -88, 100, -226, 81, -61, -47, -258, -81, -208, 13, -76, -322, 69, -118, -167, 158, -76, 20, 114, 40, -49, -80, 84, -125, 207, -255, 1, -49, -11, 255, -158, -33, -224, -27, 6, 58, -343, 258, -119, 87, -26, -185, 102, 123, -354, 132, -257, 57, 96, 149, -52, 141, 16, -45, 394, -161, -139, -96, -106, -194, 64, -234, -32, 89, -44, 73, 5, -70, -45, -107, 62, -85, 353, 21, -37, 521, 63, -83, 205, 39, 123, -171, -238, -20, -79, -69, -27, 75, -244, 238]
5978B38k65J24O8m74J94J86P0q4k8j08K07j4k24o9M10J47k81r2k20L74k40QL16
6001B43O9l41R7k45J15L77k09k42J14rQ8K77k03k57L04k75J95k94N0j04L07j40
6023h3J40J2J94Jm8j86Q0J73l58L61m80L44k34j36K09j96K13q1L8k05L17J54r1
6046A38rN0j24r3K7J87o1k05M75l95J47r8j08P9k59M29j04P6j93P6O9r5j35K21
6070I5j10l70O33k06l09N71k71l34L98l63K10k31K03N45n45mOj00K06J66k65L35
6092B60r3p3n1k83O04l90J18P1j57K3l18j9K48J64k4j76J23J10k20mN39n25O1
6115a2NN7J10k87PK14j55J28j63J07J86r7O4l39J1K40j77L01j57l7N6k08L05j85
6139b6p2J04j43j7K41N0j5l50P6L23m48K23j54n9j90M59j32M37o64K29J18oL23
$$ y = [238, -27, 97, 165, -309, -115, 71, 141, 57, 29, -79, 128, 114, -110, -179, 231, 378, 97, 5, -215, 159, -81, -73, 243, 312, -29, 68, -177, -62, 315, 106, -136, -22, -31, 57, 334, 131, -126, 178, -97, 98, -196, -146, -250, 57, -83, 57, 69, 263, 264, 216, 30, 110, 283, -75, 286, -194, 150, -84, -220, -11, -207, 6, -75, -37, -242, 75, 229, 138, 129, 179, 55, -38, -11, 176, 115, -90, 385, -10, 137, 39, -69, 10, -249, 180, 76, 152, -41, 35, 104, 9, -126, 95, -15, -385, 248, 42, -267, 304, 33, -301, 97, -266, -56, -287, -84, 461, -84, -88, -82, -182, 24, 190, -75, 260, 167, 94, 43, -240, 364, -26, 92, 163, 6, 29, -289, -308, -60, 104, 80, -96, 27, 137, -83, -87, 452, -73, -12, -7, 50, 160, -127, -120, 94, -61, 67, -96, 11, 197, 100, 164, -175, -164, 76, -101, 200, 43, 6, 62, -146, 159, -26, -98, 6, -137, -154, 87, 137, 122, -228, -152, 171, -277, -54, -208, -267, -457, 2, -130, 307, -357, -128, -10, -16, 307]
6162C07l52J66P7j13j48P6J56j45rQ3k48J87J84k66J38l05L06n23M13N6m5J31
6184A26m4k29Q3L03k28L06k89j49J34j80Q2K3L7R5k08J04J7K4m23L66k84L37o
6207cJ82L8n73N97m44K34j26O5j08K0J92K03j93J25k25k25L09p0j53J41j03J80
6229F3Kk4L51l32j23R6m25M94k64K71j42O1j4O6j30Q5k72J62k48M27mJ23Jl75
6253a51j8J11m7J41q9K65j6k98J00n7L50m43M14l21M75l25K84n93K23j47P9J99
6275A36j26P0J73MK8l46J62J09l0j55o8K50pm9k3k08j00J71j77M13k81j14P4J9
6299g5n9N6L12k03j54O4j26N7j28LK56L38o38K95J24O3j13k75J73r0J47j87L01
6322A41M4m06L0K29R9m3m07L63R4k15P0L68k32oq9K92k92P9j88K8k4n9j41j27
$$ y = [307, -45, 121, 198, 85, -63, 13, 169, 24, 15, 98, -150, 37, 221, -45, 93, -212, 94, -429, -16, 40, -5, 126, 82, -147, -64, 239, 11, 317, 28, -121, 13, -167, -85, -62, -25, 70, -138, -34, -17, 7, -416, -50, -334, 3, -3, 179, 217, -356, 241, -203, 31, -95, -30, -138, -118, 74, 277, 84, 209, -16, -241, 68, -2, -155, -14, -117, 63, 65, 41, 392, 60, -63, 33, -392, 102, -162, 109, -33, 28, 14, 80, -50, 35, -237, -75, -323, 104, 100, 223, 224, -151, -169, -58, -105, 36, -53, 212, 196, -102, -2, -59, 291, -152, 262, -59, 416, 91, 375, -218, 5, -142, -63, 136, 10, 80, 253, 257, 285, -61, 101, 210, 180, 25, -43, 207, 200, 151, 128, -80, -180, -9, -186, 227, -54, -168, -94, -75, -134, -78, 234, 31, -123, -59, -185, -128, -256, -253, 3, 341, -297, -2, 122, 185, 72, -203, -30, -120, 27, -160, 141, 185, -221, -191, 38, 137, 94, -313, 50, 144, -71, -1, 367, 135, 129, 40, 332, 40, 119, -69, -41, -65, -124, -265, -392]
6346c92J62O3O2J73J45rj69J85r2k22J36r0L70m97Q3K40l91K36J0J68l72M46l39
6369i4k41K64j5j69l2L00q7K5K21k80j25L00j92L43J58l30k21K49p9J81l10j73
6391c07M33j6Q5k83p8J42K63j93o1j4j29M24m46J81J27k43O9J21P2kj81J68k02
6414g0J49n91M92k0J85l25L88k36k0J50N1m65J17L02m84N86l95L7o2P7J21j10
6436a23J25j21K88m91N82k87L14m90K35L6L4j77J88K03m90L25n50K71L20r5k88
6457a91K8N82k77k96J08q7n8K54n8p1J58k27P1l9N1j30L11K1M5K8j64J40r4K09
6481C14n32J33J61K06n6k91k4j42L35j23m4J32o3m3j49J69J62j42o7j95K05J79
6503A25n3M1j81j04m3P0J33K43j40l02J98J43j82m9M8K1j56N1M1M1J85j46K09
$$ y = [-392, -230, -167, -105, 68, 213, 204, 35, 220, 128, -94, 42, -48, 322, -175, -92, 148, -243, -7, 3, 171, -201, 245, -94, -335, -71, -86, -255, -287, 13, -74, -49, 172, -108, -233, 67, -125, 218, 376, 46, -175, 74, -5, 176, -134, -307, 126, 110, 195, -88, -166, -24, 239, 46, -15, -29, -158, 266, -180, 1, 128, -115, -46, 75, 147, 145, -36, 132, -70, 79, -512, -20, -40, 145, -180, 208, -28, -48, 102, 153, -312, -195, 107, -377, 209, -186, -149, -211, -134, -13, -123, 2, -119, 169, -322, 260, -27, 287, -203, 32, 68, 102, -75, 113, 316, -174, 151, -399, -128, 192, 97, -191, -163, 419, 142, -154, -46, -133, -191, 63, 5, -66, 92, -135, -64, -103, -52, -182, 129, 150, 195, 223, 59, 199, 105, 314, -218, -85, 76, 282, 226, -65, -89, -231, 104, -19, -63, 69, 6, -37, -186, -17, 145, 3, -64, -259, -54, 125, 72, 113, -68, -172, -215, -145, -12, 231, 91, -211, -13, 130, -52, -101, -53, -32, -188, -137, -96, -55, 130, -16, 193]
6526A93j62j2j82K33l38K10L34l02k8k33K38K92l12Jo5M33n40l3j18N28j73j82
6548b18J52K73k39q6j57K88K19k97l09K21J80N1l62M1J47L52j43j73K36K2l11
6569a13k35M47n92N03l1j39K04J7mq9M74o04M55m02j52K29r5K28k06J63o9J19
6591A08k35K73k82j7P8L12l76J66j03J70j25m4o3K93j49J37k62M5O2P1M8l21%
6614b14QJ96K21j08j87M27n46K02K1k7k0o6K81n00K66K55l38L44j30k27M24m43
6636a61L30k56K53J29l10J84kJ91l71j46K69l32n0J67J79K47k24l89P40l86o2
6657@k9k50J84M7m8J55J72k21J57k49R0K12p0l86K17M6K0k55M53j29l41P3K50
6680I8k87N5K65k36OJ47J24l40R2J85l86K49J11l54M23M3J0j10j17L80k02l73
$$ y = [193, 31, 19, -163, 70, -268, -58, 276, -26, -54, -287, -49, 243, -69, -68, -133, 300, -240, -273, -391, 137, -36, -218, -66, 207, -32, -118, -275, 13, 232, -65, -374, -153, 27, 78, -284, -243, -96, 256, 113, -60, 176, 198, -113, -348, 99, -493, 10, -21, -160, 44, 61, 57, -32, 442, -162, 293, -109, -261, -32, -127, 101, -105, 58, -11, 108, -127, 146, -136, -153, -75, 237, -139, 27, -76, 94, -31, -75, -138, 155, 6, 143, -119, -74, -12, 59, 107, -214, -214, -206, -10, 211, 103, -84, 343, -203, -1, 20, -7, -27, -93, 188, -312, -46, 209, -129, 215, 85, -142, 282, -161, 169, -87, 166, 295, -15, 169, 167, 358, -13, -159, 110, -222, -272, -105, 74, 321, 97, -292, 448, 62, 0, -29, -279, -95, -48, -96, 59, 231, 10, 167, -82, 8, 220, 150, -236, -19, 27, 47, -208, 245, 116, -225, -152, 98, -189, -134, 131, -105, -99, 48, 172, -168, -76, 109, -277, -28, 83, -271, 152, 195, 205, 95, -22, 358, 156, -217]
6702b17L69k11L86j5j90k52J64k99N15Q5l16oR0J03j55L21n93J37J32L3k73L18
6724A26qj32o6k99O10j02l59r8M09J6q6J88n9j99O9L9N3j9Oj82J18k36P8L77j65
6749G9k18l2J16P9J98Q1m52M4j36J52j9k80L72J67l39L60k5p3k3M3J9l02l05L75
6773a19J38R2k92K45J4Q8m98L14J42j58j01K90q6j65k28K82J17j43N04o45M75
6794B66n23J04Q3K74j80l02J91K09j44m5j33P6J27K9k36J59J55l0k42Q0o8j68
6816c18M54M4l59q5K26JJ78k13J36K52l55K65k26j86K88j55K78j18LL8k26P5o4
6839f7MkL2j74L51j7l20N17o99J66K97k6N5j35LJ76j76k1l88J34K39q1K12Oj3
6864G3p0r7q4L33j51O5j22q7J62J11l98P00k76K0j15m3j04K41m72L55J50K1m28
$$ y = [-217, 152, -59, 327, 312, 122, -130, 34, -265, 250, 335, 19, 13, 103, 206, 51, 372, -221, -84, 48, 81, -192, 126, 118, -14, -80, -379, 231, 129, -230, -328, 81, 97, 11, 199, 140, -59, 10, 49, 102, 83, 89, -93, 25, -211, -133, 244, 79, -139, -171, -55, 24, 222, 303, -149, -105, -241, -89, -108, -388, -16, 151, -188, 172, 147, 74, 51, 94, 113, -189, -494, -119, 19, 111, -181, 64, 78, 166, -332, -18, 124, -34, -135, 155, 69, -96, -324, -42, 75, -68, 436, -209, 266, -257, -153, -70, 204, 24, -278, -87, 122, -22, -67, -200, -124, 3, 32, -204, -45, 110, 80, -162, -82, -150, -318, 136, 180, -179, -264, -38, -37, 141, -72, 64, 316, -39, 226, 0, -186, 102, -53, 225, 107, 110, 148, -78, -3, -67, -63, -65, -33, -207, 144, 127, -193, 324, -375, -209, 88, 62, 117, -18, -15, 161, -15, -36, -424, -290, -51, -132, 80, 86, 73, 3, -94, -178, 155, 4, 69, -53, -140, 22, 133, -265, 435, 159, 179, 64, 21, -83, 158, -314, 41, 191, 212, -216]
6887b16o6J81K32k15n7K48j94K72J3l26J53KQ9O1J35n54K52j67K10j48J04o2J03
6910E0qM9K19j88K87k41o7j59r6L1J94J47j50l50K42J24j0R0M7j44m4J94n3J38
6934C02k12l81N29l14K13mm25L00K18k95j6J77p7j1j8l9O1j46M3j78M29j10O8
6957A14j54K9J28k41j46L57n5M5j01j44L44j17j0J23K9n68J2K67J03p6J82R6l77
6980a60K18J43j93l2j42N5j48L66o1r4N9k71J66J95j90l7J75l0J04M5o1Ko4oj8
7005B1K99l26K07l98L37M8j59l63K78J74k49R2J49l78P17j86j75k85J19J07j06
7026g7j43L00k77J91n7QN5j53M95n27L45j89J97l16R4J16p0j42J05L08l00K00
7048A63k97K56l72M27r4Q6j59J32j89Mp4n6K98M9k95J49k71k29O61j40n3j76J21
$$ y = [-216, -282, -101, 131, -84, -141, 107, -87, 185, 198, -128, 25, 27, 116, 177, 312, -242, 10, -157, 53, -95, 9, -53, 50, 42, 91, 310, 122, 409, 168, 101, -58, -154, -123, 71, 218, 68, -282, -40, 84, 74, 164, 211, 67, 23, 217, 164, 302, 90, -291, 238, -76, 137, 133, -292, 8, 226, -69, -85, 92, 15, 4, -14, -53, 8, -138, -95, -273, 156, 46, 114, -40, -11, 117, -124, -270, 87, 32, 77, -24, -168, 176, 59, 49, 172, 201, -367, -355, -88, 15, -61, 121, 217, -160, 58, 201, 8, -24, -166, -111, -259, 107, 46, -48, 11, -260, -94, 101, -89, -126, 49, 19, 123, 168, 107, 109, 45, 39, 21, 320, -6, 201, -197, 140, 188, 29, -334, -56, 118, -131, -39, 110, -268, 449, 263, 88, -197, -78, 29, -77, -220, 80, -197, -6, -63, -55, 0, -153, 342, -185, 160, -29, 168, -148, -54, 62, -8, -150, -45, 263, -37, 163, -134, 122, -250, 177, 83, 169, 10, 142, -47, -43, -117, -173, 125, 174, -121, 28, -243, -472, 189, 49, -4, -180, -59]
7071e9k66L52K54j58J46n07N11l68K3l25P40p9j72p3l45N69l09q8K95l31L23m01
7093b68K33l14L27J31j48j33N8J91l21J58L1k41K28J06j79J70l32O05l86o3L5
7114a12J62k20K86j05j3J93J21j31P0nm37L96K0l30JL01l54J40J55k75K62j57
7136c2J29j22RL91k81j85j4J68K64l36j80L80J10l56K33j99L0k29J93j35K05N1
7158I4R4l12L96j08k94j5K39j67m7J17l07M74j47p8K71k49r8K93n92N58K62l53
7180C1j96J13L47k36l02K33J58j88J1J48j04pk7k19M16m56K14J38M5j1r4j94K04
7203B4J67l37J62J54k89N8j83N56p8l59R3Q5m6n9J87l51L79M2l6j93J87k46J46
7226F3k12J91m0j68K3L25K3O0k26K90l02O4k41K60m5l59R9j62M34l69L96j11p9
$$ y = [-59, -325, 27, 281, 123, 269, -238, 273, -95, -72, -397, 343, 264, 92, 19, -326, 243, -66, -154, 141, -190, 133, -268, -35, -349, -22, 109, -39, -172, -114, 77, -244, -86, -55, -296, -68, 38, -141, 29, -303, 302, -84, -147, -112, 50, -170, 116, 11, -2, 191, 312, 181, 251, 246, -191, 205, 225, -105, -104, 197, -157, -17, 138, -137, 125, -32, 97, -25, -16, 375, 94, -91, -105, 63, 327, -9, -189, 191, 301, -55, 178, -21, 9, -220, -27, -162, 43, 94, 188, -124, 272, 164, -130, -145, 94, -73, -120, -3, -310, 164, 17, -61, 210, -39, -137, 156, -436, 122, 384, 31, -165, -52, 295, 59, -243, -10, 148, -40, -29, 119, 15, 8, -19, -238, 178, -278, -64, 74, 119, 108, 14, -180, 24, 191, -146, 16, 170, -119, -61, -244, 312, 234, -125, -32, 53, 7, -52, 135, -216, 163, 205, 169, -24, 163, -83, 63, -149, 42, 2, -166, -143, 182, 205, 265, 39, 329, 27, 91, -150, 110, 65, -294, -195, -357, 77, -292, 104, -7, -86]
7249h6K56m05M77l24n8M7rM78m87M6L5J15j31K23j13RL95l92P8J10l32l9J06n3
7273e4J50l59L28k26K16J34k47J68J53j65k35K32J39k51l6J21k19L40k12J88j70
7294ej36L12m80M83p5k04J98k91K88j36J25k46L80o11M76lj40P6J11l41J61Lm2
7317i7J15r9K57j76P0J03M2l91K80l20P9L28k92R7j28J33j14K21j19j66R3J80
7339I6n2J37k26J42p0N3q1K09j68j58M00n37J50R6O8q1J19l4k71L20k3j8M4R7
7363B12m89R3O4J81k22J72J00l95K33L60j90r1k50K07j0K21m15K9L58l54J99P6
7385H9m4K3J06j57J04k77L71k1j35k1m24j0M30k39M29l15r1o2L52l11J84j33K20
7408F8j0O2k80J3j68K46M8L93m11j02l8J00k37N27q9j75P0j43J27l34K60P6M6
$$ y = [-86, 170, -235, 242, -82, -140, -93, -102, 376, -111, -65, -30, 85, -46, 177, 64, 73, 468, 76, 154, 264, -68, -107, -1, -54, 96, -263, 65, -161, 55, 189, -58, 110, 263, 98, -137, 95, 234, -17, -53, 68, -151, 189, -23, 165, -5, -141, 171, -309, 174, 99, -105, 93, -198, 90, -46, 79, -167, 213, -398, 78, 75, -65, 11, 122, -219, -58, -55, -97, 18, -81, 176, 0, 70, 173, 215, -176, 104, -216, -137, 191, -101, -4, -132, 1, -113, 108, -11, -177, -84, 96, 44, 181, -45, 97, 27, 80, -1, 208, 40, -118, 282, -255, -105, -9, 59, -22, 97, 63, -208, 112, 89, 71, 115, 212, -277, -184, -120, 61, -161, 11, 111, -284, -51, 309, 119, 28, -222, -15, -25, 196, -219, -190, 168, -186, 13, 89, 45, 68, 174, 17, 121, -156, 215, 194, 59, 38, -386, -396, 34, -205, 224, -91, -182, -244, 108, -203, -19, -152, 68, 58, 120, -160, -147, -315, -69, -21, 372, -39, -141, -179, -79, -316, 211, 122, -53, 17, -126, 1, -333, -73, 3, 49]
7431D9p3K05M4j55j94K40l06K74j28m4M1P8p9K79j22p8jj57K5j82M76l37J95L8
7455H8P9p7m8k72J64KQ0J79o4k6k85M59k24K02q1j6j70j5p1N6J74J83m86P4k48
7480c43N26k51L2k10J70P1O6J7N4J11l69J90lj07O9k06K00j45M09k62L10o40L59
7503D8j14J97K38k45L1r3J32m05J21n2K8k16L75j10q5J30q1O6Qj28J96N3J61l67
7527a12J47j25JK17j97Q2j74J77k1J96l83J28J08j64JM6K72j89p0M6r3j2kK87
7551A66j28J79j57J77k11R0m9K82l79r0m3K75j0J13M5K1m41J11j16J26J75k97
7573a61J09m4N93n35Q3k39K85K69l93r9J54k33K26K31l73K5J39k56L21k60M27
7594B69m79M09j38j24K81j82N3j74K04j63O5j39M58l09j8j10j78M5K90k51K75
$$ y = [49, -24, 181, 225, 70, -124, 116, -190, 84, -44, -88, -47, 31, -48, 231, 109, 31, 30, -127, -102, -284, 192, -145, 50, 88, 167, 90, 42, -230, -66, -64, 16, 195, 131, 105, -180, 279, 55, 257, 176, 160, -10, -25, -96, -40, 134, 317, -169, -95, -343, 183, -68, -36, -246, -76, -5, 61, 78, 132, 243, -126, 64, 61, -46, 23, -183, 17, -128, 281, 19, 329, -311, 48, -66, 131, 369, 124, 155, 62, 194, -211, -90, -142, -114, -330, 45, -65, -150, -20, -101, -35, -27, -155, 41, 94, 255, -112, 35, -90, -89, 128, -69, 13, -161, 16, -5, 191, -192, -64, 44, -120, -119, -73, 199, 10, -60, -14, -107, -119, -121, 166, 38, 217, 60, 237, 26, 116, 67, 349, -30, -120, -163, 112, 102, 215, 260, 281, -160, -49, -165, -39, 136, -161, -52, -96, 497, -38, 45, -194, 91, 360, -33, -132, 22, -211, 15, 246, -127, -102, 37, -219, 102, -158, 269, -210, 199, 61, -63, 218, 36, 89, -85, 119, -44, 21, -118, 340, 31, 13, -97, -275, -230, 60, -191, 84]
7615H4Q9k14j69J01o2J67O2k32L11k67J37J57k34J4K26ok44p2O9L61j93k25l07
7638d47L69J00J08j50J74R2k42j24J59M4l64K64K21q1l13L63N0j86P3k76MO4J21
7661B3j74j51J15J31j40J84K98l00j98K83R7j52J13j65R5j09K64j74j10K65l26
7682a31m2L87l61j74O57k40p0J54j3j96J29n52P5M22k0K67j74j94L11j8k88J58
7704H7j28J15J92r2J02o04L63p8J22J20m96J53K41K48o94K33J65j31mJ35l19J36
7726a34L11l38J97l17K54k65K66j34K98k71J09R5j90J74kk64J75M0K62m17M57
7747C06m88o2K58N3j17q5J01jj55J10J80n8KO7j12j55M5J75M7p8J2l4R8J89l14
7772a6Ok69N35j38j91R7J36k18L28l18K14j69l5J45k77o1p8J34Q2J7l7K02k76
$$ y = [84, 173, -41, -210, -109, -171, -4, 58, -174, 137, -130, 7, 164, -70, -56, 170, 164, -80, -152, -83, 278, 85, -140, -447, -78, 22, 130, -20, 154, 246, 4, -120, 39, 83, -281, -17, 204, 123, -190, 173, 223, 37, 110, -166, -162, -98, 23, -151, -302, -187, -56, -196, -12, 286, -14, -212, 71, 168, 16, 129, -36, 59, -50, 214, 40, -70, 195, -131, -173, 214, -147, -321, 336, 96, 26, 180, 167, -29, 100, -452, -377, 45, 25, 292, 118, -76, 235, 217, -71, 87, -41, 74, 266, 174, 276, -328, 35, -43, 79, 199, -297, -144, 97, 345, -349, -116, 49, -82, -86, 49, -270, -134, 177, -161, 36, -281, -27, -292, -26, -160, 138, -133, -24, 71, -119, 55, 53, -211, -36, 4, 266, -151, 306, -182, -244, 14, 67, -50, -135, -34, -35, -190, -80, 100, 42, 44, 111, -1, -156, -111, 64, 111, 33, 45, 11, 109, 298, -16, -10, -279, 256, 118, -73, 24, 160, -58, 270, -48, 166, -3, -38, 107, -170, -231, -309, -175, -93, -76, -113, 89, -187]
7795a87J52N5J19L4j83k66J29J89k0l25M97k08K03J53l77L1M4p5K79j89p3R7k22
7818a43K67j97l3K32l34k40K96N0J48n3NJ12j83N15m53j01K41j16J35k07k21j51
7840d31M87K06P6l66K6j92J07q2K02K3k81L18l55K61L1k07J17K95l86Q3J75j27
7862b0n8q5J94J75k82q4L0K86j82j33M68l90J41l83L92K63k90K67n13M0m1j40
7884c45N01o2k02Q5J2K08m08J35K89m27K11J05O3l07J23O5j48J16j35R5K12l65
7906a79J61JJ23r9p1J41l07O4K84j87J6M18k16k26M5l8n7K98m1n2J02J90l27P1
7930A14q4L39k97lk99L24j29%Q6K91l64k22M7J89o0J18k86M17n8k34K37k87J27
7953c4j34M58l46J77k5j07j38K73p4J23J17l35l2L65l00J86j76j51J52J79k98
$$ y = [-187, -35, 20, 139, 173, -10, -276, -147, 42, 22, -303, 194, -14, 189, 342, -35, -4, 40, -35, 244, 55, -18, 79, -143, 124, -73, -106, 126, -208, -448, -152, -102, 46, -7, -2, 110, -73, 442, -11, -112, 129, 13, 148, -59, -280, -431, 56, 262, 338, -28, -2, -194, -87, -169, 33, 56, -225, 93, -262, -1, 30, -177, -60, 235, -151, -68, 107, -20, -78, -163, 31, 206, -76, -160, -130, 156, -26, -159, 309, -81, 60, -323, 69, 332, 42, 309, -204, -164, -205, -345, 156, 94, -108, -23, -11, 197, -211, -76, 213, -214, -3, 102, 165, -142, -19, 46, -102, 14, -121, -26, 186, -179, -18, -17, 106, 7, -64, 77, -230, -166, 118, -69, -53, 365, 149, -77, -32, -70, -127, 171, 130, 78, 180, 370, 43, 114, 30, 369, 72, 69, -230, 94, -35, -35, 51, 342, -22, -244, -197, -8, -68, 50, -236, 181, 123, -111, 126, -161, -34, -168, 290, -56, 121, 96, -11, -149, 124, 50, 173, 290, -45, -77, 288, -12, 174, -2, -153, -1, 178, -120]
7974a20J84L52l28j39K18q7j58K25K40m48L18m38N1m6J29J5J3j12J55LMNK83k19
7998A00J37m2j71Qj6Jk69K40KL58q7l0r4k33j23M2K83m15j20O62j44J28k97R9
8022A9l3J83l4l87J84j77M47j15j23L19m13L31k2J40m36p0o8J27O5k31M13k02
8044h3j44L56j1p0K50l07J91n3j37Q9K8j8k94K78l67N21m05j15M91m03L06k64
8066a61L17q4J54l00O2K03k40k05J53J59p1K56j60J5k32J37q6P8J37P7j2k54k0
8089g7L6j3l09N62N7l36P5J00j78J43J85n46J18J30l9j2J57j25k59M09k4l2J76
8112A98j47k02K24k32K51j09j15J23K29l14P2K16j16j14J93k13J9O9j41j52L73
8133A12l6k38K87r7j71K5o7J35M0J05j89O5k86M08m52M01j7m14J91M21q2k86L6
$$ y = [-120, 64, 416, 88, -51, 167, 80, -78, 147, 387, -61, 257, -181, -130, -176, -47, -32, -19, -131, 24, 27, 31, 36, 319, 100, 237, 195, 24, 32, 16, 17, -252, -12, -10, 348, 261, 231, 137, -96, -219, -177, 106, -309, -429, 233, 89, 217, -80, 19, -14, 169, 135, -252, -68, -245, 202, 87, -36, 283, -130, 201, 179, 319, -117, -187, -255, -128, -63, -294, 119, -83, -227, 129, 118, 48, 298, -9, 182, 129, -8, 81, 109, 91, -203, 75, -292, 229, -176, -291, 200, -203, 103, -161, 156, 72, 226, -74, -12, 191, -49, -254, -101, 58, -13, 243, 83, 98, -134, 3, -83, -5, 132, 209, 197, -57, -77, -41, -54, -363, 199, 256, -80, -5, 95, -83, 60, 245, -301, -183, -53, -92, -104, 53, -72, -331, 78, 54, 22, 198, 51, -151, 73, -159, 92, -17, -132, -9, 220, -94, -22, 194, 78, -36, 157, -56, -37, 32, -109, -261, 112, 76, -162, 125, 28, -143, -118, -185, -50, -10, 95, -94, -29, -315, 93, -359, 42, 25, -389, -198, 223, 141, -145, -109]
8156a09J04J97k60J47j67K15j13M9o1m2j13PJ72o9L3j6L48k56j01J19k73L95k40
8179c4n7l7N5l63L47R4q4N9K11p2m8j75
$$ y = [-109, -5, 192, -68, 79, -88, 127, 14, 63, 2, -40, -153, -146, 26, -43, -10, -26, 322, 66, -35, 84, -189, 206, -34, -91, -128, -73, -436, -89, 5, -79, -20, 191, 119, 71, -104]
8191a04
$$ Imaginary data points
##PAGE= N=2
##DATA TABLE= (X++(I..I)), XYDATA
0@%%%Qj6J6k4M0m8O4q0R6j28J52j84K25k66L24l86M54n36O22p25Q40r65J109j263
27f71J440j637J849k090K351k636K955l302L685m102M556n061N611o217O887p622
43d004Q442r350J0364j1510J2804j4284J5994j7997K0383k3276K6879l1511L7716
56B0650m6531O0132q4140J39166m88950j54446Q44695K67325J50370j46051l88048
67A74172o20963k57723J24819L63256L78190L93365R1829k87215m69125l06090
77d15485j26595J07800L43330M26426J81767r8656k60562l11826k78908l1310
87d64019K46182L19335J96099Q0416o3868k49982l15376j40013Q4264K06083K36896
98A36017J90493R834j88550k35402j48605n0181O6620K01400K24613Q0158q0212
$$ y = [0, 0, 0, 0, 8, -8, 8, -16, 24, -24, 40, -40, 56, -72, 80, -104, 121, -145, 179, -207, 247, -289, 333, -392, 448, -517, 592, -671, 769, -868, 981, -1109, 1242, -1394, 1561, -1741, 1944, -2158, 2398, -2663, 2948, -3269, 3618, -4004, 4438, -4912, 5452, -6058, 6746, -7538, 8456, -9541, 10842, -12434, 14445, -17066, 20650, -25881, 34251, -49889, 89277, -399673, -554119, 290576, 557901, 708271, 562220, 174172, -446791, -704514, -579695, -216439, 161751, 555116, 646945, 359730, -109395, -415485, -542080, -434280, -90950, 335476, 517243, 418587, 158025, -153801, -432709, -464019, -217837, 101498, 297597, 378013, 314145, 64163, -251213, -391226, -306962, -100879, 136017, 326510, 336344, 147794, -87608, -236213, -286394, -219774, -18374, 206239, 286397, 206185]
109B06185j46120j60738j38250j5947J43872J91250J14185K0471o3226j49154
119B528j64990n9891P1301J26132J19119Q1510J33r9329j36399r0909j5843N8590
131a08048J18857J17758L7409n4835r6551r4294o1875R531Q5364J03944O0807
142A18067L154m7752q8412q4289k5408M3229P4139P1456M5070r025o7211q2132
154d9114m6527K358M3071O8289O0928J4697l5628n6859n2649l2071R029N1643
166b2833O2528L5264l908l5077n2376m5263j1174K8247M6434M1937K1540j0973
178E4346m0984m5109k5526L450K7712L9953L3735P836k1263l6346l3421j5682
190e1299J0650L1528L5050J8540l975k2055l0441k4737n432J6963K8090K5183
$$ y = [206185, 60065, -100673, -238923, -254870, -110998, 80252, 194437, 214908, 151682, 2528, -162462, -222353, -151052, -24920, 94199, 175709, 175842, 76513, -59886, -150795, -166638, -108048, 10809, 128567, 165976, 111141, 14590, -79704, -141579, -132048, -46684, 57260, 118067, 121221, 73469, -14943, -99232, -124640, -81411, -7272, 64184, 109254, 100229, 33018, -49114, -95641, -93283, -50212, 18077, 79005, 93702, 58074, 1215, -51434, -83505, -74476, -22833, 39695, 74959, 71051, 35974, -16402, -61665, -72839, -44592, 1842, 43779, 65319, 54346, 13362, -31747, -57273, -53823, -26111, 13842, 47577, 55413, 34150, -2196, -35617, -51299, -40649, -9121, 25929, 44469, 40494, 18439, -12002, -36739, -42171, -25208, 2882, 28065]
202B8065J0693q919k3883k5577j4651K931J7751K4111J8261K734j3302k1108j9094
215b1988p197P465J7743J8967J0561k126j3611j8027j3334j886R754J6284J4027
228A6632N231o039j3089j4259p592J955J0596J3222R291J238p545j1779j0574
241a2712l460M642J0171R950N653j780p723j0135o552m29N525Q761O910K978l390
256H409p139p494l705P23O068P111M613N4l739o186n724j633K700N194N364K718
272G334q44m242m918l347m10K935M273L962J066j598l595l821k092O47L137L398
288A885K149M54k145k793l050r55J529K548K403J479r5k181k363k029k48J476
304a936K219J861R94p32j648k283j059K02J095J952J541J29p75j682j613n95J25
$$ y = [28065, 38758, 29839, 5956, -19621, -34272, -31341, -13590, 10521, 28782, 31516, 18214, -2894, -21988, -29185, -21720, -3977, 14990, 25551, 23425, 9814, -8213, -21547, -23433, -13679, 2605, 16632, 21863, 15824, 2735, -11524, -19116, -17161, -6565, 6657, 15948, 17186, 9641, -2138, -12712, -16172, -11530, -1359, 8591, 14244, 12464, 4741, -5394, -11946, -12375, -6850, 1911, 8821, 11799, 8409, 1270, -6224, -9929, -9206, -3138, 3973, 8586, 8640, 4901, -1285, -7009, -8642, -5942, -748, 4616, 7334, 6490, 2248, -2670, -6017, -6427, -3492, 781, 4743, 5809, 4211, 616, -3205, -5297, -4650, -1513, 1885, 4034, 4488, 2343, -450, -3500, -4455, -2926, -378, 2025, 3504, 3409, 1228, -1135, -3164, -3412, -1936, 283, 2144, 3138, 2406, 758, -1525, -2584, -2382, -1287, 665, 2206, 2335, 1560, -122, -1735, -2330, -2205]
321b205J343J547J504q5o21j223j754m96K25Q87J242J120N94j161j143q31o45
338a702K99J010J177P80L12q64j044j063m92K14J146J125N24K98q87j062j133
355a362k33O21N24J559M64p3r58j198o06l66L33J310P34Q03k99p87q87o77j74
374a272L63Q24J099O06o43q02r55n47L61J65J155Q54j05l36p54p09o95M95N87
393c09J042L71L8l70r44p74k68O57O45P86K00n30o97n14p54N14M85R80L15K08
413A081n84q45l64k86N54P07M93K73m18l87o96o29P5N11Q63M00M91n94p22n86
433f63n58N50L08N96R27j04o61q74m58P2K13M74R54K42n30m95m63k32m47M29Q81
454A61Q40j99l78n29o41n5L09J55O68N43j70l41q63k15j37J51Q85K51M69l64n24
$$ y = [-2205, -862, 685, 2189, 2104, 1483, 260, -1494, -1990, -1765, -878, 364, 1484, 2078, 917, -226, -1057, -1702, -1403, -393, 784, 1564, 1876, 1012, -32, -1095, -1587, -1373, -227, 898, 1422, 1720, 833, -229, -1362, -1595, -974, -450, 1109, 1573, 1500, 542, -656, -1262, -1628, -1295, 15, 749, 1552, 1253, 466, -421, -1098, -1272, -909, -85, 1014, 1620, 977, 175, -780, -1327, -966, -801, 354, 1208, 1103, 767, 13, -696, -1391, -896, -309, 733, 1104, 1142, 772, -172, -946, -1214, -557, 88, 874, 1074, 544, -153, -667, -1421, -907, -422, 558, 873, 1081, 497, -348, -712, -998, -444, 263, 756, 1029, 611, 224, -472, -1101, -1026, -515, 348, 748, 1239, 645, -77, -663, -1221, -671, -363, 233, 1160, 1056, 395, -479, -937, -865, -652, -178, 776, 1018, 488, -7, -470, -702, -1149, -720, 161, 1001, 802, 424, -105, -746, -801, -492, -337, 331, 874, 704, 363, -500, -715, -852, -701, 184, 435, 904, 540, 16]
475A6k49q08K15K77R26L36K98k55o13p76m83M38N64M00M25k1m83k48q38L4K59
496e86O66M12L86l40m06o43k06J02k1N37Q44Q6j20q49l64q9j95N36N61N0K89j98
518D52m31k21n81M75L01J45J39N45n90j17n31k66K91L44M12K93k23L0m29o89K74
539c77J75L46L14K25m06l0n71k53l4J99L80O55J6k55n65j05j82m4L03M66RJ31
561C97k43k45l5n86O51p0K20L02Jk64j46k96k66J92L88K62M19m40k91m85N22m91
583e04R2R09k59K84n75q6j79j35K6M45N1L55%k78m39p3M95l52J49N43r5k51on44
607d27q0J70K23P3L20q4J17m86m78N62J32O0J85J5N3j18m63q7L7r6L09L81k07
630A11K93k53l11l72L37j97N35L06J36j4o99l14K17kj17M41K39q3l41k27L57l84
$$ y = [16, -233, -1041, -826, -549, 377, 713, 1011, 756, 143, -633, -1116, -678, -114, 286, 711, 690, 207, -41, -879, -845, -586, 80, 492, 878, 538, 132, -511, -717, -615, -636, -99, 745, 831, 711, -138, -502, -591, -786, -250, 311, 361, 650, 452, 21, -200, -781, -306, -5, 140, 279, 824, 234, 117, -414, -680, -389, -45, 367, 660, 437, 467, 38, -651, -377, -202, 144, 458, 683, 277, 247, -324, -577, -611, -412, -32, 623, 639, 384, -181, -286, -468, -512, -209, 257, 266, 397, 154, -91, -126, -712, -61, -131, 89, 391, 392, 128, -18, -314, -580, -388, 0, 262, 681, 241, -50, -535, -13, -504, -412, 497, 238, 522, -53, -139, -318, -453, -427, 18, 69, 424, 424, 146, -293, -366, 129, -223, -74, 469, 374, 123, 117, -427, -507, -337, -114, -41, 279, 195, 312, -174, -652, -90, 42, 102, 287, 302, 355, 237, -226, -313, -276, -372, -63, 318, 111, 404, 151, -160, -532, -195, -392, 143, 449, 585, 571, -128, -442, -225, -227, -344, 97, 336, 253, -88, -315, 42, -342]
652c42J30L66j0J66O5k07l39j67r3L42J58M49M5r6o21k5l09J04K75L85j53j12
674A1L70n59R2j63l30N94J04J31k75L5k34J04r7m6N29j67O3q3l2k10l18L03K43
697F5j21j69O19j018O50k16J15m6R1K51J87j48n9k36n48Q4M06L09j14K42k72m98
719d26j73J92J67J4M02M8j92m9l1L8k23M77K00l08o6j21J34l61P4r3L64O2K42
742C71j38j76j1k11k26K2M15J32K81l29r2m0k73k31L62K38K5N01n58l70J63k08
764c53Q3K02K13m5K8j30K2o9k37J82N9N15J03J85o97o10K15K15q2K72L77j34N9
787C73n06n12N41k03M16L94j42m7k47m93OJ46L50OJ64Q9k01j52k33k25L09K36
809F9j09L87k21Lj58o5k28J70L82K1j32r9j06m09L58R1K14p3J03m9O1j19k55k44
$$ y = [-342, -212, 154, 144, 310, 375, 168, -171, -338, -431, -89, 69, 518, 563, 467, -154, -179, -488, -384, -109, 276, 123, 11, 381, -178, -86, -249, -579, 15, 119, 250, -25, 10, -224, -120, -217, -263, 266, 99, 162, 79, 47, -163, -481, -178, 65, -56, -225, 394, -624, 26, -190, -75, -121, -30, 221, 408, 260, 201, -35, -583, -499, -93, 216, 102, 344, 72, -426, -599, -407, -240, -226, 176, 224, 32, -17, -48, -10, -233, 244, 444, 136, 70, -51, 83, -278, -204, -297, 67, 129, 371, 233, 57, 46, -165, -391, -369, 46, 178, 459, 130, 38, -2, -275, -506, -144, 94, 119, 620, 62, -308, -145, -353, -270, -68, 145, 100, 128, -2, 20, -49, -286, -104, -45, 470, 573, 758, 61, -549, -334, -119, -201, 71, 448, 314, 373, -133, -645, -104, -307, 109, 503, 361, 314, 67, -426, -420, -274, 76, 82, 246, 335, 134, -18, -251, -476, -167, 69, -40, 347, 126, 129, -29, -94, -322, -152, 230, 251, 119, 20, -86, -495, -137, -46, 168, 95, 198, 149, 210, 91, -164, -408]
833d08L11K94n9j04mK03p32L66Q2M29l56P6N7j03N1n62K47l01N14M95l73q0J72
856B15m96M22l12R5K77J55k84K42m08k8kp1J30K97J26m88L91k72k24L27k25k2
878a55M90j88o1K5J39m67J0L33R5k1k9l20j6M4k89J68M10J4l2j54l67K60L40m73
902b44K01J82k37N9N0J3k92J66O6j64L69N7l09J57L8j31k9K68l0k19K51k06k4
925hP4m05M52K03l9n39J73j30L99l62K25k0lk48K53j46mN37m07k03M29k75J79
948A35k66n3O5L28P2k09Q7j17J20J6l61P6J22K9L5M5n8j42L94n77L04N7o2r6L96
973C40m26J27k33p3J99l4K63k61K33j65p3L11k48J27l2L00l04K14j37j02j08J83
995A01J86l18m3J03k06L3n1k2J45Q2oR0n1k8r6j54J58L48m03Q7R2k58j9K45J5
$$ y = [-408, -97, 197, 138, 34, 30, 233, -499, -133, -51, 378, 22, 98, 155, 52, 103, -459, -212, -513, 1, 496, 123, 43, 215, -281, 141, -171, -76, 201, 356, 72, 314, -94, -122, -124, -195, -65, 232, 358, -130, 261, -11, -235, 92, -133, -155, 335, 147, 86, 111, 250, -217, -207, 126, 221, 200, 171, -149, -165, -121, -410, -242, 168, 182, 150, -4, -371, -111, 229, -244, -43, 139, -98, -39, 11, 24, -268, -102, -36, -200, 169, 226, -83, 74, 112, -19, -48, 220, 190, -29, 222, 16, -8, 66, -339, 113, 316, 277, -262, -89, -219, 180, -182, 43, 23, 20, -228, 25, -121, -125, 412, 5, -198, 231, -44, 135, -131, -184, -119, 209, 281, 72, 159, 42, 162, 178, -183, -107, 15, 44, 79, 124, 66, -76, 318, -259, 45, 102, 40, -56, 340, -86, 41, -192, -265, -66, -100, 163, -98, 135, -30, -103, 208, -40, 87, 55, 355, 51, 265, 128, 26, -82, 101, 287, -31, -74, 29, -177, -144, -195, -217, -72, 10, 4, 94, 43, 15, -81, -235, -77, 271, -132, -45, 47, -211, -230, 15, 30]
1020C0J85j49l4j97L92n60K92l5l9L12j12k16K22O3o6j88p6K36K7J98m35M8J00
1043bJ4j84K96j49K20p0k76O1Nq3M07k98M16l63j00L35r3j33r2J70r2J37j91j40
1067b05R7L31l50K56Rk40L35j14k36k00M56l03k09M55j71l0j59O6K59J79l49m9
1089a72L86k85L03J09m94J60m44J78M11P4k23L91l85l09K52j66K93k48J80J44
1109A55N1j62o8j69J38N6j66N18k15J10k10q8q4K32j09L12j10kl25L68j44j33
1131d5J52L9p2k83R7k6R0K6M6N4j29J12r8j2k1P9J31Rl00K0K36j14n8J3pj19m0
1158b20J64K26k62J55k36N0K23P3l39L4lj2m6J33J62m89K20J85k62L92P4r2j02
1181B8l26J28L57j12l04K88k33j45K34K17L6k76JQ8rJ53n14K92R4k07L44m8j58
$$ y = [30, 215, 66, 32, -165, 227, -333, -41, -76, -115, 197, 85, -131, 91, 154, 88, -100, -176, 60, 87, 285, -150, -102, -2, 12, -172, 124, -25, 195, 125, -151, -90, -85, -168, 239, -59, 357, -6, -106, 229, 136, 3, -89, 81, -11, 126, -65, -205, -108, 223, -127, 129, 138, -102, 233, 119, -117, -317, 139, -164, -373, 82, -89, -119, -278, -212, 47, 226, -123, -172, 214, -71, 232, 341, -153, 7, -437, -259, 152, 226, 3, 394, 9, -300, -48, -214, 79, -169, 11, 155, 206, 44, -24, -193, -55, 1, -165, 353, 138, 248, 38, -50, -134, 98, -11, 301, 191, 189, -136, 232, 88, -45, 107, 146, 74, -209, -112, -138, -48, -22, 24, 78, -51, 61, -37, -49, -70, 9, 140, 149, -151, -131, 105, -9, -67, -54, -61, -180, -220, -56, 170, -92, 63, -173, -123, 100, 173, -166, -132, -135, -147, -193, -60, 102, -387, -167, 18, -244, 148, 222, 130, 28, -298, -170, 187, 75, -229, 59, -174, -319, -85, 132, 168, -108, -107, -19, -28, 125, -389, -97, -3, -210, 134, 86, -72]
1204g2J41j30M69k91j85n8L22m37M39o5P8k64J71j47K4K86l58k3m9J62J68l12
1226a31L74M6l28J40k29KL63l44o4L69n6j17j17j25L90l27Q6n1K79j27J26l74
1248b15K1K41p7j11L92l06l0L56q4k86J55k73L20k49K65q8n07P21j97J99l06k54
1270c13M0J59k53K92j19L00L0p6J7M1k38L36l49n0M42n41J06L24l38J27J45j3
1292F9k75L31k42N0Q8l8J07l32J56P3j69K3K52j17J7j44L26j94K17r8j41J17Q8
1315A64j31K52m57M42p0P3l19L12k9m72J03K0N8K12l01j53O90l49K31k25Q5q0
1337E6Mk23j23L60K66n72P1K33J7K04k13j11J3j62O0J91k50K50k01r5J71J80r0
1360C6P1j48J36k64N4J07l66O71k38oR0l00J89q7m3L39o8j35l5n6J02k24L64m3
$$ y = [-72, 69, -61, 408, 117, -68, -126, 196, -241, 198, 133, 211, -53, 118, -29, -5, 281, -77, -100, -149, 13, 181, -131, 243, 289, -39, 101, -128, -126, 237, -107, -171, 198, 142, 25, -92, -217, 173, -154, -68, -119, 160, 33, 159, -215, -194, 47, -30, -141, 251, -55, -85, 271, 187, -99, 56, -217, 103, -146, 119, 31, -476, 245, 48, 247, -59, -313, -273, -114, -367, -75, -194, 106, 136, 60, 77, 118, -120, 216, -133, -183, 259, -282, -176, 148, -190, -63, 82, 69, -206, 125, -117, -67, 21, -17, 90, -242, -86, -13, -182, -159, 93, -24, -7, -151, 175, -19, 198, 100, -41, 76, 164, 33, 285, -172, 270, 200, 273, -46, 266, 237, -235, -132, -112, -54, 158, -143, -296, 394, 45, 276, 51, 136, 56, 60, -163, -286, 74, 340, -232, -161, 72, 89, 293, 80, -31, -18, -180, -120, 71, -179, 71, -130, -225, -54, 126, 36, 107, -41, 95, -169, -115, -8, -374, 297, 59, 53, 143, -157, 32, -55, -98, 241, 173, 38, 3, -53, 49, -175, 189, 146]
1384A46r6K4j18L51l44J91p6j94L64M8k65j22q6j85N67r4o3J8j41O4J82m75K72
1407c2K62m09M30k32j6R0n2q1l60K94R7K02n7J10k70N1P9j86J6j04L22l55J61
1430d0j25P3o5j10J31J99l80M25J35m76J20RN62n42J2K46r0M0j74n6K96k62N4
1453a8J13K9k50M48j90j48K4K8n1l01K47J50k5p0j58O0j31jM45o4k6J38j35q0
1477C4r5j46M24k68M7R7k84K95n3j0m5K21k12N8R0j48j95L24m8j86L47j66k33
1500a52Q4N8j31L98j83K24k80P2n89N48L12k62l04L40k74l07O24m17K01j26L07
1521A43k67j61L17j67J63o0J31O2j05l32K05K63l67J59L33n08J43lJ9j9J86N1
1543A86l75J94k55J65Ql5j9K85r8r8O7j30K62M9l30J74J19m00j74J79L28N2J73
$$ y = [146, 50, 74, -44, 307, -37, 154, 78, -116, 248, 296, 31, -91, -177, -362, 205, 111, 48, 66, -75, -11, 171, -304, -32, 230, -179, 251, 19, 3, 93, 41, -40, -400, -106, -9, 193, 136, 246, -24, 27, 106, -80, -64, -168, 154, -201, -40, -165, -92, -157, -267, -136, 63, -317, 108, 243, -233, -113, -104, 458, -84, -72, 174, 84, 124, -50, -106, 190, -72, -18, 95, 124, -126, 322, 132, -16, 8, 36, -15, -316, -69, 81, 56, -14, -172, -112, -243, -244, 201, 137, 111, 249, 114, 34, -61, -207, 217, -51, -4, 93, -191, 104, 51, 41, -4, 217, 5, 63, 153, 5, -190, 134, 86, -100, 247, 81, -152, -68, -10, -141, 257, 74, 298, 18, 90, -499, 49, 361, 99, -205, 135, -139, -446, 178, -239, -38, -164, 143, -124, -285, 32, -135, 28, -32, 99, 161, 56, -276, -71, 192, -175, -16, 317, -191, -48, -51, -32, -51, 135, 186, -189, 5, -250, -85, -77, -112, -131, 154, 56, -42, 25, -105, 157, 206, -124, 50, 169, -231, -405, -226, 102, 154, 327]
1566C27n16k71K41J05J43j1J12N8l60n2M81l16o5N3l81M83j60j93J61n1L81k22
1588e3J10O9j98j4j12K80k16L4k1L00k73q3J05O9o4N32o90j86P71j55n72L22K30
1611A85m25J93q0J80j28J48j68j36J75r2J49j45J76m5j98J70j48M19lk13P2jk05
1634a20J92J20k93k56K95R0k00M52l34J13J30j01r2l3J71j54n4j58J33J43k20
1655a76K04R0j17L6K0J8N4q5J80j71k39J99j73J82J35k6r4n8l10K74j17L65j57
1678C4K62j11O1m35J7L27k53K24o7l21J76J4J69n5M8J5N7k31j89k5K43N43m22
1701H1j8k49K47j5j3j67J90n3n6m2O3k64M61R1m02J94k88K94K2o6R0Q4k74j85
1725b75M46j27K2r6K56l77J64%n0j98J71P7j38K98Lm6k5j40J04m3q4N8j49K06
$$ y = [327, -189, -460, -219, -114, 29, 18, 130, 188, -172, -224, 257, -59, -124, -71, -452, 31, -129, -322, -161, -212, 169, -53, 57, 126, -72, -86, -198, 82, -134, -100, -121, 179, -94, -177, -72, -3, -67, 465, -225, -411, 360, 205, -367, -45, 185, -240, -47, -127, 53, -75, 73, -95, -231, -56, -148, 1, -144, 32, -13, -211, -41, -189, 230, 227, 14, 86, 85, -120, 72, 192, -101, -357, -62, 28, -172, 280, -54, 59, 189, 88, -4, -37, 134, -20, -74, -232, -99, 44, -176, 28, 118, 1, 37, 57, 75, 129, 44, 224, 53, -186, 13, -160, 22, 157, 131, 37, -21, -331, -57, -174, 191, 34, 296, 185, 246, -189, -172, 155, -98, 126, 59, -262, -86, -72, 97, 42, 90, 105, 162, -69, -258, -283, -40, 503, 81, 63, -186, 61, 46, 33, -134, 56, 3, -53, -95, -32, -296, 165, 256, -146, 48, -240, 54, 76, 10, 100, 184, -90, -275, 171, 44, 66, -30, 226, -151, 13, 13, -37, -235, -64, 13, -125, 173, 176, 130, 105, -35, 69, 26, -58, 0, -149, 57]
1749E7k45Q5K5r7l3K15m5M82l63j27k47J74O04l97k62J96K81q5K00m42m1L8j33
1772a60J91N9O2j49j1J96n5k61K11k83J2K11R9l14PK43r3o7J57K04o4k39K50o28
1796d22K98J73m44j75P07j05K73l09J82l7l06n1L59P8k10k61k52M77K2L00m04
1817a07L58j85l40K49j83R3o6K67k21L56m14J91J38J0q7k25J03Q7L0m5K4J17j92
1840d2j2o9J98J98k39R6l41j13M05k01K0J55l74L97J10k36K21k95M19l70K65k51
1862e9P5K79l06l8j01L99j07r0N3j94o9K6j20L26p9M47m56j3J24k31J07J74j93
1885d6O8k84J78N9J03j93J34L62l18P3p6J55l08L06j73l8Kj70N43m7k57L7j83
1908g3n9k27J38N0K2L88l11J65j75L1r2n4J56k2M60l66L02n75M25j93N3M8J77
$$ y = [57, -188, -103, -78, -175, -208, 7, -38, 444, 81, -46, -293, -119, 485, 88, -174, 22, 303, 218, 418, -24, -65, -27, -160, 31, 90, 152, 3, -8, 188, 133, -128, 83, -200, -188, 23, 122, -192, -185, 58, -35, -102, 55, 259, 195, -44, 206, -422, -124, 49, -395, -570, 137, 32, 305, -4, 178, 141, -165, -216, 143, 221, 11, -250, -502, -25, -3, 297, -107, 251, 66, -274, -25, -208, -115, -181, 86, -135, 221, -193, -2, 136, 146, 59, -166, -63, 24, 54, 9, 33, 150, -42, -54, -123, 75, 273, 34, 130, -211, -324, 81, -120, -100, 55, -319, 78, 188, -48, 173, -122, 297, -73, 192, -59, 16, 295, -11, -49, -150, 249, 142, 52, 105, -89, -158, -132, -252, 74, -5, 442, -14, -27, 97, -134, -27, 147, -46, 22, -262, -84, -25, 78, -115, 19, 381, 63, 136, 60, 215, -93, 213, 40, 2, 4, -166, 377, 330, 73, 110, -73, -132, -359, -221, -171, -149, 239, -72, 93, -82, -51, -143, -197, -41, -63, 397, 31, 333, -242, 183, -10, 43, 91, 268]
1931B68l41N2J47j99K18m39l9K60l3K35j93j97M28l43Q3q9R9K01m08L01j6K1K74
1954B90m49L70K13j47l53N7m6J64k41K98l86M40Rj80m5j81J82J25k68L47R8l61
1976f4k7o3J66j3k22K04r2L70k49P5j33J58j14K4j51K92k44N5j89R2k0J64l04
1999b85M9K21N2R6p0K49l59j19j59K36k8J97j99K13p9M63l33k31J87K04k75J58
2021A88r0n5j07K21j71K49m15K83k20R8j54L32o2j09j05L09q5m07mL56j28j25
2043b01N3L62l83N29l70M9j36j64L09p8N9K8p9k6L59k09O9j09r8K88j12r0j27
2066g7J80l69L61J09m18Q1j9L12r3M3k18N7MK37l78K81k91K34P1R0k62J12K8q9
2090a4J35j57kJ16j56q9K97J02j72J17J22k47L7n5%O3l8K32j84P8k84k05L40n1
$$ y = [268, -73, -21, 126, -73, 145, -294, -333, -73, -106, 129, -64, -261, 167, -176, -93, -182, -83, 118, -290, 11, -5, 16, 290, -159, 211, 424, 277, -76, -19, -65, 99, -142, 156, -230, 210, 219, 39, -6, -187, -5, 120, -148, 199, 297, -64, -91, -154, 12, -1, -223, -19, -111, 259, 10, 85, -48, 110, -4, 20, -131, 161, -83, -28, -217, -125, -145, 19, -285, -236, -15, 37, 133, 63, 312, -47, -166, -325, -89, -117, 80, -119, 94, 15, 478, 145, -86, 101, 305, 30, 188, 98, 43, -64, 157, -14, 235, -180, 103, -117, -19, -173, 159, 97, -12, -117, 192, 107, -300, -304, 52, -76, -201, -148, 214, -169, 360, -10, 39, -97, -261, 48, -30, 29, 57, -22, -48, 311, 102, 171, 62, -36, 252, 140, 50, -77, 103, -266, 95, 204, -214, -133, -152, 160, 67, 110, -108, -51, -47, 190, -188, 93, -198, 36, 107, 197, -65, 47, 75, -14, 121, -36, -38, 78, -78, -167, 130, 232, 60, 177, 299, 52, 89, 34, 34, 97, 59, 291, 107, 185, -99, -304, 36, -15]
2114a5O6pn9j0o6j0L8J61j64L0J64l62L60j38n9J02j63K81m82K72P8l03L36j58
2138a08k21J61r4K34K02k04n3k10K74k88M90k47R3j16M05n61L59j4k81K80K01
2159C02l60J11q7k30K68M71n67M4J55j30r3K02l38R0Q6K21k83M0J42L07k46k05
2181a00n1L83j79kK4k37M66n98L99j39r3K24P0P0k96n5n5J15j36K60k38K18j92
2204a42J62Q0q4N6Q7j7%O6q7m9j35j07P6K10r4j4J71l81O4J17K74j23j61J84j36
2229A7j81k27K50L95P5o54O48o08M24m93M00K0p7m8Pl88N39J67k53j42O6L08l23
2252g8J05j46kK36k11j25L07k12J42p1j45L83Lm39K28m6O0n8K16j60M2l3n8j19
2276a81K54M3r9kj90K44j06L00j42K95m21j35K70j68l2K7jl9J18m8J04o0O2p3
$$ y = [-15, 51, 44, -15, -25, -91, -101, -63, 98, -66, -36, 128, -234, 126, -12, -71, 31, -132, 149, -333, -61, 17, -286, 50, -108, -329, -168, -262, -28, 174, -30, -83, -293, -19, -307, 183, -64, 29, -87, 318, -243, 116, 102, -179, 101, 302, -58, 53, -34, -264, 4, 475, -92, -48, 107, -23, -116, 86, -252, -162, -76, 145, -138, -98, 44, 351, 105, -100, -151, 232, 53, 51, 75, -162, 304, -294, 105, -34, -127, 97, 167, 237, -59, -114, -169, -54, -190, 70, -168, 50, -142, 20, 100, 16, 72, 159, 142, 142, 208, 121, 72, -63, -170, -94, 116, 22, 8, 179, -202, -138, -21, 253, 130, -31, 153, 17, -164, -391, -141, 254, 329, -325, 323, -285, 139, -354, 46, 66, -11, -59, -52, -440, 99, 266, 13, -129, -63, 245, -78, 27, -119, -121, 115, -96, -221, 86, -126, 16, -55, -200, 183, 186, -253, -25, -71, -11, -69, 147, -13, 29, -4, -62, -181, 73, 116, 17, 15, -175, 69, -37, 263, 121, 416, -5, -140, 130, -38, -70, -43, -44, -83, 35, -13, 91, 31, 93, 20]
2300B0n7N9J33j32lNJ33K38l18n9jj64K41o5j55K84k65M6L44k80K62k49K44l22
2324f1J74j87L0QN6rm9K6KL49l97L69k54J7O0k3j62N5j30L13r2j02J87k36l6N1
2350d1Qk99J92J17kL4l20P1m3M30m14J31J03j36K65j73J55l3r2K48k59J81R6l27
2374a08J9R7K02k62k01L52L0j90r1O6m7O6p1P3K12j09k59J1K04j00p4J60J17q5
2398A2m4k6j56P4L01l06J35K30k79L34j38l9M3n34K12K5J61j45K98k95Oj0J33
2421hk4j43J8L63k41N8o7R5j16q4J10j04J42MO6j46k5J26K04J03k73J62k68k01
2445b49K58O7k61J78K37k17K81m93J74m8L2j13L00k97j11L40O7j66L11k32M4l30
2467b28K39j89J79K71k36J33k29k04L82m09K60O7Q6k57K99j34k36K96j62K9l0
$$ y = [20, -37, 22, 155, 23, 20, 25, 158, 396, 78, 19, 18, -146, 95, 30, -125, 159, -106, -60, 284, 4, 266, 17, 261, -61, 113, -74, -44, -36, 20, 11, -38, -12, -10, 339, -58, 311, 57, 74, 134, 111, -51, 4, -126, 187, 95, -7, 180, -56, -92, -41, -33, -332, -140, -23, -25, 9, -311, -240, -283, 147, -267, -136, -33, -169, 96, -77, 78, 45, -47, 201, -58, 123, 219, -108, -89, 8, 210, -52, -253, 99, 129, -61, -152, -86, -133, -67, -138, -65, 147, 38, -221, -210, -6, -106, -180, -20, 97, 12, -32, -58, -214, -140, 161, -145, -10, 220, -59, 275, 137, 98, 141, -393, -181, -156, 5, -140, 158, -137, -131, -141, -8, -32, -175, -157, 206, -35, 23, -44, 51, -65, -149, -39, -143, -1, 3, 69, -77, -102, 24, 228, 331, 58, 220, -48, -249, 9, 76, -185, -7, 230, 13, 294, -199, -25, -73, -41, -154, 146, -151, -262, 78, 145, -21, 290, 58, 102, -228, 11, -178, 1, 272, 36, 169, -60, -264, 118, -291, -31, 36, 122, -135, 164, 30, -206, 90, -72, -43, -73]
2488g3j58J34lJ32j59J61J04k73J19r0J4L94j25m69L54j1k2k04K2Q1J50j26L9
2511ik2k28L97j10j19p8J02J95r3j44Q6j05J13k37O18k97r9R4j64M37m21O3R6
2534G5m3k7P1Q3P2n88N79l12M5j80L00L7k17M0j45Q3N32m15n7L89n01O6k1j48
2558b82O15l23k8O8m0P2l25Q8J62k46M74l04K07Q8l19Q2NK82n36L68M5j56k65
2581b68L93o11O52j35K61k33m3n0k82M16j49j50J0K75k25j9J36J41k14j20L26
2602A11J83o29M13j76j43K58P5Mj46k3l4j38L03l43J53L33k09J17n4j17N7L32
2624C27k12k09k3r1J94j62O3n3Q3K11Qk41r2K70r7Mo5p6j16K42J66k25k36M37
2648A07K61l15j03j61O9J37J2l72K39L61k85J81lk15J5K61k48j16K87k92K45K15
$$ y = [-73, -231, -97, -100, 32, -127, 34, 138, -135, -16, -106, -92, 302, 177, -292, 62, 51, 29, -175, -153, -72, 78, -48, -9, -31, -259, 138, 28, -91, -169, -67, 128, 35, -109, -23, -128, -15, -252, 366, 69, -30, 64, -100, 337, -84, -21, 75, 32, 5, 76, 159, 231, -357, 222, -90, -45, -225, 75, 112, -105, -65, -210, -127, 405, -10, -67, 322, -179, -113, -134, -282, 333, 10, -18, 50, 10, 82, -243, -155, 7, -239, 235, -69, 138, 226, -93, -11, -6, 276, -260, 108, 153, -3, -268, 125, -486, 166, 31, 292, 59, 16, -34, -316, 100, -49, -199, -189, 86, -139, -158, -22, 119, -95, -215, 111, 294, -335, 78, -98, -241, 17, 92, 96, -50, -73, -107, -245, 58, -285, -132, 201, -8, 109, 55, -62, -5, 327, 115, -94, -117, -208, -14, -176, -113, -166, -83, 128, 136, -105, -197, 73, -24, -20, -85, -161, -277, -35, 131, -94, -330, 107, 368, 53, -50, -211, -142, -5, 7, -365, -126, 235, -50, 131, 128, -87, -72, 189, -59, -175, 112, -180, 65, 280]
2670B80k00k44J69L29j32k16n5o9L99k59j7m3n9J64j37o1k0l9K75k64J08L65j49
2693A25p3j58Q9q8J2L45k85j39M1K71l41L40p7K18o51M85J41l9j09l51l2K87o7
2716e6k02K43r6n2L49k90K64l01j22mM94k57k31J35Ql4jJ58K89m72K35J93m47
2739a97J06k76N59k93J45R3j11J50m61L10k9n1K40m8n0J94k24J43m6k12L43j87
2761I8r9J78j89k30J33L46k35r4k13N9N15k05n5Q9j18j74L86j35O8k35M2k3K9
2784f2l78N37m22J99J07j3K22k29K32l76K51n3j84Q5P7K28k2n29J55j20K18O6
2806a1k3l2Q9o4J17mp3N09n42J14j64l53L65J88j89N8J73J76o59O99k78j9j65
2829h8J96j62J75n0l38M09m35M9N36l51j3k04P9K49J03j39j74K62k26J20j47j00
$$ y = [280, 80, -164, 5, 334, 202, -14, -69, -138, 261, 2, -15, -58, -117, 47, -90, -151, -171, -210, 65, -199, -91, 274, 125, 52, -106, -17, -105, -93, 252, -33, -172, -131, 140, -201, 139, 62, 280, -371, 114, 255, 216, 107, -244, -276, 11, -56, -258, -15, -111, -163, 186, -104, 160, -141, -263, -267, 227, -30, -261, -126, -118, -152, -153, 5, 294, -178, 57, 250, -197, -91, -367, 192, -101, 44, 137, 26, 176, -285, 25, -4, -55, 185, 137, 87, 281, 57, 200, 154, -58, 285, 98, -1, 177, -12, -242, -109, 237, 2, -92, -305, -246, 269, 64, 9, 98, -20, -194, 192, 57, 125, -110, -68, -91, -62, -440, 97, -325, -126, -19, -32, 190, -39, 193, -183, 68, 15, -169, -84, -7, 221, 199, -330, -175, -295, -77, -11, -34, -66, 23, -41, 76, 72, -1, 508, -34, 80, -84, -437, -72, 116, -73, -15, 158, 334, -325, 374, 96, 77, -88, 108, -54, 121, 71, -267, 142, -293, -244, 292, -59, -72, -276, -197, 52, 155, 16, -158, 104, -122, -2, -149, -249]
2851b49M02q9N4k88J67k94O45l20n4j10K59K06Jl07Q9l84J37L37j29o2pK14n39
2874c21O0M39l27j17L19N6j81J07J6l63Q7J3K31k35J92l8P8k79K89n5J21L9n4
2897G7l11J68o8j4l8j33K22n9K70k77J11j53K56J8j49L22k64L8j04M2N9J41m45
2920b91L11N6J0j50J7j3K8m3j33K60J4k33J23j7r6L6N9J13j50J63Jo5jJ46r7j39
2946i1QM7J25k07M01l41J08k1jJ74l28K11l57O89m73K16p4lj41L85j049O17J70
2969F5oL75m11j77J68J96j41j04N5j45K53j26K11j39k13Q0j77K09L07k82j30K31
2991I9N7j59J82l13j29J19M24j25n0m5m67M06j6K27j57m8p5k82K43P2j31J19J04
3014E5j12J17j63J63j5k52j69K93K51j36m8K38J1o11M72M6k29nK92J70p11M02
$$ y = [-249, 153, 64, 118, -170, -3, -297, 348, 28, -26, -136, 123, 329, 330, 23, 112, -272, -135, 202, 73, 11, 4, 218, -321, -261, 178, -149, -266, 53, 109, -72, 35, 51, -312, -225, -212, 19, -216, -24, -62, 16, -263, 26, -29, 92, 131, 77, -234, -66, -134, -148, -186, -319, -97, -156, 114, -163, -52, -205, 51, 69, -80, 242, -22, 16, -88, -46, 13, 154, -291, 20, 76, 86, -64, -47, -60, -32, -75, -208, 52, 66, -167, -44, -61, -157, -121, -62, 51, -99, 64, 65, 0, -1, 145, 48, -91, -83, -36, 89, -118, 283, -58, 50, 29, 28, 202, -126, 85, -272, 417, -56, 160, 86, 83, -58, 327, -722, -105, 65, 59, 434, 23, -154, 14, 210, 69, -35, 20, -125, 128, 2, 213, 74, -139, -59, -236, -27, 280, -2, -132, 99, 156, -3, 179, -134, -263, -144, 280, 155, 105, 60, -407, -1, -17, 210, 53, 5, -70, -352, -109, -37, -168, -49, 55, -57, 60, -103, 60, 45, -207, -376, -83, 168, 32, -16, 222, 233, -378, 94, 140, -89, -94, 198, 368, -343, 59]
3036E9k95K61l7J7l8M23n11j62L88J5j01m0rM1L20j89l46L83J28l86jO1k43K81
3060A9J50k96J54J21n5r8O3R5k58M1k82K08L35j15j28m2p1o7J92q8K22j90M0O9
3084A9j08M4j9j10M37m16P0P1L25m48L72k76Q9P3k80K59L6J3lL8k78K74j4j03
3108F5k63K31L98m59J67J9j86J08l03N25k39K09j49k1k21j4K45K1N4j56j14M7
3130c6K69n44j50P26j07k61P2R0j34N8j72j37L92n2M4k49o5J82j89K33N8k55L37
3153A10j77J38L5m03M22l73K41R7r4q0R3J81j41m6P7j11J12j78j44J56RQ7r2K51
3177A70n4j12l0M6Ok1j68L80K2M2l10k1L60k61o5J83m70L16J34m39P8J2J24o3
3201a41m7J16J79l10J8K39m38K57J89k1k75Mk30M78J38l01K97k32K25J06k32o0
$$ y = [59, -236, 25, -12, 5, -33, 390, -121, -283, 105, 120, 19, -21, -30, 11, 331, 142, -204, 179, 307, -79, -80, -19, -262, 19, 169, -127, 27, 148, 93, -5, 58, 153, -105, -64, -346, -138, 197, 82, -46, -88, -159, -226, -34, -122, 100, -90, -50, 19, -89, -45, -64, -174, 263, -153, -83, -12, 313, -135, 237, -39, 50, 123, -157, 102, 138, 151, 148, 186, -92, 182, 168, 65, -198, 33, 431, -28, 139, 158, -28, 80, -223, 302, 63, 272, 123, 102, -119, -133, 112, 133, 187, 31, -83, -36, 233, -311, -461, 265, 158, -103, -31, 59, -75, -17, -189, -326, 66, 14, 58, -191, -256, -74, -263, -30, 28, -227, 110, -67, 71, 106, -297, 125, -248, -7, 90, -4, -84, 9, 190, 49, 3, 80, -31, 81, -97, -241, -85, -76, 11, -81, 170, 116, 4, -26, 20, 26, 5, -163, 217, 239, 281, -29, -50, 310, 49, -16, 167, -303, 13, 147, -292, -214, -202, -78, -141, -188, -72, 107, -203, -185, 54, -384, -127, 62, 41, -234, -230, -460, 18, 156, -145, 152, -80, 145, 251, 19, -41]
3223d1N1l30K49p4K38j99n9K54N9k36K33jm26N73l88k9J8J56J35l83J74J93k07
3246d0L3j4J87k10K4Q1k86J88M1Q8o9K3l13O42k38N2l66K02j57J92J73j30r7j43
3270a37K29k84N7M7k1K07Nj00k35J13J16l5m75O55k40M36k92J02l07N7K77k67
3292i2j31J8L95j53n8L5P8j90K81l68K82k5p8J06J01j67K5j02J5K85m17K14k8
3315B6K99j81n93N54j36m1k01q8L09Q9P0l55K44j10N0j13P3J9M32j43k32M6J02
3338A20J57j66J12k45k22K82r4K80n11K52k06J88R0k0j38M00m34L81k09l00J70
3359a13L9J65j63K96j05j81l5j95K13J3n3K49r7N5j67Q9l3K8J20k21N1j93O40
3382D02k41l52J93J22J7k40R1P7J01%r2j40L3J71q7j49r8P8L77m00J73j84M44
$$ y = [-41, 10, -320, -71, -145, 93, -106, -165, 89, 148, -88, 145, 144, -282, 291, -97, -126, -108, 48, 183, -200, -26, 167, -40, -7, -21, 166, -44, -20, 61, -225, -37, 4, 92, 23, 46, -267, 375, 137, 189, -177, 25, -132, 60, 233, 103, 6, -137, 92, -192, -135, -88, -109, 98, 103, 3, -232, -119, -3, -38, -513, 142, -98, 338, 46, 148, -159, -102, 175, -92, -223, -205, 190, 37, -21, 14, 92, -98, 183, -185, 97, 72, -6, 100, 201, 34, 59, -43, -28, 257, -160, 54, 26, 325, 144, -449, 105, -31, -72, -273, -361, -52, 37, 107, -248, -4, -114, -64, -177, -104, -85, 347, 204, -28, 18, 120, 277, 111, 223, -22, -244, 38, -56, 224, -287, -35, -241, -53, 37, 17, -121, 279, -155, 226, 17, -283, -113, -74, 91, -72, 224, 119, -62, -97, -292, -79, -66, -119, 130, 33, 88, -79, 10, -23, 5, 125, -96, -45, -238, 402, 161, -191, 2, 124, 141, -99, -8, 69, 170, 170, 78, -62, -29, 142, 55, -94, -192, -114, 263, -137, 36, -148, 296]
3405B96m00K97Pm11M68l27L2m0K87k52P9j48Q5R9k79M48k40m0k1M46k98N8n6j42
3429e2J82j16p1p9K51l17L44l21l8J28J61n3N1j21k05K38L12k77k03K79j34J16
3451G5l08L77k04K49k72K40l88Q0j7K49p2l1L0j51K37j94K63j94J04m0k29K12
3473A6J51k4l6K0j53j07k56L25r7k62N14K45q04N04j31Q4R2j27l9j6J20M1n0k3
3497a3K81J79l24j33pp2K05l46K52m20L23J69l03J87j63O4N01o09J76q5P5J81
3519A18j31K34p2j34J14P3L08l84l30J23J34j93QJ76q3k17M56r3j34L48l91J89
3541A19j70n2J30m6j76K33J15l09N25o5l13K84n88M42l23m3L44l82M14k58J66
3562D7j3o1j13K61p3O5k40l1M32k16k35J37l3K42m9l6l70J11J29K04l66K97O8
$$ y = [296, -104, 193, 200, -211, 257, -70, -38, -78, 209, -43, 36, -112, -27, 72, -207, 241, 1, -39, -60, 386, 88, 146, 90, -52, 130, 14, -57, -136, 115, -202, 142, -179, -217, -89, 72, 19, 70, -51, -256, -18, 294, 17, -186, 93, -41, 75, -233, 144, -60, 189, -83, 157, -231, -151, -168, 81, 9, -22, 8, -143, 94, -100, 163, -31, 73, 33, -196, 16, 167, 143, 107, 127, -26, -133, -389, -64, -161, -423, 91, 336, -468, 36, -95, -11, 81, -46, -85, -101, 19, 60, 10, -13, 268, 447, 123, -10, -17, -89, 116, -230, 22, -398, -75, 94, -209, -22, -185, -121, 380, -229, -53, -138, -63, 118, -13, 221, 149, 15, 129, 202, 510, 126, -204, -81, 53, -140, -132, 44, -39, -256, 200, 107, -27, 321, -70, 119, -51, -103, 27, -19, -195, 38, 153, -156, 369, 304, -9, 275, -313, 129, -194, -237, 107, -275, 139, -119, 47, 34, -27, -140, 121, 48, 113, -127, -158, 274, 58, -177, -40, -73, 169, 120, 84, -286, -175, -46, 158, -208, 89, 157]
3585A57m4j29k23K43Q6j46Q5r4K04m60N17l20R2L7j32K20k0j21j98L74NJ67l39
3608c9J56N5m30Q3J94o9q1J47r6K66n72K07K16r7QKo9K4K0k5j74j6n8J16P3n6
3634b15M87m29q0L23k57kL26l22M70k44j27k6j76J80J98m03L25o9q3K05r5J75
3656A61K7k7j20J02p4M85m49k72J50N0P4k01J11o3k62L25K34l67n5K24n5Q0l1
3679D7P3k48J39oJ68L2k02Rr1R8J6l60p7K54K93j20J33j13j19M03j33j21j29j7
3703g1J01LN88m76j28J68k97j3J21k58K08K30m27K69r7J08j13Q4k74K89j9J53
3725A49M2j07j45p7N3K00j23o8O7o7L81k84r2J21m5p4l0L1K69j11kj16J00J41
3749B13m06L42j2j28j79J34K07J34k55M29o25K23J76l66L36k25PJ00m2l33J67
$$ y = [157, 113, -16, -239, 4, 90, -56, 29, -65, 139, -321, 196, -124, -32, 5, -127, 93, 73, -48, -246, 128, 133, 300, -39, 117, 172, -258, -175, 19, -50, -131, 16, -80, 186, -386, -179, 37, -60, -52, -50, -119, -95, -75, -100, -274, -290, -348, -232, -159, -215, 272, -157, -237, 86, -171, -173, 153, -169, 301, 57, -70, -96, -272, -92, 106, -297, 28, -41, -124, 81, -14, 161, 188, 161, 41, 143, 69, 554, 105, -167, -17, 33, 107, -94, 17, -46, -308, 17, 251, -116, -171, 53, -2, 78, 47, 120, -128, 11, 5, 173, 205, 3, 12, -79, 19, 35, -325, -402, -148, 145, 25, 158, 45, -74, 329, 196, 75, -54, -71, 30, 33, 621, 145, 17, 185, -112, -125, -4, -262, -54, 176, -251, 18, -79, 29, -84, 0, -274, 15, -4, 149, 191, 84, -61, -138, -85, 115, -8, -76, -9, -76, 305, 21, -71, 50, 5, -69, -99, -68, 201, 90, 88, -28, 72, 213, -193, 149, 137, 9, -170, -36, 171, 305, 50, 479, -146, 77, 253, -113, 223, -2, 5, 105, 63, -270, -103]
3770a03K74M4j14K04o5j64l60L57j23mK13J04n12L57k74K29n8m1K1k8j68K99k57
3793a69K92k92N4J29o4Q5L4l67L14r8j77P14k40k85J69k37M51k41k41J29j50p1
3815b61J86k6Q0P8k1l27O01k81j36k20K91j5k07L45m87J83K62rj24M56k10k23
3837f5m6n1J82j63k3J98L38m27j40L03j86K54K02l73J00l12J9N63j77m08J26L01
3859B15j94p1j06J79j49MJ69lN1J06m71M32j88K9J09P2j61N4J17p9L0R8l54q4
3883a95J11P0j99K66m6l4p6L3J10Lm08L66J61q7q7J68m8J91l8k27j88J70j83L96
3907B29l93K25K3Q4k12n1K22k76L72m02P5j00J8K25j23j9L34n54M27J05j46j43
3929h0K89l14J55k20K40O3k06J49m3mO2J1k93J61K12J6L2j73J06Q5j33l14M57
$$ y = [-103, 171, 215, 101, 305, 240, 76, -284, 73, -50, -54, 159, 263, -249, 108, -166, 63, 5, -36, -15, -43, -211, 88, -169, 123, -169, -115, 14, -50, 35, 69, -298, 16, -82, -259, 455, 215, -70, 99, -138, 313, 72, -169, -40, -190, -261, -75, -101, -21, 57, 36, -291, 310, 29, -107, -327, -36, -51, -258, 87, -400, -217, 45, 36, -88, 368, 158, -65, -111, -162, 20, -143, -166, 32, 370, -57, -197, 106, -80, 174, 376, 3, 103, -209, -190, 373, 196, -212, -86, 215, 21, -50, -156, 23, -126, -122, 47, 44, 95, 201, -270, 162, -26, 3, 112, 184, 23, 77, 194, 115, 145, 243, -111, -195, -84, -14, -213, 53, 7, -27, -103, -70, 40, 43, -365, 1, 162, 75, -12, 156, 108, 299, 261, 34, -154, 16, -167, 229, -164, 61, 84, 168, -44, -95, 127, -149, 223, -179, -104, -204, -186, 39, -84, -103, 231, -323, 104, 209, 63, -80, 209, -105, 50, -170, 70, 133, -73, 76, 33, 29, 91, 102, -191, -30, 182, 198, 230, 57, 163, 248, 115, -199, 258]
3952B58l1o03Q03l93k30J79O1o0Q5j9j55J28q7j73J1k11L99k63L93l3j49J88j50
3975e2M6kk36L59Mo82J040m87K69k66J05K08m67J89p2K12m80M89j85J57k35P9
3997gK9oJ33r9J08j85P4L65l68j49L9Q9J23k0j90O0j16J93p6l4J93j0k94L52l81
4022a77L53l07K32k11J15q8K86l6L3K0l04J59k83L56k63Mk68K74M31m93J79j38
4044a26Q6M9j32K99j47j95J33J29j08J65k87K2r0L12p2J35n12L13J20k37L35j27
4066F5j93J05K7n7L4l36J13L60j61M55p67O63m24K36P4k49J85j31o2O3J31j30
$$ y = [258, 227, -376, 427, 34, -196, -17, 44, -16, 69, 50, -105, 23, -64, -237, -226, -437, -38, -301, 92, 59, -90, 98, -52, -6, -8, -244, 115, 119, -563, 477, -10, 259, -7, 98, 306, -161, 28, -44, 168, -312, 177, -8, 149, -86, -7, 22, 16, 149, 50, 158, -27, 47, 412, 44, -105, -66, 23, 146, 126, -64, -4, -120, 73, -3, -37, 156, 146, -148, 204, -177, 176, -131, 101, -110, 5, -83, 203, 167, 200, 220, -84, 75, -208, 148, -115, -111, -379, -105, 326, -167, 12, -126, -40, 9, -123, 176, 29, -166, -33, 96, -12, 153, -134, -112, -202, 110, 38, 173, -339, -26, 94, -143, 192, 65, -128, -23, 4, -53, -19, -355, -242, 118, -43, 412, -355, 308, -116, 120, 194, -55, 130, -1, -63, 0, 131, 1]
$$ [...]
8191b57
##END NTUPLES=NMR FID
##END=
