##TITLE=1H_DE-75k_TFA2
 CDCl3
 8 sc, 
 27.11.2024
##JCAMPDX= 6.0         $$ Bruker NMR JCAMP-DX V2.0
##DATA TYPE= NMR FID
##DATA CLASS= NTUPLES
##ORIGIN= UXNMR, Bruker Analytische Messtechnik GmbH
##OWNER= root
$$ XWIN-NMR		Version 3.5
$$ Wed Nov 27 14:13:22 2024 Russian Standard Time (UT+4h)  she@DPX200
##.OBSERVE FREQUENCY= 200.1315
##.OBSERVE NUCLEUS= ^1H
##.DELAY= (6, 6)
##.ACQUISITION MODE= SIMULTANEOUS
##.ACQUISITION SCHEME= undefined
##.AVERAGES= 8
##.DIGITISER RES= 18
##SPECTROMETER/DATA SYSTEM= spect
##.PULSE SEQUENCE= zg30
##.SOLVENT NAME= CDCl3
##.SHIFT REFERENCE= (INTERNAL, CDCl3, 0, 15.7039)
##AUDIT TRAIL= $$ (NUMBER, WHEN, WHO, WHERE, WHAT)
$$ ##TITLE= Audit trail, XWIN-NMR		Version 3.5
$$ ##JCAMPDX= 5.01
$$ ##ORIGIN= Bruker BioSpin GmbH
$$ ##OWNER= she
$$ F:/spectra/data/she/nmr/H-F/1/audita.txt
$$ ##AUDIT TRAIL=  $$ (NUMBER, WHEN, WHO, WHERE, WHAT)
(   1,<2024-11-27 14:12:18.95 +0400>,<she>,<DPX200>,
      <created by zg, POWCHK disabled, PULCHK disabled
       configuration hash MD5:
       00 E9 B6 7A A2 85 ED C7 34 08 36 98 17 FE 4E 26
       data hash MD5: 16K
       66 57 3D AA 1B D4 07 90 9B 2D 32 2F 80 9A 81 B6>)
$$ ##END=
$$ 
$$ hash MD5
$$ 8F B9 AE 83 E4 4D C1 88 C4 21 0E BC 5D 10 11 C6
##$RELAX= 
##$RELAX= 
##$RELAX= 
##$RELAX= 
##$RELAX= 
##$RELAX= 
$$ Bruker specific parameters
$$ --------------------------
##$DU= <F:/spectra>
##$EXPNO= 1
##$NAME= <H-F>
##$PROCNO= 1
##$TYPE= <nmr>
##$USER= <she>
##$AMP= (0..31)
100 100 100 100 100 100 100 100 100 100 100 100 100 100 100 100 100 100 
100 100 100 100 100 100 100 100 100 100 100 100 100 100 
##$AQSEQ= 0
##$AQ_mod= 1
##$AUNM= <au_zg>
##$AUTOPOS= <>
##$BF1= 200.13
##$BF2= 200.13
##$BF3= 200.13
##$BF4= 200.13
##$BF5= 200.13
##$BF6= 200.13
##$BF7= 200.13
##$BF8= 200.13
##$BYTORDA= 1
##$CFDGTYP= 0
##$CFRGTYP= 5
##$CHEMSTR= <none>
##$CNST= (0..31)
1 1 145 1 1 1 1 1 1 1 1 1 1 1 1 1 1 1 1 1 1 1 1 1 1 1 1 1 1 1 1 1 
##$CPDPRG= <>
##$CPDPRG1= <>
##$CPDPRG2= <>
##$CPDPRG3= <>
##$CPDPRG4= <mlev>
##$CPDPRG5= <mlev>
##$CPDPRG6= <mlev>
##$CPDPRG7= <mlev>
##$CPDPRG8= <mlev>
##$CPDPRGB= <>
##$CPDPRGT= <>
##$D= (0..31)
0 1.2 0 0 0 0 0 0 0 0.06 0 0.03 0 0 0 0 0.0002 0 0 0 0 0 0 0 0 0 0 0 0 
0 0 0 
##$DATE= 1732702338
##$DBL= (0..7)
120 120 120 120 120 120 120 120 
##$DBP= (0..7)
150 150 150 150 150 150 150 150 
##$DBP07= 0
##$DBPNAM0= <>
##$DBPNAM1= <>
##$DBPNAM2= <>
##$DBPNAM3= <>
##$DBPNAM4= <>
##$DBPNAM5= <>
##$DBPNAM6= <>
##$DBPNAM7= <>
##$DBPOAL= (0..7)
0.5 0.5 0.5 0.5 0.5 0.5 0.5 0.5 
##$DBPOFFS= (0..7)
0 0 0 0 0 0 0 0 
##$DE= 6
##$DECBNUC= <off>
##$DECIM= 24
##$DECNUC= <off>
##$DECSTAT= 4
##$DIGMOD= 1
##$DIGTYP= 9
##$DL= (0..7)
0 120 120 120 120 120 120 120 
##$DP= (0..7)
150 150 150 150 150 150 150 150 
##$DP07= 0
##$DPNAME0= <>
##$DPNAME1= <>
##$DPNAME2= <>
##$DPNAME3= <>
##$DPNAME4= <>
##$DPNAME5= <>
##$DPNAME6= <>
##$DPNAME7= <>
##$DPOAL= (0..7)
0.5 0.5 0.5 0.5 0.5 0.5 0.5 0.5 
##$DPOFFS= (0..7)
0 0 0 0 0 0 0 0 
##$DQDMODE= 0
##$DR= 18
##$DS= 0
##$DSLIST= <SSSSSSSSSSSSSSS>
$$ [...]
##$SUBNAM2= <"">
##$SUBNAM3= <"">
##$SUBNAM4= <"">
##$SUBNAM5= <"">
##$SUBNAM6= <"">
##$SUBNAM7= <"">
##$SUBNAM8= <"">
##$SUBNAM9= <"">
##$SW= 24.0689530833862
##$SWIBOX= (0..15)
0 0 2 0 0 0 0 0 0 0 0 0 0 0 0 0 
##$SW_h= 4816.95568400771
##$TD= 16384
##$TD0= 1
##$TE= 0
##$TE2= 300
##$TE3= 300
##$TEG= 300
##$TL= (0..7)
0 120 120 120 120 120 120 120 
##$TP= (0..7)
150 150 150 150 150 150 150 150 
##$TP07= 0
##$TPNAME0= <>
##$TPNAME1= <>
##$TPNAME2= <>
##$TPNAME3= <>
##$TPNAME4= <>
##$TPNAME5= <>
##$TPNAME6= <>
##$TPNAME7= <>
##$TPOAL= (0..7)
0.5 0.5 0.5 0.5 0.5 0.5 0.5 0.5 
##$TPOFFS= (0..7)
0 0 0 0 0 0 0 0 
##$TUNHIN= 0
##$TUNHOUT= 0
##$TUNXOUT= 0
##$USERA1= <user>
##$USERA2= <user>
##$USERA3= <user>
##$USERA4= <user>
##$USERA5= <user>
##$V9= 5
##$VALIST= <valist>
##$VCLIST= <CCCCCCCCCCCCCCC>
##$VD= 0
##$VDLIST= <DDDDDDDDDDDDDDD>
##$VPLIST= <PPPPPPPPPPPPPPP>
##$VTLIST= <TTTTTTTTTTTTTTT>
##$WBST= 1024
##$WBSW= 4
##$XGAIN= (0..3)
0 0 0 0 
##$XL= 0
##$YL= 0
##$YMAX_a= 265496
##$YMIN_a= -57962
##$ZGOPTNS= <>
##$ZL1= 120
##$ZL2= 120
##$ZL3= 120
##$ZL4= 120
##$ABSF1= 10
##$ABSF2= 0
##$ABSG= 5
##$ABSL= 3
##$ALPHA= 0
##$AQORDER= 0
##$ASSFAC= 0
##$ASSFACI= 0
##$ASSFACX= 0
##$ASSWID= 0
##$AUNMP= <proc_1d>
##$AZFE= 0.1
##$AZFW= 0.1
##$BCFW= 1
##$BC_mod= 2
##$BYTORDP= 1
##$COROFFS= 0
##$CY= 11.3945322036743
##$DATMOD= 1
##$DC= 2
##$DFILT= <>
##$DTYPP= 0
##$F1P= 15.6554695791079
##$F2P= 12.8336369535428
##$FCOR= 0.5
##$FTSIZE= 0
##$FT_mod= 4
##$GAMMA= 1
##$GB= 0.15
##$INTBC= 1
##$INTSCL= 1
##$ISEN= 128
##$LB= 0.24
##$LEV0= 0
##$LPBIN= 0
##$MAXI= 10000
##$MC2= 0
##$MEAN= 0
##$ME_mod= 0
##$MI= 1.114404
##$NCOEF= 0
##$NC_proc= 0
##$NLEV= 6
##$NOISF1= 3.799351
##$NOISF2= 2.8
##$NSP= 1
##$NTH_PI= 0
##$NZP= 0
##$OFFSET= 15.70392
##$PC= 1
##$PHC0= -26716.46
##$PHC1= 11.58745
##$PH_mod= 1
##$PKNL= yes
##$PPARMOD= 0
##$PSCAL= 0
##$PSIGN= 0
##$REVERSE= no
##$SF= 200.130013532006
##$SI= 16384
##$SIGF1= 3
##$SIGF2= 2
##$SINO= 400
##$SIOLD= 16384
##$SREGLST= <1H.CDCl3>
##$SSB= 0
##$STSI= 0
##$STSR= 0
##$SW_p= 3612.71676300578
##$SYMM= 0
##$S_DEV= 0
##$TDeff= 0
##$TDoff= 0
##$TI= <>
##$TILT= no
##$TM1= 0
##$TM2= 0
##$TOPLEV= 0
##$USERP1= <user>
##$USERP2= <user>
##$USERP3= <user>
##$USERP4= <user>
##$USERP5= <user>
##$WDW= 1
##$XDIM= 8192
##$YMAX_p= 0
##$YMIN_p= 0
$$ End of Bruker specific parameters
$$ ---------------------------------
##NTUPLES= NMR FID
##VAR_NAME=  TIME,          FID/REAL,        FID/IMAG
##SYMBOL=    X,             R,               I
##VAR_TYPE=  INDEPENDENT,   DEPENDENT,       DEPENDENT
##VAR_FORM=  AFFN,          ASDF,            ASDF
##VAR_DIM=   8192,          8192,            8192
##UNITS=     SECONDS,       ARBITRARY UNITS, ARBITRARY UNITS
##FACTOR=    0.0002076,     1,               1
##FIRST=     0,             0,               0
##LAST=      1.7004516,     0,               0
##MIN=       0,             -57962,          0
##MAX=       1.7004516,     265496,          0
$$ Real data points
##PAGE= N=1
##DATA TABLE= (X++(R..R)), XYDATA
$$ [...]
1941c5L32j88k38q3M19k42L09k69L3pJ67R6oO0k82k2K74o76K08j9o1L41LM0J59
1966C13k40K26k12K53l29j9J98N3j00j0q0j51m23M02N26m96L13j69n8Rj46j71
1988c11M82j58R4k34L30j27Nk25K75K41m88L47j58p0l64K57k11J21J71j85K06
2009bk42K21j41M72j68r6J68k07l02J40m7k53M49l35K40r0l26L79J51O2k74K23
2031B2o7j72K70p5J69j89k12J34J61J66m03L54k65j98L39j15q5J44j62j76N37
2052A77M9l27O1j0R8J19l52J37L80l66K06l66K31j2N8O1M7r8j62M39j55l41N08
2075C82l51q1J81j93J00M6J65l03P7L48n42K62n8K79k76k61L29l7K81l52n2J37
2097H1p0K9J07r9m1l9Q9Q7l93K97m7p7p1J71j10J87j03L16l2m2l50J89k7n9j48
$$ y = [-35, 297, 109, -129, -212, 207, -35, 274, 5, 38, 31, 198, 294, 288, 348, 66, 44, 318, -358, -150, -169, -230, 111, 114, 154, 313, 73, 299, 87, 340, 11, -8, 190, 243, 143, 133, 53, -98, -521, -119, 407, -89, 224, 55, -3, 6, -140, -311, 171, 13, 107, -127, 203, 76, 81, -144, 131, 372, -116, 231, 73, 3, -361, -104, -315, -194, -23, -208, -2, -244, -23, -164, 308, 140, 44, 212, 5, -297, -157, -204, -457, -8, -343, -103, -193, -519, -140, 11, 73, -201, 22, -45, -217, 53, -22, 147, -42, -254, -120, 41, 207, -196, 158, -107, -305, 34, -81, -166, -22, -184, -360, 177, 226, -101, -40, -50, 48, 167, -185, -48, 332, -34, 172, -194, 37, 25, 83, 144, 191, 93, -69, 370, 215, -126, 382, 31, -50, 131, -62, 38, 84, 249, -54, 23, 371, -171, 91, 33, 312, 36, -225, 104, 67, 348, -4, -56, 81, 11, 40, 147, 48, 7, -32, 57, 144, -249, 48, 1, -76, -147, 24, -86, 101, -2, 314, 282, 240, -110, 79, 52, -7, -155]
2122a55j51L86r5P6j13K83m41J65k63K73R2r0LJ30om62p2L79J02j32l8M92k58
2145A05l21M58o54J97K02j65k9L52r3k18J79k38l5M80m16j2L08p9k96L32N4k7
2167H4j61r4L89l05K21m4p6j08L3K0Q9J26J01r9k29O00o35K95J39o07N80m00l0
2190a11n1P0l20L35K95m77J98L47n16K33J75m32M98k45J48o5j46k95L93J69m85
2211b82L48r4O5m3J53L6k44K5K64r2k65J78n9L75l57j21K99j23K9j22M37n00M3
2234e0k20K40l9K49m11j6L96n81J97N46k60J39m41J84r8jL72l83J72R1K15m33
2256a32L35n25J19J08q4k75N61j80J06Q6k57n1J61n3N3k89J13L58n58L54J37k00
2278a13k00J05L66r2o1K3Qj10K00n90L25M83m53N2K57m53M65j38j12J43j53K45
$$ y = [-155, -306, 80, -15, 61, -52, 231, -210, -45, -308, -35, 57, -33, -30, 100, 94, -368, -440, -61, 41, -91, -129, 363, 105, -216, 242, -412, -215, -13, -178, -207, 145, 52, -166, 13, -225, -260, 220, -196, -208, 100, 21, -275, 57, 111, 84, -77, -171, 218, -87, 134, 90, 14, -94, -61, -41, 48, 174, 275, 176, -53, 547, -88, 207, 346, -261, 319, -81, -111, -162, -92, -412, -77, 218, -259, -61, 286, -230, 3, 178, -254, 244, -1, 147, 82, -64, -359, 34, 203, -282, 66, -28, 37, -6, 147, 183, -61, -36, 228, 136, -129, 49, -10, 365, 8, -113, 186, 63, 92, -30, 407, -93, -50, -270, -30, -69, 180, -231, -247, 149, -432, -235, 311, 51, 190, -251, -67, -165, -166, 206, -177, -5, 86, 301, -132, 203, -322, -203, -95, -179, -454, 107, -73, 33, 119, -138, -189, -28, -81, -28, -317, -204, 154, -404, -50, 87, -113, -313, -208, 158, 66, 5, 28, 36, -74, 126, -464, -139, 344, -109, -57, 200, -253, 212, 74, -38, 105, -48, 197]
2300A97o32K83J76j37K66q3Lk51K19Jk41q8l3L52n6J53J43nj24j74qQ7j34J33
2324D7N9N8j32N8j20J32j2R3p9M5o7k25K49k57R1K2L41r6j70L42k39m35M71%r7
2349G9N3Q7k31j0K68k14j69K83j7K8k08M0J7k74K56P3j90L59l2r1k59O8K02p5
2373D3p9j04O40m81j36K00j30l57K52qK29n31M56k55R0j7M85l32J77n6P1j91j12
2396a46K70k79J01j0O2m59J27N25j69J49l68J51R4n6J32k97J38J71j76K14p2k07
2418a05J20J30j13K7k99j42N54J27j96K7O7l60MM37m31K64k18J07K40q4q4K6j49
2441e1L59oK3j73jL5j01n6J87j75o1R6j40j36R4K69l6j53K38l01J20m0Q7L7k8
2466H7k42Q7R2J24j10J03j52k06Q2J99jk37K30k2q7K39M3n40M18k59M05k54j23
$$ y = [197, -435, -152, 24, -113, 153, 70, 73, -178, 41, 42, -199, -287, -320, 32, -24, 129, 272, 267, 143, -31, -39, 48, -86, 47, 106, 164, 32, 90, -30, 102, 90, 183, 104, 149, 82, -143, 106, -151, -60, -38, 303, 207, 37, 379, 140, -295, 176, 176, 79, 132, 219, -12, -22, 246, 32, -137, 146, 129, 157, -51, -11, 6, -268, -12, 61, -129, 230, 198, 107, -152, -84, 118, 43, -36, -140, 500, 19, -117, 83, -47, -404, -152, -160, 69, -462, -6, -261, -171, -188, 297, -35, 142, 86, 157, -34, -146, 124, -155, -54, -64, -2, -461, -334, 191, 22, 171, -197, -46, 48, -8, 124, -173, -35, 136, -40, 174, 102, -105, 15, 145, 32, 59, -240, -382, 172, 299, 103, 130, 197, -163, -159, 278, -153, 111, -107, 0, 240, 156, 72, 98, -51, 308, 302, 325, 152, 151, 186, 85, 29, 216, 41, -20, 76, -64, -200, -106, 163, 127, -26, 212, -89, 31, -9, 78, 115, 87, -155, -68, 24, 148, 38, 141, -11, -217, -135, 64, 63, -174, 56, 34, -53, 186, 229, -311, 107, -152, 253, -1, -124]
2489a24K35j42J38k32J84k25N15n61L07K8J24m64M29m56J95p5O5p9K15j34q4J39
2511bP2j45l4M5j93J4J76l4Nm1O0J88l02P5J68o9j56k7j9M68n94M20j05J38M0
2536A48j37m1J40n1J03k27l44L10n5M23j69j9op6J86j42K42k94QN2k47K36j32
2559i2K91l12L52Jq5j22L7K02m5k32k66j22N88qo6o2j10m9mL48K1k00K18k0k11
2584E2J72k48J27j47N1m3N4K56j52l52J94J64P6j88k3Q3k16K15k21K46j81J72
2606I1r5j39J52j36O8L5k23J20K89j60k36N82m96K75o8K52k87R7Rk38J04J18k07
2629i3k3K63k41q3K98L1l6k2l74R8L09O4k73Q9K7m0l30N25l93J50k4j20L66k6
2653A42r2k3l04L25k17J17p1MR3%J01j14j00l8K50K57l81j44L4L85K5k96L01n39
$$ y = [-124, 111, -31, 107, -125, 59, -166, 349, -212, 95, 123, 247, -217, 212, -244, -49, -124, -59, -138, 77, -57, -141, -2, 70, -75, -109, -64, -257, -243, -67, -101, -96, -137, -77, 111, -191, -116, 52, -17, -173, -200, -219, 249, -345, 75, -30, 108, 148, 11, -30, 110, 59, 162, -65, -409, -99, -154, 269, 100, 81, 75, -1, 185, 43, 285, -9, -1, 51, -196, 40, -92, 199, -113, 239, 240, 155, 33, 70, 272, 227, -5, -271, -393, 195, 187, 121, 59, -51, -100, -104, 244, 265, 65, 283, 263, 52, 224, -24, 103, -44, 7, -36, 18, 274, 122, -230, -36, 128, 204, 16, -7, 76, -140, 75, -146, 100, -81, 91, -4, -143, 9, -127, -59, -24, -247, -127, 162, 2, -234, 348, -148, 127, 59, 311, 24, 121, 130, -108, -4, 114, -93, -116, 147, -94, -177, 121, 152, 116, 94, -280, -182, 127, 191, -82, 7, 34, -6, -336, 189, -204, -54, -78, -198, 168, 142, 50, 27, -277, 48, -169, -52, -123, -119, -26, -26, 75, -39, -139, -177, 73, 330, -51, -195, -161, 224, 249, -47, 254, -285]
2677b85K24k22K08J94j67J06j26P5Q1q8R0j6K0k87K79J20k72o3O07p15J35J13
2699A1m8j58J91J27k70K11k07M00m03pL29j66K66j64J22j44L7p6J47j7K24n02
2721i7L01k3J30r8l03L2j08J64Q4l8k66k4M00j09q6Q7R3o0l94M76k5N0j91j1k89
2746c05M56l10N1m9K02l2k23L39mj62K3n1L60j92k19K72k30K1k0J98m17L10Q9
2769A07RK12l91r7L67m12L32p3j01qJ33j20J75l8n8m58M35K27n60K32lL0j46L26
2793A20k88p4M4k1K81n8J76j68j01J08k63K46mL71n06L02J65k82R7MN4k75J01
2816B9l39M08M1r7K15l70K06O1j86J95n9p1k7J14o5l06K69m6J77J51j45j48K13
2839B20j54J80j23r7K3j6J86k38K27k39m9OM29k15l72M73j76j15J60j47o9PK92
$$ y = [-285, -61, -283, -75, 119, -48, 58, -68, 7, 88, 0, 90, 74, 94, -193, 86, 206, -66, -129, 478, -237, -102, 11, -37, -195, -4, 123, -147, 64, -143, 257, -146, -153, 176, 10, 276, 112, 234, 90, 127, 51, 198, 181, 405, -97, 204, 181, 311, 213, -90, -58, -166, -2, 82, 44, -222, -246, 154, 45, -41, 46, 139, 79, -315, 161, 136, 186, -5, -16, -305, 151, -159, -108, -157, 45, 13, -210, 129, 125, -37, -14, -65, 295, 103, -116, 156, -74, -53, -73, 125, -292, 18, 107, 116, 328, -63, -160, 207, -205, 127, 54, -47, -55, 78, -42, 133, 95, 37, -421, 14, 241, -319, -87, -90, -60, -206, 120, -168, -242, -198, -219, 62, 4, 180, 12, -89, 19, -244, 2, -2, 369, -137, 165, 330, 48, 145, 149, 203, -72, 29, -310, 98, 139, 42, 257, -113, 93, 154, -32, 163, 104, 33, 6, 120, 55, -251, 18, -28, 149, 300, 155, 7, 220, 66, 246, 123, 26, 49, 33, 219, -19, 208, -31, -80, -74, 355, 140, -232, 241, 65, -50, 110, -37, -106, -99, 193]
2862A93k98L56n12p1K19k04M39L3j45P6L6M3k35m3L68p4j05m16J47N45k55m1m32
2885c76O43m76J57J29l46J11L46m49J30L08j47m8n0M0k33M15Nj97k7L0r5j52L40
2908E8O8M8k44J85l23K96j31QJ25J79m91L10j11R7n3p5PJ72l6l80L63l63L72k63
2932a82Q5K57k3ml45J20M63n21J92k62O07n17J13l4j1K73l46J5K3L50l40K03O3
2955A79N1p4l09j19J50K83K4k31j60M50QR1l22J75m53K84k02J07J44m6q7K77k07
2978A3O8K4n8q1m4RJ0j09k9K21O2r3o7kL51J59m50K55k69j00O4L71l30O1k08j07
3004b79KP9L7p6J30J27j06o4J34P8J03m60L38O2j94J52k22M6P0L21k41l5j96M63
3028B69k05R2n6l43N65l82L9K63l45Pk19M75J01k12p3j17L63j41j84K64J6l01
$$ y = [193, -105, 251, -261, -332, -113, -317, 122, 155, 10, 86, 122, 165, -70, -113, 255, 181, 76, -340, -193, 352, 97, 56, -376, 267, -209, -52, 77, -269, -158, 188, -261, -131, 177, 30, -18, -68, -28, -261, 154, 159, -38, -65, -35, -130, -282, 58, 126, 174, -70, 115, -208, 88, -43, -35, 90, 269, -222, 88, -23, 74, 21, -54, -47, 125, 89, -291, 72, -291, 81, -182, -97, 160, 137, 133, -212, -92, 371, -150, 42, -220, 387, -130, -17, -51, -62, 211, -135, -120, -97, 253, -87, 116, 179, 230, 156, -153, -272, -122, 161, 185, -46, -206, 244, 252, 343, 21, 196, -257, 27, -175, -68, 76, 30, -57, 220, 13, 81, 105, 47, -34, -78, -69, -59, -168, -197, 24, 86, -7, -74, -76, 275, 434, -16, 239, -30, -130, -66, 305, -25, 36, -172, -279, -277, -198, -161, -237, -107, 20, -86, -150, -16, 62, 165, -295, 43, 105, -89, 63, -159, -113, -43, 278, 37, 2, -194, 269, 64, 156, 100, -243, 322, -60, -21, 242, -103, -96, -315, 160, 261, 49, -24, -141, 222, 81, -103, 161, 177, -124]
3050a24lK11n8j18Q0j50K55J72rm79L07j69K65P6j65L12l32J58r4j07m2K27J8
3073B31n55M08N9m78L75m9k6J59l3k43j61J83J78K14l16Q0J34J75m08j16Q6K41
3095A38O5l50J44j91K57n3q7J7O1J79k27l5J08n8L90k39k12j82R6K3M92l43M5
3118C8K1q9K91j09k1p5R9k20O9j16p4L66j23k75K10L8j20J32J85l86Jl0J41J10
3142F3j87K47j60N1k52o6P9J92K22k30M1J30l98K65l25M64k82m8K24O4m7J28l33
3165a58l9K25j27K45k92K13k94K27L4l49L20K83l08K79m33J92jQj20j42J45M39
3187C47j63m78MN03K6J14o56L7K60n5J58K4J5Q8k23L64p3k88k48K65Km2m3J26
3211F4m8r8J40N4P4m81M57j62J2J74Ok74J07k61M97r9l05J63p2J73r5n2j4J21
$$ y = [-124, -127, 84, 26, -92, -12, -162, 93, 265, 256, -223, 84, -85, 180, 256, 91, 403, 71, 229, 135, 28, -14, 213, 231, -324, 84, 143, -335, 40, -9, -35, 124, 91, -152, -313, -130, 48, 262, -54, 26, 160, 335, -73, -189, -103, 138, 203, -147, -3, -194, 63, 10, -77, -60, 1, 180, -47, -82, 26, -32, 358, 119, -93, -275, -179, -156, 336, -7, 38, 59, -30, 261, 152, 131, 56, 155, -65, 4, -112, -186, 180, 57, -218, -8, 30, -90, 42, 227, -159, -158, -188, -47, 63, -124, 123, -37, 14, -238, -304, -225, -33, 189, -41, 0, 130, -268, -3, -328, 136, -146, -194, 30, 94, 47, 175, -158, -197, 28, -99, 146, -146, 67, -227, 0, 34, -315, 5, 288, -20, 259, -174, 18, 17, 25, -95, -237, -92, 347, 184, -294, -290, 213, 239, 353, -303, -266, -6, -61, 97, 121, 136, 224, 1, 365, 292, 4, -244, 21, 23, -19, -62, 64, 16, -82, 58, 112, 186, -295, 162, 0, 12, 186, 192, -82, 25, -236, 261, 162, -143, 20, -52, 121, 26, -26, -40, 81]
3235H1j67p7L15p2O0J2m9l1K2j60O7k2J17J25l71J82k41M25k45q8n0J15L51n48
3259b49M52j94K44j0k18q0Q4j46Q2l41K00L05L1k53l8P2J07L3m0j88K79q1k41
3282a90L0M3P0M18k68K2J42k21o8l9j13J75L95l85r7R3k83L7L52l63M5j90J71
3305b24K76k0j70l2J51K65K5n26L47M5k57o1R9J50p2J15j58j25l3J48K24m19K22
3328c0J09k45q7J71qN1r1J82l95K30K08k0j72n6q0L82l03J94m68M09j00J21qJ67
3352A61k36k14L68n2J57k38K26j39J32k21L41k89k36L48j19k4p4J53N9j87N13
3373D29k13l76p8J20NJ89m5J31k26j22L0L43l59K19k1j05J39RP6o00Q78l92M7
3396G8k76K85k3k97j7K09L3p5M2O7j11M78l09m6k37N5Q4k3J12j57j39M03K4J97
$$ y = [81, -86, -163, 152, 80, 140, 152, 103, 72, 94, -66, 1, -21, 96, 221, -150, 32, -209, 216, -29, -117, -167, -52, 299, -249, 203, 9, 253, 243, 25, -55, 29, -117, -35, -376, -176, 129, 160, -93, -131, -59, 48, 81, 41, -147, 132, 51, -190, -160, -117, -47, 371, 103, 125, 267, 46, -22, -61, -174, 1, 396, 11, -86, 7, -276, -239, 113, -250, -205, -395, -224, 52, 32, -138, -170, -19, 246, 271, -255, 92, 137, -120, -181, -82, 68, -4, 111, -47, -172, -205, -57, 167, -252, -30, 79, -166, -253, -82, -90, -39, -130, 52, -343, -113, 95, 75, -97, -153, -233, 149, -154, 40, -428, -19, -119, 2, -6, 161, -75, -289, 79, 27, 184, -54, 172, 33, 165, -56, 285, -4, -240, 108, -11, -35, -109, 44, 103, -84, 429, 216, -160, -238, -118, -113, 76, 31, 162, -64, -186, -156, 187, -172, 47, 26, -79, 60, 69, 145, -455, 423, 31, 78, -198, 87, 64, -233, -250, -41, -8, -83, -41, 26, -85, 393, 84, 38, -199, -144, -60, -83, 29, -128, -267, 136, 160, 357]
3420C57n5k34k24j5J56J10l25K36j26k03%J35L08k87J58k85O3K67Q3p4K05k10
3442D0M5j14k10LJ41k8K25k73Q8OJ9p6Nj65K32J52m9k9P8l93M21k51j20K85k40
3467b08J67J2j89L97m29J69l7J63j02J38k34O4J07J16ol18M44k30K87n67M75m51
3489b32M76m70M89q7m63P24m29K9m4k3K0pL1L11l68J10l72N2j05r5K67R0L60m43
3513a79K12j64K86Q4k87Qp2K23j92L7Q1J6J30q7q2j77J51N0l75O78n73K38L43
3536C49m2j92l33K93l13J43J10K52k65o9K38j15q6J78l36J43O7k9o3K07j59K3
3558Ap1J45J8J53l33j29L54L16l06P2K32n13Q5q1K77L43m44l42K58l75N36k91
3580i5j06K80k60K10j19r3J08L30J9l84K99j18P3k14Q0Q9j23L43j96m6k20L15
$$ y = [357, 302, 68, -156, -171, -15, 95, -230, 6, -120, -323, -323, -188, 120, -167, -9, -294, -231, 36, 119, 45, 250, 40, 85, -29, -239, -236, -95, -123, 102, -171, -83, -77, -58, -134, -129, -294, -62, 90, 41, 12, 90, -303, 118, -133, -253, 32, -208, -41, -29, -218, 179, -250, -81, -118, 45, -57, 81, -153, -89, 18, 134, 128, -190, 254, 24, 311, -256, 219, -232, 244, -226, 263, 176, -287, 437, 8, 37, -7, -30, -10, -17, 14, 325, -43, 67, -305, -253, -358, -453, -186, -96, 264, -179, 33, -131, 155, 239, -48, -40, -112, 111, -81, -44, 37, 53, 183, 96, 14, -163, -12, 38, -337, 341, -232, 6, 349, 307, 115, -218, 75, -238, -95, 15, 267, 2, -67, 171, 56, -30, 148, -188, -45, 22, -7, -70, 137, -22, 1, -70, 75, 93, 246, -87, -216, 138, 454, 148, 220, 452, -61, 24, -57, 220, 563, 119, -223, 35, -340, 196, -95, -201, 79, -181, 29, -90, -183, -75, 255, 274, -110, 189, 71, 144, -70, 10, 99, -24, 319, 123, 77, -143, 172]
3602A72k57r0K18P2k35J66l0k96Q7K57m8k6j68M22l83K68p0K96m70J21j07J72
3624G1p9j3p5k24J3N40n43K62j07O3r1P7Q2J5J40%J37l73M0K31K03l45o2K54k29
3649a3KlJ18n8j42J25k9j96pK48k65K33p5J59j89L8R2K41k39q9k0j07K35r0J8
3674a3J03K3k47J31J67l05J54J06J12j4o55L59Q2l75K77M96k13k49L65k80j82
3695a58K64J16m10m1%K55k5p7J38j32L6j48K85k16K7K12j97K82l45K56k6l52L96
3718A40l7k57J4o6K53o4qjl00M61j60j4K96k79J0j38p0J68L26m83J95j03L61j39
3742A05k85J31j35J46P8l26J89K78k5l99K74l21J20K8J06M8r8K50j04J34k47k09
3764b62l1L00O35p02J17R7O8m17K48q0J63j87l15M36o4K64j39l62j95L37J89l88
$$ y = [172, -85, -175, 43, 115, -120, 46, 16, -280, -193, 64, 16, -10, -178, 244, -139, 129, 59, 355, -115, 6, -101, 71, -8, -21, -96, -320, -307, 233, -310, -48, -155, -92, -183, -106, -24, -9, 131, 131, 268, -105, -65, 166, 369, 24, -38, 216, -13, -11, -14, 104, 46, -96, 29, 0, -196, -203, 45, -220, 13, -62, 97, -92, -54, 38, 279, 40, -49, -69, -176, 59, -31, -13, 90, 113, -134, -3, 164, -141, 13, 119, 231, 217, -438, -79, 3, -372, -95, 401, 188, -61, 304, 24, -158, 106, 222, -188, -229, -229, 26, 1, -76, 62, -70, -34, -182, 103, -113, -86, 126, -71, 211, -134, 122, 96, -256, 140, 103, -154, -140, -206, 47, -17, -25, -26, -326, 135, -25, -39, 257, -22, -12, -150, -220, -52, 274, -209, -14, -117, 244, 105, -180, -49, -184, -38, 40, -286, -97, 181, 156, -243, 31, -290, -170, -142, -36, 12, -86, 164, 60, 194, -53, -262, -293, 7, 642, -60, 57, 154, 222, -195, 53, -27, 136, -51, -366, 70, 6, 270, 131, -231, -426, -89, 100, -288]
3786b88OL41p3K91j06k88L67l79K42j27k85L81j1L9k10J21j10J91o8K13l93J6
3808a30K43m8n2r5N82o42J12k05L51M4l86J14r1K50j99M08l16K81k92mR5n9K59
3831B20j29p3L5q9qj86L31k03J78q3lM5L58o5k62P3k65L56j45m0K07j58o4k71
3855b41J70j83J49J29o4j25J1J08p4P6k09J25M97j23l00J14j1l1N7Prj66K62j82
3879a3K33m91M97j52k93N18j55j37k11L23j02O6J80k50M0k91J24k53N05j30j4
3900fj89M43m82K92j62j26J70J09R5k0l26L71r1p8J27k32K20ll09K07m8K99l23
3923f2J02m9K07k76L49k93j36k22L70k3l7K46l31N5p3M82n92M87l33L53k57k06
3945b39J52j83M7k60M70J73k63L41n72K80p6j22L47Q9n09L97jm4m31J85K08K39
$$ y = [-288, -282, 59, -14, 277, 171, -117, 250, -129, 113, -14, -299, 82, 71, 110, -100, 21, -89, 102, 34, 247, -146, -130, 113, 65, 13, -82, 500, -142, -30, -235, 116, 160, -226, -112, -203, 47, -152, 256, -60, 221, -71, -75, 20, -39, 220, 91, 18, 53, -36, -44, -230, 101, -102, 76, -7, -10, 35, 393, 328, 66, 139, -126, 230, 85, 45, 252, 94, 30, -241, -71, -254, -105, 24, -40, -165, -154, -46, -120, -44, -253, -128, 369, 246, -54, 60, 49, 18, 75, 82, 73, -93, 169, -13, 220, -271, 226, 74, -219, 299, 144, 7, -204, 119, 17, 83, 263, 13, 53, -238, -114, -367, 138, 8, -6, -195, 248, -234, 58, -104, -230, -60, 49, 144, 124, -202, 169, 78, 0, 127, -105, 115, 112, -197, 10, -38, 261, -62, 40, -9, 198, -78, 271, -22, -158, -380, -10, -33, -70, 176, -155, -100, -173, 309, -283, 204, -129, 224, -33, -239, -87, -270, -223, -483, -13, 160, -103, 238, -334, -54, -130, -252, 95, 184, -325, 72, 71, 27, -404, -219, -11, 228]
3967B28o5q6o4L3p7k81K68l1J83j91K2K34j36l24O3M50k67j56l7K71l69L21K37
3990B26k66l2J32Pj08J92M3r6R3k7j43q5j58k6K10J21j69j23M02j78n0N8n6k33
4014b66J91K12n6j57K67n7N5j71j80k65M23r3j2k44L21P0K12m68n0L02K9J99k33
4037B9o3Q7j84K69l11J55J97j25j71j28L67j64M45j91k25r8j46J54L59k16j2j30
4059a02L3K55k62Q3O3n3K09l01L47j59R9j49J6k13J16k3N3K59l49l6j16K81j29
4082g8K40k07P7J01k23j13K04j83J01K6l6K77L2K3m56rL25J1m7p0r5Ok2K77n2
4107A09nl9j97K39k19M7JK6L99l82M7J42Q6l84J00P8R8l00N8m7J71K38l19J06
4131E3K41r9p3j77k69K19Q8p1O2q8j3K34k36J69l1L8l61J93o0J94N8k2p0J52j87
$$ y = [228, 163, 77, 13, 46, -31, -312, -44, -75, 108, -83, -61, 173, 37, -287, -224, 226, -41, -197, -234, 37, -332, -11, 226, -40, -72, 60, 67, -41, 151, 194, 98, 191, 164, 21, -64, -222, -248, -38, 83, -86, -209, 193, 15, -35, 23, -33, -266, -75, 137, 81, -76, 191, 134, 189, 18, -162, -427, -4, -97, -109, -353, -32, 38, 250, -218, -268, 34, 63, 262, 29, -34, 53, -131, 138, -173, -18, 179, 54, -117, -245, 122, -42, 403, 212, -13, -111, -257, -103, 256, 40, 28, -102, -69, 186, -76, 7, 70, 17, 226, -75, 272, 113, 212, 63, 79, -134, -18, -41, 12, 271, -78, -114, -230, 51, -78, 162, -45, 32, 133, -90, -203, 1, -182, -81, -55, -91, 186, 218, 241, -215, -224, 101, 112, 65, -5, -100, -94, -116, 161, 109, 104, 65, -132, 107, -112, -65, -64, -38, 361, -21, 26, 168, 254, -130, -30, 48, 146, -154, -96, -143, 28, 266, -53, 53, 294, 195, 122, -55, -324, -105, -17, -88, -26, -114, -127, 107, -129, 40, 9, 47, -314, -121, -181, 13, 71, 49, -21, 131, -56]
4156e6J61J04m30jL06N8J7r9k76K53n53O13k93K40j90M63k69K9%J52o50J98L94
4179A71qK4Qr6J3r8l1l3J07j39L23k16n7k13M14j35j40O4M6k7K9k02M43k82J13
4204G8p3q8j31J22J50L4j34j13J30k20J71J5r3L36k60M3j18R7J53p4mm2q1L36
4228B34l71K23k28K06l24J0L37R1k24J02j91j56L74J4R5k92J1r4M00m08J73R5
4250G7l10K93M2K22n30J59j9j28L81j31m9j81K71k19O8Jj9j44J67J4r5K15N1P7
4274B13k92K68j37n8K85k35k61J27j9J29O9M9Jl43j95K08j23N59k90QK07k85J20
4297Er0M83m06M88m06L12k67N9l30J40J24J36J1J64l90J5r5qM4k4k44K50J37K1
4321A29K47m25Ml37K56J4K68j99n4K39k1q9k51J8N53k32k9j77J31l33L56j77J49
$$ y = [-56, 105, 209, -221, -222, 84, 142, 159, 60, -216, 37, -516, 97, -196, 44, -146, 317, 48, 77, 77, 229, -421, -223, 171, 163, 187, 195, 99, 112, 14, -17, -50, 57, -82, 241, 25, -32, -245, 169, 34, -106, -42, 4, -23, 6, -196, 247, -35, 78, 5, -83, -214, -92, 58, 92, -42, -155, -25, -245, -74, -59, -152, 184, -76, -33, -151, -54, 99, 25, 21, -21, -102, 234, -137, 86, -142, 64, -260, -250, 87, 178, -46, 56, -135, -291, 83, 97, 192, -100, -89, -183, 217, -191, -18, 77, -233, 60, 102, 324, -206, -47, -66, -194, 187, 56, 7, -174, 97, -122, -54, -53, -72, -216, -49, -35, -130, 85, 136, 213, -79, 189, 52, -6, 279, 44, -217, -90, -109, 20, 89, 138, 139, -204, -399, -191, -314, 245, -45, -37, 170, -115, 5, -85, 398, -8, 480, 74, 386, 119, 178, -152, -12, 112, 248, 259, 423, 33, 48, -47, -55, -11, -35, -279, -29, 108, 129, 376, -49, -45, -382, -126, -112, 156, -43, -97, 142, 121, 32, -219, -201, 352, 120, 91, -86, 45, -288, 68, -109, 40]
4344D0m32O17j40k66J73j51mn8M25l65K96j27j19J08m35N48J48j30n9k20K38l28
4366b41N4J52L5L01l83J53L9QN8n57M77q7k06r4K72k95N10l94K40n6m5J97k51
4389a13K55k31r3MK06j10L12m21L23o9M8K46m12j01K77l56LL23K72l48j32pJ99
4412G5r4n5L2k4k05J33K28m32O50j74r0j53P9J58j74K74l59P9L8p6J13L9j54L90
4436B98m66o6L56J16j91K11k71j38Q5j7j55M32J52j34k15q8M2J30q7Q0j67J11
4458A8m3l0j29Q3J29m8n6K46o0j40L07k21J3pj53o9K79L4L28k20k4l56O3N5j01
4483a02M3n8L05j71l33K98m95K51O88j26k70K14j38m15L24p4o4K3q5L17Q7k81
4505f2L96m61M3L1j69M57k81N1n8k4Kj69M5M16j25J72p45N82j36Qr6k74R3Q8L4
$$ y = [40, -392, 225, 85, -181, -8, -159, -163, -221, 204, -161, 135, 8, -111, -3, -438, 110, 258, 128, 69, -151, 87, -241, -187, -35, 0, 301, -82, 71, 110, 118, 176, -381, 96, 9, -197, -291, -19, -314, 196, -198, 42, -14, -59, 138, -113, 142, -89, -182, -178, 28, -82, 230, -191, 132, 63, 111, 357, -55, -156, 121, -235, -232, 91, 363, 15, -117, -124, 75, -19, -74, -42, -66, -271, -138, 90, -342, 308, 134, 44, -109, -30, 128, -46, 228, -131, -52, -14, -90, 23, 62, -92, 298, -168, -234, 122, 238, 47, 258, -13, -151, -66, -83, -238, 194, 346, 212, -3, -91, -49, 81, -6, 74, -93, 18, -25, -55, -184, -101, 28, -20, -76, 170, 110, -30, 277, 56, 69, 62, -91, -160, 119, 153, 481, 261, 237, -119, -56, -1, -102, -59, -117, 188, 17, -316, -18, -513, -262, 426, 300, 30, 244, 106, -309, 15, -59, -123, -100, -185, 132, 219, -62, 334, -127, -84, -53, -222, 235, -46, 5, -53, -77, -75, -244, -199, 217, 92, 264, -481, 101, -35, -27, -123, -397, -304, -216, -182]
4530a82L32K12m19j08K53j34K12K40k61J90m70J00k88N83m31K95k25J13k00P1
4550a17K94l37K66j53k74M05l7k3k47mO4J77p2j50L67k12K89m38M9J98j17j29
4572b01L28j79J14k08K07j28L32r2l13N9J54R5m23J92l0jO07p77K46K10J60l26
4594B6P5n6jJ6j55rk0LP8L53k25P0j24o5j07l7Q1j70K44m6K01j06l36J44M73l56
4620d9l1K2J53p2j49o0N5K02j32L16l29J42r3K64k71j8K06J62o2k89k33M83k31
4643a4J60o1k55L24j67j38J40L20o61P97o07K90j69j46L7jJ98j33k03N22k34j70
4665a71J55K96j05l77K49K12m34L10n4m37L96J31m4L2k61OJ59k76K04M0q1jJ32
4688H1N9l31O2L09J48p33M30K4J02P5m38K98n3J07N2j16l52P2M87j92k32J05J89
$$ y = [-182, 150, 362, -57, -165, 88, -46, 166, 406, 145, 335, -135, -35, -323, 260, -171, 124, -101, 12, -188, -117, 177, -160, 106, -47, -321, 84, 47, 24, -223, -227, -163, 14, -58, -208, 159, -53, 236, -202, -153, 45, -72, -201, 127, -52, 62, -146, 61, -67, 265, 173, -140, -81, 73, 168, -255, -63, -93, -94, 513, -264, -18, 192, 352, 26, 101, 45, 44, 60, -95, -104, -124, -121, -43, 310, 85, 155, 31, -34, -141, -178, -97, -267, -23, -69, 132, 26, -310, -166, 307, -49, -80, -58, 95, 23, -126, -186, -131, 71, -61, 255, -74, 68, -25, 239, -32, -50, 156, 318, 256, -33, -266, 217, -14, 146, 85, -170, 154, -13, -151, -11, 309, -352, 445, -162, 128, -41, -187, -150, -151, 47, -86, -289, 233, -1, -171, -16, 280, 175, -202, 47, 259, -175, 135, 81, -356, 40, 171, 127, 159, -102, -96, 63, -213, -9, 31, -50, -51, 81, 140, -191, -129, 180, 328, -405, 25, 49, 151, 226, -212, 86, 33, 140, 192, 76, -276, -204, 283, 91, -141, -36, 153]
4711A53k84J98r9K97k87K74l44n1m4J55J8j02Nk9L53j11j4n1pr6J23l99M07k99
4735b34N05l95J49L49O0p44J59j9L93l93R6K63r5m38N18l8m7J8q3l8K43q7P7j03
4759A16kk52Q8J06j94J36j12K06L9j72L11m74l4M37k82K03r5r2J42j97L09k28
4781d1K74k1m72p0L47L64m11r5k6J64J89k99L46j18k89L0L11j43lO2j39Q3J28
4804A71l38J18L52l28K42n53M36k39N0oR3k0NN2J74o3k42j24K48J2J01j6j28J02
4828I9L50m12O1J44l34q9J97Nk79K33J90j36j9k39K52L1mKJ9k43K6K82J84l18
4852BQ2j07l57N26k25J94k83P7K64n2k02k04L48k64L96j42n8K01o8k95K67K88
4874C88m98j7NP9j54l7N4K46j56K9N1k25J71k84M93l16L41k94l10M48r2m6J29
$$ y = [153, -131, 67, -32, 265, -22, 252, -92, -143, -187, -32, -14, -116, -111, -140, 213, 102, 88, 37, 30, -66, 57, -342, 65, -234, 271, -124, 25, 374, 434, -310, -151, -170, 223, -170, -74, 189, 94, -344, 174, 136, 89, 107, 24, -14, 229, 142, 219, 116, 114, -138, -50, 56, -138, -2, -114, 92, 131, -41, 270, -204, -238, 199, -83, 120, 25, -67, 75, -122, 187, -41, 233, 212, -260, -330, 17, 381, -30, -125, -151, 13, 202, -97, 249, 131, -158, -128, 183, 40, 37, 99, -40, 43, 171, -167, -49, 303, -25, 217, -336, 100, -139, -89, -95, -2, -22, -17, 35, 209, 146, -96, -220, 28, 40, 141, 125, -3, 99, 449, 37, 98, 242, -92, -181, 16, 21, -258, -25, 165, 29, 10, -229, 23, 54, 50, 52, 71, -172, -146, 136, 320, 2, 84, -23, -380, 146, -79, 115, -168, -91, 173, 121, -81, -285, 63, -201, 195, 53, -5, 196, 128, -167, 100, 388, -110, -127, -122, -43, -197, -234, -180, 66, -90, -61, -10, -235, -64, -348, 145, -171, 170, -124, -434, 14, -78, -124, 5]
4897EK24l73R6J77K9L3j63q1j28mJ63j72M74m32L94l50O2k59L39J72j82k70L20
4920G4l9M3J27n71N52o39N59M9j90J63J2M0n08M21K27l11mj53J37k76L16r5J85
4943A19k97K51k36K59j29K63j18k84QL93k82j91M99k24J6j39K15o4J80l27K81
4964A93m4k87K97k07M4l6q3K05k10J10k63J95L4l8j05L60j77k37L52J37k95K62
4986B07m16R9O3j43nP8R6R3L17m09K33j48p9J89k10Jk9M9J96k65j49K15N8Q6l20
5011a93k2K54L47l88K9j73J57K95l17J82j66J67j9k0Mq8p4j59Q8K31J9K3q7q9
5035Aj71Q6J1p4J69R7j61q4J86r4l8j47K08L3J37pj19j94L58l57K45k49L58M9
5059B43q2k46L15j61k88K27j2j94J55j0P4m24K18M60j91k46K46k37K62m05Q4L47
$$ y = [5, 229, -144, -48, 129, 158, 191, 28, -53, -181, -185, -22, -194, 280, -152, 242, -108, -46, -305, 34, 206, 24, -246, 74, 35, 78, 205, -366, 186, -453, 106, 155, -35, 128, 140, 180, -328, 93, 320, 9, 5, -148, -11, -287, 29, -66, 119, -178, 73, -163, 96, -33, 230, 112, -172, -164, 229, -53, -244, 255, 31, 47, -92, 123, 59, 239, -88, 193, 149, -138, 159, -48, -4, -40, -123, 82, -128, -18, -281, -86, -52, -90, -195, 165, -12, -249, 103, 240, -55, 207, -209, -110, -47, -190, -195, -117, -21, 72, 389, -20, 213, 65, -14, 175, -35, -34, -63, -14, 182, -83, -232, -17, 41, 127, -193, -215, 39, 386, -2, 27, -146, 11, 306, -11, 171, 5, 172, 153, 133, 137, 49, -25, -184, -96, 135, 154, 177, 90, 1, -170, -84, -73, -147, 22, 119, -42, -126, 60, -34, -72, -219, -11, 22, 159, 152, 33, -161, 197, -160, 85, -164, 194, 243, 161, -85, 230, 69, -219, 8, -4, -198, -43, -53, 21, -403, -185, 275, 84, -162, 84, -153, 109, -296, -212, 135]
5081A35j74k52L10J31j87J17Q1PK02m07k67L49K1r9k11M32j09l09J48J24k22m1
5103b21M44l58o8K07L05m25j6O9L13j07k73J83j24j06L94j17j33J03k28J97R6
5124A35j82k85L43R0j82M9k61L11j64K10k31K45q5r9mK35k45M8J4j00N72n18J86
5147H2k06L94m82L96m04mL89n23L07J60p6J25l0n24L58J2L0q1Q7k90J44J67k91
5170b60J13j22L05N8l09J11L54k27k60J98l25L82J39j56L3j82J84J2j32K84N9
5191B59l4k25Q8r9L2J7K54Q2k06r5k59J98J54k2o1J4M1m65M24k11J70L8k92j81
5215c79M76j7k01LNl7L14Nj24j23O4J44k59m16O31q9Rl73K08K13j61J35k88L25
5239F5m9J57j64j45J98k40M65l0l77J4L1J43j02J30Q4K0o1j54k6J4j16K08J8j9
$$ y = [135, -39, -291, 19, 150, -37, 80, 161, 168, 370, -37, -304, 45, 66, -33, -244, 188, 79, -230, -82, 42, -180, -221, 223, -135, -203, 4, 309, -116, -132, -63, 250, 143, -130, 53, -71, -177, 217, 100, -33, 70, -158, 39, 135, -47, -332, 11, 101, -81, -32, -293, 18, -146, 64, -167, 78, -7, -106, -110, 125, -120, -72, -58, -158, 414, -104, 82, -124, 270, -212, 184, -220, -224, 165, -358, -51, 109, 33, 158, 128, -396, -38, -26, 4, -77, 10, -280, -136, 31, -260, -147, -269, 36, 94, -215, -104, 250, 23, -237, -39, -364, 18, 157, 1, 34, -148, 36, 48, -84, 200, 259, 225, 0, 88, -11, 21, 38, 292, 374, 168, 73, -186, 12, 166, 144, 83, 97, 138, -327, 97, -114, 56, 94, -198, -379, 97, 80, -121, -118, -113, -150, 164, 169, 45, -78, -14, 130, -129, -545, 86, -3, 6, -367, -159, 54, -107, 28, -260, 65, 16, 173, 9, -136, 62, -178, 287, 257, -120, -106, -75, 68, -34, 96, 180, 200, 139, -15, -41, -27, -143, 65, 83, 64]
5263F4j5K01j93k14O4j39M03r8j38k96K34J39J02l17L76k10N8j30j77K68J64o3
5285H3Jn0l68Q14m34l31K54o2k12L64O7n1q6n4k9J7J03m73K79l25K75J41P7K1
5309B1j99L14n27M40k4J2J23j94j57J3R0K02pm04N18k51J81m9j88J69j27o5J4
5332i5K08oJ31l02j81L94l53J88n3K21m24j18K01K53m1N5N3k40L55l82L34j00
5354I8k48P2J09k0O0K5k9MM9j82J83j29K17k09k21K07Qp1L01k75J11j57k18N36
5378B21j81J85k06j46M8k94L26K93m19j30L61k42p3P9J33J76J0m00J03J3K8R1
5400b4o7K34l90L71k36J47l02K92q4K09m1k11%J0J96q0j18J06J12m26K90r6K0
5423h8K45j69M2r2o9k49P24o18m9N33r3j29M2q6O0l24O60j06K5p8l32J98m44L67
$$ y = [64, 49, 250, 57, -157, -93, -232, 171, 73, -65, -361, -127, 12, 114, -203, 173, -37, 21, -109, -286, -18, 146, 83, 84, 34, -334, 480, 46, -285, -31, -93, -305, 59, 126, 75, -11, -65, -94, -77, 26, -447, -168, -493, -218, -77, 0, 21, -178, 136, -391, 49, 25, 37, 160, -34, -191, -178, -88, 114, 107, -297, 221, -30, 151, 102, -86, 83, -44, -109, -95, 113, 107, 238, -64, -245, 149, -204, -16, -69, 152, -272, -390, -189, 64, 23, 78, 131, -109, 246, -136, 198, 98, -150, -78, 31, 11, 71, 96, 67, 71, 120, -62, 121, -8, 209, 0, -221, -14, -6, -77, 224, -51, 60, -97, -315, 221, 40, 225, 19, -127, -79, -373, -47, 246, -173, -303, 58, -184, -257, -178, -45, 131, 141, -259, -156, -143, -115, -24, -91, 143, -247, 124, -112, 35, -267, 25, -59, 150, 109, -102, -102, -92, 104, 24, -94, 12, 124, -302, -12, -108, -88, 157, -12, 30, -62, -131, -380, 344, -274, -323, 210, 117, -12, 30, -56, 4, -320, 340, 234, 259, 181, -151, 47, -397, -30]
5447c0M2o5l07M77p9k94L91o1j19lj6o1L72k37Q3j00J45Q5m18N66m98J4j68K44
5471c7J52k05M04k39j4J66m20L30O5Q7m20J06j25J54l0j18M22k48j00j06j25M89
5493A88l55O9M8K50l64k68K66O8m6J03j14K23o2N1o0k83l9J79M20k61j56J36p
5516a4j12L3K10O7l51PJ58r2J12j73K82k95K0L49j83R5k64J86n8Q8K77n09J06
5539f1p2J93j1m3j78j66M71j85J84j69R2r6L00m58J08O1J34m9k01P0l5J14M2k37
5563a92J99j78N4P7n9M17n24M37j64k26N5q9p3L27L18l41k1J23j25k29J06J83
5585G5O0j62LJ39Jj82K00J2l81J32J83p5J90j31j38J84j72L3MM3L09o35K48K49
5609A89j50k36L48k16L2j09n8J15K52j51k20p3K00l7J28L4K4k52J4J50O9Q7j73
$$ y = [-30, 12, -53, -360, 117, 38, -256, 135, 74, -45, -48, -64, -125, 247, 10, 93, -7, 138, 223, -195, 371, -127, -113, -281, -37, 115, -90, 314, 75, 61, 227, -193, 137, 202, 289, -131, -25, -150, 4, -26, -144, 278, 30, -70, -176, -301, 188, -167, -98, -50, 200, -164, -432, -166, -98, -144, -41, -155, 68, 6, 57, -3, -286, -325, -146, 274, 13, -143, -7, -14, -126, -93, 117, 184, -167, -160, -2, -94, 18, -155, 127, -168, -148, 201, 18, 113, -151, 35, -23, 65, 342, -167, -61, -133, 60, 49, 6, -172, -338, 133, -52, 132, -37, 55, -41, 259, -199, -91, -30, 104, 55, -146, -76, -111, 3, 45, -192, 7, -171, -117, -40, -99, 318, -206, 231, 67, -159, -104, -193, -266, 61, 379, 38, 17, 140, 15, -214, -108, 75, 135, -27, -24, 115, 116, -66, 134, 146, -235, -103, 80, 5, 195, 64, -74, 110, -62, -29, -25, 18, 327, -308, -60, 189, 39, -197, 151, -65, -33, -142, -200, -85, 167, 16, -204, -277, -77, -114, 14, 48, 72, -180, -166, -16, 53, 140, -33]
5632c3L3n5P7j52J32J7l91N81l08j61M42k90n5K58M2L8j16l68M53k53K72k42R2
5655A3J4o7J04k5j18j51K63k89K60p6K18l7j0k51K56J6L5j45J25p6j1q0J20l99
5679c11K67R7q6L21l34K21M7l17m1K24j33m6M6J89k79K65l49L30K82l55R2J20
5701B50k90L01N5m05M81n26J08pL97l06j08pj38J25j7J21j25K11j5P2k52r6K33
5724F2r7J23l2K01m94N51k03m2J35k19n1L17j70J63l93K03Q5rr8n2K17n25N23
5747A95O2m45O5pj64K67K9M49p05J02M04k33n8M1n07O67j12k25K06qo8N7L6P3
5771A21Mj81L19l35oJ91q9K08j45k45N2n0J02J0p7n9k41N76j4k50P9k5j11J98
5795C2%j60l9J0J50m0N0J23l65M8N63l46N3k59j27K64L74k05k75L44l06q6M71
$$ y = [-33, 0, -55, 22, -130, 2, 19, -372, 209, -99, -260, 182, -108, -163, 95, 137, 175, 59, -309, 144, -109, 163, -79, 13, 27, -40, 64, 39, -79, -230, 33, -256, 4, -72, 146, 109, 99, -152, 104, 120, 155, 10, 135, 59, 48, -32, 88, -311, -44, 53, -33, 288, -46, 175, 222, -95, -136, 88, -45, -91, -45, 144, -135, 130, -219, 111, 393, 38, 130, 250, -40, 261, 316, -89, 392, -134, -26, -33, 364, 58, -50, -57, -195, -70, -87, 34, -91, 120, 105, 177, -75, -171, 62, -35, 88, 56, 257, -237, 314, 111, 69, 204, -15, -66, 251, 81, 244, -149, 54, 139, 130, 32, -20, 197, -328, 195, 257, -188, -123, -130, -294, -27, 2, 451, -254, -152, 252, 19, -39, 2, -505, 162, 50, -175, 31, 23, -45, 12, 48, 121, 125, -56, 263, -72, -78, 113, 24, 232, 87, -158, -106, -156, -54, -44, -121, -180, -421, 155, 141, -109, -30, -55, -166, 32, 32, -128, -167, -157, -7, -47, 3, 126, -239, -191, 372, 26, 79, -180, -307, -43, 331, 126, -149, 195, -111, -197, 274]
5818B74P1l68J98k62L53k72J0qj33j46M40l83K56p1J89M07n43j05k05N24j20j61
5840e5k2K53j31m11L62K02k58j18R6k26k31P25j67k09j4L43l21K61j19j24l0K76
5862H2j50J38j97J44J95m45J8K3Q6j05K91J3o8n2K29k89L08R3m93Q4M24j83K74
5885D20l36j4J7q6j71K34j49J10OJ49n29M52jk0J28l46L0M2N8n3L21j25k47j52
5909b62J56j10K35J71j97J86k25m0J0o7J19J18j80J74k71J40j44L48M7k23K7M1
5931E3j34M0J45j78J83k92J87j90M01l19N0k53M51o2l06l7L60k80n2q3M76k13
5953e3L30k96pRJ33k00J29j44NL44l4k4j80J58m37r1K91J60j64L1l0K45k41K21
5977A55N5j19l3J98n18L98k06j26kN83k76k05L21K4j00j8j6l4j41R6K48n6k78
$$ y = [274, 345, -23, 175, -87, 266, -6, 4, -4, -137, -283, 157, -226, 30, -41, 148, 555, 12, -93, -298, 226, 106, -55, -77, 176, 45, -366, -4, 198, -60, -178, -82, -308, -539, 186, 19, -190, -204, 139, -182, 79, -40, -164, -194, 82, -68, 70, -127, 17, 212, -233, -215, -192, -106, -211, 80, 93, 25, -27, 202, -87, 221, 314, -179, -95, 329, 146, 420, 84, 70, 87, 1, -170, 64, -85, 25, 31, 180, -349, 103, 102, 82, 210, -136, -106, -64, -6, -59, 262, 137, -110, -262, -106, -216, 19, 190, -7, 179, -46, -86, -76, -143, -24, 94, -86, 88, -183, -43, -187, 161, 208, -15, 12, 53, -81, -41, 104, -74, 109, -183, 4, -186, 215, -104, -54, -307, 144, 82, -224, -261, 99, -181, -233, -316, 160, -53, 277, -19, -26, -17, 116, -84, 45, -99, -94, 250, 216, 192, 12, 170, -267, -358, -67, 93, -71, -40, -70, 175, -66, 155, 210, 91, 58, 256, -262, 136, -70, -196, -198, 385, 109, -96, 225, 249, 149, 131, 115, 81, -60, 36, 284, 228, -50]
6000e0J3K82m07L21j87j25K03P4j45J11P0j12l64L46J23k67K45j21j46r4M19l12
6022a23j46K08L00k76j96L3K00J23j67R8l9L13j93j48Or3J58j22M01k74n8JL73
6045C79o69N02o6l04M39l72J96p0Q5j80q0K97j96K8k9J37j49K12k61J17J67k46
6067f3J12J49j38p6J62R4n86M31o9j2n7L20m02J26r6mK59r2q6j09k22O04j13m73
6091c41K47j54J62O1K01j44j17R6k9J83j73Q4k69L40j82N4j19J58n7K1j09K30
6113A43j46j29OL14j71J67l15R5k1rJ48R7l22J0K22N7m77M42P2l76P1K6P6K64
6137B44q2M2j39l2l01L12p2k85N24n53K98n1M97n13l69L69L52k99j8qq0j14M02
6160A24M9l15L93l44K44k13L06m84J21J24Q6J26k36N7j59K51j47j5L49k78j09
$$ y = [-50, -37, 245, -162, 159, -28, -153, 50, 124, -21, 90, 160, 48, -316, 30, 153, -114, 131, 10, -136, -230, 189, -123, -269, -61, 239, -37, -233, -200, 0, 123, -44, 54, 15, 328, 135, -13, -7, -100, 58, -64, 337, 63, 5, 6, 379, -290, 212, 146, -158, 281, -91, 105, 35, 120, -60, -140, 157, -39, -11, -40, 97, -52, 160, -101, 16, 183, -63, 49, 198, 60, -16, 146, 240, -346, 85, 16, 4, -53, 267, -135, -9, -105, -109, 150, 58, -28, -137, -359, 245, 132, -341, -94, -248, -86, -25, 176, 32, -85, 11, -18, 165, -8, 76, -193, 147, -35, 19, -100, 58, 1, 22, -87, 143, -3, -132, -126, 188, 17, 184, -131, -36, -57, -66, 82, 179, -143, -133, 89, 146, -331, 111, 183, -193, -122, -96, -20, 244, 162, 204, 65, 33, -268, 44, -28, -313, 211, -342, -44, -95, 402, -111, -480, -111, 241, -58, -76, -84, -164, -278, 124, 173, -142, 251, -93, 151, -62, 244, -240, -119, 5, 91, 217, -19, 38, -121, 130, -17, -32, 317, 39, -70]
6181g0J9j17J24J21k70m2R4P0O2j52MJ45MQ9k77P7L4p0J25J63K20o46M4K16J55
6206A22j09l65N27j91nj36L04L8m88M36r3kR5j53J17l37o5K26k5L7j07L26j65
6229a3m3L61k21l85N12l5l37L81k35j15K10j75j1K69r5L3j89J34K10j65r8k01
6251b08L58n52M36j2J82j14O2j45N4j58J44P0pj29K82l87pJ37M3k38M55k14K27
6274B79m15j07J73K65l58K0J84k78O35K4k62K29l00j40J3J36Q8k06l55L81K9k71
6296b36J36mK93qn9j64r6J22KM9l1J60j89J35J46l87Q6k01K15p8J73q1Rk99K99
6321hL69l39k53J03r9J76o2K87j5l54J48J88m6l80L25k21K55K79j96k69Q8M2J34
6344A52j90J3p3K70Kj26p4k50M35K7m57L54o9J3j29r4k6J41L25k13j56k57M24
$$ y = [-70, -51, -168, -44, 77, -193, -235, -141, -71, -9, -161, -157, -12, -8, 81, -196, -119, -85, -155, -30, 133, 353, -293, -249, -33, 122, 13, -352, 175, -16, -21, -157, 147, 185, -303, 133, 40, 38, 133, -20, 97, -240, -305, -79, -104, -67, -174, 152, -13, -56, 305, 84, -301, 211, 176, -161, 220, -15, -130, 80, -95, -106, 163, 68, 101, -88, 46, 256, 91, -7, -208, 150, -402, 34, 22, 204, 90, 152, 7, 61, -97, 47, 117, 110, -19, 263, -124, -131, 6, 49, -189, 266, 52, 279, -136, -243, -70, 195, -163, -143, 41, -237, 398, 422, 160, 389, 89, -51, -38, 98, 186, -20, -375, 6, 35, -236, -100, -104, 189, 181, 122, -42, -138, -16, -14, 35, 4, 164, -25, 110, 256, -131, -45, -246, -31, -109, 64, -17, -8, -307, -8, 361, 22, -231, -128, -227, -51, -113, 174, 159, -195, -47, 141, 95, -285, 40, -181, 74, 353, 157, -112, -24, 18, 152, -38, -25, -98, 172, 174, 48, -26, -276, 159, 186, -271, 83, 14, 27, -102, -196, -222, -81, 244, 31, -125, -382, 42]
6367D2l10J3K86J57k77r4K57M4rq1k29K90J41l89K75l70J21L09j48J6P7m5Nml25
6392b48J17L19m48J25J86J5K4j64j07k51O40j99N5j77J93k07J47j23R3k21Q7m3
6414a87P4J49j69R8j81N22l97J15p1k60M32j18k5J37j0k35p6J23K19N57o81q1
6436f5q6R7ON5oK21j06M5K33k42k99N8J82k00J29k09J98j57K84p9j97K65l04J08
6460f9j61L71j80O9Qpl76K88M0j27L25m84K92K0j26p3O1L57Q7k82k23K92k12L75
6484B65l66L15k56K91r5l11N14p86J10M92j46L47k06k11J07j43Q8n5R8k35M88
6505C05l02L5P2k35L09k34K73k36l48M08k15L6K03p8j2K04rl05J31J01k56L54
6527B01j73j21j67K57j22M50k41m7k18j26M70q8J19k14J8k28J74L23k85q3k10
$$ y = [42, -268, -255, 31, 188, -89, -183, 74, 118, 109, 28, -201, 89, 230, -159, 116, -254, -133, 176, 28, 44, 121, 76, 81, 77, -248, -131, 188, -260, -135, 51, 66, 90, -74, -181, -432, 208, 9, 64, -113, 80, -127, 20, -103, -10, -231, -144, -187, -113, 36, -133, -35, -216, 306, -91, 24, -47, -307, 125, 7, -18, 119, 109, -126, -202, -79, 140, 697, 16, -65, -151, -54, -48, 7, 1, 222, 116, 161, 394, 152, -147, -89, 93, -107, 22, -187, 11, -146, 138, 59, -138, 127, -177, -69, -230, 141, -39, 30, 38, 31, -345, -57, -17, -144, 181, -303, -11, 9, -117, -190, -129, 228, 315, 33, -190, 102, -110, 265, -101, 214, -42, 249, 154, -157, 357, -429, -319, 173, 27, 374, 168, -43, 64, -79, 9, -46, 52, -183, 305, 3, 38, 110, -125, 184, -50, 223, -13, -361, 47, -168, -132, 71, -7, -19, 185, 176, -129, 2, 103, -153, 201, 28, -93, -260, -3, -125, 325, 84, 37, -181, -307, 163, 75, 194, -20, -2, -230, -56, 267, -18, -101, -311]
6548c11K28j13M02k70Q1j98J32k26L35N2J02p7l03K0K28J18l26L79m07K11j07
6569e0Q1K90l62P9l23K93m2P6l29K84k46N21m90J07L35k74%j33p0L89k18l07r3
6592d82K08J73J11J80l33q1K11r4M00m52J86m7L7k41pJ16n5R5J26j33o6J1J12
6615b5l61N34P6j89J91k18j08Q1J31j35R6o2q5n1J1o8L40k04Q3r1j31N4L06j8
6639A57l94K17l42J25O23j62r2m9nj79K34k84J48No4q6K8L02m1k9j73J52J61j47
6663A05j87J69k36j3K80j38j28%k7k28N72p4j07M03o38L59J4j52j51Q6MR0K1r3
6687f9J96Km69K72M89m55l50P9l7K82J15m3J64m6j67J93r6k09J8R9K49J79l35
6710F1k32Q9R7P5J52k56j25R2J4J48j80J12k9l4P1j49l9J70L0J16l55L79L2l38
$$ y = [-311, -83, -196, 206, -64, 17, -181, -49, -275, 60, 112, 214, 137, -166, -146, 82, 200, -126, 253, -154, 57, -50, 31, 321, -41, 38, -285, 8, -34, 42, -287, -3, -249, 272, -218, -111, 224, -50, -50, -183, -253, 136, -82, -389, -482, -274, -101, 10, 190, -143, -224, -13, -107, 293, -159, 27, -20, 17, -224, -231, -115, -170, -75, 51, -82, -148, -137, -25, -386, 148, 224, 35, 226, 8, -100, -19, 112, -23, 73, 11, -74, -125, -114, -182, 158, -46, 37, -54, -185, -131, 175, 157, -237, -20, -362, -237, 386, 224, 132, 83, 78, -101, 133, -151, -3, 2, -62, -148, -120, 182, 141, 112, -61, 91, 252, 105, -82, 87, -149, -162, 118, -20, -148, -148, -175, -403, 169, 95, -12, 391, -247, 112, 126, -26, -177, -91, -87, 3, 24, -69, 127, 129, -340, -68, 421, -34, -384, -305, -342, -60, 55, 12, 176, 130, -37, 156, 60, -149, -131, -32, 217, 396, 61, -171, -82, 15, 90, 242, -14, -139, -47, -33, 115, -65, 47, 18, -16, 55, -94, -133, 37, 67, 183, -172, 207, 239, -99]
6734i9J80k7j06J02m09L81j03K15J21k39k01M05j00k12M09m92L35m12K10N1p4
6755f5m0L41j40Jj3N4m71N23o7k82O9L95n72K00L12m52R5J00J3r9K37j76J31n2
6779D2r2K14j74k14K08J22q3M0J04m14J21O2O9K4j35K54O0k88q3j33J33K81J08
6802B26k46kkp8N5K50k97j09Q2J12k16l36N11k0J87l36K58k6p8M04l85n0J36r8
6826e8L33j36J58j05k77L15r8k47J43o2j24J69J90k80L07j53M6R5j98Nj63J24
6848a6J7k04K32j36J14l9j39J11J63J07j45j26p0j95j8L10M4R5K5l16O6J68k96
6871b48N37j93j53J28p7r1J84K51l38k32J37L90k10k03j63P6L33j92k39K25J21
6892D3o0j70k99K95J96K17j28k02R7nj44J13K29J2j55j27L85l95K27j5j57J40
$$ y = [-99, 81, 54, -52, 50, -359, 22, -81, 134, 255, 16, -185, 220, 120, -92, 317, -175, 160, -252, -42, 9, -65, -105, 236, 96, 97, 84, 138, -333, 190, 123, -159, -90, 305, -267, -67, 245, -207, -112, -12, 1, -98, 139, -37, 94, 42, -50, 164, -10, -224, -16, 106, 23, 63, 167, -247, -126, -64, 5, 29, -106, 148, 208, -80, -163, -296, -163, 118, 226, -20, -22, -24, -102, -47, 203, -94, -203, -121, -9, -225, -561, -50, -70, 117, -219, 39, 13, -65, 339, -46, -96, 40, -58, 275, 139, 297, 192, -85, 230, 132, -115, 28, -34, -158, 11, 201, -79, 228, 75, 121, 216, 18, 23, -140, -16, 1, -203, 29, -107, 7, -32, -171, -60, 103, 210, 65, -61, -131, -326, -344, -34, 10, 105, 130, -186, -120, 48, -248, 289, 96, -57, 71, -6, -97, 87, 338, 0, -232, -95, 295, 85, -118, -281, -205, 128, -64, -303, -78, 43, -17, -187, -486, -191, 5, 222, 94, -108, -11, -16, -160, -47, 182, 194, 39, -88, 297, -98, 129, 114, -43, 97]
6914I7R3l16L0j62K61o4o8k9J87L4q8m66M29J8J84m80M02m9l75M04k17L3R9P3
6938C0K34m46N33j48l47m7J61J54j40M0L9k53J92j46Q8j39R6p9K38nJ46m37j05
6961c41K05R0j16J34q7J43l26K38K03j68j93L94o4l94K38q7K30k6J06J31p7l00
6983f7J2K49k19N8K8J28l60j63P24k84K91k64k0j01j10K83k36K93j37J47r2l96
7005b36J79J00k78P1J82M29m17K24k97M2m33L00J06j44Q4J30M3k25L5O1m2o9J24
7028c1L4R0R3lk57K54l17J49l05L88Q0k16J39kK22j21K1k20j8K29l55J47j51K72
7052A22k44p6jN09m09P9j2j55Q2L66k88J24Pp5M9Q3k23KK79r7lj53K24m7K29k49
7078A23m01L0K25O1j76L63m77K1L35p3j9J05j37L00j0o30O81k99K08m75M16m2
$$ y = [97, 190, -126, -96, -258, 3, -61, -129, -158, 29, 63, -25, -491, -62, -44, 140, -340, 62, 13, -362, 42, -175, -142, -43, 30, 264, -182, 351, 203, -144, -191, -30, 124, -16, 24, 63, -190, 2, -144, -56, -195, -99, -178, 60, 55, 201, -236, -341, -136, -46, -162, -28, -115, 28, -298, -60, 143, -25, -218, 176, 112, -282, -44, -131, 99, 73, 179, 310, 233, -67, -55, 194, -25, 33, 61, 189, -171, -334, 390, 106, 397, 133, 113, 12, -98, 185, -51, 242, 105, 252, 160, -236, -57, 43, -235, -164, 18, 447, 30, 254, -43, -1, -434, -134, -28, -172, -88, 42, 85, -140, -105, -44, -86, -155, -31, 3, 93, 186, 183, -74, 180, -137, 12, -293, 95, 175, -41, 98, 96, 318, 197, 218, -2, -20, 209, -146, 1, -150, 122, -122, -198, -199, 310, -99, -20, -32, -187, -105, 261, -27, 97, 104, 29, 78, 161, -62, -60, 219, 122, 119, -34, 190, 143, 372, 123, -278, -248, -23, 38, -138, 225, -252, -231, 104, 31, 12, 117, -20, 280, 270, -360, 321, 22, 230, -245, 171, 129]
7100A29p7l5J83j98L42k28KJ75n26j3L27Lk55M90o3j54j12L40n79K72k09r9j59
7123d44J14K57N7P4q4l2K7J83N7k01k57K77P9q9M5j30J73l15L05l6l64K07O1P1
7147C5J23l51R5K49k80J54o6j39K6J74qo0mP6r0J18k48p7M9R7M9k56L23L8J6j18
7173g5N24k59j65J18m42M11O9K29l90K75k40N2M2j19j00K69k83Q0j6J07l2q4p7
7196a06m5j1K50k36K55O8l71J86j72M02l46N2K81k62r0N8l01N34k82L67k38nk90
7219c02K71K14m6l13K61J5l05R0J72O1j90J9J46j11J30j93O12m33j91J80j66M28
7241C49n97O4J34j12J14J91j81J41k11K23l50K56P4N1L69o69N3J79%j15j82M05
7263A86n0k83Q2K2K50j69K45l99L60m36N27l97O7P0k32K82m4k33MK58Rm47j01
$$ y = [129, 52, 17, 200, 2, 344, 116, 118, 293, -233, -246, 81, 84, -171, 319, 256, 102, -10, 330, -249, 23, -186, -285, -444, -330, -73, -16, 58, -26, -58, -31, 152, 209, 8, -249, 28, 107, 18, 63, -67, 106, -209, 96, 60, -304, -97, -36, 35, 158, -193, -98, 151, -129, 25, -41, -180, -154, 20, 12, -48, -52, 24, -66, 52, -196, -273, -224, -127, -78, -334, -11, 27, 43, -75, 449, 190, 25, 143, -299, 112, 181, 410, 20, 295, 55, 107, 149, 30, -70, 199, -84, -4, -20, 87, 55, -29, -106, -151, -162, 88, -148, 107, 175, -196, -10, -182, 220, -126, -74, 207, -55, -145, -87, -388, 146, -136, 231, -7, -12, -302, -31, 183, 137, -176, 85, 100, -205, -115, 57, 118, -72, -53, 93, -18, 112, -81, 531, 98, -93, 87, -79, 349, -248, -184, -50, -162, -48, 143, -38, 103, -108, 115, -235, 21, 95, 146, 515, -154, -101, 78, 78, -37, -219, 186, 136, -147, -65, -43, 207, 38, 283, -116, 244, -192, 335, -62, 5, 75, -157, 125, 81, -152, -148, 110, 119, -328, -429]
7286d29M76j60O6K69n98K19N82m57Q6m82O67k48R9j41k99M90m6j60P3K49k30O1
7308H7j76k49L83J72k40k58L24J8L7K0L0k38J01k3k19K59k04L91l82N5j77M62
7330A73m38K77m9m8J4L6Q1J36j32k77L15j48P3K05J07l44L62k79k3k37L43L3j91
7353a1p0%O4q6J58j86J18p8J72k50K06J44j52j97pL07kl8j70kM3N6o26N82J41
7378A16j49k04K40J80j96J85m56L96j47K55k73M3Q5J9k48J36l23N34l56J76N6
7399F9Q2k57K30j34q7nK48j39MP2k7j17lJ63j02J1L22m00K48k20j58J37j26L49
7423A60m7j58L0r9L9J33q2N1L4J0o0n9q9M8K07k84K60m21L05J09j97K33nl11q4
7448b77J18O03l16l67M22j54N4Q6m18J95J50j10q7K5J8j10r3K70O3k68M07l96
$$ y = [-429, 47, -113, -47, 222, -376, -157, 425, -32, 54, -428, 239, -9, 90, -51, -350, 140, 94, -66, 7, 256, 26, 87, -89, -338, 45, 217, -23, -281, 43, 61, 98, 118, 148, -90, 11, -12, -231, 28, -176, 215, -167, -112, -289, 173, -265, 12, -37, -85, -71, -35, 46, 182, 50, -227, 88, -60, 13, 218, 325, -19, 343, 64, 41, -196, 147, 180, -11, -81, -81, -17, -103, 55, -131, -13, -91, 81, -169, 37, 181, 29, -168, -175, 132, 130, 92, -78, -80, -37, 19, -607, -25, 116, -33, -237, 3, 183, -13, 172, -284, 112, -35, 220, -53, -10, 75, 94, -154, -18, -341, 193, -163, 13, 69, 151, -106, 124, -10, -97, -102, 146, 7, 11, 83, 56, -61, -64, 99, -3, 8, 330, -70, 178, -42, -200, -63, -189, 160, 113, -45, -15, -114, -75, 58, -24, 27, 61, 71, 11, -48, -137, -89, 118, -166, 94, -327, -22, 87, -110, 123, 118, -193, -277, -159, 444, 128, -239, 183, 29, 83, 169, -249, -54, 96, -14, -101, -76, -58, -168, -261, 9, 72, -196, 211, -185]
7470a85M79l32q3L7J15j07K82l99J71j5L47n31K09n4k51K02K89m08K05K4l9Mp9
7493a19N4p9m5M30j74l23M6M21n21J24l1P0m0M95l64r8M25m60Q9M09m15K60J20
7516B74k79m5N2l32P33k46J33j70M41m29j27J76j15K1j52j85J8K6M84l44M5J53
7538A32j67J07j55M4J21J10j33J40j59Q4j60L7J20j52l2O0K69j84P7pl00J09K2
7561a7K41m97L55q8J50j55M15l60K43l71m0K12Q1k66j41K03m2L6j62K24o7k2m
7584g2Q7P9Lj90J09j47L44m55L53j68R1P9l79o1M4J54L46j71l94L30N0P5J98k14
7608I1n0R8l4j64J16k10r9K68k79K28k41K84oJ66m46M24M2k09K05j20J8j40j26
7631a84J68j0N8N6l51K81L24k53j67l8j30N61j09j94N4l4j12L1J71j15j86J09
$$ y = [-185, 294, -38, -121, -84, 31, -76, 206, -193, -22, -37, 310, -221, -12, -66, -317, -115, 174, -234, -29, -5, -44, -40, -119, -65, -144, -189, 241, 67, -256, -210, 211, -310, -186, -217, -147, -187, 308, -56, -154, 271, -189, -100, 309, -106, 154, 274, -5, -50, 2, -330, 403, 157, 290, 120, 561, 132, 5, 181, 66, 87, -65, -250, -232, -206, 278, -66, -21, 132, -35, 72, -83, -39, 82, 192, 59, 199, 40, 124, -36, 1, 121, -31, -63, -3, 266, 82, 159, 152, -148, -39, -17, 224, -273, 82, -6, 144, -11, 404, 44, 287, -84, -124, 88, 169, -97, -238, -35, -77, -41, -203, 21, -46, -68, -72, 15, 94, 97, -93, 16, -131, 213, -242, 111, -57, 34, 113, -266, -327, -283, -129, 217, 46, -348, -18, 32, 107, 305, 91, 41, 139, 105, -59, 57, -153, -252, 16, -263, -35, -276, 8, 2, 168, -278, 146, 188, -21, 184, 64, 82, -58, -184, -16, -26, 32, 88, -263, 18, 342, 89, -78, -116, -246, 315, 206, 12, 66, 32, -80, -49, 122, 7, -179, -70]
7653g0M9j30j15L77j11k2Q8j02K21k25L8L2j46M1j53J72J64j58K9j13j0K4O3N3
7677dm53L76J06K52j5j14k93K31j93qO7l16L85K10k70R8M1l67J46N4p0M7L46j7
7701B39m78o6L86j30K2k91J00l4M16j84J60Pj90k38q3M08l18K01L2J82k53L83
7723B71j6K7k68k98K73K47j03m48Q49n76j0K21r3j05J84m77M26J3p8R9M7k15N8
7746B8J06M5k00k42M07j18p0J85m04L51l53K32n2Q9j9M0j3L1j1k48O4M86l45j46
7770a57J96j68O0K55o25O42j49j88J85k7J9J18j76j5K9q1LJ22k13R5P4J14l98
7793b85L12K78j32j15k25K24K9j33M4l24J55R0m5J23J0P2l36N19l75l08L36k8
7815a14L31m15K20j4k0j56L32J23k21Q4j10J83m05L08p4q9j1R6J00J13l86p8K40
$$ y = [-70, -21, -151, -266, 111, 0, -22, 66, -36, 185, -40, -2, 30, -116, -75, -228, -56, 108, -50, -21, -134, -144, -120, -57, -4, -457, -81, 25, 277, 262, 148, -145, 86, -107, -115, -48, -364, 21, 231, -39, 59, 100, -267, -121, -67, -137, -90, 256, 239, -239, -305, 81, -49, -27, -318, -218, -252, 164, -20, 140, 147, -43, -281, -364, 44, -274, -73, -41, 141, -112, 271, 255, 282, 14, -284, -11, 236, 133, -315, 534, -42, -52, 169, 76, -29, 155, -322, 104, 117, 39, 138, 185, -30, 28, 134, 179, -21, -263, 144, 26, -44, 141, -263, 88, -265, -33, -85, 4, -15, 25, 12, 43, 32, -216, -152, 334, -11, -157, 39, -129, -69, 186, -439, 203, 54, -134, 51, 24, 43, 161, -15, -30, -1, -82, -79, 43, -170, -75, -1, 113, -285, 27, 305, 173, 58, -167, 57, 86, -47, -3, -327, -172, -82, -127, -4, 6, 78, -258, 261, -114, -422, -86, -114, 217, -198, 22, 8, -12, -168, 164, 287, 66, 150, 40, 223, -182, 126, 52, -37, -48, 48, 148, 261, -125, -203, 37]
7838C7K6j80J21J66On6j78m5L15l73J03L12o28M55j95L22j43Qk12o1K70j77O22
7861E15n87j85L04k2J29Q2m43O4K23k9r0K4r1J29M2m4k26p3K85p1j08j14L33r2
7885d5j74rL35j52m4R1J35J50p38K43K09k71J08K33ml35J11J29j9p8K66k9J10
7908B22l08L45m49O6K44k61O1K47l76L82l40nq0M20l16k09N36j68J35p4j9N8r4
7931A7J28k3j18J33j6l42j37O06n8m76O52p16R8L88l99K00j47K04R5n6p1j79L26
7954A09k37J46M7l30m0L17J52k25j52L9K56n4j96j9K14k85L00l38J92q2K63j63
7976h6K30o4M3L8J05n15j24M25K74o93N85j14k36K79l91K59m4j21J63J72j04m00
7998c19M56p7L4J20n00L31k28L60k46K33m23K05K71l14P4j72R8J14K8j18M6R3
$$ y = [37, 63, -117, 4, 170, 176, 120, -58, -103, 212, -161, -58, 254, -374, 81, -114, 208, 65, 73, -139, -200, 70, -107, 515, -72, -257, 47, 25, 154, 236, -207, -143, 80, 51, -39, -15, -106, 23, 65, 21, -205, -278, 7, -64, -172, -286, 47, -45, -219, -228, 107, -45, -89, 2, 137, 287, -451, -208, 1, -270, -162, 71, 67, -268, -157, -28, -47, -125, 141, 112, 222, -86, 259, -190, -124, 120, -141, -80, 167, -209, 173, -167, -172, -252, 168, -148, -357, 179, 11, 146, 72, 53, 111, 17, 145, 122, 4, 137, 121, -221, -358, 248, 190, -286, 366, -350, -252, 136, -263, -63, -210, -6, 89, 33, -38, -217, 109, -128, 18, 65, -265, -305, 12, 164, -61, -213, -174, 82, 28, -168, -187, 27, -258, 42, -296, -104, -186, 77, -86, 144, 80, 123, 161, 266, -249, -373, 52, 326, -367, 218, 104, -132, 147, -244, 15, -29, -150, 13, 185, 81, -319, 137, 60, 94, 214, -286, 45, -183, 177, -69, 164, -259, -54, 217, -97, -23, -195, -97, 17, 45, -73, -27, 66]
8020F6k03R0j09J56Kj7J3K33N0m13K00r4j68K21q7m1j09o3M57k14r6K85n6J56
8044B59jP7k88j0j54L61j69q0j80M15j50j44l27N29l68kl0K40m8K13n5j75J72
8067H5o6l65M18M0n1J53J65n05R3O5j55J72k06O8J90o1O4K5kJ28k83P1k13M9J32
8092A1k16O5J44j9J63k30j23J81K06Nm05l9J65j52L40j07r4N7Q3k48K26n7J78
8115A34p7j41M7k9K53m31L0oj94M94j69K33l41j32N27j3n15N33n8l06l6J88j55
8138a64L6m2J82OR5p1J8L38m33P4l3j15o9n1j9K09k26J95R4j59L5K54o7J34n48
8163c27J09L25l74m6L38L85m31j62J24JJ0j87J84N0J39p4j63K03j23N6j73J56
8185B0M5Mr1P2M1p6
$$ y = [66, -137, -47, -156, 0, 2, -15, -2, 231, 281, -132, 68, -26, -194, 27, -60, -101, -210, -273, 184, -30, -126, 159, 103, 259, 258, 335, 47, 37, -117, 244, 75, -5, -185, 230, 80, -64, -391, 138, -230, -232, -262, -22, -70, 143, 88, -87, 85, 19, -346, 72, 112, 61, 214, 379, -126, -33, 32, -123, 49, -157, -89, 101, 40, 104, 129, 127, 255, -28, 43, -170, -121, 11, -205, -140, 4, -15, 148, -82, -205, -24, 182, 187, -218, -257, -92, -244, 96, -11, -105, -48, 35, -213, 13, -44, 134, 57, -84, -37, -66, 187, -244, -214, -220, -414, 80, -89, 144, -197, -329, 198, 185, -330, 203, 145, -161, -197, -9, -164, -128, -170, 12, 18, 113, 42, 60, 398, -35, 39, 6, -109, -178, -229, -248, -39, -265, -70, 24, -135, -100, 154, 87, 221, -327, -218, 107, -267, -313, 25, 410, -21, -183, -59, -58, -48, -235, -51, -1, 138, 64, -99, 104, -19, 37, -136, 20, 65, 69, -22, 50, 91, 15]
8191A5
$$ Imaginary data points
##PAGE= N=2
##DATA TABLE= (X++(I..I)), XYDATA
0@%%%%%%Qj6J6j6K4l2M0n0N8p2Q8j05J29j52J76k08K41k81L25l70M22m82N46o18
30c29O98p83Q80r84J098j225J362j515J685j869K068k289K535k807L108l446L829
47B016m261M752n324N997o795P766q981J0547j2656J5669k0358K8733m8302J77777
61A46580J18916k65662m6176P3381R0680m393J7936k2654n7989m7106L5981L0914
73G0408J4665J4262M754p2846o1921L9744Q5493n631n2625j0444P343m0230j9341
86b6369N3684N0226l0307m9660q650R747q92J2646J7821j2442l6386j7266R544
99b8304J7933J9380R475k6054m4929n463M3364K7996j9931k4154L086L289j4005
112c8317k598K1017J5889j2294k3171n237J6095J6324k661j4572o147O690L065
$$ y = [0, 0, 0, 0, 0, 0, 0, 8, -8, 8, -8, 16, -16, 24, -26, 32, -40, 48, -57, 72, -80, 96, -112, 129, -152, 173, -197, 225, -257, 289, -329, 369, -414, 466, -518, 580, -645, 717, -798, 887, -982, 1086, -1203, 1332, -1475, 1633, -1813, 2016, -2245, 2507, -2817, 3180, -3615, 4151, -4830, 5717, -6939, 8730, -11628, 17105, -31197, 146580, 265496, -166, -46342, 27039, 117719, 113326, 131262, 108608, 50619, 3513, 39494, 70408, 85073, 99335, 104089, 31243, -30678, 9066, 94559, 88928, 36303, 25859, 33202, -7028, -26369, 27315, 77541, 47234, -2426, -11076, -1329, -2221, 10425, 28246, 15804, -20582, -37848, -28304, -10371, 9009, 18484, -7570, -52499, -57962, -14598, 13398, -6533, -30687, -27601, -24312, -38317, -40915, -19898, -4009, -16303, -39474, -44711, -28616, -12292, -14953, -29525, -35672, -28982, -25917]
125b5917o225n65J4945J3890r914k3377l913K3662J8456q701j7429j624J2093
138a4619O782k681l971J809K112l293l067O492J1558R01j1236q821O258J3455
152A679L160p217l040K682j163k257O671Q573k709j0477m011M733O988N140j411
167G341n535l593L657K199j697J289P776L73j3986q022J0296J4190j827j0273
181B188k128L373m22R77N252J703l312k947k261k859M105R792O87j1968o793Q242
197C629Q047k766l802M177J077p594l244P202N982k839m370j598j423J096O132
212I706K205n349m021L130J064l153J345O115r74q734l535N941M820k529k717
227C314J249n35k908N69K942j99j567k128k181j879K842M566j453n702k592L663
$$ y = [-25917, -32142, -32707, -17762, -3872, -13786, -37163, -41076, -17414, 1042, -7659, -25088, -26712, -14619, -7837, -10518, -14489, -12680, -10568, -13861, -16928, -10436, 1122, 2023, -9213, -18034, -11776, 1679, 4839, -2378, -5418, -2736, -3899, -6156, 515, 9088, 6379, -4098, -8109, -3376, 3612, 8752, 7341, 1806, -1787, 1870, 4069, 2372, 3661, 11437, 11810, -2176, -10198, 98, 14288, 12461, 2188, 60, 3433, 3011, 3988, 9240, 10943, 7631, 4684, 2423, -436, 3669, 13461, 14148, 2180, -4613, 3629, 11676, 8910, 5108, 9285, 10362, 2768, -476, 6726, 12708, 9869, 5499, 3901, 2478, 3574, 9706, 11911, 6562, 2541, 5671, 6735, 3582, 4927, 11042, 10068, 1334, -2201, 3740, 8560, 6031, 3314, 4563, 4028, 1120, 1689, 4631, 4432, 2865, 737, -1444, -3323, -481, 4085, 2632, -3070, -5662, -1999]
243a999J980j474o09J827r25m636k532L468L363r23l298k618J68K110J848J074
259c176j799j925J75o46K45J803K598r92m835j924K717M183j47k451l44Q95l77
276f000m58K123K456m21j970j933O72K228K791l34k011j869Q22K206O17J08J959
293I86j07k675j838K779M491M2l249j986J168J679J500M18J26n26j006o46P38
310A894K164J823p15k906k051J932K970M05j616n64M34l38j304J434K460J52k699
327C475k674L14K408J848q09j722o73m67N79L49J618j6q65k471j829J610L047
344C722O66l283k732J212J530j12l23J084L84k345j760P68K302J135j290k725
360a767j003O62J565P48q85n45j22r52r78J055K963Q10l409k635O19K773P36j004
$$ y = [-1999, -19, -1493, -2102, -275, -1200, -5836, -8368, -4900, -1537, -2460, -5758, -8376, -8208, -6098, -4250, -3176, -4975, -6900, -6725, -7371, -7126, -5323, -2725, -3717, -8552, -10476, -7759, -3576, -3723, -6174, -6518, -5623, -6000, -6458, -4335, -1879, -2300, -4270, -6203, -5531, -3303, -512, -846, -2857, -4726, -3904, -1698, -1081, -973, 986, 879, -1796, -3634, -855, 3636, 3678, 429, -1557, -389, 1290, 2790, 3208, 3334, 2808, 1802, 1156, 1894, 4058, 5881, 5166, 2260, 209, 2141, 5111, 5516, 3900, 3336, 3770, 3432, 2128, 3562, 6022, 6174, 3475, 801, 1115, 3523, 5371, 4562, 2840, 2167, 1700, 2279, 2628, 4246, 4230, 3365, 894, -935, 675, 3722, 4388, 1105, -1627, -415, 1115, 1003, 680, 1764, 2148, -197, -1957, -1189, 1113, 2248, 958, -1767, -2770, -2108, -543, 205, -680, -1225, -1347, -2299, -3277, -2222, 741, 1551, -1858, -4493, -3874, -1101, -365, -1369]
378a369j106%q23m28J126J644Q71j351k071j009K089K393K69j668j542L63P38
395a874p6J83J400K35j771k160P61L549J443j845k254L08Q73J069P2J3O47r93
413d20r79k17J441K362j40k234j365N01K536K11p79k22M31q57j034O03K474J257
431C569k132j699l98K218J135l15p54n65l67k09j13N53K192J52k163j832J140
448D12K684K77j514j360M14L34m72l30J759O68j637k039M49K080Q04o64j328p76
466b39N01M67j58j02L45L48j284j496L70K762N29j826j996N01J795l7j376O16
484b80O30q13j459O9J436J039o81j450q00O64J487J23j269p0L90j76n69j88J803
503a14M48j515j690O76K003K67j551k13O08j74n4J64P35L32l85p20j089Q37J491
$$ y = [-1369, -2475, -2475, -3298, -3726, -2600, -956, -85, -1436, -3507, -4516, -2427, -34, 235, -1433, -2975, -2612, -1874, -1950, -1767, -367, -132, -1903, -4063, -3302, 247, 1690, -155, -2409, -2101, -1228, -159, -87, -74, 573, -420, -1399, -1616, -175, 2187, 2047, -187, -1552, -1051, 1485, 1696, 917, 695, 1126, 269, -765, -162, 2312, 3569, 1437, -262, -660, 1558, 2693, 2378, 1624, 1059, 692, 483, 370, 923, 3115, 3267, 1104, -728, 412, 3096, 3373, 1859, 499, 913, 1247, 775, 445, 2204, 2872, 1235, -804, -355, 1725, 2529, 1865, 537, -239, 262, 729, 571, 469, 814, 1162, -122, -1618, -1248, 1514, 2043, 217, -1779, -1278, 517, 480, -896, -280, 350, -463, -1922, -1853, -417, 622, -59, -1509, -2309, -1645, -158, -35, -1304, -1374, -984, -1160, -1729, -1917, -114, 334, -1181, -2871, -2195, -192, 75, -1476, -1689, -1081, -1255, -1309, -1145, -410, -78, -463, -1183, -2272, -1435, 56]
522E6N49j757o74P90J022o78k18P78Q72j175j156L19J975J52q26p49M1J110L52
541G83p74%O87j41m43m73O92J211q0j475p00J024J398k98r04K30N73J02j083L42
561F71J087L23n11j441j0J038L32j86q63L69N40j28m57P0Q80j68p15q72M84R77
581A420P7p83j125M79Q38l04l39K55M92j71q55l48J089O63q24r01j93P83j64k62
601a73j61L20L47n10m72R9P72L70r32r69O61N73J04j106K9P49n3q61j41O72K97
622c85l58n59l46L75R08Lj44p55K27P94m72k69L22L16n61n74L44J015R5q34m20
643a278M36L06K03L2q8n9P9k50MO86R5k3m45o30K19J083k12n04R7O14o03n85P29
666i4J260k07q95m02K77N74L27l9m20k96j35M59mj0M34O15j272o13P26J257K94
$$ y = [56, 605, -1152, -1826, -1036, -14, -692, -910, -132, 740, -435, -1591, -1272, 703, 855, 29, -720, -679, 431, 783, 9, 9, 696, 555, 112, -361, 331, 1542, 1462, -13, -713, 311, 1709, 1411, 507, 737, 1310, 1412, 329, 671, 1758, 2081, 1570, 129, 119, 1157, 1489, 1303, 440, 809, 1349, 1221, 764, 834, 1714, 1546, 831, -41, 443, 1420, 1497, 714, -411, 68, 906, 602, 263, 518, 1010, 839, -16, -364, 725, 1388, 564, -337, -530, 253, 89, -173, -334, -14, 333, -177, -649, -550, 222, 592, -340, -1309, -648, -75, 29, -1077, -1048, -299, -352, -1213, -1354, -682, -385, -743, -1302, -1648, -1273, -365, -362, -506, -1261, -1034, -240, -712, -981, -659, -343, -904, -1478, -1134, -119, -24, -858, -1278, -842, -536, -333, -301, -389, -448, -369, -619, -615, 71, 166, 143, -302, -932, -713, 370, 158, -346, -249, 365, -238, -823, -94, 1166, 959, 64, -338, -61, 513, 840, 801, 381, 85, -50, 409, 405, 395, 829, 1444, 172, -441, 285, 1542, 1836]
687A836j515K48J95k20k46K23L15K41o71q0j60M16N57j58l45m87J72N99l4l53
707E33JK82l56p78K99J032l04k76o53J28L83k28J17nr9r7O7k17j92O02r1o10n34
730i96P38L18l31o54K58O25O0r44M83lk21m4p2K50l40M44j27m96N9K82J38l94
752i67M0L46J66k33k61M48N66l65k69j06LM7O2L34m7l67L89q20K03O28N37m17
774h3n15Q1M54Ok42L90j21O4n27K22O40k98O92l65k62l70M10Q04p46r2K15K31
796E88k30l45J80P59j90q41j85Q10K2N1K35n31J86K55r8j50k3K31J19n79m74O23
818D13O03j95m33K34J37p83P4L85M19m21l61m6J91L19lj62k28j78N68k30l35k34
840b66N8O84q12j63N22O7j8n07J26j07J30j91J45N2J51j17l76K85J87n2m23k0
$$ y = [1836, 321, 569, 764, 544, 298, 521, 836, 1077, 406, 326, 166, 582, 1139, 981, 636, 149, 321, 920, 886, 533, 534, 816, 460, -318, -19, 1013, 709, 433, -220, -92, 291, 63, 180, 175, 76, -21, 46, -171, -363, 239, 148, -462, -996, -258, 60, -271, -925, -667, -42, 18, -926, -443, -446, -667, -711, -783, -533, -873, -429, -556, -1052, -993, -711, -573, -967, -927, -581, -415, -648, -909, -461, 105, -260, -529, -635, -632, -585, -523, -189, -236, -603, -214, -1034, -831, -203, 334, -83, -598, -517, -63, -57, -299, 91, -30, 34, -493, -271, 369, 71, 763, 398, 136, -234, 176, 980, 234, 142, 357, 588, 358, 13, 193, 952, 762, -79, -264, 546, 568, 619, 854, 323, 509, 764, 666, 516, 493, 724, 843, 264, -210, 413, 1016, 821, 388, 622, 759, -24, 50, 435, 854, 433, 72, 26, 217, 536, 533, 371, 143, -35, 533, 303, -32, -266, -208, 476, -336, -499, 23, 90, 72, -435, -309, -416, -286, -477, -332, -280, -129, -246, -622, -337, -150, -202, -625, -645]
862f45p8Q0K98l17j24K98O6O1l09J50L02l56k61L13L5k17K80J62k8m31J24J83
884d14p2k55M49n3m48J72M68J51j06n76M16J41l34J67M26l07K37k72J24k38O22
905B98k60j33k36L25K80j30k44K11O6K21m54N2K70Q8K91n01L1J32K60l15K94l78
927A68L28l7M7j29K61L2K99n86j20NN69l97k67Q8K01j5J79k29M02k16l46J71k18
950A90L05k87L71m48J42J08R1J0k52jr4J06l18L15J43Q9m49n0L32K25n18j01N9
973c2O4l2l51L00J55l13j05j3k05O04j26j88K37k42m8p8L5j99q0K99k33p9J67
996d63J23J66l94M08l24K28k01ML44k70N2l88K38P5J58j04L22j88j96L33k33L6
1018b74J99K7l30K2K74L82o48K42k96J76J21K41k2k29L17m4Q9l47M5J93L99m90
$$ y = [-645, -723, -643, -345, -662, -786, -488, -422, -361, -670, -520, -218, -574, -835, -522, -487, -704, -424, -262, -290, -721, -597, -414, -486, -741, -292, -345, -793, -621, -153, -2, -108, -684, -268, -127, -461, -294, 132, -175, 62, -210, -86, -324, 298, 38, -95, -331, -6, 274, 144, -100, 111, 177, 398, -56, -4, 266, 354, 645, 144, 175, 307, 567, 252, 546, 168, 496, 459, 506, 377, 638, 670, 969, 383, 263, 268, 837, 440, 173, 261, 462, 447, 626, 397, 799, 583, 237, 408, 190, 495, 208, 579, 131, 273, 381, 472, 482, 230, 229, 135, 241, -77, 238, 381, 470, 21, -29, 303, 528, 10, -91, -32, 32, 0, -351, -51, 104, -209, -314, -327, -532, 72, -54, -242, -5, -247, -295, -373, -338, -537, -617, -318, -551, -630, -463, -340, -174, -568, -160, -484, -256, -457, -453, -109, -379, -327, -715, -477, -402, -244, -348, -26, -214, -410, -77, -310, -274, -75, -48, -378, -356, -82, 300, -348, -106, -402, -226, -105, 136, 114, -115, 202, 158, 247, -100, -55, 138, 537, 47]
1040D7J18k49K90L06l57r2K68n7j65Q6R4J34l8Ql19K75J2L7L07l71J37k05J59
1063D25J89l93K64j75o2o8M02l40K27p7k65J69o1K82l32K03j97j28K45P1j71K08
1085D16j39J1k92K61l41L70q4j37O9j10k3Jj25O4k08J3N78j65m93J38n3J85p5
1108a39j26L85l06k9j14j53o6M21m18K60K15m21N02j28n17N68l66J38j29J36j0
1129b97k6O1j87Q7m05M58m2l7R2j9K2oO09o91N6J81j73K04p1K3J24k7J27r1k25
1154b53O8m4r8O19m16M22k12j06NKJ78J37Q3l05K48r0J97Kn13N07K8k25k7k99
1178i2K95L94j45o04N34j38k1k57J15K30j26K11j48P4K91m65J8J57m9m3j3J22
1200C40K2K04k10n8p4l67L09j80K56p2k49J71M3j09j84L36N2n36L82j23j3n7p9
$$ y = [47, 165, -84, 206, 512, 155, 63, 331, 274, 109, 195, 289, 423, 385, 393, 74, 349, 361, 398, 705, 334, 471, 266, 425, 614, 221, 485, 310, 248, 180, 582, 242, 469, 392, 127, 296, 235, 517, 185, 388, 191, 63, 308, 379, 208, 416, 277, 288, -4, 257, -84, 286, 202, 65, 134, 24, 1, 2, -123, -59, -267, -254, 324, 159, -334, -196, -249, -64, -139, -265, 120, -186, -215, -329, -482, -548, -127, -545, -285, -70, -491, 11, -117, -634, -66, -432, -294, -423, -287, -297, -323, -262, -449, -362, -767, -309, -351, -388, -296, -315, -293, -299, 310, -381, -325, -144, -317, -113, -184, -161, -37, -64, 63, -28, -253, -185, -229, -327, 292, -124, 298, 86, -20, -15, -13, 165, 302, 385, 80, 328, 238, 435, 437, -76, 431, 459, 234, 207, -92, 203, 597, 452, -152, 382, 244, 223, -34, 81, 311, 185, 396, 248, 322, 613, 148, 166, 323, 274, 231, 218, 340, 362, 566, 356, 298, 224, -143, 166, -14, 242, 170, -79, 92, 135, 26, -158, 178, 230, -306, 76, -47, -60, -117, -196]
1223a96J30j81K57m8r3j08J24j76r3L06J92m93j55M28k01j78K27j21L87j16l26
1244d34N7K46m19L15j33K18j04j55K02j00R0K51k03j28M4R4Q1l10n2J73ok2J19
1267a76J7J03l87P1L47o9k16J87J41K45n84j20N58k00K14q1n1Rl81K45J75j3O6
1290A00J80m23K60j9M06l39l4j21J86L18l08K5M83j69l05L7L5J80j72j80K22l21
1312D1K59J11J36n21O0K9Q3P7j83L51m50K81j00jK27l28J26j36L37j22j94K28
1334C11k00q7l27K3K99J59j46k04L30j14l55J41O8l1N6Oj00J57L34k54l19J3Q6
1357a54r9N9j5j56K22q0P7m08K62J31l3K12l45N3L10j93k17K04mLj23PL7K5j53
1382c78P5l2n2N52m48J68l7M0O1l22J50M0J64L3jo9K8J06l74j00J57M18l14K06
$$ y = [-196, -66, -247, 10, -38, -131, -239, -115, -291, -384, -78, 114, -379, -534, -106, -307, -485, -258, -379, 8, -108, -434, -377, -131, -550, -235, -368, -150, -254, -409, -207, -307, -217, 34, -169, -297, -253, -159, -78, -388, -440, -267, -273, -295, -176, -159, -56, -443, -372, -25, -94, -310, -123, 18, 263, -321, -441, 117, -83, 131, 50, -1, 8, -373, -128, 47, 34, 100, 280, -143, 117, 98, 504, 165, 131, 10, 196, 514, 206, 231, 714, 545, 240, 277, 312, 492, 320, 140, 362, 41, 300, 411, 547, 26, 86, 115, 198, 275, 92, 443, -7, 274, 174, 173, 400, 72, 198, 62, 399, 277, 83, 311, 111, 24, -303, -280, 19, 178, 32, -172, 158, 44, -311, -170, -102, -133, -77, -71, -171, -14, 320, 66, -253, -240, -154, -253, -194, -209, -365, -143, -223, -146, -554, -292, -161, -194, 18, -327, -274, 36, -157, -374, -170, -174, -171, -294, -287, -250, -225, -378, -303, -335, -387, 165, -283, -115, -152, -112, -51, -373, -223, -183, -19, 14, 13, -56, -28, 78, -296, -396, -239, 179, -135, 71]
1406G1n6J14j08L32p06P73l99n3j53K70L8m3O2M0l7J00J41j74k49K31Lm7N52p04
1430bL80p6L0k57Q9k1k94J93K39m5O3J91j16l41K64l4j13j67N5J19M9j66k0R4
1454A14M35m11k51K27J5J38k24j52J61j57j98L22j47J22O2j76J1K4j7k64j5O0
1476c21P1N02o33K59k4K76m83M92k29k4n3l82N02p6q4j03K44j12K98k08K75l15
1498a28k24N49j15p26L59J24K45n44M08M8k07J50J18n0k52O0kr7n2L87j05r4K43
1521I5j05r9j62J02q6L4o8o2M24j27j27L07K7k08k4L34k7q4q0L09j22l5k82K25
1545A59M7K3m8J8k46K88j30o0L42j86m1l04K23J0K36q6j67l7L92l37j43r3K58
1568A18P5j15j08L03J00Q5o14L60j92J51K04k75k7k88J50L8L51m4j52j41J72K3
$$ y = [71, 15, 129, 21, 353, -353, 420, 21, -32, -185, 85, 123, 80, 142, 182, 145, 245, 386, 212, -37, 194, 197, 150, 702, -2, 378, 302, 332, 75, 164, 143, -151, 42, 281, 236, 299, 490, 374, 33, 297, 263, 150, -17, 38, 157, 206, 40, 20, 114, 549, 138, -113, 114, 129, 267, 43, -109, 52, -105, -303, 19, -128, -6, 56, -120, -109, -85, -102, -366, -381, -321, -250, 252, -381, -122, -146, 130, -353, 139, -90, -114, -167, -549, -47, -123, -207, -310, -66, -178, 120, -88, 187, -128, -352, 197, 82, -644, -285, -161, 84, -460, -52, -4, -211, -61, 57, 7, -245, -185, -187, -284, -336, 51, -54, -148, 95, -10, -109, -271, -169, -255, -221, -289, -351, 73, -54, -181, 126, 153, -55, -79, 255, 228, 144, 64, 373, 251, 216, -66, 159, 206, 229, 181, 199, -47, 241, 111, 51, 393, 207, 166, -138, 85, 95, 331, 245, 78, 41, 433, 96, -47, -140, 118, 193, 78, -30, 273, 373, 458, -156, 204, 12, 163, 367, 92, 65, -223, -73, -35, 316, 272, 120, -21, 151, 174]
1590A74j74O2j71p8j17K38L41m62Jm7M7L36j08k79J32L69k96k05P7j99J78l5j0
1613b26j18J47k10N3M96J57j17m01r4P4J70K0O4j73kn5J76j81K82k28M88n97j02
1636c77K38J20k9o7NJ31p8N2k36K69r6n9J32m7J18K7r9j66J73j66N12m9R1l39
1660F0k14Q5J72J37Q3l90J89Q1m05J12K58n5k82L34l85M56J00k94J37l99O21j99
1682B02l3j10p8K45j47K44j71K6k0j35j09m0L76k59J5J52m1k8J53j02j19J16R3
1705B30j54k08J8J82Mk29M62l06k63J88o7j44K23J53k65J96J06o9M3m29J89l6
1727a76J00M27j93j62L3k61M5K27n69O90l48k66N46j37k51k0L30j52k24M21l53
1748b93M80k72P0q7j26J42K21k2l09R5L52l56p4L8N7K46l21M03l58J43r7M1Pj36
$$ y = [174, 0, 62, -109, -187, -304, -66, 275, -187, -186, -233, -186, 150, 42, -237, -105, 264, -32, -237, -160, -359, -181, -216, -226, -344, -197, -407, -354, 142, 299, 182, -219, -313, -239, -69, -49, 15, -158, -160, -215, -39, -220, 62, -166, 322, -275, -377, -139, -19, -48, -115, -110, 21, -57, -5, -241, 28, -68, -127, 5, -42, 76, 103, 4, -162, 11, -155, 357, 308, 399, 60, -154, -69, 103, 240, 323, -67, 122, 203, -202, -90, 168, 113, -169, 165, -220, 236, 336, 42, 179, -220, 401, 202, 169, 59, -19, 226, 79, 323, 152, 178, 158, 23, -86, -126, 250, -9, 6, 158, 117, 89, 242, 140, 21, 137, 230, 76, -132, -114, 68, 72, -157, 305, -1, -264, -76, -143, -287, -64, 89, -176, 20, 126, 57, 100, -329, -140, -176, -76, 351, 158, -4, 29, -232, -187, 40, -529, 161, -187, -453, 93, -44, -295, -315, 15, -137, -361, 60, -293, 187, -85, -15, -102, -228, -86, 135, 113, -196, -101, 251, -105, -179, -141, -84, 162, -159, 244, -114, 29, -68, -27, -20, -156]
1772a56N13k83J65m97L37M06o69M15k32m80M66k96N76J80n20K21k27K18k36K99
1792B00o5k63P68o81p9K85l39L42J16Lj64j96J74j24j36K24J67l09M36l32j52
1813a25L53j45k0k05K62P3o9j66J92l0J49l4q0j22j81N14l83Q8l77M82r0pm7j9
1837A3j61p0J53l4J70k57J39j85M66j93j39n7M30M8m95J86j37J68l34N59m78R8
1859a10J08p9k17L51Jk04k7J43J27k42k74L45J39l92N94k24k65j18K56K9l68L81
1881d6k44L09l02L15m59N73l07Q1J7j85J90R6pk72J99k07M05L1l47j14L50k55
1903a79J92P3J03j74k58J89J75J18j46j74J58j47K85l38M56j91r3J36m2k46K01
1924I8J42j43r8J27jj21j7j45J71l0K59j47L3L5Q6r9l42J22R8R3j96J33j7k84
$$ y = [-156, 357, 74, 239, -258, 79, 485, -184, 231, -1, -481, -15, -311, 265, 445, -75, 146, -81, 137, -99, 200, 135, -128, 640, -41, -120, 165, -174, 168, 284, 287, 123, -73, 101, -23, -159, 65, 232, -77, 359, 27, -125, 228, 83, 63, -142, 120, 193, 124, -42, 150, 120, 269, 235, 155, 33, -148, 366, -17, 71, -306, 176, 86, 79, 32, 13, -148, -218, -65, -99, 71, -186, -47, -232, 234, 41, -98, -155, 275, 323, -172, 14, -123, 45, -289, 270, -208, -110, -2, -81, -298, 53, 54, -150, -177, -34, 93, -149, -423, -78, 61, -331, 263, 39, -226, -344, -88, -59, -427, -46, -290, 19, -283, 32, -427, 146, -161, -80, -63, -248, -58, 38, 31, -241, -42, -249, 156, 187, -160, -274, 76, -179, 13, 86, 189, 15, -243, -54, 121, 239, 93, -81, 77, -70, 215, -123, 333, 142, 49, 185, 143, -103, 98, 240, 97, -1, 126, 125, 4, -13, -158, 13, -17, 242, 95, 128, 163, 249, 150, -192, -70, 28, 121, -75, 58, 41, -243]
1948b43N6k1R1j12J93N45l75k75K72J23o22L83j01P8J10j12k14M76J7m37J54M3
1970B9j7K07K8l95K45k54M14j12k4l47J19L28m22j55P1J38jJ19k20O5O4J38K76
1993B94k77O1k32l8J37k25O1L05m70J32J47L71l29j29K79oj28N2K16j25l21K21
2015dk39L25k96R8k29J86M85k69k56M38J5k73J48M7N6l25q7K64j8j97K59k37P5
2038c4M32l63k2J5j22J74l29K69K4J65k26L9j97M13m8n4l11K04L19k75MN6k33
2061a00O48o04O8KJ64R6m09L77m37L70k27K06k54O3j51L4J56p7K93l06J32l4j10
2084a00J00K4j4j1j53K12j42r0L75j73K20K8m44J39m5l99N00m0j50O7J94k86L54
2107A66k76J68j12Mk43M11j43K67m81j52L88k46n8J63J72K31k12QL1m12M61P9
$$ y = [-243, -187, -208, -117, -229, -36, 509, 134, -141, 131, 254, -368, 15, -86, -8, 102, -10, -224, 252, 269, -168, -14, 29, 12, 219, 247, -148, 97, -157, 257, 145, 121, -226, -107, 221, -201, -356, -285, -147, -148, -29, -249, -184, -120, 18, 294, 17, 78, -154, -192, -55, -280, -219, 86, -384, -252, -105, 266, -63, -192, 87, 81, -47, 5, 221, 96, -225, -4, -243, 82, -214, -116, -345, -159, 326, 57, -199, 239, 254, -19, 129, 176, 232, -93, -180, 84, 66, -131, 128, -109, -34, 398, 35, 13, 28, -94, 80, -249, 20, 44, 209, -17, 22, -175, 238, 190, 136, -175, 29, 348, 73, 77, 133, -100, 548, -56, 12, 14, 178, 274, -135, 242, -195, 175, -52, 154, -100, -37, -188, -154, 2, -75, 218, -88, 44, 10, -100, 0, 24, 10, -1, -154, 58, -84, -174, 201, 28, 248, 276, -168, -29, -74, -473, 27, -13, -163, -96, 98, -188, 166, -110, 58, -54, -50, -293, 118, -25, 242, -239, -391, -3, -249, -307, -144, 28, 259, 47, 55, 86, -326, 135, 214]
2129B14J39j32j14o00N32k1l7J04l70K18K35L2J24l72J2L21l04l9L83j32o7J19
2151B45m39P9J06K57Rk05K23l68L6K57m05L26m2k27L43k83K45q6J97j99j43N4
2173b0j71M69j88j32j16L21J42k47p0K32l49J98J19m64J47L64r0L9r1k3M1l16
2195b05M83k78K48K6k60L7K04k17J33j11m5K66k68j25l26J27M65P8m52n2J50P7
2217d5l77N27j93K05m95M42L0l23K62j43j12J73k18P5K95k50J11r5N5k29M60l02
2239a47Q5n5M20m90L54l27L43k68N6K6L9j28j7L7l7J41L68l42P2j91j10J2K91
2262A32mj71M1l4K13j09L8k53L70l1l12K95J00l08j31L02j65j70M45n55K28J1
2284f8K38n6N1l3k93M8L21k11J36n2n6P8P9m9k80Q4K79N8Q2l40J52J22m67M22
$$ y = [214, 353, 221, 107, -493, 39, 18, -19, 85, -285, -67, 168, 200, 324, -48, -36, 285, -19, -58, 325, 193, 126, 245, -194, -115, -9, 248, 257, 52, 275, -93, -57, 200, -205, 121, 79, -148, 195, -88, 157, 71, 268, 69, -74, -20, -191, 278, 90, -42, -158, 163, 305, 58, -12, 220, -129, 69, 188, -276, -129, 235, 145, 184, 93, 70, 111, -205, 278, 0, 248, 274, 14, 51, 255, 38, 171, 60, 15, 281, 13, -112, -438, -311, 154, 232, -220, -272, -122, -45, -422, 105, -88, 117, -378, 64, 94, -229, 33, -110, -222, -49, -267, -192, 103, -147, -36, -131, -76, -305, 155, -147, -62, -117, 303, -187, 167, -160, 183, -85, -29, -3, 36, -92, -109, -72, -109, 32, 400, 58, 130, -61, -171, -159, 132, 128, -43, -2, -36, 177, 68, 106, -147, 223, 192, -120, 175, 275, -33, -164, 138, -27, -197, 248, -307, -79, -68, 170, 114, 165, 132, -161, -113, 208, -3, 133, 81, 25, 103, 182, 133, -147, -63, 216, 274, 356, 16, 168, 290, -177, 245]
2308B45q7N0l58j31O04m66PK77l8j52J13q8M1p0R7p9L52P1l66J14R3l35j05L61
2332A50k13n5O9l05N39k26j97L49k59m4K09k90K42j73k0K07l38M23l17K85j15
2353g9p2j99M76m24Q7q7L25l8m67N33j87J13l9M7j99K55o5j30kJ58q3o5O4j21
2377a99n5O5K57k63J15J00j35J64j39K54Qk24l06M24m8r9K60j7l33L4J65l63M88
2400A53J69n5J10k29j30J45J19R3j79j39j19Q5J77n1k72K74j08J48l65N57o3m16
2422i6K74L0j44M53j90r9J91o3j78m5q5J18l7k22K60j45O3K60n43P2OJ8K46M4
2446A88Q3R2m11K55j24k35j07J65M0l16L14M2j6j90K98p5J08k96J5k77K26L72
2468A51k21J68j32J03k02K88M7l26J37K1k30J49j21J57N0j76M3n9J05J41j9k80
$$ y = [245, 158, 208, -150, -281, 323, -143, -136, 141, 103, -49, 64, -24, 17, -53, 44, -35, 317, 388, 22, 136, 229, -106, -211, 150, -63, -118, -49, -354, 185, -41, -238, 111, -148, -192, 17, -273, -31, -204, -224, -17, -355, 68, -249, 36, -79, -151, -350, 126, -298, -211, -298, 27, -11, -478, 55, -132, -19, -58, -11, -210, 45, -20, -150, -152, 6, -77, -142, -78, -199, -254, -189, 68, -195, -80, 20, -115, 49, -90, 164, 172, -52, -358, 66, 18, -81, 179, 162, -171, -137, 28, -335, 153, 322, 267, 377, 148, 18, 163, 282, 375, 196, 57, -62, 23, 200, 149, -123, 151, 43, 191, -174, 383, 320, -96, 178, 208, 64, 517, 327, 228, 419, 356, 178, 133, 48, 166, 129, -93, 167, 22, 85, 345, -198, -126, -120, -102, 144, 188, 271, 363, -48, 207, 83, -152, -259, -94, -54, -370, -56, -14, -30, -220, 78, 3, 111, -185, -170, -447, -221, 151, -70, 98, -34, 69, -133, 155, 202, -124, 13, 34, -196, -47, -168, -11, 39, -137, -94, -153, -48, 93, 74, -206]
2490b06Q1R3k2O8j72O6q5N33n43r5M18l06J95k53J34K39q95P37M74o98J34K5q1
2513a59J88J36J25l75J63K08o14L78l6j50J83k57K4J50L59n98L32Q4J43k12j69
2534i7J93j09M90o08K82k83R0R5J03n1o8k0N0l6n1kK37J76m69L23n2k43K03QJ46
2559C07p0l51J80o0m89M08K4K85j79Lk52L51l93M06P4k7o3j3J05m15N9K78l44
2582a76Q3M5m9j70M47j83j06J18j74K24j66L2J32J16o2m54K62L05l51R9n1P6R8
2605I5k04l92M31K3N4j14j19J85J1o9On4j57J95L86k43p9l5q6M02l71O5K30l49
2629a89j62O08j80lj41j6j82M03j53o3K6K13j79Rj47K78O0j20J03j19K85j02j86
2652D3j63K82L6k07J17jk9L0k35K00oj2K5P7K69m13M4l5k77R5J59K99l09%o9p3
$$ y = [-206, -125, -32, -54, 14, -158, -92, -177, 356, -187, -282, 136, -170, 25, -228, -94, 145, -750, -13, 461, -237, -103, -78, -159, 29, 165, 290, -85, 78, 286, -328, 50, 14, -136, 47, -210, -186, -36, 323, -275, 57, 141, 284, 72, -97, 96, -13, 477, -131, 151, -132, -42, 53, 156, 105, 37, 17, 67, 31, -20, -22, 215, 391, -78, 245, 193, -50, 153, 161, 307, 237, -114, 66, 6, -483, -75, -51, 234, 55, 58, -194, 157, -236, 170, 244, 217, 154, 141, 246, -169, -110, 168, -176, -93, -48, -97, -267, 180, -3, -109, 9, -165, 59, -107, -75, 57, 173, 111, -343, -81, 224, -127, -28, -79, -3, 95, -109, -501, -70, -47, 7, -107, -226, -41, -30, -99, -93, -147, -304, -109, 277, 34, -45, -80, -166, 236, -135, -70, 160, -189, -351, 257, 77, 74, -67, -83, -265, 138, -15, -78, -52, 161, -18, -9, -156, 122, 182, 62, 165, 46, 331, 229, 43, -120, 162, 198, -9, 108, 107, 78, 108, -127, 73, 67, 55, 80, 157, 426, 13, 57, 22, -255, -160, -1, 298, -11, -11, -80, -153]
2678a53r4l2K19j61L81j93L7kl5k09J41j87M72k63J72J35l56J42l2l7K62n58M75
2701A24P6j15j41j53J45J72O5j46k66N90l20k33J60pK7j00k09JM32j74L69q0k43
2724b6k6L6M5j38J74j99j7N8J19j18%P9l8R3m2k01J83J80l05o2M1L20k26m3J64
2749E1K81l82J36o2P0k40L15j12p8j83K03J29J93j66k29K24J60k48k67J58Q1K24
2771B58l09j9n0o8j58K43N10n80m9J57j11J63p6j3q2J21j74R8O4J94J07k05p1
2794e0J86k41J78n2j70k49L15K92l33J16k29L77J3j25R1J24m07K13l21J12j02
2815b62M88j80m7k78J41K31N7J63k18o5L3J29k30L05j10J7l25K40J0k39R0k09
2837b59K85Q4j04m6J06l02K39J05J3K2j9k67n4K42j17J19o0J34k92P7R4J07L01
$$ y = [-153, -247, -279, -60, -221, 160, -33, 4, 2, -33, -242, -101, -288, 184, -79, 93, 228, -128, 14, -18, -55, 207, -351, 124, 200, 85, -56, -209, -64, 108, 173, 27, -239, 351, 31, -202, -42, -49, -22, -122, -331, -330, 102, -72, 297, 217, -26, -52, -16, 29, -109, 65, -134, -151, -93, 26, -92, -92, -13, -51, 42, 0, -201, -18, 162, -143, -205, -164, 156, -70, -113, 51, 332, -50, 86, 24, 94, -146, 169, 57, -21, -204, -1, 128, 321, 155, -74, 150, 310, 62, -205, -47, 34, 258, -51, -70, -120, -188, -346, -103, 407, -173, -222, -65, -176, -13, -89, -102, -184, -63, -237, -139, -75, 119, 226, 21, -50, 136, -105, 73, 21, -149, -398, -83, 209, -124, -8, -237, 140, 153, 28, 119, 243, -164, 49, -272, -160, -262, 226, 46, -1, -279, -138, 93, 150, 313, 95, 30, 63, 192, -38, 267, 157, 174, -151, 89, 99, -140, -50, -259, 26, 110, 6, -40, 66, -236, 3, 108, 121, 143, 124, -143, -197, 45, -72, 47, -13, 121, -171, -94, 0, 107, 408]
2860D08m68r5L18j15O5j83p0M02n46M43N4n06N60m90L96r8j50J47P2m32M62l04
2882a30k29J83P5L4n5J00R0j96k1q8j08L64k47K95j08L12m12J72J78l23J71J7
2904G4j51J89J9k99J41o9L49p3k27K79j40J09l02L8k58L1L57J79j13j26j22J48
2926C3j4j59J59j00K1J61K2J02m58M10l80L52j66k10K95N1J0j2j9k10J70q5r3
2949a20J21J8L19k78pj6j81J1q7M99o05M14l64J28K57j26k4o7m5J03J49J42k98
2972e7r5K33r0J84j4j12r7j21J99j82l7L10k69K11l09M02k16p6J44J22j05L80
2994D05l31M0q9j46K04k27k94K99K40k93O1K93k38R3k88L37J27j88J05l77L00
3015C3j11M29o74J40M85j47k8n18M35M2j33j8n2J19j36L92j21j44j15j1K58K2
$$ y = [408, -60, -155, 163, 48, 113, -70, -140, 262, -284, 159, 213, -293, 267, -223, 173, 75, -75, 72, 144, -288, 174, -130, -359, -176, -101, -67, -122, -22, 68, -128, -149, -237, -345, 19, -228, 67, -41, 271, -141, 31, 209, -114, 57, 74, -77, 112, 131, -168, -27, -96, 253, 180, -47, 232, 92, 201, -101, -63, -321, -290, 67, 246, 133, 7, -115, 33, 19, -140, 19, -81, -60, 101, 123, 225, -233, 177, -203, 149, -17, -227, 68, 119, 129, 117, 98, -112, 58, -27, -120, 1, 19, 338, 60, 53, 37, -144, -133, -220, 279, -326, 88, -276, -148, 109, -17, -41, -108, -153, -50, 99, 241, -57, -152, 81, -9, 175, 161, 49, -48, -169, 30, -152, -189, 121, -148, 63, -246, 156, -60, -136, 8, 130, 25, 405, 74, 114, 25, -121, 83, -144, -438, -139, 101, -192, -131, 162, -76, 17, -271, 66, 193, 5, 110, -267, 33, -78, 351, -323, -183, 302, 155, 127, -391, 44, 86, -47, -65, -117, 2, -134, 258, 137, -7, -122, -133, 125, 147]
3037A47l18K21j55J11P5m3k93O26k77j33qrJ84J27k87K46m5Lk85oJ3j11M87Q4
3061C54o02R4J90Qj83P6r8K58r7k11J86Om2K35k75Q2J11l28K27n4k70K63J38j05
3085c7j95K67o0j85K81J44K8n59L16j6j52K1K4J68m7O0lj48K7J92k68J88k68L94
3109A72j38k79K30p4N8j7J57j21l6K35k0k29l09N8L59k58M24lq7l0R7l26K10j58
3133h5J74Q9j99K86k92K01o38P30k23J50k43j75J92L3K1k48L70j10m24K78J40
3154B7n1N5l8j19n4k9L54M8j49Q6L4k37J77j89J54j14J50j69k38J79o7L53k07
3177d4n1K92o68N50L6r1Q4k61K37j06R7j04L5M31l15J89l19J04k92L58l5n0j13
3200c6j12J92L1j77K62p2j19Q8K34k25k68O1L08J5k8P1k78J35J21n61K02j43P5
$$ y = [147, -171, 50, -105, 6, 81, 38, -255, 371, 94, -39, -47, -56, 128, 255, -32, 214, 169, 172, -113, -119, -106, -217, 270, 354, -248, -154, 36, 44, -139, -63, -161, 97, 0, -211, -25, -19, -61, 174, -101, -19, 92, -236, -9, -63, -333, -70, 68, -37, -232, 35, -25, -210, 71, 215, 243, -316, 0, -16, -168, -147, -123, 45, -2, 58, 55, -93, -66, 126, -142, 46, -222, 172, 34, -245, -15, -89, -31, -48, 109, -12, -48, 187, 167, -62, -371, -313, 46, -212, 212, 209, 122, 92, 189, -137, 73, -85, 89, 178, -21, 265, -27, 174, -464, 266, 43, 193, -50, -225, -33, 0, 21, -227, 143, 33, -391, -113, 27, -24, 31, -7, -126, -180, -209, 145, 193, 44, 130, 164, -73, 104, -85, 69, -45, 105, -64, -302, -123, -190, 163, -44, -95, 197, -471, 79, 115, 24, 108, -153, 84, -22, 75, -29, 6, 437, 122, 311, -8, 96, -196, 162, 127, 77, -36, -148, 44, 75, -102, 160, 88, -31, 57, 291, 66, -202, -141, 167, 182, 154, 225, -53, 82, 203, -358, -156, -299, -224]
3223b24L76n5l46J85k71N46l24J05K78k53q2r6r2K01J36J71j48k67j11J40K04
3244G3k09K03Q7L6j03j28j76L66k13J51K12k05o4j60QM7k35p7L94L59m63J37n4
3267a4J91m0m6k03K19j37J07L7J55l26M7J8k9K97m74L02n8M3k38J19J36o4m41
3290c99N19j43q6J15J09J30k65J66k23q4J60k14P9Q5j32L03k39m7L56l11J78l87
3312c30J20M69j65L4n23M38Q5l82P7N6QL63J5l50O3N7k85J27L5Q8J1l14J27J7
3336a59o9L73k54M7n3J97l34M59Kj39k2J2j75mJ62L5n97N28J76j85R1n0m3q2J98
3361A14k76K13r2j36J82J34n8j85O9k13L59q1q0j37K44l0k73K97q3q2R1j02N26
3384D01n35n3L79k45j3K60m0j84l4J62m48J47K0Q1o2J22N9M0K38l02ok1L03l97
$$ y = [-224, 152, 97, -249, -64, -335, 211, -113, -8, 270, 17, -65, -161, -253, -52, 84, 255, 107, -160, -271, -131, 73, -136, 67, 154, 190, 87, -41, -217, 149, -64, 87, 299, 94, 30, -130, -122, -75, -310, -387, 7, 366, -97, 40, -14, 177, 137, 91, -112, 107, -30, 77, 114, 269, -57, -10, 8, -21, 276, -198, 104, 46, 89, -149, -30, 106, 42, -399, 120, -23, -109, 6, 115, 245, -20, 146, -77, -161, -1, -215, -136, -51, -183, 120, -119, -166, 190, -121, 57, -330, -210, 259, 94, 128, -395, 43, 128, -254, -177, -121, -113, 250, 265, -85, -22, 35, -250, -123, -88, 0, 11, -303, -176, -159, -228, 145, -109, -62, -115, 82, -252, 207, 209, 70, 48, 60, -115, -119, 43, 78, -519, 9, 185, 0, 91, 41, -2, -84, 114, -162, 51, -41, -177, 5, 139, 81, -104, -35, -248, 111, 30, -50, -187, 57, 27, -246, 51, -32, -114, -23, -125, 401, -134, -187, 192, -53, -66, 194, 154, -30, -64, 98, -350, -203, -183, -102, -164, -42, 17, 57, 295, -7, -13, -34, 269, -128]
3408a28Q8j01QK48j06L4J12l51J59K92l42M12n20K47P3j0j1o3j23J72K24k07l9
3431F8J56j32m56O13m47Jj50L12n7O6r4J68n6j8n2k92M25N7k14J12N0k79l6K27
3455b8J02k94K04K8J04l37L72l26K99L5j94K24l80N01j70j88J99k61N0K8O0J06
3477A34l31K74j6k14Pj8J90N8J72k32j73J72P7k24k62K55M43k96j00J18k08M53
3499B79l57J96k53L62k93Q3j0k73N48m55J95k45L68k20k55K65K5k4J86r9q8Rk12
3522b68K59K01k96O7L47k87o6k99K25L67k49J05O4j53O1j5m6O5Ok13K50j34m3
3545e2q3K27j83M16l24l3O6l34L94K71m32J09j25j45J51J56qO1l66L44l9j11J77
3568A37j94n0J45k15J90L43k33P3P2k92q4jJ7K22j47J06n1K27l58J01j68J49K5
$$ y = [-128, -40, -141, -133, 115, 9, 43, 155, -196, -37, 255, -87, 325, -195, 52, 125, 115, 104, 41, -82, 90, 314, 107, 68, 224, 92, -364, 249, -198, -197, -347, -35, -92, -26, -120, 48, -8, -26, -78, -370, 55, 112, -102, 10, 60, -219, -255, -28, 74, -220, -16, 12, 116, -221, 151, -175, 124, 159, -35, 189, -191, 310, 140, -48, 151, -110, -60, -32, 28, 134, -197, 77, 61, -153, -146, -164, 26, 84, 256, 24, -149, 23, 100, -124, -386, -131, 312, 16, -84, 34, -174, 279, -78, 118, -135, 227, -66, 17, 7, -266, 282, -173, 22, -223, 145, -75, -330, -65, -40, -64, 122, 23, -65, -56, -268, -9, 192, -104, -37, 310, 23, -43, -342, -117, 250, 1, 106, 170, 17, 78, 63, 17, 82, 88, -125, 125, -9, -52, -135, 92, -91, 325, 1, -32, 34, -300, 94, 365, -67, 42, -83, -228, -77, 79, 71, 132, -234, 110, 71, -40, 137, -57, -107, 38, -177, 13, 356, 123, 196, 268, -24, -108, -109, -92, 130, -17, 89, 38, 265, -93, 8, -160, -11, 14]
3591A4j49J26j4K2J25l81P9J99r9n7J20l14M05j4k14J67m3q3J45j16R8k36K93
3614G3J0j28j60j3M75l74M8J94J23l57M6j87j48M68p3J69k72R6P0r0q6M01m75
3637a90k30M89k90L08l20J48L27m06K26J14m6J76l61Q8j07J9j03J04o8P3L91j65
3659A77k69K71J41k00j03Rk47J90p9R3j3J50l75J33L43P6j77l58L43k43K67j72
3681d3J25k8K12n7l27K39K7k77J77j88O9L3K73n3l98L72k72M1J41O5l15L21J68
3704C05n09M15k18Q5L5J51k8k83J39J7Q1n5l6lk8r5P7j54L02k8j53k8r3J90J20
3729B06m81K85J14o4J06p7l70J05L8K9J48Q8J34M4j94l34K4N6J31j26M17l65J16
3752C0j21J45j69L34l03k29K95j44L13m42l20P46J88l53m61K72K1K26J42q6j39
$$ y = [14, -135, -9, -23, -1, 124, -257, -178, 21, -78, -135, -15, -329, 76, 62, -152, 15, -28, -111, 34, -82, 16, -220, 73, 83, -45, -205, -218, 257, -117, -69, 125, 248, -109, -63, -250, -398, 70, -3, 166, -106, -10, 60, -30, -116, 285, -190, -420, 69, -221, 87, -233, -85, 242, -164, 62, 176, 130, 306, -55, 33, -74, -55, -158, -54, -122, -49, 342, 177, -92, 179, 320, 120, 17, 26, -221, -31, -110, -17, -30, 120, -255, -122, 221, 297, 120, -238, 105, -138, 129, -43, 82, 54, 266, 209, -118, 121, 148, -129, 48, -140, -71, -38, 235, 182, -216, 156, -116, -75, 66, 131, -184, 137, 305, -204, 211, -7, 78, 113, 264, 236, -47, 92, 109, 190, 135, 99, 96, 68, -27, 50, -104, 198, 170, 17, -11, -104, 86, 206, -275, 10, 124, 60, 166, 89, -281, -176, -138, -109, 39, 127, 261, 305, 111, -223, -199, -143, -12, -138, 279, -86, 30, -91, 54, -115, 219, -84, -313, -18, -162, 151, -291, -611, 135, 323, -30, -491, -219, -198, 28, 170, 84, -55]
3773e5J61q1j22J29j19J95r9j85M74l97qJ53j8J31j34R2J74M3n38N5L65j21J35
3796B30k36r8O0l5j4R7j13J23L13k56j64j12J98k08J40J56j19n8J02Q3j51K83
3818B21l74J17M9K32j99K74l82j61L45%k14L94k22j07K46k83l10K81r1p1L47K9
3840A21j7J24j18l2p2j87k1lJ32J51k84L43l77J49O4k03J53J70K68j42k09k07
3862a97n0L71l27m6K23O4K29n32K6J65K61l47Q3K0q1m4L36k62j23L58l21M5K55
3885A06J5j74j7J46j07k01K22j10N31l71j74P1J15j33L0Q7o0j2K03Pj25n8K4k24
3909b09K17j35j24L69J36n94L12j78K19M2K34k60KJ44J54l16j39L12R2m32J91
3930C7K10l2n28M79j66P7J06j1J14m75O6p3J58M11l88m24N03L4Q5r4K8K04l8j22
$$ y = [-55, 106, 25, -97, 32, -87, 108, 9, -176, 298, -99, -107, 46, 28, 159, 25, 117, 291, 334, -204, -149, 216, 95, 230, -6, -104, -44, -79, -93, 4, -109, 14, 327, 71, -93, -205, -7, -215, -75, 81, -38, -96, 6, 89, -62, 221, -153, -36, 13, 245, 46, 320, -62, -223, 122, 122, -92, 302, 80, -27, 219, -64, -374, -93, -184, -255, 92, 121, 104, 228, 110, 78, 6, -181, -202, -205, -73, 78, -206, 137, -240, -91, -27, -230, -77, 93, 361, 219, 10, -197, -247, 124, -203, -249, -26, 38, 267, -265, -239, -74, 187, -160, -77, -57, -138, -182, 154, -108, -231, 127, -194, -149, 106, 121, -53, -70, 76, -31, -232, -10, -120, 411, 40, -134, -63, 52, -81, -51, 36, -24, -36, 167, 174, 49, -9, 15, -209, 8, -127, -251, 118, 254, -340, -28, -206, 13, 55, 289, 29, 31, 175, 329, 13, -126, 186, 278, -154, 37, 247, 215, -313, 166, 0, 77, 183, 172, 286, -189, -123, -196, -38, 373, -15, -439, 64, 98, 183, 89, 117, 321, 283, 161]
3954A61p2k57q8K60l11R8M45j07j17K56j66m93K02J55N2l56J89rJ72O0jM7j48
3977b8o5k98M66j11qj18j7R0K65j78k01K39j33l08M40j16L87k93J71j23M3kJ03
4000B05m28P4K74j47k33K81P2l67J41J13l7k11J00J52L38n07j04N69k01q1N6M4
4022A03k6k86m9L54j25K84k51k00J43N6L3K2J40j35l31J58J08k72K75n3j66K77
4044E9nL0k2l3K12n34K53j03r5j46M08j38nQJ42j06K23p8o6K52o4l07j69p5J78
4069a81P7J68k2k04K25KJ98l63M3J34j59k19l7M55j5j48k50L77j41L15l52k78
4091c75L75j33K53k29K50j74ON7J48l73O89o31o4L17k3np0l9j87K61m81L03J59
4114C4O3rL11m86M73m62K45k9j48J70N5j98l69O61l83K22r1K02j14J55m20L89
$$ y = [161, 89, -168, -256, 4, -307, -209, 236, 129, 12, 268, 102, -391, -189, -34, 18, -338, -149, -158, 14, 74, 73, 120, -28, -93, -391, 75, -36, -44, -162, -179, -89, 176, -2, -203, 36, -97, -405, 35, -81, 306, 13, 184, 61, 104, 102, 205, -223, -149, 125, -22, -255, 26, 98, -269, -128, -15, -52, -263, -163, -11, 327, -180, -284, 285, 84, 3, 59, 103, 77, -209, -258, 96, -29, 255, 4, -196, -53, 3, 36, 58, 198, 63, -268, -110, -2, -274, 1, -52, -218, 59, 54, 84, 62, 29, 241, -293, -40, -143, -238, -384, 24, -114, -119, -111, 31, -75, 148, 70, 4, 256, 192, -115, -284, -359, -181, -104, 64, 42, -162, 63, 65, 263, -100, -57, 77, -82, -301, -338, 117, 102, -46, -296, 81, -60, 255, -97, -375, 0, -133, 120, -109, 141, -33, -27, 30, 178, -195, 494, -137, -201, 116, 93, 88, 18, -21, -208, 53, -428, -125, 34, 97, 88, 399, -87, 386, -76, 169, 140, -8, 162, 217, 19, -350, 311, -72, 150, 59, 261, 147, 302, -118, 271]
4136B71m21o0K23M2j41K28N2j96L5j02J34j88P5K63k1m61K59k12n3L52L0j45J10
4159G4L8k19K22L5l51K19J00n0k92K73L6j3j81J19k35K25K92m87k5L01L4p3K08
4182B50l82Q2K07J87l72K89l86J89k79K17J36l38J26p4K35j27j23K87j8J13N9
4203B78m02K4k31J85K03j66N76l43l06L37j69j67J16J10L5J00k99k29L62R6j53
4224d3K7j25j82L55J78j62k21L69k10k52N36l99R3r3R2M3j19K13j70r6M8K06J64
4247B52l64K09J51R4k39n1l53R7p3M73m49L63j22P4k32J3J02N6m5J31j91K1L31
4270B48k55j16J90j6Q6k29j29M30k98k6q8J79j2K22j1j29j29J96K6m37L36J82
4292B20l02M04l35k8RL62l10P1J13l00J19j44K10j59J1j56n4N61k41l87K60K16
$$ y = [271, -150, -210, 13, 55, -86, 142, 194, -2, 33, -69, 65, -123, -48, 215, 194, -267, -8, -220, -273, 79, 109, -36, 74, 112, -107, 115, 150, -201, 18, 118, 68, -224, 49, 85, 72, -109, 10, -225, 0, 292, -195, -220, 81, 115, 42, 250, -132, -50, 157, 344, -28, 261, -125, 64, -215, 2, 138, -200, -74, -148, 87, -40, -163, 124, 106, 219, 278, -124, -100, -331, -146, 57, -109, 467, 124, -182, 155, -14, -181, -65, 45, 80, 180, -119, -348, 14, 110, -43, -16, -141, -323, 32, 210, 48, -173, 196, -14, -266, 270, -129, -36, -129, -37, 6, -113, 100, -70, -166, -118, 88, 252, -112, 97, 248, 342, 103, 52, -301, -204, -277, 196, -253, 110, -12, 62, -170, -157, -55, 1, -44, 87, -104, -83, 248, -7, -123, 67, 51, 137, -92, -221, 209, -89, -115, -203, -24, -36, 186, 175, 46, -83, 113, 139, -298, 38, 220, -82, 322, -13, -41, -32, 330, 20, 91, 204, -96, 23, -121, 89, -70, -59, -215, -269, 292, 51, -336, -76, 140]
4314A40p5l71J04K86J10m71K70l81L82J49j94N7L4K42l33j17OK24m0k16j21M76
4336A61n94M80k48ML29m5k5L5j58k08J59j41K78J75m15J16N4R3k3m8N2M2L2n7
4360D8O0Q6L6k22L7J32o9j58j32K58K4j4l64K61L40n14J88j78L5J21k20K20lK4
4384dNj83K81m7J56q0l11L71l52J52kn4J67k88L60j53q1n2K35k0j08K2J22j09
4408B7j35m8j7L69k34N0J23J31m1l03J47q7J5L3qQ4K02l88J67K16o43K82j09M57
4432B90o1k12N8j4k12K49o5j0j68j23K03N9J96j91k95rL35m2J90k5j33j14R5J88
4456A89j93jL4K99j25J9j66k26M55k74j54J50j17q3J22NJ82k61j20J49o2K05q8
4479f1L29L0n56L02n7P0N2l38k9L87j51l41L10L5j07J45P5j23K31k9R2n90P02
$$ y = [140, 65, -306, -202, 84, 194, -277, -7, -388, -6, 143, -51, 6, 40, 282, -51, -168, -162, 62, 22, -194, -315, 161, -433, 47, -201, -197, 132, 87, 62, 97, -61, -269, -110, -251, 27, 202, -213, -97, -43, 50, 27, -21, 31, 73, 105, 48, 108, 194, 230, 8, 45, 177, 108, -50, -182, 76, 100, 86, -278, -17, 323, -191, -3, -181, -146, -25, -245, -25, -28, -4, 1, -182, 99, 52, 208, 128, -183, 188, -164, -12, -14, -68, 99, -189, 171, 18, -63, -115, 120, 100, -8, 14, 136, 27, -108, -156, -173, 196, -38, 12, 135, 266, 225, -78, 69, -18, -3, 30, 22, 106, 308, -80, 87, 303, -340, -58, -167, 290, 229, 17, 75, 61, -151, 98, 33, 23, -145, -268, -65, -6, 190, -1, -296, -305, 30, -12, 178, 153, 20, -94, 1, 189, -4, -5, 29, 328, 203, 222, 56, -170, 285, 11, -143, 7, -110, -193, -71, -66, 116, -145, -265, -116, -178, 27, -61, 268, 298, -258, 44, -13, 57, 109, -229, -258, 129, -22, -363, -53, -18, -125, 20, 95, -28, 203, 174, 266, -324, 378]
4502C78k91j28J61k53N3p1j60L83j23L34m73J83l29K56L3J15q7m9M93l48K58k10
4524A25J00k32J04k87M45j91j29kJ13J82mk31N9M5J13j87k96J86o8K96l55M20
4546B06j03p9k28L98l91K63n7N1j08J33J69r5l38K18J7n72M68k07J98M2K23l10
4568a02J95j20J01k04jK60j24r3J88j6L64l85K48l22J02qp3j55L22ol76J16o8
4591a57N0K27Nk25j99L65j96L20m20J3l1J52N1K83l4l92L21q1l43J02K85P4k54
4614h4j33L55l77Mj09L47q9l1N68o04j9J51L9j38M5k06L37k16M63M4l49j07N5
4637e4K23l54L08k08M4q9P5L2J11P2j86Q7J17j93r2M25l87K32O1l15J51j75j49
4660b64J12k65K82J3J03j42J56J19j28J74m20K40R5k77J75j19M11m48N44l19k0
$$ y = [378, 87, -41, 120, -133, -80, -151, -311, 72, -51, 283, -190, -7, -336, -80, -47, 68, -19, -68, 425, 77, 335, 125, 225, -7, 97, -190, 255, 64, -65, -67, 46, 228, 224, -7, 52, 97, 210, 23, -273, -87, -155, 141, -214, 206, 103, 24, -204, 194, -197, 66, 9, 60, -48, 85, 254, 159, -179, 39, 56, -516, -48, -255, -57, -15, 208, -102, 93, -27, 74, -130, -131, 129, 5, -88, 100, 84, 448, 63, 311, -11, 91, 83, 10, -145, 177, 171, -205, -89, -157, -107, 120, 125, -100, -299, 66, -130, 190, -230, -217, -248, -96, -45, 238, 204, -188, 133, 52, -291, -189, 96, 170, -84, -217, 138, -239, -235, -344, 3, -86, -117, 451, -153, -172, -21, 18, -120, -75, -281, 56, -160, 303, 347, -2, -109, -54, 169, -185, 123, -85, -41, -130, -55, -23, 88, 160, -26, 61, 178, -15, -107, 318, -69, 163, 224, -91, 60, -115, -264, -152, -417, -135, -122, -19, -161, -5, 114, -14, 160, -260, -20, 75, -202, -27, -146, 265, -183, 361, 42, 22]
4681B2k84M72l58K65k33J52p2J1J05L9l06K22j60L1r2l8L36l06K64J32k57k56
4703c11L99k68Q5J03l7j10L5M1J33l87L38O8l36K06j44J07k17N70J7k84L58n45
4725a79J68p4q0O73m84o0j17m61O29k87L42j88L88l25m6J89o2l72K92Lo7K46j42
4748a4J16J69M3Jn49K64k56j47M94k93L54J39m11L75j66j3l50MJ47L09n75K54
4770a05K5L21k15j69K83q3K0j24J26k47J34N4J70j01M7k91p0J50J99l47J27P4
4792b2Q5J23nl57J77j86j30J88J81j10Q2K6l9q1R5m1j04J56J14l11J56J46n8j72
4816h7j28J76r5L06l64M22q7k71J05R8j31k88N13j79L22m29k20M68j5j14Q5r7
4838a0k6J75J0%k53M2J91Q9J26p09M59j35l5j20n9J78K21L59l62j44k45M50m37
$$ y = [22, -262, 210, -148, 117, -116, 36, -36, -25, 80, 119, -187, 35, -125, -94, -186, -224, 112, -194, 70, 202, -55, -311, 88, -180, -95, 8, -29, -139, -104, -63, 70, -317, 21, 89, -247, -41, -185, -78, -295, 275, 292, 8, 366, -179, -11, -85, -165, 508, 24, -36, -153, -614, 15, -272, 70, -118, 270, -55, -101, 88, 26, -346, -54, -51, -118, 128, -14, 102, 271, 314, 315, -234, 30, -226, -373, 121, -172, 182, 321, -90, 285, 119, 106, -244, -240, -93, 216, -359, -105, -80, 241, 26, -143, 140, 57, 77, -47, 79, -168, -34, 20, 190, 89, 136, -155, -225, -75, 124, -223, -96, -22, 63, 186, 181, -176, 1, -185, -315, -127, 54, -56, 26, 52, 13, -68, 27, -14, -118, 38, 152, -159, -3, 143, 85, -87, -215, -39, -134, 172, -192, 230, 143, -128, -23, 75, -56, -344, 169, -10, 312, -117, -337, 131, 116, 2, 87, -10, -36, 139, 149, 149, -104, -62, 129, 218, 344, -365, 94, -41, -76, -196, -255, -77, 144, 503, 141, -3, -248, 202, -235]
4861b35K96j75J40l1J44o3j07o3J94j54J17l63K4O03j77j40J69r3k45J25k7m3
4883a04r8K20k27K46J46Qn5l5j47J3J60l24K68j18K67j50pj51J48J39l50q8J97
4906d2J18J51j17l90K39J64j69J3Q1m3j17K09k60K07k85K10J61k72J97oL40n64
4928a75j36N5N23p8k11k82L71K95k92K5r8J02l84K38j18K51j84k46L64j99L8J96
4950E5k08K41j96o8K5J83l4J6Q1j88P6j95L67j84Rr2j79K41K39j28j1l28L42k21
4974a57K25m4Kk39L95J85q07L04K83l83L89J88r1n5j18k02M9R8P9k1R3k1j08K9
4998G3M7J63n66N41o07L10l28M16o6M09m22k82K23J41j0p2j39L17j6j28j17R8
5020a5J49j6j00p4J73l14j25N13j4j96L10k73j9K97l09R8j78J63l27J01L32k69
$$ y = [-235, 61, -114, 26, -5, 139, 76, -31, -94, 100, -54, 63, -300, -276, 327, 150, 10, 179, 86, -159, -34, -61, -104, -202, 18, -209, 37, 183, 191, 136, 101, -46, -33, 127, -197, 71, -47, 220, 70, 63, -88, 60, 199, -151, -239, -42, 76, 227, 110, -280, -41, 123, -46, -33, 48, 5, -112, 97, -163, 44, -241, -31, 130, -142, 55, 49, 389, -175, -311, -256, 267, 189, -22, -304, 67, 362, 70, 95, -3, 99, -285, -47, -165, 86, -98, -344, 20, -179, -141, 55, -153, 88, -108, -176, -151, 32, -2, 14, 95, -93, -17, -212, 155, -29, -20, -112, -291, -50, 189, 61, 50, -278, 64, -157, 68, 24, 26, -213, 182, 367, -440, -136, 147, -236, 153, 341, 250, 195, 77, -125, -76, 22, 101, 80, 173, 152, 44, 73, 120, 283, -283, 258, -349, -39, -367, 49, -17, 392, -30, -312, -89, 52, 42, -30, -169, 148, 132, 4, -113, -15, 134, 118, 18, -56, 117, -197, -322, 191, 177, -19, 291, 18, -1, 296, -13, 85, -93, 70, -257, -156, 176, -93]
5042i3J37o9N2P0j30q8J56j82K9R5j6j01O0R8p6o1NRQ6k53L40M6k12K64l79M91
5068B78k63p5M7j33K65n7q6O5j7k72K79L91l76K5J6p4RM41n80J20K09l42K72j37
5092EM05m04K78m37L23R1m38L56j38J35k11j90M73j31r8P1l7M1p8k28K68o5J15
5115A06k91J89oP6j47J03L0k61M49m15j22L11J23l69J19J12l0n2J67j04K12n0
5137A50j24K1j09j78L56k35L98m4l72J03M6p0K63k34n0k1J66L9j40k3O9Q8r3Q0
5161H6L6K2j34O4j41J94O9l00J68j60J50L9r8L86l55r4K84r5J83p2j95k11J14
5184f0K55j05j2m79N34k79M03k63J61R7j17n09M67j6l7p6k7J16K17m11k98O42
5206B03k98K48k78k3r3M47k49q4R6o7r5j39L95j87J78r9rN5J13j28L93m28n2L4
$$ y = [-93, 44, -25, 27, 97, -33, -121, 35, -147, -118, -23, -39, -140, -80, 18, -58, -119, -114, -105, -19, -272, 68, 114, -98, 166, -213, 278, 15, -60, -13, -146, 119, 62, -24, 41, 24, -248, 31, 422, 46, 71, 87, 13, 22, 463, -117, 3, 212, -130, 142, 5, 410, 6, 284, -153, 170, 261, -177, 179, 41, 176, -35, -225, 248, 117, 19, 90, 53, 94, 16, -212, 56, -9, 106, -185, 4, -2, 74, -73, 30, 60, -201, 248, -167, -289, 22, 145, -224, -105, 7, -23, -75, 92, -12, 200, 150, 26, 47, -62, -240, 116, -119, 279, 235, -137, -34, 12, -58, 205, -29, -79, -100, 66, 105, -35, -58, 11, 99, 6, 86, 122, 144, 10, 74, -67, 127, 196, -104, 64, -96, 54, 93, -5, 381, 26, -68, 216, 121, 304, 232, 37, -174, -60, 195, 90, 78, -401, 133, -146, 257, -6, 155, 252, 135, -374, 93, 77, 40, -36, -63, 53, 270, -141, -439, 203, -95, 153, -125, -148, -241, 206, -43, -127, -31, -98, -193, -332, 63, -124, 54, -45, -54, 1, 114, -14, 379, -49, -101, -67]
5230f7k6L78m82J5o2L05j61L51m01k4L43K5Q1j10J41l15j03m0J88Q9j28j16J7
5253a02J44j05j06p6J01N6J77K6l64J6L34mL3m28J0K78J00j05J02l28L72J3k32
5276h8j8j7N6J5k60M08Q3m8j1j65J77l6l1k93J10J37L66k99L23k05j31Rk44M75
5300C13k27l07J06L02k67mJ36Rn7J07O5k10K72j78j61J28k90K10J91L24l89j40
5322f7KP5R4j16J38j22N8J9J07j77k53L02l9q2J51J20k83L08n6l9m73N66k08n9
5346c4l73L24J4r1N6j7r2L05m1Po3j30J07J14L31o15N3K05J96k77J5k02J68k53
5370b93K56j9K79N7j53L9K65p24N8K49j79J87J03k96K83j61O2j56M2Q8k45M80
5392B22l69J68p4J46k57M84j90K2k22J35j56k32K83O5n5J50K14l28K97l58J86
$$ y = [-67, -93, 285, -197, -182, -244, 61, -100, 251, -150, -174, 169, 194, 275, 165, 306, -9, -112, -152, 36, 125, -3, -119, -102, 42, -63, -169, -245, -144, -88, 89, 115, -249, -233, 101, 97, 130, -298, -288, -10, 90, -15, 87, -241, 131, 144, -88, -106, -123, -67, -52, -312, 96, 179, 131, 120, -45, 132, 96, 65, -228, -118, 19, 385, 86, 409, 204, 73, 82, -162, 313, 86, -221, -115, 187, -80, -84, 52, 61, 4, 111, 176, -34, 238, 60, -101, 27, -263, -53, 138, 462, 73, -67, -65, 10, 104, -12, 126, 4, 62, 81, 188, 11, -242, 60, 21, -61, 90, 210, -73, 235, 179, 140, -333, 233, 25, -34, -407, -83, -69, -160, -104, -121, -213, 92, 51, 58, -5, -135, -28, 86, 417, -198, -145, 60, 256, -21, -6, -208, -40, -293, -37, -56, 223, 280, 127, 166, 431, -293, -235, 14, -165, 22, 125, -171, 112, -49, 13, -143, -101, -13, -258, 222, -147, 21, -53, 93, -164, 320, 130, 152, -70, 65, -91, -323, -40, 25, -30, 120, 334, 6, 303, -55, 131]
5413A31k07K49j63K17m12L12M8j91m3l51O43m56P3j3j19J83J28Q1l1N9J4j38j34
5436a20O37p38L52J15j53N1j60N5o2L18n86L57l02L10k04l7K90o3K71k59k74o1
5458b63K20J68k93q1L50K94m06J38j25k85L48j44J59j5L8K17n61P2K81k75J37
5479b6j9K58m15J19J50lk4rk76L47k41L9J42j92K70k52K50K6P8Nk04R1k93O7J15
5504Ck28K95l26M25j40J65q0j98M7j30R8k16N70l95M16k30j08o8K87J59l33J8
5526C1k32L27K4k01R1J6j5kR5j9l47J27j51J97L55m38Q0L30o2k22J3M00n44L15
5550A68l67Q5J29rQ6O9r4k3l43K10j36L33l01J77J3K06j05l29L88j41J54k03J0
5573b3j28K13J14j89j35k3J40R0l82K07J59J00j84k34J87N0O4k05K30j22L2j41
$$ y = [131, -76, 173, 10, 227, -185, 127, 175, -16, -59, -410, 233, -223, -150, -163, -282, -99, 29, 110, 79, 138, 152, 14, -120, 517, -221, 131, 246, 93, 144, -16, 39, -23, 295, -291, 66, -236, 74, -130, -167, 123, 60, 331, 72, -202, -263, -43, 125, -168, -249, 101, 395, -11, 127, 2, -283, 65, -79, 80, 65, 103, 320, -241, -169, 112, -163, -26, -45, 213, -202, -83, 67, 64, 40, 31, -245, 102, -139, -100, 42, -150, 120, -132, 118, 144, 222, 227, 23, 114, -179, -112, 3, -225, 70, -256, 169, 29, 194, 114, -84, -37, -167, -69, -285, 285, -110, 306, 76, -32, -100, 187, 346, 13, 31, -201, 126, 150, -51, 40, 56, 41, 39, 134, 115, -232, -105, -256, -59, 296, -142, -62, 268, 206, -16, -3, 397, -147, 168, -199, -114, 15, 6, 92, 161, 67, 44, -299, -89, -225, 108, -193, -16, -3, 203, 98, -231, 157, 16, 170, -33, -23, -151, 62, 176, -13, -148, -171, -31, 59, -323, -116, 43, 143, -41, -275, -88, -38, 26, -179, 51, -71, -39, -180]
5595a80P5m6j16K27Qk4J13K82j14j39m74N16m48M24j30j25J14j49J20o0j20K1
5617b25L81l42N25j77l00J52j05L24m43K71k03l5P5K1J30l95K74J43k16K67l39
5638b17O0J60n33N69J20j36K32j62P5R5l09q0RK85l47K57j22K99p9k17N1K13l23
5661a00k20K74RJ36r3K09k58J30j77N55l82k01O4l26K88L39j47j32Q9L4m64L23
5683e0J78k47p7L67o7m54J56J75J7j47k0L9J2J79k80J23J81n5n5Q5j21n2r1k89
5707d93L29L3k27N42k64J01k20K36p2rK09o6l7Q9l67J80N1J6O2j73M0j06J20K24
5731A98l02K19j40j41M69m92K42P2j21m54L82j4Mj6K0n3K02j65M8Q9K2L15l05
5754G9k2j38l6J13J69k11L31q3k81J15O6l41K28r9nQ3n0O2J17k89K84n0J0Mo8
$$ y = [-180, -105, -151, -267, -40, -32, -56, 57, 339, 225, 86, -388, 128, -320, 104, -26, -151, -37, -186, -66, -126, -246, -225, 156, -186, 339, 162, -138, 14, -91, 233, -210, 61, -142, -177, -102, -81, 49, -346, -72, 71, -145, 122, -217, -157, 3, -530, 39, 159, 23, 255, 93, 168, 263, -46, -126, -117, 168, -179, 78, -44, 255, 176, -41, 10, 223, -100, -320, -46, -37, 99, 6, 215, -43, 87, -90, 465, 83, -118, -54, -380, -92, 247, 100, -32, 57, 91, -373, -50, 128, -119, -196, 171, 104, -350, -194, -19, -2, -149, -169, -130, -118, 61, -219, -96, 85, 30, -25, 60, -61, -113, -204, -493, -164, -131, -358, 184, -80, 21, -199, 37, -35, -44, 165, 99, 62, 151, -216, -36, 15, 31, 93, -80, -40, -146, -26, 198, -104, 115, -25, -166, 303, -189, 53, 125, 4, -450, -68, -82, -78, -94, -74, -127, 75, -90, -42, 47, 69, 384, 79, 57, -81, -117, -4, 165, -46, 285, 202, -79, 36, 102, -239, -11, -110, -115, -32, -82, -20, 97, -192, 92, 42, 52, 56, -12]
5779a2Lj32N97n02j73L13k74n7j75mL34R5j2o9j66K05PR2j0k68P4K28r8K17k33
5804b0k21L80K04n95K23J04j58J11q0J09j81OQ5R0J31pk54J58k89L11J28l62L70
5827B43l87Q1J70j17j59N4L79m78r5M62m72q6O53k01j91K62j50r2L08r4j01j14
5849a25L21j66K96l43J00n2j09L27j0l13K07o8j21J52q5n9R7j36K49l07J59k22
5871b08J70o9r8K68k18M23l34M9J72k54m2J84l7J65l1l08K52k73J17J90q4J89
5893B23k28n7p7J66j81J0K79M5j26o5%K7L60k92k08J42l10L44j22K74l32Q7K78
5916B37k49RO5r5Q4j25j06J22Q9J91n67J15K32m75K19J01j73M27k83K49o0K1L7
5939F5j75M3J51l34O6L94k52J71k28J35K10l37j02Q2j17Q3K50K7r6K73k43r1O3
$$ y = [-12, -9, -141, 456, -46, -219, 94, -180, -237, -412, -416, -82, 13, 1, -68, -234, -29, -22, 70, 60, -208, -134, 94, -4, 213, -20, -241, 139, 343, -252, -29, 75, -83, 28, -52, 57, -124, -118, -33, 57, 188, 181, -73, 85, -204, 107, 235, -127, 243, -144, -63, 107, -10, -169, -115, 264, -214, -309, 153, -319, -405, 248, 47, -144, 118, -32, -124, 184, 90, -11, -125, 196, 30, 326, -17, 83, 31, -78, 249, 239, -74, 133, 65, -56, 96, 11, -48, 49, -87, 162, -145, 14, -208, -38, -107, -205, 63, -155, 268, -66, -17, 155, -99, -141, 43, 6, 171, 140, -168, 84, -189, -72, 118, 34, 223, -5, -62, -139, 27, -154, -144, 135, 180, 54, -11, -11, 16, 376, 84, -124, 18, -292, 52, -70, 204, -128, -41, 237, -12, -3, 62, -33, 51, -74, -180, -58, 31, 222, -345, -230, 2, -473, -254, -153, -326, 101, -182, 67, 7, 28, 65, -110, -67, 84, -250, -184, 210, -42, 129, -99, 36, 246, -91, -193, -111, -228, -145, 105, 132, 36, 309, 66, -25, 38]
5962C8K83l63q3J58J23n5l11K31P4j5Jl12M04l85K79J32k81j31j96l4M41Rj12
5985a05J34J25q7j30L43k80J18k38J91N3J9m00K03L07j90j35K18k13N9J18j33
6006b3J48r3l8%j92J15K42j35M9l0m89M57K10j4k49Q1QJ50n11M03PN6M7l38J06
6031c3l9K90j49l04K38j63K97P4l21L55r9r7l58K52n7J99k52J58o5K88l90l3N37
6054C28j86j21J6oj6J53k82K17r6k23K85L3k86J28L0l4R3k24R4J82j39l07N78
6077B17k07M5k09j28L33J29j82J61k01K94k85J87J46L1m01r7J77l9j8n9M35l67
6099c8L6K03J3J63l73l2L1q5N7k76O4J27N1o5j02L55l05L40K5k6l8k74j5K73J68
6124B77m29J85j0J21k01K60m09K77l24J41J10j27J53p4Q1k4J83j39J76j07Q9Q9
$$ y = [38, 321, -42, -125, 33, 156, 101, -210, 21, 95, 80, 81, -231, 173, -212, 67, 199, -82, -213, -409, -443, -2, 7, -105, 29, 154, 67, -63, 280, 0, 118, -120, 71, 124, 143, -257, -54, 253, 63, -72, 146, -67, -8, 110, -23, 125, 32, -6, -6, -198, -83, 159, 24, 73, 43, -446, 11, 221, 207, -42, 39, 47, 197, -314, 89, 96, 152, 199, -139, -33, -72, 218, 69, -235, 3, -160, 137, 211, -110, 245, 146, 49, -309, -57, -114, 85, -167, -9, -74, 214, -176, -209, 328, 142, 21, 37, 31, 15, 168, -114, 103, 7, -216, 69, 102, -184, -56, -26, -60, 33, -191, -97, 85, -54, -361, 217, 10, 55, -154, -282, 51, 180, -2, 159, -42, 252, -33, 154, 300, 331, -70, -167, 10, -29, -47, -106, 329, -38, -2, 201, 214, 377, 4, -28, 3, -82, -25, -301, -237, -110, -59, -124, -226, 129, -176, 164, 189, 163, 125, -149, -164, 109, 277, -152, 33, 23, 144, -57, 203, -206, 71, -253, -112, -2, -129, 24, -50, 31, 7, 190, 51, 227, 120, 209, 298]
6146B98k33K43n38K67j78j06J58J26j44j17M09l91J76j74J19Q6q0p1jJ57j23J20
6168CJ28L11m30L77p26K01R2j50M87m38q0J71J18j57mJ41J38l4l9K42k14J15l31
6191g9j32L0K11l66L40K53m25K6L00r3j44j47J27j07M00l56K00j17l28L73m2K58
6213A82q3m2k25P8M82l32N9KO8l24J1N9J64l06L1P4J21Q5r8k57jL62k69K23j35
$$ y = [298, 65, 308, -230, 37, -141, -247, -89, 37, -107, -224, 185, -206, -30, -204, -85, 1, -79, -150, -151, 6, -117, 3, 131, 442, 12, 389, -337, -136, -44, -194, 293, -145, -225, -54, 64, -93, -97, 44, 182, 148, 109, 351, 137, 252, -79, -211, -181, 30, -336, 4, 257, -168, -142, 158, 65, -79, -226, -99, -206, 194, -162, 38, -79, -407, -34, -76, 182, 99, 57, -168, -90, 392, 60, 119, 121, 189, -135, -124, -65, 99, -207, -176, -102, 19, 104, 6, -251, -252, 110, -159, 64, -71]
$$ [...]
8191i5
##END NTUPLES=NMR FID
##END=
