##TITLE=1H_DE-75k3_F
 200.13MHz, CDCl3,
 24 sc
 
 15.1.2025
##JCAMPDX= 6.0         $$ Bruker NMR JCAMP-DX V2.0
##DATA TYPE= NMR FID
##DATA CLASS= NTUPLES
##ORIGIN= UXNMR, Bruker Analytische Messtechnik GmbH
##OWNER= pz
$$ XWIN-NMR		Version 3.5
$$ Wed Jan 15 14:28:41 2025 Russian Standard Time (UT+4h)  she@DPX200
##.OBSERVE FREQUENCY= 200.1312
##.OBSERVE NUCLEUS= ^1H
##.DELAY= (6, 6)
##.ACQUISITION MODE= SIMULTANEOUS
##.ACQUISITION SCHEME= undefined
##.AVERAGES= 24
##.DIGITISER RES= 18
##SPECTROMETER/DATA SYSTEM= spect
##.PULSE SEQUENCE= zg30
##.SOLVENT NAME= DMSO
##.SHIFT REFERENCE= (INTERNAL, DMSO, 0, 14.3821)
##AUDIT TRAIL= $$ (NUMBER, WHEN, WHO, WHERE, WHAT)
$$ ##TITLE= Audit trail, XWIN-NMR		Version 3.5
$$ ##JCAMPDX= 5.01
$$ ##ORIGIN= Bruker BioSpin GmbH
$$ ##OWNER= she
$$ F:/spectra/data/she/nmr/H-C/1/audita.txt
$$ ##AUDIT TRAIL=  $$ (NUMBER, WHEN, WHO, WHERE, WHAT)
(   1,<2025-01-15 14:27:28.29 +0400>,<she>,<DPX200>,
      <continue with go, POWCHK disabled, PULCHK disabled
       configuration hash MD5:
       00 E9 B6 7A A2 85 ED C7 34 08 36 98 17 FE 4E 26
       data hash MD5: 16K
       AD A9 87 0F 02 0F F1 A2 F1 BF E0 DD BC 7B CC B9>)
$$ ##END=
$$ 
$$ hash MD5
$$ D7 F0 36 89 81 F5 D2 AF 56 94 5E 48 0E 0D 70 17
##$RELAX= 
##$RELAX= 
##$RELAX= 
##$RELAX= 
##$RELAX= 
##$RELAX= 
$$ Bruker specific parameters
$$ --------------------------
##$DU= <F:/spectra>
##$EXPNO= 1
##$NAME= <H-C>
##$PROCNO= 1
##$TYPE= <nmr>
##$USER= <she>
##$AMP= (0..31)
100 100 100 100 100 100 100 100 100 100 100 100 100 100 100 100 100 100 
100 100 100 100 100 100 100 100 100 100 100 100 100 100 
##$AQSEQ= 0
##$AQ_mod= 1
##$AUNM= <au_zg>
##$AUTOPOS= <>
##$BF1= 200.13
##$BF2= 200.13
##$BF3= 200.13
##$BF4= 200.13
##$BF5= 200.13
##$BF6= 200.13
##$BF7= 200.13
##$BF8= 200.13
##$BYTORDA= 1
##$CFDGTYP= 0
##$CFRGTYP= 5
##$CHEMSTR= <none>
##$CNST= (0..31)
1 1 145 1 1 1 1 1 1 1 1 1 1 1 1 1 1 1 1 1 1 1 1 1 1 1 1 1 1 1 1 1 
##$CPDPRG= <>
##$CPDPRG1= <>
##$CPDPRG2= <>
##$CPDPRG3= <>
##$CPDPRG4= <mlev>
##$CPDPRG5= <mlev>
##$CPDPRG6= <mlev>
##$CPDPRG7= <mlev>
##$CPDPRG8= <mlev>
##$CPDPRGB= <>
##$CPDPRGT= <>
##$D= (0..31)
0 0.7 0 0 0 0 0 0 0 0 0 0.03 0 0 0 0 0 0 0 0 0 0 0 0 0 0 0 0 0 0 0 0 
##$DATE= 1736936762
##$DBL= (0..7)
120 120 120 120 120 120 120 120 
##$DBP= (0..7)
150 150 150 150 150 150 150 150 
##$DBP07= 0
##$DBPNAM0= <>
##$DBPNAM1= <>
##$DBPNAM2= <>
##$DBPNAM3= <>
##$DBPNAM4= <>
##$DBPNAM5= <>
##$DBPNAM6= <>
##$DBPNAM7= <>
##$DBPOAL= (0..7)
0.5 0.5 0.5 0.5 0.5 0.5 0.5 0.5 
##$DBPOFFS= (0..7)
0 0 0 0 0 0 0 0 
##$DE= 6
##$DECBNUC= <off>
##$DECIM= 32
##$DECNUC= <off>
##$DECSTAT= 4
##$DIGMOD= 1
##$DIGTYP= 9
##$DL= (0..7)
0 120 120 120 120 120 120 120 
##$DP= (0..7)
150 150 150 150 150 150 150 150 
##$DP07= 0
##$DPNAME0= <>
##$DPNAME1= <>
##$DPNAME2= <>
##$DPNAME3= <>
##$DPNAME4= <>
##$DPNAME5= <>
##$DPNAME6= <>
##$DPNAME7= <>
##$DPOAL= (0..7)
0.5 0.5 0.5 0.5 0.5 0.5 0.5 0.5 
##$DPOFFS= (0..7)
0 0 0 0 0 0 0 0 
##$DQDMODE= 0
##$DR= 18
##$DS= 0
##$DSLIST= <SSSSSSSSSSSSSSS>
$$ [...]
##$SUBNAM0= <"">
##$SUBNAM1= <"">
##$SUBNAM2= <"">
##$SUBNAM3= <"">
##$SUBNAM4= <"">
##$SUBNAM5= <"">
##$SUBNAM6= <"">
##$SUBNAM7= <"">
##$SUBNAM8= <"">
##$SUBNAM9= <"">
##$SW= 18.0517418723606
##$SWIBOX= (0..15)
0 0 2 0 0 0 0 0 0 0 0 0 0 0 0 0 
##$SW_h= 3612.71676300578
##$TD= 16384
##$TD0= 1
##$TE= 0
##$TE2= 300
##$TE3= 300
##$TEG= 300
##$TL= (0..7)
0 120 120 120 120 120 120 120 
##$TP= (0..7)
150 150 150 150 150 150 150 150 
##$TP07= 0
##$TPNAME0= <>
##$TPNAME1= <>
##$TPNAME2= <>
##$TPNAME3= <>
##$TPNAME4= <>
##$TPNAME5= <>
##$TPNAME6= <>
##$TPNAME7= <>
##$TPOAL= (0..7)
0.5 0.5 0.5 0.5 0.5 0.5 0.5 0.5 
##$TPOFFS= (0..7)
0 0 0 0 0 0 0 0 
##$TUNHIN= 0
##$TUNHOUT= 0
##$TUNXOUT= 0
##$USERA1= <user>
##$USERA2= <user>
##$USERA3= <user>
##$USERA4= <user>
##$USERA5= <user>
##$V9= 5
##$VALIST= <valist>
##$VCLIST= <CCCCCCCCCCCCCCC>
##$VD= 0
##$VDLIST= <DDDDDDDDDDDDDDD>
##$VPLIST= <PPPPPPPPPPPPPPP>
##$VTLIST= <TTTTTTTTTTTTTTT>
##$WBST= 1024
##$WBSW= 4
##$XGAIN= (0..3)
0 0 0 0 
##$XL= 0
##$YL= 0
##$YMAX_a= 372265
##$YMIN_a= -434514
##$ZGOPTNS= <>
##$ZL1= 120
##$ZL2= 120
##$ZL3= 120
##$ZL4= 120
##$ABSF1= 10
##$ABSF2= 0
##$ABSG= 5
##$ABSL= 3
##$ALPHA= 0
##$AQORDER= 0
##$ASSFAC= 0
##$ASSFACI= 0
##$ASSFACX= 0
##$ASSWID= 0
##$AUNMP= <proc_1d>
##$AZFE= 0.1
##$AZFW= 0.1
##$BCFW= 1
##$BC_mod= 2
##$BYTORDP= 1
##$COROFFS= 0
##$CY= -3
##$DATMOD= 1
##$DC= 2
##$DFILT= <>
##$DTYPP= 0
##$F1P= 0
##$F2P= 0
##$FCOR= 0.5
##$FTSIZE= 0
##$FT_mod= 4
##$GAMMA= 1
##$GB= 0.15
##$INTBC= 1
##$INTSCL= 1
##$ISEN= 128
##$LB= 0.25
##$LEV0= 0
##$LPBIN= 0
##$MAXI= 10000
##$MC2= 0
##$MEAN= 0
##$ME_mod= 0
##$MI= 1.114404
##$NCOEF= 0
##$NC_proc= 0
##$NLEV= 6
##$NOISF1= 3.799351
##$NOISF2= 2.8
##$NSP= 1
##$NTH_PI= 0
##$NZP= 0
##$OFFSET= 14.38212
##$PC= 1
##$PHC0= 251.7697
##$PHC1= 13.7922
##$PH_mod= 1
##$PKNL= yes
##$PPARMOD= 0
##$PSCAL= 0
##$PSIGN= 0
##$REVERSE= no
##$SF= 200.129724274929
##$SI= 16384
##$SIGF1= 3
##$SIGF2= 2
##$SINO= 400
##$SIOLD= 16384
##$SREGLST= <1H.CDCl3>
##$SSB= 0
##$STSI= 0
##$STSR= 0
##$SW_p= 3205.1282051282
##$SYMM= 0
##$S_DEV= 0
##$TDeff= 0
##$TDoff= 0
##$TI= <>
##$TILT= no
##$TM1= 0
##$TM2= 0
##$TOPLEV= 0
##$USERP1= <user>
##$USERP2= <user>
##$USERP3= <user>
##$USERP4= <user>
##$USERP5= <user>
##$WDW= 1
##$XDIM= 8192
##$YMAX_p= 0
##$YMIN_p= 0
$$ End of Bruker specific parameters
$$ ---------------------------------
##NTUPLES= NMR FID
##VAR_NAME=  TIME,          FID/REAL,        FID/IMAG
##SYMBOL=    X,             R,               I
##VAR_TYPE=  INDEPENDENT,   DEPENDENT,       DEPENDENT
##VAR_FORM=  AFFN,          ASDF,            ASDF
##VAR_DIM=   8192,          8192,            8192
##UNITS=     SECONDS,       ARBITRARY UNITS, ARBITRARY UNITS
##FACTOR=    0.0002768,     1,               1
##FIRST=     0,             0,               0
##LAST=      2.2672688,     0,               0
##MIN=       0,             -434514,         0
##MAX=       2.2672688,     372265,          0
$$ Real data points
##PAGE= N=1
##DATA TABLE= (X++(R..R)), XYDATA
0@%%%%%%%%%%%%%%%%%%%%J3l6M7m8M8m8M9o2Q4r5J00j14J33j50J68j91K14k42
$$ 0 0 0 0 0 0 0 0 0 0 0 0 0 0 0 0 0 0 0 0 0 13 -23 24 -24 24 -24 25 -37 47 -48 52 -62 71 -79 89 -102 112 -130
38a30K73l02L38l80M19m58N06n61O23o90P58q34R21j014J115j231J360j503J669
$$ -130 143 -159 179 -201 218 -240 266 -295 328 -362 396 -438 483 -531 584 -647 713 -790 879
57H79j857K074k329K633l008L475m073M884o052P864j1089J8583o9115j8748J14267
$$ 879 -978 1096 -1233 1400 -1608 1867 -2206 2678 -3374 4490 -6599 11984 -57131 -75879 38388
72C8388K7589R8294J08669r6097k27999l0446N8105j19993j43895J29766K36842
$$ 38388 65977 164271 272940 176843 -51156 -81602 -23497 -143490 -287385 -157619 79223
83G9223K6595j05626N9763J26857q8930j71205L7922Q7888p7459p1109O9811K8628
$$ 79223 105818 192 59955 186812 97882 -73323 -35401 52487 -24972 -96081 -26270 2358
95B358p1757k2659O3384N2395J4862L1553N2640j7764j02297o0292K7307M955
$$ 2358 -69399 -92058 -28674 23721 38583 70136 122776 105012 2715 -57577 -30270 -25315
107b5315l6257m194K8999L2963K7604q495j4375L9913L8684k9656m8125j6855
$$ -25315 -61572 -65766 -36767 -3804 23800 15305 930 40843 79527 49871 1746 -15109
119a5109j200j0209l0253j3465M4284N0818M358O669J6319k8545l7429J1541J2212
$$ -15109 -16309 -26518 -56771 -70236 -25952 24866 29224 35893 52212 23667 -13762 -2221 9991
132I991k7363j4576L1938L2171k7492n0913J5008N3491l332k3424L0875K1040
$$ 9991 -17372 -31948 -10 32161 4669 -46244 -31236 22255 18923 -4501 26374 47414
144D7414l9711l4414M686Q002N19L708P814Q494J076R76P972q744k4040P558L0320
$$ 47414 7703 -26711 -22025 -14023 -13504 -9796 -1982 6512 7588 8564 16536 7792 -16248 -8690 21630
159B1630k513k4187j0582r04L831Q552J392K294J8848J5967q121k3576j9692J916
$$ 21630 19117 -5070 -15652 -16556 -12725 -4173 -2781 -487 18361 34328 26207 2631 -17061 -15145
173a5145Q382j4533q577K8267J9475j1462l697J0627l852n888R163K495j8739
$$ -15145 -6763 -21296 -29873 -1606 17869 6407 2710 13337 9485 3597 12760 15255 -3484
186c484j6073P192J2381j5654j5653K7308L0470j1179j3368J5926L928k2625j2061
$$ -3484 -19557 -12365 16 -15638 -31291 -3983 26487 15308 1940 17866 21794 -831 -12892
199a2892M039J202k286K826L456l172k311J1482J2548q588r010J4595J2002j4408
$$ -12892 -8853 -7651 -9937 -7111 -3655 -6827 -9138 2344 14892 6304 -2706 11889 23891 9483
213I483j9140o026k79M041O057L171J068M383N031J959m349r22Q301J449j7246
$$ 9483 -9657 -15683 -15962 -11921 -5864 -2693 -1625 2758 7789 9748 5399 4477 12778 14227 -3019
228c019j3044O940L309q608l429J0580J2987J0416N075k295j1544j2254o04K726
$$ -3019 -16063 -9123 -5814 -14422 -17851 -7271 5716 16132 21207 18912 7368 -4886 -5490 -2764
242b764q384n021J4121J2219j0715r815P984R857k003l760M770M333l368p916
$$ -2764 -11148 -16169 -2048 10171 -544 -10359 -2375 7482 5479 1719 6489 10822 7454 -462
256d62m263n174l625O926R368l276n646Q713R342l986r252K110P748n29q455o049
$$ -462 -4725 -9899 -13524 -6598 2770 -506 -6152 2561 11903 7917 -1335 775 8523 7994 -461 -6510
272f510k332l235l7O328Q555N089O862J476j1121j1967Q40N973l373o690M154
$$ -6510 -8842 -12077 -12114 -5786 2769 7858 14720 16196 5075 -6892 -6052 -79 -3452 -10142 -5988
287e988J1906K597q613m490K391K029L270M398j271p477j000L005m218o698M714
$$ -5988 5918 8515 -98 -4588 -2197 -168 3102 7500 6229 -1248 -2248 757 -3461 -10159 -5445
302e445J0543J039r366l36Q161J448p003j591N952K164j821k073n912p879p7J0191
$$ -5445 5098 6137 -3229 -3565 4596 6044 -959 -2550 3402 5566 3745 1672 -4240 -12119 -12196 -2005
318b005P211j395J472O437j141j3697o245N269L336l416PN640K467k624j796k12
$$ -2005 5206 3811 5283 11720 10579 -3118 -9363 -4094 -758 -4174 -4167 1473 3940 1316 -480 -692
334f92j574J961O906J849p718n980L245J655n844j923Q102P214k227l850m39j2
$$ -692 -2266 -305 6601 8450 732 -5248 -2003 -348 -6192 -8115 -13 7201 4974 1124 685 673
350F73k579J226L294q36j752J555q70p007m101P003R459j745k856M201M255o103
$$ 673 -1906 -680 2614 1778 26 1581 711 -6296 -10397 -3394 6065 4320 1464 5665 9920 3817
366C817r013k223J048P15M047N402j6m916L26M519k100l086M245M815n237p898
$$ 3817 -5196 -7419 -6371 -5656 -1609 3793 3777 -1139 -813 3706 1606 -1480 2765 7580 2343 -5555
382e555Q06M564j453l556K403N408K031l90J46l464n583J932N906N33n479P32
$$ -5555 -4749 -185 -1638 -5194 -2791 2617 4648 4258 4404 940 -4643 -2711 3195 3728 -1751 -1019
398a019K073j218n661R14P325J973j910k42K332k705l722j513j148j119K547O943
$$ -1019 1054 -164 -5825 -4911 2414 4387 2477 2235 4567 1862 -1860 -3373 -4521 -5640 -3093 3850
414C850J178n777j461N868J61o060r57O031P48m300j349J3j429n96M235L170j902
$$ 3850 5028 -749 -2210 3658 3819 -2241 -3198 2833 3581 -719 -2068 -2055 -3484 -4080 155 3325 1423
431A423j94K714j528n583j272O247J442n306k479M501J283k224j303J769K709
$$ 1423 1229 3943 2415 -3168 -4440 1807 3249 -2057 -4536 -35 1248 -976 -2279 -510 2199
446B199Q88K665n63n887m902J888J573j016l50N789K852l384k692J976J739k514
$$ 2199 3087 5752 5189 -698 -5600 -3712 -2139 -3155 -3505 2284 5136 1752 -940 1036 2775 261
462B61k231J054J258p06K19j193j665j162M089N207j456k742Q30P68l479l505
$$ 261 -1970 -916 342 -364 -145 -1338 -3003 -4165 -76 5131 3675 933 1763 2531 -948 -4453
478d453J772L426J94k768Q15J702r04q79J410Q03o27K579K909l515p182k48M929
$$ -4453 -2681 745 939 -1829 -1014 688 -216 -1095 315 1118 491 3070 5979 2464 -4718 -4966 -37
495c7j211l256K406O267K90k859L91J03k585j128K254j43l324O97K630j654k251
$$ -37 -1248 -4504 -2098 4169 4459 1600 1991 2094 -491 -1619 635 492 -2832 -2135 495 -1159 -3410
512c410K369M805l20k739n84K415p46l475j331K55J253R92J382k90r68M2R41J760
$$ -3410 -1041 3764 3444 705 121 2536 1790 -1685 -3016 -2761 -1508 -516 866 576 -392 -350 591 2351
530B351j303n21M11O64l727k697K611L353r98k104K389K359r88j096O35j549j352
$$ 2351 1048 527 938 1602 -2125 -4822 -2211 1142 144 -1960 429 2788 1800 704 1339 -210 -1562
547a562J993K023k920l693K205K506j877j044L547L135k211j707J161n01l491
$$ -1562 431 2454 -466 -4159 -1954 552 -1325 -2369 1178 4313 2102 395 1556 1055 -2436
562b436k00K373p25n19K512J615k760k162K838K132j952j037J729O19l078j962
$$ -2436 -2636 -263 -988 -1507 1005 2620 -140 -2302 536 2668 716 -321 1408 2027 -1051 -3013
578c013P72L55l37K648J874l09j026J090l1k805j651J805J377j643j356J182J446
$$ -3013 -2241 -1886 -2223 425 2299 1990 964 2054 2023 -782 -2433 -628 749 -894 -2250 -1068 378
595C78q83m58R89J269R89K36L5k346k374p5N38n03L34J427K243l78j992J332J434
$$ 378 -505 -963 26 1295 2284 2520 2555 209 -2165 -2240 -1702 -2205 -1871 -444 1799 1421 -571 761 2195
614B195J80j523j631L67k80r18kJ32J20M67K465J261j283j402J60J315k139p38
$$ 2195 2375 852 -779 -412 -692 -1610 -1612 -1480 -1360 -893 1572 2833 1550 148 308 1623 -516 -1254
632a254J682J213l262j082J546J541j153L81L709L78k185q57P73l012k837J913
$$ -1254 428 1641 -1621 -2703 -1157 384 -769 -388 3321 3699 1514 657 1430 -1582 -4419 -2506
648b506K514q51p43K985K431k199j826R89M24j928M27J201j036k440K63J411j36
$$ -2506 8 -843 -1586 1399 3830 1631 -195 794 1218 -710 -283 918 -118 -2558 -2295 -884 -1020
665a020K04K626K205j348k749o5L41j437j012P60J004k34KR02J17r58J43K570
$$ -1020 -816 1810 4015 2667 -82 -147 194 -1243 -2255 -1495 -491 -725 -723 179 296 -662 -519 2051
683B051O78j903o17J84j098k491O8K446L56p16J701K332p41j413P56o26j275j638
$$ 2051 2729 826 209 393 -705 -3196 -3128 -682 -326 -1042 659 2991 2250 837 1593 967 -308 -1946
701a946J630o24j390J7K511R36j083J117J692n05k288k51p05m16j03O60O84n10
$$ -1946 -316 -940 -2330 -2313 198 1134 51 1168 2860 2355 67 -184 -889 -1305 -1408 -748 -64 -574
719e74j63J164P73j197l4J619R84j340j634R9j044j032k51J713J072J42P34J660
$$ -574 -737 427 1200 3 -31 1588 2572 1232 -402 -303 -1347 -2379 -2630 -917 155 297 1031 2691
737B691j338j519M90N70j571m91N14j19j450r2K356Q55j9O03M37n39n88j025n43
$$ 2691 1353 -166 324 894 -677 -1168 -654 -773 -2223 -2315 41 896 877 1480 1917 1378 790 -235 -778
756g78j097l6Q23J294R9m19N82O12L54j095P19M4j64j154o73k59j319O29J206
$$ -778 -1875 -1911 -1088 206 305 -114 468 1080 1434 339 1058 1102 938 -216 -889 -1148 -2467 -1838 -632
775f32J142K29L57J531m72k089r74Q32Rj102J55O10j50o80J014J094J71l44N67
$$ -632 510 739 1096 2627 2155 66 -908 -76 -67 -1169 -1014 -404 -554 -1234 -220 874 1045 701 1268
794A268L38r30j288J73p87r20P43J685Q14m25l25P44M58r30k72J59l26m81L30
$$ 1268 1606 676 -612 -439 -1226 -2146 -1403 282 1096 671 346 1090 1548 618 346 505 179 -302 28
813B8r07r24k20J974J257k17k34J098K47j240j465k23P2j056J02J152M63K60L15
$$ 28 -879 -1803 -2023 -49 1208 991 757 1855 2102 862 -603 -826 -754 -1810 -1708 -556 -93 167 482
832D82N96m21l18J238j56r58j314P6M71j362m8J035J134K92J38R94o87q69p73
$$ 482 1078 657 339 1577 1421 463 -851 -775 -304 -1666 -1714 -679 455 747 885 1879 1192 323 -450
851d50L91l89j215P41J358q85r24J176J133K07j03L57M5m5j635n96k8r60Q78N27
$$ -450 -59 -448 -1663 -922 436 -449 -1373 -197 936 1143 1040 1397 1442 1397 -238 -834 -862 -1822 -944 -417
871d17O16Q5J71J091m69j244P48K10r2j492J35m8Q5j075J264P12L12K70R93k77
$$ -417 199 284 455 1546 1077 -167 581 791 699 -793 -658 -706 -621 -1696 -432 280 592 862 1855 1578
891A578j331p26Q1K19r76p92J854j26L22L60M08K15o09L16P1l32j227J74n64l39
$$ 1578 247 -479 -398 -179 -1155 -1947 -93 -219 103 463 871 1086 477 793 864 532 -695 -521 -1085 -1424
911a424q8J298N66k62k61J201L78n02n80K48K3j598Q4j73k74j65J419J060n25
$$ -1424 -1512 -214 352 90 -171 1030 1408 906 326 574 597 -1001 -917 -1090 -1364 -1529 -110 950 425
930D25O27M82j4j262j274J18Q0o24L91O32O07K12M45O68o36l08l99K32r67n81
$$ 425 1052 1534 1520 258 -1016 -898 -818 -1442 -1051 -419 188 400 845 1513 877 569 170 402 -565 -1146
950a146M33J10j68k61J040L56K00m40M95j52J0m40nn26j47p12J433o70n07Q53
$$ -1146 -713 -603 -771 -1032 8 364 564 124 619 467 477 37 32 -494 -641 -1353 80 -590 -1097 -244
970b44P59K09j67K85M19m66q35m21l92m20l31Q26R07K17N12L99l11m06j137O11
$$ -244 515 724 557 842 1261 795 -40 -461 -853 -1273 -1604 -778 129 346 858 1257 946 540 -597 14
990A4J00j260J10Q34j61o97J209O25J91m53J35L7p78m33M47j45k14q53J349K93
$$ 14 114 -1146 -1036 -202 -363 -1060 149 774 965 512 647 684 -94 -527 -80 -225 -439 -1292 57 350
1010C50n55k06J269J40o85MN99k63p53n6m37n81K14J88Q22J39K9O34L27o35p19
$$ 350 -205 -411 858 998 313 317 916 653 -100 -156 -593 -1174 -960 -772 50 189 218 852 1179 544 -175
1031a75K53J45j298p6J64L71N79k15Q79O29l88k02J71j166o79J09K04j39K29P70
$$ -175 78 223 -1075 -1151 -987 -616 -37 -252 627 1256 868 666 837 -329 -1008 -899 -695 -834 -605 165
1051A65P64o38j4M31m67J15j39J58k95p24K36K03j012Q29P6Q79l08J73Q9R1j42
$$ 165 929 291 277 708 241 356 217 375 80 -644 -408 -205 -1217 -388 -312 567 259 432 521 612 470
1072D70j90k91j32m08m73l45R91j32Q06K77O02Mk72j23o52j373m21P58q4J084
$$ 470 280 -11 -143 -551 -1024 -1369 -378 -510 296 573 1175 1179 907 784 132 -1241 -1662 -904 -988 96
1092I6L76m9N85o92L23k99k68O3K45o94l17R3M04R5n11NP76J53m4l15P07J64k51
$$ 96 472 423 1008 316 639 340 72 135 380 -314 -631 -538 -134 -39 -550 -545 231 384 340 25 732 896 645
1115F45m03m38K78j068M3K43L00J12J291J93on96k87k03r24o48M76M42L81n83
$$ 645 242 -196 82 -986 -943 -700 -400 -288 1003 1196 1190 594 307 104 -820 -1468 -992 -550 -169 -752
1135g52J576j4L46n29K12o56p10N1l76J37l90N90M47M10n40O63j42O3n56k3k13
$$ -752 824 810 1156 627 839 183 -527 -476 -852 -715 -1105 -515 -68 342 -198 465 323 386 -170 -193 -406
1156d06O4J19q1j14k46k59O93K6J51M27M12L2l04K85n98n71k13j33J29l4o8J275
$$ -406 -342 -223 -304 -418 -664 -923 -230 -204 -53 374 786 818 514 799 201 -370 -583 -716 -587 -621 -689 586
1178E86m92J57J59Q3J40l01n69l44k6J1L46M04L71J33l55O77n16j09l14k89k61
$$ 586 94 251 410 493 633 332 -237 -581 -607 -596 -250 154 525 658 303 980 464 355 41 -248 -509
1199e09K77M59p19J8o2Q64n05P21r2j35M79m97k44l56l62j43N5M40J26K15JP09
$$ -509 -232 227 -492 -474 -536 328 -177 544 452 317 796 299 55 -301 -663 -806 -751 -311 -185 30 31 740
1221G40l05p11L89J77K79j201l2Q6k3k55M23P60J49L3J71j18l25j08o37L1j2L41
$$ 740 435 -276 113 290 569 -632 -664 -578 -601 -856 -433 327 476 509 680 562 237 129 -508 -477 -489 -148
1243a48J36k06K2K87K99j65L87o64K55O4p94K39p63N47J60J24M83q2n1J53J72
$$ -148 -12 -218 -196 91 390 225 612 -52 203 267 -527 -288 -1051 -504 -344 -220 263 181 130 283 455
1264D55n80o9M86j47l05l96P38m2p93L88NM99N38M1L10r68Q3o46J93n23L61N78
$$ 455 -125 -194 292 145 -160 -556 182 140 -653 -265 -260 239 777 818 1128 160 243 -403 -210 -733 -372 206
1286B06j37k7N7O28j96m02M58m47o53J67K79o66K77j7N39Q62q19M36m96O01n55
$$ 206 69 42 99 727 531 129 587 140 -513 -346 -67 -733 -456 -473 66 928 109 545 49 650 95
1307I5J4l84k18J5M7K81m63M78P8M02l40N27L2j36l0l95N4l17j61k40N82k48N08
$$ 95 109 -275 -493 -478 -431 -150 -613 -135 -57 345 5 532 564 428 398 3 57 -260 -421 -661 -79 -327 181
1330A81L28o3j60l01Q84l71m66p50M87k57k25P45l9L62O9K4L8L38n56l95J85n73
$$ 181 509 446 286 -15 869 498 32 -718 -231 -488 -713 32 -7 355 424 448 486 824 268 -127 58 -515
1352e15K19J06J78r3j1O6N68l88j70O21o0n31k3K08o19j86J19j0N20k44R59J67
$$ -515 -296 -190 -12 -105 -116 -50 518 130 -40 581 521 -10 -33 175 -444 -630 -511 -521 -1 -245 714 881
1374H81m59o25L10J37m02j61l73Q54m67j22M14J07L21K32n96K83l42l55L05k10
$$ 881 422 -203 107 244 -158 -319 -692 162 -305 -427 -13 94 415 647 51 334 -8 -363 -58 -268
1394b68k15K70J70k93M53k26N08l2j36l12O29k90q34k18K41Q3Q2N65j68K56l11
$$ -268 -483 -213 -43 -336 117 -109 399 367 231 -81 548 258 -576 -794 -553 -470 -388 177 9 265 -46
1415d6O53J50k50m19K26n43l99J95j96N13J10k03K54R12q41RL17n86j70k46N95
$$ -46 607 757 507 88 314 -229 -628 -433 -629 -116 -6 -209 45 957 116 125 442 -144 -314 -560 35
1436C5r7l99P15l75o0m27Q49J80R1n96J46l68K84n65L23m5L6L70K81p24P94M4
$$ 35 -62 -461 254 -121 -181 -608 241 421 512 -84 62 -306 -22 -587 -264 -309 -273 97 378 -346 448 492
1458D92l30K37n20o62O67l89K52l33O38L6K08j94j26O3J50k16L2m06J34k24K32
$$ 492 162 399 -121 -783 -116 -505 -253 -586 52 88 296 102 -24 39 189 -27 5 -401 -267 -491 -259
1479b59M24p5l39O54l5J0l23K13l9k50r9k71j21K72J06M2N77O7k50j28K73m83
$$ -259 165 90 -249 405 370 380 57 270 231 -19 -118 -389 -510 -238 -132 -90 487 554 304 176 449 -34
1501c4J89m49k71M99j49l42K36J74K83L23J09n15N57l59n31K94l05Q2M11k79M4
$$ -34 155 -294 -565 -66 -215 -557 -321 -147 136 459 568 53 610 251 -280 14 -291 -209 202 -77 -33
1522c3l1J65n2N70m16k77K65j92j37M3k53k23P69j92k2k96L86J92L50o24j83j7
$$ -33 -64 101 49 619 203 -74 191 -1 -138 -95 -348 -571 198 6 -16 -312 74 266 616 -8 -191 -208
1544b08j71J17j48M08j9m63L61M17j16L0j29L35n24M86q11K81m46M29O13r43O02
$$ -208 -379 -262 -410 -2 -21 -484 -123 294 178 208 79 414 -110 376 -435 -154 -600 -171 442 -501 101
1565A01M12n9p41Q62m54k8M0o2m07m27O81K23K07l13J57k66O6K5j62L79p77K68
$$ 101 513 454 -287 575 121 93 133 71 -336 -763 -82 141 348 35 192 -74 -8 17 -145 234 -543 -275
1587b75Q1r0j02LJ59O54k71l69K29K07K24n65L54m43J41k09l59M17j16L41m63
$$ -275 -194 -284 -386 -383 -224 430 159 -210 19 226 450 -115 239 -204 -63 -272 -631 -214 -330 11 -452
1608d52M93l05R83o61Knl77O26o36l60O92J14J35k50O6K76r7k17k86K11m22QO55
$$ -452 41 -264 719 58 60 55 -322 304 -332 -692 0 114 249 -1 65 341 244 27 -259 -48 -470 -462 193
1631A93m34n3O31j67j18L39k77L79m7q06L33N7o01K18lK35m4M89r1N2k78o5L98
$$ 193 -241 -294 337 170 52 391 114 493 446 -360 -27 30 -571 -353 -356 -121 -165 324 233 285 7 -58 340
1654C40k93M0l92l48L38L64J82l63K71M11l0l5m29pJ1o04J02N44k32K41K61o38
$$ 340 47 87 -305 -653 -315 49 231 -132 139 550 520 485 56 49 60 -544 -442 102 -130 111 372 -266
1676b66M33N60r73K79M35l68k36Jm43L25L92l87O47J41n93M5K10k0Q2j73n78M42
$$ -266 167 727 -246 33 468 100 -136 -135 -578 -253 139 -248 399 540 -53 -8 202 182 264 91 -487 -45
1698d5K36n87J09M95j66J59l26K55J75k53K75l8q00L46p4L36l24L78mJ14l41N96
$$ -45 191 -396 -287 208 42 201 -125 130 305 52 327 289 -511 -165 -239 97 -227 151 147 261 -80 516
1720E16m15L37o51J72m14K90K42n07N30l87J94K1K21J27k69N7K08r93L03M49m40
$$ 516 101 438 -213 -41 -455 -165 77 -430 100 -287 -93 -72 149 276 7 64 272 -721 -418 31 -409
1741d09M57k38K12M1j98K5O67k31l01M00q45m0R1J15j50K01P5j43j12O79J4k56
$$ -409 48 -190 22 63 -135 -110 557 326 25 425 -420 -460 -369 -254 -404 -203 -128 -271 -383 296 310 54
1763E4k71N6j01K38m43L46Jk10K76j62L14r6j59L01L07n96j58j26J69k07M10p7
$$ 54 -217 -161 -262 -24 -467 -121 -120 -330 -54 -216 98 2 -157 144 451 -145 -303 -429 -260 -467 -57 -134
1785a34K55l24J18M43lk33J73R6m88q5J40m47M56k9l74N66J79j33rk00J68J19
$$ -134 121 -203 -85 358 355 122 295 391 -97 -182 -42 -489 -33 -62 -436 130 309 176 167 -33 135 254
1807B54k38L69m90n56J113q50k92O96K71k14M33o22k15N07j12k96k13L89R9J25
$$ 254 16 385 -105 -661 452 -398 -690 6 277 63 496 -126 -341 166 54 -242 -455 -66 33 158
1827A58k15j53L64p25O26j44k9O2l14n3K99J77k53j25M46m40K87j21j52M06m46
$$ 158 -57 -210 154 -571 55 -89 -118 -56 -370 -423 -124 53 -200 -325 121 -319 -32 -153 -305 101 -345
1848c45K04k83p9L79J14Rl06K51J95L56l03l37L86m2J0m15j53M14j45K8k3J68
$$ -345 -141 -424 -503 -124 -10 -1 -307 -56 139 495 192 -145 241 199 209 -206 -359 55 -90 -62 -85 83
1870H3k40p1J44O98q51O1P52p17O03o70J47r7L45K82l70j63l56K20L59l26PK50
$$ 83 -157 -228 -84 614 -237 -176 576 -141 462 -208 -61 -158 187 469 99 -64 -420 -200 159 -167 -160 90
1892I0M20j264L81M96k7j80K21L22JQ7p44P49l01m00L59n11O22l22N7p25N58P31
$$ 90 510 -754 -373 123 96 -84 137 459 460 547 -197 552 251 -149 210 -301 321 -1 56 -669 -111 620
1914F20o91J34J92o13K61l46O17k77j25K55k66M61n28N03j58K17J79j91l11j74
$$ 620 -71 63 255 -358 -97 -443 174 -103 -228 27 -239 222 -306 197 39 256 435 244 -67 -241
1934b41K27OJ21J54Q7k37j13L74n71N53No63O8N8J77np5K75k42M82n60mK18N03
$$ -241 -14 -8 113 267 354 117 4 378 -193 360 365 -298 -230 -172 5 0 -75 200 -42 440 -120 -124 94 597
1958E97n65m18Q16q65K38j73K45n0P5L73k68j46J0N39l79N02n85r5J59J48l63
$$ 597 32 -386 430 -435 -197 -370 -125 -175 -100 273 5 -141 -131 408 29 531 -54 -149 10 158 -205
1979b05K54J12J01J27p80L29K65q70O69j23l11K12J36j57J07M32J19l02l65J38
$$ -205 49 161 262 389 -391 -62 203 -667 2 -121 -432 -220 -84 -241 -134 298 417 115 -250 -112
1999a12ok78K93j86O35p94L92k85L02j13K40j43k59k99Q29k68M10Ml11k63j41
$$ -112 -118 -396 -103 -289 346 -448 -56 -341 -39 -152 88 -55 -314 -613 216 -52 358 362 51 -212 -353
2020c53Q22q08N22O4j14M1K43k66j40R1J57m03J23j9m91Q37l66O56o74J4P6K11
$$ -353 469 -339 183 247 133 174 417 151 11 102 259 -144 -21 -40 -531 306 -60 596 -78 -64 12 223
2042B23o84P63m5o19M26l29P94l79q2L64n31k17M93q6l76K03n72R15q58O53j58
$$ 223 -461 302 257 -362 64 -265 529 150 68 432 -99 -316 177 91 -285 -82 -654 261 -597 56 -102
2063a02N30j99J57l29j73M20o4k33L38l38K19Jm69J04k29J08Q27n19P9o7n14K71
$$ -102 428 229 386 57 -116 304 240 7 345 7 226 227 -242 -138 -367 -259 568 49 128 61 -453 -182
2085a82N1L0k93Q9O72m70j35M56o76O33J59n31o1N73n75K17K88K24j8l09J26k30
$$ -182 -131 -101 -394 -305 367 -103 -238 218 -458 175 334 -197 -258 315 -260 -43 245 469 451 142 268 38
2107C8P0K05l6m06L89l55l66M10l89K37K31k41M31l19M9K78o60N34j07Rp5r2o
$$ 38 108 313 277 -129 260 -95 -461 -51 -440 -203 28 -213 218 -101 -52 226 -434 100 -7 2 -73 -165 -171
2130a71n8J89kr1M98j78l01O8k30K94J92l47J44j47L48j10K2k7J72l56K51J08
$$ -171 -229 -40 -42 -133 365 187 -114 -46 -276 18 210 -137 7 -140 208 98 120 93 265 -91 160 268
2152B68l27j29P2J77jm7k67O7N31n10P68j89m44L39m51N95q63L96L29o12j74O18
$$ 268 -59 -188 -116 61 60 13 -254 -187 344 -166 602 413 -31 308 -143 452 -411 -15 314 -298 -472 146
2174A46j30N56o58J06k42O28m48L12l94j63K63k29K09J43Lk81J24L75m32M11l1
$$ 146 16 572 -86 20 -222 406 -42 270 -124 -287 -24 -253 -44 99 102 -179 -55 320 -112 299 268
2195B68j89K19m64O29k84n17LO25k39o17L19M86r7J95l81RN33m32L48k81j28m09
$$ 268 79 298 -166 463 179 -338 -335 290 51 -566 -247 239 142 337 -44 -35 498 66 414 133 5 -404
2217d04J44O74j62K01j41k82r6M71p71L70j05M93q56K47M74J21m77P6m74O27j38
$$ -404 -260 414 252 453 312 30 -66 405 -366 4 -101 392 -464 -217 257 378 -99 -23 -497 130 -8
2238hn5p1L45n44O69k05l5Q9j16m24J91k35L03J03k36o0J08J11K46j47P1o42M39
$$ -8 -63 -134 211 -333 336 131 96 185 69 -355 -164 -399 -96 7 -229 -289 -181 -70 176 29 100 -542 -103
2261a03L14J21l5l47j03N3j10l78O16m2M42k83j30l5M38j78m2P1j66j91M6K77
$$ -103 211 332 297 -50 -153 -100 -210 -588 28 -14 428 145 15 -20 418 240 198 269 103 -88 -42 235
2283B35L6l22r6J36k10M46q9m24K94j43J80l16N25J17k77p61N19M8J99L2k78K00
$$ 235 271 -51 -147 -11 -221 225 136 -288 6 -137 43 -273 252 369 92 -669 -150 -102 97 129 -149 51
2305E1K55o81J53j13K57l5j16k12L97N46m03j43L11k84k96M11j16K41j14m64Q81
$$ 51 306 -375 -222 -335 -78 -113 -229 -441 -44 502 99 -44 267 -17 -313 98 -18 223 109 -355 526
2326E26l36l40k23J72O94l99r2J81j2l58n3M00l60L58l48k48O31k84K16m56O7
$$ 526 190 -150 -373 -201 493 94 2 183 171 -187 -240 160 -200 158 -190 -438 193 -91 125 -331 -264
2347b64L12k55m6j26L60l74L14M61k95o6J21l71L48K3n6o6r7R8L05n48L59K25
$$ -264 48 -207 -253 -379 -19 -393 -79 382 87 21 142 -229 119 142 86 20 -77 21 326 -222 137 362
2369C62R0j43o00K90j04M08n31K39L41j025P01L92k99o8L4J11q4J68o0J74k9l23
$$ 362 452 309 -291 -1 -105 303 -228 11 352 -673 28 420 121 53 87 198 114 282 222 396 367 44
2391D4k11L45p32L13j52K60P2K68L3k70K9l82L87N3l60K26M0m04P81m15K04L33
$$ 44 -167 178 -554 -241 -393 -133 -61 207 240 -30 -1 -383 4 57 -303 -77 -37 -441 340 -75 129 462
2413D62n96M08k54M86j169O06K18j31L84l61M1l57M99k71P7K97j67l40J97j38
$$ 462 -134 274 20 506 -663 -57 161 30 414 53 94 -263 236 -35 42 339 172 -168 29 -109
2433a09R5k35k94O72k21K70j79k22M04j33J06l89k44j11L82j00L02j48K2K10L38
$$ -109 -14 -249 -543 129 -92 178 -1 -223 181 48 154 -235 -479 -590 -208 -308 -6 -154 -132 78 416
2454D16n41L21k47K78l50M57l32RK49j96q5J77L0l30J36l48N53O1j13P0m78K09
$$ 416 -125 196 -51 227 -123 334 2 11 260 64 -21 156 186 -144 -8 -356 197 258 145 215 -263 -54
2476e4Q7K76J90k49k98KO4K34l32M84k06m87N8J17K7K45j37J82k20j2J00J3m07
$$ -54 33 309 499 250 -48 -46 18 252 -80 404 198 -289 -231 -114 -87 158 21 203 -17 -29 71 84 -323
2499c23L93j15l50K69n71J026m96O14p23J24N3l8N16k41n75J98J29r4K61K89m05
$$ -323 70 -45 -395 -126 -697 329 -167 447 -276 -152 -99 -137 379 138 -437 -239 -110 -204 57 346 -59
2520e9M22l73L12J13m45L35l17l63O2M14L95m93n59N77J14j32l24M99N4l15q5
$$ -59 363 -10 302 415 -30 305 -12 -375 -313 101 496 3 -556 21 135 3 -321 178 232 -83 -168
2541a68L31P2q35R57k05j39K19m13K35j71k15k80L57M27q6k14K24p71L89n2M23
$$ -168 163 235 -600 357 152 13 232 -181 54 -117 -332 -612 -255 172 86 -128 96 -675 -286 -338 85
2562H5k35J23M9k21N9k50L42p6j9J95N3K48n83K09j43L79k04J83k44j93M0q2N4
$$ 85 -150 -27 22 -199 -140 -390 -48 -124 -143 52 105 353 -230 -21 -164 215 11 194 -50 -243 -203 -285 -231
2585b31K02k5n1m31Q80l13l9k97L08k42L4R9K18Ql98L42l36K84m73R68k99k18
$$ -231 -29 -54 -105 -536 344 31 -8 -305 3 -239 -205 -106 112 120 -278 64 -272 12 -461 507 208 -10
2607a0J12k97N60o34K99k32m1K18oj98N81K14j82l55j12M12k37k28N5k07L96j18
$$ -10 102 -195 365 -269 30 -202 -243 -25 -31 -229 352 566 384 29 -83 329 92 -136 -81 -288 108 -10
2629a0K61p02N63o9l71J76J28r9J25l18J34N6N2m4l2m29P76l74n5L51L70j034
$$ -10 251 -451 112 43 -328 -152 -24 -123 2 -316 -182 -126 -74 -118 -150 -579 197 -177 -232 119 489 -545
2651e45K37j0L01j29m9K14m1n1M23m55M91l33J74j31m20M37J31m28k94L37J12
$$ -545 -308 -318 -17 -146 -195 19 -22 -73 350 -105 386 53 227 96 -324 113 244 -184 -478 -141 -29
2672b9J04n18Q88j36m07R9K7K45J32j17l16j64K78m23L8O16q52M91L55n94p7L79
$$ -29 75 -443 445 309 -98 1 28 273 405 288 -28 -192 86 -337 -299 317 -535 -44 311 -283 -360 19
2694A9l70M73l03M13L8l14J34l91K46q6K93m54N69J07k59p4K7o8K38P6j63j27
$$ 19 -351 122 -181 232 270 -44 90 -301 -55 -141 152 -302 267 374 115 41 68 0 238 314 151 24
2716B4L93k66J90n40N90j097L25K41N08o01O5K18M33n28m0kM14R6o20M41l58n7
$$ 24 417 151 341 -199 391 -706 -381 -140 368 -233 -168 50 483 -45 -85 -87 327 423 -197 244 -114 -171
2738a71p2J36k2L84n74R8LL05K01l44l61M99j65q6J28l03L62m93K18O17k64J74
$$ -171 -243 -107 -129 255 -319 -221 -218 87 288 -56 -417 82 -83 -169 -41 -344 18 -475 -257 360 96 270
2760B70k36j70J6K64J51l81J12j19J51r0N8J60j75l28N95k53k42J8k63N15k27
$$ 270 34 -136 -120 144 295 -86 26 -93 58 -32 26 186 11 -317 278 25 -217 -199 -462 53 -174
2781a74L8K39k84J42K48k56K82K3m30M89n19J38m7l84M13N36l36k80O66k46k50
$$ -174 -136 103 -181 -39 209 -47 235 258 -172 317 -202 -64 -111 -495 -82 454 118 -162 504 258 8
2802HL6k99O1O21p07k23N33%l82K05N7M08n83K48J05K25j11l70L35L78p45P25
$$ 8 44 -255 -194 427 -280 -503 30 30 -352 -147 -90 318 -265 -17 88 313 202 -168 167 545 -200 525
2824E25n08K4K35m26j57O17k69j9R6O4nJ55k7o55k01O79J66p02O06n42M53l74
$$ 525 17 41 276 -150 -307 310 41 22 118 182 177 332 305 -350 -551 128 294 -408 198 -344 109 -265
2846b65J16Q2O4j82L90n00K88r5j28J22J4L81k90oj05%L26o2n87N10K80j86l09
$$ -265 -149 -67 -3 -185 205 -295 -7 -102 -230 -108 -94 287 -3 -9 -114 -114 212 150 -437 73 353 167 -142
2869a42M69j94o31P32r1j45q00J370k59J91p60J40N31k79j4q1J58l6q0l92L75
$$ -142 327 133 -498 234 143 -2 -802 568 309 500 -260 -120 411 132 118 37 195 159 79 -313 62
2890F2J21k00j11J56K05m10J35n9K95k08J55l76K59l7j23N85l87j04J26M51m28
$$ 62 183 -17 -128 28 233 -177 -42 -101 194 -14 141 -235 24 -13 -136 449 62 -42 84 535 107
2911A07k7K93k92k12K94m11N07k03pj52L41q4k12K79l74N40m85L25m97J68K59
$$ 107 80 373 81 -131 163 -248 259 56 49 -103 238 154 -58 221 -153 387 -98 227 -270 -102 157
2932A57J81k41j88M8J27j69N78n57O1O3k90J50N36n45J49K76l90N7J11l78l3L02
$$ 157 338 97 -91 -43 84 -85 493 -64 -3 60 -230 -80 456 -89 60 336 -54 3 114 -264 -297 5
2954EL9k76LL7k10N49n70J95L16L89j14o51O66l34j83J95j50o4L05j40r9K92Q6
$$ 5 44 -232 -229 -192 -402 147 -423 -228 88 477 363 -288 378 44 -139 56 -94 -158 147 7 -92 200 286
2977B86l55Q3N2N3K32k82j17K2j27k01O67l74M33q36M19M14nK12m86k13N56r48
$$ 286 -69 14 66 119 351 69 -48 -26 -153 -354 313 -61 372 -464 -45 369 364 576 90 -123 433 -515
2999e15L74L1L70l70J87j75k77N75j94K34m47o2N11j57j87L21j11N6l23Q6O7j86
$$ -515 -141 -110 260 -110 77 -98 -375 200 6 240 -207 -269 242 85 -102 219 108 164 -159 -73 -6 -192
3021a92K35k07j80K1M73L54o39P9J33J25O0M4l64k65J52M26n00K18j95L9j7j39
$$ -192 43 -164 -344 -323 150 504 -135 -56 77 202 262 306 -58 -323 -171 255 -245 -27 -222 -183 -200 -339
3043c39M34J75m32L01o0K05o9n0M7q5n13K77M48j83k17L34o0n20R8K89M5r6j53
$$ -339 95 270 -162 139 79 284 215 165 212 127 -386 -109 339 156 -61 273 213 -307 -209 80 125 29 -124
3066a24M97q1m35K69n3K13j82J17n64K99l59O43k96K27k04m43O37K13o7m69k0
$$ -124 373 292 -143 126 73 286 104 221 -343 -44 -403 240 -56 171 -33 -476 161 374 307 -162 -182
3087a82N32l42j13q2n2L8M52l27P3n0J04j69R4K91L12o04O65m79l60L69o2k85
$$ -182 350 8 -105 -187 -239 -201 251 -76 -3 -53 51 -118 -24 267 579 -25 640 161 -199 170 108 -177
3109a77O8L33J78n92J03j88O08l98k17N05K29n19K93j70L46o49L37n04P95j49
$$ -177 -109 224 402 -190 -87 -275 333 -65 -282 223 452 -67 226 56 402 -247 90 -414 381 232
3129B32J69o7j31P1q28N35J44J1k85q7M62Ol63N95k38j80N0k95J40j91M77k91
$$ 232 401 334 203 274 -554 -19 125 136 -149 -236 226 232 -131 464 226 46 96 -199 -59 -250 227 -64
3151f4J53n61J52j80K60j88P8J56K41K05o45O23r3k45M02l56j04j4K57k15l2K50
$$ -64 89 -472 -320 -500 -240 -428 -350 -194 47 252 -393 230 137 -108 294 -62 -166 -180 77 -138 -170 80
3173H0M7k01n0j61L2J72J3L43m70j96L72K27m15p2N20j20k79J86j88k76N55k18
$$ 80 127 -74 -124 -285 -253 -81 -68 275 -195 -391 -19 208 -207 -279 241 121 -158 28 -160 -436 119 -99
3195i9j48J27q5R27k45j02k86j6j97l1K35Q2J35j09Ok45K91o58O72M3k59K07l28
$$ -99 -247 -120 -205 722 477 375 89 73 -124 -155 80 162 297 188 194 -51 240 -418 254 297 38 245 -83
3218h3n0n0K83l60N38m21L60k81m5J75K14k16qP6j82l30P53m89J60J12r5k24O06
$$ -83 -133 -183 100 -260 278 -143 217 -64 -109 66 280 64 56 132 -50 -380 373 -116 44 156 61 -163 443
3241D43o76K44m59P83m41m4P6j32K7L4K46Q2M0j34m48M56M11j198N53N3L84k54
$$ 443 -233 11 -448 335 -106 -150 -74 -206 -179 -145 101 183 223 89 -359 97 508 -690 -137 -84 300 46
3263D6NJ2k01L00rk50L75m07K19j88M6J7L5L17q7m01K98k57K19k41M80m34j24
$$ 46 51 63 -138 162 153 -97 278 -129 90 -98 -52 -35 0 317 230 -171 127 -130 89 -152 328 -106 -230
3286b30P13n51M7m7J47l50Q0k48P96l40J75l06J88l30N00m90M42k31J19k62j25
$$ -230 483 -68 -21 -68 79 -271 -191 -439 357 17 192 -114 74 -256 244 -246 196 -35 84 -178 -303
3307c03j38L16r4O6P55k40k62m01L37j16K6l87M97K10k83n04N33L08m75m4L14
$$ -303 -441 -125 -219 -153 602 362 100 -301 36 -80 -54 -441 56 266 -17 -521 12 320 -155 -199 115
3328A15l11L52n42M25L94j42p42L78p7N7J35qK23m16jK32j23K39k3l71j17K19
$$ 115 -196 156 -386 39 433 291 -451 -73 -150 -93 42 34 257 -159 -160 72 -51 188 165 -206 -323 -104
3350a04R8j49j47J78K68k89K77j62L47n61J91L0n29L65P9k4K79o8J5l91J38K03
$$ -104 -6 -155 -302 -124 144 -145 132 -30 317 -244 -53 -23 -552 -187 -108 -132 147 79 94 -297 -159 44
3372D4q1p0j62J14OM55l76L94m86M11n37J76M76n59Q91k90j047K28L34L06l68
$$ 44 -37 -107 -269 -155 -149 306 -70 324 -162 249 -288 -112 364 -195 696 406 -641 -413 -79 227 -141
3393a41J05j27P0m78L77J66K06M9k68k11M06K71m31K32K39l03o20L78P9J74m54
$$ -141 -36 -163 -93 -571 -194 -28 178 227 -41 -252 154 425 -6 226 465 162 -458 -80 -1 173 -281
3414b81K28j37N64l98K02m30K62j19K75j0k53P61o73Jk84O1N61r27K79N90K72
$$ -281 -53 -190 374 -24 178 -252 10 -109 166 156 -97 664 -9 -8 -292 -231 330 -597 -318 272 544
3435E44l65Q3l28Q2J74l96k5j23P03o37J28M31n9J13p40K73J53P9J20M57q52M25
$$ 544 179 262 -66 16 190 -206 -231 -354 349 -288 -160 271 212 325 -415 -142 11 90 210 667 -185 240
3457B40m16K79j85J0J49r7K20j88m31M05K25L14j53j77l0n64Q07P2j99m10L45
$$ 240 -176 103 -82 -72 77 -20 200 12 -419 -14 211 525 372 195 165 -399 408 480 281 -129 216
3478B16m27J92k87N62p5mr3k32J5J50K82j61m63P35j85n49K84J82j54M62m44M9
$$ 216 -211 -19 -306 256 181 177 84 -148 -133 17 299 138 -325 410 225 -324 -40 142 -12 450 6 55
3500E5J30m91lM37p5m23M10j11J23M9K39o62N96m07mK72l45K17K5q2j6M6J53K25
$$ 55 185 -306 -309 128 53 -370 40 -71 52 101 340 -322 274 -133 -137 135 -210 7 32 -50 -66 -20 133 358
3524C58k44k93k60N63j73k16L58k95N42o1l50L89j77M1j02m15M8O60n73O91l89
$$ 358 114 -179 -439 124 -49 -265 93 -202 340 279 -71 318 141 182 80 -335 -287 373 -200 491 102
3545A02l04p9P20p74M62k29k06l7M34J34l00L0M0m70L02M12j28L88r17O01l28
$$ 102 -202 -281 439 -335 127 -102 -308 -345 89 223 -77 -47 -7 -477 -175 237 109 497 -420 181 -147
3566a47l8L44j10K57m84k40Q65q51K37r5M5J24M32m97j17M96m61j75J26O5K33
$$ -147 -185 159 49 306 -178 -418 447 -404 -167 -262 -217 -93 339 -158 -275 221 -240 -415 -289 -224 9
3587IL42k76J91l35K7O08q73M47m40L39l2N79n77L86o23M88J69n20j26l5N62n80
$$ 9 351 75 266 -69 -42 566 -307 140 -300 39 7 586 9 395 -228 260 429 -91 -217 -252 310 -270
3609b70K67M4L11o60L60K09m25M08l58M1j2K14P6l38J02Q8j28K5j73L16j10j87
$$ -270 -3 41 352 -308 52 261 -164 244 -114 -73 -85 129 205 -133 -31 57 -71 -46 -219 97 -13 -200
3631b00L35j78j32M68p1k36J77k73l3J38Q6j13j78m6Q74k97k72l53M72j67Q7j34
$$ -200 135 -43 -175 293 222 -14 163 -110 -143 -5 81 -32 -210 -256 618 321 49 -304 168 1 88 -46
3653d6M17j048N21K79j99m14M48M11k74N8l48M05j29j9j35N32k71N2k64l11P91
$$ -46 371 -677 -156 123 -76 -490 -42 369 95 153 -195 210 81 62 -73 459 188 240 -24 -335 456
3674D56j03n14N51p21M22l62K43M6j51L77l27L88r14M76J00M2j28j9p0J70J50
$$ 456 353 -161 390 -331 91 -271 -28 18 -133 244 -83 305 -609 -133 -33 9 -119 -138 -208 -38 112
3695A12m50O85n9m14l48M29K01K57n20p8M78J18m21j37j87M37k0l21j60J90J16
$$ 112 -338 347 288 -126 -474 -45 156 413 -107 -185 293 411 -10 -147 -334 103 83 -238 -398 -208 -92
3716i2J54P3R1p33M75K0j92Q59q86m7Q33o33J27Lk25K03J12k38N8n41P79M0l31
$$ -92 62 135 226 -507 -32 -12 -204 655 -231 -278 555 -78 49 52 -173 30 142 -96 -38 -579 200 240 -91
3739i1j7K77L6l78M08l27P9l06L14k06N21J08j96l53m6K29l49L50o67N22k7J13
$$ -91 -108 169 205 -173 235 -92 -13 -319 -5 -211 310 418 222 -131 -177 52 -297 53 -614 -92 -119 -6
3761fj08r6j94P67k06j0j26j98N24j8p50O88m37Q7j50N98m06K17k02lo69R53n45
$$ -6 -114 -210 -404 363 157 147 21 -177 347 329 -421 267 -170 -83 -233 365 -41 176 -26 -29 -698 255 -290
3784b90M09k76L55j26j49o1L07K59l58k81M07m75J70K94p41R38k68m07M39r1O0
$$ -290 119 -157 198 72 -77 -138 169 428 70 -211 196 -279 -109 185 -556 382 114 -293 146 55 115
3805A15R7l71L60o48M16j65L22j85k38K00j94N37l73L6N11n73J10J01k3J14Q4
$$ 115 212 -159 201 -447 -31 -196 126 -59 -297 -97 -291 246 -127 -91 420 -153 -43 58 35 149 233
3826B33k0m39Q2L87J29m62L00n08P16l23j02j8m15M90J9j1L9L09k34m65P5Q11
$$ 233 213 -226 -144 243 372 -90 210 -298 418 95 -7 -25 -440 50 69 58 97 406 172 -293 -218 593
3848E93l30p68M53J50K68o23J54J71K35m4m81K04k6qk90Q64j048P56n12K69j67
$$ 593 263 -505 -52 98 366 -257 -103 68 303 259 -222 -18 -44 -52 -342 522 -526 230 -282 -13 -180
3869a80M87l26L8M49q24M36R2n0m71J02J81n4J09K75k85K9j58k81O95l04r1j54
$$ -180 307 -19 19 468 -356 80 172 122 -349 -247 -66 -120 -11 264 -21 8 -150 -431 264 -40 -131 -285
3891b85N31j22j36L2k7j83q2L28l94K88k0K33L09l26n55P38o80L89j01J35L9j85
$$ -285 246 124 -12 20 -7 -190 -272 56 -338 -50 -70 163 472 146 -409 329 -351 38 -63 72 111 -74
3913g4J13N10l66k99L15l08n0r4L88k16j92M50R9o60K28l35M30J02p4K74K20m16
$$ -74 39 549 183 -116 199 -109 -159 -253 135 -81 -273 177 276 -384 -156 -491 -61 41 -33 241 461 45
3935D5K94n3o50Q83R4o25J43N33l69K15k33p71N40l52M27Q8j89N41m62p7r5k6
$$ 45 339 286 -364 519 613 -12 131 664 295 510 277 -494 46 -306 121 209 20 561 99 22 -73 -99
3957i9K63j32l28J06N4M69J12l60M5j19j17O4j69M76q0j51m28L76J04R4L66n54
$$ -99 164 32 -296 -190 -136 333 445 85 130 11 -106 -42 -211 265 185 34 -394 -18 86 180 546 -8
3979hl4k58O18q44R81k91P8p5K85j51j95M4r7r0L83n52m8L83j33J50q4P4k7n77
$$ -8 -42 -300 318 -526 455 164 242 167 452 301 106 150 53 -37 346 -206 -254 129 -4 146 62 136 109 -468
4003d68Q00j20j12j38q6oN53l79k77L33N3l59K17J11L3q7j73K80N13p87q0J93
$$ -468 332 212 100 -38 -124 -130 423 44 -233 100 153 -206 11 122 155 68 -105 175 688 -99 -179 14
4025A4k30K68M34j020N78K68j59p2k27J37m05N36K61p3m17j59l15L44K63N17o23
$$ 14 -216 52 486 -534 44 312 153 81 -146 -9 -414 122 383 310 -107 -266 -581 -237 26 543 -80
4046h0L16L6l06Qj72q6L0J29Mj34L37k95O17M4o03K79l17N0J69L36m03o9j77O88
$$ -80 236 272 -34 -26 -198 -284 -254 -125 -121 -255 82 -213 404 448 -155 124 -193 -143 26 362 -41 -110 -287 401
4070D01l42j34n20P51k50K28o6m52j4J09N6j48Q2M01N55l98j31l8l9K78J07o69
$$ 401 59 -75 -595 156 -94 134 68 -384 -398 -289 -233 -381 -299 102 657 259 128 90 51 329 436 -233
4092b33N09m8n01L62J36K80p10K8P6k44J1K81QL29m83K50j96r0O50L4m02o17O90
$$ -233 276 228 -273 89 225 505 -205 -177 -101 -345 -334 -53 -45 284 -199 51 -145 -235 415 449 47 -570 120
4115A20NL45m70k24L59%J00J27R7m1l36l45M90M0n39l27L22r7L52M93j51n49J07
$$ 120 125 470 0 -224 135 135 235 362 459 418 82 -263 227 267 -272 -599 -277 -374 -22 471 320 -229 -122
4138a22j60L12K6m27L16J44J4L45l23l8k86j67N08J48m65k9J45K3K12j36L9l58
$$ -122 -282 30 56 -371 -55 89 103 448 125 87 -199 -366 142 290 -175 -204 -59 -36 176 40 79 -279
4160b79n7K08O84q10K55n2J33K55J89l47k00Q0K30l9n75M31m8N5p2J83j49M76
$$ -279 -336 -128 556 -254 1 -51 82 337 526 179 -21 59 289 250 -325 106 58 113 41 224 75 551
4182E51j157L96J64n51J37P58m58o4L35l66N67m43K36Q3k60j94N29l47o4k82O79
$$ 551 -606 -210 -46 -597 -460 298 -160 -224 111 -255 312 -131 105 188 -72 -266 263 -84 -148 -430 249
4203B49n86N38nk23l37N04k80P04m38l87Q17j022O75Mk37l44O50m04L75k95K01
$$ 249 -337 201 196 -27 -364 140 -140 564 126 -261 556 -466 209 213 -24 -368 282 -122 253 -42 159
4224A59l91L61J31m49J74P9K33l75j56j53O01p50J05%M85j50J72j29n17O98L38
$$ 159 -232 129 260 -189 -15 64 297 -78 -234 -387 214 -536 -431 -431 54 -96 76 -53 -570 128 466
4245D66l61l42N22l26k62L82r6K60l46J55l58O43j62j46q3l00L09L85R1n92M33
$$ 466 105 -237 285 -41 -303 79 -17 243 -103 52 -306 337 175 29 -54 -354 -45 340 431 -161 272
4266B72m5m80J67n8j53q2M53K31n24P8J56k9M49m84M98m51K40n24N5J37M69j45
$$ 272 227 -253 -86 -144 -297 -379 74 305 -219 -141 15 -14 435 -49 449 -2 238 -286 -231 -94 375 230
4288B30n93M59K09q47K28K93m80N79K7j32k05R0rK31m81L12mq8k53M68J68o27
$$ 230 -363 96 305 -542 -314 -21 -501 78 105 -27 -232 -142 -151 80 -401 -89 -93 -181 -434 34 202 -425
4310d25L75K58p6l05Rj6l5l45M25j93K74K15k94p4K06lK52j29k09L52l37M18m10
$$ -425 -50 208 132 -173 -164 -180 -215 -560 -135 -328 -54 161 -133 -207 -1 -4 248 119 -90 262 -75 343 -67
4333f7K23K00J6m7j71J82k95j12j34M09k32l91L06l1k32M39M95p21r8N20p51P83
$$ -67 156 356 372 325 154 336 41 -71 -205 204 -28 -419 -113 -144 -376 63 558 -163 -261 259 -492 291
4355B91k5k46k04K12j6l03K72L49j02j96k72L2M65j11j32j9J85j93j62J11L49
$$ 291 266 20 -184 28 12 -291 -19 330 228 32 -240 -208 257 146 14 -5 180 -13 -175 -64 285
4376B85l29j70J49N13q38J33M81l08N2r2J98j9l90K53K70m3m02j02N00m35MK23
$$ 285 -44 -214 -65 448 -390 -257 224 -84 -32 -124 74 55 -335 -82 188 145 -257 -359 141 -294 -290 -67
4398f7Q4K1J79j00k3k0j01J5r1L63r49O88m5K26l47M45m23q1L37j10N3j63J88
$$ -67 17 38 217 117 94 74 -27 -12 -103 260 -689 -1 -46 180 -167 278 -145 -226 111 1 54 -109 79
4421G9l64M85k79M23q11M58k36k33R11o38O9N09j80J94m74j45Q4k84J69K83j4
$$ 79 -285 200 -79 344 -467 -9 -245 -478 433 -205 -136 373 193 387 -87 -232 -148 -432 -263 20 6
4442FK81R9n30L12m79K72M95J58m54p22M65M36K0j75n7j89K98n43K91O7l01L16
$$ 6 287 386 -144 168 -311 -39 456 614 160 -562 -97 339 359 184 127 -62 236 -307 -16 51 -250 66
4464F6K37k40K04K2l35P16p85Q0R9J20J37k87J59l32k06J90o3L1M37r6n42J10
$$ 66 303 63 267 289 -46 670 -115 -35 64 184 321 34 193 -139 -345 -155 -218 -187 250 154 -388 -278
4486b78Q2M36P6m68p5N11o42M00K04n17P50p06J26N5J16k01L6p0J37k65O71k21
$$ -278 -196 240 316 -152 -227 284 -358 42 246 -271 479 -227 -101 -46 70 -131 -95 -165 -28 -293 378 157
4508A57j63Q2j47j12K76l49K37L4L44k49l15O9k8K3K17J65l59L25k57k79M58n9
$$ 157 -6 76 -71 -183 93 -256 -19 15 359 110 -205 -136 -164 -141 76 241 -118 207 -50 -329 129 70
4530G0M17k90l31M79k42M80n35j90k28L9O61n48K99l9q4J30m17L52L70k01p8P1
$$ 70 487 197 -134 345 103 583 48 -142 -370 -331 330 -218 81 42 -42 88 -329 23 393 192 114 185
4552A85j92KR3l98j52O60l28j16J07j5K5K35k96L28m68NQ11l04j97k86M42l9k96
$$ 185 -7 -5 88 -310 -462 198 -130 -246 -139 -154 -129 106 -190 138 -330 -325 486 182 -15 -301 141 102 -194
4575a94J65J17L64n13O53l06k82L9L9J44m7l59L57j42j9K63k67M09l88r4m5N3
$$ -194 -29 88 452 -61 592 286 4 43 82 226 179 -180 177 35 16 279 12 421 33 -61 -106 -53
4597e3L91l65m77J88J61L58l04K57M5l84K2L58j85R4k70M88n24Q1O45o03R9J87
$$ -53 338 -27 -504 -316 -155 203 -101 156 201 -183 -161 197 12 106 -164 324 -200 -119 526 -77 22 209
4619B09k3k11Q5l65J1R7L67K44m7r3j09L90p44K43n55P99k31j46K28j87n17k74
$$ 209 186 -25 60 -305 -294 -197 170 414 367 274 165 555 -189 54 -501 298 67 -79 149 -38 -555 -829
4641h29J061l97L93p8j71j61J65l36M47K56j70Pj28k02K01P7L12k32P8k67p9L4
$$ -829 232 -165 228 150 -21 -182 -17 -353 94 350 180 187 59 -143 58 135 447 215 293 26 -53 -19
4663a9J53J84p68m4L93m91O18K1q4L76K8jo80J17j54N92n50M53l3k47j58N54l99
$$ -19 134 318 -450 -494 -101 -592 26 47 -37 339 367 366 -314 -197 -351 241 -309 144 111 -136 -294 260 -139
4686a39pp9M54k40q5o6N66m13j67K8K03MJ12l6J28k95R2j92J83L27k69k37P6L46
$$ -139 -146 -225 229 -11 -96 -162 404 -9 -176 -148 55 59 171 135 263 -32 60 -132 51 378 109 -128 -52 294
4710B94M9k5m12R0L69k82j24L9j8L90l66P7Pm65L61L51k65J27j62p1K98l81J84
$$ 294 343 318 -94 -4 365 83 -41 -2 -20 370 4 81 88 -377 -16 335 70 197 35 -36 262 -119 65
4733F5On6l30N60l21p5N84n64M01j81K1m2K69o83K50O9l95O15m08j17Q2J76J82
$$ 65 71 15 -315 245 -76 -151 433 -131 270 89 110 68 337 -346 -96 -27 -422 193 -215 -332 -250 -74 108
4756A08n12K90J40k62K72J18k87M3J67j5J12j2n95N78j09N4k65J69K60j54j22
$$ 108 -404 -114 26 -236 36 154 -133 -90 77 62 174 162 -433 145 36 90 -175 -6 254 100 -22
4777b2l1l44Q46n51J68m16L58J09k24j54j08R60n56M4l85K93J67n42k20P70l81
$$ -22 -53 -397 449 -102 66 -350 8 117 -107 -261 -369 591 35 79 -306 -13 154 -388 -608 162 -219
4798b19K94J05l09K56N78j378P43k29J69j50M95m6J8j98N2l56k95M75O5k01J45
$$ -219 75 180 -129 127 705 -673 70 -159 10 -140 355 309 327 129 181 -175 -470 5 70 -131 14
4819A4L01k79N6n82K42k8K29j00M12l10l73M34N23l90R8j85l2M0K60k00k67L8
$$ 14 315 36 92 -490 -248 -276 -47 -147 265 -45 -418 16 539 149 247 62 30 70 330 130 -137 -99
4841i9mK26j91j1j05M93j5m48J29nn9M54l33k76N97l57J92k66k32J46k11N22J90
$$ -99 -103 123 -68 -79 -184 309 294 -154 -25 -30 -89 365 32 -244 353 -4 188 -78 -310 -164 -375 147 337
4864C37l73l87Q27o83j65L67J00J41P6k16J06l91j16N96k37K00j03l41l8J1L81
$$ 337 -36 -423 404 -279 -444 -77 23 164 240 24 130 -261 -377 219 -18 182 79 -262 -300 -289 92
4885I2m4O5n70M62P6k95k01M98l65L56k63K73j05M38K1p11L02j60N8j72J02j4
$$ 92 48 113 -457 5 81 -214 -415 83 -282 74 -189 84 -21 417 438 -273 29 -131 -73 -245 -143 -157
4907a57m7L71j46r4J65J9k29K56n17M18J86m73QpL93l06L8P6R2k03L78J56k20
$$ -157 -204 167 21 -73 92 111 -118 138 -379 39 225 -248 -240 -247 146 -160 -122 -46 46 -157 221 377 157
4930A57Q5o62N13J10j30p2n85M69O8N3J74k58q8M05k83p0J04J90M82o83j38l42
$$ 157 242 -420 93 203 73 1 -584 -115 -47 6 180 -78 -166 239 -44 -114 -10 180 662 -21 -159 -501
4952e01j13L99J38J51J26j47k6J21j97R3j78l40P14K03l59l61J46r0L15r4l6J86
$$ -501 -614 -215 -77 74 200 53 27 148 -49 44 -134 -474 240 443 84 -277 -131 -221 94 0 -36 150
4974A50j82j42R9l4J25k81Q0j93P34p8j79k33j58M49K6o74Q76m22L89j04M2l72
$$ 150 -32 -174 -75 -109 16 -265 -185 -378 356 278 99 -134 -292 157 183 -491 385 -37 352 248 290 -82
4996h2L69n00m3K72L00q3n54O07J49j54K77p97K84J41l27p9j15K49N5rK15l73
$$ -82 287 -213 -256 16 316 233 -321 286 435 281 558 -239 45 186 -141 -220 -335 -86 -31 -40 175 -198
5018a98M94k60K71l59Q9K08j81K21j02l97L32J12p51M65n3L99l69k29M76j74q2
$$ -198 296 36 307 -52 37 245 64 285 183 -214 118 230 -521 -56 -109 290 -79 -308 168 -6 -88
5039h8j23L61n82M94P6m53N17K0j70M9L28o33M45k67M8N0j92K82j69J18p0p9J04
$$ -88 -211 150 -432 62 138 -315 202 222 52 101 429 -204 241 -26 22 72 -120 162 -7 111 41 -38 66
5062F6m59j56Q86n0k23k91m9O77j05k82k69N36m23k65N62k03j80J20N40p83M93
$$ 66 -393 -549 337 287 64 -227 -276 401 296 14 -255 281 -142 -407 155 -48 -228 -108 432 -351 142
5083A42l94M23j45N97n98o42R76m55k96L9M27l85M94O3j38J44o24L78ml08J56
$$ 142 -252 171 26 623 25 -617 359 -96 -392 -353 74 -311 183 246 108 252 -372 6 2 -306 -150
5104a50q1L4rR9Jm2J65O1Q7M3N8l75K2oK62p48O97r0p6m6m6Q5J4n8J32M19p6j50
$$ -150 -231 -197 -206 -107 -106 -148 17 78 165 208 266 -109 -87 -93 169 -579 118 28 -48 -94 -140 -55 -41 -99 33 452 376 226
5132B26l10PR7l55O72J84q84J29j14N71k88K46j24j33l79K34M51k21j68q8K84
$$ 226 -84 -77 20 -335 337 521 -363 -234 -348 223 -65 181 57 -76 -455 -221 230 9 -159 -247 37
5153C7no6o1k87M81J7j92K76n17K10L26l64K86l25K30m25K68Q5J50K05o08j23
$$ 37 32 -34 -95 -382 99 116 -76 200 -317 -107 219 -145 141 -184 46 -379 -111 -26 124 329 -279 -402
5175d02P20q42L76J54j81K83p4Jq9J65k8k94j76J73K31j1k2j59O78o75M5K99k16
$$ -402 318 -524 -148 6 -175 108 34 35 -54 111 83 -211 -387 -214 17 6 -16 -175 503 -172 -127 172 -44
5198d4q0o8P49r17L25P7lM12k43O2j16pj34p8J63K75l46j05J44J35n63N39L35
$$ -44 -124 -192 557 -360 -35 42 39 451 208 270 154 147 13 -65 98 373 27 -78 66 201 -362 177 512
5221E12j198N85K9k75L49M08q86M33P2k23L82n9k76q1N51J65m56J3j35M77m34
$$ 512 -686 -101 -72 -347 2 410 -476 -43 29 -194 188 129 -147 -228 323 488 32 45 -90 387 -47
5242d7j03m4k76L44j53J30K20Q3l8n02N25k38J14m04L53l1R3n12L08j46M63k79
$$ -47 -150 -194 -470 -126 -279 -149 71 154 116 -386 139 -99 15 -389 -36 -67 26 -486 -178 -324 139 -140
5264a40m17N28l3O19n0r34M70j05j1J86j90K90L03j7n97J41k96k54M38j04K69
$$ -140 -557 -29 -62 557 507 -427 43 -62 -73 113 -77 213 516 499 -98 43 -253 -507 -69 -173 96
5285I6k91L96k89M05l24l7l70K41R4l20Q40o33L98K2p0k98qL36m43M58j57k30
$$ 96 -195 201 -88 317 -7 -44 -414 -173 -79 -399 441 -192 206 228 158 -140 -148 188 -255 203 46 -184
5307a84M09L34n55k59L92j50K00k37J19j30L54k30NM9n20K11J88m86M72J01l16
$$ -184 225 559 4 -255 137 -13 187 -50 69 -61 293 63 68 117 -403 -192 -4 -490 -18 83 -233
5328b33L62mM8j81n0J16l19L17m33K79j03K35K41j38pQ1j0P0q70N67J54j36k10
$$ -233 129 125 173 -8 -58 58 -261 56 -377 -98 -201 34 275 137 130 211 201 271 -599 -32 122 -14 -224
5351b24M68p5n09L73k44L43l4k8n0n27O15k8j7l0j55K43L4l12M94j36j58J47J
$$ -224 244 169 -340 33 -211 132 98 70 20 -507 108 80 63 33 -122 121 155 -157 337 201 43 190 191
5374A91l21K01J03J13K61o19n51J035m32L30o46M34l42M26M4l45O3J3L42m19L51
$$ 191 -130 71 174 287 548 -71 -622 413 -19 311 -335 99 -243 183 227 -118 -55 -42 300 -119 232
5395B32r3j63K53j91m3J48m97Q28m59k04%K88l29O71n34j30J79M80n33l2O5n2
$$ 232 139 -24 229 38 -5 143 -354 474 15 -189 -189 99 -230 441 -93 -223 -44 436 -97 -129 -64 -116
5417a16j07M43o66N46rnK10l07O30r77P46m48J3j5K91k29k14j25N84L13o48J41
$$ -116 -223 220 -446 100 91 86 296 -11 619 -358 388 -60 -47 -62 229 0 -214 -339 245 558 -90 51
5439E1L58l73j18l4K93q0k67j73P40k48N9q33L81K31k52L62n1q2J52J00p68O97
$$ 51 409 36 -82 -116 177 97 -170 -343 397 149 208 -625 -244 -13 -265 97 46 -36 116 216 -552 145
5461A45r63M89M09J23k16M5O5j14K54K11k41j88K83k17k68M61k58rL22l50o49
$$ 145 -818 -329 80 203 -13 32 97 -17 237 448 207 19 302 85 -183 278 20 11 333 -17 -666
5482f66M60J49L08m32P16o72K36J20l8m13j13L43l42K52M83O1o50K39L3R9l92
$$ -666 -206 -57 251 -181 535 -137 99 219 181 -232 -345 -2 -344 -92 391 452 -198 41 74 173 -219
5503b19L61J49j93K79l76P7n46L38N9j7M85k91o4r9p0M44j95o36O02j73M19K09
$$ -219 142 291 98 377 1 78 -468 -130 -71 -88 397 106 42 -57 -127 317 122 -514 88 -85 334 543
5525E43k59l36K07J2m24M39l84N24Po01k09P32l69L9J62o23J155o57K14j10m05
$$ 543 284 -52 155 167 -257 182 -202 322 329 -272 -481 251 -118 -79 83 -540 615 -42 172 62 -343
5546c43K43l27Q60m34P6O7J52m09J75M74n42J36K57l91k40K63m38N94k22L80k73
$$ -343 -100 -427 433 -1 75 142 294 -115 60 534 -8 128 385 -6 -246 17 -421 173 -49 331 58
5567E8k21L20j62J07k1K99o38J61OP9Q8J01lk45L55j20j54k9j14M4L47n17N17
$$ 58 -163 157 -5 102 81 380 -258 -97 -91 -12 76 177 174 -71 284 164 10 -19 -133 -89 258 -259 258
5590B58k84j97n9N07L8p68M10L62o53K31L86N9j65l86M87R3l41j2M61o50J09L03
$$ 258 -26 -223 -282 225 263 -505 -95 267 -386 -155 231 290 125 -261 226 319 -22 -34 427 -223 -114 189
5612A89m09N91k39n22O45l1l93J1P2L67l75K39K1j44J32j48R4L63m89L00o28M96
$$ 189 -220 371 132 -390 255 224 -169 -158 -86 281 -94 145 166 22 154 6 100 463 -26 274 -354 142
5634A42P1p3p5l44N00j8j90K25K2n17J57n01J308j000L47M51Q3l61k83k1j14P6
$$ 142 213 140 65 -279 221 203 13 238 260 -257 -100 -601 707 -293 54 505 588 227 -56 -77 -191 -115
5656a15L41n37J19J91j93L57M73m39l16L68l47J9j28K91p7P0%J35m69P11m63M51
$$ -115 226 -311 -192 -1 -194 163 636 197 -119 249 -98 -79 -207 84 7 77 77 212 -257 454 -9 442
5678D42q03J8P07n9n05l76P20l68J46k23K67J05l29L81L60o62J11R7j69J22L69
$$ 442 -361 -343 364 305 -200 -576 144 -224 -78 -301 -34 71 -258 123 483 -179 -68 29 -140 -18 351
5699C51k81l91L77n6k86J22L74n01L82k44K67k45J45P8j90M10l81K52L89k35l87
$$ 351 70 -321 56 0 -286 -164 210 -291 91 -153 114 -131 14 92 -98 312 -69 183 572 337 -50
5720e0J59L56p41K86P7k29j91M14k1k43o5L51N7k04j28M56m29O6N95n87k2Rj58
$$ -50 109 465 -276 10 87 -142 -333 81 60 -183 -248 103 160 -44 -172 284 -145 -79 516 -71 -93 -84 -242
5743b42k0J93j40P6M29J40m85q6J01K30P1m00k23K56K91k51K99k13n07O95j67
$$ -242 -262 -69 -209 -133 296 436 -49 -135 -34 196 267 -133 -356 -100 191 -60 239 26 -481 214 47
5764D7m5J74j18J26j21R6k23j24K76m02L65k36J95Q6P9m44M86n42M72mj46J74
$$ 47 2 176 58 184 63 159 -64 -188 88 -314 51 -185 10 96 175 -269 217 -325 147 143 -3 171
5786A71l4j35m40O1J12M02L48p92L10M57o63K75o1j97N76p75N26k29Q9m01R2M45
$$ 171 137 2 -438 -377 -265 137 485 -307 3 460 -203 72 11 -186 390 -385 141 -88 1 -400 -308 137
5808A37l13R2j54J32k27M58l45O64q71N20q6j0k24M09J14m13O13n33J78K3P0n06
$$ 137 -176 -84 -238 -106 -333 125 -220 444 -427 93 7 -3 -227 182 296 -117 496 -37 141 164 234 -272
5830b72J51q7M9k0N36k13k92p9J27L27J8J0J18n78M4M44r31P57r9O9k67LO72p94
$$ -272 -121 -208 -159 -179 357 144 -148 -227 -100 227 245 255 373 -205 -161 283 -648 109 10 79 -188 -185 487 -307
5854c07K61l2J21o0J89j7j11J05J37k74K80l57J7J69j92J65j13k23M17J76l77
$$ -307 -46 -78 43 -17 172 155 44 149 286 12 292 -65 -48 121 -71 94 -19 -242 175 351 -26
5875b6r2L72l20N07J4o13P8k37J15j82J001o08j40j09P71q44M41J37j4m22j95
$$ -26 -118 254 -66 441 455 -158 -80 -317 -202 -384 617 9 -131 -240 531 -313 128 265 251 -171 -366
5896c66R62m49j24o3n9J57n22K66J53J0M61k31K99m42J21m79M60l8j24l3NJ26
$$ -366 596 147 23 -40 -99 58 -464 -198 -45 -35 426 195 494 52 173 -306 154 116 -8 -41 -36 90
5918I0k13K81k26J90l99N10Jl49N57j69l45j98j91L02Q9M63j76Q6P4p23J54q5
$$ 90 -123 158 -68 122 -277 233 234 -115 442 273 -72 -270 -461 -159 -70 393 217 303 377 -346 -192 -277
5940b77L63J71k72l15R92r44K38l26R45p30J75K24k48k44N64J32j67n24M3P33
$$ -277 86 257 -15 -330 662 -282 -44 -370 575 -155 20 244 -4 -248 316 448 281 -243 -200 533
5960E33j58o69O78m31J1N97p62N75n09J67m6M0m77N00J71m49r3J04J42L73k64
$$ 533 375 -294 384 -47 -36 561 -201 374 -135 32 -14 26 -451 49 220 -229 -322 -218 -76 297 33
5981C3M7l70L76O9r0n60O76j75j08J6j02o7O5L04j91K15m79o7K58L51k94M13k68
$$ 33 80 -290 86 155 65 -495 181 6 -102 -86 -188 -255 -190 114 -77 138 -341 -408 -150 201 -93 320 52
6004E2o6Mm03J80KK32Q9K24l28m15L89j54J93j86K08K39k21K2q4l4k82J17L35
$$ 52 -14 -10 -413 -233 -231 1 90 314 -14 -429 -40 -194 -1 -187 21 260 39 61 -23 -57 -339 -222 113
6027A13k44O02n50J14m33J76K82j73J08n30L07Q6m6Q9R3O2j23K8M7n42R59o92
$$ 113 -131 471 -79 35 -398 -222 60 -113 -5 -535 -228 -142 -188 -99 -6 56 -67 -39 8 -534 425 -267
6049b67o6N29Nk92l96L83M32p47K68k75J57K16l13L99j13r4K69JN31j018P52n44
$$ -267 -333 196 201 -91 -487 -104 328 -419 -151 -426 -269 -53 -366 33 -80 -174 95 96 627 -391 361 -183
6071a83L50k27J11j50k26L71M6L39k64j81kj22m47K02P77j43n85J92R1j4M16n56
$$ -183 167 -60 51 -99 -325 46 92 431 167 -14 -16 -138 -585 -383 394 251 -334 -142 -51 -65 351 -205
6093b05J86k49L66k75K15J22l51L85k17k27j35M24J80m18j1J26K8O1K2J8l04j5
$$ -205 -19 -268 98 -177 38 160 -191 194 -23 -250 -385 39 219 -199 -210 -84 -56 5 27 45 -259 -274
6115b74j47J13M42j50j29M67j37k59l3J75l16k44L83M02k65J96J66m27k68N11
$$ -274 -421 -308 134 -16 -145 322 185 -74 -107 68 -248 -492 -109 293 28 224 390 -37 -305 206
6135B06K47q16M47J9k88j49K62m64O71m31K05J89m42k02L53L97l70M52L37n96
$$ 206 453 -363 84 103 -185 -334 -72 -536 135 -296 -91 98 -344 -546 -193 204 -166 286 623 27
6155B7q06L04O69n64K81K32l06J65J02k05mj02L18PN6J33m90J19p0l85O05k35
$$ 27 -779 -475 194 -370 -89 143 -163 2 104 -101 -105 -207 111 118 174 307 -183 -64 -134 -519 86 -149
6177a49O9L00m20k62M01Q1Q3m01M70l24L85l57j23N3J51L2K06K51l60o65l3R26
$$ -149 -80 220 -200 -462 -61 20 103 -298 172 -152 233 -124 -247 -194 -43 -11 195 446 86 -579 -612 314
6199C14o04K00M73j66Q6n03m6N37m48N19q23K53R95r50M18J7l43O03l48P3k72
$$ 314 -290 -90 383 217 303 -200 -246 291 -157 362 -461 -208 787 -163 255 272 -71 532 184 257 -15
6220a5R8l99J13K69l1j41M25n34Q57l39k56MP9l93J33M87k67m97M97m1j42L22
$$ -15 83 -316 -203 66 35 -106 319 -215 642 303 47 51 130 -263 -130 357 90 -407 90 49 -93 229
6242B29l32M94k84o7k09k7J57j31J23k5K67j24Q0k80k19K20L73k2j48J02m32K86
$$ 229 -103 391 107 40 -169 -196 -39 -170 -47 -72 195 71 151 -129 -348 -128 245 223 75 177 -255 31
6264C1j0L93m08k79J62j55L71k18k92N1K1J28N31o92K39k13J47L03J58n64P33
$$ 31 21 414 6 -273 -111 -266 105 -113 -405 -354 -333 -205 326 -366 -127 -340 -193 110 268 -296 437
6285D37n79R6K64l2J89l60L68p08N14k15L43n00K86n20j44O98k92l4K41m2J79
$$ 437 -142 -46 218 186 375 15 383 -325 189 -26 317 -183 103 -417 -561 137 -155 -189 52 10 189
6306A89K76n67K61l41L03J83p93N83j15O5L21M7p93L54J29o5O63l50L00k19m94
$$ 189 465 -102 159 -182 121 304 -489 94 -21 44 365 412 -381 -27 102 37 700 350 650 431 -63
6327f3K81l09j0l3j26L72K44m03j99P8N73n49J33N3k00j95N32j91K31J71l60l71
$$ -63 218 -91 -101 -134 -260 112 356 -47 -246 -168 405 -144 -11 42 -158 -353 179 -12 219 390 30 -341
6349c41L76P0j36n08N22k62J89j41J02P7M14o01p4J96J60N4l45M48o42N06K99
$$ -341 35 105 -31 -539 -17 -279 -90 -231 -129 -52 362 -239 -313 -117 43 97 -248 200 -442 64 363
6370C63p99P28p0j03j60J39j56pK27J8l16j1M3K00j0n7L2q9J2q4M9k24J00jk62
$$ 363 -436 292 222 119 -41 98 -58 -65 162 180 -136 -147 -104 96 86 29 61 -28 -16 -100 -51 -275 -175 -176 -438
6395d38K55K65k12m79N87n8J82N31j489R44m9K27m15P5N8n8L68p7n97P52q7n07
$$ -438 -183 82 -130 -609 -22 -80 102 633 -856 88 39 266 -149 -74 -16 -74 294 217 -380 372 285 -222
6417b22J4M0J49L3n5j62L6M39k1j20k50k69L99m1l18M97j26k28r8J89J14J21l80
$$ -222 -208 -168 -19 14 -41 -203 -167 272 251 131 -119 -388 11 -30 -348 149 23 -205 -303 -114 0 121 -259
6440b59L85j55n06O29ln05M85k26J96o3l37L34k58L74j00j6J25k39L18K8m1pM3
$$ -259 126 -29 -535 94 91 -414 71 -155 41 -22 -359 -25 -283 91 -9 -25 100 -139 179 207 166 159 202
6463B02Q8K46m36j29j23M07j43K82p7n43J59j36l7L45j45Q8m81M48Q5R5R6n68
$$ 202 290 536 100 -29 -152 255 112 394 317 -226 -67 -203 -240 105 -40 48 -433 15 100 195 291 -277
6485b77K58l89R2L06n3K4J02k9O6L5k25N80l85k18j17J15L78m55L27k66k55N80
$$ -277 -19 -408 -316 -10 -63 -39 63 34 100 135 -90 490 105 -113 -230 -115 263 -192 135 -131 -386 194
6507A94m21K49r1N14o71J04Q3l09L99J2Mj97k96L47p20Q84n87K09L21Kk64o4j51
$$ 194 -227 22 -69 445 -226 -122 -39 -348 51 63 67 -130 -426 -79 -799 85 -502 -293 28 30 -234 -298 -449
6530d49K11R15n44j46L07n44O31n44K1N72k82P5j16K61o72j06Q4M20K87j3j30
$$ -449 -238 677 133 -13 294 -250 381 -163 -142 430 148 223 107 368 -304 -410 -326 94 381 368 238
6551B38n46M80K51p26N25k90K35j1j17M39p72K90J99n90L46N9K75Kn75J54j21
$$ 238 -308 172 423 -303 222 -68 167 156 39 478 -294 -4 195 -395 -49 10 285 287 -288 -134 -255
6572b55O69k74j92j16K15k2QM7K55k97j03k30J87P5n08K38K05j56J8R86j080L10
$$ -255 414 140 -52 -168 47 25 33 80 335 38 -65 -295 -108 -33 -541 -303 -98 -254 -236 750 -330 -20
6594b0q0k47Q7k72P43M3j85N3n06L36J93m36P28r87M94J09k88L32j76j0k32M0
$$ -20 -100 -347 -260 -532 211 254 69 122 -384 -48 145 -291 437 -550 -56 53 -235 97 -79 -89 -321 -281
6616b81J84O03n68Q2J50K46m56j57O97m37k21J65K98m18j60L08j09L1N1J08%q30
$$ -281 -97 506 -62 20 170 416 -40 -197 500 63 -158 7 305 -113 -273 35 -74 -43 8 116 116 -714
6638g14O42K39K56p81l39Q78m10j6N05n75J25K81k27M63n1o06M85l65K2L33j23
$$ -714 -72 167 423 -358 -697 181 -229 -245 260 -315 -190 91 -136 327 276 -330 155 -210 -188 145 22
6659B2j30j22J96l90Q69j69o69M67k40P5K06k30j56K22k28J45l15O63n39M23m19
$$ 22 -108 -230 -34 -424 445 276 -393 74 -166 -91 115 -115 -271 -49 -277 -132 -447 216 -323 100 -319
6680c19L76l39N64l30O2L4j26m23K98j85J03N45k11J44l80n36R57j56J47n5j03
$$ -319 57 -282 282 -48 14 48 -78 -501 -203 -388 -285 260 49 193 -187 -723 234 78 225 170 67
6701F7l57L55J71j27k7k60K08O92l90l73K43m33K15J12p0l98K92P4J85m99J87
$$ 67 -290 65 236 109 82 -178 30 722 332 -41 202 -231 -16 96 26 -372 -80 -6 179 -320 -133
6722a33L40M57o95K62k45K22J09K3m02k46K74O61k93j32j55j75N8J7J99l04J63
$$ -133 207 664 -31 231 -14 208 317 340 -62 -308 -34 627 334 202 47 -128 -70 -53 146 -158 5
6743Ek78M34j37l45L40P1K31j50k33K28o68M66J19J94k63K00O6m55J29Lj16L90
$$ 5 -273 161 24 -321 19 90 321 171 -62 166 -502 -36 83 277 14 214 280 -175 -46 -43 -159 231
6765B31n4j40n56L11K48n5J2J3j63j7K18l12N5K02l35K33L72P4m48K83J0m0k87
$$ 231 177 37 -519 -208 40 -15 -3 10 -153 -170 48 -264 -209 -7 -342 -109 263 337 -111 172 182 142 -145
6788a45rL06O3j81m62Q08n74J3L67n1j85J25j35n6J56N3k50R7k98K25J36J74n62
$$ -145 -154 152 215 34 -428 380 -194 -181 186 135 -50 75 -60 -116 40 93 -157 -60 -358 -133 3 177 -385
6811c85N86L09k16l35K11k45J11R9j89M8l36M88r8J08J08m27J8M03j59k16k61
$$ -385 201 510 294 -41 170 -75 36 135 -54 -6 -342 146 48 156 264 -163 -145 258 99 -117 -378
6832c78j20K3N29J45k41KJ11p3k95L0L34q7K46l76O8K09k21M9k21l8N16r6l25
$$ -378 -498 -475 54 199 -42 -40 71 -2 -297 -267 67 -20 226 -150 -82 127 -94 -45 -266 -304 212 116 -209
6855b09N98k99l88O19o33J59p0j56O75m66J81J28l72K68k30k55P67m09M16J64
$$ -209 389 90 -298 321 -312 -153 -223 -379 296 -170 11 139 -233 35 -195 -450 317 -92 324 488
6875D88k92k26J70l53j62M22O11q95j18Q06o70N83n78L7K8j41J33N6L21r87O87
$$ 488 196 -30 140 -213 -375 47 658 -237 -355 451 -219 364 -214 -177 -149 -290 -157 -101 220 -767 -80
6896h0lj98J21M52m00N3L75o89M6J11K74L18p22rO48k51l49K98M86n5N8r16M23
$$ -80 -83 -281 -160 292 -108 -55 320 -369 -323 -212 62 380 -342 -351 297 46 -303 -5 481 426 484 -432 -9
6919ij41l63K14M3N16l35L1j0K44oo90J86N06m86K33k00k0K7K64K06k91Ql31Q74
$$ -9 -150 -513 -299 -256 260 -75 -44 -54 190 184 -506 -320 186 -300 -67 -267 -287 -260 4 210 -81 -73 -404 470
6943D70n35M07n26j30M66k44K45M3P7J32l72J2M01j56L68r03n5R64n39j07o01
$$ 470 -65 342 -184 -314 152 -92 153 196 273 405 33 45 446 290 658 -245 -300 664 125 18 -583
6964e83L31M10j66k44J08J21l87l69M52K96l59K83p32O54N04l94o9k1O17n51K92
$$ -583 -252 158 -8 -252 -144 -23 -410 -779 -327 -31 -390 -107 -839 -185 319 -75 -144 -165 452 -99 193
6985A93j73j94L22k85L67l82K60J15j81l65M46M06l46Q6k26m22K88M5K36o5k37
$$ 193 20 -174 148 -137 230 -152 108 223 42 -323 123 529 183 269 43 -379 -91 -46 190 125 -112
7006a12L14j45k3l32J11N92o35L84m05J02M65m16l07J00K56l15K37kj02N48J03
$$ -112 202 57 34 -298 -187 405 -230 154 -251 -149 316 -100 -407 -307 -51 -366 -129 -131 -233 315 418
7027D18m59k31K99J78k78P90o07j37k20J09J23P6L67p72M35O90o79k48M31K32
$$ 418 -41 -272 27 205 -73 717 110 -27 -247 -138 -15 61 428 -344 91 781 102 -146 285 517
7047E17m98O0K71k65n02K65K64m85K59M35n97N40o76J75M43P7l09j91K21n27N28
$$ 517 19 79 350 85 -417 -152 112 -373 -114 321 -276 264 -412 -237 206 283 -26 -217 4 -523 5
7068EK29j35k59kk86N08N0j70L71J56l06j24k7m4K15k66L63l80K97l83N15n63
$$ 5 234 99 -160 -162 -448 60 110 -60 311 467 161 37 10 -34 181 -85 278 -102 195 -188 327 -236
7090b36PK30K82o35K36L6m4O5o7J0J47lj96L59o23L60K2N14m45k36M68m55P23
$$ -236 -229 1 283 -352 -116 -80 -124 -59 -126 -116 31 28 -168 191 -432 -72 -50 464 19 -217 251 -204 519
7113E19o03M38n40L50K49k16J37r6m91L98p16L39N38m03J03j28r2J95n6P2j46
$$ 519 -84 354 -186 164 413 197 334 238 -253 145 -571 -232 306 -97 6 -122 -214 -19 -75 -3 -149
7134a49j87L3M61k94m2j62K60n1j08L65k8l64M73m33K52q4O6J44J46l33M5k53
$$ -149 -336 -303 158 -136 -178 -340 -80 -131 -239 126 98 -266 207 -226 26 -58 8 152 298 -35 10 -243
7156b43R11j76o60K72k57j5p8q1K17J21K21l77j69P17k53k31m2M09K0o66N08l07
$$ -243 668 492 -168 104 -153 -168 -246 -327 -110 11 232 -145 -314 403 150 -81 -123 286 306 -360 148 -159
7178a59q1P3Om39K87K23m0k2N0J72q5J2j04m1j19j91R4J09O20l14o6M10m76J50
$$ -159 -240 -167 -161 -600 -313 -90 -130 -152 -102 70 -15 -3 -107 -148 -267 -458 -364 -255 365 51 -15 395 -81 69
7202F9L52k65j41j02J12o9Q3J65m87n6L74L3p5m22O24L15l11j10l26L42j02j45
$$ 69 421 156 15 -87 25 -44 39 204 -283 -339 35 68 -7 -429 195 510 199 89 -237 105 3 -142
7224a42J20M76K59l12m0p10J83j25J0K73L2L74l60l96M57j16O1j62q0J16K13n53
$$ -142 -22 454 713 401 361 -349 -166 -291 -281 -8 24 398 38 -358 99 -17 44 -118 -198 -82 131 -422
7246d22K23N17j41k65j34k39O51j20J01l79O7j24M17j8k48k72P89o87L60J4J76
$$ -422 -199 318 177 -88 -222 -461 190 70 171 -208 -141 -265 152 134 -114 -386 403 -284 76 90 266
7267B66l00J99o03J46N58q11R40n19q3K78P7n06J01K66k59P2l4N40k13l63L22
$$ 266 -34 165 -438 -292 266 -545 395 -124 -207 71 148 -358 -257 9 -250 -178 -212 328 115 -248 74
7288G4j90J64j07k66M83l78l38N78J53k94J55j30O64r90N15m2Jl96J18P09o5m26
$$ 74 -116 48 -59 -325 158 -220 -558 20 173 -121 34 -96 568 -422 93 51 52 -344 -226 483 418 -8
7310hk27M12J19n7p36N42J05J24j82m39P33m33p8K87k81j3Q5L05j09j16O3R4n92
$$ -8 -235 177 296 239 -497 45 150 274 92 -347 386 -47 -125 162 -119 -132 -47 258 149 33 96 190 -402
7333d02N85m39M08j5k77L6J98J70j7j30k03L42m90M16l16n04J069M7k87k85R5
$$ -402 183 -256 152 137 -140 -104 94 264 247 117 -86 256 -234 182 -134 -638 431 478 191 -94 1
7354Ak0J56m88Q0M99q9k92K65r8l5J27l82J84L05n17J1L3l0j1kK87k6J83o45L26
$$ 1 -19 137 -351 -271 228 139 -153 112 14 -21 106 -276 -92 213 -304 -293 -260 -290 -301 -303 -16 -42 141 -504 -178
7379a78J1K30k08j50L68p7l12L62M69j71J3k03L2k01q0L20n3J00k19N7m25J7j3
$$ -178 -167 63 -145 -295 73 -4 -316 46 515 344 357 154 186 -15 -95 225 172 272 53 110 -315 -298 -311
7402c11K46M8K11l19k29O59o53j28K63J90K9J75j60l50M87K28l62m28J95M60M9
$$ -311 -65 -17 194 -125 -354 305 -348 -476 -213 -23 6 181 21 -329 158 386 24 -404 -209 251 300
7423C00k58K56j34j46Jj70O45l33j69p1j41L2QJ60J48n38M86K69j17l61L06J2
$$ 300 42 298 164 18 19 -151 494 161 -8 -79 -220 -188 -180 -20 128 -410 76 345 228 -133 173 185
7445A85k10k54R6O58q69M25J44l89r4N48J70j96j32o3k34K22l56K6M90m11N66
$$ 185 -25 -279 -183 475 -394 31 175 -214 -308 240 410 214 82 19 -215 7 -349 -323 167 -244 322
7466C22M84j227N01j92Q3j8j58M36j49J03j61K06o73K74J77k57o5K08j98l5L7
$$ 322 806 -421 80 -112 -29 -47 -205 231 82 185 24 230 -443 -169 8 -249 -314 -106 -304 -339 -302
7487c02O65j73l72Q23j126K74J36O8j8q2J11k39N43o4k52l7M22q35N34L9k25p2
$$ -302 363 190 -182 641 -485 -211 -75 -7 -25 -107 4 -235 308 244 -8 -45 377 -458 76 115 -110 -182
7509a82K6N94l73k03L09l1j08r9k8J07j79j78J87J5J36M5j9q5P53n08m10PN44
$$ -182 -156 438 65 -138 171 140 32 -67 -95 12 -167 -345 -158 -143 -7 38 19 -66 687 179 -231 -224 320
7532C20m06j29m5l4K51n00R52J77q10K34K01K83j196N11L93K2l98J15p6r1K63
$$ 320 -86 -215 -260 -294 -43 -543 409 586 -224 10 211 494 -702 -191 202 224 -174 -59 -135 -226 37
7553C7l40N22r7k70O00j78l92J6Q8P1j16L47j72l26J03k86N53J11n57J2J66R8
$$ 37 -303 219 122 -148 452 274 -118 -102 -14 57 -59 288 116 -210 -107 -393 160 271 -286 -274 -108 -10
7575a0J56L04k29k77k20L58K57q54N08K24o76M88M6J09m50p8p0Q31l20j51K19
$$ -10 146 450 221 -56 -276 82 339 -515 -7 217 -459 29 75 184 -266 -344 -414 417 97 -54 165
7596A65l40L35l40M41n65J73J58N5k55K70l19K81L16n30K98j71l89N9O89n74K88
$$ 165 -175 160 -180 261 -304 -131 27 82 -173 97 -222 59 375 -155 143 -28 -417 -358 331 -243 45
7617D5j20l55M30k87L03k88L13k43L26l98K12M26R5j84k45j96K68j86L26k11k0
$$ 45 -75 -430 0 -287 16 -272 41 -202 124 -274 -62 364 459 275 30 -166 102 -84 242 31 11
7638A1J20j2J1l08j94K00R8mj63N52n92j83L36K04J37k85L26n30P96r51O51n53
$$ 11 131 119 130 -178 -372 -172 -74 -78 -241 311 -281 -464 -128 76 213 -72 254 -276 520 -431 220 -333
7660c33L66j08j3J73n8l08M05J1J00jL02n84j85M19m83nj8K20K52m1L2j70j63
$$ -333 33 -75 -88 85 27 -281 124 135 235 234 536 -48 -233 186 -297 -302 -320 -100 152 111 143 -27 -190
7683a90K92j52j12K41k67j1K19J63k56n8q4J9o4p1M57k72J24L5n89Q02P8m37J55
$$ -190 102 -50 -162 79 -188 -199 20 183 -73 -131 -215 -196 -260 -331 126 -146 -22 13 -576 226 304 -133 22
7706B2L08J82r38K30K61Q0l71K80J38J80m55K60k00K99k51k45K44O41p18J71m3
$$ 22 330 512 -426 -196 65 145 -226 54 192 372 -83 177 -23 276 25 -220 24 665 -53 118 75
7727G5QK46l98k72P5K97J90K63j52l74k25o2k68M07O60o06n5M73l00M34l57j24
$$ 75 83 329 -69 -341 -266 31 221 484 332 -42 -267 -329 -597 -190 470 -136 -191 282 -18 416 59 -65
7749f5K56p32R78p08J78N2m34P42Lk53L33l17L46k93j78N62n65N5N7r0j98M25
$$ -65 191 -541 437 -271 -93 -41 -475 267 270 17 350 33 379 86 -92 470 -95 -40 17 -73 -271 154
7771A54K44j01m72l8l87O84Q5k84k16O27j20j4m27P9J32L74Lm68r9L33L20q1o1
$$ 154 398 297 -175 -213 -600 84 169 -115 -331 296 176 162 -265 -186 -54 320 323 -145 -244 89 409 328 267
7794B67p29J84K77Mj36N09j95J63m24j98L49l55N04j75o32O84m50M8Q52n43L21
$$ 267 -462 -278 -1 3 -133 376 181 344 -80 -278 71 -284 220 45 -587 97 -353 -305 547 4 325
7815C25J9o09J75K93j43j65K69k7o7Q7j37k36O79n09J49p56M34N22j73j62o0L86
$$ 325 344 -265 -90 203 60 -105 164 137 70 157 20 -216 463 -46 103 -653 -219 303 130 -32 -92 294
7837B94j77j58l46L15o3J05N4m05O55j66j57k6J98k58j8K48L9j58k30M20j21k46
$$ 294 117 -41 -387 -72 -135 -30 24 -381 274 108 -49 -75 123 -135 -153 95 134 -24 -254 166 45 -201
7859b01J76M9l59O91n27L91m76L32L8K1k79mK22j63K09M6m64P5K49k71K99L29
$$ -201 -25 24 -335 356 -171 220 -256 76 114 135 -144 -148 74 -89 120 166 -298 -223 26 -245 54 383
7881C83o87m2m2M60j50MJ29J27n45L96m37M41Rm01R94l31k61m95L94P3J80l79
$$ 383 -304 -346 -388 72 -78 -74 55 182 -363 33 -404 37 46 -355 639 308 47 -448 -54 19 199 -180
7903a80Q9K70M42r87J76J07K14P72r56J29k41M77Mn6j58l26J06K62k83L83j52
$$ -180 -91 179 621 -366 -190 -83 131 903 -53 76 -165 312 316 260 102 -224 -118 144 -139 244 92
7924I2l39R4J65m77J64M13M64m18p9j11j42n22N2R96m48J62N9oJ80m18J68J00
$$ 92 -247 -153 12 -465 -301 112 576 158 79 -32 -174 -696 -644 352 -96 66 125 119 299 -119 49 149
7946A49J14M41o79q9r5Q3L28n33M88l44j28N23p78M98m75K99n9K20j99J75M78
$$ 149 263 704 25 -64 -159 -76 252 -281 207 -137 -265 258 -520 -22 -497 -198 -257 -37 -236 -61 417
7967D17l98M46o78J0J40k88j77Q30K3l93M9K21k90l19L45M89m2m61N8k1l58M19
$$ 417 19 465 -213 -203 -63 -351 -528 302 325 -68 -19 202 -88 -407 -62 427 385 -76 -18 -39 -397 22
7989B2k11p0J90n6Q5K18k46J83l07J67Q09p16l85L29k21M4O6n11M32j1J96l45
$$ 22 -189 -259 -69 -125 -40 178 -68 115 -192 -25 784 68 -317 12 -209 -165 -99 -610 -178 -189 7 -338
8011c38J04M16n86O58m21K82j26J82K18m23N3l54K15j08N33K45l99m83J13j33
$$ -338 -234 182 -404 254 -167 115 -11 171 389 -34 19 -335 -120 -228 305 550 151 -332 -219 -352
8031c52O9M65q86L71K8M50m04M7P5J57Jj20J69J21j52J02l12L57k4j09j22kj68
$$ -352 -283 182 -704 -333 -305 145 -259 -212 -137 20 21 -99 70 191 39 141 -171 186 162 53 -69 -71 -239
8054b39L82l23K05j5L09m32N20n15k74j8K35j71K06l71L81k93J18p2J6N24l98
$$ -239 143 -180 25 10 319 -113 407 -108 -382 -400 -165 -336 -130 -501 -120 -413 -295 -367 -351 173 -225
8075b25O78q48K98K54n18N24k14J3K47lK42n56K81k51Lj85Q1O2k0l62J51L19K67
$$ -225 453 -395 -97 157 -361 163 -51 -38 209 206 448 -108 173 -78 -75 -260 -179 -117 -137 -499 -348 -29 238
8098B38k14K51p6l89j22L10K96p57P66j41l91L43l22L78l35j78N38Qpm06m6K35
$$ 238 24 275 199 -190 -312 -2 294 -463 303 162 -229 114 -208 170 -165 -343 195 203 196 -210 -256 -21
8120b1j79l5J46O6o2j44K89K69j46R7k09j63j45K82j85M25k8k92l86L60M49o98
$$ -21 -200 -235 -89 -23 -85 -229 60 329 183 280 71 -92 -237 45 -140 285 257 -35 -421 -61 388 -310
8142c10M03p9k26L13j86J62k57j61O4P40p2n99L93j63n6j21K78k64L16j21m60
$$ -310 93 14 -212 101 -85 77 -180 -341 -277 463 391 -208 185 22 -34 -155 123 -141 175 54 -406
8163d06n3L70M21j08k88K24m18L76j91J53j16L81m92K08%o7J38J07j15K23k07
$$ -406 -459 -89 332 224 -64 160 -258 118 -73 80 -36 345 -147 61 61 -6 132 239 124 347 140
8184A40n91R09l47k03J94m2l14
$$ 140 -451 458 111 -92 102 60 -254
8191b54
$$ Imaginary data points
##PAGE= N=2
##DATA TABLE= (X++(I..I)), XYDATA
0@%%%%%%%%%%%nK9m8M8m8O7r1R6j20J44j68K16k50K80l28L93m55N24n98O75p76
$$ 0 0 0 0 0 0 0 0 0 0 0 0 -5 24 -24 24 -24 43 -48 48 -72 72 -96 120 -130 150 -178 215 -240 284 -314 361 -415
32d15Q92j012J142j289J448j624J816k026K257k513K790l092L422l781M175m604
$$ -415 477 -535 607 -682 766 -858 958 -1068 1189 -1324 1466 -1626 1796 -1985 2190 -2414
48b414N077n596O164o792P485q253R112j0079J1178j2436J3885j5586J7616k0080
$$ -2414 2663 -2933 3231 -3561 3924 -4329 4783 -5296 5882 -6554 7331 -8255 9361 -10719
62a0719K3154k7115L2432l9990N1682p2353J19756m42781o8580O25220j76493
$$ -10719 12435 -14680 17752 -22238 29444 -42909 76847 -365934 -434514 190706 14213
73A4213j01098K44568K14582k79958j54191J39907O2858k57809o4991J89408L5030
$$ 14213 -86885 157683 372265 92307 -61884 78023 140881 -116928 -181919 7489 42519
84D2519k13826K3623K03336J3940j30647P8536J53349k8895j54645l4250N0195
$$ 42519 -171307 -147684 55652 69592 -61055 17481 170830 141935 -12710 -46960 3235
95C235k3990q8617K9222R4127m312n0727L1216K2933k1664L7676P4577k2079p2786
$$ 3235 -20755 -109372 -80150 13977 9665 -41062 -9846 13087 -8577 29099 103676 81597 8811
108H811j7169R089n0308p0157K7965J00282K4879k6645M4401M6590n5243m1816
$$ 8811 -8358 731 -49577 -119734 -91769 8513 33392 6747 51148 97738 42495 679
120F79K6795k8286p4415K2789P7931j2591p4255O088Q5639K3744n6088L571O2347
$$ 679 27474 -812 -75227 -52438 25493 12902 -61353 -55265 30374 54118 -1970 1601 63948
133F3948k0831q1772p73M1295j7935k3411L5905L7346j7306k9542J4750K2259
$$ 63948 43117 -38655 -39428 1867 -16068 -39479 -3574 33772 16466 -13076 1674 23933
145B3933l1475k6844N1208M2039m9056m5242K5108J4357l1652q786L3986K9791
$$ 23933 -7542 -34386 16822 58861 9805 -35437 -10329 4028 -27624 -36410 -2424 27367
157B7367k060j1113N51l607k2490o890J0170j1775r649L0439K6563j7727k0898
$$ 27367 25307 14194 14745 11138 -11352 -18242 -8072 -19847 -29496 943 27506 9779 -11119
170a1119R209J6283N274o612r887m116p715r275j5q23j415K2037K4808q162j4847
$$ -11119 -1910 14373 19647 13035 3148 -968 -8683 -17958 -17973 -18796 -20211 1826 26634 18472 3625
185C625J2255O747k3454k0860O819J6034o709j5640J0126J8358m826m241J9186
$$ 3625 15880 22627 -827 -21687 -14868 1166 -5543 -21183 -11057 7301 2475 -1766 17420
198A7420J863j9802N909J7578j9586l2627M308K6023N9j7217Q672K6241l613k3479
$$ 17420 19283 -519 5390 22968 3382 -29245 -24937 1086 1145 -16072 -7400 18841 15228 -8251
212h251M769J8917n216q867Q037k567j8533m386R053l606j1925R541L0132J2147
$$ -8251 -3482 15435 10219 1352 9389 6822 -11711 -16097 -7044 -10650 -22575 -13034 17098 29245
226B9245j5876r876R410l953j8167l776O197k490k395P197M605k635M470J0847
$$ 29245 13369 3493 12903 8950 -9217 -12993 -6796 -9286 -11681 -4484 121 -2514 1956 12803
240A2803J450j0986k444J2269k553k4933j0614J4876R102j864M182N986m004l858
$$ 12803 14253 3267 823 13092 10539 -14394 -25008 -10132 -1030 -2894 1288 7274 3270 -588
254e88M296J884o477n37J1466L005j6696j0527P967K709j0902Q94J8428J1206
$$ -588 3708 5592 -885 -1422 10044 13049 -3647 -14174 -6207 -3498 -14400 -13506 4922 16128
268A6128l837m983o36l439p733k414K624k321j724R035O506r740p278J1693J2355
$$ 16128 12291 7308 6672 3233 -4500 -6914 -4290 -6611 -8335 700 7206 -2534 -9812 1881 14236
283A4236l893r538R34J324q189q330L926Q494L267J746J620l154m753L389K969
$$ 14236 10343 805 1739 3063 -5126 -13456 -9530 -1036 2231 3977 5597 2443 -2310 1079 4048
298D048p157n227Q842J2371l351j3442n341K580N20r27P045P556J069j983j209
$$ 4048 -3109 -8336 506 12877 9526 -3916 -9257 -6677 -6157 -7084 -39 7517 8586 6603 5394
313E394m478o535J254M425j947n551M028Q182j836q815J204J1374M312o048k994
$$ 5394 916 -5619 -4365 60 -1887 -7438 -3410 4772 2936 -5879 -4675 6699 11011 4963 1969
328A969j055n262m246J685K730R15M254P430K18q204m052M160J294n497l7Q091
$$ 1969 914 -4348 -8594 -6909 -4179 -3264 990 8420 8638 434 -3618 542 1836 -3661 -3698 4393
344D393K568p930n496J431K227J318J925L937M75q03K030j881r802n336O853O450
$$ 4393 6961 -969 -6465 -5034 -2807 -1489 436 4373 4848 4045 6075 4194 -5608 -10944 -4091 2359
360B359j622m069K417K499k726k162N036M546j194k539j547m223m161J967L403
$$ 2359 737 -3332 -915 1584 -1142 -3304 1732 6278 5084 2545 998 -3225 -7386 -5419 -2016
375b016j476k6P913O335m276r067j455L717l76j776K728K557l242k727N46p88
$$ -2016 -3492 -3518 4395 10730 6454 -2613 -4068 -351 -727 -2503 225 2782 -460 -3187 -2641 -3429
391c429l72L876N860j139m139J278K270m106q072P02O994K779k118j56J554q52
$$ -3429 -3801 75 5935 4796 657 1935 4205 99 -7973 -7271 -277 2502 384 228 1782 930
407I30j398J766Q74j440j4K022k031p278j121O283L160k397J578O383o72o508
$$ 930 -468 1298 2172 732 718 2740 709 -6569 -7690 -1407 1753 -644 934 7317 6645 137
423A37l161J660N3k17K234R92j821j270K994j149m445O57P294L694m917l082Q55
$$ 137 -3024 -1364 -1311 -1528 706 1698 -123 -1393 1601 452 -3993 -3336 3958 7652 2735 -347 508
440E08j205m648k14L515K912L54J139O31k222q57J989M61m499q69M929J870n873
$$ 508 -697 -5345 -5559 -2044 868 1222 2361 2992 770 -87 1902 2363 -2136 -3005 1924 3794 -2079
457b079m198K160M983R94J310J865j334k662k458l57q70o58L057J851k195j849
$$ -2079 -6277 -4117 866 1860 3170 5035 3701 1039 -1419 -1776 -2646 -3304 -247 1604 -591 -2440
473b440K245K542k529k651K785M982J37m342j710J44k604j165J852J742O32K712
$$ -2440 -195 2347 -182 -2833 -48 4934 5071 729 -981 -837 -3441 -4606 -2754 -1012 -380 2332
489B332K701k410m090J69M194j332n029J037M056j360m691J442L696J26R02K819
$$ 2332 5033 2623 -1467 -1298 2896 1564 -3465 -2428 1628 268 -4423 -2981 715 841 1743 4562
505D562j077k948l83J721l754l493J186N313N23k613M84K309j93j873M66J851
$$ 4562 3485 537 154 1875 -1879 -5372 -4186 1127 1650 -963 -479 1830 1637 -236 230 2081
521B081J41q50j852j504l22m40J674J075j041N80L235J977m508k784K121K681
$$ 2081 2222 1372 -480 -1984 -2306 -2746 -1072 3 -1038 -458 2777 4754 246 -2538 -417 2264
537B264j070k782P29L86r76o52K780R26j028J911O45k660k927J516K677l443k494
$$ 2264 1194 -1588 -859 -473 -1449 -2101 679 1605 577 2488 3133 473 -2454 -938 1739 -1704 -4198
554d198L184L295j616k412J728J618r20L96K307j147l082J2M13l370j241L276
$$ -4198 -1014 2281 665 -1747 -19 1599 679 1075 3382 2235 -847 -835 -422 -3792 -5033 -1757
570a757L673j119q14K280R32l003j807J756N29r80M49j01j964p13J315K201j513
$$ -1757 1916 797 -17 2263 3195 192 -1615 141 670 -310 139 38 -1926 -2639 -1324 877 -636
587f36p9L245J314j172l058j19m71j624q04K438J463J45ok61K84l00J093O18j153
$$ -636 -715 2530 3844 2672 -386 -505 -976 -2600 -3404 -966 497 642 636 375 659 359 1452 2070 917
606I17l075N64K317j797j609M96K343J691m33j77L54q93j162J83r5L17n41P4K33
$$ 917 -2158 -1594 723 -1074 -2683 -2187 156 1847 1414 1237 1591 698 -464 -281 -376 -59 -600 -526 -293
625b93j634r4J448J940j29m33J830J148k941l252L58J264j417K93K640Q68k044
$$ -293 -1927 -2021 -573 1367 1238 805 2635 3783 842 -2410 -2052 -788 -2205 -1912 728 1596 -448
642d48N18K276j216j774J943K004k886l506J017R64k482n11M090K577J80O2M03
$$ -448 70 2346 1130 -644 1299 3303 417 -3089 -2072 -1108 -3590 -4101 -11 2566 2746 2808 3211
659C211j956k923j83R96q83o20K042K245r59k245M14J147N92n85J188P90j909
$$ 3211 1255 -1668 -1851 -855 -1738 -2358 -316 1929 970 -1275 -861 286 878 293 1481 2271 362
676C62j566l08N1j102O20K132Q27j087J112J615o79k206R8J137q52k346K2J500
$$ 362 -1204 -1512 -1461 -2563 -1943 189 1016 -71 1041 2656 1977 -229 -131 1006 154 -2192 -2170 -670
694f70m86n61J912K100l01l75P76j121k861m02J413m04j702R51K413Q1p17K70
$$ -670 -1156 -1717 195 2295 1994 1619 2395 1274 -1587 -1989 -576 -980 -2682 -1731 682 763 46 316
712C16Q91M00n78j00q9j975q24O98K58n52K49J430J663n71q06P30Q5j427j95J148
$$ 316 1207 1607 1029 929 840 -1135 -1959 -1261 -1003 -1555 -1306 124 1787 1216 410 1140 1225 -202 -397 751
732G51m21j568j89L43P3k6J450K150k61m97N31p31k762k045J566Q83l96P23J224
$$ 751 330 -1238 -1427 -1084 -1011 -1037 413 2563 2302 1805 2336 1605 -1157 -3202 -1636 -753 -1149 -426 798
751G98j73m18L59N92l43o15M49j85j087j356L97O15M14J23N36J388Q62j169l84
$$ 798 625 207 566 1158 815 200 649 464 -623 -1979 -1582 -967 -553 -430 106 1494 2356 1187 803
770H03k72j149Q7K04J54r87kN50L19k03P73J581M08j417l36J22q86j561k67Q98
$$ 803 531 -618 -531 -327 -173 -1160 -1162 -612 -293 -496 277 1858 2266 849 513 635 -251 -1812 -2079 -1181
790a181l34R08J575M57m41n37P88l36j607O56J62m4j620R2P4R35K87L10R55N80
$$ -1181 -1515 -607 968 1425 984 447 1235 899 -708 -52 110 66 -1554 -1462 -1388 -453 -166 144 1099 1679
810A679j45n62k24j610l62N64Q1j139L44R96J239m31k35L56J492n15j182J99j211
$$ 1679 1534 972 748 -862 -1224 -660 -579 -1718 -1374 -378 861 430 195 551 2043 1528 346 545 -666
829f66r08k65O17M71J70J102J431q82m92J13P29j396j489O99O14l14p55J041K0
$$ -666 -1574 -1839 -1222 -751 -581 521 1952 1070 578 691 1420 24 -1465 -766 -152 -466 -1221 -180 -160
848a60l81O54J567j98o13K15M6j694j389O10N49L64n71Q92J144j29m93N02j53
$$ -160 -541 113 1680 1482 869 1084 1130 -564 -1953 -1343 -794 -430 -1001 -109 1035 906 413 915 762
867G62j24o04m05L17r62j90N29N31o54P48J400K02o75K88n74o61j142N49M89j079
$$ 762 638 34 -371 -54 -1016 -1206 -677 -146 -800 -52 1348 1550 875 1163 589 -72 -1214 -665 -176 -1255
887a255J27Q22R9M65R00N56l98o69k02J40q48j012m08Q24M30K15R85m5Q0l76N77
$$ -1255 -1128 -306 -207 258 1158 1714 1316 647 445 585 -263 -1275 -1683 -859 -429 -214 771 726 806 430 1007
908A007o49n20p16P57N6r00k83P46L01K28k43J181P51p22k20o27m46o86J09r9
$$ 1007 358 -162 -878 -121 -65 -965 -1248 -502 -201 27 -216 965 1716 994 774 147 -299 -985 -876 -975
928i75m46K63R29Q40m02O49N23J68n78o61n29m87p44k46P09O02Q88q3J246q77
$$ -975 -1421 -1158 -229 611 209 858 1381 1549 971 310 -219 -706 -1450 -1696 -987 -385 503 420 1666 789
948G89n61K24l64k86l88n56N80J26j30k11N34M9O97Q2R67q73k91p5m20o97l79
$$ 789 228 452 88 -198 -586 -1142 -562 -436 -566 -777 -243 -194 503 585 1552 679 388 313 -107 -804 -1183
969a183J117p82j28L50J068Q83l18m09M93J05j666J01n53m58J55R11No7J04J513
$$ -1183 -66 -848 -976 -626 442 1325 1007 598 1091 1196 -470 -369 -922 -1380 -1225 -314 -309 -376 -272 1241
989A241K98o42j011N70l60j091m73Q14J97n1K2R58j2K4K35j78l03l36M02o98l85
$$ 1241 1539 897 -114 456 96 -995 -1468 -654 -457 -508 -486 472 460 484 719 541 238 -98 304 -394 -779
1010g79k81J52M60K6J30J302k68p2m28L64n59j5j86O4r18PO19Q25q16N04Q24N80
$$ -779 -1060 -908 -448 -422 -292 1010 742 670 242 606 47 32 -154 -90 -1008 -1001 -382 443 -373 131 955 1535
1032A535j127p53N95l62n01p74R43m49P40N63O10O1j042J90R32j226m95J15N71
$$ 1535 408 -345 250 -112 -613 -1387 -444 -893 -153 410 1020 1081 39 229 1161 -65 -560 -445 126
1051A26j012j87P60J78J89N70J11K10r47M39o7l36l25R9L67r70j0J11J05J282
$$ 126 -886 -1073 -313 -135 54 624 735 945 -2 437 370 34 -291 -192 175 -795 -805 -694 -589 693
1071F93m56j92J346k9q87n23n10j02l76M77N5J73N89Q13J03n92M85n04k88j203
$$ 693 237 45 1391 1362 475 -48 -558 -660 -1036 -559 -504 -331 258 1071 1174 582 1067 563 275 -928
1091i28L27J78o12O40k30P14M30oj83j83K17p83M63k58m65J5N33J88k51p63L68
$$ -928 -601 -423 -1035 -395 -625 89 519 513 330 147 364 -419 44 -214 -679 -664 -131 57 -194 -957 -589
1112e89M10N78k46Q92k03m24n45J31n16k93m01Q65j09k08J559L16J93j025O63
$$ -589 -179 399 153 1045 842 418 -127 4 -512 -805 -1206 -341 -450 -658 901 1217 1410 385 1048
1131A048r74j04j447k4O78R6R2J112K71Q6J12l62k29j021N17O6k54k59L79O4O2
$$ 1048 74 -30 -1477 -1501 -823 -727 -635 477 748 834 946 584 355 -666 -149 -83 -337 -596 -217 -153 -91
1152i1K8O46J56j84N43o73k66l12J10m22J49n58j0Q84j75%M65Q94n21j77l30K21
$$ -91 -63 583 739 555 1098 425 159 -153 -43 -465 -316 -874 -884 0 -175 -175 290 1184 663 486 156 377
1174C77j69q86m16L29q6P87K68M84j84QJ17j24p98J65m56P09r79J84K38L22J73
$$ 377 208 -678 -1094 -765 -851 -64 204 688 504 512 629 505 -293 -128 -584 125 -854 -670 -432 -110 63
1195F3j76P30m17j2J55J32p95o46N51m7J44J46L47J2j16K59m61K0K07l70O88k92
$$ 63 -113 617 200 188 343 475 -320 -966 -415 -462 -318 -172 175 187 71 330 -131 -111 96 -274 414 122
1217A22l52r1n49K74M72M28K75J12n86N44k38p36l02j4m04O68k3j9L34k29Q56
$$ 122 -230 -321 -870 -596 -124 304 579 691 105 649 411 -325 -627 -641 -1045 -377 -400 -419 -85 -314 542
1238E42j68M5m74L63n96J72m34m67O41O77k55K95P0j92j33M85m07k39q0j11J67
$$ 542 374 419 -55 308 -288 -116 -550 -1017 -376 301 46 341 411 219 86 571 164 -75 -155 -266 -99
1259i9M9r7J90n5kJ81L8K82k54O40l31o99J13l37K18l79M64K88k7r2J95L19L2
$$ -99 -50 -147 43 -12 -14 167 205 487 233 873 542 -157 -44 -381 -163 -542 -78 210 183 91 286 605 637
1282F37j33m72m52m01J90K57k54L76j60J035j6J77l18N8k31n66o16R50K73o43
$$ 637 504 32 -420 -821 -631 -374 -628 -252 -412 623 607 784 466 524 293 -273 -889 61 334 -309
1302c09k63K45R52n27J69L90m29l78J07l9J25o72K48Q1j91L68M58n19O59l02N
$$ -309 -572 -327 625 98 267 657 228 -150 -43 -82 43 -629 -381 -300 -491 -123 335 -184 475 173 178
1323A78J49J81m97J00L8o20Q1k38L68P67j68O7R2n3j87j9o27J81l12K84O5K6O12
$$ 178 327 508 11 111 149 -471 -390 -628 -260 507 339 406 498 445 258 239 -388 -207 -519 -235 -170 -144 468
1346D68k30K59j85J11q44J099l75n23O63n32m98M22l29L96r7J052r53P8K62M74
$$ 468 238 497 312 423 -421 678 303 -220 443 -89 -587 -165 -494 -98 -195 857 -96 -18 244 718
1366G18o80l46O66j068M77p1k42O34j51N88R4P5l01k11k07j31o96M40J62R4Oj99
$$ 718 38 -308 358 -710 -233 -304 -546 88 -63 525 619 694 393 182 -25 -156 -852 -412 -250 -156 -150 -349
1388c49N25n49N71L69J03q60j91N78q10R6K40K72M36k69J10K66m91O81j043M88
$$ -349 176 -373 198 567 670 -190 -381 197 -613 -517 -277 -5 431 162 272 538 47 728 -315 173
1408A73m68L12k19m08L62q8L52j49J67j11N40L9l0n84j35j74m96Q43j35K82l54
$$ 173 -295 17 -202 -610 -248 -336 16 -133 34 -77 463 502 472 -112 -247 -421 -917 -74 -209 73 -281
1429b81Q35o63L48j42L69J68n77m64O97m08o17J09O07K19k08k26L85j34J09k70
$$ -281 554 -109 239 97 466 634 57 -407 290 -118 -735 -626 -19 200 -8 -234 151 17 126 -144
1449a44K94k19j04R3j46n53J54L13J90Q20n43L08m30M51m87m51K70j97R5K20j63
$$ -144 150 -69 -173 -80 -226 -779 -625 -312 -122 698 155 463 33 484 -3 -454 -184 -381 -286 -66 -229
1470b29L47O7L49K26q41L17Q6j15k86o3l44K55l21L14J98K10k2lN33m49l3m01
$$ -229 118 185 534 760 -81 236 322 207 -79 -142 -486 -231 -552 -238 -40 170 148 145 678 229 196 -205
1492b05N40l69j38j81O00j025Q74K49r5Q3r8p8q2n23m8L5J45J92K52K16N9j93
$$ -205 335 -34 -172 -353 247 -778 96 345 250 333 235 157 75 -448 -496 -461 -316 -124 128 344 403 210
1514B10K33l59r5L53k66L31m7n48k39k04K49M86j42O51j68k88j53m4K2r4k75K43
$$ 210 443 84 -11 342 76 407 360 -188 -427 -631 -382 104 -38 613 445 157 4 -40 -18 -112 -387 -144
1536a44j93J93L88m19JQ40M31o56j41r1q3r1k18j10J82l87J37Q58K8n92O58k04
$$ -144 -337 -144 244 -175 -174 666 1097 441 300 209 126 35 -183 -293 -111 -498 -361 497 525 -67 591 387
1558C87N0k01m95l1L1j8m12K02K32J6K12Q2N34L7p20J46j90j70j09K95j17M0k64
$$ 387 437 236 -259 -290 -259 -277 -689 -487 -255 -239 -27 55 589 626 -94 52 -138 -308 -417 -122 -239 -199 -463
1581d63M59K42k19O62p97N65k74j91k11Q4j20n5Q1L32k18N07j73q06P25j4m13
$$ -463 -4 238 19 681 -116 449 175 -16 -227 -143 -263 -318 -237 95 -123 384 211 -595 130 116 -297
1602b97N4N82m24j23j0J6p7j54P87j75k63M74k63k74J89m55j18J84M46m63j56
$$ -297 -243 339 -85 -208 -218 -202 -279 -433 354 179 -84 390 127 -147 42 -413 -531 -347 99 -364 -520
1623e20N51N94m43o4M11n83K08J6m56j25N52m05K13M45k35J72J49m08J1M13k98
$$ -520 31 625 182 118 529 -54 154 170 -286 -411 141 -264 -51 394 159 331 480 72 83 496 198
1644A98j82R4k56M04o22p7J08L25K22q0j42Q7m2j52j14J09j00l5QM34k80jL83
$$ 198 16 110 -146 258 -364 -441 -333 -8 214 134 -8 79 37 -115 -229 -120 -220 -255 -247 187 -93 -94 289
1667B89J05K13j26q8n49Q1j57J4J8K34Q35j047K80K23m3k50N81l37k11k59j6j80
$$ 289 394 607 481 393 -156 -75 -232 -218 -200 34 869 -178 102 325 282 32 613 276 65 -194 -210 -390
1689c90J95m3j98K08L44l7M95j18l40k12j86N9r1j2NK1P48o73M74k31L42J34l2
$$ -390 -195 -238 -436 -228 116 79 574 456 116 -96 -282 -223 -314 -326 -321 -300 448 -225 249 18 360 494 462
1712D62j80k92l28j54j78M55n6M44J56l1P5m94P0K88k40J57l48k06J16J31n0n0
$$ 462 282 -10 -338 -492 -670 -215 -271 173 329 298 373 -121 -51 237 -3 154 -194 -400 -284 -153 -203 -253
1734b53L09j26j85N81l53J0L62o40N64q75Q88q94O67m61N72L5pM11p05q5M37J62
$$ -253 56 -70 -255 326 -27 -17 345 -295 269 -606 282 -612 55 -406 166 201 194 605 -100 -185 252 414
1756D14l25l22l10M28NM75n43N22J16o58p9O0J73L18N6o97K59J77J08j5L01l09
$$ 414 89 -233 -543 -115 -110 365 -178 344 460 -198 -277 -217 -44 274 330 -367 -108 69 177 162 463 154
1778A54m4N2K04o08O54m76J90K21m23j88M40k70K98K49m21qo0jk43L76k48k20
$$ 154 110 162 366 -242 412 -64 126 347 -76 -264 176 -94 204 453 32 24 -36 -37 -280 96 -152 -372
1800c72j7j10N86l6K11Q6O0K27j061Q76p47P23j107P15K34n43O21m66J93R0j2
$$ -372 -389 -499 87 51 262 348 408 635 -426 450 -297 426 -681 34 268 -275 346 -120 73 163 151
1821A51K57j66n01j1j85L39j32M87j45rl5J09r1K34k97L02o6n2l00j00M21q9J44
$$ 151 408 242 -259 -270 -455 -116 -248 239 94 85 50 159 68 302 5 307 241 189 -111 -211 210 121 265
1844B65n0j1J92om17J93J93m53q5K80l78K30k81qM51J4j2J39K52O3q59k04L51
$$ 265 215 204 396 390 -27 166 359 -94 -179 101 -277 -47 -328 -336 115 129 117 256 508 571 -288 -492 -141
1867a41k35L3K92K38j51J75l02j28M02O88j091K80J95q4r7J6l27K29j50J30O29
$$ -141 -376 -343 -51 187 36 211 -91 -219 183 871 -220 60 255 171 74 90 -237 -8 -158 -28 601
1888F01m58K4m48M61J67m49O3k5M6J22k23K4J41p8J94K14l81k93N79j30n42K60
$$ 601 143 167 -281 180 347 -102 -39 -64 -18 104 -119 -95 46 -32 162 376 -5 -298 281 151 -391 -131
1910a31n4K2O5M4N4L33o29R25l91n26L62l6m25O89j74m37N03R2k76L76j60j55
$$ -131 -185 -163 -98 -54 0 333 -296 629 238 -288 74 38 -387 302 128 -309 194 286 10 386 226 71
1932G1N86q44N45q20L08k38L54l15J71M44o67N57K19l46j98p7M70Mk93K85L5m67
$$ 71 657 -187 358 -462 -154 -392 -38 -353 -182 262 -405 152 371 25 -173 -250 220 224 -69 216 251 -216
1954b16J55R2J65l14j61L8N53m88L70l7n00J5J41l23N08J64l86K06N10K43p51
$$ -216 -61 31 196 -118 -279 -241 312 -176 194 157 -343 -328 -187 -510 -2 162 -224 -18 492 735 -16
1975a6L16m44J19O2l03M14J4l79N84k23j31K84n09l1Q12p98P34r28L72m01O21
$$ -16 300 -144 -25 37 -266 148 162 -217 367 144 13 297 -212 -243 569 -229 505 -423 -51 -452 169
1996A69P6k93N60l75k1k60M22l14j12R5P2q4M89l35n9r4K78Oo73L06P12m71l0
$$ 169 245 -48 512 137 116 -144 278 -36 -148 -53 19 -65 424 89 30 -64 214 220 -453 -147 565 94 64
2019F4K03p10M90J59l16M47j83J90k49m0ql44nL30k56k9l61M50J70J9J62k95Q30
$$ 64 267 -443 47 206 -110 337 154 344 95 55 47 -297 -302 28 -228 -257 -618 -168 2 21 183 -112 718
2042G18o16n9O2k02j95K48o57Q80j77m9N2R2k90N11J25p58N69o4L87l49j88rl86
$$ 718 102 43 105 -97 -292 -44 -701 179 2 -47 5 97 -193 318 443 -315 254 190 577 228 40 31 -355
2065c55M83k19K80o63N16Q3k7M9l03M94m16K64M7m01J27K85J33r6k25j74K70L5
$$ -355 128 -91 189 -474 42 125 98 147 -156 338 -78 186 233 -168 -41 244 377 281 56 -118 152 187
2087A87M7o14K27k39L28m58L66J87o0M0l35K46j36M50p50J06P6K89j48L50j3n5
$$ 187 234 -380 -153 -392 -64 -522 -156 31 -29 11 -324 -78 -214 236 -514 -408 -332 -43 -191 159 146 91
2109I1K92o90J07j48K56K48K4k91L16l76p9j11M06j30L08R8pp5j57K64o35J57
$$ 91 383 -307 -200 -348 -92 156 180 -111 205 -171 -250 -361 45 -85 223 321 314 239 82 346 -289 -132
2131a32L56l4j82K6R5k24M6J77j75M51o76k47O35m0p4J0m21O19m56J4L31J4Nl58
$$ -132 224 190 8 34 129 -95 -49 128 -47 404 -272 -519 116 76 2 12 -409 210 -246 -232 99 113 118 -240
2155b40K00K49R8n56N77n76L10L55m12m80O51l20K79Qk82jk12J38k17K48L56k60
$$ -240 -40 209 307 -249 328 -248 62 417 5 -475 176 -144 135 143 -139 -140 -352 -214 -431 -183 173 -87
2177h7l2J95j48O1p2o0P0j9N98k76l09K03k69L96k06J50J21j02r0k45L87M3m87
$$ -87 -119 76 -72 -11 -83 -143 -73 -92 506 230 -79 124 -145 251 45 195 316 214 124 -121 266 309 -178
2200a78M66j74j91n78P14J10R8L8j83k76K30l71L62l37MO19l50m9O10n20O96o62
$$ -178 288 114 -77 -655 59 169 267 305 122 -154 76 -295 67 -270 -266 353 3 -46 564 44 740 78
2222G8J21r3m98P92q23L04N5k15L71k1P07o55l66P65j64k45m61P05m18r3J50L65
$$ 78 199 106 -392 400 -423 -119 -64 -279 92 71 778 123 -243 522 358 113 -348 357 -61 -154 -4 361
2244C61k71j63K91L23q07L66J77k14l8j36r6O6J38l24M87j79O2p94J028l79L84
$$ 361 90 -73 218 541 -266 100 277 63 25 -111 -207 -141 -3 -327 160 -19 43 -751 277 -102 282
2265B82l31m97p2L33J43K25k48J37K89K23o15J41J83o0M04m87l46N43n85M15J61
$$ 282 -49 -546 -618 -285 -142 83 -165 -28 261 484 -131 10 193 133 537 50 -296 247 -338 77 238
2286B38k41J18m97N11p6j39Om2K31m16O3k0Q04j28N8m89K96K08k23k55j2J43k89
$$ 238 -3 115 -382 129 53 -86 -80 -122 109 -307 -244 -264 540 412 470 -19 277 485 262 7 -5 138 -151
2309a51N17l46kR9j31l36J51M38K03o02K00m95O9R42j24k24l41j93n3N57p3J3
$$ -151 366 20 18 117 -14 -350 -199 239 442 -160 40 -455 -386 556 432 208 -133 -326 -379 178 105 118
2331A18l96M20O6k24J26j75K93o20K29k07L6K75q3K27L52m48k98N34L44m16l66
$$ 118 -278 142 208 -16 110 -65 228 -392 -163 -370 -334 -59 -142 85 437 -11 -309 225 569 153 -213
2352b13L23n03N39j14k04p7M27k55M50n75J90k31l83Q12m96N48n35M37k30n46
$$ -213 110 -393 146 32 -172 -249 178 -77 373 -202 -12 -243 -626 186 -310 238 -297 140 -90 -636
2372f36O71M08n57J57K79m14j41J15j57j6k8M81N8m33M05j80j6Q1m70N44l90R40
$$ -636 35 443 -114 43 322 -92 -233 -118 -275 -291 -319 162 220 -213 192 12 -4 77 -393 151 -239 701
2394G01q07m04P78kk52M06q41R04p10K80j25p8M91j93J52K00r37Q33p3k27K05
$$ 701 -106 -510 268 266 14 420 -421 483 -227 53 -72 -150 341 148 300 500 -437 396 323 96 301
2415C01k29O7K05k86K9o78P27J3l44k82P76m07P1j05K73o7K4k6n0k19J49J35J00
$$ 301 72 139 344 58 87 -591 136 149 -195 -477 299 -108 -37 -142 131 64 88 62 12 -207 -58 77 177
2438A77l57J68l95O98m99N63j56j40J03o43O28jL0m1J74j12J42k15J63J18j49
$$ 177 -180 -12 -407 291 -208 355 199 59 162 -481 147 146 176 135 309 197 339 124 287 405 256
2459B56l25n03K93M89o2l28m06M93p8L97j72L75Jq71O21j41j02j52K78j69j04
$$ 256 -69 -572 -279 210 148 -180 -586 -93 -171 226 54 429 430 -441 180 39 -63 -215 63 -106 -210
2480b10N02k00K97k72j25k83L55k65L0O70j016O48n25K60K71rk8L40q28k35P68
$$ -210 292 92 389 117 -8 -291 64 -201 -171 499 -517 131 -394 -134 137 128 100 440 -388 -623 145
2501A45j67K60j53p07L24j9M46l22k53O53l72K25N01o94P1J64p5j06O7k65M37
$$ 145 -22 238 85 -622 -298 -317 129 -193 -446 207 -165 60 561 -133 -62 102 27 -79 -12 -277 160
2522A60m68N65n3K62n18o4j02L7l71M33L44m53J52j59N38m51r4L94m88K41l61
$$ 160 -308 257 204 466 -52 -116 -218 -181 -552 -119 225 -228 -76 -235 303 -148 -242 152 -336 -95 -456
2543d56N47k48K99m1k1j31k30K10L24m66r7K50O2J16Q7Lq28O46k7j67Q0K14n64
$$ -456 91 -157 142 101 80 -51 -281 -71 253 -213 -310 -60 2 118 205 208 -620 26 -1 -168 -88 126 -438
2566d38O26m3L02k99k24J33l34K22l5n7K19K93m07l08J49K21QK18j7L4l73N81
$$ -438 188 145 447 148 -76 57 -277 -55 -90 -147 72 365 -42 -350 -201 20 28 246 229 263 -110 471
2588D71o08%L28l87K05L55l12r3O2l7R2J48o5m75K91r6m67O26J09m18K94k70L70
$$ 471 -137 -137 191 -196 9 364 52 -41 21 -16 76 224 159 -316 -25 -121 -588 38 147 -271 23 -247 123
2611A23l23L70R9k08J46j79j9j29J36k54M76m83L45J20k01m12L43M2K37r12J326
$$ 123 -200 170 269 61 207 28 9 -120 16 -238 238 -245 100 220 19 -393 -50 -8 229 -683 643
2632F43p25M0L27j26m0j33m27P08l13q6K32m66K52N9M21j9l84L7J35n36O70k18
$$ 643 -82 -42 285 159 119 -14 -441 267 -46 -132 100 -366 -114 -55 366 347 -37 0 135 -401 269 51
2654E1P7n11K21J70J02n35L76k66J60k84K75j11J14j18L06L33n29J17l11J47J29
$$ 51 128 -383 -162 8 110 -425 -49 -315 -155 -439 -164 -275 -161 -279 27 360 -169 -52 -363 -216 -87
2675h7n8O1J79m1M32n33J06j85J94j63K9K46j17k48K94k96J14L62M0j09Q0j52
$$ -87 -145 -84 95 54 486 -47 59 -126 68 -95 -66 180 63 -185 109 -187 -73 289 329 220 300 148
2697A48k18J47RK33k16l86J20L49J21m75L59P9n53L97o0RR3p66P21L60k45l84
$$ 148 -70 77 86 319 103 -283 -163 186 307 -168 191 270 -283 114 54 63 156 -610 111 471 226 -158
2719a58Q2n0l5N20m70M99n81J46P5J90q09K16P42k96N4L25m42l32J021l95q74
$$ -158 -76 -126 -161 359 -111 388 -193 -47 28 218 -591 -375 367 71 125 450 8 -324 697 302 -572
2740e72M50J80k99L51j64p2J60K45l88l3J75l76Q2L53j47l66J87k38K91J10L38
$$ -572 -122 58 -241 110 -54 -126 34 279 -109 -142 33 -343 -261 92 -55 -421 -234 -472 -181 -71 267
2761B67J34k88J40k35R9Q1j20k38J60k99J22O31j79N4L8l64j09K53l28Q7J13j99
$$ 267 401 113 253 18 117 198 78 -160 0 -299 -177 454 275 329 367 3 -106 147 -181 -94 19 -180
2783a80j96K33j7j75P37n26r1K43L58l76r3JJ7k53L72l35J59Lk73J77L19KO4k30
$$ -180 -376 -143 -160 -335 402 -124 -215 28 386 10 -83 -82 -65 -318 54 -281 -122 -119 -392 -215 104 106 170 -60
2807f0K9M67l35k94M53n1N6l59L77Q1m60J93j97M51l50j58K55N3j74Q1j26J16
$$ -60 -31 436 101 -193 260 209 265 -94 283 364 -96 97 -100 351 1 -157 98 151 -23 58 -68 48
2829D8j10K18n16j16O77k60m05N8O58n9J6l4l36L43k66J46p3J39m66J01j91M16
$$ 48 -62 156 -360 -476 201 -59 -464 -406 252 193 209 175 -161 182 -84 62 -11 128 -338 -237 -428 -12
2851a2n88J239l41o18O32n23l8Q3L36m2J20Pm72N48l14M23n40P8O17j061N27k86
$$ -12 -600 639 298 -320 312 -211 -249 -166 170 128 248 255 -217 331 17 440 -100 -22 595 -466 61 -225
2873b25J31K83k44L23l52M72m64M19n44l73N11R20j054j28K57M73l92o17R34j47
$$ -225 -94 189 -55 268 -84 388 -76 343 -201 -574 -63 857 -197 -325 -68 405 13 -604 330 183
2893A83L2R0k54nP9N7l3k86J71J52Lk81K51J87l30N14k94n92L07l42M45J62m52
$$ 183 215 305 51 46 125 182 149 -137 34 186 189 -92 159 346 16 530 236 -356 -49 -391 54 216 -236
2916b36l53M95N9j31L87o05O81k49k65L41m04M62O5k81m03J83K88K66n43O25o5
$$ -236 -589 -94 -35 -166 221 -384 297 48 -217 124 -280 182 247 -34 -437 -254 34 300 -243 382 317
2937C17l81k88J30R5r9k64N00K84m55J12J33j41N37l11m7j33J03M5k55J40l64
$$ 317 -64 -352 -222 -127 -226 -490 10 294 -161 -49 84 -57 480 169 122 -11 92 137 -118 22 -342
2958c42Q7j94N75kq1n35N81j0l2L30r7l54M86jn12K51j72l1j16k82O28k90k27
$$ -342 -255 -449 126 124 43 -492 89 79 47 377 280 -74 412 411 -101 150 -22 -53 -169 -451 177 -113 -340
2981c40l8P81k99J66k17M61q30Q76p02M79j34K87m09o15L48N53n77M90m56L98
$$ -340 -378 403 104 270 53 514 -316 560 -142 337 203 490 81 -534 -186 367 -210 280 -176 222
3001B22l20r5J71K97k70P70m59o17N55m32N82q30O67j85M9j34n71P0J134p1o42
$$ 222 -98 -193 -22 275 5 775 316 -301 254 -178 404 -426 241 56 105 -29 -600 -530 604 533 -109
3022a09K08j83J72J23p15L86L56l70J77k79K99J43o95N94K74K57n57l52J06k32
$$ -109 99 -84 88 211 -504 -118 238 -132 45 -234 65 208 -487 107 381 638 81 -271 -165 -397
3042c97L2M2L73j90j27K55K94n34J85K79n54P99k23L38l27n21L84k17K22k15N3
$$ -397 -365 -323 50 -140 -267 -12 282 -252 -67 212 -342 457 234 572 245 -276 108 -109 113 -102 -49
3063d9M5l81M6O96n20L12q0K33l41O6j2j30J51k55O01j36K98n00p7J57m34kK88
$$ -49 -4 -385 -339 357 -163 149 69 302 -39 27 15 -115 36 -219 382 246 544 44 -33 124 -310 -312 -24
3086b4o4K02k36R5j6j09R32l66j9l16k63M2O53k44j039J005j68j98L3L47o47Q82
$$ -24 -88 114 -122 -27 -43 -152 780 414 395 79 -184 -142 511 267 -772 233 65 -133 -100 247 -400 482
3108D82j97m95L30j92j61L12n38P5M50J87m30P1J38J47l53K39J96P6n79Q3K58
$$ 482 285 -210 120 -72 -233 79 -459 -384 66 253 -177 -106 32 179 -174 65 261 337 -242 -159 99
3129I9q7K92k58k50N37j88m69k23O07M5k27L64l52j33N33k20lJ84k78K53l19j20
$$ 99 12 304 46 -204 333 145 -324 -547 60 105 -122 242 -110 -243 290 70 67 251 -27 226 -93 -213
3151b13J51L45m18J18M63l87o8K67p9J40n81m87P05L04m45L10N07o18M16o26L65
$$ -213 -62 283 -135 -17 446 59 -9 258 179 319 -262 -749 -44 260 -185 125 632 14 430 -196 169
3172A69l29J70R6k82K61lL58m42R4l77J45m8K29j32m16O58J47l55M95o32J14K38
$$ 169 -160 10 106 -176 85 82 440 -2 92 -285 -140 -188 41 -91 -507 151 298 -57 438 -194 -80 158
3194A58l27K04M24l41l53Q9K63n77R01j60p63J90J91J71m0P6m88j69L74K47k60
$$ 158 -169 35 459 118 -235 -146 117 -460 441 281 -482 -292 -101 70 30 106 -382 -551 -177 70 -190
3215a90M73j29j48L11n61O29k05l30K14k24L63l48L93o79O85R4L29p07K62o48
$$ -190 283 154 6 317 -244 385 180 -150 64 -160 203 -145 248 -431 254 348 677 -30 232 -416
3235d16L37J48K58j22l92L2O9l1O6K1Q3K7j04K7k45K25J13j40mo0L79J78k49n94
$$ -416 -79 69 327 205 -187 -155 -86 -117 -51 -30 53 80 -24 3 -242 -17 96 -44 -48 -108 271 449 200 -394
3259c94Q30o64j76J64K09K51m84J60R6j97N02o25N11j90k14K98k80j21M09o66
$$ -394 436 -228 -404 -240 -31 220 -264 -104 -8 -205 297 -328 183 -7 -221 77 -203 -324 85 -581
3279e81L75J75MJ31l05P37p05J09J35r3J7L45l65k69K60j29m77P09k67K85k12
$$ -581 -206 -31 -27 104 -201 536 -169 -60 75 -18 -1 344 -21 -290 -30 -159 -636 73 -194 91 -121
3300a21r1L1k50P02j60n03P23j23p8J8O2p3M26l34l28j33M18j74P54p99m14K15
$$ -121 -212 -181 -431 271 111 -392 331 208 130 148 210 137 563 229 -99 -232 186 12 766 -33 -447 -232
3322b32k62L08M28m78N9J11j6K79k23L51k33j41n04N83j43j92J61K66K97n56O2
$$ -232 -494 -186 242 -236 -177 -66 -82 197 -26 325 92 -49 -553 30 -113 -305 -144 122 419 -137 -75
3343g5J46j54Nj63L16q24O51L23l87M31k94j43k31L06J80o8j58k26J30pQ31r14
$$ -75 71 -83 -78 -241 75 -749 -98 225 -162 269 -25 -168 -399 -93 87 19 -139 -365 -235 -242 589 -325
3365c25M93j03j55L17k83Q2J14J11k16j90J37j41j45j62R79o23L2k76J80Q23m65
$$ -325 168 65 -90 227 -56 26 140 251 35 -155 -18 -159 -304 -466 513 -110 -78 -354 -174 649 184
3386A84r9j35O8l59M37m01J31M94o58K45k44O74o9m11l41P75m14l49M94N54o49
$$ 184 85 -50 18 -341 96 -305 -174 320 -338 -93 -337 337 268 -143 -484 291 -123 -472 22 576 -73
$$ [...]
8191A66
##END NTUPLES=NMR FID
##END=
