##TITLE=1H_DE-75K_NaOH
 D2O
 8 sc, 
 25.11.2024
##JCAMPDX= 6.0         $$ Bruker NMR JCAMP-DX V2.0
##DATA TYPE= NMR FID
##DATA CLASS= NTUPLES
##ORIGIN= UXNMR, Bruker Analytische Messtechnik GmbH
##OWNER= root
$$ XWIN-NMR		Version 3.5
$$ Mon Nov 25 14:50:27 2024 Russian Standard Time (UT+4h)  she@DPX200
##.OBSERVE FREQUENCY= 200.1315
##.OBSERVE NUCLEUS= ^1H
##.DELAY= (6, 6)
##.ACQUISITION MODE= SIMULTANEOUS
##.ACQUISITION SCHEME= undefined
##.AVERAGES= 8
##.DIGITISER RES= 18
##SPECTROMETER/DATA SYSTEM= spect
##.PULSE SEQUENCE= zg30
##.SOLVENT NAME= D2O
##.SHIFT REFERENCE= (INTERNAL, D2O, 0, 15.7039)
##AUDIT TRAIL= $$ (NUMBER, WHEN, WHO, WHERE, WHAT)
$$ ##TITLE= Audit trail, XWIN-NMR		Version 3.5
$$ ##JCAMPDX= 5.01
$$ ##ORIGIN= Bruker BioSpin GmbH
$$ ##OWNER= she
$$ F:/spectra/data/she/nmr/H-F/1/audita.txt
$$ ##AUDIT TRAIL=  $$ (NUMBER, WHEN, WHO, WHERE, WHAT)
(   1,<2024-11-25 14:48:36.56 +0400>,<she>,<DPX200>,
      <created by zg, POWCHK disabled, PULCHK disabled
       configuration hash MD5:
       00 E9 B6 7A A2 85 ED C7 34 08 36 98 17 FE 4E 26
       data hash MD5: 16K
       C6 53 89 3B D3 2F A9 8A C2 7F C9 98 B9 D8 45 99>)
$$ ##END=
$$ 
$$ hash MD5
$$ D1 23 B7 E7 65 25 1B 47 6A 9E CD 60 E7 A4 59 F3
##$RELAX= 
##$RELAX= 
##$RELAX= 
##$RELAX= 
##$RELAX= 
##$RELAX= 
$$ Bruker specific parameters
$$ --------------------------
##$DU= <F:/spectra>
##$EXPNO= 1
##$NAME= <H-F>
##$PROCNO= 1
##$TYPE= <nmr>
##$USER= <she>
##$AMP= (0..31)
100 100 100 100 100 100 100 100 100 100 100 100 100 100 100 100 100 100 
100 100 100 100 100 100 100 100 100 100 100 100 100 100 
##$AQSEQ= 0
##$AQ_mod= 1
##$AUNM= <au_zg>
##$AUTOPOS= <>
##$BF1= 200.13
##$BF2= 200.13
##$BF3= 200.13
##$BF4= 200.13
##$BF5= 200.13
##$BF6= 200.13
##$BF7= 200.13
##$BF8= 200.13
##$BYTORDA= 1
##$CFDGTYP= 0
##$CFRGTYP= 5
##$CHEMSTR= <none>
##$CNST= (0..31)
1 1 145 1 1 1 1 1 1 1 1 1 1 1 1 1 1 1 1 1 1 1 1 1 1 1 1 1 1 1 1 1 
##$CPDPRG= <>
##$CPDPRG1= <>
##$CPDPRG2= <>
##$CPDPRG3= <>
##$CPDPRG4= <mlev>
##$CPDPRG5= <mlev>
##$CPDPRG6= <mlev>
##$CPDPRG7= <mlev>
##$CPDPRG8= <mlev>
##$CPDPRGB= <>
##$CPDPRGT= <>
##$D= (0..31)
0 1.2 0 0 0 0 0 0 0 0.06 0 0.03 0 0 0 0 0.0002 0 0 0 0 0 0 0 0 0 0 0 0 
0 0 0 
##$DATE= 1732531716
##$DBL= (0..7)
120 120 120 120 120 120 120 120 
##$DBP= (0..7)
150 150 150 150 150 150 150 150 
##$DBP07= 0
##$DBPNAM0= <>
##$DBPNAM1= <>
##$DBPNAM2= <>
##$DBPNAM3= <>
##$DBPNAM4= <>
##$DBPNAM5= <>
##$DBPNAM6= <>
##$DBPNAM7= <>
##$DBPOAL= (0..7)
0.5 0.5 0.5 0.5 0.5 0.5 0.5 0.5 
##$DBPOFFS= (0..7)
0 0 0 0 0 0 0 0 
##$DE= 6
##$DECBNUC= <off>
##$DECIM= 24
##$DECNUC= <off>
##$DECSTAT= 4
##$DIGMOD= 1
##$DIGTYP= 9
##$DL= (0..7)
0 120 120 120 120 120 120 120 
##$DP= (0..7)
150 150 150 150 150 150 150 150 
##$DP07= 0
##$DPNAME0= <>
##$DPNAME1= <>
##$DPNAME2= <>
##$DPNAME3= <>
##$DPNAME4= <>
##$DPNAME5= <>
##$DPNAME6= <>
##$DPNAME7= <>
##$DPOAL= (0..7)
0.5 0.5 0.5 0.5 0.5 0.5 0.5 0.5 
##$DPOFFS= (0..7)
0 0 0 0 0 0 0 0 
##$DQDMODE= 0
##$DR= 18
##$DS= 0
##$DSLIST= <SSSSSSSSSSSSSSS>
$$ [...]
##$SUBNAM2= <"">
##$SUBNAM3= <"">
##$SUBNAM4= <"">
##$SUBNAM5= <"">
##$SUBNAM6= <"">
##$SUBNAM7= <"">
##$SUBNAM8= <"">
##$SUBNAM9= <"">
##$SW= 24.0689530833862
##$SWIBOX= (0..15)
0 0 2 0 0 0 0 0 0 0 0 0 0 0 0 0 
##$SW_h= 4816.95568400771
##$TD= 16384
##$TD0= 1
##$TE= 0
##$TE2= 300
##$TE3= 300
##$TEG= 300
##$TL= (0..7)
0 120 120 120 120 120 120 120 
##$TP= (0..7)
150 150 150 150 150 150 150 150 
##$TP07= 0
##$TPNAME0= <>
##$TPNAME1= <>
##$TPNAME2= <>
##$TPNAME3= <>
##$TPNAME4= <>
##$TPNAME5= <>
##$TPNAME6= <>
##$TPNAME7= <>
##$TPOAL= (0..7)
0.5 0.5 0.5 0.5 0.5 0.5 0.5 0.5 
##$TPOFFS= (0..7)
0 0 0 0 0 0 0 0 
##$TUNHIN= 0
##$TUNHOUT= 0
##$TUNXOUT= 0
##$USERA1= <user>
##$USERA2= <user>
##$USERA3= <user>
##$USERA4= <user>
##$USERA5= <user>
##$V9= 5
##$VALIST= <valist>
##$VCLIST= <CCCCCCCCCCCCCCC>
##$VD= 0
##$VDLIST= <DDDDDDDDDDDDDDD>
##$VPLIST= <PPPPPPPPPPPPPPP>
##$VTLIST= <TTTTTTTTTTTTTTT>
##$WBST= 1024
##$WBSW= 4
##$XGAIN= (0..3)
0 0 0 0 
##$XL= 0
##$YL= 0
##$YMAX_a= 299852
##$YMIN_a= -163317
##$ZGOPTNS= <>
##$ZL1= 120
##$ZL2= 120
##$ZL3= 120
##$ZL4= 120
##$ABSF1= 10
##$ABSF2= 0
##$ABSG= 5
##$ABSL= 3
##$ALPHA= 0
##$AQORDER= 0
##$ASSFAC= 0
##$ASSFACI= 0
##$ASSFACX= 0
##$ASSWID= 0
##$AUNMP= <proc_1d>
##$AZFE= 0.1
##$AZFW= 0.1
##$BCFW= 1
##$BC_mod= 2
##$BYTORDP= 1
##$COROFFS= 0
##$CY= 11.3945322036743
##$DATMOD= 1
##$DC= 2
##$DFILT= <>
##$DTYPP= 0
##$F1P= 15.6554695791079
##$F2P= 12.8336369535428
##$FCOR= 0.5
##$FTSIZE= 0
##$FT_mod= 4
##$GAMMA= 1
##$GB= 0.15
##$INTBC= 1
##$INTSCL= 1
##$ISEN= 128
##$LB= 0.24
##$LEV0= 0
##$LPBIN= 0
##$MAXI= 10000
##$MC2= 0
##$MEAN= 0
##$ME_mod= 0
##$MI= 1.114404
##$NCOEF= 0
##$NC_proc= 0
##$NLEV= 6
##$NOISF1= 3.799351
##$NOISF2= 2.8
##$NSP= 1
##$NTH_PI= 0
##$NZP= 0
##$OFFSET= 15.70392
##$PC= 1
##$PHC0= -26718.01
##$PHC1= 17.78744
##$PH_mod= 1
##$PKNL= yes
##$PPARMOD= 0
##$PSCAL= 0
##$PSIGN= 0
##$REVERSE= no
##$SF= 200.130013532006
##$SI= 16384
##$SIGF1= 3
##$SIGF2= 2
##$SINO= 400
##$SIOLD= 16384
##$SREGLST= <1H.CDCl3>
##$SSB= 0
##$STSI= 0
##$STSR= 0
##$SW_p= 3612.71676300578
##$SYMM= 0
##$S_DEV= 0
##$TDeff= 0
##$TDoff= 0
##$TI= <>
##$TILT= no
##$TM1= 0
##$TM2= 0
##$TOPLEV= 0
##$USERP1= <user>
##$USERP2= <user>
##$USERP3= <user>
##$USERP4= <user>
##$USERP5= <user>
##$WDW= 1
##$XDIM= 8192
##$YMAX_p= 0
##$YMIN_p= 0
$$ End of Bruker specific parameters
$$ ---------------------------------
##NTUPLES= NMR FID
##VAR_NAME=  TIME,          FID/REAL,        FID/IMAG
##SYMBOL=    X,             R,               I
##VAR_TYPE=  INDEPENDENT,   DEPENDENT,       DEPENDENT
##VAR_FORM=  AFFN,          ASDF,            ASDF
##VAR_DIM=   8192,          8192,            8192
##UNITS=     SECONDS,       ARBITRARY UNITS, ARBITRARY UNITS
##FACTOR=    0.0002076,     1,               1
##FIRST=     0,             0,               0
##LAST=      1.7004516,     0,               0
##MIN=       0,             -163317,         0
##MAX=       1.7004516,     299852,          0
$$ Real data points
##PAGE= N=1
##DATA TABLE= (X++(R..R)), XYDATA
0@%%%%%%%%%Qj6J6j6K1k9L3m1N0n8P2q4R3j08J28j49J71j95K23k53K84l22L65
$$ 0 0 0 0 0 0 0 0 0 0 8 -8 8 -8 13 -16 17 -24 26 -32 40 -44 49 -59 69 -80 91 -104 119 -134 150 -172 193
32A93m09M59n12N72o38P08p88Q75r69J073j189J315j455J614j790J989k218K481
$$ 193 -216 243 -269 303 -335 373 -415 460 -509 564 -625 690 -765 849 -941 1048 -1170 1311
50A311k786L150l586M122m810N714o970Q855j2023J8701n8570J17242J36420p5338
$$ 1311 -1475 1675 -1911 2211 -2599 3115 -3855 5000 -7023 11678 -46892 70350 206770 131432
64A31432o9719p3005q4277o3395N2050R8059Q6024N6023K2823n3346r6113q9095
$$ 131432 61713 -11292 -95569 -158964 -106914 -8855 77169 133192 156015 102669 6556 -82539
76h2539m6451K3879J21923J33576L3181n6271n5798o5795r9524m6531Q4412J28888
$$ -82539 -128990 -105111 16812 150388 183569 127298 71500 5705 -93819 -140350 -55938 72950
88G2950O9854J3698j7185q0650j26119p0916L8569R5875Q6756M6315l023m4192
$$ 72950 142804 156502 139317 58667 -67452 -138368 -99799 -3924 82832 129147 126124 81932
100H1932o6312q0293p0379O375J05523J19062M3389k8159o2664r4812r3692j4738
$$ 81932 15620 -64673 -135052 -128677 -23154 95908 139297 111138 48474 -46338 -140030 -154768
112a54768Q1138J00801N4874J1388k1963o3264q7024n7903O673O3488Q6931O5245
$$ -154768 -73630 27171 82045 93433 71470 8206 -78818 -136721 -130048 -66560 20371 85616
124H5616J0423m2724p2386p8150m5849K6813Q6402P8288L4325L616l1627q3110
$$ 85616 96039 53315 -19071 -97221 -143070 -116257 -29855 48433 82758 86374 54747 -28363
136b8363r2639k1858O4413Q8935O3044K7728j6603o4796p8456m5136P066N0965
$$ -28363 -121002 -142860 -78447 10488 73532 101260 84657 19861 -58595 -103731 -96665 -45700
148d5700P2480N8136J7162k2355n4801p8825n9554J5971Q3234Q3094L9015j296
$$ -45700 26780 84916 102078 79723 24922 -53903 -113457 -97486 -14252 68842 107857 106561
160A06561m2424p9615o7960n272M6144N4801M8338L8077q8n1728p3818n5035r325
$$ 106561 64137 -15478 -83438 -88710 -42566 12235 60573 98650 98562 46834 -26984 -82019 -91344
173i1344M4777P5571N5901R450k4929m9930o7368m6725J2893N7252N5132M0858
$$ -91344 -46567 29004 84905 94355 69426 19496 -47872 -94597 -81704 -24452 30680 71538
185G1538K0823k6098p7196p4166j7182L6486N8428N6303K9743j2109m3504n2493
$$ 71538 92361 66263 -10933 -85099 -102281 -65795 -7367 48936 78679 66570 23066 -29427
197b9427m5129j7215K9804N9889N3443K6257p843n1814p6224m3988K1471N5437
$$ -29427 -74556 -91771 -61967 -2078 51365 77622 69779 17965 -58259 -102247 -80776 -25339
209b5339M7920L3734J5717k1297n5358n3799k3503J2799M5314O0514M1107j383
$$ -25339 22581 56315 72032 50735 -4623 -58422 -81925 -69126 -23812 36702 77809 76426
221G6426l9733n8250m8451q071L7087M9722L6679K2178K475l5305o3020m4984
$$ 76426 36693 -21557 -70008 -78079 -40992 8730 45409 67587 70062 34757 -28263 -73247
233g3247K703L8679N1167M6750J8991k6922n6796m8916j7350J5019L6882M2505
$$ -73247 -70544 -31865 19302 66052 85043 58121 1325 -47591 -64941 -49922 -13040 29465
245B9465L2289R790k1446n1256n4274k0179K7105M9522M3953K5029n182m0811
$$ 29465 61754 71544 50098 -1158 -55432 -75611 -48506 1016 44969 69998 64816 24005
257B4005n4503l1850L581K6006L5404L9529K5445j0967m5756n3725k9157R594
$$ 24005 -30498 -62348 -58767 -32761 2643 42172 67617 56650 10894 -42831 -71988 -62394
269f2394L8696M5794L1092N653k4284m4391m1392j3505J5478L2392L8399L3860
$$ -62394 -23698 22096 53188 58841 34557 -9834 -51226 -64731 -49253 -16861 21538 55398
281E5398O831l3661n5231l7793o74K7617L9774L6886J7449j1394l6102m0354k4567
$$ 55398 62229 28568 -26663 -64456 -65130 -37513 2261 39147 56596 45202 9100 -31254 -55821
294e5821R83K4665L8870L8126J7280j9006m7833m4616j2604J8242L2825L4729
$$ -55821 -54838 -30173 8697 46823 64103 45097 -2736 -47352 -59956 -41714 -8889 25840
306B5840K5489L663k5366l9775l2018j0372J4364L4237M1007K6191q241l8484
$$ 25840 51329 54992 29626 -10149 -42167 -52539 -38175 -3938 37069 63260 55019 16535
318A6535m3923k3012N639K5244L1494K8644J4224j1544l4444l8414k0862M758
$$ 16535 -27388 -50400 -44761 -19517 11977 40621 54845 43301 8857 -29557 -50419 -45661
330d5661K7776L9799L1914L250k9148m1091k7944m027J3451K4923L1078K3612
$$ -45661 -17885 21914 53828 57078 27930 -13161 -41105 -45132 -31681 -6758 24320 47932
342D7932P96k7312l9642k9446m249K1358L5254L3672J3163j6048l5185l1694j3511
$$ 47932 48728 21416 -18226 -47672 -51921 -30563 4691 38363 51526 35478 293 -31401 -44912
355d4912M551J8453K9129K9792J1652j7399l6789l3421j2976J1965K9885L4063
$$ -44912 -40361 -21908 7221 37013 48665 31266 -5523 -38944 -51920 -39955 -10070 23993
367B3993K0396m238k6283l0653k0469n422J0822K6200L3592K0681p890l2638l4544
$$ 23993 44389 40151 13868 -16785 -37254 -42676 -31854 -5654 27938 48619 40729 8091 -26453
380b6453j8375L949K2208L0710K5456N799j5873k8249k4199j3725L045K0692L2635
$$ -26453 -44828 -40879 -18671 12039 37495 43294 27421 -828 -25027 -38752 -35707 -15015 17620
393A7620K7149K377k4598l4204k3443m089J3728K6628K7242J4083o633k2889k6175
$$ 17620 44769 47146 22548 -11656 -35099 -39188 -25460 1168 28410 42493 35860 12971 -13204
406a3204j9728n393J4033L0432L0322J0326j6651l0171k5632j0982M856J9534
$$ -13204 -32932 -38325 -24292 6140 36462 46788 30137 -34 -25666 -36648 -31792 -12258
418a2258K6498K1694K593j7246k6207k3228j1746P250K5718L1679J6636q257k4966
$$ -12258 14240 35934 38527 21281 -4926 -28154 -39900 -32650 -6932 24747 41383 33126 8160
431H160k5474j5354j976J1854K3571K4545J1030q678k2722k5084j7116l29K0088
$$ 8160 -17314 -32668 -34644 -22790 781 25326 36356 27678 4956 -20128 -37244 -37573 -17485
444a7485L0617K1907j88j8319k3369j8221q141M292J9175K6069J7780j244j7874
$$ -17485 13132 35039 34851 16532 -6837 -25058 -33199 -28907 -9732 16337 34117 32873 14999
457A4999k4575k0977o692J3637K7192K4502P275j1251j9317j9706j3525j690J3375
$$ 14999 -9576 -30553 -37245 -23608 3584 28086 35361 24110 4793 -14913 -28438 -30128 -16753
470a6753K4653K2480N757j2828k3377k2019j1232O031K2212K4737J2758l645j4841
$$ -16753 7900 30380 36137 23309 -68 -22087 -33319 -27288 -5076 19661 32419 28774 13933
483A3933j8388j7027r318P103K1582K4328J2666n798k0501k3426j4714J36J5206
$$ 13933 -4455 -21482 -30800 -23697 -2115 22213 34879 29081 8580 -14846 -29560 -29424 -14218
496a4218K2457J7316L452r380j7159j8167j4140L48J7416K4709J7062l54j4960
$$ -14218 8239 25555 29007 19627 2468 -15699 -29839 -29491 -12075 12634 29696 29342 14382
509A4382k1514j7570n599Q914J8941J8767R636k748j3670j8795j6693n672J1579
$$ 14382 -7132 -24702 -30301 -21387 -2446 16321 25957 23209 9539 -9256 -25949 -31621 -20042
522b0042K3361K0446N303j0433j7885j7639j0127J854J4557J8766J3815M266q567
$$ -20042 3319 23765 29068 18635 750 -16889 -27016 -25162 -10605 8161 21976 26242 17675
535A7675j8193j9434r942O168K0041K1271J0256m825j4637j6200j2959l496P930
$$ 17675 -518 -19952 -29894 -23726 -3685 17586 27842 23017 8380 -7820 -20779 -24275 -16345
548a6345J7371J7020Q289l475j4576k0343j4048J110J5474K0272J3134R34r792
$$ -16345 1026 18046 26335 22860 8284 -12059 -26107 -24997 -9523 10749 23883 24817 15025
561A5025j4952j4090q604K285J4101J8049J2784L00j1620j8345j6547m567J0364
$$ 15025 73 -14017 -22621 -20336 -6235 11814 24598 24898 13278 -5067 -21614 -26181 -15817
574a5817J8277J4859N026m145j1588j5763j2198k566J0158J7887J5967M563q333
$$ -15817 2460 17319 22345 18200 6612 -9151 -21349 -23915 -13757 4130 20097 24660 16327
587A6327j6582j6280p970M192J4457J5986Q936m10p650j2882j5355q080N872J6083
$$ 16327 -255 -16535 -24505 -20313 -5856 10130 19066 18656 11006 -1876 -17231 -25311 -19439 -3356
601c356J7523Q657l518j3154j6666j1790O64J0259J4540J1916M795m299j1711
$$ -3356 14167 22824 19306 6152 -10514 -22304 -21640 -11381 3159 15075 19870 15571 3860
614C860j5070j0631J0J2967J7782J1690K73r027j3828j3725n062N733J2947J2954
$$ 3860 -11210 -21841 -21831 -8864 8918 20608 20881 11854 -1974 -15699 -20761 -15028 -2081 10873
628A0873Q689O10r168j5868j3917k713R086J6358J3106M343o333j1723j2463q324
$$ 10873 19562 20172 11004 -4864 -18781 -21494 -12408 3950 17056 21399 15066 3343 -9120 -17444
642a7444k27R606J3585J0293M045m461j3313j6165p887N545J3742J3264P883j231
$$ -17444 -17671 -8065 5520 15813 19858 15397 2084 -14081 -21968 -16423 -2681 10583 18466 17235
656A7235r176j2677j0597l454N526J1899J2814P114k312j0579j5090j0747P67
$$ 17235 8059 -4618 -15215 -18669 -13143 -1244 11570 18684 16372 5793 -9297 -20044 -19277
669a9277J0864J3567Q474K560l828j1158j2531p563J981R911J3878J0223J007
$$ -19277 -8413 5154 13628 16188 12360 1202 -11329 -18892 -16911 -7000 6878 17101 18108
682A8108q448j4369j1971k292P366J2153J0041M297q09p287j1645j0664k281P035
$$ 18108 9660 -4709 -16680 -18972 -11606 547 10588 14885 14076 6789 -4856 -15520 -17801 -10766
696a0766J2569J1647N516m862j2262j3292n974L584R570J0849P457K248n093j1389
$$ -10766 1803 13450 18966 14104 1842 -11450 -17424 -13840 -4270 6579 14036 16284 11191 -198
710a98j2001n091M228J1426J1664O630j490q529j1616q970r66O067R738R369N506
$$ -198 -12199 -17290 -13062 -1636 10028 16658 15168 6639 -4977 -13947 -14913 -8846 892 10261 15767
725A5767r59r429j3403r188Q49J0146J2356Q385Q01o159j0748r168l441K433Q005
$$ 15767 14808 5379 -8024 -17212 -16363 -6217 6139 14524 15325 9166 -1582 -10750 -14191 -11758 -3753
740c753R192P996J728o510j2022j0710k632O329J0547R936M774l126q639j0364
$$ -3753 5439 13435 15163 8653 -3369 -14079 -16711 -10382 165 10101 14875 11749 3110 -7254
754g254o771o7O482R430R113M250m024j1017j0932m992L916Q660R308N856J117
$$ -7254 -14025 -14092 -7610 1820 10933 15183 11159 142 -10790 -15782 -11866 -3206 6102 11958 13075
769A3075n382r589q998l338L248Q615J0565O949j391q999j1387p168J103O519
$$ 13075 7693 -1896 -10894 -14232 -10984 -2369 8196 15145 13754 4755 -6632 -13800 -12697 -6178
783f178Q704P145L197k726p841r359n410K90O438R606Q239K637o210j0533q581
$$ -6178 2526 9671 12868 10142 2301 -7058 -12468 -12178 -5740 3866 12105 14742 8532 -2001 -10582
798a0582j957L537P238P883N854O38o297j0022p626k049M967R555Q673L745l432
$$ -10582 -12539 -9002 -1764 6119 11973 12611 6314 -3708 -11334 -13383 -8416 1139 9812 13557 10125
813A0125q634q850l915R79M684P695P488L144l446q967r006m710K421P959R548
$$ 10125 1491 -7359 -11274 -10295 -5611 2084 9572 12716 9270 303 -8703 -13413 -10992 -3033 6515
828F515O027j205p075q495n652q98L085O219P940N606j267p084r764n815K4N868
$$ 6515 12542 11337 4262 -4233 -9885 -10783 -7698 -1479 6461 12067 10800 3716 -6048 -11863 -11839 -5971
844e971Q572O880K215l984p178p459l671M83N692Q122P025J472n721r271o645
$$ -5971 2601 9481 11696 7712 534 -6925 -10596 -10113 -4421 3701 10726 12198 6477 -2794 -9439
859i439j856L869O906P606L584k073n265o763n131j642K707P743Q601L127k783
$$ -9439 -11295 -7426 -520 7086 10670 8597 3332 -3431 -8562 -10204 -7497 246 8847 11974 9191
874I191q786p578l422J698N513O685N672J136l807o888o258l505J532O410P689
$$ 9191 405 -7173 -10595 -8897 -3384 3301 8973 10109 6302 -586 -6844 -10349 -8817 -2407 5282
889E282N858j339o003p544n028n01L575O089O113L175j592n360p189m877o60M838
$$ 5282 11140 9801 3798 -3746 -8774 -9275 -5700 389 6502 9677 8085 2725 -4464 -9341 -10001 -5163
905e163Q214O324N19m406o574n168k304J333M513O262M623Q55l684o833o130k530
$$ -5163 3051 9375 9894 5488 -1086 -6254 -8558 -7225 -2712 3550 8173 9028 5344 -1489 -7619 -10149
921a0149L293O725O615L334k388n852n761l361l80K946O027N850K403k576n912
$$ -10149 -6856 -131 6484 9818 7430 1578 -4183 -7544 -7924 -4978 1049 6899 9302 6726 814
936H14o431l829J383N782O577L672j08l474n610m386k279J031N147O381M435p37
$$ 814 -5617 -9446 -8063 -2281 4296 7968 7860 4386 -1224 -5610 -7889 -6858 -1711 4670 9105 8368
952H368n185o743m473j43L478O127N032J170k279l509n325l884l71L617O562N079
$$ 8368 3183 -3560 -8033 -8176 -4698 1429 6461 7631 5352 1843 -3482 -7366 -7737 -4120 2442 7521
968G521J080l594o039n165j992K409M457N273K990j72l300m619m807k437K551
$$ 7521 8601 5007 -1032 -6197 -8189 -5780 -1323 3950 6940 6768 3468 -1151 -5958 -8395 -5844
983e844N769N959K334k269m801m906l213P98L095M572M244J461j751m386n468
$$ -5844 -75 5884 8218 5949 1148 -3758 -6971 -6173 -3078 1494 5738 7199 5448 1062 -4406
998d406k998P13M150O283L489m53l920m501l379j551J541M250M683K828n62l512
$$ -4406 -7404 -6691 -2541 3742 7231 6778 2858 -1643 -5022 -6573 -5032 -782 3901 6729 6167 2655
1014B655m772m534o24L148N697M332P66k104m071m122k613O97K744M669L630J099
$$ 2655 -2117 -6651 -7275 -4127 1570 5902 6668 4564 493 -3629 -6242 -5545 -2801 1868 5498 6597
1030F597k403m665m445k057J736M772M412K037q41l009l463l381j362J675M198
$$ 6597 4194 -471 -4916 -6973 -5237 -465 3947 5984 5143 2134 -1329 -4710 -6072 -4397 -199
1045a99M349K454j304l766n356k664Q63L727L996K872L41j811l249l701k613Q33
$$ -199 4150 6604 5300 1534 -3822 -6486 -5623 -1896 2100 4972 5313 3502 253 -3448 -6061 -5228
1061e228L482M447L047J71l111m527l075r56K364L936L127J536o98k551l516l967
$$ -5228 -1746 2701 5748 5919 2808 -1719 -4794 -5750 -3386 550 3677 5213 4515 1964 -1552 -5519
1077e519j49K486M460L302J126j893l700l421k021R74K820L239K532Q91j936l267
$$ -5519 -5668 -3182 1278 4580 5706 3813 113 -3308 -5329 -4355 -1535 1704 4236 5127 3191 -76
1093g6m036j660J780L303M268J802j049k701l381k544l96J972L148K699K055o94
$$ -76 -4112 -5772 -3992 -689 3579 5381 4332 1631 -1750 -4294 -4690 -2718 430 3129 5184 4490
1109D490l010m087k906M55L102L477L350m09j728l111k772j249O31K546L162K455
$$ 4490 1480 -2607 -5513 -5058 -1956 1521 4871 4462 2734 -377 -3149 -4398 -3767 -1221 1941 4396
1125D396J95k121l959l221l72K275L284L110P15p46k416k874k121n48J778L306
$$ 4396 4591 2470 -1489 -4710 -5082 -2807 477 3587 4302 3556 1140 -1734 -3855 -4403 -2625 681
1141F81L212J013j480l443l179j559J095K544L032J891q5j002k901k856j416R88
$$ 681 3893 4906 3426 -17 -3196 -4755 -3660 -1116 1916 3807 3722 2720 -181 -3037 -4453 -3465
1157c465K887L446J942o95k974k934j963k34K072K632K127Q34j35k501k776k431
$$ -3465 -578 2868 4810 4115 1141 -1793 -3756 -3990 -1918 714 2841 3675 3540 1039 -1737 -4168
1173d168J32K331K883K903K43j990l304k127n10P32K361K599J148L05j687k872
$$ -4168 -4036 -1705 1178 4081 4324 2334 -970 -3097 -3607 -2875 -514 2085 3233 3538 1851 -1021
1189a021k460j216K198L097K497R81j009k387k805j602M87J747K110K146Q74o24
$$ -1021 -3481 -4697 -2499 598 3095 4076 3067 680 -2125 -3727 -3240 -1493 617 2763 3637 3013
1205C013k856k345j855L67K938K717J652l84j748k170k024r19J190J826K460J597
$$ 3013 157 -2188 -4043 -3676 -738 1979 3631 3247 1499 -671 -2695 -3614 -2424 -598 1862 3459
1221C459J61k481k803j656K53J607K361K098L62j037k083k065j314L76J540K307
$$ 3459 3620 1139 -1664 -3320 -3067 -1460 901 2999 3361 2324 241 -1824 -3138 -2762 -1222 1085
1237A085K122M13j583k774j938n80J334J594K049J226J38j465k426j730n40J086
$$ 1085 3207 3620 2037 -737 -2675 -3255 -1921 -327 1722 2948 3086 1621 -805 -2535 -3075 -1989
1253a989J868K478J019p68k221k149j581O85J740J718J857K21j007j750j955j328
$$ -1989 -121 2357 3376 2608 387 -1762 -3343 -2658 -918 800 2657 2878 1871 121 -1834 -3162
1269c162L80J799K009J986j2k085j983j499l96J097J704J858R08Jj486k101k047
$$ -3162 -2782 -983 1026 3012 3000 915 -1068 -2567 -2963 -1866 -162 1696 2604 2605 1119 -982 -3029
1286c029r6J531K281J633P09j071k184j838p50P81R62J932J645N44j202k456j771
$$ -3029 -3125 -1594 687 2320 3029 1958 -226 -2064 -2814 -2033 -1071 861 2506 3050 1848 -608 -2379
1303b379p89J098J720K183Q70l31j250j912j408k93R76J507J598J201o07j574
$$ -2379 -3168 -2070 -350 1833 2703 2372 1122 -790 -2198 -2491 -1515 -8 1590 2791 2184 610
1319F10k062j312N86J472J459J438j84j020r52j008j383K51J463J808J470n11
$$ 610 -1452 -2764 -2178 -706 753 2191 2007 987 35 -973 -2356 -2105 -642 1166 2636 2125
1335B125q97j937j512j2Q18J442J495N81j68j144j915j020m06P78K225J311R75
$$ 2125 1228 -709 -2221 -2233 -1415 27 1522 2103 1935 791 -1124 -2144 -2550 -1772 453 1764 2739
1352B739j205j941j115o31K28J563J078J111j0p58j054j692n47P10J040K178J110
$$ 2739 1534 -407 -1522 -2153 -1925 -362 716 1827 1817 1059 5 -1687 -2234 -1524 -484 1694 2804
1369B804p02j485j351j030l03J130J151J356J79K46j171j892o36n65J352J659
$$ 2804 2102 617 -734 -1764 -2067 -937 214 1570 1749 1995 824 -1068 -1704 -2269 -917 742
1385G42J238M37j184j543j187m74K11Q62K060R09J70q72j753j444p24J365J637
$$ 742 1980 2417 1233 -310 -1497 -1971 -1760 -898 1162 2071 2241 1369 -384 -1828 -2552 -1187 450
1402D50R28Q26q26j059q97r44j52P40Q77J644N61m55j756j144j025M08J340J552
$$ 450 1378 2204 1378 319 -578 -1522 -1674 -934 -57 1587 2148 1693 -63 -1207 -2232 -1824 -484 1068
1420A068N06J71p63j154j082m32j5J355J559O04K72j191j383j306q5P04J268J102
$$ 1068 1574 1745 982 -172 -1254 -1686 -1701 -346 1213 1817 2089 898 -485 -1791 -1876 -1172 96 1198
1438A198K91J09p66j399j062j56O89J387J273K62o93j136r22o93L71O81J115J018
$$ 1198 1489 1598 832 -567 -1629 -1785 -1096 291 1564 1826 1133 -3 -925 -1618 -1247 -566 549 1567
1456A567k13k65j239j325j37K03J125J290R18n45q59j157p57r7M11R81J315J28
$$ 1567 1354 1089 -150 -1475 -1612 -1409 -284 1006 1924 1379 520 -637 -1394 -1491 -1080 -99 1216 1344
1474A344P5j063j293m57j42P60J213J257j53o35j198l56n14j43Q67J113R26j36
$$ 1344 1419 356 -937 -1394 -1536 -776 437 1694 1541 906 -292 -648 -1162 -1305 -438 675 1601 1465
1492A465p30p43j063q77J144R90P66M55J4j016j227l49k37K43J182J138O80q96
$$ 1465 735 -8 -1071 -1948 -804 186 952 1407 1421 405 -822 -1171 -1408 -1165 17 1155 1835 939
1510I39q74q17r29J99J067Q72P97j66m04n17j164m62J65J191O74J209l74q07q83
$$ 939 65 -752 -1681 -1482 -415 457 1254 1088 684 167 -997 -1459 -1294 -103 571 1780 1406 599 -284
1529b84j112k95J076O96R70N56m92m19j000j125k14J092Q40J500n7n68r59r69
$$ -284 -1396 -1691 -615 81 1051 1607 1115 696 -304 -1429 -1643 -551 289 1789 1732 1164 205 -764
1547g64n82N74L61R51N86J56m43o73j321o14Q09P24J092N16k54o47p39j322J68
$$ -764 -1346 -772 -411 540 1126 1282 839 166 -1155 -1769 -960 -236 856 1372 1118 471 -268 -1590 -1422
1566a422P66M21J160K50l18k79j266p59J56O92J233P50J26o74p83n35r95j97R63
$$ -1422 -656 -235 925 1175 857 578 -688 -1447 -1291 -599 634 1384 1510 836 53 -482 -1477 -1674 -711
1585g11J225P27ll99j389n59k73M42R82P53M11K18j102p05p79J11KJ247R58J36
$$ -711 514 1241 1238 839 -550 -1109 -1382 -940 42 795 1206 1424 322 -383 -1162 -1051 -1049 198 1156 1292
1605A292q6j044j234p0L39J68R70M19L32j55j077q35m91K37R79R29N96J01p61
$$ 1292 1206 162 -1072 -1142 -803 -635 335 754 1086 931 -146 -981 -1472 -1235 -256 673 1269 1370 609
1624F09j127l71k44M30M99Q08O39R6r48j046l75l86L96J490P11K20l37j002q18
$$ 609 -518 -889 -1133 -703 -204 604 1243 1339 391 -655 -1030 -1416 -1020 470 1181 1401 1064 62 -756
1643g56n84M45N79Q71M83O53j000n64j083l56L15P76R90K26K46r72n53p81J2L36
$$ -756 -1340 -895 -316 555 1038 1691 691 127 -956 -1312 -997 -221 769 995 1241 269 -284 -1065 -1053 -717
1663g17L95P95N45L9n83j050n80k13O50J141P44N8l75r04p90m25K64L96Q61J163
$$ -717 -322 473 1018 1057 474 -576 -1156 -1369 -719 422 1166 1224 849 -55 -845 -1270 -1006 -610 251 1414
1683A414l52m59j015p72q7L53Q37P43J73J55o80k38r94j42P7J106P38J13Mp94
$$ 1414 1062 603 -412 -1184 -1271 -918 -81 662 835 990 310 72 -922 -1064 -987 119 857 970 974 180
1703A80r60j47j87P38O28N81K85m90m80r90m76K4J015M62J155l80n24q23o12N4
$$ 180 -780 -927 -1114 -376 252 833 1118 628 148 -842 -1318 -1294 -279 183 1338 958 434 -389 -1001 -947
1723i47M82M78M84M14K77j053m23p32m2M49O77J012N18p33q02o01m92M51J20P70
$$ -947 -465 13 497 911 1188 135 -288 -1020 -1062 -613 64 1076 1594 861 59 -542 -1034 -583 -463 307
1743C07J082l48m89n51r03l37N34M61Q48M66Ko15p10j096N79PM65J010O30j74
$$ 307 1389 1041 552 1 -902 -1239 -705 -244 604 1070 1072 457 -253 -1349 -770 -763 -298 712 1342 1168
1763A168p81q85o07j09M63J366O3K81j71n17r18m49K7O27R15M81J45l04j066o73
$$ 1168 387 -498 -1105 -1214 -751 615 678 959 788 271 -647 -1096 -1069 -442 473 954 1099 795 -271 -944
1783i44L7Q8P46O30L62J12j28j166p66L4K20O56R28L57k88o67j147j49K95M08
$$ -944 -907 -819 -73 557 919 1031 903 -263 -1029 -995 -775 -119 809 1166 878 211 -936 -1085 -790 -382
1803c82M70M03M89k88p76q60j02R8N07R64P49j53m73o88r65m6L33O81P01L34j74
$$ -382 88 491 980 692 -84 -944 -1046 -948 -441 523 1272 1119 646 -42 -1007 -1053 -720 -39 662 996 822
1824H22l84q17m46n20Q49M46Q98J53m28n38q13j22j10Q37L98O90j4j09q73j000
$$ 822 438 -379 -825 -1345 -496 -50 848 1001 573 35 -778 -900 -1010 -173 225 915 901 792 -81 -1081
1844a081O6K67N19O32P36j77n31n26p02k55M2J261O36N07l57p54q46n68R7M74
$$ -1081 -1015 -748 -229 403 1139 962 431 -95 -797 -1052 -1010 251 887 1394 1037 283 -563 -1131 -1034 -560
1864e60O65Q72M3n52n33p45l67o1R99L33Q24M04r69n21n88k02J18O39O95N76N2
$$ -560 105 977 1020 468 -65 -810 -1177 -1238 -239 94 918 1322 353 -168 -756 -958 -840 -201 494 1070 1122
1885A122o00p94j106N42J61M24J043K46n20l48r28k34o8N17P50O14J75p47j29
$$ 1122 522 -272 -1378 -836 -675 -251 792 1038 518 170 -758 -992 -1060 -543 207 821 996 249 120
1904A20o09o86O36M82M43P32j70n54m30o35k65K04N34Q34N38l67o43o10l89m01
$$ 120 -489 -1175 -539 -57 386 1118 948 394 -36 -671 -936 -732 -198 636 1174 807 164 -446 -835 -1236
1924a236O79R36O05J93l91l72j069k37M1N80O60M75K81m94r58p01R3o0R16Q52
$$ -1236 -557 379 984 1177 786 414 -655 -892 -851 -271 389 864 1145 651 -307 -1008 -915 -975 -59 793
1944G93M58j61p02o76l68m38J68J162O10R4k02l24q15p29M07L09O21O98P9o48
$$ 793 1251 1090 388 -288 -656 -1094 -926 236 846 940 738 414 -401 -1130 -723 -414 207 905 984 336
1964C36k52q20k67L00N37N24R03j53p50q01l02J69l26J017M47M89m05o28j30q90
$$ 336 84 -736 -1003 -703 -166 358 1261 1108 358 -443 -745 -576 -902 115 562 1051 646 18 -112 -1002
1984a002J66M00J188J40J20n32m28r00R3k8N93M92L08K89j43q95n35m18K06J027
$$ -1002 -836 -436 752 892 1012 480 52 -848 -755 -783 -190 302 610 899 756 -139 -674 -1092 -886 141
2004A41N85M08k53m87p75l66k47M06M49Q83K05j52l36j184k81J80N09P84L03l9
$$ 141 726 1134 881 394 -381 -747 -994 -588 -139 744 949 797 461 -723 -1004 -824 -315 469 772 733
2024G33n59l60l64p52N77Q92M06K95K73o42r63k29l24M97M91Q85k3J63r28n36
$$ 733 174 -186 -550 -1302 -725 167 573 868 1141 499 -464 -693 -1017 -520 -29 856 833 996 68 -468
2044d68m94k77O82O82P36L0m72l14j117k15O46P75J17N20Q4j25p94p64J5J00M05
$$ -468 -962 -1239 -557 125 861 891 419 105 -1012 -1227 -581 194 311 831 915 790 -4 -768 -753 -653 -248
2065b48R55M22l06m45r29m94K86J37O92P34J19l73p28k37m73J25M90N51N98N5
$$ -248 707 1129 823 378 -551 -1045 -759 -622 70 804 923 550 -178 -415 -888 -763 -273 278 876 931
2085I31j32r33p57j86K47N28Q80N20R9n19p94q33k84N04R16O08L48m23p17p45
$$ 931 799 -134 -891 -1077 -830 -302 578 1098 1197 678 -116 -949 -1233 -729 187 795 1143 720 3 -742
2105g42l61L62P70R6N53J77o2o18q89l9k84Q81P83K03K87r73j94m97m55N65N36
$$ -742 -1103 -741 29 125 678 855 793 175 -714 -753 -1037 -156 627 830 1117 144 -50 -547 -1002 -437 99
2126I9O16M24l12n69q28k72j29M71N30Q72k27m1o42o56J34O2K74O25N08l37j37
$$ 99 715 1139 827 258 -570 -842 -971 -500 30 902 675 634 -8 -664 -530 -468 -194 431 939 602 465
2147D65o58p18m0M29L16O99M90n6p86n29o83J96N31M22Q59J77n15m57n17p08M90
$$ 465 -193 -911 -951 -522 -206 493 983 927 141 -388 -1071 -875 -344 78 937 1114 599 142 -375 -1083 -593
2168e93L83P11L69l4%j026o72j64M13M82M86P98l44k46q49n92K17L41L55O36J72
$$ -593 -210 501 870 836 836 -190 -862 -1026 -613 -131 355 1153 809 563 -286 -878 -661 -320 35 671 843
2189H43m6q12m45n40KM86O11O73L29r43j20n16q08M46N38R06L29K75m93q08n54
$$ 843 797 -15 -460 -1000 -998 -512 99 772 1101 158 38 -478 -1286 -840 -302 604 933 1208 715 -93 -647
2210f47j15M3O49N93J87J5o30o21m66J34K42O10Q59J70l92m34j050j32p9P06Q20
$$ -647 -762 -719 -70 523 710 725 95 -526 -992 -858 -616 -6 853 1023 631 197 -853 -985 -1064 -358 462
2231D62Q3L29m03o76m83l06L95M47R20N38m62p31q7n37l11L31P76M24J97m26k54
$$ 462 545 874 471 -205 -688 -994 -599 -152 768 1306 844 113 26 -511 -822 -491 285 709 906 480 226
2252B26n69l78J14N2P62M58J46k63q16n16k82P41P8N83M77P8n81m55q23J26M40
$$ 226 -343 -721 -607 -555 207 665 811 548 -268 -784 -1066 -325 -247 336 813 891 310 -145 -968 -842 -402
2273d02N18N86k0P9q63n16k88L21L16J07P99J61j49n60q01k06K28N93N21N93l3
$$ -402 116 702 682 761 -102 -618 -906 -585 -269 -162 637 798 649 89 -712 -918 -690 -97 424 1017 984
2294I84n57q83n40M08n7P28P57J4k08k05o46p15l8L61Q26P16k24j60q46j03l17
$$ 984 427 -456 -996 -588 -645 83 840 854 646 441 -205 -920 -958 -597 229 945 721 561 -285 -388 -705
2315g05j25L05Q29M80R9k48r42k86j73j98M90J301J29m6r32o2r44K94J83Q17M45
$$ -705 -830 -525 304 784 883 635 -307 -593 -766 -964 -474 827 956 910 -22 -84 -1028 -734 -551 266 711
2336G11k42L15n94l05q43L62L98L42K39L12j91o37o24m92N46O86Q52k02N38n56
$$ 711 469 784 190 -115 -958 -596 -198 144 383 695 504 -133 -757 -1249 -703 -17 835 633 1171 615
2356F15r81j65k80P23N3Q03L02n29l04n81o70R3M06O42N11J62j39p00n89j92L65
$$ 615 -366 -531 -811 -88 -35 768 1070 541 237 -344 -1014 -921 -515 127 638 800 661 -39 -628 -820 -455
2377d55N04M14L26r6l90m32o31m03N91O37O03L36k02p28m79n92J37L77L91Q80
$$ -455 49 463 789 693 303 -129 -760 -1163 -572 65 668 1004 802 74 -405 -997 -860 -483 -92 788
2397G88J84j49q56l37k49j70O10O88L46J66q31m14m76j51PN31R81J37om59o16
$$ 788 972 823 -33 -370 -619 -789 -179 509 855 1021 190 -224 -700 -851 -844 -313 668 805 799 340 -276
2418b76o59K98j5P41N60L15m80j76o23r69M25L65J167k07N69n52n01m22j96q8
$$ -276 -935 -637 -652 89 649 964 484 308 -315 -1284 -859 -494 673 466 1035 483 -18 -440 -636 -724
2438g24O22N11R00o12l25o65n17o4J76O99P10M31k67p87q11j10q3O16Q44J01j4
$$ -724 -102 409 1309 697 372 -293 -810 -874 -698 1 711 1142 875 88 -723 -833 -916 -300 544 645 631
2459F31l24l86m42k13M6O03O88L14J9l44o62q87L41L30O9P53K73J26p73n84k92
$$ 631 307 -79 -521 -734 -688 -85 603 917 936 592 -70 -957 -616 -286 -217 536 809 935 162 -422 -714
2480g14l56P91N27O5L26p7m88o77q1J19Q2P23M41O0m57m68n07j57j42J239J39
$$ -714 -1070 -279 248 313 639 562 74 -603 -684 -565 -483 240 681 741 284 -184 -691 -848 -990 249 388
2501C88O72k26n72r79j02J59K80L95R42J9m58l60o56j68M1L07O09K95N8j20r17
$$ 388 1060 834 262 -717 -819 -660 -380 15 957 976 518 158 -498 -666 -625 -318 291 586 644 524 -393
2522c93r1k31J46M77N65L40J72p13o92m89K56L48M12N05L5n9o93l88l78K86J77
$$ -393 -484 -715 -569 -92 473 813 985 272 -420 -909 -653 -305 107 612 647 588 -105 -493 -871 -585 -408
2543d08R35J46J13n65l94l69m66M84N06M64K73J01l56j059j06j58L36M29P45M05
$$ -408 527 673 786 221 -173 -542 -1008 -524 -18 446 719 820 464 -595 -701 -859 -523 -94 651 1056
2563A056n23n55n79n0k04O01K28M20M45q8m14p18m48N10R7Q08K26j06m31n18k54
$$ 1056 533 -22 -601 -651 -855 -254 -26 394 839 751 337 -381 -829 -319 -222 586 812 706 275 -243 -497
2584d97j40K00N92L28L02J67q47o52k30P0J5Q73N50L44l31n39n82n62J45N33O42
$$ -497 -637 -437 155 483 785 952 105 -547 -777 -707 -692 181 731 1075 744 205 -377 -939 -794 -261 381
2605C81N03j04l98o17m32m75P31L57M31N17k56j77r09m02L07K73L70O89m3J1o39
$$ 381 884 780 382 -235 -667 -1142 -411 -54 377 894 638 461 -448 -850 -543 -270 100 789 746 757 118
2626A18o03k78p3M97N70L40J87m71m58q17K28J73M74N92O08l76l46r02m2m1K36
$$ 118 -485 -763 -836 -339 231 571 758 287 -171 -988 -760 -587 -113 479 1087 711 365 -537 -579 -620 -384
2647c84J28J089j77j34M4m90o98j66M23N60P83J08m89j021J45m97P7M04P20K73
$$ -384 -256 833 656 522 566 76 -622 -788 -365 195 978 1086 597 -424 -279 -776 -699 -295 425 698
2667F98M9p19J06n27j40J56N60M21M36l93o30o32k43N5L71N42M92J09pn66n26
$$ 698 747 28 134 -393 -533 -377 183 604 1040 647 17 -615 -858 -803 -432 110 602 711 704 138 -388
2688c88j73q9L85L43Q16n1o83j90n22k66M11N59M17J51j24l63k77p23n0L26N15
$$ -388 -561 -650 -265 78 894 843 160 -30 -552 -818 -407 152 569 720 596 233 -44 -767 -817 -491 24
2709B4O51K83o48k74o94K1J1J66L58O18KK21r02n65K95l62L97P26L43J17l64o56
$$ 24 675 958 310 36 -658 -637 -626 -460 -102 516 518 739 -163 -728 -433 -795 -398 328 671 788 424 -232
2731b32o29K91L89K41P53k4l74l11n18k31K16K07J50P47n9k97j82n86k27l85J056
$$ -232 -861 -570 -181 60 813 789 415 104 -414 -645 -429 -222 -72 675 616 319 137 -449 -676 -1061 -5
2752eK87O52m42k53m25o04J90K17M47M11o5L43n39o67j57j44N1R92N47K32o83
$$ -5 282 934 492 239 -186 -790 -600 -383 64 475 410 753 214 -453 -610 -754 -703 289 836 1068 385
2773C85m69o01J95l0J05P58O33k72q3p90n84J89r6O66N63q9J55j55j101J0L7K81
$$ 385 -84 -685 -490 -520 -415 343 976 704 621 -169 -753 -564 -660 6 569 480 635 480 -621 -611 -574 -293
2795b93K52O26K12r1j102J95m63L6p9Q64Q85n18l25k76k54l44K75J36O30Q8K60
$$ -293 -41 585 797 706 -396 -201 -664 -628 -707 157 1042 524 199 -77 -331 -675 -400 -264 366 454 714
2816G14k99n91p6m39L89N41jO43m64l79l29p01J47N78M47L55J69l23o76l79m0
$$ 714 415 -176 -252 -691 -302 239 238 881 417 38 -291 -992 -845 -267 180 535 704 381 -295 -674 -714
2837g14J5M44Q64P9Q5l60n06q32J67K34O84L65L19q5n16m71m23J8L15N05M53J77
$$ -714 -699 -255 609 688 773 413 -93 -925 -758 -524 160 525 844 759 243 -228 -651 -633 -318 187 640 817
2859H17l03n00m02k65J00L56M73J16L72m85q04l37K73J45M88L39K29O1l20o84
$$ 817 514 14 -388 -653 -553 -197 276 392 764 279 -525 -862 -589 -444 44 383 612 673 353 -331
2879c31m91L22P8N29K22K43j6l89n27n33m5N64N46L01M30j06j058m07L38k26O70
$$ -331 -822 -500 -422 107 329 572 556 167 -360 -893 -938 -374 172 473 903 797 -261 -668 -330 -556 114
2900A14M24J99L90j034j12l70k83K75Q28J87J0j8o78l07m21K23N79K96J59L02
$$ 114 538 737 1127 93 -19 -389 -672 -397 431 618 628 610 -68 -375 -796 -573 6 302 461 763
2920G63n43o04j44Q8p8N61K43N03j64n19j38o77J33J07M70K25L87k59J17p40k97
$$ 763 220 -384 -528 -440 -518 43 286 789 625 106 -32 -709 -576 -469 1 226 613 354 471 -269 -566
2941e66j86N89M9O12k7J0m26k41m30J9L81L61P02j76k63m06m88l7P8N09L39L68
$$ -566 -752 -163 -114 498 471 481 55 -186 -616 -597 -216 145 847 671 408 2 -486 -523 -445 64 403 771
2963G71Q2o39n99m8j11K65J64N83K03k4n57j091O22j79KQ39J19O23p62n72l07
$$ 771 853 214 -385 -433 -544 -279 -115 468 671 647 90 -1001 -379 -558 -556 283 402 1025 263 -309 -616
2984f16r7K12O11M7K58L66o44n62k03l04L46P14M28Q3l15l38m05j32L5J01P15
$$ -616 -713 -501 110 157 415 781 137 -425 -628 -932 -586 128 556 639 324 -14 -419 -551 -516 -415 300
3005C00M88j40N5p99k79j63K09K04N35N82k22p27j52k26l28J76L11O62L39m23
$$ 300 788 648 703 -96 -375 -538 -329 -125 410 992 770 43 -109 -335 -663 -487 -176 486 825 402
3025D02R6p35m90L01J5M38O24j49J50n38m27m80O70L13K12K21K51l93o49J56n85
$$ 402 498 -237 -727 -426 -411 27 651 502 652 114 -313 -793 -123 190 402 623 874 481 -168 -12 -597
3046e97K34L56M45J99j72j62m92k75r2K97M72K08L20k08k87n12N6k14K18J70P24
$$ -597 -363 -7 438 637 465 303 -189 -464 -556 -259 213 421 741 533 246 -266 -210 -424 -206 -36 688
3067F88j68j66m07l32pR3j24N71J69L26m11k44l09j70K30K36L21l8m2j53m40m06
$$ 688 520 354 -53 -385 -392 -299 -423 148 317 643 232 -12 -321 -491 -261 -25 296 258 216 63 -377 -783
3089g83K90p0L02Q13K65o67n1p32J33p6J04Q26P7R7l13m61m74J39K22K70N60j67
$$ -783 -493 -563 -261 552 817 150 99 -633 -500 -576 -472 354 431 528 215 -246 -720 -581 -359 -89 471 304
3111C04Q4k03m56m47N60l38M62O47k97J41l24m36p3j42M53J94K27J76j68l34p03
$$ 304 388 185 -271 -718 -158 -496 -34 613 316 457 133 -303 -376 -518 -65 129 356 532 364 30 -673
3132f73K16O9L61M96K07m4m22m95k62j88O60M11M4K18O8o56n44J3p5M94N24N7
$$ -673 -457 -388 -27 469 676 632 210 -285 -547 -735 -75 336 380 598 666 10 -534 -521 -596 -102 422 479
3154D79R1k87k08n72K41o3k83O97M37P6n15j79k57m78J52Q11K82P1l67l59L0k43
$$ 479 570 283 75 -497 -256 -319 -602 95 532 608 93 -86 -343 -821 -669 142 424 495 128 -231 -201 -444
3176d44Q4O0O92q2K46k76k03o77j83O11J33K60J25j71J86j88n74m74N00K21K48
$$ -444 -360 -300 392 310 556 280 77 -600 -783 -172 -39 221 346 175 361 173 -401 -875 -375 -154 94
3197I4P88n17j59m28o26J88O69J95J54K09j84k62n18nM9K21l8P41m21J94n07l67
$$ 94 882 365 206 -222 -848 -660 9 204 358 567 383 121 -397 -402 -353 -132 -170 571 150 344 -163 -530
3219e30K33j17N75L60q7p8n2l99j06m92M09M09K98n8j06l85j79j03j09N41j57
$$ -530 -297 -414 161 521 434 356 304 -95 -201 -693 -284 125 423 365 259 -126 -305 -408 -517 24 -133
3240a33M48K83l56m91k36N2n1K08P64j1o6k41l56k22j49L81L58K34J72k89j70
$$ -133 315 598 242 -249 -485 -433 -484 -276 488 477 411 170 -186 -408 -557 -176 182 416 588 299 129
3261A29j31n81J58L1O50K87J7k96j06n01J18l73M11L83L14l15M3n05r3j09L3K94
$$ 129 -2 -583 -425 -394 256 543 560 264 158 -343 -225 -598 -187 196 510 195 238 -267 -360 -469 -436 -142
3283a42L88M98k29l90l83P2m82K57L39O36N6j61m72n10P7K94K66J58L32j77l76
$$ -142 246 744 515 125 -258 -186 -668 -411 -72 564 620 459 -13 -523 -446 -152 114 272 604 427 51
3304E1l04p2l26M96J19M47j84L20l94k85m85M28j05K46O44l48K09n59l56J75k0
$$ 51 -253 -325 -651 -155 -36 411 227 547 153 -132 -617 -189 -294 -48 596 248 457 -102 -458 -283 -303
3325c03Q8M64j96L67l32No27Q4j17P98K20O4j05j74n09j98k3L00L87L11K7k69
$$ -303 -215 249 53 420 88 93 -534 -450 -567 231 451 515 410 236 -273 -471 -494 -194 193 504 531 262
3347B62m20J20k88jM7Q02k25J97n99J79o15K14j1R4M36K2M29m57l19J23m38J04
$$ 262 -158 -38 -326 -327 -280 522 297 494 -105 74 -541 -327 -338 -244 192 214 643 186 -133 -10 -448 -344
3369c44N44n0L70k08m0o35l39O25J05j6M17j92J01l54j73n1J12M5L76M19k22r2
$$ -344 200 150 520 312 272 -363 -702 -77 28 12 429 237 338 -16 -189 -240 -128 -83 293 712 490 398
3391C98n71J20p15L62N80j9J89j04l03j71j36J82j36O11K30L3k00m28l59L5J46
$$ 398 -173 -53 -768 -406 174 155 344 240 -63 -234 -370 -188 -324 287 517 550 350 -78 -437 -402 -256
3412b56L69k4K30j32j21p2m81L8N4J75N43J51k53q2Q8o09q7K64K27J90J89k8l34
$$ -256 113 89 319 187 66 -6 -487 -449 -395 -220 323 474 221 139 227 -382 -469 -205 22 212 401 373 39
3435C9l48rJ83PK39J27L65m24p8l77J29k37K26N19l27K00j17m97k0M36j24M85
$$ 39 -309 -318 -135 -128 111 238 603 179 101 -276 -147 -384 -158 361 34 234 117 -380 -400 36 -88 397
3457C97j22J96r3l63l79l9L10M7K29M05k66q3m79k07J03K10J76j4M13p6j97m65
$$ 397 275 471 378 15 -364 -403 -93 -46 183 588 322 239 -240 -447 -344 -134 42 28 441 365 168 -297
3479b97j14K13n9O48l56L14j39l38r9m16NO14L2N35j63P7m87J41m12P6L31P0L9
$$ -297 -411 -198 -257 391 35 349 210 -128 -227 -643 -638 -24 8 543 380 457 -30 111 -301 -225 106 176 215
3502B15j22k43nm06J51J97N03k14K20K53o03K10r02O96J8K58l2R5K73n54m74J09
$$ 215 93 -150 -155 -561 -410 -213 290 76 296 549 -54 156 -746 -50 -32 226 194 289 562 8 -466 -357
3524c57J7K30J34L88j73j8n41L29o18K92K41K06J40q4K9o29J01j46M50J95l6K94
$$ -357 -340 -110 24 412 239 221 -320 9 -609 -317 -76 130 270 186 215 -414 -313 -459 -9 186 150 444
3546D44m82L29n53K0j38L02J92J33J43l48k03l33P1M5L60M56j83jn3k30k00r5
$$ 444 -38 291 -262 -242 -380 -78 114 247 390 42 -161 -494 -423 -378 -18 438 255 254 201 -29 -229 -324
3568c24R6L18J94K43k50k60k90P7j01q0R23Jl19j61l41R3k68L76l6k1P03l18J00
$$ -324 -228 90 284 527 277 17 -273 -196 -297 -377 546 547 228 67 -274 -181 -449 -73 -109 -130 573 255 355
3591C55o21L21j46l21M78K49J0p0k41j91n73N65K55j89N11Nk55p5l29k21K77K15
$$ 355 -266 55 -91 -412 66 315 325 255 14 -177 -750 -185 70 -119 392 397 142 67 -262 -483 -206 9
3613IL57K61l38k44J34m85L6j17M14K74R9k74J45m95k94J61n8O06J03P0j29j10
$$ 9 366 627 289 45 179 -306 -270 -387 27 301 400 126 271 -224 -518 -357 -415 191 294 364 235 125
3635A25m18j70L29l8M53O3J79j99k07l88j39N51L85j57k27J04l30k44L0q2J8J52
$$ 125 -293 -463 -134 -172 281 344 523 324 117 -271 -410 141 526 369 142 246 -84 -328 -298 -380 -362 -210
3657b10K78M83k22l43j39m03L5L53L38K05j8m9j26q20K10J28M20r4M3K56k14j68
$$ -210 68 551 329 -14 -153 -556 -521 -168 170 375 357 308 182 -638 -428 -300 120 26 69 325 111 -57
3679e7k95O8J12P7J55L68j15j46k99j81J38K83J46J97j69l98j43r0J45k3J94K85
$$ -57 -352 -284 -172 -95 60 428 313 167 -132 -313 -175 108 254 451 282 -116 -259 -349 -204 -227 -33 252
3701B52k75K20J9m95o9RJ87K10J37J35n1j81l25l5m9K80J35L48j84mm87K42j89
$$ 252 -23 197 216 -279 -348 -339 -152 58 195 330 279 98 -227 -262 -311 -31 104 452 268 264 -223 19 -170
3724a70r0L57R2K92j29m34J77m07r1N91k87L14l19K04L3m27m8k84P31q2K54Q2
$$ -170 -260 97 189 481 352 -82 95 -312 -403 188 -99 215 -104 100 133 -294 -342 -626 105 23 277 359
3746C59o96L85o23L28J27K32M4J70r6k48j7j12m6p0K90J07Q2N1m50J2j89K79k22
$$ 359 -337 48 -575 -247 -120 112 156 326 230 -18 -35 -147 -193 -263 27 134 216 267 -183 -171 -360 -81 -303
3769c03N02M4Q5l26k03l84K87n2M48MJ78j24l0j56j85k23K90J79Q7J58L0mn91
$$ -303 199 243 328 2 -201 -585 -298 -350 98 102 280 156 126 -30 -215 -438 -148 31 118 276 306 302 -289
3792b89K97j50J23J68l9L77j21n14oj82K68J81K53p9N8k1p5k70l90K59K16J35
$$ -289 8 -142 -19 149 110 487 366 -148 -154 -336 -68 113 366 287 345 324 249 -21 -411 -152 64 199
3814A99p1J99l07Ql41K55L21k05J43L01k52j17m28J86j63L42k32M73j32J47l03
$$ 199 128 327 20 28 -313 -58 263 58 201 502 250 133 -295 -109 -272 70 -162 311 179 326 23
3835B3j90m6l4M14m11M58k17J35Q5m35j7L7K08k2J63j4l28J62j37k8j55K88J84
$$ 23 -167 -213 -247 167 -244 214 -3 132 217 -218 -235 -198 10 -12 151 137 -191 -29 -166 -194 -349 -61 123
3858A23l8l1j34m9j8P7n6M97j63p8k18K8k4k92L66q3O12O7o89J79k23j1k68K16
$$ 123 85 54 -80 -129 -147 -70 -126 371 208 130 -88 -60 -84 -376 -10 -93 519 586 -103 76 -147 -158 -426 -210
3882b10Q6L67j38J53m28r4J86k66J35J94L51J99n95j15J41j03K19j23K10n6Om2
$$ -210 -124 243 105 258 -170 -264 -78 -344 -209 -15 336 535 -60 -175 -34 -137 82 -41 169 113 119 77
3904G7q5Pk82M4K30j32K64j54k36K41o10N75J71M2J47j38l2l06k83L39J47K84
$$ 77 -8 -1 -283 -239 -9 -141 123 -31 -267 -26 -636 -61 110 152 299 161 129 -177 -460 -121 26 310
3926C10J5r8o3k13j30j74j80N57J66J6R4j34k39k81J79N8K56j09k62N18j38j54
$$ 310 325 227 164 -49 -179 -353 -533 24 190 206 300 166 -73 -354 -175 -117 139 30 -232 286 148 -6
3948fR3m03K80n3L12JJ80m25J30l11K76n1K08k08K69N4k23m77L13j1j10K91rJ29
$$ -6 87 -316 -36 -89 223 224 404 -21 109 -202 74 23 231 23 292 346 123 -354 -41 -52 -162 129 120 249
3972B49j43J25o60K83k54L72K64j12l9j52k5K8j89Q2L20J70L14n88K19j43k49
$$ 249 106 231 -429 -146 -400 -28 236 124 85 -67 -92 -64 -253 -171 149 319 633 45 264 121 -128
3993a28K04k07L62j09N1r8j07j53k52K77J58P4m2J62n0l87O4Q4K0J20j09L32k87
$$ -128 76 -131 231 122 173 75 -32 -185 -437 -160 -2 72 30 192 142 -245 -181 -97 -77 43 -66 266 -21
4016b1K54o14L43l81K43j63L95R4l8j30ML17l47R6k16L44n4k29R7Q9O8P2j36P6
$$ -21 233 -381 -38 -419 -176 -339 56 150 112 -18 -14 303 -44 52 -164 180 126 -103 -6 83 151 223 87 163
4040A63j80K35o6k90Q3J4K84n34M14r8Q0l18O7l2Q9k33O01J9m58L08k9n19R1K93
$$ 163 -17 218 152 -138 -55 -41 243 -291 123 25 105 -213 -146 -178 -89 -322 279 298 -160 148 119 -400 -309 -16
4064a6M13j82J61o47K68K06m58J05N2J36J11k77K32K81q04L83J2j77l8M60J17
$$ -16 397 215 376 -271 -3 203 -255 -150 -98 38 149 -128 104 385 -419 -36 -24 -201 -239 221 338
4085C38l94k67M40k54j11J38j03J4L81n19N12o79N92m63L53J09L33l06k93J27
$$ 338 -56 -323 117 -137 -248 -110 -213 -199 182 -337 175 -504 88 -375 -22 87 420 114 -179 -52
4105e2l73M93k49K44J54L1l88K32l59M41m36J21R7J57L29m14n6L3qr5n3j90J86
$$ -52 -425 68 -181 63 217 248 -140 92 -267 174 -262 -141 -44 113 442 28 -28 5 -3 -98 -151 -341 -155
4128a55N42n56M10l22K89j80R7k81K36J03k15j64K22j57J57r2K48j22J0O4n04
$$ -155 387 -169 241 -81 208 28 125 -156 80 183 -32 -196 26 -131 26 -66 182 60 70 134 -370
4149c70J42J93j0K15p1O7R3k21j40j10J99K35O9j76J36m59K29q2l66J67N97l91
$$ -370 -228 -35 -45 170 99 166 259 38 -102 -212 -13 222 291 115 251 -208 21 -61 -427 -260 337 -54
4171e4J18j56o0L05m80J81K92j92O6L12k77j31k75L35l57J58K01q5K68j92Q7j81
$$ -54 64 -92 -152 153 -327 -146 146 -46 20 332 55 -76 -351 -16 -373 -215 -14 -99 169 -23 64 -117
4193a17L5J02J22j0q3N1l3K5k6m50L15N50n04K31j24r1r3k74N33K13n05L79j50
$$ -117 -82 20 142 132 49 100 67 92 66 -384 -69 481 -23 208 84 -7 -100 -374 159 372 -133 246 96
4216I6m1k77L96k69M3J54j88O7K8J96k19j79K65j27j02L58j86K8Kk50R7n2J75
$$ 96 55 -222 174 -95 -52 102 -86 -19 9 205 -14 -193 72 -55 -157 201 15 43 45 -205 -108 -160 15
4239A5m9K18l12K8k4rn4L95j17k18K14Jp2J42j97m17K22M74j17o1j97R7O8Q9m02
$$ 15 -34 184 -128 -100 -124 -133 -187 208 91 -127 87 88 16 158 -39 -456 -234 240 123 62 -135 -38 30 119 -283
4264b83M31j18j04J85J67l73K1K02j46J5k03L93m19m4K60k77K65j30K85oJ99j81
$$ -283 148 30 -74 111 278 -95 -74 128 -18 -3 -206 187 -232 -276 -16 -293 -28 -158 127 121 320 139
4286A39n34M52Mj72m4J41j30R9l26J27K11J61j46k25K33K63l79j52L3K74j99Q5
$$ 139 -395 57 61 -111 -155 -14 -144 -45 -371 -244 -33 128 -18 -243 -10 253 -126 -278 -245 29 -170 -85
4308h5n3L36q4k03j16J49l5k4L74r9j40Q3O4l56J03J19J68k12J92j90n8J38k49
$$ -85 -138 198 114 -89 -205 -56 -91 -115 259 160 20 103 167 -189 -86 33 201 -11 181 -9 -67 71 -178
4331a78J01l0J82l40N67k40%k63J13J27j28M9O3KK28J80n43mK22J12l16L3Q9J05
$$ -178 -77 -107 75 -265 302 62 62 -201 -88 39 -89 -40 23 25 253 433 -110 -114 108 220 -96 -63 26 131
4355A31P0j27L0j47J01j44j52M05j38m0l2L7j28J69J41k64K69R7j78k83p6J99
$$ 131 201 74 104 -43 58 -86 -238 167 29 -11 -43 -6 -134 35 176 -88 181 278 100 -183 -259 -60
4377f0j20M33k90J91j19k36p6k1K36J28J88j9k75p7K32m99M36K9l56K41M3Rk28
$$ -60 -180 253 -37 154 35 -201 -277 -298 -62 66 254 235 -40 -117 115 -384 52 81 -275 -34 9 18 -210
4400b10K11om3J18op3J08k31J18m07K54J56j15K58j8o3jK6l60M09n41J54L46L41
$$ -210 1 -5 -48 70 64 -9 99 -132 -14 -421 -167 -11 -126 132 114 51 50 76 -284 125 -416 -262 84 425
4424D25o55K67J80j59o1K18j58j33J13l7m2J4k06L88j4k4m7n0j69L61j47j96j72
$$ 425 -230 37 217 58 -3 215 57 -76 37 0 -42 -28 -234 154 140 116 69 19 -150 211 64 -132 -304
4447c04L80l20M14j38K95n91L38J01p2k2M57o98K40k28K07j0l03K89QJ16mk79
$$ -304 76 -244 170 32 327 -264 74 175 103 81 538 -160 80 -148 59 49 -254 35 43 159 155 -124
4469a24J39Q6K0M4o28L16q8J29L02q3k27j69M5L62k28J38k05K17K17j61J48l83
$$ -124 15 101 121 165 -463 -147 -235 -106 196 113 -114 -283 -238 124 -104 34 -171 46 263 102 250 -133
4491a33J53J0j16J54M8k57J34m8o4J87M1q6k28L26p9j20K80j82J77l5%j25mk37
$$ -133 20 30 -86 68 116 -141 -7 -55 -119 68 109 23 -205 121 42 -78 202 20 197 162 162 37 33 -204
4515b04K88k9r4NK34qr0M1m24L96j02O4k00K60k98J57j19R1J18Q7Q0n5k89m7J51
$$ -204 84 55 -39 -34 200 192 102 143 -281 115 13 77 -123 137 -161 -4 -123 -32 86 173 253 198 -91 -138 13
4540A3L4j8J20k98Q2M33j14n07j20K36K36L09l48r7K01n63M49l3Q9nJ12k09J3
$$ 13 47 29 149 -149 -67 366 252 -255 -375 -139 97 406 58 -39 162 -401 48 15 104 99 211 2 15
4563A5K35j49k15l15J62K97R2q2J86j92j04o9J81J0QJ5n0J02j23jj90R9K73l98
$$ 15 250 101 -114 -429 -267 30 122 40 226 34 -70 -139 42 52 60 75 25 127 4 3 -187 -88 185 -213
4587b13L11p6r8K66j75M6K89k59l19K58j17J36n4K19l60J86J01q5k0k9l2k6j83
$$ -213 98 22 -76 190 15 61 350 91 -228 30 -87 49 -5 214 -146 40 141 56 36 7 -25 -51 -234
4610b34lm0K86m5k07L78l59O00k91m1oJ51J23m67m4J01J90O1j1l52J21j70l5L01
$$ -234 -237 -277 9 -36 -243 135 -224 376 85 44 38 189 312 -155 -199 -98 92 153 142 -210 -89 -259 -294 7
4634Gp2O1J85k52M37j87k94R9k75J54K69j31j17J45M0j05J6J19j20k82J37J71
$$ 7 -65 -4 181 -71 366 179 -115 -16 -291 -137 132 1 -116 29 69 -36 -20 99 -21 -303 -166 5
4656EJ91J33k38k96K7M36l81J18K74l51J44j65K65k22OL36l25M37l79jN6P9mk50
$$ 5 196 329 91 -205 -178 258 -123 -5 269 -82 62 -103 162 -60 -54 282 -43 394 15 14 70 149 145 -105
4680a05M53n61K71r5J31j88J82K0k72r3K67o0J70l61N27l44k3j20l85N76J19O3
$$ -105 348 -213 58 -37 94 -94 88 108 -164 -257 10 -50 120 -241 286 -58 -81 -201 -586 -10 109 172
4702A72j01j4p9l80N66j09J42j63n8k6q2L60k27K65m56K55O4j8l17K68J89l61
$$ 172 71 57 -22 -402 164 55 197 34 -24 -50 -132 228 1 266 -190 65 129 111 -206 62 251 -110
4724a10K14J3J6j03J62l80O5J16j92K57O9j62n4K04r6k61M19m79J90J82k07K34
$$ -110 104 117 133 30 192 -188 -123 -7 -199 58 127 -35 -89 115 19 -242 177 -302 -112 70 -137 97
4746I7k55L77o33K35K8M14k16k3M8O1q3j49J47l6MJ01k69j7K85O5j93J26k23J12
$$ 97 -158 219 -414 -179 -151 263 47 24 72 133 50 -99 48 12 16 117 -152 -169 116 181 -12 114 -109 3
4770CJ4rJ72m32K75m71M47K41j97J21qm9k39K24J9M1j49j78P0J18j04k27N43R0
$$ 3 17 8 180 -252 23 -448 -1 240 43 164 156 107 -132 92 111 152 3 -175 -105 13 -91 -318 225 315
4794C15o46O14l26j80K44j66J62m08L25J62l0K18n28o8K28L10m20K13j16j37J78
$$ 315 -331 283 -43 -223 21 -145 17 -391 -66 96 66 284 -244 -312 -84 226 -194 19 -97 -234 -56
4815e6K32k90k12J55L45k36L1K71l41L20q3J43j20k78O2j48K82j39N8J93K2m13
$$ -56 176 -114 -326 -171 174 -62 -31 240 -101 219 136 279 159 -119 -57 -205 77 -62 -4 189 211 -202
4837b02K94j98O4Q5l37N60k09n7J97j48o1j24J92k31J61r2P4j99q9M42j0k74j44
$$ -202 92 -106 -42 43 -294 266 57 0 197 49 -12 -136 56 -175 -14 -106 -32 -231 -320 122 112 -162 -306
4860c06K78J46j81Q9L1l29L86j77J71j88K47j09J20k87L91K3j00l96K31m5o2j01
$$ -306 -28 118 -63 26 57 -272 114 -63 108 -80 167 58 178 -109 282 305 205 -191 40 -5 -67 -168
4882a68K78J06r7k15J8p3L45P7j17m6J93j36n44J39N65n96o9N77j01Q5l50k1M95
$$ -168 110 216 119 -96 -78 -151 194 271 154 108 301 165 -379 -240 325 -271 -340 237 136 221 -129 -150 345
4905C45k74l6m0l6P2pN2m08Q5L80q6j02K7J21r5m13M32J30r1l47L86K7k1l8n6
$$ 345 71 35 -5 -41 31 24 76 -332 -247 133 47 -55 -28 93 -2 -415 17 147 56 -291 95 122 101 63 7
4930Gj2J2j27p5R6J54j57P0l04N57j30q8l07N57j07k35J83k28J82q9K85j37J33
$$ 7 -5 7 -120 -195 -99 55 -102 -32 -336 221 91 3 -304 253 146 -89 94 -134 48 -41 244 107 240
4953B40k33K74n72K62P2j15K62k44J13m0j67K65j29Oo6r1J68J32l48L07m1J3q6
$$ 240 7 281 -291 -29 43 -72 190 -54 59 19 -148 117 -12 -6 -72 -163 5 137 -211 96 55 68 -18
4976a8o9J09o1O4l27K09K97j99k05L87K78m65J19l92K07j71J54n6M7P4J43j05
$$ -18 -87 22 -39 25 -302 -93 204 5 -200 187 465 0 119 -273 -66 -237 -83 -139 -92 -18 125 20
4998B0K7J45o7J01k18J77N6J19l81OR7J06j56q3J9Mk67K62j19J78j66J89l8q8
$$ 20 47 192 125 226 8 185 241 360 -21 -15 82 188 32 -51 -32 -28 -295 -33 -152 26 -140 49 11 -77
5022g7L41m94N04j28j74j42J83j09K24j48r6k22K63j74J09J07P8K8q2R9m77L59
$$ -77 264 -230 274 146 -28 -170 13 -96 128 -20 -116 -338 -75 -249 -140 -33 45 73 -9 90 -387 -28
5044b8K4J36p4j04m7m21L16L30%J30l9l16l8J11m9J19j55k6L39p5m9oj36j18O
$$ -28 -4 132 58 -46 -93 -514 -198 132 132 262 223 -93 -131 -20 -69 50 -105 -131 208 133 84 78 -58 -176 -170
5069a70J84P0Q0N5m20K36r3J25j29j1jl9L9K20j56L8r7N3J25o09N50J11p3O1j49
$$ -170 14 84 164 219 -201 35 -58 67 -62 -73 -74 -113 -74 146 -10 28 -69 -16 109 -500 50 161 88 149 0
5094@K81m18J46P6j6M29k73m28R1K55k43m6K13K8k08K38l86L57O4k00K39l79L
$$ 0 281 -137 9 85 69 498 225 -203 -112 143 -100 -146 67 95 -113 125 -261 96 160 -40 199 -180 -177
5117a77K36j1Pl5j21J91l53J90j48L27O2l90J82R8P0m19K12nnK2J6k69M21m2m2
$$ -177 59 48 55 20 -101 90 -263 -73 -221 106 168 -222 -40 58 128 -291 -79 -84 -89 -67 -51 -320 101 59 17
5142A7j18n6K34q7lk87N84k7j46k35M0L06l60K10k0k34O27k39k37o6J60K55l01
$$ 17 -101 -157 77 -10 -13 -300 284 257 111 -124 -84 222 -138 72 52 -182 445 206 -31 -97 63 318 17
5165A7M8L00Pl58j38J51M8m2l35J79K3m0N9Jq0J15K46p6K5l18Q0J02L02l87l4
$$ 17 65 365 372 14 -124 27 75 33 -302 -123 -100 -140 -81 -80 -160 -45 201 125 150 -168 -88 14 316 -71 -105
5190a05j06J00K86k44K8J29l20K82j69kL14j54n9K08j57j47NK72M0k86L38m73
$$ -105 -211 -111 175 -69 -41 88 -232 50 -119 -121 193 39 -20 188 31 -116 -111 161 201 -85 253 -220
5212b20J40pJ35J03K05j84q4Qo0N3j00j04P7P2P0k87J78r1L07m21r2OJ54P4K33
$$ -220 -80 -87 48 151 356 172 88 96 36 89 -11 -115 -38 34 104 -183 -5 -96 211 -210 -302 -296 -142 -68 165
5237A65m13K90j04j26O9j29K11Jo5p6N7P7J62j56P7l58K10K3K12j55Q4K4k47k31
$$ 165 -248 42 -62 -188 -119 -248 -37 -36 -101 -177 -120 -43 119 -37 40 -318 -108 -85 127 -28 56 80 -167 -398
5261c98M46R1k72R3K67l49J98j42N2n0j9P9r3J12J02j99j07J64K1k10j10L27q8
$$ -398 48 139 -133 -40 227 -122 76 -66 -14 -64 -83 -4 -97 15 117 -82 -189 -25 -4 -214 -324 3 -85
5284h5O4J46J8o1K39m73K88jP3m14L35P0j3k12K72k86N7K6o3Nk5K6l1nj00L20
$$ -85 -21 125 143 82 321 -152 136 135 208 -206 129 199 186 -26 246 -40 17 43 -20 -15 -40 -14 -45 -50 -150 170
5310A70k94J68j01q0J97j5K39j91k23J6K36j52K43k29J39k33L9n6q8K77O6k24
$$ 170 -124 44 -57 -137 60 45 284 93 -130 -114 122 -30 213 -16 123 -110 -71 -127 -215 62 128 -96
5332i6L41p2m63M53l80j27L27%j32J57j91N3J35N5k0k02J93r6k54K48J91j51j31
$$ -96 245 173 -290 163 -217 -344 -17 -17 -149 8 -183 -130 5 60 40 -162 31 -65 -319 -71 120 -31 -162
5355a62N8J42J21K13m75M0K25k92J03J50j80O0J00j59Nj46J41m06N98N7N5k17
$$ -162 -104 38 159 372 -103 -63 162 -130 -27 123 -57 3 103 -56 -51 -197 -56 -462 136 193 248 31
5377C1m05M07l65L30JpJ17rk33J00K17M5r7m6m29N48o5l57Q9J82oL3n7o0K03k85
$$ 31 -374 33 -332 -2 -1 -8 109 100 -133 -33 184 229 132 86 -343 205 140 -217 -128 54 48 81 24 -36 167 -118
5403a18oO0Q2J20J00o31N89R8l62N6mk46J15J81P1J94k46m4n4Q8OJ02j24J51J74
$$ -118 -124 -64 18 138 238 -393 196 294 -68 -12 -16 -262 -147 34 105 299 53 9 -45 43 49 151 27 178 352
5428C52j9m56r3J84k84L65K06l28J01j26K04m8Kl98M32K6m26J35L91l03j64L07
$$ 352 333 -123 -216 -32 -316 49 255 -73 28 -98 106 58 60 -338 94 120 -306 -171 220 -83 -247 60
5450F0m1K6J80k75O7J60n45N05k46K17j36O4j31M79l77j29J41J8N0O2j14O2o0
$$ 60 19 45 225 -50 17 177 -368 137 -109 108 -28 36 -95 384 7 -122 19 37 87 149 35 97 37
5473C7l4n8Q6r8j18J94K52l01O2j38j15L18j72J50NJ87j26k53J85n2L5k03M16
$$ 37 3 -55 31 -67 -185 9 261 -40 22 -116 -231 87 -85 65 70 257 131 -122 63 11 46 -157 259
5496B59k09k25J44j74L63q9l82M46k45j19l0M98k61j05J47L2j92kq8K45L10p53
$$ 259 50 -175 -31 -205 158 69 -313 133 -112 -231 -261 237 -24 -129 18 50 -142 -144 -232 13 323 -430
5518d30M69P9j50K92j70k30J01K64k42j7L13r0j92q6J35j37K50l08P9j55L52l26
$$ -430 39 118 -32 260 90 -140 -39 225 -17 -34 279 189 -3 -89 46 -91 159 -149 -70 -225 127 -199
5540a99J53J40M7j64L16l68No5J58k10J64R5j0R3J28k90l13L58J61l35M00k87
$$ -199 -46 94 141 -23 293 -75 -70 -135 23 -187 -23 72 62 155 283 -7 -320 38 199 -136 264 -23
5562b3P1o6m7P9K38m9j15j39k35M53J44k16j02j16K34k46lO1p8Q9k4Q2M36k40
$$ -23 48 -18 -65 14 252 203 88 -51 -286 167 311 95 -7 -123 111 -135 -138 -77 -155 -66 -90 -8 428 188
5586A88l9N7m25K27j01N24n81k30M67K27m26m4R0q%j13M39n7k92J32o1k28Q1J33
$$ 188 149 206 -219 8 -93 431 -150 -380 87 314 -112 -156 -66 -74 -74 -187 252 195 -97 35 -26 -254 -173 -40
5610d0P8l7k4M0k98L46K25Ml79JK32l9j16N2k97O0j03nM73p8k07J69k46J61oL5
$$ -40 38 1 -23 17 -281 65 290 294 -85 -84 148 109 -7 45 -252 -192 -295 -300 173 95 -112 57 -189 -28 -34 1
5636AP6k60J99L2p1m5J49l05P7P1N35m51j72J04J9J29k63J65J85j60J30j78J77
$$ 1 77 -183 16 48 -23 -68 81 -224 -147 -76 459 8 -164 -60 -41 88 -175 -10 175 15 145 -33 144
5659A44k47KK84k61J76j51J51j28j32J82RL2k0L5o0L0J10k36L2j8J6J78k61K44
$$ 144 -103 -101 183 -78 98 -53 98 -30 -162 20 29 61 41 76 16 46 156 -80 -48 -66 -50 128 -133 111
5683A11k95L57j95J31j16K10j64mj69J80K33m26M0K10J55k63m1M2NJ96j55JM6
$$ 111 -184 173 -22 109 -7 203 39 35 -134 46 279 -147 -107 103 258 -5 -46 -4 1 197 42 43 89
5706H9j44L1j16l6L1N6J9j85L03j26K01j66k4M6n7K32k22k29J42M43j72P2l58
$$ 89 -55 -24 -140 -176 -145 -89 -70 -255 48 -78 123 -43 -67 -21 -78 154 -68 -297 -155 288 116 188 -170
5729a70J64J35J92k70kR3J02M4n76L89L1j42N8J92l09m8K46k88J50J55j93K50
$$ -170 -6 129 321 51 49 142 244 288 -288 101 132 -10 48 240 -69 -117 129 -159 -9 146 -47 203
5751B03m90K06q6n0J25K35j5j74K0j4oL0k25J97r4K37j32J49k27J09l72N35k41
$$ 203 -287 -81 -167 -217 -92 143 128 -46 -26 -40 -46 -16 -241 -44 -138 99 -33 116 -111 -2 -374 161 -80
5774h0KM34n40M80r5m02M2J58j76J82m6L79o52N05j67j16K18k68K99l32l1M25
$$ -80 -78 356 -184 296 201 -201 -159 -1 -177 5 -41 338 -314 191 24 -92 126 -142 157 -175 -206 219
5796B19j07j55J11qj94O5K30J45j31k8l09J36p7L40k14m4j95MJ55L69m14K65O8
$$ 219 112 -43 68 60 -134 -69 161 306 175 147 -162 -26 -103 237 23 -21 -216 -212 -57 312 -102 163 231
5819B31j15K23m08J98M5k28k70M70j30k93L60k03K24K8j08N2o6N5j24k6K49n54
$$ 231 116 339 -69 129 174 -54 -324 146 16 -277 83 -120 104 132 24 76 10 65 -59 -85 164 -390
5841c90N53J64m60K50m4l29J46j66Q7l2K52O5k01N1lM4J91n22K97j15J75M8O7
$$ -390 163 327 -133 117 73 -256 -110 -276 -189 -221 31 96 -105 -54 -57 -13 178 -344 -47 -162 13 61 128
5864A28j59K75l27J24rl64M72j51K54k78j87J34R1m7k4M2J54q0M15k86l46L17
$$ 128 -31 244 -83 41 32 -332 140 -11 243 -35 -222 -88 3 -44 -68 -26 128 48 463 177 -169 148
5886A48k70J80k73J17p2o9KL86j19q3O1Q6PJ10k35K0K9n3L51l47jK05j71M95n23
$$ 148 -122 58 -215 -98 -170 -239 -237 149 30 -53 8 94 101 211 -24 -4 25 -28 323 -24 -25 180 9 504 -19
5911a9p5K70l16K58l07M52k16k11K7R6R8J93j84p9R4j20O2K8O0o6k86L43j19j06
$$ -19 -94 176 -140 118 -189 263 47 -164 -137 -41 57 250 66 -13 81 -39 23 51 111 45 -241 102 -17 -123
5935a23J41LP7k13O3J40m1Ok62N9K67l24J14M3j15K52l0k64j57K63J81K15k76
$$ -123 18 21 98 -115 -52 88 47 53 -209 -150 117 -207 -93 -50 -165 87 57 -207 -364 -101 80 295 19
5958A9j48J22k21J57k73M64L5n40M09K7k21k0J41P7N3k0l33J81J4J04p3J5P9l83
$$ 19 -129 -7 -228 -71 -344 120 155 -385 24 51 -170 -190 -49 28 81 61 -272 -91 -77 27 -46 -31 48 -335
5982c35N92l38L52k85l6K74j72o7L4O3l71K61O5k04L17j16j83L5J86q8J16L39
$$ -335 257 -81 271 -14 -50 224 52 -15 19 82 -289 -28 37 -167 150 34 -149 -114 72 -16 100 439
6004D39l81o6L8q4K82O1k46m5K5J67j50J2J80j28k85J33kK10j59o6j38M33k07
$$ 439 58 -8 30 -54 228 289 43 -2 23 190 40 52 232 104 -181 -48 -50 160 1 -65 -203 230 23
6027B3k60M39j86j61O6J70j70J59o2q7j91J2K84j19J18j05P7K91m01L06m0l31
$$ 23 -237 202 16 -145 -79 91 -79 80 18 -69 -260 -248 36 -83 35 -70 7 298 -103 203 163 -168
6049a68K56j41l22M01P1k6L29m82o8J01p5K55j12L78j46k36J90p1j18j73K84k66
$$ -168 88 -53 -375 26 97 71 400 -82 -150 -49 -124 131 19 397 251 15 205 134 16 -157 127 -139
6071a39L18m1k65j78L89K03k44O5k04lJ2L84j51j90q9M62l62J95k07P8J36k98
$$ -139 179 138 -127 -305 84 287 43 108 -96 -99 -87 297 146 -44 -133 329 -33 162 -45 33 169 -129
6093a29m8J68K46j86m7M54n92m2J45j92M00k44k3k22L68l78M26l39L85P7j81J38
$$ -129 -177 -9 237 51 4 458 -134 -176 -31 -223 177 -67 -90 -312 56 -322 104 -235 150 227 46 184
6115A84k1k39P4k5k61K20O0K83j8l34j06J97j24P4P2K22j94PN8R2m79L09j29J98
$$ 184 163 -76 -2 -27 -288 -68 -8 275 257 -77 -183 14 -110 -36 36 258 64 71 129 221 -258 51 -78 120
6139A20j74N5O8j2J42j04k38J43J38j4j25k26J08J96k07k8L7J7k6O6L8K31k90
$$ 120 -54 1 69 57 199 95 -143 0 138 124 -1 -227 -119 77 -130 -158 -121 -104 -130 -64 -26 205 -85
6162h5J35k48M68l12M9P6J46J24o81K10J41O0O0k61L0K35q5r1J94k38M58j54k52
$$ -85 50 -198 270 -42 7 83 229 353 -328 -118 23 83 143 -118 -88 147 62 -29 165 -73 385 231 -21
6185b1M5j23m3K65k25L44j43J76j62M1j62p6L7m89N66q0L08m85L56K0k01L23J3
$$ -21 24 -99 -142 123 -102 242 99 275 113 154 -8 -84 -47 -536 30 -50 258 -227 129 149 -52 271 284
6208B84j51q0k85N20j60k68L95Ok96J02j28k12L43q8j85J38J3j23q8L53k11K39
$$ 284 133 53 -232 288 128 -140 255 261 -35 67 -61 -273 70 -18 -203 -65 -52 -175 -263 90 -121 118
6230A18l01J24K91j44j12k1p4j0J37l2K15l12J44l01L51j66L72j18l37L47q1K2
$$ 118 -183 -59 232 88 -24 -45 -119 -129 8 -24 191 -121 23 -278 73 -93 279 161 -176 171 90 112
6252A12j77K53l35K5K83M7k87q2R0K85k72J25J40k83k10J13L60N9l26J23k38N52
$$ 112 -65 188 -147 -122 161 208 -79 -161 -71 214 -58 67 207 -76 -286 -173 187 246 -80 43 -195 357
6274C57n44L97m87J61K58O7q1lk19K9K93j86Mj36K75j29k10K11j69k3J62j88K03
$$ 357 -187 210 -277 -116 142 209 128 125 -94 -65 228 42 46 -90 185 56 -154 57 -112 -135 27 -161 42
6297D2P0O8l46j8qKK14q7J93m57J58J65k1j64K17j8k34J07K32n8l12J09L50m89
$$ 42 112 180 -166 -184 -192 -190 24 -63 130 -327 -169 -4 -25 -189 28 10 -224 -117 115 57 -255 -146 204 -285
6321b85R2N7L57p4k59K43j75k61L20r2k9K68J2l84L14J01l50Q8J83k17J77mk41
$$ -285 -193 -136 221 147 -112 131 -44 -305 15 -77 -106 162 174 -210 104 205 -145 -57 126 -91 86 82 -159
6344a59J61r3K60j22j38J92k05J95r1m31N03j7P0l40L26l78J42K51k1p4j11L2
$$ -159 2 -91 169 47 -91 101 -104 91 0 -431 72 55 125 -215 111 -267 -125 126 105 31 -80 -48
6366d8J82j55k0k31K03RJ06j92J4N84n81j33M71l53K28J47j06n7j6P5q8J3k78
$$ -48 134 -21 -41 -272 -69 -60 46 -146 -132 452 -129 -262 209 -144 84 231 125 68 52 127 39 52 -226
6389b26K23K8k88J29J02j42L76r5j39q5J90k24J69j70L77k15J55l09K49j61o3
$$ -226 -3 25 -263 -134 -32 -174 202 107 -32 -117 73 -151 18 -152 225 10 165 -144 105 -56 -119
6410a19J03n1o7r6K47J10l0l20L86k30k71N54o0n47M72m7K92k83N7j89Q9R0j99
$$ -119 -16 -67 -134 -230 17 127 97 -223 163 -67 -338 216 156 -391 81 34 326 43 100 -89 0 90 -109
6433a09L3M78o18N4M6q7L85k01r8L15m90M79k96O6J49j39K26l55L04j81Nj41L0
$$ -109 -76 402 -216 -162 -116 -203 182 -19 -117 198 -292 187 -109 -43 106 -33 193 -162 142 -39 -34 -175 -145
6456a45K5n5J25J75k05K38o3l16L09j85m8K66k99k5J45p6J5L59j83j46J0j86L80
$$ -145 -120 -175 -50 125 -80 158 95 -221 88 -97 -145 121 -178 -203 -58 -134 -119 240 57 -89 -79 -265 115
6479A15j29l09L57M2L6Q9n16J29K65LN9k86K36j48L7l51J74L02j59J80j40j66
$$ 115 -14 -323 34 76 112 201 -315 -186 79 82 141 -145 91 -57 -20 -371 -197 105 -54 126 -14 -180
6501a80k11O9L49J60K61n54L26n2l62O0N8K90j74j73L76l18J82k99M69k05J29
$$ -180 -391 -322 27 187 448 -106 220 168 -194 -134 -76 214 40 -133 243 -75 107 -192 277 72 201
6522B01n4M6k57ML96j62n4k20J50k44K18J21r4J93l64M9N71n88K26j43p0l46L16
$$ 201 147 193 -64 -60 336 174 120 -100 50 -194 24 145 51 244 -120 -71 500 -88 138 -5 -75 -421 -105
6545a05L72j80P1l53N44j97m8J29m14M46j92J14o0j13O7N7j87J65k31RJ38M8J04
$$ -105 267 87 158 -195 349 152 104 233 -181 265 73 187 127 14 81 138 -49 116 -115 -106 32 80 184
6568A84m24K77J15k50J04M32p48J19K15J84n31j79O14j15j84M46l63K76l16K60
$$ 184 -240 37 152 -98 6 438 -310 -191 24 208 -323 -502 112 -3 -187 259 -104 172 -144 116
6588A16j23O6qk30J61j5O5J18J04k48L1k21J22K40j74L21m04R5j55J02J09j80
$$ 116 -7 59 51 -179 -18 -33 32 150 254 6 37 -184 -62 178 4 325 -79 16 -139 -37 72 -108
6610a08l6M41o9j02N5k28j61K63K38m16K35q8l34M67j03rJ91j41j98K87j56J63
$$ -108 -144 297 228 126 181 -47 -208 55 293 -123 112 24 -310 157 54 45 236 95 -103 184 28 191
6632A91k12J1j6n5K30j49j10J11P6K4l45L32Q7k23j4k49L30j13qJ94l10K72J28
$$ 191 -21 -10 -26 -81 149 0 -110 1 77 101 -244 88 175 -48 -62 -311 19 -94 -102 92 -218 54 182
6655A82k68r0j93J03J80r4N33j41j59j76K38j22M40l59j32Q3j76J01J27q7J90
$$ 182 -86 -176 -369 -266 -86 -180 353 212 53 -123 115 -7 433 74 -58 25 -151 -50 77 -10 180
6676A80k53k73M00j32N6J54r5j12P3J32k94L43m43N66m11L6K0r9M27Nj29m37L70
$$ 180 -73 -346 54 -78 -22 132 37 -75 -2 130 -164 179 -264 302 -109 -73 -53 -152 275 280 151 -286 84
6699H4j54O6Qk46J97J64l06n4O0J91K8j07j61K49Q4p6R6q2K28l56k07K98K19j10
$$ 84 -70 -4 4 -242 -45 119 -187 -241 -181 10 38 -69 -230 19 103 27 123 41 269 -87 -294 4 223 113
6723A13j83l54M12j8L11k39J69j26j28M0J63P9j36k74K33k60J38m9Q5M5J10j14
$$ 113 -70 -424 -12 -30 281 42 211 85 -43 -3 160 239 103 -171 62 -198 -60 -109 -24 21 131 17
6745A7r0J20p4k43o5L58P9k98N6L08l95K31j89K21k11J03J33J32k95Q6J17j74
$$ 17 -73 47 -27 -270 -335 23 102 -196 -140 168 -227 4 -185 36 -175 -72 61 193 -102 -16 101 -73
6767g3J57o3j26K34k79J91N3j74n2J9q7J15O2j36Q7K9K82q0n8K3k2k34J58k82
$$ -73 84 21 -105 129 -150 41 94 -80 -132 -113 -200 -85 -23 -159 -72 -43 239 159 101 124 102 -132 26 -256
6791b56M19j20n5K8k21L97m08L78l50q9K23l8Ok03J29k45M82k38J58k8L02l29
$$ -256 163 43 -12 16 -205 192 -216 162 -188 -277 -54 -92 -86 -289 -160 -405 77 -161 -3 -31 271 -58
6813e8k18K43r7J0M16k18J56m8k04K5j66L89n09J38K00j3N8L3j63j20L23l21J60
$$ -58 -276 -33 -130 -120 296 78 234 186 -18 7 -159 230 -279 -141 59 46 104 137 -26 -146 177 -144 16
6836A6K5J5J7k61K32l5Q3m84L32j48K94j62M01l25m6O8q1K26j99k56K32N9k2P4
$$ 16 41 56 73 -188 44 9 92 -392 -60 -208 86 -76 325 0 -46 22 -59 167 -32 -288 -56 3 -19 55
6860E5j81J97j9o5J64k79r2K3K3Q4J72K70J00l14k6j34q3K29R1k40J61J70n38
$$ 55 -126 71 52 -13 151 -128 -220 -197 -174 -90 82 352 452 138 112 -22 -105 124 215 -25 136 306 -232
6883b32M67k54k93J13L72n8J9j3r9P2k64K22K3l98L76k90l4O09k79J93j13RR5
$$ -232 235 -19 -312 -199 173 115 134 121 22 94 -170 52 75 -323 53 -237 -271 338 59 252 139 148 243
6906B43r7J3J14l23j03M2J77k05L19M2O5r2J11l91J25j47J22n3k84L70P3k66Q3
$$ 243 146 159 273 -50 -153 -111 66 -139 180 222 287 195 306 -85 40 -107 15 -38 -322 48 121 -145 -62
6929f2j07Q2L89l31Q1o1N6k25K90q1K25l83O6N7k3j60N7L30l04J18k07K89j4m4
$$ -62 -169 -87 302 -29 52 -9 47 -178 112 31 256 -127 -61 -4 -27 -187 -130 200 -104 14 -193 96 82 38
6953C8MK21n54L23l4k25M19j06p0j23o2J71Q3J8q9rj53J84J97j32m23K21k39N56
$$ 38 42 263 -291 32 -2 -227 192 86 16 -107 -169 2 85 103 14 5 -148 36 233 101 -322 -101 -340 216
6977B16k89O4N35n52j61J3J28p6K38k42M98m12P3L54l77J51j73K7J19j23Op7j76
$$ 216 -73 -9 526 -26 -187 -174 -46 -122 116 -126 372 -40 33 387 10 161 -12 15 134 11 17 -60 -236
7000b36R2J95q1L67l83k15N8Q5q3K71K24m07k00L55l45L53Q9J25l21J43k35M23
$$ -236 -144 51 -30 337 -46 -261 -203 -118 -201 70 294 -113 -313 42 -303 50 139 264 -57 86 -149 274
7022B74k19l57M77M4n4j38n5l3j04J10K03j95p0K45n8m4j17J37k18L38k40q7J93
$$ 274 55 -302 175 219 165 27 -28 -61 -165 -55 148 -47 -117 128 70 26 -91 46 -172 166 -74 -161 32
7045C2k36K06k47M14J97l77L4K7j17j08K3N4K77O4k6l53K40j92Qk6L8k94K61K8
$$ 32 -204 2 -245 169 366 -11 23 50 -67 -175 -152 -98 179 243 217 -136 104 -88 -80 -106 -68 -362 -101 -73
7069g3j20J29j4J68j2l14J58K60P8k70R6j17J71l33L89p0j38L35k21j74j46L37
$$ -73 -193 -64 -78 90 78 -236 -78 182 260 -10 86 -31 140 -193 196 126 -12 323 102 -72 -218 119
7091A19J52N9n64L45k11j7J52L4r4K30j48k00M5K71k64k7j6L8p0NK11k74J71J24
$$ 119 271 330 -234 111 -100 -117 35 69 -25 205 57 -143 -98 173 -91 -118 -134 -96 -166 -161 50 -224 -53 71
7115G1l2K09k97QO7q0j87K07QM6k31k4K11k05K74J7q2K36j42l5j16mK55J3l36
$$ 71 39 248 -49 -41 26 -54 -241 -34 -26 20 -211 -235 -24 -229 45 62 -20 216 74 39 -77 -81 174 187 -149
7140a49L2L07j73l04M24j20O3n30P47m41L30q4r1j27j7M07k53J15k14L82m79J03
$$ -149 -117 190 17 -287 137 17 80 -450 297 -144 186 102 11 -116 -133 274 21 136 -78 304 -175 -72
7162g2K82l81J73l1q0J9J67l6o3k13K94n0k02N2M23m20N11j24j07j31l73L76l4
$$ -72 210 -171 2 -29 -109 -90 77 41 -22 -235 59 9 -193 -141 282 -138 373 249 142 11 -362 14 -20
7185b0P9J0k28J62R1o1J31j13j37K96k70J9m1O5M9k88N07l09j02j38N67k36J2
$$ -20 59 69 -159 3 94 33 164 51 -86 210 -60 -41 -82 -17 32 -256 251 -58 -160 -298 269 33 45
7208D5o9J57k00J77j53M39m72k28K39J45l37N12m61J14K14j07j8k2k23M41m44
$$ 45 -24 133 -67 110 -43 396 -76 -304 -65 80 -257 255 -206 -92 122 15 -3 -25 -248 193 -251
7229b51K97k37J34l02M12k36M16j82m5q1O0J65m26L79j58O3pK33n03K12M81k02
$$ -251 46 -191 -57 -359 53 -183 233 51 6 -75 -15 150 -276 103 -55 8 1 234 -269 -57 424 222
7251B22Q0l49Lj65K38l25K08J94K27N3m38J85L7k8l41L2L84j66l37M34m11K46
$$ 222 302 -47 -44 -209 29 -296 -88 106 333 386 -52 133 170 142 -199 -167 217 51 -286 148 -263 -17
7273a7r2J44j93QN2K00j30j35K01l69N9K71l5j0J14m5N3J01m28Q5L04j1j82P4
$$ -17 -109 35 -158 -150 -98 102 -28 -163 38 -331 -272 -1 -36 -46 68 23 76 177 -251 -166 138 127 -55 19
7297A9K44l74K07j46r5J86k3k9kj08M56o60L57k07J45Q0o4K48j74O4k7L22o04
$$ 19 263 -111 96 -50 -145 41 18 -11 -13 -121 335 -325 32 -175 -30 50 -14 234 60 124 97 419 -185
7320a85N7L46j64k66K0J74l5j22K66j70K47l6j23J58k09m58M07N09n27J45P4j81
$$ -185 -128 218 54 -212 -192 -18 -53 -175 91 -79 168 132 9 167 -42 -500 -93 416 -111 34 108 -73
7342g3RJ08j83J59q1J66o3j92m35N75j28J98k08J54k03J34K13k07L8K57k38O4
$$ -73 -64 44 -139 20 -61 105 42 -150 -585 -10 -138 60 -148 6 -197 -63 150 -57 -19 238 0 64
7364F4k52J69j64L77j63k42K71M0k35K26q9q3J3J83r6k24K16k32J77R9K42k33
$$ 64 -188 -19 -183 194 31 -211 60 100 -135 91 2 -81 -68 115 19 -205 11 -221 -44 55 297 64
7386F4j40O1j24R1n9R2K2j14N7k3Q2k28J79J82j82J76j58l9O5l1K38j41j87L58
$$ 64 -76 -15 -139 -48 -107 -15 7 -107 -50 -73 9 -219 -40 142 -40 136 -22 -61 4 -27 211 70 -117 241
7410B41j43o7M5j82J40k66L87j63r3j26p8M99j5J78j54k96N7r3J30j71K06K2m02
$$ 241 98 31 76 -106 34 -232 155 -8 -101 -227 -305 194 179 357 203 -93 -36 -129 1 -170 36 58 -344
7433c44M80k42J86l06J94N2j1k68L61p8k15K72q9K57l22L55j48j78K76j45l57
$$ -344 136 -106 80 -226 -32 20 9 -259 102 24 -191 81 -8 249 -73 282 134 -44 232 87 -270
7454b70L01k05J10J75j75K07k21N5p9m3J69k14P6m2n6L02o3n7o5o8Q4J76p1k53
$$ -270 31 -174 -64 111 -64 143 -78 -23 -102 -145 24 -190 -114 -156 -212 90 27 -30 -95 -163 -79 97 26 -227
7478b27M28k12J04K93m69J38M9K66n33K16l13J52K16j37L23j03l60K62J10l65
$$ -227 201 -11 93 386 -83 55 104 370 -163 53 -260 -108 108 -29 294 191 -169 93 203 -162
7498a62K91k75J38j50J75o1M32k20j29J28l18K31J69j78j31j97j3L5p3J09M63
$$ -162 129 -146 -8 -158 17 -44 388 168 39 167 -151 80 249 71 -60 -257 -270 -235 -308 -199 264
7519B64j49o2O5k6P0k45K8R6k46n1L66j92J52L8p7oO7j94R4K36j96Q9m5J28j25
$$ 264 115 53 118 92 162 -83 -55 41 -205 -256 110 -82 70 108 31 25 92 -102 -8 228 32 121 76 204 79
7544G9j18J53J29j97q6J96l10K74k18R3j55L09k23K53j32Q8l33L66k55J84k32
$$ 79 -39 114 243 46 -40 156 -154 120 -98 -5 -160 149 -74 179 47 135 -198 168 -87 97 -135
7565a35K83k43K82k7l45J06K11j90pl0J33K66n56R4K53r7R4j39K6l22K70j31L23
$$ -135 148 -95 187 160 -185 -79 132 -58 -65 -95 38 304 -252 -158 95 -2 92 -47 -21 -343 -73 -204 119
7588A19j45j76K12J4k10K40k4k5k2j98L27K15j45J18k13k30j64M1L12k42M33j21
$$ 119 -26 -202 10 24 -186 54 30 5 -17 -215 112 327 182 300 87 -143 -307 -266 46 -196 237 116
7610A16j3K5j52j69K29n0j12l8J85k64Q9K26O4K9M15n93R0M7k4O3l24J30k9K57
$$ 116 103 128 -24 -193 36 -14 -126 -164 21 -243 -154 72 136 165 580 -13 77 124 100 163 -161 -31 -60 197
7634A97k46K24n12K81K15j53j13J2J44j90N8j32L63j73R2l04Q8P04l51p6j15j83
$$ 197 -49 175 -337 -56 159 6 -107 -95 49 -141 -83 -215 148 -25 67 -237 -149 555 204 128 13 -170
7656a70M64l44j92M19l35K38k13K33r3j71J05J34N7k98Mj00J77L0nL4j05Q9J98
$$ -170 294 -50 -242 177 -158 80 -133 100 7 -164 -59 75 132 -166 -162 -262 -85 -55 -60 -26 -131 -42 156
7679A56qq3J68j58k44L65l79K17OJ42j63J7j13o9L06j93j81N91j35q9R7l2m37
$$ 156 148 65 233 75 -169 196 -183 34 40 182 19 36 -77 -146 160 -33 -214 377 242 153 250 218 -219
7702b19J4m9M88k41R7k91N45m11k3K97k50j87J37R3L6j57j02L03l7j86J70q2r
$$ -219 -205 -254 234 -7 90 -201 344 -67 -90 207 -43 -230 -93 0 36 -121 -223 80 43 -143 27 -55 -64
7725f4K77l79J37j39J66k80L99l13J06KQ6m69L24K97k60pJ47j60K68J56n84K86
$$ -64 213 -166 -29 -168 -2 -282 117 -196 -90 -88 -2 -471 -147 150 -110 -117 30 -130 138 294 -290 -4
7747dj82M22k73N3l4o4k79M60M9j47j20J60j51L57k13l8o9J60K0J3K4N2k63N4
$$ -4 -186 236 -37 16 -18 -82 -361 99 148 1 -119 41 -110 247 34 -4 -73 87 107 120 144 196 -67 -13
7771a3N3L36n32L4L80j45l96J41P4J09Q5j67J99r2m3jJ74j67K14k83KJ40k87J82
$$ -13 40 376 -156 -122 258 113 -283 -142 -68 41 126 -41 158 66 23 22 196 29 243 -40 -38 102 -185 -3
7795cm2O8j71O6j15L25J21l55j70Q7L20j06R4j86J67N3Jk34N8J04k64J70k7n5
$$ -3 -45 23 -148 -82 -197 128 249 -106 -276 -189 131 25 119 -67 100 153 154 -80 -22 82 -182 -12 -39 -94
7819i4j23jN8o3J74L5P4k12K29k64J59k35M64k72%L16l85L29k70kL20P8n14P9
$$ -94 -217 -218 -160 -223 -49 -14 60 -152 77 -187 -28 -263 201 -71 -71 245 -140 189 -81 -83 237 315 -199 -120
7843a20K57j72J66k42p0L29j47J04j99j71j66K49J52O7p6j24k42P13k48J35m08
$$ -120 137 -35 131 -111 -181 148 1 105 -94 -265 -431 -182 -30 37 -39 -163 -405 308 60 195 -213
7864b13M16m47M09Pl30J44pJ57l65r3L3J95kM44k07j67j74j9M58n52N11j72R0
$$ -213 203 -244 165 172 -158 -14 -21 136 -229 -322 -289 -94 -96 348 141 -26 -200 -219 239 -313 198 26 116
7887A16nK5j66q0K09j07n7k25K40j35KK53j7n5k4k20P8M19p6k60j63M6K8L08j83
$$ 116 111 136 -30 -110 99 -8 -65 -290 -50 -185 -183 70 53 -2 -26 -246 -168 251 175 -85 -248 -202 -174 134 -49
7912d9j1L71m93L14k75n3K46J66k22j21P9j24J62k10K4J57M07l33m6r5M17n29
$$ -49 -60 311 -182 132 -143 -196 50 216 -6 -127 -48 -172 -10 -220 -196 -39 368 35 -11 -106 311 -218
7934b18qL03L0o1J76r6N8j30j26L02J0l72J82k49rJ03j41L91lO3j97Pm8K35k71
$$ -218 -226 77 107 46 222 126 184 54 -72 230 240 -132 50 -199 -208 -105 -246 145 142 205 8 15 -33 202 -69
7959f9J01k03J8P6j08J06j6M5n7J05J58K4l91J53l27J92J38K22j40j46K25m0j51
$$ -69 32 -171 -153 -77 -185 -79 -95 -50 -107 -2 156 180 -211 -58 -385 -193 -55 167 27 -119 106 66 -85
7982h5J50j50J00k5n8K79j41j80N2l34L07m2L90k88n5Q6p5m6K66m7l2J02k13J04
$$ -85 65 -85 15 -10 -68 211 70 -110 -58 -392 -85 -127 263 -25 -80 6 -69 -115 151 104 72 174 -39 65
8006F5q2m6j1m4l5K31j03J82k8q9j30K9j38J95n1k57M49o6k57K91k89j17K84K7
$$ 65 -17 -63 -74 -118 -153 78 -25 157 129 40 -90 -61 -199 -4 -55 -312 137 71 -186 105 -184 -301 -17 10
8030A0K12j33l18K00J1j01P0j38qR6K4N9j00J12j43O0J48K01J04m33O1K70k39
$$ 10 222 89 -229 -29 -18 -119 -49 -187 -195 -99 -75 -16 -116 -4 -147 -87 61 262 366 -67 -6 264 25
8053B5j42qK01P5j2J58k07o5J3q8j8l3M48o0m74L59j52J22m27J34J76l80Q6J93
$$ 25 -117 -125 76 151 139 297 90 25 38 -50 -68 -101 347 287 -187 172 20 142 -285 -151 25 -355 -269 -76
8077g6MJ97L1J22o7j9q9k97J58J36J10l2k91j78M12k17N6L8M5l75L82j56O7q0
$$ -76 -72 125 156 278 211 192 103 -194 -36 100 210 178 -113 -291 121 -96 -40 -2 43 -332 50 -106 -39 -119
8101a19K32Q1j15J4o4l89N85j80j67p9N5K65j69L13m03l5Q9J83j55K69j38K0q0
$$ -119 113 194 79 93 29 -360 225 45 -122 -201 -146 119 -50 263 -140 -175 -86 97 -58 211 73 93 13
8124A3J50j94k17K10L68l80K74lj16K93l54M9K43k27j75j1j55K87k6j33L33k72
$$ 13 163 -31 -248 -38 330 -50 224 221 105 398 44 93 336 109 -66 -77 -232 55 29 -104 229 -43
8146d3j41K86J62k08k29N3J13J69Q9k31m3Q7L29l36p3J96l65K43j19K02q5jJ71
$$ -43 -184 102 264 56 -173 -120 -7 162 251 20 -23 64 393 57 -16 180 -185 58 -61 141 56 55 226
8169B26l8j67J20k05l6K78l29K02j68q9K31k83J64K74j81J43k22K44m36K42p4
$$ 226 188 21 141 -64 -100 178 -151 51 -117 -206 25 -258 -94 180 -1 142 -80 164 -272 -30 -104
8190a04K26
$$ -104 122
8191A22
$$ Imaginary data points
##PAGE= N=2
##DATA TABLE= (X++(I..I)), XYDATA
0@%%%%%%Qj6J6j6K4l2M0m8N6o9Q4j02J19j37J60j85K15k50K86l29L76m27M84n47
$$ 0 0 0 0 0 0 0 8 -8 8 -8 16 -16 24 -24 32 -37 47 -55 64 -73 87 -98 117 -133 153 -176 200 -227 257 -290
30b90O19o97P79q70R74j088J209j344J494j655J833k031K248k491K758l057L396
$$ -290 329 -368 411 -459 515 -573 636 -708 786 -869 964 -1067 1181 -1310 1448 -1609 1787
47A787l780M221m727N323o036O903p990R392j1283J3996j8236K5867m3909J63464
$$ 1787 -1993 2228 -2499 2824 -3212 3691 -4299 5093 -6190 7806 -10430 15437 -28472 134992
61A34992J64860k20005j13126n4907k278Q953J12538J04892M2664l2866n2293
$$ 134992 299852 79847 -33279 -88186 -90464 -81511 31027 135919 178583 145717 93424
72I3424r5761q5712l0702M4319Q5071J18804O5953n4820j30133q0163l1278k1410
$$ 93424 -2337 -88049 -118751 -74432 10639 129443 195396 140576 10443 -69720 -100998 -122408
84a22408K9846J25594J14085k04p7666p7736q3173p1655J2605J10970J15134M3668
$$ -122408 -92562 33032 147117 146913 69247 -8489 -91662 -163317 -150712 -39742 75392 119060
96A19060k8599o7249p7530n8141k7932J0749P2380J19328P3839l7280j00726q6800
$$ 119060 90461 23212 -54318 -112459 -140391 -129642 -57262 62066 135905 98625 -2101 -88901
108h8901n5393j4767O3164J21316Q4470o281n8551o5138o3304m5194J0899P1289
$$ -88901 -144294 -159061 -95897 25419 109889 103608 45057 -20081 -83385 -128579 -117680 -46391
120d6391R0600O1714M004n4386q1171o4697k4763K5307P9365R4914M1981k8516
$$ -46391 44209 105923 109927 55541 -25630 -90327 -115090 -89783 -10418 84496 126477 97961
132I7961n8571n9899o3852l3491M8566J06850Q1286Q245m1788o4547p1513m5085
$$ 97961 39390 -20509 -84361 -117852 -69286 37564 118850 127095 85307 20760 -50753 -95838
144i5838J4054O2937P3366N1546O365m1383o4972n9371l9590M246O9546R7237
$$ -95838 -81784 -18847 54519 106065 112430 71047 6075 -53296 -92886 -88640 -19094 78143
156G8143M8823k5485o2711o7673n8911j6516N0883P9672M9609R152j6176m4899
$$ 78143 126966 101481 38770 -28903 -87814 -104330 -53447 26225 75834 84986 68810 23911
168B3911o8716n2277j698M7442P2969O1098R611m4934o2555n1277l1506P275N8691
$$ 23911 -44805 -97082 -98780 -51338 21631 82729 92340 47406 -15149 -66426 -97932 -90657 -31966
181c1966P3707L6138p609l1340n5333o8254k9868M0922P6928N9334J9260j9069
$$ -31966 41741 77879 70270 38930 -16403 -84657 -114525 -73603 3325 62659 81919 62850
193F2850n1795n7006l2737r96L0956N7575N6767J9266k4649m8855n9221m4974
$$ 62850 11055 -45951 -78688 -79684 -48728 8847 65614 84880 60231 11376 -47845 -92819
205i2819Q588O6000P0737K7578r199k8477m6181n1763k2137K3404N0160N3372
$$ -92819 -84231 -18231 52506 80084 70885 42408 -3773 -55536 -77673 -54269 -4109 49263
217D9263L5614m732m5814o0006m2464o640L6236O1197M4984N904k0433l2957m6374
$$ 49263 84877 80145 34331 -25675 -68139 -74779 -38543 22654 67638 73542 53109 20152 -26222
230b6222m4445l954M5790O0003L8632O537k6496n4587n4948j7745K5246M7022
$$ -26222 -70667 -74621 -28831 31172 69804 76341 49845 -4742 -59690 -77435 -52189 -5167
242e167M3124K3762l384k8478m3964m4894k0445K3444N7074N0688J6149j7512
$$ -5167 37957 61719 58335 29857 -14107 -59001 -79446 -56002 1072 51760 67909 50397
254E0397l8957m9686l5206M695M0634M4766K8755J0951j2484l9841n0568k9627
$$ 50397 11440 -38246 -73452 -68757 -28123 16643 45398 56349 43865 4024 -46544 -76171
266g6171J1884M5445N0421K8899l941l0127m2610l7598j2259K2193M2352L7554
$$ -76171 -64287 -18842 31579 60478 56537 26410 -16200 -53798 -66057 -43864 -1512 36042
278C6042J9785q64k7580m8465m2504k721L6251M8511L3716R123j7348l7618m0268
$$ 36042 55827 54963 27383 -21082 -63586 -66307 -30056 18455 52171 61294 43946 6328 -33940
291c3940k1795Q119L1439L9184K9311R041j8814m2672m5783j7741K2890M4114
$$ -33940 -55735 -47616 -16177 23007 52318 61359 42545 -127 -45910 -63651 -40761 3353
303C353L7026J5015n569k5345l9160l2218n569K2042L6111L4296J8985q415l7126
$$ 3353 40379 55394 49825 24480 -14680 -46898 -52467 -30425 5686 39982 58967 50552 13426
316A3426m5963k6178R189L4432L6835K2821L339j5319l2182l6351j9688R942L2724
$$ 13426 -32537 -58715 -49526 -15094 21741 44562 47901 32582 400 -35951 -55639 -45697 -12973
329a2973L6650K5768J891k7342m3979l2714j391K4784L2699K5347J3892l736k4641
$$ -12973 23677 49445 51336 23994 -19985 -52699 -54090 -29306 3393 28740 42632 38896 14255
342A4255l7605k8571j614K6066L7710K9851R477j6874l5837l5658j2463J3436
$$ 14255 -23350 -51921 -53535 -27469 10241 40092 49569 32695 -3142 -38800 -51263 -37827
354c7827K7658K7357K0203O486j5221l4549l4528j1701J6760L4269L2640J7099
$$ -37827 -10169 17188 37391 43877 28656 -5893 -40421 -52122 -35362 -1093 31547 48646
366D8646p043k8470l3885k0933K134J9485K6330K5418J5408o404l0653l7526j9809
$$ 48646 41603 13133 -20752 -41685 -39551 -20066 6264 31682 47090 40686 10033 -27493 -47302
379d7302Q810K8112L1030K1174K962j9112l0989k5865p976J0572K2276K7170K1669
$$ -47302 -38492 -10380 20650 41824 44786 25674 -5315 -31180 -39156 -28584 -6308 20862 42531
392D2531K405k3505l6163k6687p85K0327K8546K4378J0019r183k5699k8263j5985
$$ 42531 44936 21431 -14732 -41419 -42204 -21877 6669 31047 41066 31883 6184 -22079 -38064
405c8064J852J7591K6457K5581J0130j4968l3390k9154q903J2382K3817K4132
$$ -38064 -36212 -18621 7836 33417 43547 28579 -4811 -33965 -42868 -30486 -6669 17463
417A7463J6963M16j8674k8050k2141n410J1426K4403K7437J6729o818k7763l0219
$$ 17463 34426 34842 16168 -11882 -34023 -39433 -28007 -3604 23833 40562 33744 5981 -24238
430b4238j4170N224J7890K2232K0515Q392j0104k4534k5324j2650M740J9677K7811
$$ -24238 -38408 -33184 -15294 6938 27453 35845 25741 1207 -24117 -36767 -32027 -12350 15461
443A5461K1527J512k0759k9283j8757k066J1471J9122K1884J5020j863k0263k5891
$$ 15461 36988 38500 17741 -11542 -30299 -32365 -20894 -1772 20112 35132 33269 13006 -12885
456a2885j8290k027J4432K5691K4692P553j3840k5193k1594q199L978J5135K1630
$$ -12885 -31175 -33202 -18770 6921 31613 39166 25326 133 -21461 -29660 -25682 -10547 11083
469A1083J8720N629j3518k5752k2344p933R337K1608K4020J3667o058k0082k1554
$$ 11083 29803 35432 21914 -3838 -26182 -34115 -24778 -3170 20850 34517 28459 8377 -13177
482a3177j3235k231Q929J9455K1910J1639o578k2214k4361j3101L160J7226K3032
$$ -13177 -26412 -28643 -19714 -259 21651 33290 26712 4498 -19863 -32964 -29804 -12578 10454
495A0454J6633J986j3333k0544j6431p557L369J5349K2754J7337k02j7686k3656
$$ 10454 27087 29073 15740 -4804 -21235 -28792 -25423 -10074 12680 30017 29815 12129 -11527
508a1527j6412k137J1499K0283J8368P928o367j5907j8601j2777j954J1565K1189
$$ -11527 -27939 -30076 -18577 1706 20074 28002 21635 5728 -12873 -25650 -27604 -16039 5150
521E150K0411O727j2489k1958j7905o656N436J5580J8897J2695j40j1291j7580
$$ 5150 25561 32288 19799 -2159 -20064 -26720 -21284 -5704 13193 25888 25748 14457 -3123
534c123j6672p560O876J9106K1592J0629o030j8430j9063j0239N13J0419J6385
$$ -3123 -19795 -27355 -20479 -1373 20219 30848 24818 6388 -12675 -22914 -22401 -11982 4403
547D403J6085O223p007j5667j8033j1749J255J5398K0960J4281o08j3968j7571
$$ 4403 20488 26711 19704 4037 -13996 -25745 -24490 -9092 11868 26149 25541 11573 -5998
560e998j2938m229N525J3271J6924J1390j224j3637j8134j4139l147R879J9190
$$ -5998 -18936 -23165 -17640 -4369 12555 23945 22721 9084 -9050 -23189 -26336 -16457 2733
573B733J6871M541q861j4693j3591r176m1J0460J7251J4635M062r417j7661j6013
$$ 2733 19604 24145 15284 591 -13000 -22176 -22217 -11757 5494 20129 24191 14774 -2887 -18900
587a8900o387O028J5657J6701R334l266j2123j3667j0440m641N352J5104J8030
$$ -18900 -25287 -19259 -3602 13099 22433 19167 7044 -6623 -17063 -21704 -16352 -1248 16782
600A6782Q037n328j4926j6062j0542R19J2726J6256J1485J575o889j3169j3235
$$ 16782 24819 19491 4565 -11497 -22039 -21120 -8394 7862 19347 20922 14033 864 -12371
613a2371p608J482J1823J7207J2797o59j2461j5971j0982l460O789J4188J3941
$$ -12371 -19979 -18497 -6674 10533 23330 22671 10210 -5761 -16743 -20203 -13414 774 14715
626A4715O021l617j0079j3422j2284k923R767J6677J3458L769q506j4081j2887
$$ 14715 20736 17119 7040 -6382 -18666 -21589 -11822 4855 18313 22082 13576 -505 -13392
639a3392n274K141J0143J3295J0083J111p378j2414j2927p546M400J5559J5930
$$ -13392 -18666 -16525 -6382 6913 16996 18107 10729 -1685 -14612 -22158 -17758 -2199 13731
652A3731O019l764j1574j2751q826j466P139J2579J2159N233m196j1197j3179
$$ 13731 19750 15986 4412 -8339 -17165 -18631 -11492 1087 13246 18479 14283 3086 -10093
665a0093r790R63J1302J5495R791o88p796j0774j0253o231K937J1354J3149Q330
$$ -10093 -19883 -18920 -7618 7877 17668 16980 9184 -1590 -11843 -18074 -15137 -3783 9366 17696
679A7696L00r285j4220j1379k192Q505J4010J1047K758m791r021r892q012j717
$$ 17696 17996 8711 -5509 -16888 -19080 -10575 3435 14482 17240 12449 3428 -6464 -14476 -16193
693a6193P532J2814J1376L217o091j2099j2865n987M097J2104J1708O243r07o921
$$ -16193 -8661 4153 15529 18746 12655 556 -12309 -18296 -14199 -2095 9613 15856 14949 8028
707H028j0721r809m871M729J2081J2398N481l026j0173j1927p923R8Q009J1097
$$ 8028 -2693 -12502 -17373 -12644 -563 11835 17316 14290 4117 -7810 -15733 -15635 -7626 3471
721C471Q362L010l693q482j1407q649J001J0520J3465Q412q66q055j1185q809
$$ 3471 11833 14843 11150 2668 -8739 -17388 -16387 -5867 7598 16010 15144 7089 -4096 -12905
735a2905k526M953R238Q935N573l21o336j0617j0110k882P097J2160J0032L228
$$ -12905 -15431 -10478 -1240 7695 13268 12947 6611 -4006 -14116 -16998 -9901 2259 12291 15519
749A5519m384r396j0279o299J495Q087J0073P208K449m390r951j1281n170M386
$$ 15519 11135 1739 -8540 -14839 -13344 -5257 4816 12024 14473 10083 132 -11149 -16319 -11933
763a1933J0850J0366M509j493o781q750p850k560M442Q672R849N446j589q997
$$ -11933 -1083 9283 13792 12299 5518 -3232 -11082 -13642 -9200 -528 9321 14767 13178 4181
777D181j1426p373Q56Q989R999O640O51m032q017q587m958J845P791Q922P030
$$ 4181 -7245 -14618 -13762 -4773 5226 11866 12517 8485 468 -8119 -13077 -11232 -3441 5481 12511
792A2511J182n844j0711r904j297N396R244P867L478j149o421r336p275r99N798
$$ 12511 13693 7849 -2862 -12766 -14063 -8667 577 8444 11922 10773 4352 -4984 -12259 -13258 -7460
807g460R989P725K970l912r248r089l902L163O940P123N677J532l709q604q722
$$ -7460 2529 10254 13224 9312 64 -9025 -12927 -9764 -2824 4299 9976 11508 7799 -805 -9527
822i527m331L719Q599R229M911j674p180r502o069P11N624O668O083L777j007
$$ -9527 -13858 -10139 -1540 7689 12600 10926 3746 -5756 -11825 -11114 -5490 1178 7261 11038 10031
837A0031p097r478n649Q26O719Q819O391J004m573q335p099k649K258O835P535
$$ 10031 2934 -6544 -12193 -11367 -4648 4171 10562 11566 6993 -1342 -8441 -11090 -8832 -1997 5538
852E538N132P03n616q838p641j127M879Q422O700K869k186p032p200m095J97L974
$$ 5538 10670 11373 5757 -3081 -10722 -11849 -6970 1452 8152 11021 8835 1803 -5397 -9492 -9295 -5321
868e321O829P113L125k806q249q735l836L015O990P084M542k32m399p129o010
$$ -5321 1508 8621 11746 8940 691 -8044 -11880 -8865 -1875 5209 9751 9519 5120 -2009 -8019
883h019j808K781N796P047M795r25o708q038m830L88M863P013N077K086k145o022
$$ -8019 -9827 -7046 -1250 5797 10592 9667 2959 -5079 -9909 -9521 -4658 2355 7432 9518 7373 1351
899A351o899m253J082M464P667N998J058n170p505n784j154K910N285N713L833
$$ 1351 -5548 -9801 -8719 -4255 3412 9410 10468 5298 -2207 -7991 -9145 -6235 -950 4763 8596
914H596j37m640o488n540j456L380P055O744K462k458o769o387l043J232M073
$$ 8596 8459 3819 -2669 -8209 -9665 -6285 770 7514 9976 7518 749 -5638 -8681 -7449 -3376
929c376N730M920J702k969n989o358k615J687N534O496M040q05m937o022m087
$$ -3376 2354 7274 8976 6007 18 -6340 -8955 -7268 -1734 4762 8802 7997 3060 -2962 -7049
944g049p22K627M958N076L516q12m771o870m448O70M083O124M892P26k961n399
$$ -7049 -7771 -5144 -186 4890 8406 7594 2823 -4047 -8495 -7825 -3742 2382 7274 8000 5039 -360
960c60m549k319O20L342O039M591J080l903o340m954j809L367N289N149K371r44
$$ -360 -4909 -7228 -6608 -3266 2773 7364 8444 4541 -1799 -6753 -8562 -5195 94 5243 7614 6670
976F670m464m905l834m95K185N113N680K408k262n497n707k558J490L690N135
$$ 6670 2206 -2699 -6533 -7028 -4843 270 5950 8358 6096 599 -5108 -7666 -6176 -2486 2649
991B649L729K27k671m408m404k137R81M396N858L372o79m548n287l418j39L012
$$ 2649 6378 6605 3934 -474 -4878 -7015 -6034 -1638 4220 7592 6913 2365 -2922 -6340 -6479 -3467
1007c467L817M213K178j301l762m739l386k64L015N753M411N92l173m926l517
$$ -3467 350 4563 6741 5440 1678 -3061 -6447 -6711 -3696 2057 6468 7060 3887 -1039 -4556
1022d556j774J372L201M377L418N2k810m402m393j433J862N035M543K028j634
$$ -4556 -6330 -4958 -1757 2620 6038 6090 3280 -1122 -5515 -6948 -5086 -51 4492 6520 4886
1037D886l641m190k118l15J802M086M104K073j890m184m498k419P61L723M808
$$ 4886 1245 -2945 -5063 -5378 -3576 510 4614 6687 4797 613 -3885 -6304 -5543 -1820 2988
1052B988K541j14k633l633l405j360R50L289M520K537k21k969m385l401m82K664
$$ 2988 5529 5415 2782 -851 -4256 -5616 -4666 -1377 3143 5680 5459 2490 -1895 -5296 -5778 -3114
1068c114M165L526R75j580k611l829k505l88K442M030M062O50k026m420l441j483
$$ -3114 1051 4577 5552 3972 1361 -2468 -4973 -5361 -2919 1111 5173 5823 3797 -623 -4064 -5547
1084e547J504L017L934J890l4k212l319l363j229J237M098M150J442j145l298
$$ -5547 -4043 -1026 2908 4798 4764 2552 -767 -4130 -5359 -4122 -24 4126 5568 4423 1125
1099A125l901k326K97K582L132K978R39j327k885l721k103k8L237M479K385K17
$$ 1125 -2776 -5102 -4805 -2223 909 3887 4826 3499 614 -3107 -5210 -5238 -2001 2478 4863 5080
1115E080k573l706k522p69J007K873L464J986o83k184l536l280k83K289L901K835
$$ 5080 2507 -1199 -3721 -4490 -3483 -610 2854 4840 4157 1973 -1563 -4843 -5126 -2837 1064 3899
1131C899R82j593k927k859j544P0K107L083K852N87j688k816l673j346J120L516
$$ 3899 4881 3288 361 -2498 -4042 -3972 -1865 1218 4070 4657 2969 153 -3520 -4866 -3746 -230
1147b30L095J689q83k095k645k489o13J157L085L050J684r85k669l645k129P25
$$ -230 2865 4554 3671 1576 -1069 -3558 -4171 -3014 71 3121 4805 3820 1151 -2494 -4623 -3898
1163c898K052L146J963L81j213k233k561j645j42K589L561K096L3j831l290k618
$$ -3898 -1846 1300 3263 3644 2431 198 -2363 -4008 -4150 -1561 2000 4096 4129 2298 -992 -3610
1179c610o41J683K626K301J205n17j446k856k107q99J650L270L091L67j092k848
$$ -3610 -4251 -2568 58 2359 3564 3047 1601 -1255 -3362 -4261 -2611 659 3750 4117 3025 177
1195A77k819j471J078K039K588J800J72j241k134k950j351J136K470L055J285
$$ 177 -2642 -4113 -3035 -996 1592 3392 3564 2323 189 -2761 -4112 -2976 -506 2549 3834
1210C834k31k358k544j423l06J410J882K410P91l12j968k970j862K02K086K562
$$ 3834 3603 1245 -1299 -2722 -3028 -1618 264 2674 3465 3153 1185 -1785 -3647 -3445 -1359 1203
1226A203J802K48j333k319k029o34M36J737K262J656J31j198k792k486j96R96
$$ 1203 3005 3253 1920 -399 -2428 -3062 -2626 -889 1373 3029 3160 1962 -830 -3316 -3512 -2516
1242b516K715K145Q71l96j933k133j691j89J351J985K157J036j052k260k718p66
$$ -2516 199 2344 3215 2819 886 -1247 -2938 -3127 -1776 209 2366 3402 2350 90 -2628 -3394
1258c394Q72J794K223J452j84j023j939k131j110J184J773K450J306Q3k148k519
$$ -3394 -2522 -728 1495 2947 2763 1740 -199 -2330 -3440 -2256 -483 1967 3273 3356 1208 -1311
1274a311j390J1J215J657J512Q33k74j456k055j396j52J434K501J674J46q25k352
$$ -1311 -2701 -2690 -1475 182 1694 2527 2253 797 -1258 -2654 -2806 -1372 1129 2803 2949 2124 -228
1291b28k035l67N08J973J276J025N52o95k422j827l63P41J815J967P14o45j469
$$ -228 -2263 -2630 -2122 -149 1127 2152 2704 2009 -413 -2240 -2603 -1862 -47 1920 2634 1989 520
1308E20j387j555J03R94J590J684O62p18j637k039j099L70J966J669J728o60j041
$$ 520 -867 -2422 -2319 -1325 265 1949 2611 1893 256 -1783 -2882 -2512 -546 1123 2851 2191 1150
1325A150j728j359l78N57J216J681J193Kj336j830j521j42J191J822J373J53m13
$$ 1150 -578 -1937 -2315 -1758 -542 1139 2332 2334 998 -832 -2353 -2495 -1304 518 1891 2044 1631
1342A631j332j420q29k00Q82J517J775R71j657j549j795l31N68J105K034P78l78
$$ 1631 299 -1121 -1950 -2150 -1268 249 2024 2995 1338 -211 -2006 -2337 -1769 -664 1370 2148 1770
1359A770k67j668j444n32M31J603J939O97o05j384k057p85J07J406J070J258R54
$$ 1770 1503 -165 -1609 -2141 -1710 -107 1832 2529 1924 540 -1517 -2302 -2195 -789 281 1539 2493
1376B493j172j340q46j248j39J401J495J439M91j706j433j415j28P28J309P98
$$ 2493 1321 -19 -865 -2113 -2252 -851 644 2083 2574 868 -565 -1980 -2108 -1380 -71 727
1392G27J041L08j410j442r75l27P99J505J568M22q60j055j367l83l43J189J178
$$ 727 1768 2076 666 -776 -1751 -2078 -1279 226 1794 2216 1356 301 -1066 -1449 -1792 -603 575
1409E75Q64O44k62j793j732m65M89J072J489R99k33j004j041q34m45N38Q26J325
$$ 575 1439 2083 1821 28 -1704 -2169 -1680 -608 881 1880 1647 643 -398 -1232 -1677 -1139 -313 1012
1427A012P91k3j239j185j034j97R95J003Q02P91l49j181r85p52j68J046J143J401
$$ 1012 1803 1780 541 -644 -1678 -1875 -880 123 925 1716 1367 186 -799 -1551 -1719 -673 470 1871
1445A871N0r06j335p98q55P30J097J413L45Q2q22j397q07m05M57J130J279P67
$$ 1871 1921 1015 -320 -1118 -1973 -1243 -146 1267 1612 1694 872 -525 -1332 -1737 -1280 -150 1129 1896
1463A896k79j263j507o08K55O86O72J451K72k43j250j493l75J94R17J300J012
$$ 1896 1617 354 -1153 -1761 -1506 -820 -148 1303 1575 1332 82 -1411 -1786 -1592 -675 625 1637
1480A637K25j023j228r61j34J64J300N90O84M03j074j054o27q14P58J624Q11M39
$$ 1637 1862 839 -389 -1350 -1484 -1320 -20 570 1254 1657 583 -471 -1098 -1912 -1154 470 1281 1720
1498A720r03m17j241m14o3P44P72J114K83n76q81j290n08L13P93J519Q15n84m85
$$ 1720 817 400 -841 -1255 -1318 -574 198 1312 1595 1019 138 -1152 -1660 -1347 -554 965 1780 1196 711
1517G11j030o86o21N19Q29J068J090l49r72j415p84R2Q08Q09Q27O44p74q47m00
$$ 711 -319 -1005 -1626 -1107 -278 790 1880 1531 559 -856 -1640 -1548 -740 69 896 1540 766 -81 -481
1536d81p80l62Q80J335P87M22n41j444j071l09L51J077Q48M21J16o08q29q49n99
$$ -481 -1261 -1623 -743 592 1379 1801 1260 -184 -1255 -1564 -1213 -136 712 1133 1249 641 -188 -1037 -1636
1555a636L12J291J226M40j94j261r45m03O8L7J303Q30J3J22p92j367n58K08M53
$$ -1636 -1324 -33 1193 1633 1439 178 -767 -1170 -1102 -1065 238 1068 1081 1203 411 -956 -1514 -1306 -853
1574h53J485R50l72n74p94r24o8K70O84J009M80J44p60j057p60l53O47J602L23
$$ -853 632 1582 1210 636 -158 -1082 -1150 -880 -196 813 1293 1437 677 -380 -1140 -1493 -846 756 1079
1593A079O3k98n49j351q1l21P17J361O01M92n77j273l46p50L99K91J294O97j5
$$ 1079 1142 844 295 -1056 -1137 -1458 -741 620 1221 1713 1136 -137 -483 -1233 -834 -543 751 1448 1433
1612A433r11m89n53p04L56O15J134N07n5j072n79j089O0Q15O17Q83M19m52k28
$$ 1433 522 33 -520 -1224 -868 -253 881 1388 1333 261 -318 -1407 -1347 -532 85 968 1387 935 707
1631G07j189q41j97R30J113Q42k21r8r96j158o2J00N78J195L90j57l85r93p22
$$ 707 -482 -1323 -1520 -590 523 1365 1144 1046 50 -1108 -1170 -1070 -492 703 1093 936 551 -442 -1164
1650a164j85Q4J138J162K11j18q16j166k67J40L34P23P70L29Q4j222p13n21j73
$$ -1164 -1349 -1265 -127 1035 1246 1128 312 -854 -1121 -981 -647 76 846 1175 1259 37 -676 -1197 -1370
1669a370Q87R11M71L59n60r31o93j48K44L65J078M14j23l44j068p31N6K43J127
$$ -1370 -483 428 899 1258 698 -233 -926 -1074 -830 -465 613 1027 904 560 -508 -1239 -1183 -940 187
1688A87O50k3M9m40q12p14j4M89J053O66K35m22p46j050o15N98J26J197O23j00
$$ 187 837 814 863 423 -389 -1103 -1117 -628 425 1091 1326 904 158 -892 -1507 -909 -783 414 1037 937
1708I37k78p46n12n99K64O18J037L64r1n64r24p40K9N11P01O72O19k76r75l70
$$ 937 659 -87 -599 -1198 -934 -316 721 1085 994 430 -494 -1234 -1205 -694 7 679 1298 1022 47 -323
1728c23n33j46L84Q86N04L89m80q99m88o31N97M34Q72K98J18k15q57r41k40L43
$$ -323 -856 -1002 -618 268 772 1161 681 -218 -706 -1337 -740 -306 566 864 982 767 -90 -1031 -1271 -928
1748i28O88Q37O55l06m94p75l00l58L35P30O27M01l49n66q96n06J59P30R46L68
$$ -928 -240 597 1252 946 452 -323 -623 -981 -646 84 711 1112 763 197 -699 -1205 -1046 -316 630 998
1768I98j81l90o50n94k22K40N03O71N94k23k01n84p94j89L31N61Q71P1K82p38
$$ 998 817 427 -223 -817 -1039 -799 -296 375 969 746 545 -39 -833 -1022 -691 -130 741 812 1094 356
1788C56q37m05k31N25O67N86P74p51n94p80m20J13Q35M34P17K88r74m60p71k36
$$ 356 -481 -886 -1117 -592 75 661 1435 684 90 -690 -1110 -997 -162 272 989 1277 303 -157 -928 -1164
1808a164J61M32J265N40k01q18r14M3m43M45Q72M52K60J9l99r54o10l0O62N57
$$ -1164 -1003 -571 694 1234 1033 215 -699 -656 -1099 -654 218 670 930 949 550 -404 -1014 -1044 -382 175
1828A75Q82K47j094k66p22M4K30M1Q10N00k5%j048k81n95L59J063L69N26n2j113
$$ 175 1057 1304 210 -56 -778 -734 -504 -463 347 847 822 822 -226 -507 -1102 -743 320 689 1215 1163 50
1849E0k63q15J76M65P26M07M22l55o63j139j11J29P50P18J83K56m74p91m95m47
$$ 50 -213 -1028 -852 -387 339 746 1168 813 150 -989 -1100 -971 -221 497 680 936 462 -329 -824 -1271
1869a271L47P28P69J53Ql5j139m26o5L60M91O83M38k32p72m13l90n5P9J121N03
$$ -1271 -924 -196 573 726 734 699 -440 -866 -931 -571 -80 603 1041 809 37 -376 -766 -821 -742 379 882
1890H82L13k91r67q68o5J47O24N85O88o5m41o83n83k57L18L01J057L21K23j025
$$ 882 1195 904 -63 -931 -996 -849 -225 360 1048 983 542 -141 -724 -981 -663 -362 695 1016 1239 214
1910B14o04n47j3N71L31Q89Ln4n81j002l17K95Q2R97P72j61k17q48o65K46k29
$$ 214 -390 -937 -950 -379 -48 841 844 790 209 -793 -1110 -815 -733 264 1036 875 658 -190 -855 -609 -838
1931h38Q06M64N73j9q09l34j012J48M50N13J189J60n46l52o87q34L40M05O92L27
$$ -838 -32 432 1005 986 177 -157 -1169 -1021 -571 -58 1131 1291 745 393 -294 -1128 -788 -383 309 636
1951F36L31j98o93q04j44j6P72N73L88m7m33o61m04k39J14N48P79N44k80n39o34
$$ 636 967 769 76 -728 -872 -888 -116 457 845 798 365 -296 -700 -939 -825 -277 502 1046 766 227 -407
1972d07r21J18P22P65N84L17m91k71r50l91j52O57M77O70M73m67j279n49l5O29
$$ -407 -1328 -1210 -488 277 861 1178 687 416 -534 -925 -1077 -420 57 727 1200 733 -546 -1095 -1130 -501
1992e01K98O56N80k93l13n88q55j31N46O57O15M24j57n55o96o86J57N25L02Q88
$$ -501 -203 453 1033 740 427 -161 -1016 -1147 -601 56 671 1095 938 383 -313 -999 -842 -317 -15 873
2012H73p0j90o08q73k24J33P93M42N79J83o13o50p32l8N53M16O48L38l92lj275
$$ 873 803 613 5 -868 -1092 -959 -166 276 855 1038 425 -225 -957 -995 -442 -26 622 960 568 565 -710
2033g10k54K18K74P01O44o6K28q69q83j08Q6M65P54L49L77q88l34r67k58O19M22
$$ -710 -964 -746 -472 229 873 807 1035 166 -717 -825 -739 -274 480 829 1206 318 -16 -983 -1241 -622 -200
2054b00Q60M59n63J4r47j53j95K88P47R5N87l39l88r74r0R8N02M11M30M11l55
$$ -200 660 1119 556 570 -377 -530 -725 -437 310 405 992 653 265 -709 -799 -701 -199 212 642 1053 698
2075F98n99p11l63oO41R72n4L53m55j197l32O47j00O22L96M49L3q73m90n31j2
$$ 698 99 -612 -975 -981 -340 632 578 931 476 -721 -1053 -406 -506 116 512 961 994 121 -369 -900 -912
2096i12L13P05R26l16k33l76o64j22q2N10N25P48j2n74m76q78J93k8P09P13O52
$$ -912 -599 106 1032 716 483 107 -557 -679 -761 -251 274 1022 1010 436 -40 -918 -725 -753 -44 669 1321
2117A321n33l86o98n21p0L4P85L86P61j14p03p27o51K81N56N70O89k13j23n34
$$ 1321 788 402 -296 -817 -887 -853 -68 318 1079 965 262 -465 -1116 -835 -279 291 980 767 644 110
2137A10o02m28J84P25M99M72j80m72m66q53l32P79O05M84K92qn95r24J64m48P93
$$ 110 -492 -920 -736 -11 488 960 780 308 -158 -1011 -1343 -564 41 525 817 809 214 -710 -546 -994 -201
2158b01P45Q1N56o37n89q35m4J13O09Q97K02L22o02q39o79j49N49N24O53L0J49
$$ -201 544 625 1181 544 -45 -880 -924 -811 -202 695 897 1219 617 -222 -901 -1050 -501 23 676 706 855
2179H55o48m11m94m21P21N79M99J90k94n79o80K7k27Q71J89Q78j96l40p44m47
$$ 855 207 -204 -698 -1119 -398 181 680 870 576 -3 -683 -656 -883 -12 177 1055 859 519 -225 -672
2199f72l06L26N82M99O07k38m41o12o03J6J50O83P02J87k32o40n45j80J96K5P43
$$ -672 -978 -652 -70 429 1036 798 357 -255 -858 -842 -692 -9 693 880 648 8 -537 -717 -521 -496 247
2220B47N12n0l36k39q33l00J91O76Q37K82l90m06n16n59n6M44N17L16N60K34j031
$$ 247 759 709 373 134 -699 -999 -808 -132 705 987 597 191 -325 -884 -940 -496 21 337 897 1131 100
2241A00o11j80k50K51J081M69K12m52q61l63m37J00K26R01Q16J26j81j342k68
$$ 100 -511 -691 -941 -690 391 860 1072 620 -241 -604 -1041 -941 -715 186 1002 1128 947 -395 -663
2260f63n93M31R59K05R61o44l32n60r32M15J70Q20O04P8o7p74p53k2n2Q30K00
$$ -663 -1256 -825 134 339 1300 656 324 -236 -1168 -753 -583 237 841 919 852 78 -675 -697 -749 81 281
2281B81M01K08n32p48j08l81R5Q51P12L73m76l43m88m38l51L69N86O73j62M1k34
$$ 281 682 890 358 -390 -498 -879 -784 67 779 1152 676 333 -155 -593 -944 -575 11 684 522 563 329
2302C29m52q03K65M33M17N62K32m82l91r82L2K15M43O61N61j20n94o38l38n5Q9
$$ 329 -123 -926 -661 -228 189 751 983 501 110 -872 -840 -625 -182 479 1040 920 326 -312 -650 -705 -616
2323f16P52O10M21m20p23o93q4j7J77R22M96M7n76l50m29k40K0M80P67K98o5m25
$$ -616 136 746 1167 747 24 -669 -753 -770 -593 329 825 872 296 -54 -483 -723 -703 -223 544 842 777 352
2345C52p34j48m69N75L55O72L92l91j86o83o90O2J61J294J86O8k9o77k97q82K34
$$ 352 -382 -530 -999 -424 -69 603 995 604 418 -265 -955 -893 -732 562 748 816 787 110 -187 -1069 -835
2366h35L62P44L52L36l63p56k42n27M29L24O44L17l79L43j194l14k64N41P85M08
$$ -835 -473 271 623 959 596 -160 -402 -929 -500 -176 468 785 406 749 -445 -759 -1023 -482 303 711
2386G11K00k83l88r37R8k29L55O42O69j85q1l70p46m71K82K87J059L19l57k67
$$ 711 911 628 240 -697 -599 -828 -473 169 838 653 572 202 -544 -1015 -733 -446 613 932 575 308
2406C08q47r1k58O39K37O73K34k72l84o64k22k22M96M18P25J24o41k46o17l16
$$ 308 -539 -630 -888 -249 -12 661 895 623 239 -425 -647 -869 -373 45 770 894 253 7 -610 -926
2426i26N48L08Q68P3k9k29r56k03m62M62M37M30L06K57m76r66j65k17P53M55M51
$$ -926 -378 -70 798 871 842 613 -343 -546 -1008 -546 -109 321 627 884 408 -558 -723 -940 -187 268 719
2447G19M86o49l61n49m68M0N24P95P6K80m98m84o30k51M21L32P01L21j27j10q24
$$ 719 1205 556 195 -354 -822 -782 -258 537 613 893 395 -89 -719 -970 -549 -217 484 805 678 568 -256
2468b56l11m42O43N38M51N0l4l50q33k76j60M91M19P29L17n90m45p80j55O22K92
$$ -256 -567 -1009 -366 172 623 673 639 289 -544 -820 -980 -489 -70 659 976 386 -59 -839 -994 -372 -80
2489h0P43mJ86n12l81j072J34O16M72L98K28L73o16r11l59m2N67M42Q29k3m79
$$ -80 663 659 845 333 -48 -1120 -986 -370 102 500 728 1101 485 -426 -785 -827 -260 182 1011 988 509
2510E09n22n89k80L14L60J051n4K8m90l95n68l32L69N64M98J78M17j114l14l46
$$ 509 -13 -602 -882 -568 -208 843 789 817 327 -68 -636 -968 -599 -35 463 641 1058 -56 -370 -716
2530g16N5K21Q06l4O08m99n66o58M7R3L22O17P01q0m12m23q01j52J34J105O9O36
$$ -716 -661 -440 366 332 940 441 -125 -783 -736 -643 -321 296 997 917 505 82 -719 -871 -737 368 437 1073
2552A073o39j11o11j96o62O53M54N68N58n26m75l47l82j41N70N56K05N4J04q27
$$ 1073 434 323 -288 -484 -1146 -493 -39 529 1087 561 86 -261 -643 -784 -214 342 547 601 705 -122
$$ [...]
8191b13
##END NTUPLES=NMR FID
##END=
