##TITLE=1H_DE-75H_b
 200.13MHz, D2O,
 8 sc
 
 4.2.2025
##JCAMPDX= 6.0         $$ Bruker NMR JCAMP-DX V2.0
##DATA TYPE= NMR FID
##DATA CLASS= NTUPLES
##ORIGIN= UXNMR, Bruker Analytische Messtechnik GmbH
##OWNER= pz
$$ XWIN-NMR		Version 3.5
$$ Tue Feb  4 16:33:36 2025 Russian Standard Time (UT+4h)  she@DPX200
##.OBSERVE FREQUENCY= 200.1313
##.OBSERVE NUCLEUS= ^1H
##.DELAY= (6, 6)
##.ACQUISITION MODE= SIMULTANEOUS
##.ACQUISITION SCHEME= undefined
##.AVERAGES= 8
##.DIGITISER RES= 18
##SPECTROMETER/DATA SYSTEM= spect
##.PULSE SEQUENCE= zg30
##.SOLVENT NAME= D2O
##.SHIFT REFERENCE= (INTERNAL, D2O, 0, 14.3821)
##AUDIT TRAIL= $$ (NUMBER, WHEN, WHO, WHERE, WHAT)
$$ ##TITLE= Audit trail, XWIN-NMR		Version 3.5
$$ ##JCAMPDX= 5.01
$$ ##ORIGIN= Bruker BioSpin GmbH
$$ ##OWNER= she
$$ F:/spectra/data/she/nmr/H-C/1/audita.txt
$$ ##AUDIT TRAIL=  $$ (NUMBER, WHEN, WHO, WHERE, WHAT)
(   1,<2025-02-04 16:32:10.62 +0400>,<she>,<DPX200>,
      <created by zg, POWCHK disabled, PULCHK disabled
       configuration hash MD5:
       00 E9 B6 7A A2 85 ED C7 34 08 36 98 17 FE 4E 26
       data hash MD5: 16K
       29 9D AE 68 BA 23 77 C9 7F BB 40 0B 68 33 03 85>)
$$ ##END=
$$ 
$$ hash MD5
$$ A6 05 A3 BD 19 2B 2E 62 7B 31 FF B7 28 DB 6A 05
##$RELAX= 
##$RELAX= 
##$RELAX= 
##$RELAX= 
##$RELAX= 
##$RELAX= 
$$ Bruker specific parameters
$$ --------------------------
##$DU= <F:/spectra>
##$EXPNO= 1
##$NAME= <H-C>
##$PROCNO= 1
##$TYPE= <nmr>
##$USER= <she>
##$AMP= (0..31)
100 100 100 100 100 100 100 100 100 100 100 100 100 100 100 100 100 100 
100 100 100 100 100 100 100 100 100 100 100 100 100 100 
##$AQSEQ= 0
##$AQ_mod= 1
##$AUNM= <au_zg>
##$AUTOPOS= <>
##$BF1= 200.13
##$BF2= 200.13
##$BF3= 200.13
##$BF4= 200.13
##$BF5= 200.13
##$BF6= 200.13
##$BF7= 200.13
##$BF8= 200.13
##$BYTORDA= 1
##$CFDGTYP= 0
##$CFRGTYP= 5
##$CHEMSTR= <none>
##$CNST= (0..31)
1 1 145 1 1 1 1 1 1 1 1 1 1 1 1 1 1 1 1 1 1 1 1 1 1 1 1 1 1 1 1 1 
##$CPDPRG= <>
##$CPDPRG1= <>
##$CPDPRG2= <>
##$CPDPRG3= <>
##$CPDPRG4= <mlev>
##$CPDPRG5= <mlev>
##$CPDPRG6= <mlev>
##$CPDPRG7= <mlev>
##$CPDPRG8= <mlev>
##$CPDPRGB= <>
##$CPDPRGT= <>
##$D= (0..31)
0 0.7 0 0 0 0 0 0 0 0 0 0.03 0 0 0 0 0 0 0 0 0 0 0 0 0 0 0 0 0 0 0 0 
##$DATE= 1738672329
##$DBL= (0..7)
120 120 120 120 120 120 120 120 
##$DBP= (0..7)
150 150 150 150 150 150 150 150 
##$DBP07= 0
##$DBPNAM0= <>
##$DBPNAM1= <>
##$DBPNAM2= <>
##$DBPNAM3= <>
##$DBPNAM4= <>
##$DBPNAM5= <>
##$DBPNAM6= <>
##$DBPNAM7= <>
##$DBPOAL= (0..7)
0.5 0.5 0.5 0.5 0.5 0.5 0.5 0.5 
##$DBPOFFS= (0..7)
0 0 0 0 0 0 0 0 
##$DE= 6
##$DECBNUC= <off>
##$DECIM= 32
##$DECNUC= <off>
##$DECSTAT= 4
##$DIGMOD= 1
##$DIGTYP= 9
##$DL= (0..7)
0 120 120 120 120 120 120 120 
##$DP= (0..7)
150 150 150 150 150 150 150 150 
##$DP07= 0
##$DPNAME0= <>
##$DPNAME1= <>
##$DPNAME2= <>
##$DPNAME3= <>
##$DPNAME4= <>
##$DPNAME5= <>
##$DPNAME6= <>
##$DPNAME7= <>
##$DPOAL= (0..7)
0.5 0.5 0.5 0.5 0.5 0.5 0.5 0.5 
##$DPOFFS= (0..7)
0 0 0 0 0 0 0 0 
##$DQDMODE= 0
##$DR= 18
##$DS= 0
##$DSLIST= <SSSSSSSSSSSSSSS>
##$DSPFIRM= 0
$$ [...]
##$SUBNAM0= <"">
##$SUBNAM1= <"">
##$SUBNAM2= <"">
##$SUBNAM3= <"">
##$SUBNAM4= <"">
##$SUBNAM5= <"">
##$SUBNAM6= <"">
##$SUBNAM7= <"">
##$SUBNAM8= <"">
##$SUBNAM9= <"">
##$SW= 18.0517328524113
##$SWIBOX= (0..15)
0 0 2 0 0 0 0 0 0 0 0 0 0 0 0 0 
##$SW_h= 3612.71676300578
##$TD= 16384
##$TD0= 1
##$TE= 0
##$TE2= 300
##$TE3= 300
##$TEG= 300
##$TL= (0..7)
0 120 120 120 120 120 120 120 
##$TP= (0..7)
150 150 150 150 150 150 150 150 
##$TP07= 0
##$TPNAME0= <>
##$TPNAME1= <>
##$TPNAME2= <>
##$TPNAME3= <>
##$TPNAME4= <>
##$TPNAME5= <>
##$TPNAME6= <>
##$TPNAME7= <>
##$TPOAL= (0..7)
0.5 0.5 0.5 0.5 0.5 0.5 0.5 0.5 
##$TPOFFS= (0..7)
0 0 0 0 0 0 0 0 
##$TUNHIN= 0
##$TUNHOUT= 0
##$TUNXOUT= 0
##$USERA1= <user>
##$USERA2= <user>
##$USERA3= <user>
##$USERA4= <user>
##$USERA5= <user>
##$V9= 5
##$VALIST= <valist>
##$VCLIST= <CCCCCCCCCCCCCCC>
##$VD= 0
##$VDLIST= <DDDDDDDDDDDDDDD>
##$VPLIST= <PPPPPPPPPPPPPPP>
##$VTLIST= <TTTTTTTTTTTTTTT>
##$WBST= 1024
##$WBSW= 4
##$XGAIN= (0..3)
0 0 0 0 
##$XL= 0
##$YL= 0
##$YMAX_a= 651750
##$YMIN_a= -685153
##$ZGOPTNS= <>
##$ZL1= 120
##$ZL2= 120
##$ZL3= 120
##$ZL4= 120
##$ABSF1= 10
##$ABSF2= 0
##$ABSG= 5
##$ABSL= 3
##$ALPHA= 0
##$AQORDER= 0
##$ASSFAC= 0
##$ASSFACI= 0
##$ASSFACX= 0
##$ASSWID= 0
##$AUNMP= <proc_1d>
##$AZFE= 0.1
##$AZFW= 0.1
##$BCFW= 1
##$BC_mod= 2
##$BYTORDP= 1
##$COROFFS= 0
##$CY= -3
##$DATMOD= 1
##$DC= 2
##$DFILT= <>
##$DTYPP= 0
##$F1P= 0
##$F2P= 0
##$FCOR= 0.5
##$FTSIZE= 0
##$FT_mod= 4
##$GAMMA= 1
##$GB= 0.15
##$INTBC= 1
##$INTSCL= 1
##$ISEN= 128
##$LB= 0.25
##$LEV0= 0
##$LPBIN= 0
##$MAXI= 10000
##$MC2= 0
##$MEAN= 0
##$ME_mod= 0
##$MI= 1.114404
##$NCOEF= 0
##$NC_proc= 0
##$NLEV= 6
##$NOISF1= 3.799351
##$NOISF2= 2.8
##$NSP= 1
##$NTH_PI= 0
##$NZP= 0
##$OFFSET= 14.38212
##$PC= 1
##$PHC0= -115.1647
##$PHC1= 17.19222
##$PH_mod= 1
##$PKNL= yes
##$PPARMOD= 0
##$PSCAL= 0
##$PSIGN= 0
##$REVERSE= no
##$SF= 200.129724274929
##$SI= 16384
##$SIGF1= 3
##$SIGF2= 2
##$SINO= 400
##$SIOLD= 16384
##$SREGLST= <1H.CDCl3>
##$SSB= 0
##$STSI= 0
##$STSR= 0
##$SW_p= 3205.1282051282
##$SYMM= 0
##$S_DEV= 0
##$TDeff= 0
##$TDoff= 0
##$TI= <>
##$TILT= no
##$TM1= 0
##$TM2= 0
##$TOPLEV= 0
##$USERP1= <user>
##$USERP2= <user>
##$USERP3= <user>
##$USERP4= <user>
##$USERP5= <user>
##$WDW= 1
##$XDIM= 8192
##$YMAX_p= 0
##$YMIN_p= 0
$$ End of Bruker specific parameters
$$ ---------------------------------
##NTUPLES= NMR FID
##VAR_NAME=  TIME,          FID/REAL,        FID/IMAG
##SYMBOL=    X,             R,               I
##VAR_TYPE=  INDEPENDENT,   DEPENDENT,       DEPENDENT
##VAR_FORM=  AFFN,          ASDF,            ASDF
##VAR_DIM=   8192,          8192,            8192
##UNITS=     SECONDS,       ARBITRARY UNITS, ARBITRARY UNITS
##FACTOR=    0.0002768,     1,               1
##FIRST=     0,             0,               0
##LAST=      2.2672688,     0,               0
##MIN=       0,             -685153,         0
##MAX=       2.2672688,     651750,          0
$$ Real data points
##PAGE= N=1
##DATA TABLE= (X++(R..R)), XYDATA
0@%%%%%%%%%%%%%qJ6j6J6j6K4l2L2m0M8n6O5p3Q8j01J17j33J51j75J96k22K53
$$ 0 0 0 0 0 0 0 0 0 0 0 0 0 0 -8 8 -8 8 -8 16 -16 16 -24 24 -32 33 -40 48 -53 64 -69 82 -93 103 -119 134
35A34k85L20l56L99m47M96n52O12o76P46q24R10j002J105j218J343j480J630j801
$$ 134 -151 169 -187 212 -235 261 -291 321 -355 391 -433 477 -525 580 -638 705 -775 855 -946
54i46J990k203K450k732L060l448L916m496N230o197P535r510J2733j8894L4886
$$ -946 1044 -1159 1291 -1441 1619 -1829 2087 -2409 2821 -3376 4159 -5351 7382 -11512 23374
69B3374j59132m73769p5626J60215L11686L71140L45147J48715p5040k69998l49308
$$ 23374 -135758 -609527 -685153 -524938 -213252 157888 503035 651750 576710 306712 -42596
80d2596l11588j66760K2890K28287L21866K61962J19560k8509j94599k94305k57590
$$ -42596 -354184 -520944 -498054 -269767 52099 314061 433621 405112 210513 -83792 -341382
91c41382j13833M3360J83025K61024K41106J28678k5571j63041k22816j95208
$$ -341382 -455215 -411855 -228830 32194 273300 401978 376407 213366 -9450 -204658
101b04658j04463J5018J30805J92167J78241R8974j8495j29203j82535j64101
$$ -204658 -309121 -294103 -163298 28869 207110 306084 287589 158386 -24149 -188250
111a88250r4695K123J02928J66479J58626Q7859p477r2137j37828j30644p2298
$$ -188250 -282945 -280822 -177894 -11415 147211 235070 227593 135456 -2372 -133016 -205314
122b05314Q667Q0036J21031J21297P7055P35p6745j17597j10146o7141m819N8754
$$ -205314 -196647 -116611 4420 125717 202772 203507 126762 9165 -100981 -168122 -172941 -114187
134a14187R9850R8248N7949J803n1229q5401q9136n7528l317N0949Q2161Q1790
$$ -114187 -14337 83911 141860 143663 92434 7033 -82103 -139631 -142948 -91999 -9838 71952
146G1952N2099M416m1562o9339p0393m7115p446L3245O1592O5325M2023M362l2902
$$ 71952 124051 128467 86905 17566 -52827 -99942 -107388 -74143 -12551 52774 94797 99159 66257
159F6257n5915n9328l9478n688K7662N0498N3261L6810O591k2635m3632m6983
$$ 66257 10342 -48986 -88464 -94152 -66490 -15992 37269 74079 80670 58035 14403 -32580
171c2580l2284o250K1028L9724M2751K9332N732j8423l6357l8894k7349p085J5458
$$ -32580 -64864 -71114 -50086 -10362 32389 61721 67453 49030 12673 -26221 -53570 -60655 -45197
184d5197L1142L4529K4979O849j3625k8054l0783k2508n929J2691K5341K8027
$$ -45197 -14055 20474 45453 52302 38677 10623 -20160 -42668 -48597 -35906 -10565 17462
196A7462K1240O485j0556k2201k5534j9313o271Q467J9587K2426J6881N495p347
$$ 17462 38702 45187 34631 12430 -13104 -32417 -38688 -30221 -10634 11792 28673 34168 26821
209B6821j7202k0841j5823n286O374J5931J8491J4592N519m971j3836j6624j2958
$$ 26821 9619 -11222 -27045 -32331 -25957 -10026 8465 23057 28576 23605 9769 -6855 -19813
222a9813n389M809J2575J4637J1912M426m041j1120j3500j0607m751L050R743
$$ -19813 -25202 -20393 -7818 6819 18731 23157 19116 7996 -5504 -16111 -20862 -17812 -8069
235h069J2542R317M167k838q220j0744q785l815K647P528R977Q205L434k268o931
$$ -8069 4473 13790 17957 15119 6899 -3845 -12630 -16445 -13798 -6270 3707 11912 15346 13078 6147
250F147q642p092l546J559O109P563O340L504j996n439o605o076k628R88N017
$$ 6147 -2495 -9587 -13133 -11574 -5465 2098 8438 11942 9946 4507 -2098 -8174 -10802 -9814 -4797
265d797O266N441K871j100m263n637m793k377J155L809M643M407K237r61l762
$$ -4797 1469 6910 9781 8681 4418 -1219 -6012 -8389 -7234 -3425 1218 5625 7862 6901 3139
280C139m204l996k152R54K966M285L359J757o79k598l544l517j263M45K509L356
$$ 3139 -1065 -5061 -7213 -6259 -3293 992 4351 6108 5429 2831 -713 -4230 -5493 -5048 -2539 817
296H17K943J359l70k145l076k603j430M87J852K539K322J332l77j585k822k238
$$ 817 3760 5119 4749 2604 -472 -3075 -4505 -4018 -2166 373 2695 4027 3650 2065 -757 -2995
312b995o54L57J545K159J969J050q9j290k484j817p41N08R28J885J593R52m02
$$ -2995 -3649 -3292 -1747 412 2381 3431 3342 2052 -432 -2249 -2990 -2482 -1554 331 1924 2876 2474
329B474j286j389j635n56N9J081J522J240Q42j49r81j183j351p20J45Q09J185
$$ 2474 1188 -201 -1836 -2392 -2333 -1252 270 1510 2352 2203 1222 39 -1312 -2032 -1887 -1078 107
346A07J009R43m40p35j142q18o80N8R30Q79R78P71q4j050m38j241m68Q4N96R19
$$ 107 1116 2059 1619 884 -258 -1076 -1756 -1698 -768 111 1089 1860 1776 726 288 -953 -1421 -1337 -741 178
366A78P31N04p5o44o65q66l90L44p5J025K57R40p9k94p24r82n62M18O29J49R01
$$ 178 909 1413 1338 694 29 -837 -1227 -883 -958 67 324 1264 1185 891 167 -815 -1377 -959 -330 -181 720
387G20J25j58J70n06p00l56k94M48P01L81K39j35k37l75o41j25p8N46L35L59L52
$$ 720 845 687 857 351 -349 -705 -999 -551 150 531 770 635 398 23 -618 -743 -821 -275 60 419 771
408G71j84k06j48m34m29qL30K4N10J95L68l62k86m90l83Q5L76P5J66O56Q3j41
$$ 771 587 381 233 -201 -630 -638 -308 -284 226 421 789 427 141 -349 -732 -647 -271 -196 -30 626 709 568
430E68m11q5n22k13L12M49J9L91m6O0l37n99J8j3j1K43N23J35J84o15J79m65l44
$$ 568 157 72 -450 -663 -351 98 117 508 462 522 185 -414 -396 -409 -420 -177 346 481 665 50 229 -236 -580
453e80J00R3J25L03K97J20J35m49k70l36j64J56K52M81l8K76j42q8o6k85m18J98
$$ -580 -480 -387 -262 41 338 458 593 144 -126 -462 -626 -470 -218 263 225 501 359 271 205 -80 -498 -300
475c00l0L90k5K28J46k95J7l71k47K11N9M26j4K37l5k32j18l99O0l19M98n7N85
$$ -300 -330 60 35 263 409 114 131 -240 -487 -276 -217 209 195 432 397 165 47 -352 -292 -611 -113 -170 415
498D15k73M6N5j68j37k72o3J59L47r8J41J58J9j55k61j45m4K67j47O5N46j84K3
$$ 415 142 188 243 75 -62 -334 -397 -238 109 11 152 310 329 174 -87 -232 -276 -9 -156 -91 455 271 294
521B94O1m21p5j09K41K58k28J4K17j74J65l30j98j63K66M50k02l9J85m19K84p9
$$ 294 355 -66 -141 -250 -9 249 21 35 252 78 243 -87 -285 -448 -182 268 66 27 212 -207 77 -2
543bo2k91j54K81L17K36k08J07k27j3K5m12m2N30j15J82j40L61j35l04J47j77
$$ -2 -64 -355 -509 -228 89 325 117 224 -3 -16 9 -403 -445 85 -30 152 12 373 238 -66 81 -96
565i6l68L56k6J33J12j06N1K78k5l67j62L94j26l3K43o3J32k74j89K91k41k80
$$ -96 -464 -108 -134 -1 111 5 56 334 309 -58 -220 174 48 15 258 195 327 53 -136 155 -86 -366
587c66L62j5L4K02j27j12j31K22m0L5k66J57k0K7L9r2J03N7J87l48M9r2LJ36J5
$$ -366 -4 -19 15 217 90 -22 -153 69 29 64 -202 -45 -65 -38 1 -91 12 69 256 -92 -43 -135 -132 4 19
612A9l32L88q6k81J35M04j96N9Jj63J37j82o8J88J80j84J11j03N37m18q9l58J72
$$ 19 -313 75 -11 -292 -157 247 51 110 111 -52 85 -97 -165 23 203 19 130 27 564 146 57 -301 -129
635a29L1M0m4K17K22j59k6j08p4n0lP9L6k04O1M3J56K7j84oJ29J24j61P4j65K14
$$ -129 -98 -58 -102 115 337 178 152 44 -30 -80 -83 -4 32 -172 -111 -68 88 115 -69 -75 54 178 17 91 -74 140
661A40Q8k63j08L89k53q2p0L09J61k31l7Q1J25n14M39n3j25K6j03J24J57k21n1
$$ 140 228 -35 -143 246 -7 -89 -159 150 311 80 43 124 249 -265 174 121 -4 22 -81 43 200 -21 -72
684g2J54On8l9K34j05j64P7K49k50m4K10j36k24N5j97L96PJ65k53l0O8J11O1l11
$$ -72 82 88 30 -9 225 120 -44 33 282 32 -12 198 62 -162 -107 -304 92 99 264 11 -19 49 160 221 -90
709i0J81j07J91L2k88l74L57j76J53O4J3P5J29j39q1R3k39M5Q2K89j51J6R0k62
$$ -90 91 -16 175 207 -81 -455 -98 -274 -121 -57 -44 31 160 21 -60 33 -206 -161 -79 210 59 75 165 -97
733i7J79p0Q8m62O01k96L01l52M09k29L0o2p1o8R1J35j95J55k22J60j7P7q0k6
$$ -97 82 12 100 -362 239 -57 244 -108 301 72 102 40 -31 -99 -8 127 -68 87 -135 25 8 85 5 -21
757b1j48L63p6Q2j64j0L4j04R2J15k82j08L11Q2m38K49j00p8K51j04J95m3Lj22
$$ -21 -169 194 118 200 36 26 60 -44 48 163 -119 -227 84 166 -272 -23 -123 -201 50 -54 141 98 101 -21
781b1n0j18N37m16J47O5N2k09J82n06M00P7n7o2J2j85M9M0J57j94R5j18J57nM6
$$ -21 -71 -189 348 -68 79 144 196 -13 169 -337 63 140 83 21 33 -152 -103 -63 94 -100 -5 -123 34 29 75
806G5N7k40M4K26K7k96K21o9J74l79J46k1N1J54k56L03j54j4K42l7j75p7J6L07
$$ 75 132 -108 -64 162 189 -107 114 45 219 -160 -14 -35 16 170 -86 217 63 49 291 254 79 2 18 325
830C25n48K78J0k51K16j7J9J47j04k35O2K15j09O9L13m97Q7o9l97M60j87L20o3
$$ 325 -223 55 65 -186 30 13 32 179 75 -160 -98 117 8 77 390 -107 -20 -89 -486 -26 -213 107 44
853D4qJ17k73N9J90R7j09j31R1l71J98K19k45L9K42J17j39l43K48%J14l06o8O3
$$ 44 36 153 -120 -61 129 226 117 -14 77 -294 -96 123 -122 -83 159 276 137 -206 42 42 156 -150 -218 -155
877a55l6K39K40j36J07jj0k05j40J90l8l0o7K65j39n9j3q7j78M76o9n5J8j65J9
$$ -155 -191 48 288 152 259 258 248 43 -97 93 55 25 -42 223 84 25 12 -75 -253 223 154 99 117 -48 -29
902b9L02o3j21N4k03K81l61J73M5J34k99K85k09j21J60j32n3J98RR5k2p4j89K00
$$ -29 273 210 89 143 -60 221 -140 33 78 212 -87 198 -11 -132 28 -104 -157 41 50 145 123 49 -140 60
926F0K62m32P5K2Q8L98n62O1o7o0K9J01J19O3k28j90J20J84N8l29L00l63J73J19
$$ 60 322 -110 -35 -13 75 473 -89 -28 -95 -155 -126 -25 94 157 -71 -261 -141 43 101 -228 72 -291 -118 1
950Aj56J31k02K51K75o09L03Ql9n2O6K64m44K74j06J06j0r5J33j68J65j29J82
$$ 1 -155 -24 -226 25 300 -309 -6 2 -37 -89 -23 241 -203 71 -35 71 61 -34 99 -69 96 -33 149
973A49k78K4K55j99J85q0J35k09j17q5K8M6K12j24L0k23J73qk19J59L06j56p7
$$ 149 -129 -105 150 -49 136 56 191 -18 -135 -220 -192 -146 66 -58 -28 -251 -78 -86 -305 -146 160 4 -73
996g3j24L9K27L6J1j05l37K97O5j3m9j32L39J78k97K02l36k27O12q6k83K00J41
$$ -73 -197 -158 69 105 116 11 -326 -29 36 23 -26 -158 181 359 62 264 -72 -299 313 227 -56 144 285
1019B85n25K94o0Q2k0J27j63J3j58Q4l5R1J04lj92n5K44o0j61Q4L0o1k5n4M22
$$ 285 -240 54 -6 76 56 183 20 33 -125 -41 -76 15 119 116 -76 -131 113 53 -108 -24 6 -55 -80 -134 288
1044B88r6j52K01k38j17Q2R2j07M1K02j02j8P2O7k62o2K7L28k07m84N02j77J49
$$ 288 192 40 241 3 -114 -32 60 -47 -6 196 94 76 148 215 -47 -109 -82 246 39 -445 57 -120 29
1067B9j50j0P2J54j26j50K37M2Q7j83J33n81M67L1j68m1R5Q0K96j79J12j91J55
$$ 29 -121 -131 -59 95 -31 -181 56 98 185 2 135 -446 21 52 -116 -157 -62 18 314 135 247 56 211
1090B11P2j13k27L33l46q3J18M8K7Q6J13j14m4j11J00l2R0j21n06L84M7O5n8P1
$$ 211 283 170 -57 276 -70 -153 -35 13 40 126 239 125 81 -30 70 38 128 7 -499 -115 -68 -3 -61 10
1114A0J82j46Q6j6j25j57J21R0J09k07J50k43L54m24J49J26J07m04K33m9l95J01
$$ 10 192 46 132 116 -9 -166 -45 45 154 -53 97 -146 208 -216 -67 59 166 -238 -5 -54 -449 -348
1136c48N70l13j43J96K62n66L00k3k75J55K89O1q4j00M2k84L12P9M2k06j86J98
$$ -348 222 -91 -234 -38 224 -342 -42 -65 -340 -185 104 165 81 -19 23 -261 51 130 172 -34 -220 -22
1158b2j73K18jJ81j62P3p6K23R9l28O3l61R0J60J6q7J35j12j8K23l78M72j09m34
$$ -22 -195 23 22 203 41 114 38 261 360 32 95 -266 -176 -16 0 -87 48 -64 -82 141 -237 235 126 -308
1182c08L94J2l25K77O3k4n2j09M6J33l08L29l03N2j3J57J51k91j10J39j42K03
$$ -308 86 98 -227 50 113 89 37 -72 -26 107 -201 128 -175 -123 -136 21 172 -119 -229 -90 -232 -29
1204b9J55j69K12n2R6l64J15J50q2k29J74R0r4j90K54O5k36j3K23o7j39J80J63
$$ -29 126 -43 169 117 213 -151 -36 114 32 -197 -23 67 -27 -217 37 102 -134 -147 76 9 -130 50 213
1227B13k09O3k95K99j22R5K21q5L4k44L15l55K50n0k57K23j6j09J7J10k7n1L48
$$ 213 4 67 -228 71 -51 44 265 180 214 -30 285 -70 180 130 -127 96 80 -29 -12 98 71 20 368
1250C68m25J45Jl3M5j86o0K67j1j39Q5L0K7j33j57L21k59J51n1q6l5M5J20j66
$$ 368 -57 88 89 56 101 -85 -145 122 111 -28 57 87 114 -19 -176 145 -114 37 -14 -100 -135 -90 30 -136
1274a36RL97k21n0J65j98nl6J89K68k16r7J23N4k54k6Q7k62J23k70L30P2m23O84
$$ -136 -127 270 49 -1 164 -34 -39 -75 114 382 166 69 192 246 -8 -34 53 -209 -86 -356 -26 46 -377 307
1298C07j71j60plj13K46J7j12o7M18l80J1J3l64M89r2l5k10M06Kj12l81K36L5
$$ 307 136 -24 -31 -34 -147 99 116 4 -63 355 -25 -14 -1 -365 124 32 -3 -213 193 195 83 -298 -62 -27
1322b7k24J07J36l53M44j34J69MJ71m85M44k85K0J12k05k36L55k30L08N9N6j15
$$ -27 -251 -144 -8 -361 83 -51 118 122 293 -192 252 -33 -13 99 -106 -342 13 -217 91 150 206 91
1344I1j06K14k36j60K33Q6l12L31j9j96k8K42J9j69K56m00N27j68j41O6O8j96
$$ 91 -15 199 -37 -197 36 122 -190 141 122 -74 -102 140 159 -10 246 -154 373 205 64 130 198 2
1366Bj64J92m0l7K77Lm48K84l16J75K7R1J25R7q8k54J89J95m21J66q6j0J82l35
$$ 2 -162 30 -10 -47 230 233 -215 69 -247 -72 -45 46 171 268 180 -74 115 310 -111 55 -31 -41 141 -194
1390a94Q0N3L20k14R1r1K40l19r4m7K51k85K59l8k62L95k43J57m4J71k33k9M02
$$ -194 -114 -61 259 45 136 45 285 -34 -128 -175 76 -209 50 12 -250 145 -98 59 15 186 -47 -76 326
1413C26l37l79N33j10K30l1l25K70k08j8K43m13J49J64M2j50J55j22j66K24r9
$$ 326 -11 -390 143 33 263 232 -93 177 -31 -49 194 -219 -70 94 136 -14 141 19 -147 77 -22
1434b2n7R4m9J03J5J81l4k96L6J34l28L82j12o0j0R9J47l65J45j73PO7J08R5j29
$$ -22 -79 15 -34 69 84 265 231 -65 -29 105 -223 159 47 -13 -23 76 223 -142 3 -170 -163 -96 12 107 -22
1459b2O8J74j70q8k03K61j30O1po7P7q8l2L65l73L4N1k25M92j61k41K61m3J69
$$ -22 46 220 50 -38 -241 20 -110 -49 -56 -123 -46 -134 -166 199 -174 -140 -89 -314 178 17 -224 37 -6 163
1483A63j73j4P5j90K9j58L06L4j55J97p2k69L05P3k12N5J62l13M5%J07J70j49
$$ 163 -10 -24 51 -139 -110 -268 38 72 -83 114 42 -227 78 151 -61 -6 156 -157 -112 -112 -5 165 16
1506A6l21K11j2J04P5n6n8l7j3K83j62j14J57q8Q7q3m9j72L21m7k3J02l5m7J29
$$ 16 -305 -94 -106 -2 73 17 -41 -78 -91 192 30 -84 73 -15 72 -11 -60 -232 89 42 19 121 86 39 168
1531A68k1l18k8K93l68J65J42j62k6j8K44j23l3J94p0M3k38K1J99l8m5J46J12
$$ 168 147 -171 -199 94 -274 -109 33 -129 -155 -173 71 -52 -85 109 39 82 -156 -135 64 26 -19 127 239
1554B39l14K48j43j41q4K94l2m6l11L00Q9j41j17J39LQ4K36l10r0q5J52J17k89
$$ 239 -75 173 30 -111 -195 99 67 21 -290 10 99 -42 -159 -20 -17 67 303 -7 -97 -182 -30 87 -202
1577b02J64L7J04K28n13O03n12l1K3N4j48jK80J5J21j44k82K67K10m08Q5J59O0
$$ -202 -38 -1 103 331 -182 421 -91 -122 -99 -45 -193 -194 86 101 222 78 -204 63 273 -135 -50 109 169
1600A69r3k43j01L24J76r1l47Q7k1N3J42r9K95k68jL0J17j75j45K36N1p6P0j42
$$ 169 76 -167 -268 56 232 141 -206 -119 -140 -87 55 -44 251 -17 -18 12 129 -46 -191 45 96 20 90 -52
1624e2R7j11L6r3J85j08j38J98p8K45k25K27q7j54L62k12j09k29K82J23j43m0
$$ -52 45 -66 -30 -123 62 -46 -184 14 -64 181 -44 183 96 -58 304 92 -17 -246 36 159 16 -24
1646b4J9J75k19no7K51n8mj82N88k67k89K3J07J90k38l7L4J2M8L7j10j1O9Q1k71
$$ -24 -5 170 -49 -54 -121 130 72 68 -114 474 207 -82 -59 48 238 0 -37 -3 9 57 94 -16 -27 42 123 -148
1672a48L79o1k01J69k42O2m1J23j45K53L6l51J92KK7k35K9K64r4j59M00o3l50
$$ -148 231 170 -31 138 -104 -42 -83 40 -105 148 184 -167 25 27 54 -181 -152 112 18 -141 259 196 -154
1695a54K60J0n2m13P2L38l99J51p0L97l12m8L6M7J20K54j40j4R0J04k27K7j80
$$ -154 106 116 64 -349 -277 61 -338 -187 -257 140 -172 -220 -184 -137 -17 237 97 83 173 277 50 77 -103
1718a03J63k89K86j43k69M49p9J0OJ20j89l7J05r2J82J00j37J35k43J16q6j68
$$ -103 60 -229 57 -86 -355 94 15 25 31 151 -38 -75 30 -62 120 220 83 218 -25 91 5 -163
1740a63R8j3M6j91K7M59j36k17K8n1J26m9q2J00l54L16L15j79%m32M32j38o2n1
$$ -163 -65 -78 -32 -223 -196 263 127 -90 -62 -113 13 -36 -118 -18 -372 -56 259 80 80 -352 80 -58 -120 -171
1764a71j7O6J38P2k46J59q7j05M3r2L85j44J47L6R4l23L9J54k31J46O7k57m9K11
$$ -171 -188 -122 16 88 -158 1 -86 -191 -148 -240 145 1 148 184 278 -45 -6 148 -83 63 130 -127 -176 35
1788C5p6J43J22k57Q2k07J07K00r5P9k99N9J96j38J39j99J16J35j36n4J27l88
$$ 35 -41 102 224 -33 49 -158 -51 149 54 133 -166 -107 89 -49 90 -109 7 142 6 -48 79 -309
1810c09K70K17j28RL9j61l7R5J26J25l9k66M3J47k13J36p4N9n2J4L0o7J69r7M46
$$ -309 -39 178 50 59 98 -63 -100 -5 121 246 207 -59 -16 131 -82 54 -20 39 -13 1 31 -36 133 36 482
1835D82m68J14j27j88J43q0K37l0J7po3j5Q8R0k43J86l5k45L7L2m7J95k06oR2
$$ 482 14 128 1 -187 -44 -124 113 83 100 93 30 15 103 193 -50 136 101 -144 -107 -75 -122 73 -133 -139 -47
1860d7J54j25j4K5n0K67o5l6nL05n35J73KL9k7j98R8K02k62L9J11R4j36R6M7j43
$$ -47 107 -18 -32 -7 -57 210 145 109 104 409 -126 47 49 88 61 -137 -39 163 -99 -60 51 145 9 105 152 9
1886Ij4j92L59l83K56J08J49l69j2P9J10j58r0L35O7k23j45K06j5l8P5l59K43
$$ 9 -5 -197 162 -221 35 143 292 -77 -89 -10 100 -58 -148 187 254 31 -114 92 77 39 114 -245 -2
1909bj86J9K54k9l8Q0P7q8J18J9o09J54K46R3r1L4Jq5J3O0lj67K69r3K40m19j30
$$ -2 -188 -169 85 56 18 98 175 87 205 224 -385 -231 15 108 17 51 52 -33 -20 40 37 -130 139 46 286 -133 -263
1936b63L57j77J18J22L4l03J3L24k47N7J43j27J8r9J6J31j25n1k6N2l0k30M86
$$ -263 94 -83 35 157 191 -112 -99 225 -22 35 178 51 69 -30 -14 117 -8 -59 -85 -33 -63 -293 193
1959A93j25jR0k52j4K08M2j19j16j91M19l8J41k00K58k36j96J03j54K60l9%j62
$$ 193 68 67 157 -95 -109 99 141 22 -94 -285 134 96 237 37 295 59 -137 -34 -188 72 33 33 -129
1982a29K19k95N7P2r2L36k63L35m65J40J51M2k23K49m7J14j69j51j29Q1K66k14
$$ -129 90 -205 -148 -76 -168 168 -95 240 -225 -85 66 108 -115 134 87 201 32 -119 -248 -167 99 -115
2004a15k12M64q2n1l8r6m9J76j35R3nj45qL65j07J16j3j16k07J20L29l73J25J33
$$ -115 -327 137 55 4 -34 -130 -179 -3 -138 -45 -50 -195 -203 162 55 171 158 42 -165 -45 284 -89 36 169
2028A69m47K48j67L64j57N4r4q2r7L72K3j84K02m06L0J87R7j6m10L26J12k1l88
$$ 169 -278 -30 -197 167 10 64 -30 -112 -209 163 186 2 204 -202 -172 15 112 96 -314 12 124 103 -285
2051b85K76j62J50O0j25K2J10J44k94J02J95j82k36J06L32pl23k14J77K43j64
$$ -285 -9 -171 -21 39 -86 -64 46 190 -104 -2 193 11 -225 -119 213 206 -117 -331 -154 89 -75
2072g5j38Q9K11r3Oj15J48M1J85m38L05k94J94j79J93K7k38M8L48l31P5q6K61
$$ -75 -213 -124 87 -6 0 -115 33 74 259 -179 126 -168 26 -153 40 67 -171 -123 225 -106 -31 -117 144
2095A44j88J08o6j81K34o8J33j92L06k79J59J75l23LJ85l94J08L86m84J53J8K53
$$ 144 -44 64 -2 -183 51 -17 116 -76 230 -49 110 285 -38 -35 150 -244 -136 250 -234 -81 -63 190
2117A90m5k56P5P9J05J18m36P0j54K25j38L86k82l1n4L20k1j89K4j84R4J8K55
$$ 190 145 -111 -36 43 148 266 -170 -100 -254 -29 -167 219 -63 -94 -148 172 151 -38 -14 -198 -104 -86 169
2140A69k39O8o2P3k1%P4J55j17j30J71k66j11N91l54R3k12R2J72k32K9P2J02j86
$$ 169 -70 -2 -64 9 -12 -12 62 217 100 -30 141 -125 -236 355 1 94 -118 -26 146 -86 -57 15 117 -69
2164f9J62q8j3J4J15k52K69J0k54K13j5L1j33N3j02L8M04l65o6J96n11J39K90
$$ -69 93 5 -8 6 121 -131 138 148 -106 107 92 123 -10 43 -59 -21 383 18 -48 148 -363 -224 66
2187F6k17K51R0j81J8J50n34K12Q9r9J53J25k14J88j66K60p0j01p9r9K28j90J44
$$ 66 -151 100 190 9 27 177 -357 -145 -56 -155 -2 123 -91 97 -69 191 121 20 -59 -158 70 -120 24
2210B4k31K59K6j58j15K59p3R9k33K24j68m3j5K78k66j7K40j09MJ15j4K3o6l3
$$ 24 -207 52 78 -80 -195 64 -9 90 -143 81 -87 -130 -145 133 -133 -150 90 -19 -15 100 86 109 43 10
2234A0j26n1L28J10J04o19L25l89L94j97nL51j04P6Q8l67O9o8j52L21k24M16m99
$$ 10 -116 -167 161 271 375 -244 81 -308 86 -111 -116 235 131 207 295 -72 -3 -71 -223 98 -126 290 -209
2257b09K05J18k49M23o24K88J35N1p2j51k34L32J21k11R0m6J85j96j17J87M5K8
$$ -209 -4 114 -135 288 -336 -48 87 138 66 -85 -319 13 134 -77 13 -33 152 -44 -161 26 71 99
2279I9k74O7J6L38k65k31J46J08J6J22k35K28n0k01oJ28J62m59K71N9j12rK92
$$ 99 -175 -108 -92 246 -19 -250 -104 4 20 142 -93 135 85 -116 -122 6 168 -291 -20 39 -73 -82 210
2302B10j00p1J48k32K14r2K80m19K13k7J84m12o5j01M12k95K73K9l54K45n8n8
$$ 210 110 39 187 -45 169 77 357 -62 151 124 308 -104 -169 -270 142 -153 120 149 -205 40 -18 -76
2324g6jK05p4m5m6R2K74j63l35K61l75K3L11p8k0K63j57k9J17J7k1l58M76j89
$$ -76 -77 128 54 9 -37 55 329 166 -169 92 -283 -260 51 -27 -47 216 59 30 147 164 143 -215 261 72
2348G2K4j00J8mj4N7j7l09Q9O1N4J29j29J50j21j83J69N8o9N0J14l33k3L00J82
$$ 72 96 -4 14 10 -4 53 36 -273 -184 -123 -69 60 -69 81 -40 -223 -54 4 -65 -15 99 -234 -257 43 225
2373B25l57l29M43M8l66N18j30l69K81J82l67K99O3k0Rl20M44pj69k8j01nM7l2
$$ 225 -132 -461 -18 30 -336 182 52 -317 -36 146 -221 78 141 121 130 -190 254 247 78 50 -51 -56 -9 -41
2397d1J14P6k39p0J47k74K35k22K79j17M8R9j53l47N81n5L3M5o7J93k48J57k18
$$ -41 73 149 -90 -160 -13 -287 -52 -274 5 -112 -64 35 -118 -465 116 61 94 139 72 265 17 174 -44
2420d4o1m4J00L0m9L18K5j56n73P03l68K1L29k64o0K33k5j3k19J83J9j26Q6p2
$$ -44 -105 -149 -49 -19 -68 250 275 119 -454 249 -119 -98 231 -33 -93 140 115 102 -117 66 85 -41 45 -27
2444b7Q4j50L46km07J13k3K84k63o5J31L2R3j13L1jk33K0L15l04N8j63K46k5r1
$$ -27 57 -93 253 251 -156 -43 -66 218 -45 -110 21 53 146 33 64 63 -170 -150 165 -139 -81 -244 2 -23 -114
2469a14J71j06o1K38Q1q5mk88L16j97q0L18R4l35L92n71K54J06l6J68j71l27J52
$$ -114 57 -49 -110 128 209 124 120 -168 148 -49 -129 189 283 -52 340 -231 23 129 93 261 90 -237 -85
2492h5k05K95L7J12r4o1J65k04m2J93p8J26o6K35m62K2L73j65l9l08M06m0l37
$$ -85 -290 5 42 154 60 -1 164 -40 -82 111 33 159 93 328 -134 -112 261 96 57 -251 155 115 -222
2515b22P07p12J05L41k38J44j97J56n2J04l22N0Q8k58K14K03k62L65p2q0M4r2
$$ -222 485 -227 -122 219 -19 125 -72 84 32 136 -186 -136 -48 -306 -92 111 -151 214 142 62 106 14
2537A4J38l42M31k17m29M51p4J8J55k9j82p7q7L54j6m34M54j4j18M5p8L5J31k89
$$ 14 152 -190 241 24 -405 46 -28 -10 145 116 -66 -143 -230 124 108 -326 128 114 -4 41 -37 -2 129 -160
2561a60J92R9l63K27J08k49k6l0j20M06n1j05Q0l5k02J20J19M3P6k38J82j69P1
$$ -160 32 131 -232 -5 103 -146 -172 -202 -322 84 33 -72 8 -27 -229 -109 10 53 129 -109 73 -96 -25
2584b5M7K4J29j77R4k48L84r1k04l8p8K09j99L49j20J88m10Q3J56K8j40J62k58
$$ -25 22 46 175 -2 92 -156 228 137 -67 -105 -183 26 -173 176 56 244 -166 -83 73 101 -39 123 -135
2607a35K22Rn14J58L44j4J34j77k1O8K17m23J14j27J81MJ79k88N5K74k67Oj81
$$ -135 87 96 -418 -260 84 70 204 27 6 74 291 -132 -18 -145 36 40 219 -69 -14 260 -7 -1 -182
2630a82K13K32j40M1J0k63J27Q2q8j26L67k68o1O3M5j69P2Q6l9r8q7K34j76J14
$$ -182 31 263 123 164 174 -89 38 120 32 -94 273 5 -56 7 52 -117 -45 41 2 -96 -183 51 -125 -11
2654a1J54j62N0L5jJ25j06l0j53K14k14j08J55J5j52J09J54j52j55L40j64k15
$$ -11 143 -19 31 66 65 190 84 54 -99 115 -99 -207 -52 -37 -189 -80 74 -78 -233 107 -57 -272
2676b72L49o1j02L4J52n38L53J29j84L9j09J65K88m9j31o5j62J99j19K06k05K03
$$ -272 77 16 -86 -52 100 -438 -85 44 -140 -101 -210 -45 243 194 63 -2 -164 35 -84 122 -83 120
2698A20l5k15K23j42Q3P3k02J53l3J39j45K9j06J38j10l15R0M8L04k33r1J34j37
$$ 120 85 -130 93 -49 34 107 -95 58 25 164 19 48 -58 80 -30 -345 -255 -207 97 -136 -227 -93 -230
2721b30J65rJ75j48L9r9L44j14j13K1J15k23P7j74L03j53l5J36k92Q9K42j99P6
$$ -230 -65 -74 101 -47 -8 -107 237 123 10 31 146 -77 0 -174 129 -24 -59 77 -215 -126 116 -83 -7
2744gJ56N1l17J64j16J1k17K37j34k5M39n84L76K19Mj47j6k75K18k3J92k45J98
$$ -7 149 200 -117 47 -69 -58 -275 -38 -172 -197 242 -342 34 253 257 110 94 -181 37 14 206 -39 159
2767A59j02j44q8O7J71j74K3K00j9j5k45R6L58k73k01J17p0K11k45K38p3JJ68
$$ 159 57 -87 -175 -108 63 -111 -88 112 93 78 -167 -71 287 14 -187 -70 -140 71 -174 64 -9 -8 160
2790A60j70j80J39K4N4J4q9K83k66L3j38k7L74l32J67K03l24M8q3L94j60j70J10
$$ 160 -10 -190 -51 -27 27 41 -48 235 -31 2 -136 -163 211 -121 46 249 -75 -27 -110 284 124 -46 64
2813F4R5l45j6K18J30J43l67j34Q5k10L74N5k21K29j28J18j0j40j33L52k64J13
$$ 64 159 -186 -202 16 146 289 -78 -212 -127 -337 37 92 -129 100 -28 90 80 -60 -193 159 -105 8
2835Hj74Q5J65q3K24j91j38L17k32q2K91j52p9L50m59K05j31k15J52KLK46j73
$$ 8 -166 -81 84 1 225 34 -104 213 -19 -101 190 38 -41 309 -150 55 -76 -291 -139 -137 -134 112 -61
2858f1L50m62N70l50j7o5k7kj90L72j16lM36j12k53l56L16j73J05j22L89j56k22
$$ -61 289 -173 397 47 30 -35 -62 -64 -254 118 2 -1 435 323 70 -286 30 -143 -38 -160 229 73 -149
2881a49K30k20L71lm45J87J53l52J55K46l18jK85k06o6K76J47l32q1J96J42n0
$$ -149 81 -139 232 229 -216 -29 124 -228 -73 173 -145 -146 139 -67 -133 143 290 -42 -123 73 215 165
2903A65q0O5j96K6K07o1k39JQ0LRj8K25l40p8O6j8M30l54R3q4N8q3K8K55k15j99
$$ 165 85 150 -46 -20 187 126 -113 -112 -32 -29 -20 -38 187 -153 -231 -165 -183 247 -107 -14 -98 -40 -123 -95 160 -55 -254
2930b54O2J01R5j83L78k49L19j73Q5k25K12J18k81L00M3j00m62L37j59K4j40R2
$$ -254 -192 -91 4 -179 199 -50 269 96 181 -44 168 286 5 305 348 248 -214 123 -36 -12 -152 -60
2952f0J32j20J14j18k31Q7J42LJ96k18K27n1r4j02J64k06Q7J19j63R3K1l24K56
$$ -60 72 -48 66 -52 -283 -196 -54 -51 145 -73 154 103 9 -93 71 -135 -48 71 -92 1 22 -302 -46
2975d6j46J67q8J79LL6k90M21k21N9J84j88k57J81Oq8L0K30l66Q9K2m9K90k62
$$ -46 -192 -25 -113 66 69 105 -185 236 15 74 258 70 -187 -6 0 -88 -58 172 -194 -105 -83 -132 158 -104
2999a04J89k22n1K74l4j0J00l74L79J19m36L02j36J20j74P2nJ8oP8J04j55l86
$$ -104 85 -137 -188 86 52 42 142 -232 147 266 -170 132 -4 116 -58 14 9 27 21 99 203 48 -338
3022c38L62M0k33J5K43k25J94r4J8K4P1j73J2l5Q0j12L9K91n1k94J17K47m51J51
$$ -338 24 64 -169 -154 89 -136 58 -36 -18 6 77 -96 -84 -119 -39 -151 -112 179 128 -166 -49 198 -253 -102
3046a02N1R5k76J43J23O2j11l1K52j88J2j99p5J78O0J57l32K52j75j03L06o3j42
$$ -102 -51 44 -232 -89 34 96 -15 -46 206 18 30 -169 -244 -66 -6 151 -181 71 -104 -207 99 36 -106
3069a06J83J66Q4m54J4k5L07j66j7O9p9j34R9N2j04k5J0m2pJ91K76k97J26j34
$$ -106 77 243 327 -127 -113 -138 169 3 -14 55 -24 -158 -59 -7 -111 -136 -126 -168 -175 16 292 -5 121 -13
3093a3m8r2J65J90Q5j37p2j66o7Q7J43k63n3L09j92R4jm4J50j43k35K66J16j20
$$ -13 -61 -153 12 202 287 150 78 -88 -155 -68 75 -188 -241 68 -124 -30 -31 -75 75 -68 -303 -37 79 -41
3117d1N6j65J08P1j47L3J06%J56k66K40k20k21M67l66L33j74K18m40J64L18l64
$$ -41 15 -150 -42 29 -118 -85 21 21 177 -89 151 -69 -290 177 -189 144 -30 188 -252 -88 230 -134
3139a34mM1k3K%M6j70J16R6k5l1j25J36j60J79K0M7R7j16q1j03R9J09K49k5q9
$$ -134 -138 -97 -120 -118 -118 -72 -242 -126 -30 -55 -86 -211 -75 -235 -56 -36 11 108 -8 -89 -192 -93 16 265 240 151
3165A51l41P3l2K12P2k2n5j4l2j91J76k9l64M74j39L1L7j64L13j03k55L18n9n1
$$ 151 -190 -117 -149 63 135 113 58 44 12 -179 -3 -32 -396 78 -61 -30 7 -157 156 53 -202 116 57 6
3189Fj29n0L18j23J01j82M9N8J96k50p6J01o2O1J95j47r8k13J88J4n3l0j17M90
$$ 6 -123 -173 145 22 123 -59 -10 48 244 -6 -82 19 -43 18 213 66 -32 -245 -57 -43 -96 -126 -243 247
3213B47l05l6J87k08K24r5rJ04k54J52K4j76L61l62O7K19k82K23L1o2p8J6R8k62
$$ 247 -58 -94 93 -115 109 14 5 109 -145 7 31 -145 216 -146 -79 140 -142 81 112 50 -28 -12 86 -176
3237a76K68m86L99n2J02q6K13k63l3J22J13j25k33j23J65K15J12j36k1p3n8l8
$$ -176 92 -394 5 -47 55 -31 182 -81 -114 8 121 -4 -237 -360 -195 20 132 -4 -25 -98 -156 -194
3259a94J59L8Q7O4K2j60N0k65K47n8L00l45J5o0p8Q8K77j41k93J08J18k8J72p4
$$ -194 -35 3 90 154 176 16 66 -199 48 -10 290 -55 -40 -100 -178 -90 187 46 -247 -139 -21 -49 123 49
3283D9L6J33m35J4J83o9J70l00J69L6k48M48l06K40l76L71j22j6q9K60J63n62
$$ 49 85 218 -217 -203 -20 -89 81 -219 -50 -14 -262 186 -120 120 -256 115 -7 -23 -112 148 311 -251
3305b51M30j01j44M36m84J36M9N4j02J47k0j91n9k6K76k01J68K14n09M44j30k32
$$ -251 179 78 -66 370 -114 22 71 125 23 170 150 -41 -100 -126 150 -51 117 331 -178 266 136 -96
3327i6J64l4K28l26J07j63J70k57M52k99k71K18K59k61j7l20L96K58m50K47O0
$$ -96 68 34 262 -64 43 -120 50 -207 245 -54 -325 -107 152 -109 -126 -446 -50 208 -242 5 65
3348F5M7l49M69m23N9J16k96J42L86P9k33r8q4K64J39k02o6j34N0K10j81m2J36
$$ 65 112 -237 232 -191 -132 -16 -312 -170 216 295 62 -36 -120 144 283 81 15 -119 -69 141 -40 -82 54
3371E4o8J55j92j28K31J00j21Q5j72J34q7N6j4N5K3K3O4j12j1j74M07j92k44j12
$$ 54 -14 141 -51 -179 52 152 31 116 -56 78 -9 47 33 88 111 134 198 86 75 -99 308 116 -128 -240
3395b40P6L28q9q8r4J30j5j60NJ8L22k73m0J87N1k3j56L79k05rL56m97R0LR5j43
$$ -240 -164 164 75 -13 -107 23 8 -152 -147 -129 193 -80 -120 67 118 95 -61 318 113 104 460 -37 53 56 151 8
3421Hj64p5K90N0j36M0l13K09J13L16m34J73O2p4J88j87Mj03J91j34o0N3l9p9
$$ 8 -156 -231 59 109 -27 13 -300 -91 22 338 -96 77 139 65 253 66 70 -33 158 24 -36 17 -22 -101
3445a01K86N4k06J91k19Q7j53k3j66J86L2mP0j4M2P4k38L79j83jQ9m21M09j55
$$ -101 185 239 33 224 5 92 -61 -84 -250 -64 -32 -36 34 20 62 136 -102 277 94 93 182 -239 170 15
3469A5O9j12NR1J1J38m79J91P6q3J56k44RJ48o6J22j26L22j55k64M31k88M2J77
$$ 15 84 -28 -23 68 79 217 -262 -71 5 -78 78 -166 -157 -9 -75 47 -79 243 88 -176 255 -33 9 186
3493A86r0q5k05L24k90N47k60j27N2j68J6O4O0j42K43L1k14P3l7k4N1l6J12%l30
$$ 186 96 11 -194 130 -160 387 127 0 52 -116 -100 -36 24 -118 125 156 -58 15 -22 -46 5 -31 81 81 -249
3518b49J49K49j5l7j81L3O6j96nJ18r4L32l38J84j37J01m6P0j44P5N3K1j19j10
$$ -249 -100 149 134 97 -84 -51 15 -181 -186 -68 -162 170 -168 16 -121 -20 -66 4 -140 -65 -12 9 -110 -220
3542b20J93J45j11Q2l4J14m61L22j32M9k34J06j07Q5L45l2K89l99P2k8j16P0j89
$$ -220 -27 118 7 89 55 169 -292 30 -102 -53 -287 -181 -288 -203 142 110 399 0 72 44 -72 -2 -191
3565a91j2K60m3Q0n10O38l94L79k51O7j05J2K3m1l23L66j4k56K14N3J05j01J00
$$ -191 -203 57 14 94 -416 222 -172 207 -44 23 -82 -70 -47 -88 -411 -45 -59 -315 -101 -48 57 -44 56
3588E6K9L4m96J10L26N9j68p7K93p4P1l83J73j07J06K0k0J10L31m23J21l0j50
$$ 56 85 119 -377 -267 59 118 -50 -127 166 92 163 -220 -47 -154 -48 -28 -48 62 393 -30 91 61 -89
3611h9J09j33J70Pl39L22N5J58j46k07M4m8O1j28J03L53k17m1L1j44L08k80K30
$$ -89 20 -113 57 64 -275 47 102 260 114 -93 -49 -97 -36 -164 -61 292 75 34 65 -79 229 -51 179
3634A79q2P7j56j40L7J22Q2q3m9j38M4R6j55J01l9J75k91L67j76n2j10K19N4j33
$$ 179 97 174 18 -122 -85 37 119 36 -13 -151 -107 -11 -166 -65 -104 71 -220 147 -29 -81 -191 28 82 -51
3658e1J52N6j50j43KJ07k67J69M4J83O7j38K43l15J75r3j27K37l33o8PL54J10
$$ -51 101 157 7 -136 -134 -27 -294 -125 -81 102 169 31 274 -41 134 41 -86 151 -182 -250 -243 111 221
3681B21m21J39L95l15M8j04L29n05n8J30L06k90K46j62J34M4n7j84J91p0p9P4
$$ 221 -200 -61 334 19 67 -37 292 -213 -271 -141 165 -125 121 -41 93 137 80 -104 87 17 -62 12
3703A2j61N84m80N8J16j33L41j83Q6J2k23K74j92j17j15M28k64n6O0j38r3lK4
$$ 12 -149 435 -45 13 129 -4 337 154 240 252 29 303 111 -6 -121 307 43 -13 47 -91 -184 -187 -163
3726a63J33N2Q3j92Q0K94j96mOl54J12k08M40j1J8Q2j90k30M20k31j9j27J07R3
$$ -163 -30 22 105 -87 -7 287 91 87 93 -261 -149 -357 83 72 90 172 -18 -248 172 -59 -78 -205 -98 -5
3750ek5Q9J5P8o4k56Q6r8K50n0j2p1J24N5M6l67K5K0M24J85o02J82o1J04Jj31
$$ -5 -30 59 74 152 88 -168 -82 -180 70 20 8 -63 61 116 162 -205 -180 -160 264 449 -153 29 -32 72 73 -58
3776e8J76j85J60j79pm2m3L8K59j43J44l51M00o5j63Q9J78l25M08k61j34O8KK01
$$ -58 118 -67 93 -86 -93 -135 -178 -140 119 -24 120 -231 169 104 -59 30 208 -117 291 30 -104 -36 -34 167
3800A67j15J89m41M1K84j63Rj40M61l59lJ74k06Q6J22j1j17R8J5k68L57m11O08
$$ 167 52 241 -200 -159 125 -38 -29 -169 292 -67 -70 104 -102 -16 106 95 -22 76 91 -177 180 -231 377
3823C77j40k01M4j83N4L1j53O3q9qJ30L63k15o6j09M2J89j70L8K99m50K0J29n3
$$ 377 237 36 80 -103 -49 -18 -171 -108 -197 -205 -75 288 73 7 -102 -60 129 -41 -3 296 -154 -134 -5 -58
3847e8j2J85l14L74K3l98J60r8k4L14ml59L77J2p8j82K52k71R3j0L17k35L7l6
$$ -58 -70 115 -199 175 198 -200 -40 -138 -162 152 148 -211 166 178 100 -82 170 -101 -8 -18 299 64 101 65
3871F5j66J64K86k87J02k65j30J57P8QL7j35j62M8O3L93k20J77j28q8j67J3K49
$$ 65 -101 63 349 62 164 -101 -231 -74 4 12 49 -86 -248 -200 -137 256 36 213 85 -3 -170 -157 92
3894I2j27R6J19j59Q9k33P0r3Q1O9k16J93k80L27j53N5L08m69K62N4J19k34j72
$$ 92 -35 61 180 21 110 -123 -53 -146 -65 4 -212 -19 -299 28 -125 -70 238 -231 31 85 204 -30 -202
3917b02J83qK11j98l2j34J00L11j45k8j23R4k57J71J9J67M5l35J88P6m8j60oK89
$$ -202 -19 -27 184 -14 -46 -180 -80 231 86 58 -65 29 -228 -57 -38 129 174 -161 27 103 55 -105 -111 178
3941A78m32M31m45K21L7J8Q6P8j50k32J79M0m0J34L3k37j37L62k11K22k36K24
$$ 178 -254 177 -268 -47 -10 8 94 172 22 -210 -31 9 -31 103 136 -101 -238 124 -87 135 -101 123
3963A23j38k30L20j12Q2R2k43Q3j21r3J47R7n5J12q7k25K67j69M32l67K3m8K78
$$ 123 -15 -245 75 -37 45 137 -106 -23 -144 -237 -90 7 -48 64 -23 -248 19 -150 282 -85 -62 -110 168
3986A68j95R4K4o8k37J42k03J47Q6K32j94k10Q0n3K36k30L66j76p6Q1Q3m0j56
$$ 168 -27 67 91 23 -214 -72 -275 -128 -42 190 -4 -214 -134 -187 49 -181 185 9 -67 14 97 57 -99
4009i9L11k32J12l8k76J19Q5Q4j17R3o8n6J65k06K76k88K17K6l55K61J33j23j8
$$ -99 212 -20 92 54 -222 -103 -18 66 -51 42 -26 -82 83 -123 153 -135 82 108 -247 14 147 24 6
4032Fo4jK0J82j81P0j87L0J81j27L4q6O8J58j32K89m4k81N39l43j75j93J32L18
$$ 6 -58 -59 -39 143 -38 32 -155 -125 56 -71 -37 -123 -55 103 -29 260 216 -65 474 131 -44 -237 -105 213
4056B13j53R5j50Lq0r0J22m8K0J25j03j15L56j71k14Q7j63L18j90K0J88Q0j96
$$ 213 60 155 5 8 -72 -162 -40 -88 -68 57 -46 -161 195 24 -190 -103 -266 52 -138 -118 70 150 -46
4079d6M56m22O4l19K46K2k2k7j44J64kJ24q7j46K9N06p07J03L14q9r7J83J0M4
$$ -46 410 -12 52 -267 -21 1 -21 -48 -192 -28 -30 94 7 -139 -110 396 -311 -208 106 17 -80 103 113 157
4103A57J05m52J95Lo3K24j78o9M0j49L3J04J12j65j94L80l69M42k80K65j89J25
$$ 157 262 -190 5 8 -55 169 -9 -78 -38 -187 -154 -50 62 -103 -297 83 -286 156 -124 141 -48 77
4125G7J13m22L18j28k2R8q5L9Q5n2K5J61m29J93j31J32J82kr1j39J65n6j65J66
$$ 77 190 -232 86 -42 -64 34 -51 -12 73 21 46 207 -222 -29 -160 -28 154 152 61 -78 87 31 -134 32
4149C2m0j31L45k60K28k23L02n43K95j63l1P1K46J50l95J39L04m33J09Q0j19j84
$$ 32 -8 -139 206 -54 174 -49 253 -290 5 -158 -189 -118 128 278 -117 22 326 -107 2 82 -37 -221
4171b21J7q5J12l0L49Rk11k0J38j69j5M7j9J66L54m84oK29l43R8k5J05K59l59
$$ -221 -204 -289 -177 -207 142 151 -60 -80 58 -111 -126 -79 -98 68 422 -62 -68 161 -182 -84 -109 -4 255 -104
4195a04M03l21J7kj8k84L14q8q4K40n02L52L39k77r4K11J02l37Q3O8k98M83k51
$$ -104 299 -22 -5 -7 -25 -309 5 -83 -167 73 -429 -77 262 -15 -109 102 204 -133 -50 18 -280 203 -48
4218d8n3K66k54R8J2j70M81m05P1k7%L5j26J69Oj9Q6N8k34n1N2j58J93k98M84
$$ -48 -101 165 -89 9 21 -149 332 -73 -2 -29 -29 6 -120 49 55 36 122 180 -54 -105 -53 -211 -18 -316 168
4243A68j52L5O0pP1j32k08m3L66j48P8L17n03pJ60m33L81J63l10j0L15j96K4K26
$$ 168 16 51 111 104 175 43 -165 -208 158 10 88 405 -98 -105 55 -378 3 166 -144 -154 161 -35 -11 215
4267B15n78L18k3M77n27J78N9k87K12q2K7M7Ok47M04m01k48M05J07Lj14pK3K53
$$ 215 -363 -45 -68 409 -118 60 119 -168 44 -38 -11 36 42 -205 199 -202 -450 -45 62 65 -49 -56 -33 220
4291B20m69L04K94k98J03l00M69k41J86j39m9n4qK41m89L22K4l74N00k81J71j08
$$ 220 -249 55 349 51 154 -146 323 82 268 129 80 26 18 259 -230 92 116 -258 242 -39 132 24
4313B4J09p8l61N13l21K06Q5LL9k54K24j32Q8K0k22J23k08J01J79l28L43k05n7
$$ 24 133 55 -306 207 -114 92 177 180 219 -35 189 57 145 165 -57 66 -142 -41 138 -190 153 -52 -109
4336a09M9o7j55K79r7J58J29o0l28%L79l57J21p7K10j34k37K01J07N0P8K25k62
$$ -109 -60 -127 -282 -3 -100 58 187 127 -201 -201 178 -179 -58 -135 75 -59 -296 -95 12 62 140 365 103
4359A03k63K42k24K82j32n9q9J45K33k36Q0j79K06k81L36j29l22K47K83l54jK24
$$ 103 -160 82 -142 140 8 -51 -140 5 238 2 82 -97 109 -172 164 35 -287 -40 243 -111 -112 112
4381A12l52J01L43k33l13N7K56n04P85j94k24J04j27M5J30K8j86J59J62j03j17
$$ 112 -240 -139 204 -29 -342 -285 -29 -533 252 58 -166 -62 -189 -144 -14 14 -172 -13 149 46 -71
4402g1o9p8J2l9M70q1%r1K0j18L01j18j90l7J79j60J43k7K06n17K42L8l18K77
$$ -71 -140 -218 -206 -245 225 144 144 53 73 -45 256 138 -52 -89 90 -70 73 46 252 -265 -23 15 -303 -26
4426b6p7L50l60J99N5j20j56K44L2r2j52M8J74o3j11m5L38j5k49l96L26K70M6
$$ -26 -103 247 -113 86 141 21 -135 109 141 49 -103 -55 119 56 -55 -100 238 223 -26 -422 -96 174 220
4449B20j73N6m35J96j55K51O6m32M31j37K03j79K50O5l77L35r7k57l1K46k5j72
$$ 220 47 103 -332 -136 -291 -40 26 -406 25 -112 91 -88 162 227 -150 185 88 -169 -200 46 21 -151
4471a51J83k04Q4K47l51J62R1j31M2J65J38l61j98K09R8j3m8q1L34k58QJ37k91
$$ -151 32 -172 -88 159 -192 -30 61 -70 -28 137 275 -86 -284 -75 23 10 -38 -119 215 -43 -35 102 -189
4494a89J70Q9j3J9j13J63j26O6L3q1l12M13O6k79J07j15j8j22L36k08K19m9j57
$$ -189 -19 70 57 76 -37 126 0 66 99 18 -294 119 185 -94 13 -102 -120 -242 94 -114 105 56 -101
4517a01k9K92k78k09L83l9j35R1k93L69P3kJ02l57J01K53l06P1J94k2j58k64K39
$$ -101 -130 162 -116 -325 58 19 -116 -25 -318 51 124 122 224 -133 -32 221 -85 -14 180 158 0 -264 -25
4540b5m3j0p9j5M8K08l43L36k12m4K6M5J98k42K02kn7J56p2J59j90q2r5K89m03
$$ -25 -68 -78 -157 -172 -124 84 -259 77 -135 -179 -153 -108 90 -152 50 48 -9 147 75 234 44 -38 -133 156 -247
4565b47O00m50K09j7q8J06j70P4k31K0J11K46r6j99q2L00L8L3l10K2K47O1k22
$$ -247 353 -97 112 95 7 113 -57 17 -214 -194 -83 163 67 -132 -214 86 124 157 -153 -131 116 177 -45
4588d5J73j78n7J94j05RJ25J15k37j89O6K61j46om0K93j49N9j1k06K80j58K09
$$ -45 128 -50 -107 87 -18 -9 116 231 -6 -195 -129 132 -14 -20 -60 233 84 143 132 -74 206 48 257
4611B57m56K86j77J3j25r0L12j43J08K70k84J84L4m56L03k18L07l20K07j33M3
$$ 257 -199 87 -90 -77 -202 -292 20 -123 -15 255 -29 155 189 -267 36 -182 125 -195 12 -121 -78
4632g8Q9P7n1o5K09j37l26N09k52mL1j57J1O3Q7J60L7l34K34j11J17k9K11k52
$$ -78 11 88 37 -28 181 44 -282 227 -25 -29 2 -155 -144 -81 6 166 203 -131 103 -8 109 80 291 39
4656C9K99n88N43o2p6K2j02J7j30L3m4K0p6j57M14k38O3L9J0n1Rj68K46n3R6k7
$$ 39 338 -250 293 231 155 177 75 92 -38 -5 -49 -29 -105 -262 152 -86 -23 16 26 -25 -16 -184 62 9 105 78
4682G8LL5l57M70j04k34J50k86L41k36J26p1K08j90J13k93K60k51N8k09K97L95
$$ 78 81 116 -241 229 125 -109 41 -245 96 -140 -14 -85 123 -67 46 -247 13 -238 -180 -389 -92 303
4704C03k41J8j59l6PJ68k11P0Q5k3j04J76l32J92J65j53j94L80j50K28kj49p3
$$ 303 62 80 -79 -115 -108 60 -151 -81 4 -19 -123 53 -279 -87 78 -75 -269 111 -39 189 187 38 -35
4727c5K00N0l89J9J9J32Q6l43N08k73j71J67K2J81Mj15K29j29j17J3lj83P2J15
$$ -35 165 215 -174 -155 -136 -4 82 -261 247 -26 -197 -30 -8 173 177 62 291 162 45 58 55 -128 -56 59
4751E9j96k6L14l8j69p6J35j77m0J2J29K85k48J93l14K31M3P1j58k6Q4j95P8J58
$$ 59 -137 -163 151 113 -56 -132 3 -174 -214 -202 -73 212 -36 157 -157 74 117 188 30 4 88 -107 -29 129
4775A29Q3q8J7j81K22k89k81N80k81k10L02r7K16l99J14J07l0P2k9r3K51j98J54
$$ 129 212 124 141 -40 182 -107 -388 192 -89 -299 3 -94 122 -277 -163 -56 -86 -14 -43 -136 115 -83 71
4798G1r3j85M35l78M7N1O7j47j75K13kL31k68R0j73K72k0l12J80j89L39J00j72
$$ 71 -22 -207 228 -150 -103 -52 15 -132 -307 -94 -96 235 -33 57 -116 156 136 -176 4 -185 154 254 82
4821H2M3k30J38j08K02k98K26J48l29K52j63O6K06k96J24l09J38L96p10K71K01
$$ 82 125 -105 33 -75 127 -171 55 203 -126 126 -37 29 235 -61 63 -246 -108 288 -422 -151 50
4842E0j41o2L24j26Q5n1J3o4j45L8R0m7J57l4l13K68L5R7l4k38P3O8L0p9r1l9
$$ 50 -91 -153 171 45 130 79 92 28 -117 -79 11 -36 121 87 -226 42 77 174 140 -98 -25 43 73 -6 -97 -136
4868a36N00m19j34K66mRj56oJ58j77L37j87O5k32k3l6J12K37j03j7l9LL41k71
$$ -136 364 -55 -189 77 73 82 -74 -80 78 -99 238 51 116 -116 -139 -175 -63 174 71 54 15 18 359 88
4892H8j32nK4Q7j73J10q2N2m9n3J16K5J07Nj13l4k90M91j12l13L28j36j01p5J39
$$ 88 -44 -49 -25 62 -111 -1 -83 -31 -80 -133 -17 8 115 120 7 -27 -317 174 62 -251 77 -59 -160 -235 -96
4917i6L55l20L8J55j07k43L11k49L87l00o9K26R4q9k87L45k58M3l28L45K3J61
$$ -96 259 -61 -23 132 25 -218 93 -156 231 -69 -138 88 182 93 -194 151 -107 -64 -392 -47 -24 137
4939A37k13J60j49j4K91l27j09M93l7n75K45K01nk81L56M1l3j87K95j32m50L37
$$ 137 -76 84 -65 -79 212 -115 -224 269 232 -343 -98 103 98 -183 173 214 181 -6 289 157 -293 44
4961D4O4J82m35l3Q6K43k63J18n7Q3j89jm1K49j70J21K32m66K13L5p3k8K51o3
$$ 44 108 290 -145 -178 -92 151 -112 6 -51 32 -157 -158 -199 50 -120 1 233 -233 -20 15 -58 -86 165 102
4985A02Q7j52k1p3J44j3k64J01j12M24K0o36L78J44j22j43K16OLk04O7j49J83
$$ 102 189 37 16 -57 87 74 -190 -89 -201 223 243 -393 -15 129 7 -136 80 86 89 -115 -48 -197 -14
5008a4J07l47J1K50j94J47K75m7k64J16n0q3q2L6L81n52L42N1M5J4j17K03k10
$$ -14 93 -254 -243 7 -187 -40 235 188 -76 40 -10 -93 -175 -139 242 -310 32 83 128 142 25 228 18
5031A8j49J8Q6J1j49K84k90K92p2k42J11N1j43L30k68L7J28K39k43l7l4p2P0J86
$$ 18 -131 -113 -27 -16 -165 119 -171 121 49 -193 -82 -31 -174 156 -112 -75 53 292 49 12 -22 -94 -24 162
5055A62j78pKJ39rJ5j58r4K96N9l81K48l33L08K6k12R3O1j13K27l15M70m91J71
$$ 162 -16 -23 -21 118 109 124 -34 -128 168 227 -154 94 -239 69 95 -117 -24 37 -76 151 -164 306 -185 -14
5079a4K30k8j57l19L12l14M71o9R7j22p8K8l6m27K93kN8l8J32K0M5p9K12l51J1
$$ -14 216 188 31 -288 24 -290 181 112 209 87 9 37 1 -426 -133 -135 -77 -115 17 37 82 3 215 -136 -125
5104a25j2K51o1M0n1qK49m3j55O1k30n2M26l49O8J72l98M93m97K07J38j92j29
$$ -125 -137 114 53 93 42 34 283 240 85 146 -84 -136 290 -59 9 181 -217 276 -221 -14 124 -68 -197
5127a97J22j34Q1N5K91j68j7j07J38Qrj77j02J82k47L91k01J36l63K76m0j31K70
$$ -197 -75 -209 -128 -73 218 50 33 -74 64 72 63 -114 -216 -34 -281 110 -91 45 -318 -42 -82 -213 57
5150E7L14n90K55J42k10Nm1L07k08m23M61k7J45K2m95j7L20r9n8L75m36O8J18
$$ 57 371 -219 36 178 -32 -27 -68 239 31 -392 69 42 187 209 -286 -303 17 -82 -140 235 -201 -133 -15
5173a5k58O9K28N6n1J11j79oK29k25O6j67J5K72p1j44J03N0j09J80p1p1j3j72
$$ -15 -273 -204 24 80 29 140 -39 -45 184 -41 25 -142 -127 145 74 -70 33 83 -26 154 83 12 -1 -173
5197a73L88p1J7l51J89K7l5J23j48k53N17l97r7K09K19k20lk1k26L01k66L98K6
$$ -173 215 144 161 -190 -1 26 -9 114 -34 -287 230 -167 -264 -55 164 -56 -59 -80 -306 -5 -271 127 153
5220A53j63q9N8j57M27r2n3l5l7K5Oq5J84r1m3M1J11j31J94l78P1J67j84o7K29
$$ 153 -10 -99 -41 -198 229 137 84 49 12 37 43 -42 142 51 8 49 160 29 223 -155 -84 83 -101 -168 61
5245F1o2K62k15j2k73K78j4Q1j30O9k23J96K02k89j64J81j88L10J21l25K55l79
$$ 61 -1 261 46 34 -239 39 25 106 -24 45 -178 18 220 -69 -233 -52 -240 70 191 -134 121 -258
5267b58J65j9K52l11K84J36k96K7k91K77J67J11j93k7M4k4J53Kl8k1j26k4o0J04
$$ -258 -93 -112 140 -171 113 249 -47 -20 -311 -34 133 244 51 24 68 44 197 199 161 140 14 -10 -70 34
5291C4j31Q9L15j72J3n5J03K6k81l15J85J89L2l20J48J05K0p2k2M8j22r3M09K13
$$ 34 -97 -8 307 135 148 93 196 222 -59 -374 -189 0 32 -288 -140 -35 -15 -87 -109 -61 -183 -276 133 346
5315C46m44J65L1k27N6J16J09k39P7J26J5r9k1J51q1K1J9k56K94k70k9K74l57
$$ 346 -98 67 98 -129 -73 43 152 -87 -10 116 131 32 11 162 81 102 121 -135 159 -111 -140 134 -223
5338b23K63j21R9J61R1j96r9K23j87k96J76K85n44K05K70p9k23K05j66K59k71
$$ -223 40 -81 18 179 270 74 -25 198 11 -285 -109 176 -368 -163 107 28 -195 10 -156 103 -168
5359a68P7J54O3l33L35l23P8L22L8k12J81k9k81m3M0J55k71L00p1J84j31q0j43
$$ -168 -91 63 126 -207 128 -195 -117 205 243 31 212 183 -98 -141 -101 54 -217 83 12 196 65 -15 -158
5382a58j12J73L77l97L5O3J35J7j52N6j06L86l94j24L08j72K60l05K98k97J50
$$ -158 -270 -97 280 -117 -82 -19 116 133 -19 37 -69 317 -77 -201 107 -65 195 -110 188 -109 41
5403D1L9l04M05j83r6k53L50K2j25r5K41n0q8K77l21L91p3k73M0qJ53n2Jn1n0
$$ 41 80 -224 181 -2 -98 -351 -1 21 -104 -199 42 -8 -96 181 -140 251 178 -95 -55 -63 90 38 39 -12 -62
5428f2%L4p2J69k1p3J96l39K93k63M8KJ80J52j54j94K08k49J20l9K5K03k42k06
$$ -62 -62 -28 -100 69 48 -25 171 -168 125 -138 -90 -88 92 244 90 -104 104 -145 -25 -64 -39 164 -78 -284
5452b84J61K18k11o7NK11R3k6k13J16R0j78L04j69l53M05k84L13k10j4J81P7k82
$$ -284 -123 95 -116 -183 -178 33 126 100 -113 3 93 -85 219 50 -303 102 -182 131 -79 -93 88 165 -117
5475a17K2J55m5J6p0J53Mo5j14N9P9j53Q3m23O69k78L11k46oQ3k33L32%j45k69
$$ -117 -95 60 15 31 -39 114 118 53 -61 -2 77 -76 7 -416 253 -25 286 40 34 117 -116 216 216 71 -198
5500a98L88j7p3j53N5n0J69j15j81K1K47j39J14R3j90p2K32o8j86N6P3j0K10l21
$$ -198 190 173 100 -53 2 -48 121 6 -175 -154 93 -46 68 161 -29 -101 131 63 -123 -67 6 -4 206 -115
5524a15j50K78J61j58n9J21k14J85R7j64N7r9J28J3j44p3J72O2j45K15j88n5J02
$$ -115 -265 13 174 16 -43 78 -136 49 146 -18 39 -60 68 81 -63 -136 36 98 -47 168 -20 -75 27
5547B7n7k09K88m3J7j2q1P5J82j73o7l00L47K38k26K83k88J8n2J08j98Jl70L33
$$ 27 -30 -239 49 6 23 11 -70 5 187 14 -53 -353 -6 232 6 289 1 19 -33 75 -123 -122 -492 -159
5571a59J28R5J84l26j59L68Om8j57K5J96l42O0K17j63QJ83K0l3O0k75j74K60j00
$$ -159 -31 64 248 -78 -237 131 137 89 -68 -43 153 -189 -129 88 -75 -67 116 136 103 163 -112 -286 -26 -126
5595a26J58J4k3k81K33N2J31j30j38J46K85j99j30k64L29j5j53K53k40J27n7K28
$$ -126 32 46 23 -258 -25 27 158 28 -110 36 321 122 -8 -272 57 42 -111 142 -98 29 -28 200
5617B00k22j35k4K45k24K15j54J02l8J57j14j26J58p5j42L32l41j34M32j65j17
$$ 200 -22 -157 -181 64 -160 55 -99 3 -35 122 8 -118 40 -35 -177 155 -186 -320 112 -53 -170
5638a70J71J15N5J51J2m87k3j27L78kJ61q7j62K16k38j9J08l05K81k81K75n6J33
$$ -170 1 116 171 322 334 -153 -176 -303 75 73 234 147 -15 201 -37 -56 52 -253 28 -253 22 -34 99
5661I9M5j56j09K01j31R7k50L00m39K33JK88j78k40J6O1Q7nK40r7j0j45p0j14
$$ 99 144 -12 -121 80 -51 46 -204 96 -343 -110 -109 179 1 -239 -223 -162 -75 -80 160 63 53 -92 -162 -276
5685b76L12J05j77K35k77j9J82k80K78l10K85n3j75K90K29l40j42Q9J16j72l4
$$ -276 36 141 -36 199 -78 -97 85 -195 83 -227 58 5 -170 120 349 9 -133 -44 72 -100 -134
5706a34L4L1k0J08j73P7P2k5q7l1K33j97R0lr5L24k57M55l18n9k5J99j41L2j47
$$ -134 -100 -69 -89 19 -154 -77 -5 -30 -117 -148 85 -112 -22 -25 -120 204 -53 402 84 25 0 199 58 90 -57
5731e7m6O4J57k15n4M25j95J6Q8k73p2K46j9o1MJ69K2j30J39j34j76P2j50L32
$$ -57 -103 -39 118 -97 -151 274 79 95 183 -90 -162 84 65 4 8 177 199 69 208 74 -102 -30 -180 152
5755A52q3K66m41m4J47J17j4j16P9J4k10K07j41r1K47j34J11j08K51k15lk39K53
$$ 152 69 335 -106 -150 -3 114 100 -16 63 77 -133 74 -67 -158 89 -45 66 -42 209 -6 -9 -248 5
5778EO3rJ46m82M48j2k5q3l34J60K09j4L4k43K61n3J74k95J24j90m0J84P4j08
$$ 5 68 59 205 -277 171 159 134 51 -283 -123 86 72 106 -137 124 71 245 -50 74 -116 -156 28 102 -6
5802fm1J06j65j08J23K62R6k45j69O9J07K22j41q7J27j30Ok9MR8l00K12R5k44
$$ -6 -47 59 -106 -214 -91 171 267 22 -147 -78 29 251 110 23 150 20 26 -3 1 99 -201 11 106 -138
5826a38k40L23J48J65k15k6j84J80m1j0J81J08l81nl9L75l75L17q1k74O00o29
$$ -138 -378 -55 93 258 43 17 -167 13 -28 -38 143 251 -130 -135 -174 201 -174 143 62 -212 388 -241
5848b41QJ54J3O7l34N02K28m82Lm2L88m3l68K40k02J12J7K02l29K08k42OK89k80
$$ -241 -233 -79 -66 1 -333 169 397 -85 -82 -124 264 221 -147 93 -109 3 20 222 -107 101 -141 -135 154 -126
5872a26J50l0J12l22K86nl1q8M8J32j44J93k82J28m9K28k95J24N9j3q9k52N06
$$ -126 24 -6 106 -216 70 65 34 -54 -6 126 -18 175 -107 21 -28 200 -95 29 88 75 -14 -266 240
5895B40l70K22L1O4j28l7L83j51L3k60JO4j66J13j52J40K51l1j23k0q7k7J88j67
$$ 240 -130 92 123 187 59 22 405 254 287 27 28 92 -74 39 -113 27 278 247 124 104 17 -10 178 11
5919A1j04Q8N2j93J42J93k80M2j32M62l13J80k0j48J93j50J13j44l07J02J70K60
$$ 11 -93 -5 47 -146 -4 189 -91 -49 -181 281 -32 148 128 -20 173 23 136 -8 -315 -213 -43 217
5941B17k23J79J05j12j38J51j91J50l17K69l27L71l88L98l50L43k80J32j56K55
$$ 217 -6 173 278 166 28 179 -12 138 -179 90 -237 134 -254 144 -206 137 -143 -11 -167 88
5961H8m63M88k40RJ59k25m6K29Q5j51j98J29O8J65j71J3L11j20J79m47K06j50
$$ 88 -375 113 -127 -118 41 -184 -230 -1 84 -67 -265 -136 -68 97 -74 -61 250 130 309 -138 68 -82
5983h2O7JL5P3p2j28J41J09o0j37j24j4J35q7K48K6k17J03J50R5p5k11J06l7R7
$$ -82 -15 -14 21 94 22 -106 35 144 84 -53 -177 -191 -56 -143 105 131 -86 17 167 262 187 -24 82 45 142
6008A42k32R7L57n67J94L4k95J95j13O3J26j26J64N6n6j64Q1J1m3j18K79k38K29
$$ 142 -90 7 364 -203 -9 25 -270 -75 -188 -125 1 -125 39 95 39 -125 -44 -33 -76 -194 85 -153 76
6031G6K15l94M3k20M63l22J13j32N34m51R6Q7j11n0M50n49K0K05k7j27k0K09Q9
$$ 76 291 -103 -60 -280 183 -139 -26 -158 376 -75 21 108 -3 -53 397 -152 -132 73 46 -81 -101 108 197
6054A97j01K9k07p1L44k65L90m41J07oJ49O3j80j74J73j68O3K26J88J3k63m1K33
$$ 197 96 125 -82 -153 191 -74 316 -125 -18 -24 125 188 8 -166 7 -161 -98 128 316 329 66 25 258
6077B58j82k24P0K22k19K12K3l37pN9J11j15j75R4L74j4l02L06N5m09q2K15K8
$$ 258 76 -148 -78 144 -75 137 160 -177 -184 -125 -14 -129 -304 -210 164 150 -152 154 209 -200 -282 -67 -39
6100c9l5N6L1L7k75M50l28P2j73j42K29q1J28J09j71N8nL2R0K94k49n45M06R1
$$ -39 -74 -18 13 50 -225 225 -103 -31 -204 -346 -117 -198 -70 39 -132 -74 -79 -47 43 337 88 -457 -51 40
6124D0j82OJ52j75K03K3j37Q4J59j93l16K87L09k93j41J46J11Ql3j7p5L82m37
$$ 40 -142 -136 16 -159 44 67 -70 14 173 -20 -336 -49 260 -33 -174 -28 83 91 58 41 -34 348 -89
6147h9L1R9k00K25n0p0k24J11K20K1j61j01k7J11J46J46k97o9J72K01k19L17k5
$$ -89 -58 41 -159 66 16 -54 -278 -167 53 74 -87 -188 -215 -104 42 188 -109 -178 -6 195 -24 293 268
6170B68M9k72l63M54n6l12L59l20Q6j1L4K64k57K27j95K8r8JJ74p5N3R2j65J08
$$ 268 317 45 -318 136 80 -232 127 -193 -107 -118 -84 180 -77 150 -45 -17 -115 -114 60 -15 38 130 -35 73
6194G3l2k07L13L13k95l9q3N7l78M78j30k48L96j63j21K33j05l7J9j96l2N3J07
$$ 73 41 -166 147 460 165 126 43 100 -278 200 70 -178 218 55 -66 167 62 25 44 -152 -184 -131 -24
6217b4J49j25k94L31m3K2k9l7O09m40j37J9n1N2p0N2L8J61m01K03Kj11K88j63
$$ -24 125 0 -294 37 -6 16 -13 -50 559 119 -18 1 -50 2 -68 -16 22 183 -218 -15 -13 -124 164 1
6241AQ7K0K2r6J94m57O4J09O2J6l3J24k04K08l55M07K42n10K51k85K08j33L34
$$ 1 88 108 130 34 228 -229 -165 -56 6 22 -11 113 -91 117 -238 169 411 -99 152 -133 75 -58 276
6264B76j67k57J44L21m15M5K39m9j8k1J6Q6j74K1J13P0j76j75J25Q6n0K84p2k74
$$ 276 109 -148 -4 317 -98 -53 186 137 119 98 114 200 26 47 160 230 54 -121 4 90 40 324 252 -22
6288b2K31j54J02j53q2L1K65j46m9J62K13l29J33k96J40m6j91M48k65J1j14N9
$$ -22 209 55 157 4 -78 -47 218 72 23 185 398 69 202 -94 46 0 -191 257 -8 3 -111 -52
6310e2J77K0l64K75r5J50k05J99N4Q6k43J3R4j65o0K73P9m84K23J7J19k66J46
$$ -52 125 145 -219 56 -39 111 -94 105 159 245 2 15 109 -56 -116 157 236 -248 -25 -8 111 -155 -9
6333ik35K99m5N6J19j9j70L9N0j46K56j12lK77k01q2j18Q0J61l46K46j44J50J23
$$ -9 -244 55 10 66 185 166 -4 35 85 -61 195 83 80 357 156 74 -44 36 197 -149 97 -47 103 226
6357B26q7J67k83j49Q6j04J24K90r3m7r1J35m97J63k2L96m16L52k26k99K50j9
$$ 226 139 306 23 -126 -40 -144 -20 270 177 130 39 174 -323 -160 -182 214 -202 150 -76 -375 -125 -144
6379a44R6J13r5k1J82m24L47k03J96R6m38J50J22q4J47o9M5n5J55j61K78m10K80
$$ -144 -48 65 -30 -51 131 -293 54 -149 47 143 -295 -145 -23 -107 40 -29 16 -39 116 -45 233 -177 103
6402A03L0l27L19K4l96M48L5m53J91Q7K07k05J48r0k15L63l74L26R3j80k87p7
$$ 103 133 -194 125 149 -247 201 236 -217 -26 61 268 63 211 121 -94 269 -105 221 314 134 -153 -230
6424b30K58J66J00l44P8m3J50l6j03k77K77m0M6L03j73k26l23K39O4N5J08j33
$$ -230 28 194 294 -50 28 -15 135 99 -4 -281 -4 -44 2 305 132 -94 -417 -178 -114 -59 49 -84
6446h4R8r6j20L15l2j89j22N8j22L0L84P2K4r2m6j17J46l15k0N53k43j4pj83R
$$ -84 14 -82 -202 113 81 -108 -230 -172 -294 -264 120 192 216 124 78 -39 107 -208 -228 325 82 68 61 -122 -113
6471a13J40M3j73P9K76l73J45K14l5j46l61M20p5q9l0L85l31J05N0j71J10j50
$$ -113 27 70 -103 -24 252 -121 24 238 203 57 -304 116 41 -48 -78 307 -24 81 131 -40 70 -80
6493h0M0k00L70r5m2j86K09j0p3K08l47L18r4K8pJ09k17J57k18r4J64n4K77l62
$$ -80 -40 -240 130 35 -7 -193 16 6 -67 141 -206 112 18 46 39 148 -69 88 -130 -224 -60 -114 163 -199
6517a99J84J31j03R6o7K12m44L14j21k71P6P6J15j83J77J54j98m4J87M4o9P8j61
$$ -199 -15 116 13 109 42 254 -190 124 3 -268 -192 -116 -1 -184 -7 147 -51 -95 92 136 67 145 -16
6540a6M4J5l11j46J51N91n32M14j80r5j23K40r6R9m7o8R0J34j37j43Qj38M49k53
$$ -16 28 43 -268 -414 -263 328 -204 210 30 -65 -188 52 -44 55 8 -60 30 164 27 -116 -108 -246 203 -50
6564e0O7j00l0OJ9J5K2K8j44j01N11j74j63N11n03R3k53Q5M68l64j48L13k96L1
$$ -50 17 -83 -113 -107 -88 -73 -51 -23 -167 -268 243 69 -94 417 -86 7 -246 -161 307 -57 -205 108 -188 -157
6588a57L4M34l37k18J49j2l3J65n2J00k06L8m5J53j2j68L32N8j71J49j87o4J26
$$ -157 -123 311 -26 -244 -95 -107 -140 25 -27 73 -133 -95 -140 13 1 -167 165 223 52 201 14 -50 76
6611G6j70J18o7j25R4j6R7K53j66J22k99K19k71J32K05m75L72PJ59m42K38k14
$$ 76 -94 24 -43 -168 -74 -90 7 260 94 216 -83 136 -135 -3 202 -273 99 106 265 -177 61 -153
6633a53K20P9j41j34j44L51l35J48J53K41l13J04j19r6j66L48K9j86J87j52K69
$$ -153 67 146 5 -129 -273 78 -257 -109 44 285 -28 76 -43 -139 -305 43 72 -114 73 -79 190
6654A90k87r1L37n7j53j14J49J00j35J84J6N4j94j68L94j28k14J82Jn0M3l31J27
$$ 190 -97 -188 149 92 -61 -175 -26 74 -61 123 139 193 -1 -169 225 97 -117 65 66 16 59 -272 -145
6677a45K4k1J32q0k35K07L03j91KL6O6m08K23J72k43J20m7K40j74K4K41j46K00
$$ -145 -121 -142 -10 -90 -325 -118 185 -6 -4 32 98 -310 -87 85 -158 -38 -85 155 -19 5 246 100 300
6700C00j56j48J66l46J33K13k8j44J4Q3j7n2k59N46l67K67k29p3O5l71L62l3J34
$$ 300 144 -4 162 -184 -51 162 134 -10 4 87 70 18 -241 305 -62 205 -24 -97 -32 -403 -41 -74 60
6723F0l7m00K97n3J28J55j16o9p8L1K26j43R8P5j88J48l8k2Q3l36K19l1j42K03
$$ 60 23 -377 -80 -133 -5 150 34 -35 -113 -82 144 1 99 174 -14 134 96 74 157 -179 40 9 -133 70
6747G0J11j40J4Jj67l4M0J77j70J20q9K22k40K07J1p2k78J39j06R9K92k17J6R1
$$ 70 181 41 55 56 -111 -145 -105 72 -98 22 -67 155 -85 122 133 61 -217 -78 -184 -85 207 -10 6 97
6771I7j29Q7j27J12M1M4j34j10L01m1q3JR6j59O0l9k06Q0M9n2L29j09l13J31L57
$$ 97 -32 55 -72 40 81 125 -9 -119 182 141 58 59 155 -4 56 17 -189 -109 -60 -112 217 108 -205 -74 283
6796B83j92N7j50lo7J7L53m88J51Ko1LJ35n5L7N7K8j5k82%J09P1rqK38m34K61
$$ 283 91 148 -2 -5 -72 -55 298 -190 -39 -37 -98 -95 40 -15 22 79 107 92 -190 -190 -81 -10 -19 -27 211 -223 38
6823C8n9l08K67j08K46N0k81J9K11OO9l04K46O6m18J31P9n2j17J46r6K99l9p7
$$ 38 -21 -329 -62 -170 76 126 -155 -136 75 81 150 -154 92 158 -260 -129 -50 -102 -219 -73 -169 130 91 14
6847A4jj30M8J55j28J47L6K8k27r0J8J10K69l74J36j59L1O5J79l16J51K26l32
$$ 14 13 -117 -69 86 -42 105 141 169 -58 -148 -130 -20 249 -125 11 -148 -117 -52 127 -189 -38 188 -144
6870a44m4K01j73O0L7N2k5P0M6J08p0k64O77n83J17K56m50JL93l86J28k8l35N15
$$ -144 -188 13 -160 -100 -63 -11 -36 34 80 188 118 -146 531 -52 65 321 -129 -128 265 -121 7 -21 -356 159
6894A59k33k71J08J7N8Q9J90k94K38j98L41p6j89n2N2mR4J96k79M3k73K62L7J00
$$ 159 -74 -345 -237 -220 -162 -73 117 -177 61 -137 204 128 -61 -113 -61 -65 29 225 -54 -11 -284 -22 15 115
6918A15k58J54jK04m03K53o2J1o1J4nl1L68k82J80k36Q8j81K43m35L46J99N3m30
$$ 115 -143 11 10 214 -189 64 2 13 -48 -34 -39 -70 298 16 196 -40 48 -133 110 -325 21 220 273 -157
6942a57L15j60k13J39J48pJ11k22M8L1J01j17m2R5j73M7J2j46M4L2L37l43M4K56
$$ -157 158 -2 -215 -76 72 65 176 -46 2 33 134 17 -25 70 -103 -56 -44 -190 -146 -114 223 -120 -76 180
6966A80k04J38l50l5L57q8M0j39r0K54m8R3p7k52R0M4j03N56l82l18M87j32l35
$$ 180 -24 114 -236 -271 86 -2 38 -101 -191 63 15 108 31 -221 -131 -87 -190 366 -16 -334 153 21 -314
6989c14K12J6L21j87m1j81J89P3k49N8J36j26O2O2p1P5n81M73k5m7J00m6K37j65
$$ -314 -102 -86 235 48 7 -174 15 88 -161 -103 33 -93 -31 31 -40 35 -546 -73 -98 -145 -45 -91 146 -19
7013a9J05j42l7J37J7l43J50K4k27K10j2L84j82R1l5k77J44K48j35j1l12O71o20
$$ -19 86 -56 -93 44 61 -282 -132 -108 -335 -125 -137 247 65 156 121 -156 -12 236 101 90 -222 449 -171
7036a71m3M83l36L14k27l04L08M7k09K62j15j30K51r4m5j8M5j35k3K16j78J66
$$ -171 -214 269 -67 247 20 -284 24 71 -138 124 9 -121 130 36 -9 -27 18 -117 -140 76 -102 64
7058F4k4j57J56K54m78J12j28r4L46M2J9k60K14l58K46j57L30j05R3J77k58j01
$$ 64 40 -117 39 293 -185 -73 -201 -295 51 93 112 -148 66 -292 -46 -203 127 22 115 292 34 -67
7080f7P1J18j08M5j79J93j37K21j03m6K25k29r6j31J51J12k71L09N7k76R0m0n
$$ -67 4 122 14 59 -120 73 -64 157 54 8 233 4 -92 -223 -72 40 -231 78 135 -141 -51 -91 -96
7103i6K94k67L03j72p1N1l49K41M7J05l3j3j85J84k3J10N7j0J3r0l23K85r1j6
$$ -96 198 -69 234 62 -9 42 -307 -66 -19 86 53 40 -145 39 16 126 183 173 186 96 -227 58 -33 -49
7127d9J81k8R4k56K07j52J29j81L07l14K83k00N2l9o9J22j88J94Ll37L13k73N8
$$ -49 132 104 198 -58 149 -3 126 -55 252 -62 221 21 73 34 -35 87 -101 93 96 -241 72 -201 -143
7150a43J68jm0J14O8l15J97j21j91L25m3Q7k65J51K8o5pJ9J09J30l6k18Q3L15
$$ -143 25 24 -16 98 166 -149 48 -73 -264 61 18 105 -160 -9 19 -46 -53 -34 75 205 169 -49 34 349
7174C49l15J0j48K53r5j22l6J85k23K43l00P9M04k75k48J85J52K1j41J95j11o9
$$ 349 34 44 -104 149 54 -68 -104 81 -142 101 -199 -120 284 9 -239 -54 98 119 -22 173 62 -7
7196gQ0R6l47K42j12k50M51j95J17J77l10N4j13K92m30L98p1J8j82L6rj8L26l59
$$ -7 73 169 -178 64 -48 -298 153 -42 75 252 -58 -4 -117 175 -255 143 72 90 -92 -56 -65 -83 243 -116
7220a16K38j01L7j52K70l03r1Q8m3K43K00j66J75k27Q0q3O7j10o6P1R2j87J66
$$ -116 122 21 58 -94 176 -127 -218 -130 -173 70 270 104 279 52 132 49 116 6 -60 11 103 -84 82
7243H2j15Q5j18J41J08k36N02o26Q1P3Lk60K76K17p3l52J35Qj02J65N4k09L97
$$ 82 -33 52 -66 75 183 -53 449 -177 -96 -23 -20 -280 -4 213 140 -212 -77 -69 -171 -6 48 -161 236
7266B36k93J27j80K92l41n5P5mJ81j74J17J93n3j28k8P6R5k89K39j98J49j45J53
$$ 236 -57 70 -110 182 -159 -214 -139 -143 38 -136 -19 174 121 -7 -35 41 136 -153 86 -112 37 -108 45
7289D5k28J34O4j24J1J72n1l4o0Q8L40k25J0j83J26k14J09p1n8K48j0k27m7K03
$$ 45 -183 -49 15 -109 -98 74 23 -11 -71 17 357 132 142 -41 85 -129 -20 -91 -149 99 89 -138 -185 18
7313A8Q2l61L00j42m4M26k61J19N3o3j82o3M1J12Lk4j28R4k86J32L50l9l68j0
$$ 18 100 -261 39 -103 -147 279 18 137 190 127 -55 -118 -77 35 38 14 -114 -20 -306 -174 176 137 -231 -241
7337b41J60L26k87K3k98J87k2J93J53k80K40k75L0P1j02m7K12k81K72J26M2k11
$$ -241 -81 245 -42 -19 -317 -130 -152 41 194 -86 154 -121 -91 -20 -122 -169 43 -238 34 160 202 -9
7359ip4j5J83j05J74P1l36J88j22K1N79o91K61N7k49L18j20p3L3R2l72N18n97
$$ -9 -83 -98 85 -20 154 225 -111 77 -45 -24 555 -136 125 182 -67 251 131 58 91 183 -189 329 -268
7382b68K63J00k75K15j78L27l43J75ml1P8p4N3j67R2j04J01k42K88J44j23r8k57
$$ -268 -5 95 -180 35 -143 184 -159 16 12 -19 59 -15 38 -129 -37 -141 -40 -282 6 150 27 -71 -328
7405c28K71r9J95K15l59K59J48l08J56l00K7Q5J94k22M0l3J08k59M0L51j91o0
$$ -328 -57 -156 39 254 -105 154 302 -6 150 -150 -123 -38 156 -66 -26 -59 49 -210 -170 181 -10 -70
7427g0Q7j17J29J26k67L4p9K10r0J07K1l3o4P0N8k8J44l25J76k91O8L44l62K9
$$ -70 17 -100 29 155 -112 -78 -157 53 -37 70 91 58 -6 64 122 94 238 -87 89 -202 -134 210 -152 -123
7451a23L31j7m27J85N0K6J40k82q0J8K01m2r2O4N4j43K05k9J14j42k16k02N84
$$ -123 208 191 -236 -51 -1 25 165 -117 -197 -179 22 -20 -112 -48 6 -137 68 39 153 11 -205 -407 177
7474A77l21J37l5J49k99r9L32K17m5qq3j05k26J89r1J46K91n74K36R7j32r4kJ63
$$ 177 -144 -7 -42 107 -192 -291 41 258 213 205 122 17 -209 -20 -111 35 326 -248 -12 85 -47 -141 -143 20
7498B0J87r1K05m96J04k77M84L4l66K54j68O7O7J97k59nJ33O6J93j20l64O1q7
$$ 20 207 116 321 -175 -71 -348 136 170 -196 58 -110 -43 24 221 -38 -43 90 156 349 229 -135 -74 -161
7521a61K79J20J11n74J38M4L34k53l81N08m01L88j98o2K63o6l73J66K34M0l35
$$ -161 118 238 349 -225 -87 -43 291 38 -343 165 -236 152 -46 -108 155 89 -284 -118 116 156 -179
7542a79J34k0k78M67k61R7K43j76m9L9j77K64R9l10Q9K03l40M33k55q3R7j05N0
$$ -179 -45 -65 -343 124 -137 -40 203 27 -22 17 -160 104 203 -107 -18 185 -155 278 23 -60 37 -68 -18
7565a8r2M67m72O9K68j47j69M1J56o8j20j32L10r8L3k90L10j80L17J5j49K4l9
$$ -18 -110 357 -115 -46 222 75 -94 -53 103 35 -85 -217 93 -5 28 -262 48 -132 185 200 51 75 36
7588C6j63M40j99l34K03J10k45k3N0J13M7N6J45O1l07j33j3J42L35q9k59n6O0
$$ 36 -127 313 114 -220 -17 93 -152 -175 -125 -12 35 91 236 297 -10 -143 -156 -14 321 232 -27 -83 -23
7611b3j57O1J49J20k11J72j57j97J42L3J17J87j94J64j30o2j7L1J80j29j88lJ76
$$ -23 -180 -119 30 150 -61 111 -46 -243 -101 -68 49 236 42 206 76 14 -3 28 208 79 -109 -112 64
7634F4mJ55j42k65L60j89P9j70P9K49k14lj1L0j09J05OJ03l38P1K07K3j13j24
$$ 64 60 215 73 -192 168 -21 58 -112 -33 216 2 -1 -12 18 -91 14 20 123 -215 -144 63 86 -27 -151
7658a51J64J12j54m7J22k0L5j56K94k65M3J38j77k01P8J16J42j19N6K53k18j12
$$ -151 13 125 -29 -76 46 26 61 -95 199 -66 -23 115 -62 -263 -185 -69 73 -46 10 263 45 -67
7680f7J23j54K52k58kq7J10L41n31M82j56j92K81M5J00n8j35m30L95L3m00R3K47
$$ -67 56 -98 154 -104 -106 -193 -83 258 -273 209 53 -139 142 187 287 229 94 -336 59 92 -308 -215 32
7703C2J9j09J07%K1K6l33J61K00k0m3J33k17M7l0j42J83M0j30j1j27K13k18K82
$$ 32 51 -58 49 49 70 96 -237 -76 124 104 61 194 -23 24 -6 -148 35 75 -55 -66 -193 20 -198 84
7727H4R3pj78K74l96J87k99R4J09J4j42p4J75j11L91J52k90m3j6J33j57P4k21
$$ 84 177 170 -8 266 -130 57 -242 -148 -39 -25 -167 -241 -66 -177 214 366 76 33 17 150 -7 67 -154
7750a54K35J13j15J43j97r6q0LJ36l6p8K52j45PK23k66J92r2j75L9l2K30j92j40
$$ -154 81 194 79 222 25 -71 -151 -148 -12 -48 -126 126 -19 -12 211 -55 137 45 -130 -91 -123 107 -85 -225
7774b25K72j51K77l08M6J09J04L2j27J90j57O8J5k44P7o0Q7J88k12P8k58L41o1
$$ -225 47 -104 173 -135 -89 20 124 156 29 219 62 130 145 -99 -22 -82 5 193 -19 59 -199 142 81
7797H1k93K89q4l45M38k09O3j4j18L25k12J8k16K65j4R0p3j9M4J0j07J90l28J63
$$ 81 -212 77 -7 -352 86 -123 -60 -74 -192 133 -79 -61 -277 -12 -26 64 -9 -28 16 26 -81 109 -219 -56
7821e6J10J25l78L84j94j79J83K6J69l10j2L00k8j18J86k18L70m08j75M2M92l02
$$ -56 54 179 -199 185 -9 -188 -5 21 190 -120 -132 168 140 22 208 -10 360 -48 -223 -181 311 9
7843Ij00j17O3J72j87K69j88k0J2P7r9R3J72l27r2L1M57j97J03j70M22n18L09
$$ 9 -91 -208 -145 27 -160 109 -79 -99 -87 -10 -109 -16 156 -171 -263 -232 225 28 131 -39 383 -135 174
7866A74R2m44J83p3J43q7K11j4P8k33M5Q2j67j71J23j58J27N6L63k40l38L16R4
$$ 174 266 -178 5 -68 75 -12 199 185 263 30 75 157 -10 -181 -58 -216 -89 -33 330 90 -248 68 162
7889A62k77OJ65j76N2J80m7j41J07k11K37J0j49K62J64k73k98L31l74L96j77r
$$ 162 -115 -109 56 -120 -68 112 65 -76 31 -180 57 67 -82 180 344 71 -227 104 -270 126 -51 -60
7911f0J59Q9l39L95j33K16p7m57QNN12l01K50m35K72l8J70m21J46ll1k1J47m56
$$ -60 99 188 -151 244 111 327 250 -207 -199 -194 318 17 267 -168 104 66 236 -185 -39 -42 -73 -94 53 -403
7935d03M50j04J2J26O1o4N4k5J24k90o7J79k0L1K9k51K12q6R0m4O1j79K46K30
$$ -403 47 -57 -45 81 142 78 132 107 231 -59 -126 53 33 64 93 -158 54 -32 58 14 75 -104 142 372
7959C72m19j25N17l68K39r7k21K28k37L56k69k08J32L53k13J36q6j45j36J09J58
$$ 372 -47 -172 345 -23 216 119 -102 126 -111 245 -24 -232 -100 253 40 176 90 -55 -191 -82 76
7980G6j3R6k14j91K88J26j55j61K38n9j0p8O3M9R4k34K2R3P2J54M8j89J6j10j
$$ 76 63 159 -55 -246 42 168 13 -148 90 31 21 -57 6 55 149 -85 -63 30 102 256 304 115 131 21 20
8005B0J71r8O6m7j43n1K20K5k81n2J43J82n6j64J5K3j2l6K88m70K54m6J21l51
$$ 20 191 93 159 112 -31 -82 138 163 -118 -170 -27 155 99 -65 -50 -27 -39 -75 213 -257 -3 -49 72 -279
8029b79J93J74l20L33k93L51l2l02P5J96L7n3m9j84L79m21J66R2r8Q0j29r1K44
$$ -279 -86 88 -232 101 -192 159 127 -175 -100 96 133 80 31 -153 226 -195 -29 63 -35 45 -84 -175 69
8052F9J6M2M9j66J83k46Q7n3o8N1Q2r4k03J88j56K50M7n8j3J29l80K09M3P5j81
$$ 69 85 127 176 10 193 -53 34 -19 -87 -36 46 -48 -251 -63 -219 31 78 20 7 136 -244 -35 8 83 -98
8077i8m5P3K66j18J92k22J99Mk53l5j59K7K40k54K17J20k09j01J18K0P0j83j07
$$ -98 -143 -70 196 78 270 48 247 251 -2 -37 -196 -169 71 -183 34 154 -55 -156 -38 -18 52 -131 -238
8100b38L45k56J49P9k75K8M31l57Q0N9k41J34K52l4Q0j47k38L04k66K50o6J07
$$ -238 107 -149 0 79 -196 -168 263 -94 -14 45 -196 -62 190 156 236 89 -149 155 -111 139 73 180
8122A80j32j2P4j89K64l69R6P4j63J8R4j87K44K55n6l4j41k62M72j13r1Q6j09
$$ 180 48 36 110 -79 185 -184 -88 -14 -177 -159 -65 -252 -8 247 191 157 16 -246 226 113 22 108 -1
8145ak7R0k59N4J0K76j70K00j79pQ4l2j83K1J50l13J37N47n68J78m5J18r3p9J4
$$ -1 -28 62 -197 -143 -133 143 -27 173 -6 -13 71 39 -144 -123 27 -286 -149 398 -170 8 -37 81 -12 -91 -77
8170g7q7M83l97K01m70K17M4q4J10L4j17M30l25Q4j76r8M87N1n52M24m7
$$ -77 -164 319 -78 123 -347 -130 -86 -170 -60 -26 -143 287 -38 46 -130 -228 259 310 -242 182 135
8191A35
$$ Imaginary data points
##PAGE= N=2
##DATA TABLE= (X++(I..I)), XYDATA
0@%%%%%%Nn%qJ6k4L2l2M0m9O5q6J02j21J45j76K08k43K87l35L90m52N22o02O88
$$ 0 0 0 0 0 0 0 5 0 0 -8 8 -16 16 -16 24 -25 40 -46 56 -65 80 -96 112 -131 156 -179 211 -241 281 -321 367
31C67p87Q96j014J146j293J456j632J824k038K271k527K806l109L441l802M199
$$ 367 -420 476 -538 608 -685 771 -861 963 -1075 1196 -1331 1475 -1634 1807 -1995 2204
47B204m634N108n629O199o829P529q303R170j0143J1246j2510J3970j5684J7724
$$ 2204 -2430 2678 -2951 3248 -3581 3948 -4355 4815 -5328 5918 -6592 7378 -8306 9418
61I418k0206K3304k7295L2659m0302N2166p3281J22416m57725k66217O03310L09014
$$ 9418 -10788 12516 -14779 17880 -22422 29744 -43537 78879 -378846 -645063 -41753 267261
73B67261K90225J5884j38139l58868l20015k50055j8581J45518L07838L21421
$$ 267261 557486 573370 435231 76363 -243652 -493707 -512288 -366770 -58932 262489
83B62489K56953K6786j54916k74664k84938k43726o3150J20645K44687K49065
$$ 262489 519442 546228 391312 116648 -168290 -412016 -475166 -354521 -109834 139231
93A39231J92808M9603j00928k18932k36528j68561k8212J00251J91632K11240
$$ 139231 332039 381642 280714 61782 -174746 -343307 -371519 -271268 -79636 131604
103A31604J62863M9840p1874j65948j93319j46906m2499O3259J37843J63730J33282
$$ 131604 294467 344307 272433 106485 -86834 -233740 -276239 -212980 -75137 88593 221875
114B21875M3601o5176j40496j55592j16819l7368N2980J18468J35926J05518M2529
$$ 221875 265476 200300 59804 -95788 -212607 -249975 -196995 -78527 57399 162917 205446
125B05446l2732r7858j25043r8846l2547L9052Q9098J08207Q8345L3572l3512
$$ 205446 172714 74856 -50187 -149033 -181580 -142528 -53430 54777 143122 176694 143182
136A43182q3166r7810p9898l6306K0381O9961R0730P3070L0279k1944o2756p8206
$$ 143182 60016 -37794 -117692 -153998 -133617 -63656 27074 100144 130423 108479 45723 -32483
148c2483o2437k5732J9065N5409P0374O1132K8484j4359n0561o4289n3431k5984
$$ -32483 -94920 -120652 -101587 -46178 24196 85328 113812 99453 48892 -15397 -68828 -94812
160i4812J1290M2757N5877M7608K2273j0801l9233n0643m3963k0903Q523L4964
$$ -94812 -83522 -40765 15112 62720 84993 74192 34959 -15684 -59647 -80550 -72027 -37063
172c7063M6037M0637K0811o496l0037m0352l6288j8193O401K6126L6178L2712
$$ -37063 8974 49611 70422 63926 33889 -6463 -42751 -60944 -54543 -28417 7761 40473
184D0473J6523m634k3979l3578l0383j6066L339K0977K9308K7062J4474k145j7750
$$ 40473 56996 52362 28383 -5195 -35578 -51644 -48305 -27328 1980 29042 43516 41371 23621
197B3621k6063k4322j3100K276J6219K3917K2141J2824j718j4154k1363j9962
$$ 23621 -2442 -26764 -39864 -37588 -21369 2548 24689 37513 35795 21641 278 -19684
209a9684j2144L51J2112J8913J7683J0830o48j0698j6641j6651r753R0R910J5306
$$ -19684 -31828 -31477 -19365 -452 17231 28061 27413 16715 74 -16577 -26330 -26240 -16330 -1024
223a024J4797R493K85q468j3258j3155q582p10P438J2000J2016P710ko653j0535
$$ -1024 13773 23266 23551 15083 1825 -11330 -19912 -20622 -13184 -1184 10832 18542 18540 11887 1352
238A352j1233o837q50N718R946R938O596O05m933q738q566n895n33M546P486P965
$$ 1352 -9881 -16718 -17568 -11850 -1904 8034 14630 15235 10302 1564 -7002 -12897 -13430 -8884 -1398 6567
254F567N576M57l580p181p372m861r70L423O352O084M581Q45l193n373n969m037
$$ 6567 12143 12600 9020 1839 -5533 -10394 -11364 -7941 -1589 4495 9076 9921 6728 1355 -4614 -8651
270h651l72K478N320N489L230N63k394m079m850l078p79K026L716M651K738P27
$$ -8651 -9023 -6545 -1225 4264 7494 8057 5663 1584 -3266 -6344 -7123 -5097 -1381 3270 6008 6735
286F735j992l808l752k926j24J532L002L713K592M67j519k990l331k029j18J034
$$ 6735 4743 935 -2817 -5743 -5867 -4335 -1333 2380 4972 5439 3920 930 -2401 -4430 -4548 -3514
302c514K606L012J828O90j380k346k597j804n38J077K219K045J673O05j260j502
$$ -3514 -908 2104 3932 4622 3242 896 -1701 -3505 -4043 -2966 -747 1298 2971 3576 2316 814
318H14k062j661m08Q81J527K367J094J69n09j592j660j257l37J036J232J194J133
$$ 814 -1248 -2909 -3317 -2436 -909 1458 2552 2721 2212 620 -1040 -2297 -2634 -1598 -366 828 1961
335A961N56p59j328j233j066r3M50Q14J649P55K79k98j082j479m03n87P38Q84
$$ 1961 2517 1758 430 -803 -1869 -1962 -1512 -698 951 1706 1985 1687 605 -874 -1277 -1864 -1126 -242
353b42R95P31r3l96q12n84q40j24j26J241Q04R27J03o64o11q57n20k99M16M31
$$ -242 753 1484 1391 995 183 -401 -1241 -1365 -1491 -250 554 1481 1584 920 309 -548 -1068 -1367 -951 -520
373e20Q63O61J82k87q67n66k93j48L07K38P44L40L34m38l49o71k43j27l79R56
$$ -520 343 1004 1186 899 32 -534 -827 -975 -668 -430 314 654 988 550 201 -470 -713 -840 -1219 -263
393b63O14P78j33l89n30q6m48n60M21K93L54O58J06l35k65m74k42j70n2M66Q68
$$ -263 351 1129 996 607 77 -9 -457 -1017 -596 -303 51 709 815 480 215 -259 -501 -671 -723 -257 611
414F11l52N82k36n52J1m55k73L82j51L75N17N42l73k24n14k88j88J30J83K77K69
$$ 611 259 841 605 53 64 -391 -664 -282 -433 -58 459 1001 628 404 -110 -398 -586 -456 -273 4 273
435B73M68o18K66n66m39j39K7L55O6O34R4J93j88n03q0k10j44K12J76L80Q6N4
$$ 273 741 123 389 -177 -616 -755 -728 -373 -307 327 421 614 426 -77 -157 -367 -511 -299 -123 257 343 397
457C97j18l03r6j10p7j43K76L85J60J0l18k53K61o51M42o5r2M00J79J99k96l3
$$ 397 279 -24 -120 -230 -307 -450 -174 211 371 381 63 -190 71 -580 -138 -203 -295 105 284 483 187 154
479A54j90j65j11O8Q6M20O3K7j9k27o1j28j5oK04J2LJ07L76k89k92j86k83PK69
$$ 154 -36 -201 -312 -244 -158 262 325 352 333 106 45 -83 -98 -104 100 112 115 222 598 309 17 -169 -452 -445 -176
504a76L52J42r7r1j34j47J54k69M1k18M21L11j20J31l22J05J9l96n4L27R8J82
$$ -176 176 318 221 130 -4 -151 3 -266 -225 -443 -22 289 169 300 -22 83 102 -294 -348 -21 77 259
526B59j98J15k07J01k90l3j14K56j72L70J83k66J89j90Q4j86k45R3K93j65L29
$$ 259 61 176 -31 70 -220 -253 -367 -111 -283 87 270 4 193 3 87 -99 -344 -251 42 -123 206
547B06J54j94l70L18l37J44k82J41L83j56K2L44k94J61n67M89p5q8M3n4J39r5
$$ 206 360 166 -204 114 -223 -79 -361 -220 163 7 29 373 79 240 -327 162 87 -1 42 -12 127 32
569C2J71o5k59j01NN6M21n00M96m09J00J32l6m76K74j62K90L10k52Nm9j28o7K80
$$ 32 203 138 -121 -222 -217 -161 260 -240 256 -153 -53 79 43 -433 -159 -321 -31 279 27 32 -17 -145 -212 68
593F8qo6J23P3j95q9K68n19L0J62L3n6O4L41m22N02r8n25L04j38n5L11k49rL06
$$ 68 60 -6 117 190 -5 -94 174 -345 -315 -153 -120 -176 -112 229 -193 309 211 -314 -10 -148 -203 108 -141 -150 156
618A56l58M02k35Nk49K17J19k43J64Q3q7j3Q6o3Nj08L4k70N42j93K35l58J86m4
$$ 156 -202 200 -35 -30 -279 -62 57 -186 -22 61 -26 -39 47 -16 -11 -119 -85 -355 187 -6 229 -129 57 13
642A3J11k86K64j56J54L4k04J48k75L72k34J00j40m1J72O4J94l44k02JM5L44l24
$$ 13 124 -162 102 -54 100 134 -70 78 -197 175 -59 41 -99 -140 32 96 290 -54 -256 -255 -210 134 -190
665a90MK18K65l38K09j54L9k09M20k28L5k81J13K76k84J87j50o7K74k8k03m6r9
$$ -190 -186 32 297 -41 168 14 53 -156 264 36 71 -210 -97 179 -105 82 -68 -135 139 111 -92 -138 -237
688b37L73k14L00l57L43l31J54m2K34j35J56j60j30L97l38l08P5M93j27j83M89
$$ -237 136 -78 222 -135 208 -123 31 -11 223 88 244 84 -46 351 13 -295 -220 273 146 -37 452
709D52n37l7K0n1J83J64l44M08k47L01k49l01J99J49K66n54L28j85l2J79j77k59
$$ 452 -85 -122 -102 -153 30 194 -150 258 11 312 63 -238 -39 110 376 -178 150 -35 -67 112 -65 -324
731c24j14M37k15M64k06J05l31N4J95r4k82M17l5j09j42J82j30J75j01M1J7L60
$$ -324 -438 -1 -216 248 42 147 -184 -130 65 -29 -311 106 71 -38 -180 2 -128 47 -54 -13 4 364
753C64p13L84k2O5q2j00L26j34N1j95M4j01N9M28o04J55j04K54k58j0K61n5o7
$$ 364 -349 35 13 78 -4 -104 222 88 139 -56 -12 -113 -54 374 -230 -75 -179 75 -183 -193 68 13 -54
776e4J28n1k88M18r4Pk58J85K47k98M8r4K20j13L5K76m14K23j14j67l9M67n5k18
$$ -54 74 23 -265 153 59 66 -192 -7 240 -58 -10 -104 116 3 38 314 -100 123 9 -158 -197 270 215 -3
800ck7k49J69K04k00O9K12J06L3l40J38l93K64P5k23K13n9J38r2l18L8n2M86k85
$$ -3 -30 -279 -110 94 -106 -37 175 281 314 -26 112 -281 -17 58 -165 48 -11 127 35 -283 -245 -297 189 -96
824i6J08K3J26j39L4k88Q6J97J09L04n51K77k51J28k93K55O3q5l9j30J52P2k12
$$ -96 12 35 161 22 56 -232 -146 51 160 464 -87 190 -61 67 -226 29 92 7 -32 -162 -10 62 -150
847a50L82k57n0J72j37K05m7k91N17n25K61l05p2L4K62r9J38j19K71k62k33K47
$$ -150 232 -25 -75 97 -40 165 118 -173 344 -181 80 -225 -297 -263 -1 -100 38 -81 190 -72 -305 -58
869e8L05k80p2K41k41K11L0P8m54M41k21l1J44j2p3Q7l5l28K23K61mj6k66J20
$$ -58 247 -33 -105 136 -105 106 136 214 -240 201 -20 -51 93 81 8 95 60 -268 -45 216 212 196 -70 50
893E0n7K1j85J11k98J62L75k86j65O18l27j90N2k80J85K84r9Q6j54R4j11k00J91
$$ 50 -7 14 -171 -60 -358 -196 179 -107 -272 346 19 -171 -119 -399 -214 70 -29 57 -97 -3 -114 -314 -123
916a23k8K15j17J13k20N2R6K04j75p2kJ50K4n8j31l5K04k52K01o3J62m04O7K66
$$ -123 -151 64 -53 60 -160 -108 -12 192 17 -55 -57 93 117 59 -72 -107 97 -155 46 -17 145 -259 -192 74
940G4j64J85k20K73j93R6K13l94J41J23p7n2J49j06J28m9k06J23k84J73L32n27
$$ 74 -90 95 -125 148 -45 51 264 -130 11 134 57 5 154 48 176 127 -79 44 -240 -67 265 -262
962b62K27P4M5k49N77o09L24J91k89J09j55m3o2k66M36r0j71K09l28M25kJ16l16
$$ -262 -35 39 84 -165 412 -197 127 318 29 138 -17 -60 -122 -388 48 -42 -213 -4 -332 93 91 207 -109
985a09k0M2k25J40K13J37j29j65J9j74O0J9L52j84J77m61L93o9L82l88r9J25j59
$$ -109 -129 -87 -312 -172 41 178 49 -116 -97 -271 -211 -192 160 -24 153 -308 85 16 398 10 -89 36 -123
1008a23j70O49l20j95J26n6M0Q9R2r2j25Nk1J74J10l4n9j48Pj08j65M57k68K23
$$ -123 -293 356 36 -159 -33 -89 -49 40 132 40 -85 -80 -101 73 183 149 90 -58 -51 -159 -324 133 -135 88
1032H8l14N4N7k7K19p9%O4R5k34rN6L07k06K7q7j00L0J23j92nK13k07L39k74J46
$$ 88 -226 -172 -115 -142 77 -2 -2 62 157 -77 -86 -30 277 71 98 11 -89 -59 64 -128 -133 80 -127 212 -62 84
1058H4p4l6o8KJ65m08M32k40l49M00L0L40k53j16K16j13k86L65j29Rj19K00o5
$$ 84 10 -26 -94 -92 73 -335 97 -143 -492 -92 -62 278 25 -91 125 12 -274 91 -38 -29 -148 52 -13
1081a3Q5J35l38J46j53Q7J65J20k41k57K12l7J30j6j30K03J59k83L58r7M3k98
$$ -13 72 207 -131 15 -138 -51 114 234 -7 -264 -52 -89 41 25 -105 98 257 -26 332 235 278 -20
1103b0o8j4R7N1j58R5K66l16K73r4m59M86k83K08JJ45j22Q0k23q6JJ45J5l4m9
$$ -20 -88 -102 -5 46 -112 -17 249 -67 206 112 -347 139 -144 64 65 210 88 168 -55 -141 -140 5 20 -14 -63
1128f3K68m58J50J24L0N0l06L31k45Mrk59K04P0J69j12J32k34J5Q9Q7j23K04J05
$$ -63 205 -253 -103 21 51 101 -205 126 -119 -115 -124 -383 -179 -109 60 -52 80 -154 -139 -50 37 -86 118 223
1152B23k82J18j80J51j0N7m0j70J32K0J29k98RJ80p1K44l30k45N6K02Q4m3J51
$$ 223 -59 59 -121 30 20 77 37 -133 -1 19 148 -150 -141 39 -32 212 -118 -363 -307 -105 -21 -64 87
1175H7j80k40M87J04k07J77r1k53j8l7J06O5M68p60K18J26N9K7l32J35j21J13
$$ 87 -93 -333 154 258 51 228 137 -116 -134 -171 -65 0 468 -292 -74 52 111 138 -194 -59 -180 -67
1197f7K2k10O8K59n9K38m86K42k12K38m2j00MJ53m6P2k21K14J75m9r5l23o6K28
$$ -67 -45 -255 -187 72 13 251 -235 7 -205 33 -9 -109 -105 48 2 74 -147 67 242 193 98 -225 -291 -63
1221f3J41k01k2J23K1n52N65k16R3k8J73j10J13J87M8k29j01K62j83l65M93j7
$$ -63 78 -123 -145 -22 -1 -553 12 -204 -111 -139 34 -76 37 224 272 43 -58 204 21 -344 149 132
1243A32m13O21o86L93J0N2k09Q6Q1k99L36L6k26j33K28qk1K25q9o6k6K26j86Q1
$$ 132 -281 340 -346 47 57 109 -100 -14 67 -232 104 140 -86 -219 9 1 -20 205 116 50 24 250 64 145
1267A45j24k3j9J57p0k53M06k08n0m8K37k52j75M01n7m54O4L24M4O7l49N17m26
$$ 145 21 -2 -21 136 66 -187 219 11 -39 -87 150 -102 -277 124 67 -387 -323 1 45 112 -237 280 -146
1290a46P7M7q0M7k85L95q0R7OJ3k9J65l87J91j36K20q0k38K93l28J97j97k30O65
$$ -146 -69 -22 -102 -55 -340 55 -25 72 78 91 62 227 -160 31 -105 115 35 -203 90 -238 -41 -238 -468 197
1314A97q3j99P9L4K9K14j61j77N8J13j18O9k74L54r8k55K1K37R9j11L29j90k82
$$ 197 114 -85 -6 28 57 271 110 -67 -9 104 -14 55 -219 135 37 -218 -197 40 139 28 357 167 -115
1337a15M5M54n88L51o0r1k53K19r0K15r5K9k30p2K75l01L82k90K63KJ32j98J16
$$ -115 -70 384 -204 147 87 -4 -257 -38 -128 87 -8 21 -209 -281 -6 -307 75 -215 48 50 182 -16 100
1360A00P0q1j06K12j72J7j11K00m3R8l59J36K9j72L80rj31j20K4R9m3N7rj45K53
$$ 100 170 89 -17 195 23 40 -71 129 86 184 -175 -39 -10 -182 198 189 58 -62 -38 61 18 75 66 -79 174
1385A74j45j16K12k59n8K94m8r9M0k69K13J37o1j9r2%NK86k90K62k67p2K20l7
$$ 174 29 -87 125 -134 -192 102 54 -45 -5 -274 -61 76 15 -4 -96 -96 -91 195 -95 167 -100 -172 48 11
1409A1L4j99L01j85J95m37j03N71j32k20J98q1J04j3j70J18j4k68L31k05r1M05
$$ 11 45 -154 147 -38 157 -280 -383 188 56 -164 34 -47 57 44 -126 -8 -22 -290 41 -164 -255 150
1431A50k41L49l66J71k30jK52k58O8K4N9j21M26l00N3K8K3q4P4J14k18j3L4j21
$$ 150 -91 258 -108 63 -167 -168 84 -174 -106 -82 -23 -144 282 -18 35 63 86 2 76 190 -28 -41 -7 -128
1455a28j46j6L20L6J78k11j9K57k55q0k81L80k45oK13J16r4l1O6J31k71O6Jj28
$$ -128 -274 -290 30 66 244 33 14 271 16 -64 -345 35 -210 -216 -3 113 19 -12 54 185 -86 -20 -19 -147
1479a47P8J89k85J72L4k32J50N9l5J09j43K05J49j89K6n2l06K63j02M13l08k44
$$ -147 -69 120 -165 7 41 -191 -41 18 -17 92 -51 154 303 114 140 88 -218 45 -57 356 48 -196
1501a96M9J13K66m45J26K01q4l49J51L76j76k4O9l7l32M79j30l0j40r2K2j07K67
$$ -196 -147 -34 232 -213 -87 114 30 -319 -168 208 32 8 77 40 -292 187 57 27 -113 -205 -183 -290 -23
1524b3J61L3n5j56J19k47K17l1j95L00j31J88j72O1j07P0j23n4J25j3K0k27n2
$$ -23 138 171 116 -40 79 -168 49 18 -177 123 -8 180 8 69 -38 32 -91 -145 -20 -33 -13 -240 -292
1547b92K4J75L0M5k18K08j7Mo3J36M6l30M14j73j38J35J04j45Q2J56p6j46Q1j26
$$ -292 -268 -93 -63 -18 -236 -28 -45 -41 -104 32 78 -252 162 -11 -149 -14 90 -55 27 183 107 -39 42 -84
1571h4J19N8k28P3o4L19j66M6n5k7j32P3J27j41O6j48M65l21j42J18J98j52J6
$$ -84 35 93 -135 -62 -126 193 27 73 18 -9 -141 -68 59 -82 -16 -164 301 -20 -162 -44 154 2 18
1594A8N1R1k88J56k2j19J30K42l09j13J60J41p1j03Pr6k1M3J41J81l57N0R9j3
$$ 18 69 160 -128 28 6 -113 17 259 -50 -163 -3 138 67 -36 -29 -125 -146 -103 38 219 -138 -88 11 -2
1618bk07K41n3O5K17m29P2J28k10J68M5n6nM6J36l08K68q7j47L6J44K6l1k27O7
$$ -2 -209 32 -21 44 261 -168 -96 32 -178 -10 35 -21 -26 20 156 -152 116 29 -118 -82 62 88 57 -170 -103
1643a03l5P5J87l41M69m02M74p71O66k06k07Qn3M18o6j90L60l62K10J8k71J34
$$ -103 -138 -63 124 -217 252 -150 324 -447 219 13 -194 -186 -239 179 113 -77 283 -79 131 149 -122 12
1665A2l48P0K63K70j50k01j18K75k67K27Q7M0K00l15j13J78J9J9R7p5j98P2J77
$$ 12 -336 -266 -3 267 117 -84 -202 73 -194 33 120 160 360 45 -68 110 129 148 245 170 -28 44 221
1688B21M2m43q9MK08P3K55j35k23K59k97L00k50j21K25J79j29k26K24k35M9J07
$$ 221 263 -180 -269 -265 -57 16 271 136 -87 172 -125 175 -75 -196 29 208 79 -147 77 -158 -109 -2
1710bj24L11j81L3J50j9j30l33M62rJ08n98L33Q3o7M56o17K39p5K53k72N7n8R3
$$ -2 -126 185 4 37 187 168 38 -295 167 158 266 -332 1 84 17 473 -144 95 20 273 1 58 0 93
1734I3k3l8J1k52q6M19O8J23j59R9k96j31J82J64j84n7q7O1J53n7J51j53J33J51
$$ 93 70 32 43 -209 -295 124 192 315 156 255 -41 -172 10 174 -10 -67 -154 -93 60 3 154 1 134 285
1758B85j63j88L88l65j50K35P4m54L78j1r7J64N8p5k80K35q4j25j16M39M3lk18
$$ 285 122 -66 322 -43 -193 42 116 -338 40 29 -68 96 154 79 -201 34 -50 -175 -291 148 191 188 -30
1781c0j76K81qL71j23m58J69Nr2j03J1j6J19L82m3k74k79K55o8J12j51R5k24L67
$$ -30 -206 75 67 438 315 -143 26 31 -61 -164 -153 -169 -50 332 289 15 -264 -9 -77 35 -116 -21 -245 122
1805A22j23m7o7K28J06j48j31k99K51J20K4p5QJ01l68K37j87K31L54n1l59P7Q3
$$ 122 -1 -48 -115 113 219 71 -60 -359 -108 12 36 -39 -31 70 -298 -61 -248 -17 337 286 -73 4 87
1828H7k09K62k59lJ98J38j17p0J5j45N4O3J64l61M25k95P2j18j62N34j05K26o32
$$ 87 -122 140 -119 -122 76 214 97 27 42 -103 -49 14 178 -183 242 -53 19 -99 -261 273 168 394 -238
1851b38K3L19k27J96l1J35k02k63M89k26rj22L56Ro2J03j19l38L05k44M20l61
$$ -238 -215 104 -123 73 42 177 -25 -288 201 -25 -34 -156 200 209 147 250 131 -207 98 -146 274 -87
1873h7K40j12j41J92l06J68J23n2Jp5J28l48M4J74K73j11l68M05q0m3o3K3o8L31
$$ -87 153 41 -100 92 -214 -46 77 25 26 -49 79 -269 -225 -51 222 111 -257 148 68 25 -38 -15 -83 248
1897B48m69L79k85J42j85L51l61J37M5L6J03k10J64l55M33k26L7o6N1J83J58j99
$$ 248 -221 158 -127 15 -170 181 -180 -43 2 38 141 -69 95 -260 173 -53 -16 -82 -31 152 310 111
1919A11k2k26j81M44Q2l45Q0n8K73j73p6Q5J06m33J51R3J05j11n4Q1M1L5r6R5
$$ 111 89 -137 -318 126 208 -137 -57 -115 158 -15 -91 -6 100 -333 -182 -89 16 -95 -149 -68 -27 8 -88 7
1943GN7N6k73K44j90k9K48L9o0j33K19j62P5j56j1j65L24Q0l24O1K63K7kk85L87
$$ 7 64 120 -153 91 -99 -128 120 159 99 -34 185 23 98 -58 -69 -234 90 170 -154 -93 170 197 195 -90 297
1968B97m59p9j22J05L76o6l07M65j36k5l6j39J7m5J88Kr4kq9k49L23L9J10o4K
$$ 297 -162 -241 -363 -258 118 52 -255 210 74 49 13 -126 -109 -154 34 36 -58 -60 -149 -398 -75 -36 74 10 12
1993A2j21J01l4N2kO7k38R5J69j64K22k17p5%L0Q0j2j33R1J38j97J20J92K13m40
$$ 12 -109 -8 -42 10 8 75 -163 -68 101 -63 159 -58 -133 -133 -103 -23 -35 -168 -77 61 -136 -16 176 389 -51
2018e1J03k7j6j26L25j96l5o0qk05J62K42m3j77mnR9l4j34J30K5J5oJ14l0J10
$$ -51 52 25 9 -117 208 12 -23 -83 -91 -296 -134 108 65 -112 -116 -121 -22 -56 -190 -60 -35 -20 -26 88 58 168
2044A68k17p2J34q6L6l02K60k14J38L4O7Rr7j7M15j01k25O7K79k47J00J67j50
$$ 168 -49 -121 13 -73 -37 -339 -79 -293 -155 -121 -54 -45 -142 -159 256 155 -70 -3 276 29 129 296 146
2067A46j04m6L5o8M5k56K68J94r7k66R3j29K36J20m3r4R6K1k16Rj37J07J08J84
$$ 146 42 -4 31 -37 8 -248 20 214 117 -149 -56 -185 51 171 128 34 130 151 -65 -56 -193 -86 22 206
2091B06k26j4J19m7j29j69K78k66L33k49k8J09k23M16j53j57J99J06k65K18k5
$$ 206 -20 -34 85 38 -91 -260 18 -248 85 -164 -192 -83 -306 110 -43 -200 -1 105 -160 58 33
2112C3l12L37M3j49j6j93L71N9m1j70M6n2J69j56L14j87j94K69j13J34j74O3k03
$$ 33 -279 58 101 -48 -64 -257 114 173 132 -38 8 -44 125 -31 283 96 -98 171 58 192 18 81 -122
2135a22L21j55p5JKK69J26n64j3J84j15K42l1k02K53j44q8L38j9k50mj28J25J12
$$ -122 199 44 -31 -30 -28 241 367 -197 -210 -26 -141 101 70 -132 121 -23 -111 227 208 -42 -46 -174 -49 63
2159F3m9n5Q2m4j59P0J67j86j2J67k59K14K57k29J19j54J22l2j04J20j03k07Q5
$$ 63 14 -41 41 -3 -162 -92 75 -111 -123 44 -215 -1 256 27 146 -8 114 82 -22 98 -5 -212 -127
2182a27j4J10l0K89k81K77l98N1K44m87L20pj51M2J55p9N7q9q5J76L00l15m0K55
$$ -127 -141 -31 -61 228 -53 224 -174 -123 121 -366 -46 -53 -204 -162 -7 -86 -29 -118 -203 -27 273 -42 -82 173
2206A73l2l10q1O98l35j72K40k35Q0q4K32J21l7j94j01L02q0l60L4J87j95K10
$$ 173 141 -169 -250 448 113 -59 181 -54 26 -58 174 295 258 64 -37 265 185 -175 -141 46 -149 61
2228F1j60j85L45j00P6j46R4l4n5J09Rn0O9j4J83j50J27q8j23M2J19O4P8l98K31
$$ 61 -99 -284 61 -39 37 -109 -15 -49 -104 5 14 -36 33 19 202 52 179 91 -32 10 129 193 271 -127 104
2253A04Jj72J25k58O6k39N48l09K97k17K41j3m2m46M42lk22K08j2l07N34l99r3
$$ 104 105 -67 58 -200 -134 -373 175 -134 163 -54 187 174 132 -314 128 125 -97 111 99 -208 326 -73 -166
2276a66K98l92L69k14L10m31J27J00k86M9M84k54K58k00k48N05l4j42j14k53J76
$$ -166 132 -260 109 -105 205 -226 -99 1 -285 -236 248 -6 252 52 -196 309 275 133 19 -234 -58
2297e8K03k17K62l24N8K11j91q8K3K86n32M76j94J12j10P2j1j4J36m2k73L65q3
$$ -58 145 -72 190 -134 -76 135 -56 -144 -121 165 -367 109 -85 27 -83 -11 -22 -36 100 58 -215 150 67
2320F7k64K27p5J15K7J0k59J99J31k31jn6J02L9N6ql2L4P8j45n6pJ44P4j81j75
$$ 67 -197 30 -45 70 97 107 -152 47 178 -53 -54 -110 -8 31 87 79 47 81 159 14 -42 -49 95 169 -12 -187
2346a87K80r5L62j84k4j79M0N9j59L12q7j36Q4l4l4J16m54M18J7j42J61k01L35
$$ -187 93 -2 360 176 152 -27 13 72 -87 225 138 2 86 52 18 134 -320 98 115 -27 134 -67 268
2369B68k98J01j29J22Q6m76K73j35NN2J08n2m2L34K14n33j2O5J40o2K59j55r5
$$ 268 -30 71 -58 64 150 -326 -53 -188 -183 -131 -23 -75 -117 217 431 -102 -114 -49 91 29 288 133 38
2392C8k58M26l48J53Q4j07m5j13Jk17M54p0R2l05J19L29k55K15k74K34l77N4K49
$$ 38 -220 206 -142 11 95 -12 -57 -170 -169 -386 68 -2 90 -215 -96 233 -22 193 -81 153 -224 -170 79
2415G9J97k63J26j61O9r0m0J94k46N4J17j63J20N1j02k81K72J63L1q6j07PM3K15
$$ 79 276 13 139 -22 47 -43 -83 111 -135 -81 36 -127 -7 44 -58 -339 -67 96 127 41 -66 -59 -16 199
2439A99j29j52J65J1k0j26j40M30l47K60k12J73j58m4K10l21m5K74j36J98O8j43
$$ 199 70 -82 83 94 74 -52 -192 238 -109 151 -61 112 -46 -90 120 -201 -246 28 -108 90 158 15
2461A5K02k17Q7J38k38r1K45j15j31K14M7o9L8j14L26m3j19n25M50n2K11p7O9
$$ 15 217 0 87 225 -13 -104 141 26 -105 109 156 87 125 11 337 294 175 -350 100 48 259 182 251
2484B51l16j5J51k9p9j59j00L42j7K59k91J16j74j20L52K2k17l4P7J71j22m4k24
$$ 251 -65 -80 71 42 -37 -196 -296 46 29 288 -3 113 -61 -181 171 193 -24 -58 19 190 68 24 -200
2507b00K96j15j24L42p8l91K66K40k33J72k83L7L6J94k11J02j8N1j68J05J09L9
$$ -200 96 -19 -143 199 121 -270 -4 236 3 175 -108 -71 -35 159 -52 50 32 83 -85 20 129 168
2529A68j8k29k09K00J01J84j90K5J79j72Mj53j6K86j15N11o00J81kl2j91m2K98
$$ 168 150 -79 -288 -88 13 197 7 32 211 39 43 -110 -126 160 45 556 -44 137 135 103 -88 -130 168
2552A68l18O38m66O9j24J63j36k7R1Jn1j8O0L6j38nk2P5Q1l18L86j11l3K72l38
$$ 168 -150 488 22 91 -33 130 -6 -33 58 59 8 -10 50 86 -52 -57 -79 -4 77 -241 145 34 1 273 -65
2577f5l0J08j43k13L63J25j67J18m53M07O6r7J8K47k35j01l9M39l56PP0k74P7
$$ -65 -95 13 -130 -343 20 145 -22 96 -357 50 116 19 37 284 49 -52 -91 348 -8 -1 69 -205 -128
2600a28K71j90j22k9M0M15o4k05O6Q9j30l43Q6M35O5k90P0J36k54O2J24j06j83
$$ -128 143 -47 -169 -198 -158 257 193 -12 54 143 13 -330 -244 191 256 -34 36 172 -82 -20 104 -2 -185
2623a85J25l0J73M0j65j21J38j30k6K05J27L3j39j20K5k69M75k67J70Jl47J94
$$ -185 -60 -90 83 123 -42 -163 -25 -155 -181 24 151 184 45 -75 -50 -319 156 -111 59 60 -287 -93
2645i3K0o9J36P8q9N7P6j59kq0K3K37j42P4j44k8K00j43J92k3j7j32K6k34K05
$$ -93 -73 -142 -6 72 -17 40 116 -43 -45 -125 -102 135 -7 67 -77 -105 95 -48 144 121 104 -28 -2 -236 -31
2670c1K13l39L38m88K96p5L4Mj33K56j39j6OK17j65o5K8O3K3j35K09k12j62K79
$$ -31 182 -157 181 -307 -11 -86 -52 -48 -181 75 -64 -80 -74 143 -22 -87 -59 4 27 -108 101 -111 -273 6
2694FJ8k50K08Jr7j7j84M85K0m51N2J83L77l55o2j2P3j05o3J86J01k40J95j98
$$ 6 24 -226 -18 -17 -114 -131 -315 170 190 -261 -209 -26 351 -4 -66 -78 -5 -110 -173 13 114 -126 69 -129
2718a29O0J00J14L6l93L12N8l05K91j87o1m5p9L48q6q5J07N3j74op9J83k0j11
$$ -129 -69 31 145 181 -212 100 158 -147 144 -43 -104 -149 -228 120 34 -51 56 109 -65 -71 -150 33 13 -98
2742i8J1J42J88l45mK70j51l5j28L14J4Rk29N0J8l5L0j08J11k82J07J76J52q6
$$ -98 -87 55 243 -102 -106 164 13 -22 -150 164 178 187 -42 8 26 -9 21 -87 24 -258 -151 25 177 91
2766I1m04L66N3j26j22l76M84N5k3K4n2k39K84j5j87K21J11Lk01O8J0j23n5J50
$$ 91 -313 53 106 -20 -142 -518 -34 21 -2 22 -30 -269 15 0 -187 34 145 148 -53 15 25 -98 -153 -3
2790cK7j37M27r2r2j69L18k57j04O7J77J22l93l8J13M4m4jr0J20k57O3L1o7K91
$$ -3 24 -113 314 222 130 -39 279 22 -82 -15 162 284 -109 -147 -34 10 -34 -35 -125 -5 -262 -199 -168 -235 56
2815E6K15l99L50j91j02l01J89L67l98j40J27K15j41J81P9J35n3q3j45p3L16k90
$$ 56 271 -128 222 31 -71 -372 -183 184 -214 -354 -227 -12 -153 28 107 242 189 106 -39 -112 204 -86
2837h6K7P8N1L1Oj69K51j24j63n4J01k3K89l01R8K77k61m7p9K08j45J38j07K00
$$ -86 -59 19 70 101 107 -62 189 65 -98 -152 -51 -74 215 -86 12 289 28 -19 -98 110 -35 103 -4 196
2861A96j50o3R3K05n21L48k48k1L05j37k2K43l66J29K77l06Q0J41j84J33k83J91
$$ 196 46 -17 76 281 -240 108 -140 -161 144 7 -15 228 -138 -9 268 -38 42 183 -1 132 -151 40
2883D0m62N51N5k39K82j33j33J95j38J9k9k66K48m1P0J09j45k74L64k05K52k61
$$ 40 -422 129 184 -55 227 94 -39 156 18 37 8 -258 -10 -51 19 128 -17 -291 73 -132 120 -141
2905a41J3J28L7n3k3O0r4m7k7p4K46q3j74rJ60j51J75K84L2k26roR1k25J72k22
$$ -141 -128 0 37 -16 -39 21 -73 -120 -147 -221 25 -58 -232 -241 -81 -232 -57 227 259 33 24 18 109 -116 56 -166
2931a66p2L14J08j31K49l64k2J17j89L37o10O22l10L5Q4k1j60J56q2K52Q7l26
$$ -166 -238 76 184 53 302 -62 -84 33 -156 181 -429 193 -117 -82 2 -19 -179 -23 -105 147 234 -92
2953i2J23m7Km6J65l9mj4K07k82K91j38j17j41Q5j82lL40J3k97M84k63J40M7o8
$$ -92 31 -16 -14 -60 105 66 62 48 255 -27 264 126 9 -132 -47 -229 -232 108 121 -176 308 45 185 232 164
2978A64j86j39L39K9k32j60k03K03L28k41RQ4J46j97o8K43K03o05L57N7l24j01
$$ 164 -22 -161 178 207 -25 -185 -388 -185 143 -98 -89 -5 141 -56 -124 119 322 -283 74 131 -193 -294
3000b94L06R2k5k71r2M51m16J12pM6J25o3K8j35K11p2k07q9M38j11J16k47m1K20
$$ -294 12 104 79 -192 -284 167 -249 -137 -144 -98 27 -36 -8 -143 68 -4 -211 -300 138 27 143 -104 -145 75
3024G5J20k80o1Q7k41K54j30J27p6j99N51j23l8j83Q6P0k93O04m69q1P2O4K32
$$ 75 195 -85 -146 -59 -300 -46 -176 -49 -125 -324 227 104 66 -117 -31 39 -254 350 -119 -200 -128 -64 168
3047A68l70J71k03J61J3N9J98k35K7k47J76j3L26q5r6j39k0P9N4k69r1J19K53
$$ 168 -202 -31 -234 -73 -60 -1 197 -38 -11 -258 -82 -95 231 146 50 -89 -109 -30 24 -245 -336 -217 36
3070C6R7k95L7J91O4j02L44m01J35k76k51L66J08P8j42j13LJ8Q8R4K7j22Q7j05
$$ 36 133 -162 -125 66 130 28 372 -29 106 -170 -421 -55 53 131 -11 -124 -121 -103 -15 79 106 -16 71 -34
3094c4j6j03J60k22K52j40K35o9M8o7k90J80P3K28k92K2j3o9rJ03J12k40J24R8
$$ -34 -50 -153 7 -215 37 -103 132 63 111 44 -246 -66 7 235 -57 -35 -48 -117 -126 -23 89 -151 -27 71
3118G1m6r1P3N9L7j20Q5k31P6Q8j10K8K25k71L67k17J4j05L34l62J12j46K57j13
$$ 71 25 -66 7 66 103 -17 68 -163 -87 1 -109 -81 144 -127 240 23 37 -68 266 -96 16 -130 127 14
3142A4j81j87K54J49J32j93J27J94k79R1j50L05m9l33J29K31m13K38k59R3K55
$$ 14 -167 -354 -100 49 181 -12 115 309 30 121 -29 276 227 -106 23 254 -159 79 -180 -87 168
3163A68k64R4K4j08J13o6q7L59n3lr7R2k63K32j16K78k43o9p1P3J46k05R9N59
$$ 168 -96 -2 22 -86 27 -39 -126 233 180 177 80 172 -91 141 25 303 60 -9 -80 -7 139 -66 33 592
3187E92m72k15pM1J5NL49k56m2k20L53r5J95m5m62M40n05L23R1j79J48l8l4k56
$$ 592 120 -95 -102 -61 -46 -41 308 52 10 -210 143 48 243 198 -264 176 -329 -6 85 -94 54 16 -18 -274
3211b74L37j00M9j24J65J41j94r5R3j39J27p1K2k03K29m2k31K54K7j06L7J85j56
$$ -274 63 -37 12 -112 53 194 0 -95 -2 -141 -14 -85 -63 -266 -37 -79 -310 -56 -29 -135 -98 87 -69
3234f9M2j42L58l61n2L02l71K23J73k30K61l84K00K50j46J14j99J87k22L5K26
$$ -69 -27 -169 189 -172 -224 78 -293 -70 103 -127 134 -250 -50 200 54 168 -31 156 -66 -31 195
3255A95j22p1j81J37k7n1j47L88j16J16l8J97k57RO0K34l87K43j14r5m3j85N64
$$ 195 73 2 -179 -42 -69 -120 -267 121 5 121 83 280 23 32 92 326 -61 182 68 -27 -70 -255 309
3278C09j95J1j36K2N3j45J05k97K84q0j14K4J84q3K25M7J00k20M4m6l9j32O7K28
$$ 309 114 125 -11 11 64 -81 24 -273 11 -69 -183 -159 25 -58 167 214 314 94 138 92 53 -79 -12 216
3302B16m48L13N6l4j50K14P6l25J83j33l00N34k80j28J87Kk35j8J42J60n3L22
$$ 216 -232 81 137 103 -47 167 243 -82 101 -32 -332 202 -78 -206 -19 -17 -252 -270 -128 32 -21 301
3324C01l93R3O5nn3m4J03J70j28k12K73j79m4K89r3l37K29kj69Q7j32K50Q8q5
$$ 301 -92 1 66 61 8 -36 67 237 109 -103 170 -9 -53 236 143 -194 35 33 -136 -49 -181 69 157 72
3348G2j27O3O1r9J13o7k3JL01m51lL27j68m0j68J00k6J02qJ77p2j84j4o0N57l18
$$ 72 -55 8 69 -30 83 16 -7 -6 295 -156 -159 168 0 -40 -208 -108 -134 -32 -40 137 65 -119 -133 -193 364 46
3374D6O8j49Q3k15J87j14J71j94L32o03L37Oj05J4K25k6J96l17j71L66l60j4J82
$$ 46 114 -35 48 -167 20 -94 77 -117 215 -388 -51 -45 -150 -136 89 63 259 -58 -229 137 -223 -237 -55
3397e5o7K04k2o1J76J0l12J4L6k8J65n08O50j24n4J35m59L09K0k41J14Q8O7r2
$$ -55 -122 82 60 -1 175 185 -127 -113 -77 -105 60 -448 202 78 24 159 -300 9 29 -212 -98 -10 57 -35
3421c5q8N1k4J65N2j9M6p3j04O2m5J05J26k66K67p1j7j59J34k31l7K67j89j0j4
$$ -35 -123 -72 -96 69 121 102 148 75 -29 33 -12 93 219 -47 220 149 132 -27 107 -124 -161 106 -83 -93 -107
3446a07L59k12J26n15K76N3j3m2j67M69l53m1J26o3n5J53k22K61J31j60j29rK44
$$ -107 252 40 166 -349 -73 -20 -33 -75 -242 227 -126 -167 -41 -104 -159 -6 -228 33 164 4 -125 -134 110
3469A10k56J77P6o8K55j27j93j08N5J00j74J90k04M08p9OJ5k58J44j41J29j22
$$ 110 -146 31 107 39 294 167 -26 -134 -79 21 -153 37 -167 241 162 168 183 -75 69 -72 57 -65
3491f5j24M04r1j25l19L45J31j40J17j84K04j97p4J57l9J17p1k80L34o0k13L23
$$ -65 -189 215 124 -1 -320 25 156 16 133 -51 153 -44 -118 39 0 117 46 -234 100 40 -173 150
3513A50j55K7Q2j90K81k23M4R3J06j30k3q8j02j89L82L7l35L64k61J89j63K91
$$ 150 -5 22 104 -86 195 -28 16 109 215 85 62 -26 -128 -317 65 102 -233 131 -130 59 -104 187
3535A87j77k41K34j49M39m21R9K29m22M54j45p0k54j76L71L0j48Q6K14Q3l88J92
$$ 187 10 -231 3 -146 293 -128 -29 200 -222 232 87 17 -237 -413 -42 -12 -160 -74 140 223 -165 27
3557B7M7Q9l7k78J26J13J33l62K42k09J46K44m53rk1O6o6K91k1j09J56l9J75m3
$$ 27 74 163 126 -152 -26 87 220 -142 100 -109 37 281 -172 -181 -202 -136 -202 89 68 -41 115 76 251 208
3581B08k12j66K04K8J04o4N2j99j09k3J54K27l61J82o8k6q5L00j68J83lj63J90
$$ 208 -4 -170 34 62 166 102 154 -45 -154 -177 -23 204 -157 25 -43 -69 -154 146 -22 161 158 -5 185
3604A85m01JM21l95K20J15k86K37J05j38P2l8j11J31l09J93J26l51K34q9q3PK13
$$ 185 -216 -215 206 -189 31 146 -140 97 202 64 136 98 -13 118 -191 2 128 -223 11 -78 -161 -154 59
3627E9j58J14k75K96k35O2L87n11L40l48J25M00k99k09M76r5j54k65K55L40m10
$$ 59 -99 15 -260 36 -199 -137 250 -261 79 -269 -144 256 -43 -252 224 129 -25 -290 -35 305 -105
3648a05k1J11M9k9m89L75K19J4j89j22j55M1L08L2J40O5j96Q7j56Q0k0m1k33J78
$$ -105 -126 -15 34 5 -484 -109 110 124 -65 -187 -342 -301 7 39 179 244 48 135 -21 59 39 -2 -235 -57
3672e7L32k45R8n5j59L9Q0P0l20k23L88M6J08pj86j06K35k20J50P8j67K12l30
$$ -57 275 30 128 73 -86 -47 33 103 -217 -440 -52 -6 102 95 -91 -197 38 -182 -32 46 -121 91 -239
3695b39P0J67r0K91k79J47l3K6pJ29n4J10m09Q7J45L7l76L64R8k2O8k20N9k50
$$ -239 -169 -2 -92 199 -80 67 34 60 53 182 128 238 -171 -84 61 98 -278 86 184 162 230 10 69 -181
3719a81K68j94O8K0J31l7p5l5K3K4J65m40O0K10l80K95J16oJ19l01K75j52Kj60
$$ -181 87 -107 -39 -19 112 75 0 -35 -12 12 177 -263 -203 7 -373 -78 38 32 151 -150 125 -27 -25 -185
3743a85L77m3k36n8J37J68j98k09M39j39P1j10k59L11J5R7k54J67J22r9l4o2j38
$$ -185 192 149 -87 -145 -8 160 -38 -247 192 53 124 14 -245 66 81 178 -76 91 213 114 80 18 -120
3766a20J42Q1k52R6J76j08op9l1p0M37k03j17M1rk7l4j32J56J52m01N09j65j7
$$ -120 22 103 -149 -53 123 15 9 -70 -101 -171 266 63 -54 -13 -22 -49 -83 -215 -59 93 -308 201 36 19
3790A9K82l81k36J97Q4L38l47r8j10J49K12j39P1K3j34M0j54J12j41J93K46k36
$$ 19 301 -80 -316 -119 -35 303 -44 -142 -252 -103 109 -30 41 64 -70 -30 -184 -72 -213 -20 226 -10
3812a0L29m51K43N8J76k74j9k13J6J10j40L50k00J62J48k52J12j56O8M8L12k82
$$ -10 319 -132 111 169 345 71 52 -161 -145 -35 -175 175 -25 137 285 33 145 -11 57 105 417 135
3834A35l22J47J41m1j66J59J87l33J75J50j88m13M91k10L45k99o5r0J92R0k65
$$ 135 -187 -40 101 60 -106 53 240 -93 82 232 44 -369 122 -88 257 -42 -107 -197 -5 85 -180
3855a80J01J26J24j25m1m18K83q5L82m04M32O3m43L48n04K70pL2K8r4J72l0r3
$$ -180 -79 47 171 46 5 -413 -130 -215 167 -237 195 258 -185 163 -341 -71 -78 -46 -18 -112 60 30 -63
3878f3J78r4J38j44L2J7rl46K83Q2K1k8L6Q9j88j5J38k29L09k65J86j79L68m8
$$ -63 115 21 159 15 47 64 55 -291 -8 74 95 67 103 192 4 -11 127 -102 207 -58 128 -51 317 269
3902B69n60N18j71o3J73p3k48J65k02L09k13K81k57m6j01Q2N96m59o0J96k74m2
$$ 269 -291 227 56 -7 166 93 -155 10 -192 117 -96 185 -72 -118 -219 -137 459 0 -60 136 -138 -180
3924a80K15N4j56J13n3q4j0k01L42m10N29k12p4L23l54L03k69L6K69o0l88J27
$$ -180 35 89 -67 46 -7 -91 -101 -302 40 -370 159 -53 -127 196 -158 145 -124 -88 181 121 -267 -140
3946a40J4o2L81k48J69l24J20J02k03K79k29J49KO9P5k66J26j9K53k40K04k67
$$ -140 -126 -188 193 -55 114 -210 -90 12 -191 88 -141 8 10 79 154 -112 14 -5 248 8 212 -55
3968e5k9K52j48j80mo2O96k64m64K97K6R3l33OJ80P3oj24k52L15n0J89k69L74
$$ -55 -84 168 20 -160 -164 -226 470 206 -258 39 65 158 -175 -169 11 84 78 -46 -298 17 -33 156 -113 261
3992B61k52Q9j4k20o4J70M9m6j23J42lO6n9K49l23N8K20k10l8J54l22L3J03k5
$$ 261 9 98 84 -136 -200 -30 19 -27 -150 -8 -11 55 -4 245 -78 -20 200 -10 -48 106 -216 -183 -80 -105
4016a05O4r1K75k22J96j77N3K10j49P7k54n5J6N6L81k19j84K58m30J44K2m8M01
$$ -105 -41 -132 143 -79 117 -60 -7 203 54 131 -123 -178 -162 -106 275 56 -128 130 -300 -156 -134 -182 219
4039B19l21J10K93k58j37j05K8J25Q1j30K63l00J06R9o0O0r4L8p6j18M35m19K02
$$ 219 -102 8 301 43 -94 -199 -171 -46 35 -95 168 -132 -26 73 13 73 -21 17 -59 -177 258 -161 41
4062D1k74J98M69l16j50m2K60k00j85K45j40r7K67j78J77l8j1o6J3N1q4o5L54
$$ 41 -233 -35 434 118 -32 -74 186 -14 -199 46 -94 -191 76 -102 75 37 26 -40 -27 24 -60 -125 229
4085B29j80J48p6l82L94M7J0k38L1L5N0j28j3Lq0K28J68j49K58l03q8n5M3Q2k
$$ 229 49 197 121 -261 133 180 190 -48 -17 18 68 -60 -73 -70 -150 78 246 97 355 52 -36 -91 -48 34 32
4110C2N2L1l04M7L4J38m2j08l8L38k85L6Q9j17O2o8J32J73j3Kj88Pj60K09m5j65
$$ 32 84 115 -189 -142 -108 30 -12 -120 -158 180 -105 -69 20 -97 -35 -103 29 202 189 191 3 10 -150 59 14 -151
4136a51K55j37P3N1J17j39p0L51m62R9M2j30L93l68L2J3K07q8j62J70k48J98R1
$$ -151 104 -33 40 91 208 69 -1 350 -112 -13 29 -101 292 -76 -44 -31 176 88 -74 96 -152 46 137
4159A37j27o3J79J38r7j83j58L01N8k70J7K55n23L80J45n5J8N2j81j39Q5K91q9
$$ 137 10 -53 126 264 167 -16 -174 127 185 -85 -68 187 -336 44 189 134 152 204 23 -116 -31 260 171
4182A71n9n5j10l06J70L82k74j34J31j1N2k36J95nL75k08K7m5J08j22j27L59n01
$$ 171 112 57 -53 -359 -189 193 -81 -215 -84 -95 -43 -279 -84 -89 286 78 105 60 168 46 -81 278 -223
4205b23K71o0J84n09M23k43J60M5K90k65j02J45j32k4k2j41K01q1j14K24j55M1
$$ -223 48 -12 172 -337 86 -157 3 48 338 73 -29 116 -16 -40 -62 -203 -2 -83 -197 27 -128 -87
4227h7P4K6J68j06j18K99m78R9J28j28L99n43M31n2k48k5M43m48K38k07K32o6
$$ -87 -13 13 181 75 -43 256 -222 -123 5 -123 276 -267 164 112 -136 -161 282 -166 72 -135 97 31
4249C1O3J73l65Q4J64J09l8k04N4j01p8l0K6K44k87L08Q9j97q6J52l3j22o4l8
$$ 31 94 267 -98 -14 150 259 221 17 71 -30 -108 -138 -112 132 -155 153 242 45 -41 111 78 -44 -108 -146
4273a46K27j48Q6J25L7r0j24P7k36K28j92J32k15j5M50j97r6R2m3o9O7K23o8O3
$$ -146 81 -67 19 144 181 91 -33 44 -192 36 -156 -24 -239 -254 196 -1 -97 -5 -48 -117 -50 173 105 168
4297A68k91o9K27J6Q7l42L67j48L34l53J28j4l07L29n3j12J49k6j12k7j42M14
$$ 168 -123 -192 35 51 138 -204 163 15 349 -4 124 110 -197 132 79 -33 116 90 -22 -49 -191 223
4319B23k96mL2J40l6j27N5O2O0J2k26Q4R7J84l88K3j77L22J62m15K42J1k58K29
$$ 223 -73 -77 -45 95 59 -68 -13 49 109 121 -105 -21 76 260 -128 -105 -282 40 202 -213 29 40 -218 11
$$ [...]
8191B38
##END NTUPLES=NMR FID
##END=
