##TITLE=1H_DE-75H_DEK
 200.13MHz, D2O,
 8 sc
 
 31.1.2025
##JCAMPDX= 6.0         $$ Bruker NMR JCAMP-DX V2.0
##DATA TYPE= NMR FID
##DATA CLASS= NTUPLES
##ORIGIN= UXNMR, Bruker Analytische Messtechnik GmbH
##OWNER= pz
$$ XWIN-NMR		Version 3.5
$$ Fri Jan 31 14:29:21 2025 Russian Standard Time (UT+4h)  she@DPX200
##.OBSERVE FREQUENCY= 200.1313
##.OBSERVE NUCLEUS= ^1H
##.DELAY= (6, 6)
##.ACQUISITION MODE= SIMULTANEOUS
##.ACQUISITION SCHEME= undefined
##.AVERAGES= 8
##.DIGITISER RES= 18
##SPECTROMETER/DATA SYSTEM= spect
##.PULSE SEQUENCE= zg30
##.SOLVENT NAME= D2O
##.SHIFT REFERENCE= (INTERNAL, D2O, 0, 14.3821)
##AUDIT TRAIL= $$ (NUMBER, WHEN, WHO, WHERE, WHAT)
$$ ##TITLE= Audit trail, XWIN-NMR		Version 3.5
$$ ##JCAMPDX= 5.01
$$ ##ORIGIN= Bruker BioSpin GmbH
$$ ##OWNER= she
$$ F:/spectra/data/she/nmr/H-C/1/audita.txt
$$ ##AUDIT TRAIL=  $$ (NUMBER, WHEN, WHO, WHERE, WHAT)
(   1,<2025-01-31 14:28:00.96 +0400>,<she>,<DPX200>,
      <created by zg, POWCHK disabled, PULCHK disabled
       configuration hash MD5:
       00 E9 B6 7A A2 85 ED C7 34 08 36 98 17 FE 4E 26
       data hash MD5: 16K
       AE 1E 32 0D 82 E5 26 B8 A8 2D F0 82 B6 ED DB D6>)
$$ ##END=
$$ 
$$ hash MD5
$$ E8 90 4A F0 0F AF EF AC BD 9C 41 6F 11 19 9B F1
##$RELAX= 
##$RELAX= 
##$RELAX= 
##$RELAX= 
##$RELAX= 
##$RELAX= 
$$ Bruker specific parameters
$$ --------------------------
##$DU= <F:/spectra>
##$EXPNO= 1
##$NAME= <H-C>
##$PROCNO= 1
##$TYPE= <nmr>
##$USER= <she>
##$AMP= (0..31)
100 100 100 100 100 100 100 100 100 100 100 100 100 100 100 100 100 100 
100 100 100 100 100 100 100 100 100 100 100 100 100 100 
##$AQSEQ= 0
##$AQ_mod= 1
##$AUNM= <au_zg>
##$AUTOPOS= <>
##$BF1= 200.13
##$BF2= 200.13
##$BF3= 200.13
##$BF4= 200.13
##$BF5= 200.13
##$BF6= 200.13
##$BF7= 200.13
##$BF8= 200.13
##$BYTORDA= 1
##$CFDGTYP= 0
##$CFRGTYP= 5
##$CHEMSTR= <none>
##$CNST= (0..31)
1 1 145 1 1 1 1 1 1 1 1 1 1 1 1 1 1 1 1 1 1 1 1 1 1 1 1 1 1 1 1 1 
##$CPDPRG= <>
##$CPDPRG1= <>
##$CPDPRG2= <>
##$CPDPRG3= <>
##$CPDPRG4= <mlev>
##$CPDPRG5= <mlev>
##$CPDPRG6= <mlev>
##$CPDPRG7= <mlev>
##$CPDPRG8= <mlev>
##$CPDPRGB= <>
##$CPDPRGT= <>
##$D= (0..31)
0 0.7 0 0 0 0 0 0 0 0 0 0.03 0 0 0 0 0 0 0 0 0 0 0 0 0 0 0 0 0 0 0 0 
##$DATE= 1738319280
##$DBL= (0..7)
120 120 120 120 120 120 120 120 
##$DBP= (0..7)
150 150 150 150 150 150 150 150 
##$DBP07= 0
##$DBPNAM0= <>
##$DBPNAM1= <>
##$DBPNAM2= <>
##$DBPNAM3= <>
##$DBPNAM4= <>
##$DBPNAM5= <>
##$DBPNAM6= <>
##$DBPNAM7= <>
##$DBPOAL= (0..7)
0.5 0.5 0.5 0.5 0.5 0.5 0.5 0.5 
##$DBPOFFS= (0..7)
0 0 0 0 0 0 0 0 
##$DE= 6
##$DECBNUC= <off>
##$DECIM= 32
##$DECNUC= <off>
##$DECSTAT= 4
##$DIGMOD= 1
##$DIGTYP= 9
##$DL= (0..7)
0 120 120 120 120 120 120 120 
##$DP= (0..7)
150 150 150 150 150 150 150 150 
##$DP07= 0
##$DPNAME0= <>
##$DPNAME1= <>
##$DPNAME2= <>
##$DPNAME3= <>
##$DPNAME4= <>
##$DPNAME5= <>
##$DPNAME6= <>
##$DPNAME7= <>
##$DPOAL= (0..7)
0.5 0.5 0.5 0.5 0.5 0.5 0.5 0.5 
##$DPOFFS= (0..7)
0 0 0 0 0 0 0 0 
##$DQDMODE= 0
##$DR= 18
##$DS= 0
##$DSLIST= <SSSSSSSSSSSSSSS>
$$ [...]
##$SUBNAM0= <"">
##$SUBNAM1= <"">
##$SUBNAM2= <"">
##$SUBNAM3= <"">
##$SUBNAM4= <"">
##$SUBNAM5= <"">
##$SUBNAM6= <"">
##$SUBNAM7= <"">
##$SUBNAM8= <"">
##$SUBNAM9= <"">
##$SW= 18.0517328524113
##$SWIBOX= (0..15)
0 0 2 0 0 0 0 0 0 0 0 0 0 0 0 0 
##$SW_h= 3612.71676300578
##$TD= 16384
##$TD0= 1
##$TE= 0
##$TE2= 300
##$TE3= 300
##$TEG= 300
##$TL= (0..7)
0 120 120 120 120 120 120 120 
##$TP= (0..7)
150 150 150 150 150 150 150 150 
##$TP07= 0
##$TPNAME0= <>
##$TPNAME1= <>
##$TPNAME2= <>
##$TPNAME3= <>
##$TPNAME4= <>
##$TPNAME5= <>
##$TPNAME6= <>
##$TPNAME7= <>
##$TPOAL= (0..7)
0.5 0.5 0.5 0.5 0.5 0.5 0.5 0.5 
##$TPOFFS= (0..7)
0 0 0 0 0 0 0 0 
##$TUNHIN= 0
##$TUNHOUT= 0
##$TUNXOUT= 0
##$USERA1= <user>
##$USERA2= <user>
##$USERA3= <user>
##$USERA4= <user>
##$USERA5= <user>
##$V9= 5
##$VALIST= <valist>
##$VCLIST= <CCCCCCCCCCCCCCC>
##$VD= 0
##$VDLIST= <DDDDDDDDDDDDDDD>
##$VPLIST= <PPPPPPPPPPPPPPP>
##$VTLIST= <TTTTTTTTTTTTTTT>
##$WBST= 1024
##$WBSW= 4
##$XGAIN= (0..3)
0 0 0 0 
##$XL= 0
##$YL= 0
##$YMAX_a= 645591
##$YMIN_a= -641932
##$ZGOPTNS= <>
##$ZL1= 120
##$ZL2= 120
##$ZL3= 120
##$ZL4= 120
##$ABSF1= 10
##$ABSF2= 0
##$ABSG= 5
##$ABSL= 3
##$ALPHA= 0
##$AQORDER= 0
##$ASSFAC= 0
##$ASSFACI= 0
##$ASSFACX= 0
##$ASSWID= 0
##$AUNMP= <proc_1d>
##$AZFE= 0.1
##$AZFW= 0.1
##$BCFW= 1
##$BC_mod= 2
##$BYTORDP= 1
##$COROFFS= 0
##$CY= -3
##$DATMOD= 1
##$DC= 2
##$DFILT= <>
##$DTYPP= 0
##$F1P= 0
##$F2P= 0
##$FCOR= 0.5
##$FTSIZE= 0
##$FT_mod= 4
##$GAMMA= 1
##$GB= 0.15
##$INTBC= 1
##$INTSCL= 1
##$ISEN= 128
##$LB= 0.25
##$LEV0= 0
##$LPBIN= 0
##$MAXI= 10000
##$MC2= 0
##$MEAN= 0
##$ME_mod= 0
##$MI= 1.114404
##$NCOEF= 0
##$NC_proc= 0
##$NLEV= 6
##$NOISF1= 3.799351
##$NOISF2= 2.8
##$NSP= 1
##$NTH_PI= 0
##$NZP= 0
##$OFFSET= 14.38212
##$PC= 1
##$PHC0= 242.3605
##$PHC1= 17.59223
##$PH_mod= 1
##$PKNL= yes
##$PPARMOD= 0
##$PSCAL= 0
##$PSIGN= 0
##$REVERSE= no
##$SF= 200.129724274929
##$SI= 16384
##$SIGF1= 3
##$SIGF2= 2
##$SINO= 400
##$SIOLD= 16384
##$SREGLST= <1H.CDCl3>
##$SSB= 0
##$STSI= 0
##$STSR= 0
##$SW_p= 3205.1282051282
##$SYMM= 0
##$S_DEV= 0
##$TDeff= 0
##$TDoff= 0
##$TI= <>
##$TILT= no
##$TM1= 0
##$TM2= 0
##$TOPLEV= 0
##$USERP1= <user>
##$USERP2= <user>
##$USERP3= <user>
##$USERP4= <user>
##$USERP5= <user>
##$WDW= 1
##$XDIM= 8192
##$YMAX_p= 0
##$YMIN_p= 0
$$ End of Bruker specific parameters
$$ ---------------------------------
##NTUPLES= NMR FID
##VAR_NAME=  TIME,          FID/REAL,        FID/IMAG
##SYMBOL=    X,             R,               I
##VAR_TYPE=  INDEPENDENT,   DEPENDENT,       DEPENDENT
##VAR_FORM=  AFFN,          ASDF,            ASDF
##VAR_DIM=   8192,          8192,            8192
##UNITS=     SECONDS,       ARBITRARY UNITS, ARBITRARY UNITS
##FACTOR=    0.0002768,     1,               1
##FIRST=     0,             0,               0
##LAST=      2.2672688,     0,               0
##MIN=       0,             -641932,         0
##MAX=       2.2672688,     645591,          0
$$ Real data points
##PAGE= N=1
##DATA TABLE= (X++(R..R)), XYDATA
$$ [...]
1915A27Om69L12J58j09R1j1j5k80l9L16j39j71J92J63p3M8p6k06J04j56J54K8
1938d5l6J86j96J39J34j63J87l03K6M9L10o8k9l29J79l12K48j68K35j31J86k47
1960a48L79j27l49KJ63J14q4j1k17J78l7L02j6j71J10k39L2J63J94j86K7J7j09
1983a3R2j42q3j3J53J47j96j33J55K4J23r5K2m6l6n7K3KL4J40j39J81j52M1K30
2008B62j10l29M65l65O7K00p9j5j4j85J25K07m83M98j58j06O3p7j62J11L4q2K4
2031a09K62j69l2Q0L21m13Q4J28j75K03L5j70j35J40J44k09l17L31k8r7R5K05
2053A74j74j64j01J08K76o8k58L35j44J37K2j82n4J05j25j49J73J73M6J16lo86
2075d43M93k20J61K07m79N33k05j38J72J32k34p4N8J2j16J01J32m12L48J60j83
$$ plain form
1915 127 133 -336 -24 134 25 116 105 90 -190 -229 87 -52 -223 -31 132 59 107 31 -175 -71 -227 -73 -45
1938 -45 -81 105 -91 48 182 19 206 -97 -71 -22 288 220 191 -138 41 -271 -23 -191 44 -87 99 -148
1960 -148 231 104 -245 -243 -80 34 -50 -61 -278 -100 -137 165 149 -22 88 -151 -119 44 238 52 79 96 -13
1983 -13 79 -63 -146 -159 -6 141 -55 -188 -33 -9 114 19 41 -5 -41 -98 -75 -73 -39 101 -38 143 -9 32 262
2008 262 152 -177 288 -77 -10 190 111 96 82 -103 22 229 -254 244 86 -20 43 -34 -196 -85 -51 -133 -109
2031 -109 153 -16 -48 32 353 -60 24 152 -23 180 215 45 -90 50 194 -15 -332 -1 -29 -126 -31 174
2053 174 0 -164 -265 -157 119 51 -207 128 -16 121 143 -39 -93 12 -113 -262 -89 84 130 246 243 -443
2075 -443 50 -170 -9 198 -281 252 47 -91 81 213 -21 -95 -37 -25 -141 -40 92 -320 28 188 5
2096EJ07k5j88J21k87K39p8N5l7J18N6r8j24K62j25j80L61j35l4P1J11k35P2k41
2120b09j20L66o7J72J96k84k61J30r1K81K0k16Q1K58l44O4L68j62j15l7J17j04
2142D3j53Q0k83J97K46j52K21l60L67j86O7j58Lj48q7M36j94J41j96r0L94J83
2164C71l58l6K40l93k60N56O0k73J63J1Oj95q2J25K7n4Nj78K54L4r9N6k43J54
2188a09L8l47L82k01K44J23l35L25l98O3J81J72j77K46l09J68l3j9O7k30J00l7
2210h6q9Q6O6jJ90k40K03k59J03M37m60O5p1J27k42K61n0k27L22k64J70K35n09
2233b33j5K87j24J38K02k57l0j32M18j80j43m4R7K30M6k12j16Q3m7r7J76j06J38
2256G9j32o4K57o3k53L35k34k16K48L1l9N0O5m4P3p0l04M86q6P7j70M9k98L40
$$ plain form
2096 5 112 87 -101 20 -267 -28 -106 -51 -88 30 86 -12 -136 126 1 -179 182 47 13 84 195 -40 32 -209
2120 -209 -329 37 -30 142 338 54 -207 -77 -168 113 133 -83 -2 256 -88 -24 344 182 67 30 147 43
2142 43 -110 -30 -313 -116 130 -22 199 -161 206 20 87 -71 -68 -216 -303 133 -61 80 -116 -206 188 371
2164 371 13 -23 217 -176 -436 120 180 -93 70 81 87 -108 -190 -65 -38 -92 -87 -265 -11 23 -76 -20 -263 -109
2188 -109 -71 -418 -36 -237 7 130 -205 120 -278 -215 -34 138 -39 207 -102 66 33 14 81 -149 -49 -86
2210 -86 -175 -89 -23 -24 166 -74 129 -130 -27 410 -50 15 -56 71 -171 90 40 -187 135 -129 41 276 -233
2233 -233 -248 39 -85 53 255 -2 -32 -164 254 74 -69 -113 -16 214 260 48 -68 15 -32 -129 47 -59 79
2256 79 -53 -117 140 77 -176 159 -75 -291 -43 -12 -51 -1 64 20 93 23 -281 205 119 196 26 75 -223 117
2280A17j07j22k8P0n2K92l23j39N05j25o5J80k30j79O4rL35L0j46k08J90J3M7
2303A10n1O2j22j9K95q3n6l10J95j44J38K7q7o4L38k98O8J71j2lK0j48l18K09
2327h2R0L0P8J06l50j78L53L8r6j16L44k75K38j71l2NJ29p3K64j97k12J44j05
2350f8K6J39j39j31J7J55m7N20m47n6p0kJ08m09N54j41J07k51J22M2j17j05K38
2373D5o0k7l2K36k68k1J25l52M21r4J13Oo4k69K89J4j58N1O8J50j97K9l12L09
2397BO2K47k87p5R1R6j04j4k27L86j13j64k65K67K70j56J68l01L15k12j65K73
2419I4M0k49K82j52k4n1L49L9l62Q3Qj03K17k82l1K66l03J10J50L0j78j15L01
2442A19kk39p5L84k11j35K38n1j68J28j54J75J9L3k43m4J22m9M5M06j30l14L12
$$ plain form
2280 117 10 -112 -140 -70 -122 170 -153 -292 213 88 23 203 -27 -206 -142 -151 184 214 68 -140 50 63 110
2303 110 59 121 -1 -20 275 192 136 -174 21 -123 15 42 -45 -109 229 -69 -1 170 158 155 175 27 -291 -82
2327 -82 8 38 116 222 -128 -306 47 85 -11 -127 217 -58 180 9 -23 -18 111 38 302 105 -107 37 -68
2350 -68 -42 97 -42 -173 -156 -1 -48 472 25 -31 -101 -103 5 -404 150 9 116 -135 -13 29 -88 -193 45
2373 45 -15 -42 -74 162 -106 -127 -2 -354 67 -27 86 92 28 -241 48 62 -96 -45 23 173 -24 5 -307 2
2397 2 64 311 24 -51 40 136 32 18 -209 177 64 -100 -365 -98 172 16 184 -117 198 -14 -179 94
2419 94 134 -115 167 15 -9 -60 289 328 -34 49 57 -46 171 -111 -142 124 -179 -69 81 111 -67 -182 119
2442 119 117 -122 -197 187 -24 -159 79 28 -140 -12 -166 9 28 61 -182 -226 -104 -153 -108 298 168 -146 166
2465A66k13L22J6o7o4k90N4J05n6MR5P3j93R9n4M6QJ74k43r9M1J31J49r9l9R9
2491A65j56n1Q8n0K27k44j16j04o9N8L98j89k17K4N53k65j83L2K05k59K78r2J20
2514A53o5j52K14j64q0L04l08L55j5m29J22J84k28Q9J35j67N7j85J65j13K76j80
2536c2k43K41J4n5M23l50k74K93r4J54l8j80K07Q8j41j01J48l4Oq8K69j34Knk2
2561E4k04K37k96P2K48j28K70k23r0J24J16k57J01j34K95J1L7r4m77M27j25J76
2583A40Jl80K75K20m26O1J18R6n2QK3j65L23k08J0j10J16Qj44J30K10k43L45n97
2607b41M26j64j23J18J45j24n2L6j9k27Q9M90k96m0k70K90mj9j35M1N0O6l53J11
2631b05L53p1j46q1K56j36L56k43k77K78j2l10L24l18J81j81K82P0J87l69k5Q2
$$ plain form
2465 166 -47 275 291 224 160 -130 -76 29 -27 -23 72 145 -48 51 -3 43 51 225 -18 -117 -76 55 204 105 66 165
2491 165 9 -42 46 -4 223 -21 -137 -241 -310 -252 146 -43 -260 -236 317 52 -131 -99 106 -153 125 33 153
2514 153 88 -64 150 -14 -94 210 -98 257 242 -187 -65 119 -109 -20 115 -52 5 -180 -15 -128 148 -32
2536 -32 -275 -34 -20 -75 348 -2 -276 17 -77 77 39 -141 66 154 13 -88 60 26 32 -56 213 79 81 76 54
2561 54 -150 87 -209 -137 111 -17 253 30 -60 64 180 -77 24 -110 185 196 233 139 -338 89 -36 140
2583 140 141 -239 36 256 -170 -109 9 105 53 61 84 -81 242 34 44 -66 50 58 -86 44 254 11 356 -241
2607 -241 185 21 -102 16 161 37 -15 21 2 -225 -136 354 58 18 -252 38 34 15 -120 -79 -29 37 -316 -205
2631 -205 148 77 -69 -150 106 -30 326 83 -194 84 72 -238 86 -232 -51 -232 50 120 307 -62 -87 -5
2653em6O5o6j00QJ32qJ5n9K25j01J25j66j11J16k01Lj20K62l68K62K48k20L4n6
2678a32J52J46l54J54K02M1n9n3j68K2J34j21J6P4m02M71j55q7J68L0j2j30p2
2701a35L09j33l8L5L40m17J21k23R8J94r4J6m6oj3M0j69J48k7J36m0Rp8L06l05
2726B8qk76O11j98k24Pj20J86j85K07n4J04k31j8K63J04l29J23J75j88J14k19
2748a28N6K22k7k80K88j59J53K5j47P8j38K54k1Lj66Q7k20K81k4J7m17O8J43n
2772e7L32ml58m3R1K10k53l3J31P9k68J52L7r5K1L11k26l2J42k01J51k60Q8J7
2796f8M8Jj56j8K39N9jk11R3Oj95L7K53k31N8K50j64j80K48j60J72J51p8r5p4
2821a6O8j7pk45L38l22K88j20o9J39J14j23j38j64J51L10n05J6L58J4j56M0J93
$$ plain form
2653 -5 -51 14 -52 -152 -144 -12 -20 -5 -64 161 60 185 19 -92 24 -177 -174 -294 -32 -400 -138 110 -110 -76 -132
2678 -132 20 166 -188 -34 168 209 150 97 -71 -49 85 -36 -20 54 -348 123 -32 -119 49 79 67 -63 -135
2701 -135 174 41 3 38 378 -39 82 -141 -43 151 57 73 27 21 8 48 -121 27 0 136 96 105 27 333 28
2726 28 20 -256 355 157 -67 -60 -180 6 -179 28 -26 78 -153 -171 92 196 -133 -10 165 -23 91 -128
2748 -128 -72 150 123 -157 131 -28 125 150 3 81 -57 197 176 179 13 100 -120 161 137 154 -263 -195 -52 -57
2772 -57 275 271 -87 -130 -39 171 -82 -115 16 95 -173 -21 16 -79 -58 253 27 -5 137 -64 87 -173 -85 -68
2796 -68 -20 -19 -175 -193 46 105 104 -107 -14 -8 -203 -166 87 -144 -86 164 0 -180 68 -92 80 231 153 58 -16
2821 -16 52 35 28 -217 121 -201 87 -33 -102 37 151 28 -110 -274 -123 187 -318 -302 56 70 -86 -46 147
2844A47j04k9O4l5j6k1j83K15l0K81k06J01Q5l93L82r3j24j57OO7L86l56J37j04
2868B0QJ52j39pJ4k0l33K95K15l50L00k59j9P8J44k22J08J46m39J17M7J93k49
2891b00J14M4J14l31K65O1j91R0J03J91m76N8L69k15J37j72J92k05j9nO2J76k70
2914a08j08q3N43k51J04p1J9o9q4L2L58k89q3K38k80J39J80m47L94j44J3O4J30
2937A97k02j35J86K2k15N2j02J9J04L2N52p21L44L0k69J64k0M5n3J25j00l17L37
2960G5j38l3K05k24J76j94L05k76J90k6n5l40N71l83P1J85O5r9n3j3j28J26K62
2983B69j35m01L39j05K01k20L67j72k79q9P6K02R9j07k38K04J01K5l52R2O9J0
3005d4K05Q9k83j92J91N1O1j83O0O1j13N0J4J30k61P8j6N19l72QO9l8J06k54K30
$$ plain form
2844 147 43 14 78 43 27 6 -177 38 8 289 83 184 269 -124 258 165 41 -116 -110 -43 343 -13 124 20
2868 20 28 180 41 34 48 28 -305 -10 205 -145 155 -104 -123 -45 99 -123 -15 131 -308 -191 -144 49 -200
2891 -200 -86 -42 72 -259 6 67 -124 -34 69 260 -216 -158 211 -4 133 -39 153 -52 -71 -76 -14 162 -108
2914 -108 -216 -299 244 -7 97 26 45 -24 -108 -76 282 -7 -90 148 -132 7 187 -260 134 -10 3 67 197
2937 197 -5 -140 46 68 -147 -95 -197 -178 -74 -42 510 -211 133 163 -106 58 38 83 30 155 55 -262 75
2960 75 -63 -96 109 -115 61 -133 172 -104 86 60 5 -335 236 -147 -76 109 174 75 22 9 -119 7 269
2983 269 134 -267 72 -33 168 -52 315 143 -136 -225 -149 53 152 45 -193 11 112 137 -215 -123 -54 -44
3005 -44 161 250 -33 -225 -34 17 78 -105 -45 16 -97 -47 -33 97 -164 -86 -102 417 45 53 122 84 190 -64 166
3030A66k66L11l81J71J8R4j82L0K40l83J71K39j53j02K66q4j01j94M3J69j08k
3052c8l5Q4J65p0m6j58Q6K51J9j37k02M0j60J14K45k07M7N2J74k59L87k10l09
3075a67L17j0O2j61m5j18P6r4L84k25J79L9Q1m23K33J95l94J58k3j67J33j66K38
3098A02k92n0N21n89K88K80k65m33M82k11K75n7j7K98n03K74j54L17k94o5j11
3119b04L40j33J97j90J5j04rJ42J08j01j87J61j02R1L8j24L2qL10l30q2K03p7
3142a4m8RJ3K21k81q8J37J71p0K04l39J17k68L10j51J44OM6j67J15j59k2K5J18
3166B9Jl26J6J85J11K9r8L24j01k62N2P8K28j99MP7j71K9l8J54m5j34j23K22p0
3191b8J8J74k20J35j83J44j14R9P8M5r6Ok6J32J78m53n9L03j01r0L45O6l20L3
$$ plain form
3030 166 -100 211 -170 1 19 113 -69 -39 201 -182 -11 228 75 -27 239 155 54 -140 -97 72 -36 -38
3052 -38 -73 11 176 106 60 -98 -12 239 258 121 -81 -41 -201 -87 158 -49 -2 50 224 -35 352 142 -167
3075 -167 150 140 202 41 -4 -122 -46 -140 244 19 198 237 318 -105 128 323 -71 87 64 -103 30 -136 102
3098 102 -190 -240 281 -308 -20 260 -5 -438 44 -167 108 51 34 332 -171 103 -51 266 -28 -93 -204
3119 -204 136 3 200 10 25 -79 -88 54 162 61 -126 35 -67 24 62 -62 -30 -38 272 -58 -140 63 -14
3142 -14 -62 -53 -40 181 -100 -188 -51 120 50 254 -85 32 -236 74 -77 67 73 119 -48 67 -92 -114 -89 29
3166 29 30 -296 -280 -95 16 45 -53 271 170 -92 -40 38 266 67 71 148 -23 6 -32 122 77 -57 -180 42 -28
3191 -28 -10 164 -56 79 -104 40 -74 25 103 148 52 58 32 164 342 -111 -170 133 32 -58 287 353 33 66
3215F6K5l47L71r4J1j64k87J67K89K00k27M6rj3j19L11l12K06m4K2l8j31J97J25
3239B51l96M57l73J05l58J53K63J85k96j4Q8k70J77j31J54K80k81K7k5J18j09
3260Ek81J01Q7J66L9p3P8j78%k63L9N11q5q2n7Lq6r8J34j58KN26Q0m17L9j48R6
3287b0j33%L46m12K09J42rJ90k67L9j56q9M1K52j75r6P7PN7J77j83K05o1N0Rl96
3313a96J44j3k74M04K8jj76l15O54k52m8o0p6L19l04P9K40j25K12j89O1q4l1k95
3337b98M65Q5j50K9m4l14K00J31q2o9k13J56Q7qK85j52k33J85k82K08o9j9J16
3360A4q8K84k96L00j95L4l3j92L61j95O8k21J11J65K9j23P9rm0k7j31K92q7j7
3384H3o6K9K1J56l40K08L2k63K76k44P9n6K03l85R0L66l93M2j45L16l8N3J46j64
$$ plain form
3215 66 91 -256 115 21 32 -132 -419 -252 37 237 10 56 47 34 -85 226 -86 120 76 98 60 -71 126 251
3239 251 -145 312 -61 44 -314 -161 102 287 -9 -23 65 -205 -28 -159 -5 275 -6 21 -4 114 5
3260 5 -276 -175 -88 78 117 44 122 -56 -56 -319 -280 231 146 64 7 10 -76 -174 -40 -198 -196 330 410 -7 32 -116 -20
3287 -20 -153 -153 193 -219 -10 132 123 313 46 85 -71 -160 -119 133 -42 -138 -61 -54 3 180 -3 202 141 191 200 -196
3313 -196 -52 -65 -339 65 93 92 -84 -399 255 3 -45 -105 -181 138 -166 -87 153 28 240 51 112 28 -3 -298
3337 -298 167 252 102 131 87 -227 -27 104 22 -47 -260 -104 -17 -25 260 108 -125 60 -222 -14 -83 -102 14
3360 14 -74 210 -86 214 19 53 20 -172 189 -6 62 -159 -48 117 146 23 102 93 53 26 -105 187 100 83
3384 83 17 46 67 223 -117 91 123 -140 136 -108 -29 -85 118 -267 -177 189 -204 -162 -307 9 -29 24 170 6
3408FQ2k6J02n72L70O8k7k84L98n5k15K4K81K4n8j31r1J74R0m18K37K09k37j46
3432a95L79K9k57R4q0qk5O9j3O1j63lN5K56j37l8j68Q8L6k29L27K00n16J71j88
3457b55J61L0N8P2j47n7P2M51m24L3O8j36L20j15j34k7o8O4l11O31n4l46l0J91
3481D7J79j89m5Q5j27KPJ4K33l1j1P9j89P1k20R0k88J83N0j7J92j21m4M8k82K99
3507A5J72j64k87K04p3J89J56k58J2R9l14J54m9L9J92Nj73j02K70o2K5n4J11k3
3531H4k09J05Ml64K98K08j38R9M4m12K35J69M1k38P1K16m37K15k59K31R8N5k11
3554i5L9Lj57K17L83k52o0j6j69P8j08K94m22M47j87J6O9l34J13k7J32O5Rl6j24
3579a22q4L39j55j11n3L24K96o60J10L20Q0j21j96K8M9J3j59K40O6j06j63K64
$$ plain form
3408 6 88 62 164 -408 -38 30 3 -281 117 62 -153 -129 152 176 118 -13 -104 70 160 -258 -21 188 -49 -195
3432 -195 184 213 -44 50 -30 -38 -63 6 -7 54 -109 -112 -57 199 62 24 -144 -56 -20 -249 78 278 -238 -67 -255
3457 -255 -94 -64 -6 66 -81 -138 -66 385 -39 -6 62 -74 246 131 -3 -30 -98 -34 -345 286 232 -114 -144 47
3481 47 226 37 -8 77 -50 -48 -41 -27 206 175 164 243 54 125 -95 -5 -293 -110 -60 -77 115 -6 -50 -2 -284 15
3507 15 187 23 -264 -60 -133 56 212 -46 -34 65 -249 -95 -144 -105 87 92 -81 -183 87 25 50 -4 107 84
3531 84 -125 -20 -16 -380 -82 126 -12 87 131 -281 -46 123 164 -74 -3 213 -224 -9 -268 -37 61 116 -95
3554 -95 -56 -53 -210 7 390 138 78 62 -107 -29 -137 157 -265 182 -5 11 80 -254 -141 -168 -36 29 38 2 -122
3579 -122 -206 133 -22 -133 -186 138 434 -226 -116 204 284 163 -33 -5 44 57 -102 138 204 98 -65 199
3601A99k06k78M76j22k08M31j10o5k54P2k5J96n9l9m0J15J91l04k6K47j15j19
3623d3K69k40L43l30K63l22M9L1M1n5K3Q3P8j01m8J6K82k60m44M75n7j89J52j27
3647a11J7K14j7j03l17N93j6n37L30L3n7r1J42mR6j75K30l45J55J07k02k1r1M89
3671C19j92j23NK26m2j69m4O8K1r1K8r3m3K4J39j02L1K20P0j12J24j92k24R6L8
3696a8j67J66L6K17p1p7J25p5j52K66n04K81p4J15l29L58o6%J28p5Mk06J22L8
3720D2J7k44L61m86K56J06k00M51l09M4j14M5K42l45J26j86J69R8k33O7Or8J25
3743f0L8O4k27L45j76N1N6j29K11L6j88M3q1K38r3j10j73K89N4j78Q1N0l92K79
3767B8k13L43k85O4K14r5j17L03l47K50l21N5J47r9J4j61Q0J0K52k28J54J42l28
$$ plain form
3601 199 -7 -285 191 69 -139 292 182 117 -137 -65 -90 106 47 8 -32 83 274 -30 -56 191 76 -43
3623 -43 226 -14 329 -1 262 -60 -11 20 61 6 29 112 190 89 41 57 339 79 -365 110 53 -136 16 -111
3647 -111 -94 120 103 0 -317 276 260 -277 53 86 29 -62 80 76 172 -3 227 -118 37 144 -58 -79 -170 319
3671 319 127 4 9 235 193 24 -20 48 69 -22 6 -87 -130 -106 33 -69 -38 182 252 140 264 72 -152 -56 -18
3696 -18 -185 -19 17 234 163 86 211 136 -16 250 -254 27 -47 68 -261 97 31 31 159 84 88 -118 4 42
3720 42 59 -185 176 -310 -54 52 -148 303 -6 38 -76 -31 211 -134 -8 -194 -25 73 -160 -93 -87 -185 -60
3743 -60 -22 42 -185 160 -16 35 91 -38 173 209 21 64 -17 221 128 18 -155 134 188 10 91 141 -251 28
3767 28 -185 158 -127 -63 151 56 -61 242 -105 145 -176 -121 26 -73 -59 -220 -140 -130 122 -106 48 190 -138
3790a38J12J24j63K2qk12L21L66o02R7K01j31k93K45Q2k10K99m8j45P3K83l92
3812a17L03j26r1J02k9K85k70m1k92K3J47K2j56J47N2J74r7r1J23N2L6l10j2j24
3836b90L90j77j35M18k6j68j03J09kk68J95q0K42ll25K11k26J78J52j37L9Lk38
3859b41L41q6j63J17J90L8k41j16J00Q1j60nK34j74j39L34k08R4j55L84j09l31
3881b15L17j03l02M18J08j95M2o5j4K71j45r4m2L5J23k24q7P4R0l23M21n7m0n4
3905f1R1J4n5k46K77R7l16K51k8oR3m7k04J1J47j70P0Q1qK7j59N3J91j86J39k74
3931b18M75j48j8N9r8R6j42%j19r7L14m8j13Lj4J12j54J10k87L66j23Oj72K35
3955B5K92l21l0Mk6K65j71j35J11J67j80l9r0m7K21q5j03P4L0n2J56j04m1J68
$$ plain form
3790 -138 -26 98 -65 -43 -51 -263 58 424 -178 -81 120 -11 -304 -59 23 -187 112 64 -81 -8 275 -117
3812 -117 186 60 -31 71 42 327 57 16 -276 -253 -106 -84 -240 -93 -41 133 36 -55 68 120 156 -154 -166 -290
3836 -290 100 -77 -212 206 180 12 -91 18 16 -252 -57 -137 105 102 -223 -12 -238 -60 92 -45 -6 -3 -241
3859 -241 100 14 -149 -32 158 196 -45 -161 -61 20 -140 -145 89 -85 -224 110 -98 -4 -159 225 116 -215
3881 -215 102 -1 -303 115 223 28 70 5 -9 262 117 23 -19 16 139 -85 -172 -98 -8 -331 90 33 -7 -61
3905 -61 30 44 -11 -257 20 117 -199 52 24 18 111 64 -140 -129 18 -152 -82 -1 -9 18 -141 -88 103 -83 56 -218
3931 -218 257 109 91 150 52 148 6 6 -113 -210 104 56 -57 -54 -68 44 -110 0 -287 79 -44 -38 -210 25
3955 25 317 -4 -34 -30 -56 209 38 -97 14 181 1 -38 -128 -175 46 -39 -142 -68 -38 -90 66 -38 -79 89
3979H9j16l3K18n0r1k14Q3J27K18j10k13R1J66j37k14K31l43K36J01k06K72p0
4001C5l62K49k07K55j55L11R2k19k56J75Q7k36O0K94j60%K59n33M70k63K02M8
4023A46l33J76j34L3M22l30rJ92J59j61l96L31j54j9L06k27j6p6J32j22K94k19
4045ej69J82J45k74p7L63l95K77l9l4k12J94o8J63j22j10M41j78k10J68MJ31O0
4068B35l25J57J98l28k7O4J62J68l16k39L13k82J44J92j15P7k4j19J68k7j55r8
4090a77J93O3r9J36O4j93J4J6k7j6j61Q0j6R6l21L38kO6qq0n0J32j1K1m5J4q6
4117e9N6KpJ18j06J28oJ21m05J87j24J54L7J66l14J62p7K01j58J4J0q0m4P5J06
4142A57k37J82k32J73j73R2m3om9J14J66L4j56J18k1m0j3j24o2o9K31j83K68j86
$$ plain form
3979 89 -27 -60 158 108 17 -197 -114 13 231 121 -92 -1 165 28 -186 45 -298 -62 39 -167 105 35
4001 35 -327 -78 -285 -30 -185 126 218 -1 -257 -82 5 -231 -171 123 -37 -37 222 -311 159 -104 98 146
4023 146 -187 -11 -145 -112 310 -20 -29 163 322 161 -235 96 -58 -77 229 2 -14 -90 42 -80 214 -5
4045 -5 -174 8 153 -121 -198 165 -230 47 8 -26 -238 -44 -112 51 -71 -181 260 82 -128 40 44 175 235
4068 235 -90 67 265 -63 -90 -26 136 304 -12 -251 62 -220 -76 116 1 78 54 -65 103 76 -79 -177
4090 -177 16 79 -20 116 180 -13 1 17 -10 -26 -187 -107 -123 -27 -348 -10 -12 54 46 -34 -84 48 37 58 13 27 -59
4117 -59 -3 -1 -8 110 4 132 126 247 -158 29 -95 59 96 262 -52 110 33 234 76 90 100 20 -24 51 157
4142 157 -80 102 -130 43 -130 -38 -81 -87 -136 -22 144 178 22 140 119 79 66 -58 -120 -189 42 -141 127 -59
4166e9j70L27K6L9l55O2RJ04j8k08J50l2K86o0Q1K2j15o3j38L81m50J55J91k13
4190d8R4N5J92k63p4K24l69J7J8J49j1p2J24k15K8M95n02O6q0J34J08j17q5P2
4214f0L2j58Q8j01K84L01m16p5J15o8J34j38K39m3Kj41m0J52k09K17kl38J86o1
4238a00J05j70M12j21k19J27J69l13L7j10K70o0j23L0J77p1M2k39J85j6P1m8j27
4261i2lK56k63J15J3p8K29q9J7j08J09k72L36nj82L92n90L60j07j08k8J30K4N9
4285A15%j45j55L90J07l08n1J60q9K68l71K35m75M38k72K56j84J61M7ol88J88
4307g9K31k36j9J00J08Q6m42L01k68L47p1R8r5P8j17p8k5R2k3O4q6j47M08l14
4331h7M5n8J48j56J54J9l09M9J19K6p4J79j23J41k05O8M2r3J51M4j43K83j09l43
$$ plain form
4166 -59 -229 98 124 163 -192 -130 -121 -17 -35 -243 -93 -125 161 101 182 204 89 26 -112 269 -181 -26 165 -48
4190 -48 46 101 293 30 -44 180 -189 -172 -154 -5 -16 -88 36 -179 -151 344 -158 -92 -172 -38 70 -47 -132 -60
4214 -60 -28 -186 -98 -199 85 386 -30 -105 10 -58 76 -62 177 134 136 -5 -45 107 -102 115 113 -225 -39 -100
4238 -100 5 -165 247 126 -93 34 203 -110 -73 -183 87 27 -96 -66 111 40 82 -157 28 12 83 35 -92
4261 -92 -95 161 -102 13 26 -52 177 88 105 -3 106 -166 170 165 -17 375 -215 145 38 -70 -98 32 56 115
4285 115 115 -30 -185 205 312 4 -47 113 24 292 -79 156 -319 119 -153 103 -81 80 127 121 -267 -79
4307 -79 152 -84 -103 -3 105 191 -251 50 -218 129 58 156 61 139 22 -56 -81 11 -12 52 -34 -181 227 -87
4331 -87 -42 -100 48 -108 46 65 -244 -195 -76 -50 -124 55 -68 73 -132 -64 -22 -115 36 80 -63 220 111 -232
4355b32J60j66k9M07m10mJ87m27M94M31l61j42J45j21J07j25K44k15k11M48j30
4376E0R2L8o72L94M6rJ74j8j23J69n0j27l5J40j27Q0Nj26L17j29j25l21N70j08
4400A05j3p2JJ48l57J25Lq3J84q0L8j72K75k5O9l13K24r5K9K16m45M36l66K98
4424A30l76L1L05k11J1pJ06K3N3k4P8k01J5L27k96J50j8L8k32K05q0q6q3p1K27
4449A4J5k05J87k1k8L1j24L14k80K53l62L36k46L13k78J45p6j7j06J64p3Q7R7
4472A40k8j17k3K64j17J21j95q8j13J95J48r1k89mM97l94j10K41j84O6J7P2kK5
4496C1N8l58L52k35L15j37Q4p2Q1j02r5l8J31j4k6J85o0j09J40o4j73J34q3J44
4520H9l08K59K07O4k57J4j96J15K44Q8m73P5o6J40r3l7K34k51oJ41j03r0M67k71
$$ plain form
4355 -232 -72 -238 -267 140 -270 -274 -87 -514 -20 411 50 -92 53 -68 39 -86 158 -57 -268 180 50
4376 50 142 180 -492 -98 -52 -61 113 95 -28 141 91 -36 -71 69 -58 22 27 -99 218 89 -36 -357 213 105
4400 105 92 20 21 169 -188 -63 -60 -143 41 -39 -1 -173 102 77 146 -167 57 -38 -9 207 -238 198 -168 130
4424 130 -246 -215 90 -121 -110 -117 -11 12 65 41 119 -82 -67 260 -36 114 96 134 -98 107 27 -59 -142 -213 14
4449 14 29 -176 11 -10 -38 -7 -131 183 -97 156 -206 130 -116 197 -81 64 -12 -29 -135 29 -44 43 140
4472 140 112 -5 -28 236 119 240 45 -43 -156 39 187 96 -193 -197 300 -94 -204 37 -147 -81 -64 8 6 31
4496 31 89 -269 83 -152 163 26 110 38 119 17 -78 -116 15 1 -25 160 100 -9 131 67 -106 28 -55 89
4520 89 -219 40 247 311 54 68 -128 -13 231 319 -154 -79 -145 -5 -98 -135 99 -152 -158 -17 -120 -210 257 -14
4544a4J29K3l03K67k64j51N00l70Q9L84k48mj11k18K05j45L44J83l29k49L72q5
4566EjK33k00k65L17j66K55j52J03k16J50K02j95R1l36J89n2J10k15J27Jq8k70
4589c73K08J09r4R2K63m12J52K86k86J76m92M58J60r0L2k22rk19L37J4m4k2Kk20
4613a94L39k09qO3k1P2J7NK56l92P1J54k39P3J3j19J80K62m48K80j22P3k9k27
4637a50P3R2j07nJ06m7K07l41O1P7J98j57O0o4j25J73l88K64R3L02o77J49o9L79
4661A04k3j26J90k13O6J3j8k8R1M4RJ04k69j59J60M17l97P2k27K59p5k0L49k50
4685G3j62J32m16N93l57J07O2j23J83l42K65k60K54k38J51J53q0O6J15o0q1j03
4707f8K68j77l5j48N8J78m34O24l68j2L79l46J66j37M9K60q8j25J09K2j04k68
$$ plain form
4544 -14 115 138 -165 102 -162 -313 187 -183 -94 290 42 38 -73 -291 -86 -231 113 296 -33 -282 90 5
4566 5 4 237 37 -228 89 -77 178 26 129 -87 63 265 70 161 -175 14 -38 72 -143 -16 -15 -103 -373
4589 -373 -165 -56 -150 -58 205 -207 -55 231 -55 121 -371 87 247 157 189 -33 -42 -261 76 90 46 24 26 -194
4613 -194 145 -64 -72 -9 -30 42 59 64 320 -72 -1 153 -86 -13 0 -119 61 323 -125 155 33 106 77 -150
4637 -150 -77 15 -92 -97 9 -38 169 -172 -111 -34 164 7 67 3 -122 51 -337 -73 20 322 -355 -206 -275 104
4661 104 81 -45 145 -68 -2 11 -7 -35 56 100 109 213 -56 -215 -55 362 -35 37 -190 69 -6 -26 323 73
4685 73 -89 43 -373 220 -137 -30 32 -91 92 -250 15 -245 9 -229 -78 75 -5 61 176 116 35 -68
4707 -68 200 23 -12 -160 -102 76 -358 266 -102 -114 265 -81 85 -52 -3 257 169 44 153 175 71 -197
4729a97L05N9j94L5k92J39L23pP1l64J35J4j45M4M3J32n5k33J41L02q8j07p9j45
4753a63q1j62N04R6l26K94k46j17Q3K08k60J08L94l62K13l54k1K48P5j67K15j88
4775iK96k64j26J54R4k35O6j31K20l82L0L94Pj11q4p7k5m5K2J22K03k09M8L28
4799B86n65K07J59k19K96l41J47J45j70L6J96j45qN9K9j54Q8j47j62K13q1m5J55
4822b1P6j73R9J52j53K4P6k61J20J10R9l31J26k77K53j29Q8K88q0J38j89J87j24
4845I8RK5k57O2J45p7k9n3r1K53q5k25M19O8J47n11m1k1K38j3k52J5J22Jj22J42
4871c3J00j82K98m57J87K1J55j87N5l59L00L40p5l01J82k17J87L23m04N4J38j3
4893A12k84j94L14K0O3j57L7q3L9M33m05p7J56o2K00j38N6j95J88k64k6M82j72
$$ plain form
4729 -197 108 167 -27 8 -284 -145 178 171 242 -122 13 27 -118 -74 -31 101 46 -187 -46 256 168 61 -18 -163
4753 -163 -244 -406 98 194 -132 162 -84 -201 -118 90 -170 -62 332 -30 183 -171 -192 56 131 -36 179 -9
4775 -9 287 23 -103 51 145 -90 -24 -155 65 -317 -287 107 114 3 -81 -158 -183 -228 -206 -84 119 -90 -42 286
4799 286 -279 -72 87 -132 164 -177 -30 115 -55 -19 177 32 24 83 112 -42 46 -101 -263 -50 -131 -176 -21
4822 -21 55 -118 -19 133 -20 4 80 -181 -61 49 148 -183 -57 -334 -81 -210 -122 166 86 224 35 222 98
4845 98 107 132 -125 -63 82 5 -24 -77 -168 85 0 -225 194 262 409 -102 -143 -164 74 61 -191 -176 -54 -53 -175 -33
4871 -33 67 -115 183 -274 -87 -66 89 -98 -43 -402 -102 238 163 -138 44 -173 14 337 -67 -13 125 112
4893 112 -172 -366 -52 -32 31 -126 -89 -172 -133 300 -105 -182 -26 -88 112 -26 30 -165 23 -241 -267 215 43
4916D3J66p7j77M5P1j11M2j77K44n7M0J98j34j13n2n5J9J31M6j19j40J94J22m1
4940A08k06J32J08j08j48K39L27n10j56N8o0K83M6r7J27j35L21k08k84NK04l66
4962c20L60J28j28m2j62L61j86R8J63j34J25Mk49R4j31J82j22n8R6JL1j41r6j05
4986b31K61j3j46N3L01j1l05J05k03L79m01K07o5m7J00p4K4%Q1k62P4Q5L80l05
5010a3P0P1n4j71J28pj42o3J88K56j31k52k4J30L84k74k23J40K4p1J93j00k94
5033b35L44j6j80P2J94k65J55M4k51Q1m2j61P31m97j42K9K51m4Oj62r8M6K38n5
5057D3k32K38m5O1k56L39k61L38l51J65P2j15L0j86K50q0K0k12J51r3J14J97l2
5080A55n9l16M52m37J78J20j7j09j09j01J21R5j90J80R2k76J8J10L15l43J9k0
$$ plain form
4916 43 209 132 -45 0 71 -40 2 -175 69 12 52 250 116 3 -49 -104 -85 46 92 -27 -167 27 149 108
4940 108 -98 34 142 34 -114 125 452 -58 -214 -156 -216 67 113 16 143 8 329 121 -163 -158 46 -320
4962 -320 40 168 40 -2 -164 197 11 109 272 138 263 267 18 112 -19 163 41 -17 79 80 111 -30 -126 -231
4986 -231 30 17 -129 -76 225 214 -91 14 -189 190 -211 -4 -69 -116 -16 -90 -66 -66 15 -247 -173 -88 292 -13
5010 -13 57 128 74 -97 31 24 -118 -181 7 263 132 -120 -144 -14 370 96 -127 13 37 -34 159 59 -235
5033 -235 109 93 -87 -15 179 -86 69 113 -138 -57 -99 -260 471 -26 -168 -139 112 68 74 -88 -186 -140 98 43
5057 43 -189 49 4 65 -191 148 -113 225 -126 39 111 -4 26 -160 90 10 30 -182 -31 -124 -10 187 155
5080 155 96 -220 232 -205 -27 93 76 -33 -142 -243 -122 -27 -217 -37 55 -221 -203 -93 222 -121 -102 -122
5102a22l8K66k45l3L46K48l82j77k00L23J67M5j87j66Q3O6k5P6K39l13M0j45J34
5125@N7l35M34L0k13P2l00K34J18r2o2kRp3K23j34K94n34L39j37K84l73J07O3
5149Im7q6j8J45J42j34J63J01j03j87j32K4L67l53j96M02k63K77l75K90j31J10
5171Ej43J28j55K53l90J21J95pJ61Nj89R8K0j53k66K53j09J25j42M48k28p3j09
5194a52J03R5J09k55J37j21K37k62R8kK10m11L48q4k04J47Q7j06J35l8m4L3j13
5217e3n6k1M06k81J97k16J16r2J4j8K61l93K89k49K64n8L4J61l82j32K13J48o9
5240H3j28O7Nn7J65l47K54N9l25K18k09K85k65P0J20J00j44K35Q2l23Q6K24l03
5263d8J2j7P1k4j05j7M47m37M6l05K47K00j88L62l04O6J2m8J3n6j24L95m54K46
$$ plain form
5102 -122 -160 106 -139 -172 174 422 40 -137 -337 -14 153 198 11 -155 -72 -6 -31 45 284 -29 11 -134 0
5125 0 57 -278 156 186 -27 45 -255 -21 97 5 -57 -59 -50 -123 100 -34 260 -274 65 -72 212 -161 -54 9
5149 9 -38 -124 -142 3 145 11 174 275 172 -15 -147 -123 244 -109 -305 97 -166 111 -264 26 -105 5
5171 5 -138 -10 -165 88 -302 -181 14 7 168 173 -16 82 102 -51 -317 -64 -173 -48 -190 258 30 -43 -152
5194 -152 -49 46 155 -100 37 -84 153 -109 -11 -13 197 -214 134 50 -154 -7 80 -26 109 71 27 60 -53
5217 -53 -109 -130 276 -5 192 -24 92 0 14 -4 257 -136 153 -96 168 110 144 305 -77 -209 4 152 83
5240 83 -45 22 27 -30 135 -212 42 101 -224 -6 -215 70 -195 -125 -5 95 -49 186 268 -55 31 255 -48
5263 -48 -36 -53 18 -6 -111 -128 319 -118 -72 -377 -130 70 -118 244 -60 6 18 -30 -17 -73 -197 198 -256 -10
5287a0J34j20J46j83J56K9q4O1k22J31RM6m6j05K34j22J53k46M3J0o9jJ42p3J40
5312A53k7j78K19L1M3l80L06l8r1n4N0j95j17Q2L77j5o5k52K76pm22M52k56L92
5336B84k69j10M11k07k50K02j65J88k06K14J75k74O7l62K54k94K50o2L30j31J15
5357A60J76l73j57J13K54k98J53J11j06O0k77M35p3k87kK37l24K7J55L41m13K63
5379A75l8j9n3l2J31k50P0R5j15O9K92m06J36j32J90j85j08J6J39j02J38J51J12
5402B74l90M0J04l8k0R9j80N09n69R1J56n7K07j81P7n6k2q3o6J00L2m1Q4j59N4
5427c5M0M1J0R0j74r0j3J05P7j01Q8K72l15J25l61J30J02Q3l6L8P9j26j50J29
5451HP7j36j20M15k85J54j24l02M68j41n0R0J19j98L6l40J25J28J10m3R5l48J21
$$ plain form
5287 -10 124 4 150 -33 123 152 68 129 -93 38 47 93 47 -58 176 54 207 -39 4 14 -55 -56 86 13 153
5312 153 126 -52 167 198 241 -139 167 129 38 -16 34 -161 -278 -196 181 166 101 -151 125 118 -304 148 -108 284
5336 284 15 -95 316 109 -141 61 -104 84 -122 92 267 -7 60 -302 -48 -342 -92 -154 176 45 160
5357 160 336 -37 -194 -81 173 -125 28 139 33 93 -184 251 178 -109 -111 126 -198 -171 -16 325 -88 175
5379 175 137 118 65 33 164 -86 -16 79 -36 33 325 -81 55 -77 113 -72 -180 -164 -25 -127 11 162 274
5402 274 -116 -76 28 -10 -30 69 -111 398 -171 -80 76 19 226 45 122 66 44 -39 -105 -5 27 -14 70 -89 -35
5427 -35 5 46 56 146 -28 -118 -131 -26 51 -50 38 310 -5 120 -241 -111 -9 74 38 76 155 29 -121 8
5451 8 85 -51 -171 244 -41 113 -11 -313 155 14 -36 54 173 -25 11 -329 -204 -76 34 -9 86 -262 -141
5474a41l%J78k9R9J82l10Q7j78L17k94r9J51r1N08l56J02k31Q3j59L70j30k37
5497a81K11k43K55J05Ol60J44P3J52M7j97j7P7q8J12q6p5j43J29J54j39J01k12
5520a75K75j69l9L00k90L06k17m2j30K08K03k28J4j37J3L9J06J11j76q5L6J5J
5543f1j45n0P5O5K14J89o63K55J6l41M41J75l19o3J7J58k1j56J86j00K32m7L0
5566H7j47K9j0p2m1M3p9M28o8j25K6Q7J7m9l35k6M03k88J00m7j72L67l4rj56j59
5592b30J68L6m9J19K23l76L20j50m8K70k9n59K55j43J06q1J23K13j07o7K5j30
5614a11j34N46j04j21k11K92j22q3j5J44K7k9n0J52k83q0J72K07j01Q4j87J80
5636A73r3j80K64j98R4o3k48J66N0P9J08j20p8J04o1m14N01J42k52L2j10L86l61
$$ plain form
5474 -141 -144 -144 34 5 104 286 -24 63 -115 202 -92 -191 -40 -131 377 21 123 -108 -25 -184 186 56 -181
5497 -181 30 -213 42 147 153 -207 -63 10 162 209 12 -5 72 -16 96 10 -65 -208 -79 75 -64 37 -175
5520 -175 100 -69 -108 192 -98 208 -9 -51 -181 27 230 2 16 -121 -108 -69 37 148 -28 -113 -77 -62 -61
5543 -61 -206 -256 -181 -116 98 287 -376 -121 -105 -446 -5 170 -149 -212 -195 -37 -58 -214 -28 -128 104 57 87
5566 87 -60 -31 -41 -113 -154 -111 -190 238 170 45 71 158 175 126 -209 -235 168 -120 -20 -67 -239 128 94 85 -71 -230
5592 -230 -62 -26 -75 44 267 -109 211 61 13 283 254 -305 -50 -193 -87 -168 -45 168 61 -6 19 -111
5614 -111 -245 301 197 76 -135 157 35 -48 -63 81 108 79 29 181 -102 -182 -10 197 96 180 -7 173
5636 173 80 -100 164 -34 60 -3 -251 -85 -35 44 152 32 -46 58 -3 -417 84 226 -26 6 -104 282 -79
5659g9Q0K24j5j41k71L30j73M9r2L2q7J37K0j8J60k41K6L0K68k37Q7Mj03N8j85
5684a37M98m50J32L3k04K28k20p6J99L16l18l5M2P6j68n7P1N55n47L0O9P6k83
5707a70K41k27J34J98l19K43Jj64K34k51r9J87l1L51k58R8j12J69j29n2Jno2o2
5731h4mJ44j81j6J60J49n1j29J29j68P1J39l56k24N61R6l38j02L17j9P9j41k9
5754CK1J57k84j01N91k65l55J89P9j78J65q0j14J48qK66l56K28K06j61j21j42
5776a12Q8q5q8o6J60J71j65K33Q2k24j43K76l76K26n9p0J58K70j70l05J64p6j8
5799a29J1L56j82j90P2L06l8k59k7L49k70J76k11J56J17k60m2nJ36k22M02n9j53
5822C4j67K75k59O9j77J93Q8J48j69o7j21K53j05J21L5j72K38l17L58j69j53Q8
$$ plain form
5659 -79 1 225 210 69 -202 128 -45 4 -88 -56 -143 -6 14 -4 156 -85 -59 -29 239 2 89 93 -10 48 -137
5684 -137 361 -89 43 76 -128 100 -120 -196 3 319 1 -34 8 84 -84 -141 -70 485 -62 -32 37 113 -170
5707 -170 71 -156 -22 176 -143 100 101 -63 171 -80 -179 8 -23 328 70 168 56 225 96 44 45 40 -22 -84
5731 -84 -88 56 -125 -141 19 168 117 -12 117 -51 20 159 -197 -421 140 236 -102 -204 113 94 173 32 3
5754 3 24 181 -103 -204 387 122 -233 -44 35 -143 22 -58 -172 -24 -32 234 -122 106 312 151 30 -112
5776 -112 -24 -109 -197 -263 -103 68 -97 136 218 -6 -149 127 -249 -23 -82 -152 6 276 106 -199 -35 -111 -129
5799 -129 -118 238 56 -134 -62 244 206 -53 -80 269 -1 175 -36 120 237 -23 -65 -70 66 -156 246 187 34
5822 34 -133 142 -117 -48 -225 -32 56 204 35 -32 -153 100 -5 116 151 -21 217 -100 258 89 -64 24
5844B4N2j3P8J39j70k76K28l37J58K27k36j2J3J26N0P0j52O1k44M7j25K19K64
5867A91l12J92J5j44J17J11j50q2K0J21k76K62N2RM1j78j16J3J36qj91R2J57n0
5891B2N7oj3o8r6L40k14n4K11l55K11M4j51O7L27l31k40L66k48N8J96k19K9r8
5915a65K53l6k29qq1M72j84k05J11p2j2L08Rj49R0l7r5K19l38L00k10mo3L19m4
5940A49j61j79M38k21k9k75L01q1o7J6r4M19j10o0k03K77j46O1j31L15j97j47
5962a25j0N7K6r5J86L1K54m11J40j27P7L99l95j8J49j27l0j87l2L45j85J94j01
5985A5k90L42j37jJ11r6L37k84k46L43jk63K24j67j92J26L90m24L34j16J75l94
6007b14J63j40J78J17j72M3J59K1K1k76K66l7j29q0K25j48J81p6o4k28J7K68L3
$$ plain form
5844 24 76 63 141 280 110 -166 62 -275 -117 110 -126 -138 -125 1 51 121 -31 30 -214 -167 -292 -73 191
5867 191 -121 71 86 -58 59 170 20 -62 -42 79 -197 65 117 126 167 -11 -127 -114 22 14 -177 -85 72 22
5891 22 79 73 60 -8 -104 236 22 -32 179 -176 35 79 -72 -5 322 -9 -249 117 -131 -73 123 -96 -67 -165
5915 -165 88 52 -177 -185 -266 206 22 -183 -72 -144 -156 152 161 12 102 65 -30 189 -149 151 -59 -63 -126 193 149
5940 149 -12 -191 247 26 -3 -278 23 -58 -125 -109 -203 216 106 46 -157 120 -26 35 -96 219 22 -125
5962 -125 -135 -78 -52 -147 39 70 324 -87 53 -74 3 402 7 -11 138 11 -19 -206 -238 107 -78 116 15
5985 15 -275 67 -70 -71 40 -56 281 -3 -249 94 93 -170 54 -113 -305 -179 211 -213 121 5 180 -214
6007 -214 -51 -191 -13 104 -68 -25 134 155 176 -100 166 129 0 -80 145 -3 178 102 38 -190 -173 95 128
6030A28j11p9J86k19Qr3M68n25K15J78j5Q1j83j09R3j9r9P2J48l61K18Q1j67N
6054i9M7J75j02J17j13j30J45K7r1j00j1m9K30j34J67J4Pj55N1J06k17J71j04
6077d8J11j10j1J64j86j39J16N8M6J16j03l68L73N4k72O1J78q6N0J57j20m7j39
6100a45J52n4N2Q6j33n7L81q5j40o6K15j45p6K95m76J24J34k46M1Q5j17J26m3
6123i2J43l5j07j83K24k51L90l4j22J93Jj89K32q6J00j97l01J03r6L53j96J01
6145d9l6J04q6K43m8j35J8n1k50M94q2QN5j49lk0r4l0J21L8j10L12l50N3j39J80
6171fR6o4K30l47J20O3K79j79m68K57q1l29M79q9M2m2J94l22J07J68k70j9j0J13
6195g8J3j68J33N2j62Q8K20o5r8Q2Q0k03J68L0o4J91l93m1J37J18j87M82m21K78
$$ plain form
6030 128 17 -62 124 -95 -87 -180 288 -237 -22 156 141 222 39 -70 23 4 -95 -23 125 -236 -18 63 -104 -99
6054 -99 -52 123 21 138 25 -105 40 67 -24 -124 -135 -184 46 -88 79 93 100 -55 -4 102 -115 56 -48
6077 -48 63 -47 -58 106 -80 -219 -103 -45 1 117 14 -354 19 73 -199 -138 40 -46 4 161 41 -6 -145
6100 -145 7 -47 5 91 -42 -99 282 197 57 -9 206 61 -15 280 -196 -72 62 -184 -143 -58 -175 -49 -92
6123 -92 51 16 -91 -274 -50 -301 89 55 -67 126 127 -62 170 84 184 -13 -314 -211 -307 46 -150 -49
6145 -49 -85 19 -67 176 128 -7 11 -40 -290 204 122 130 185 36 33 13 -81 -111 10 48 -62 250 -100 -47 -186 -6
6171 -6 90 26 256 -91 29 92 371 192 -276 -19 -100 -429 50 -39 3 -39 155 -167 -60 108 -162 -181 -191 -78
6195 -78 -65 -233 -100 -48 -210 -122 98 33 -65 17 97 -106 62 92 28 219 -174 -215 -78 40 -147 335 -86 192
6219A92j97k41J26J26n5J98l69J90J71L9j28K26k08k5K2j45r1P0L87l99L4K15
6241A38K2m07L84k15K38l33K04k71L65k06N2N1j16J51P3q4O7k37j64L90k70p8
6263b46J19O4p9K89m7l04K63p9K00n6k8l4j22r3K4J20O6R2k42J77m0j54q9OM07
6288B14j63l70M01k03K71l05J57k66K69p2N0j17j16J72R7l58N03J14k9k52l5P7
6310C9K04k86R7j24q4M8K02j02N3j60O2K04k6k57K89j29j18Q8q9J9P7O6j71J12
6334A4J43l25K43o4j82J48j59Q4L97l49J90j79L8j54J79J17n3J20q8j20m9R8k63
6357b14J05L84l04n0J57k6j40K1J67j48J48K18l28J07k85L69r1j2k35j10mN3J98
6380b0OP8Q8k07q4J30l04K19n4K75k92L18m43O11k75r2m1K58j02q1K1k54M0K66
$$ plain form
6219 192 -5 -246 -120 6 -49 149 -220 -30 141 180 52 278 70 45 67 -78 -169 -99 288 -111 -77 138
6241 138 160 -247 137 -78 160 -173 31 -240 125 -81 -29 22 -94 57 130 46 113 -124 -288 102 -168 -246
6263 -246 -127 -63 -142 147 100 -204 59 -20 180 124 96 62 -60 -153 -129 -9 57 149 -93 84 44 -110 -199 -193 214
6288 214 51 -319 82 -121 150 -155 2 -264 5 -67 -17 -134 -250 -78 19 -339 164 278 249 -3 -38 39
6310 39 243 -43 54 -70 -154 -106 96 -6 47 -113 -51 153 127 -130 159 30 -88 0 -89 -70 7 73 -98 14
6334 14 157 -168 75 11 -171 -23 -182 -98 299 -50 140 -39 -1 -155 24 141 88 208 120 0 -49 49 -214
6357 -214 -109 275 -29 -79 78 52 -88 -67 100 -48 100 318 -10 97 -188 181 90 78 -157 -267 -271 -218 -20
6380 -20 -14 64 152 -55 -139 -9 -313 -94 -148 127 -165 153 -290 321 46 -46 -87 171 69 -12 9 -245 -205 61
6404F1j67K44m06K62j12j76K08J72j13j21Q2N45m65o2J71j90kk44M45r2J57J9
6426B16k06k31J67L01k23L6J61l57K1K29Q2j10r5K49j80J02n2k17K23j36J95k09
6448c4J16j34Q1k37K70l0O4j74j00L42j91J03j90K02l47N65k26N0p1L0j46K35
6470A78J7l4k66R0Q8k5J6k05k4k1j17K21N7R3j33O3J14j44O3N8m43N03k20L23
6494B52j89n7L4O7k05L7j5k57N33j66j4K15l74l0K40o4J41R7k32k16K67k9k40
6517b05L52j24M4k8j25j2N1P9N5j81m3J21K35k57J57j76K30j78nr1K13rJ7pN9
6542A72N2r3r5Q0k00j14O7l8K70k09J48j4L7r4K7r6j89M22l8PJ41m62O4M8J26
6567A9j48M4K15j7q0J0K08r6r1J8j39o5N3J3L1n5o9j67L65J03j8k49O2J98j18
$$ plain form
6404 61 -106 138 -268 -6 -118 -294 -86 86 -27 -148 -66 479 14 -48 123 -67 -69 -313 132 40 197 216
6426 216 10 -221 -54 247 24 60 221 -136 -115 114 196 86 -9 240 60 162 110 -107 116 -20 175 -34
6448 -34 82 -52 29 -208 62 32 96 -78 -178 164 -27 76 -114 88 -259 306 80 130 59 89 -57 178
6470 178 195 161 -105 -15 73 48 64 -141 -165 -186 -303 -82 -25 68 -65 -2 112 -32 31 89 -354 149 -71 252
6494 252 63 6 40 107 -98 -61 -76 -333 200 34 20 235 -139 -169 71 7 148 245 13 -203 64 35 -205
6517 -205 147 23 67 39 -86 -98 -47 32 87 -94 -137 -16 219 -38 119 -57 173 -5 -10 -101 112 103 120 113 172
6542 172 224 131 36 116 -84 -198 -131 -169 101 -108 40 26 63 -31 -4 -100 -289 133 95 102 243 -219 -155 -107 19
6567 19 -129 -85 130 113 33 43 251 155 64 82 -57 -122 -69 -56 -25 -80 -149 -316 49 152 134 -115 -53 145 27
6592B7R3l19J52k52K73P4J84k88J55k51J38J30L6j88Q7O7j81J2k0J94j75P9o0
6615c3k01j9K12R4N3m84K83L1J47j07O3k32P5L51m25J4K04J17k30K69k07K6k46
6638b45L24Q6l02K88l48J85J18m6l9M11r8k20K5k08P7j43K7J53k72N7J45k93O5
6661b53p0K22j37L32j66K45Nk37K13J01l84J17M7l96K64M7J21k9j51K62j99J56
6683A10j14o8J80r9J53l59L80l78K11Lr1J58k28N3J7J89j98M8j31J89k78J80J56
6706H3J9J24M5l71JJ94l3J06l47K12k60k18K41O4J5qN04k75j55p5J82m0j40K57
6730A25rk20K95l53p0L09l7K97k87K9O6j02r0jJ95k76N0l83L61k21L13q7j6N7
6754e5k35L10J09n0j22k7L37m83K57M6j03K02j68p1p1J83p4N1j65lJ46J3j21r1
$$ plain form
6592 27 120 -199 -47 -299 -26 48 232 -56 99 -152 -14 116 152 -36 51 118 -63 -51 -71 123 -52 27 -33
6615 -33 -234 -253 -41 53 106 -378 -95 -64 83 -24 39 -193 -118 233 -192 -178 26 143 -87 182 -25 1 -245
6638 -245 79 165 -137 151 -197 -12 106 60 21 432 334 114 139 -69 8 -135 -108 45 -227 -170 -25 -318 -253
6661 -253 -323 -101 -238 94 -72 173 178 -59 154 255 -129 -12 35 -361 -97 -50 71 42 -109 153 -46 110
6683 110 -4 -72 108 9 162 -197 183 -195 16 19 -72 86 -142 -89 -72 117 -81 -33 -164 25 -253 -73 83
6706 83 102 226 271 -100 -99 95 62 168 -179 33 -227 -445 -204 -140 -125 -133 371 96 -59 -134 48 8 -132 125
6730 125 116 -104 191 -162 -232 77 40 337 50 79 145 43 -47 -48 147 -129 -79 -462 -101 -322 -9 -96 -112 -55
6754 -55 -290 20 129 79 -43 -70 267 -216 41 87 -16 186 18 -53 -124 59 -15 36 -129 -132 14 27 -94 -185
6778a85L98k99J12j1k50J90j13N4J46j47Nj5L9J0j4j9L50l80J06k36K05J5K79
6801B40r8n5J00n01L64r9K86l44Q7J45k00J47k84N06l88R7k5K73l83J59m6J68
6823A49k69N5k88M70l6q9K02m04K79l5O4q5j41M63m58l9J86k30K09l19M37j68
6845d7K0n7j19J22K13P4k47J0l6J87L9k15R2n4P1k31O4J87j24q1%l92K07M09M
6870I6j89K6j02K15k6lr9J38J51k2p8j52o9O1M7N3K3N5j43q3J84k49K53p8J80
6895A89j13J44k18L1k87L73k62J64P6l35L1J8N1lK67j06q7M2o4K54l01L27m02
6918b11J97j38o4K49l86L91k10N8K68J29l02m3K13O0l01mQ2J06l92L40L3j02J5
6941a2j15J29m9J00pP8l3l8k01L37j53k21K20r7k0N7m4k1J27k54M10l28K21Q2
$$ plain form
6778 -185 213 -86 26 15 -235 -45 -158 -104 42 -105 -100 -115 -76 -66 -80 -99 251 -129 -23 -259 -54 -39 240
6801 240 142 87 187 -314 50 -49 237 -107 -20 125 -75 72 -212 294 -94 3 -22 251 -132 27 -19 149
6823 149 -120 -65 -353 117 81 -8 194 -210 69 34 98 13 -128 335 -123 -162 24 -206 3 -316 121 -47
6845 -47 -27 -84 -203 -81 132 206 -41 -31 -67 120 159 -56 36 -18 53 -178 -114 73 -51 -132 -132 -524 -317 92 96
6870 96 -93 -67 -169 46 20 17 -82 56 207 185 107 -45 -114 -53 -6 47 70 125 -18 -101 83 -166 87 9 189
6895 189 76 220 2 33 -254 119 -143 21 97 -238 -207 -189 -138 -141 126 20 -67 -25 -89 165 -136 191 -211
6918 -211 -14 -152 -216 33 -353 38 -172 -114 154 283 -19 -62 151 211 -90 -94 -12 94 -298 42 75 -27 -12
6941 -12 -127 2 -47 53 46 124 91 53 -148 189 36 -185 35 -62 -82 -25 -69 -90 37 -217 193 -135 86 168
6965A68l60L62l01L7l69N84p7l8o3o5M31l42J18m01M22l03j9L75l08K94j89LR5
6988E4K48j06k07k55J16L04l42L04K4J0j13M0n4J41M8ok16J23j07p1Q0k05L10
7011A20n6l04J96j5K61l75J38J64J0K4k47QK50K7j04q6j86J37N7J61n14K10m1
7034a65J93K3J29k79K57k19j1j65K04JJ23k11M9K70k60rJ7L26L7n41K26l9OO2
7058B4J19j18O1j72m0J38j17J67p8j35J86Q9L4J6l69K85j48N7rO7j51J27p5J30
7082H8k0l7j42K95l03o8o0J58n6P7q0N8oJ73l4L5J59j46j53m8O4J50k79L66p2
7107A19j24l3N4K07l43N4r9L10r0j79J30j76J02J64n7m06N47j12k27j52M97j91
7129er3o0K36q7J21N2j99P9j05n7M0L63j53j58j13L11j22k0J00J36j13j35j45
$$ plain form
6965 168 -192 170 -131 -94 -463 121 44 6 -57 -122 309 -33 85 -316 106 -197 -216 159 -149 145 -44 -41 54
6988 54 302 196 -11 -266 -150 154 -188 116 140 150 37 77 23 164 212 206 -10 113 6 -65 15 -190 120
7011 120 64 -240 -44 -59 202 -173 -35 129 139 163 -84 -76 174 201 97 11 -175 -38 19 180 -334 -124 -165
7034 -165 28 51 180 -99 158 -61 -72 -237 -33 -32 91 -120 -71 199 -61 -70 -53 273 310 -231 -5 -44 -38 24
7058 24 143 25 86 -86 -126 12 -105 62 -16 -151 35 124 158 174 -195 90 -58 -1 -10 57 -94 33 -42 88
7082 88 68 31 -111 184 -119 -187 -247 -89 -145 -68 -148 -90 -96 77 43 78 237 91 -62 -110 -46 104 -175 191 119
7107 119 -5 -38 16 223 -120 -66 -165 145 55 -124 6 -170 -68 96 39 -367 180 68 -159 -311 186 -5
7129 -5 -98 -158 78 -9 112 164 -35 44 -61 -118 -78 285 132 -26 -139 172 50 30 130 266 153 18 -127
7152a27o3K77n2J42l42K0L95k69%r0j41K89r0L2J43J7j51L1j91L7J85J61j98p2
7176e7j9J77m54J59K21L20j92j70J8K05j99l2J21Jk55J08K54l03k43L20K12j79
7198A3k26O2Q4Q5J39k80J35L22k17k1p1J3L2q2L5m6L30q4l47K36j05J15j56j21
7222a55L23j56r0K5j84K8L39k5m3j94J57l2J49R5p6K83l78K0j91L15k26Q0K97
7245C61m56M4J71k1l29L10k50K50k70K87l79K91j6Jj18K01j85J44Q3l22L76l84
7267b11J31J94k91R9k5q7L11L7k09K87j03J17J03j07k75K56l95K29r3K31k61K5
7289c7J7M9J57j68Qn6J37O4k14lK6r3K26k7j53j60L48l51J88R1J32j25k38J67
7313a5K26k22L1J30k74K33j73J16J7j45J01j18J28j31K2k20M68L29n94J56k83
$$ plain form
7152 -127 -190 87 35 177 -165 -145 250 -19 -19 -109 -250 39 -51 -19 124 141 -10 21 -170 -133 52 213 15 -57
7176 -57 -76 101 -353 -194 27 347 155 -15 3 208 9 -23 98 99 -156 -48 206 -97 -340 -20 192 13
7198 13 -213 -151 -67 18 157 -123 12 334 117 96 25 38 70 -12 23 -23 307 223 -124 112 7 122 -34 -155
7222 -155 168 12 -78 -53 -237 -209 130 105 62 -132 25 -7 142 237 161 444 66 86 -105 210 -16 64 361
7245 361 -95 -51 120 99 -230 80 -170 80 -190 97 -282 9 -7 -6 -124 77 -108 36 119 -203 173 -211
7267 -211 -80 114 -177 -78 -103 -190 121 158 -51 236 133 250 353 246 -29 227 -168 61 -32 199 -62 -37
7289 -37 -20 29 186 18 26 -30 107 171 -43 -46 -20 -113 113 86 -67 -227 121 -230 -42 49 181 56 -182 -15
7313 -15 211 -11 20 150 -124 109 -64 52 69 -76 25 -93 35 -96 -74 -294 174 503 -91 65 -218
7334b18L40j06K09j19J79j64j38p1K59j32k50J47J17j20O0Qj2J94k19K6o4J20
7356D6J94k83P6P3j83J36m5P1k00m1J05q5R0N46n10J50J9k36N2j46L47l69N17
7379C24j50j50r0L80l51Q9q7O3q6J48k42K83j0k84O8L13l54K9K16j81K22l35J83
7402bj63j06K52Q6j89J57J62j61R0k52J34j57J61j91L73j8j76K12j70J64l51K30
7424H5J20p5q8R4p4oj81R4L39j37q0r6K25m67J17O5J74j56k8O3j6j1j34J15K00
7449A42k25q1M06j95l0j34k15M68M9m7j51o3q8N8J22J96j75lO2r2j9p8K11k9j53
7474f4k34J83j08L07j7k32J04Q5j17OJ4l5J53k89Q6N23m47j48M54n8k11J88k79
7497a36L60m29N7J28O9K6j32n3KM06q9j60m58N09j54l38N27k44M23l19r5J60L09
$$ plain form
7334 -218 122 16 225 106 285 121 -17 -88 171 39 -211 -64 53 -67 -7 1 -11 183 -36 -10 -74 46
7356 46 240 -43 33 106 -77 59 14 85 -115 -156 -51 -136 -46 500 -10 140 159 -77 -25 -171 176 -193 324
7379 324 174 24 -66 314 -37 52 -35 28 -58 90 -152 131 121 -163 -95 218 -136 -107 109 -72 150 -185 -2
7402 -2 -165 -271 -19 67 -122 35 197 36 126 -126 8 -149 12 -179 194 176 0 212 42 206 -145 85
7424 85 205 130 42 136 62 56 -125 -31 308 171 91 -5 220 -247 -130 -65 109 -47 -75 -12 -28 -39 -173 -58 142
7449 142 -83 -164 242 47 17 -117 -332 136 185 138 -13 -76 -164 -106 16 212 37 34 96 4 -15 -93 118 89 -64
7474 -64 -298 -115 -223 84 67 -165 -61 24 -93 -87 -73 -108 45 -244 -158 365 -82 -230 224 166 -45 143 -136
7497 -136 224 -205 -148 -20 49 75 -57 -110 -108 298 209 49 -409 100 -54 -392 135 -109 314 -5 -100 60 369
7520C69l23q8l6RO9r6J21M6n15N55j21K2L34m84Mn5J77M57m38j8n0O2p4nJ94k47
7546a31O1K05P6j72j16n7J78k03L8p9Q9J02P9j81M09k30l3p2o9k21K25L45j62
7569H1L0Q9Q7m69J90K54l51P7R4k34J54j9nL13k97L46l15j04L21p8Ml53LK36k72
7594b18O1P5qp2MR7j95N43k14l02n4L69j08r4K4Ql8j5Q3J06l85J71L10j56K40
7619B32k50J91j91J50r4J08L2r2k44L1Kk30M73j23p3J01J4J25l1M3j82j44L62
7642B10o7J5k49J73j66j35J97m1j18J78Q8j24j0J6n5J17k9j9k11L31j63J33j98
7665a27J87K8J31j81k41J85Q3r9K31j40R7k89M05l02O7O4q4J21k22K20q8j18O7
7688eJ23j32K09l25k7P8J85k69kj33L41j00J03l8k8M3m7J45M4k09j49J23L27j69
$$ plain form
7520 369 46 -42 -78 -69 0 -96 25 71 -444 111 -10 12 346 -138 -134 -189 -12 445 7 -11 -61 1 -73 -78 116 -131
7546 -131 -70 135 211 39 -77 -134 44 -159 -121 -200 -111 -9 70 -111 298 68 35 -37 -106 -327 -102 243 81
7569 81 111 200 287 -182 8 262 -89 -12 82 -152 2 -17 -22 291 -6 340 25 -79 242 164 168 -185 -182 54 -218
7594 -218 -157 -82 -90 -162 -158 -61 -256 287 73 -229 -283 86 -22 -116 -92 -84 -122 -137 -54 52 -333 -162 148 -8 232
7619 232 -18 173 -18 132 38 146 178 86 -158 -127 -125 -355 118 -5 -78 23 37 162 131 174 -8 -152 210
7642 210 143 158 -91 82 -84 -219 -22 -63 -181 -3 85 -39 -49 -33 -88 29 0 -19 -230 101 -62 71 -127
7665 -127 60 88 219 38 -203 -18 65 -34 197 57 154 -135 270 -32 35 99 15 136 -86 134 46 -72 -5
7688 -5 118 -14 195 -130 -157 -79 106 -163 -165 -298 43 -57 46 8 -20 23 -24 121 165 -44 -193 -70 257 88
7712H8l84O74l30k85J89k09K25OPJ32L2k49n8J57K1n4J22l77K99q1jL09k26l1
7736b4K21j71j07p2ML94l04j0j01O2M2J22J54j70j09J56M9o9pk07l9K82p2J6k85
7761b45K04J3k2J44j65K94m9p0j58N7k54M34j99J51n2l1J3m7q0K88k34q3K6J48
7785H3j83o8L5j81Q3L60o6j16O8k6R3J0k08J83J66k73k86K25K69K43k80j00q8
7808e7K59j91m0J3j17L92l84l6K76N0j84K23j12K34m83L64l6m39K74j53p2K39
7830B0j6j19n7J22k13r6M07N4j02J56j49l2p4K7L08l94r0L79q4J71l72K29j84
7853a09pR7j44KJ58N6j02J85p9j24j71K84k02J72n4K4p4lM17k75J13l5Q8k90K65
7878A92k24J16l05K61L32m66K29l5n3K9k21k52K93K19L1J00k05J2j00p3L66l56
$$ plain form
7712 88 -296 378 48 -237 -48 -257 -32 -26 -19 113 145 -104 -162 -5 16 -38 84 -293 6 -75 -76 233 7 -24
7736 -24 197 26 -81 -153 -149 245 -59 -69 -170 -108 -66 56 210 40 -69 87 136 67 60 -147 -186 96 24 40 -245
7761 -245 -41 -28 -50 94 -71 223 174 104 -54 3 -251 183 -16 135 83 52 65 18 -62 226 -8 -91 -65 83
7785 83 -100 -168 -133 -314 -231 129 63 -53 15 -11 82 92 -116 67 233 -40 -326 -101 168 411 131 31 -57
7808 -57 202 11 -29 -16 -133 259 -125 -161 115 165 -19 204 92 326 -157 207 171 -268 6 -147 -219 20
7830 20 4 -115 -172 -50 -263 -359 48 102 0 156 7 -25 -99 -72 236 -158 -248 131 47 218 -154 75 -109
7853 -109 -116 -19 -163 -161 -3 53 -49 136 57 -67 -238 46 -156 16 -38 -14 -88 -91 326 51 164 129 217 -73 192
7878 192 -32 84 -221 40 372 -94 135 100 47 76 -145 -397 -104 115 146 246 41 53 -47 -120 246 -110
7900a10J72J09n6r4o5L0J43J65k99L05l57rM8J5J87k37K9N7n6Ok00N33Jk92j08
7925h3K0rN4Q2l9R5j1j14J97n0k59nK93p3n6k43K03J10r0n1R6L58k11m11K6K88
7951A17l0K0m4j97K89N4o3p0j51J05j38R1K62j22r2J06k33L03L3k03j54L60l44
7974a01K83l35K16K2k04K18Q4m09K57R6Kn9j69J23j69J76J14Mj74M0J34k71K13
7997I1Lll11L99k53J9K50m27N10l29k00%J93n8N7J60K6J73l18j64J91K7N3j46
8021e7J93J15j44k01K11j53J61j88K14k00k3K42m82M43k81K57j15nl1J25j25j9
8043f3K2M7L8k62L00J17l11J53L8O3k53n0J07k44L45N1j12p0K66l62L23k87K44
8066A00q3l23L42K2J8M35n94J36j09J54j3k96K0L79l59J99k47J70j27j8K83n1
$$ plain form
7900 -110 62 171 115 21 -44 -14 129 294 -5 300 -57 -66 -18 -3 184 -53 -24 33 -23 -17 -217 316 317 25 -83
7925 -83 -63 -72 -18 64 25 120 109 -5 192 142 -117 -122 171 98 42 -201 2 112 22 -29 67 425 214 -197 -171 117
7951 117 87 107 63 -134 155 209 146 76 -75 30 -108 -17 245 123 31 137 -96 207 240 37 -117 243 -101
7974 -101 182 -153 63 85 -119 99 183 -226 31 127 129 70 -99 24 -145 31 145 149 -25 15 149 -122 91
7997 91 94 91 -220 179 -74 -55 195 -232 278 -51 -251 -251 -58 -116 -59 101 127 300 -18 -182 9 36 89 -57
8021 -57 136 251 107 -94 117 -36 125 -63 151 -49 -72 170 -312 131 -150 107 -8 -13 -44 81 -44 -63
8043 -63 -41 6 44 -218 82 199 -112 41 79 142 -111 -161 -54 -298 47 98 -14 -84 182 -180 143 -144 100
8066 100 17 -306 36 58 76 511 -83 53 -56 98 85 -211 -191 188 -171 28 -219 -49 -176 -194 89 38
8088C8j20J06q7n6K00j29K20l87K63J82j29P7j94J55j49K56n98L80j64K27r4m24
8110d27N03k8l92L58Kk9k16L06K40m90K32J24j89j93J97j48J86n3Mj3K0j1k42
8133b59J42j42K41j80J68K22j07J7k16J45j15J15j01K71M5l83J31J26oo8k05K73
8155A14r6J43j26j72J47J59k12k12L9J04J42l5K08M7q8j96k22K81j07N0K08j88
8177a2n1P5O8r7J79J82n57M59l00P7j25j37K27j53
$$ plain form
8088 38 -82 24 -63 -119 81 -48 172 -215 48 230 101 178 -16 139 -10 246 -352 28 -136 91 -3 -427
8110 -427 76 48 -344 14 16 -13 -229 77 317 -173 59 183 -6 -199 -2 -150 36 -17 -13 -26 -6 -17 -259
8133 -259 -117 -259 -18 -198 -30 192 85 102 -114 31 -84 31 -70 201 246 -137 -6 120 114 46 -159 114
8155 114 18 161 35 -137 10 169 -43 -255 -216 -112 30 -5 203 250 162 -34 -256 25 -82 -32 176 -12
8177 -12 -63 12 80 -17 162 344 -213 246 -54 23 -102 -239 -12 -165
8191a65
$$ Imaginary data points
##PAGE= N=2
##DATA TABLE= (X++(I..I)), XYDATA
0@%%%%%%%%%qJ6j7K5l2M0m8N7p3Q9j13J36j61J94k32K77l19L70m33M97n72O57
31C50p50Q54r67J095j236J389j557J741j945K166k409K676k967L286l630M008
47B104m421M871n367N912o515P180p918Q747r676J0729j1935J3327j4961J6907
61H984j9276K2228k6030L1145l8427M9723o9812J16503m34878k42531N70071K89434
73B57134L00931K1442j59657l47451l04690k78480l9570J69815L21452L26335
83B67261K87613M7761j71950k93721l10380k86993q8209J25980K60420K95098
93A32880K61899Q5687j03415k37475k92785k51547p8222R4335K16309K82543K53818
104C64027R7500p3148j98770k67290k34438r3460N8525J78633K49141K23275R8431
$$ plain form
0 0 0 0 0 0 0 0 0 0 0 -8 8 -9 16 -16 24 -24 33 -40 49 -64 72 -89 105 -127 150 -169 201 -232 265 -307 350
31 350 -400 454 -513 582 -654 735 -822 919 -1026 1140 -1269 1407 -1560 1726 -1904 2104
47 2104 -2317 2554 -2813 3099 -3416 3764 -4154 4593 -5083 5646 -6289 7038 -7923 8984
61 8984 -10292 11936 -14094 17051 -21376 28347 -41465 75038 -359840 -602371 -32300 257134
73 257134 558065 579507 419850 72399 -232291 -510771 -550341 -380526 -59074 267261
83 267261 554874 602635 430685 136964 -173416 -460409 -548618 -422638 -162218 132880
93 132880 394779 480466 377051 139576 -153209 -404756 -482978 -388643 -172334 110209 364027
104 364027 461527 388379 189609 -77681 -312119 -405579 -347054 -168421 80720 303995 402426
115D02426m7068j73094k45738k17792j03350K8702J51861K29242K08914J07646
125C41749j6116j38307k14918j94562j00222J3888J25762J98340J88955J10658
135C15227j14j16570j88419j78694j12440j3920R9929J76734J72864J09990J2944
146B77531r5908j66486j64389j09436j9214Q4541J54106J59978J15581L0614p2338
157A94580j42366j51631j11968l1561O6256J32318J42161J05773K9729o1048j22118
168E0125j36105j08273l8010N0504J14048J33299J09655M2913m2195j03431j24038
179e1508j03616m2355L4373R2271J15920J01025M4770k9952q5839j12247j00596
190a37754m7292K3675P9877J07460R8510M9057j7840p1760j01060r5074m9727
$$ plain form
115 402426 355358 182264 -63474 -281266 -384616 -355914 -204053 25189 234103 341749
125 341749 325633 187326 -27592 -222154 -322376 -308488 -182726 15614 204569 315227
135 315227 315113 198543 10124 -168570 -281010 -294930 -195001 -18267 154597 264587 277531
146 277531 181623 15137 -149252 -258688 -277902 -193361 -39255 120723 236304 266918 194580
157 194580 52214 -99417 -211385 -242946 -176690 -44372 97789 203562 233291 172243 50125
168 50125 -85980 -194253 -232263 -181759 -67711 65588 175243 218156 175961 72530 -51508
179 -51508 -155124 -197479 -163106 -70835 45085 146110 190880 160928 75089 -37158 -137754
190 -137754 -185046 -161371 -81494 25966 124476 173533 155693 83933 -17127 -112201 -161928
201a61928J2549O4307R5455R1482M9461p937n7552q8557q7713n0633L658N2187
213h5221Q3871Q5207N0002m52m7216p9801q2229n0947m035M1070P4661P9447N1148
226A15505Q500l6319p0044p5089m9564j0014L2775O6024P1833M8923J2556k8802
238H6284o2214o9036m9014j5754K4437N7202O4313M8093J7309k1341n3051o0106
250c2878m6913j8701J8493M9405N8532M7269K0696j4978m4868n5381m6394k2532
262h8250J1756M0847N1437M5483K2511j1285l8241m9318m3949k2933Q516L5628
274c7798M7384M3598K3553n912l1321m4322m1954k3538M643K7813M1143L9642
286D2931K3718k388k5530l9159l8852k3626Q21K2285L6712L7546K3855J312k0505
$$ plain form
201 -161928 -149379 -85072 10383 101865 151326 143389 85837 -2720 -90433 -141066 -137408 -85221
213 -85221 -1350 83857 133859 133407 86191 6390 -75839 -126786 -130821 -89751 -15090 64357 115505
226 115505 124005 87686 17642 -57447 -107011 -117025 -84250 -18226 53607 102530 115086 86284
238 86284 24070 -44966 -93980 -109734 -85297 -28095 36218 84311 101620 80279 27228 -32878
250 -32878 -79791 -98492 -79999 -30594 27938 75207 95903 80925 36057 -19324 -65718 -88250
262 -88250 -76494 -35647 15790 61273 83784 72499 34258 -15060 -59009 -81942 -73426 -37798
274 -37798 9586 53184 76737 70825 39504 -4818 -46772 -70310 -65667 -37854 3289 42931
286 42931 66649 64261 38731 -428 -39280 -62906 -62085 -39800 -3088 34458 58313 59625 39120
299C9120l4341l6275k3891k404J8386L2339L5073K3819M835j6359l1035l3678
311b4411k3306n030J4286K7954L2072K3378N967j2616k6954l1010k2637o745J0893
324c8159K4957K9094K2556P976r184k2630k7607k1609q976P480K1223K6177K1913
337C3211Q789o728j9278k4742k1202j0088M471J8181K4183K0995J0250m398j6198
350A7446k2831k0093j0390K783J5400K1726J9903J0550k099j4477k0283j9203
362b1568j0880J265J2780J9524J8125J0976m91j1581j8155j7521j1142l56J0352
375a8672J7393J7505J0476J378r120j6459j6662j1039j701Q203J5516J5818J1122
388B3758K146p447j4528j5266j1077k385O176J3612J5016J0617L743o212j2970
$$ plain form
299 39120 4779 -31496 -55387 -57791 -39405 -7066 28007 51826 56661 40302 9267 -24411
311 -24411 -47717 -52747 -38461 -10507 21565 44943 50910 38294 11340 -19670 -42307 -49052 -38159
324 -38159 -13202 15892 38448 46424 37240 14610 -12997 -34606 -43582 -36102 -14879 11298 33211
337 33211 42000 35272 15994 -8748 -29950 -40038 -35567 -17386 6797 27792 38042 33644 17446
350 17446 -5385 -25478 -35868 -33085 -17685 4041 23944 34494 32395 17918 -2365 -21568
362 -21568 -32448 -31183 -18403 1121 19246 30222 29731 18150 -5 -17526 -28668 -29024 -18672
375 -18672 -1279 16226 26702 28080 18960 2501 -14161 -25200 -26901 -18698 -3182 12636 23758
388 23758 25904 18457 3929 -11337 -22414 -24799 -18623 -5011 10005 20622 24365 18153 5183
401E183j3768j1072l145N321J1553J3362J0564L806m350j0809j2994j0342m373
414b1064M127J0026J2083J0032M631l635q873j1750r733m637K893Q178J1323R760
428A3361M856k016q277j0624r631m614J945P088J0128R206M851j718o566r758
442a769r132m449J167N893R330Q779M591m42n229r217q512m423J69N068P992Q508
458H324M647K9m695p662q018m997m67M338P190P556M842J047m035o738p349m948
474a0936m21L008O973O926M730J254l268n892o930m710j436K736N900N969M889
489H792J668k646n436o343m670j691K412N034O077M498J990j989m668n542m780
504g294j874J788M550N352M395J702j280m206n054m654k141J748L701M560M418
$$ plain form
401 5183 -8585 -19657 -22802 -17481 -5928 7434 17998 21804 17454 6645 -6349 -16691 -21064
414 -21064 -16937 -6911 5172 15204 19835 16200 7327 -4423 -14156 -18793 -15900 -7722 3601 13361
428 13361 18217 16201 7924 -2700 -12331 -16945 -15000 -7912 2216 11422 16273 14555 7989 -1769
442 -1769 -10901 -15350 -14183 -8290 1040 9819 14410 13968 8739 -478 -8990 -13413 -13244 -8176 -184 8324
458 8324 12971 13000 8305 643 -7375 -12372 -12839 -8501 -1311 6245 11087 12134 8099 1361 -5988 -10936
474 -10936 -11357 -8349 -1376 5550 10280 11534 8266 2374 -4556 -9266 -10702 -7966 -2066 3903 8792
489 8792 10460 7814 2378 -3965 -8635 -10326 -7914 -2880 3197 7695 9685 7696 3028 -2514 -7294
504 -7294 -9168 -7380 -2830 2522 6917 8619 7339 3133 -1921 -6575 -8716 -6968 -3267 1293 5711
519E711K149r90l722m349m227k289J265L011M404M348K098r41k495m710m144k097
535f978M28K793M372L727K429m78k588m057l809j993J2K026L813L974K583k60
551E994k065l622l983j798j17J801L388L253K110K87j491k947l588j990o02J600
567c770K816L118K298M48j347k525k999k090r14J166K778K440K436N84n34k522
583A383l015j924p58R38K242K652J680J187q85k153k381j803j114M97K001K367
599I14J955Q62l61j892k266k079q89M54J717K088J709R97j32j522j625k059j212
616c341K35J543J946J546R89j19j133j770j915j145K56J190J515J796J089j14
632B568q78j498k015r83O2J055J530J634Q59J99o33j837j076j436L1O24J244J592
$$ plain form
519 5711 7860 6870 3148 -1201 -5428 -7717 -6452 -3441 963 5311 7409 6468 3973 -737 -4881 -6978
535 -6978 -6550 -3757 615 4342 6771 6293 3705 -352 -4161 -6154 -6142 -4116 -303 3671 6254 5994
551 5994 3929 307 -3676 -5474 -5591 -3790 -402 2851 4961 5248 3757 810 -2778 -4768 -5370 -3770
567 -3770 -954 2164 4462 4910 3563 1038 -1961 -4051 -4965 -3799 -1021 1419 3855 4439 3905 1383
583 1383 -1632 -3556 -4314 -3376 -1134 1518 3198 4385 3500 1347 -1034 -2837 -3951 -3454 -1453 914
599 914 2869 3731 3370 1478 -788 -2867 -3756 -3302 -1585 503 2212 3209 3077 1555 -70 -2129 -3341
616 -3341 -3106 -1563 383 1929 2918 2799 1666 -104 -2019 -3164 -2908 -1718 -203 1593 2682 2568
632 2568 1690 192 -1823 -2806 -2744 -1689 -159 1475 2334 2533 1900 63 -1013 -2449 -2418 -1794 -550 1042
650A042J026J72m64j126j672p96j88J52J339J367Q29J22k91q17j555p87k85K08
668a724J084J188J151L19l25r40j361r27l29L82Q43R60Q81M94j74r11q85n01p36
687a511J31P68J020O55O03l62n20j008p33n52o0P69R25O31P42k60l94o53p83m26
707a018k22L76R31N82O61k39m24l92r91J39n06N71L18Q90K83J20j63m37q45q84
727a250O3K81O04N79O74Kj24m12r30k72n9Q2L24O83M76O7K45n38m16p14j94J51
749f78L52K71N39L26J70q07m37r2m65r8N73O74N49%j72j37o13l52k41J5K38M13
771B8K66K71L24n23m53m67J62k26K35N10L49K24Pk20j56n43k95m7J75J30M27M56
793F34k27R2j79o82k25k85K47M32K75M44M5n2j70m67j28k38m91Q57OM13Q7K42
$$ plain form
650 1042 2068 2240 1776 650 -1022 -1818 -2006 -1854 -515 852 1681 1803 1512 695 -860 -1647 -1932 -1724
668 -1724 -640 548 1699 2018 1693 753 -608 -1535 -1864 -1482 -639 321 1202 1696 1522 611 -274 -775 -1511
687 -1511 -1380 -612 408 1063 1666 1304 784 -224 -957 -1509 -1569 -800 125 756 1498 1238 844 191 -592 -1018
707 -1018 -1240 -864 67 649 1310 1071 647 255 -736 -597 -1103 -532 -214 676 959 1079 916 479 -366 -1250
727 -1250 -1187 -906 -302 277 951 953 829 417 -513 -785 -844 -762 -438 245 721 788 1033 495 79 -635 -829 -678
749 -678 -326 -55 484 810 980 173 -264 -356 -821 -919 -346 328 877 877 705 568 -45 -397 -638 -623 -385 28
771 28 294 565 889 366 -87 -554 -392 -618 -383 127 476 700 707 487 331 -212 -507 -554 -379 -249 178 634
793 634 407 499 320 -362 -587 -872 -625 -193 82 526 571 519 349 -118 -246 -484 -975 -118 -112 301 388 630
815F30l72l25k53k28J88n2M32J07K54rL59m96q06O0K43O9M3L55J18L05l86l59
837a23m1k04l33K83M73K11J32J21j81k89m4n56J30J18J79K70K49r7P3k34J57r53
859f59K38o0J23O51J5K08N1l41k95o2n19L68M5J48K72K43o4J9k81n10k47L49K08
882a00J30L57r9P8l9k13j05l85k27J24M17N01j6M5l45P9l68l60M3k53O74K20M6
905B04J1M15m27k44j51M4k39L01L2M07J53m21j70j10M9o9J15N9J87K31Po7k82
928C5p3k22j69K85j6M00K38k98j89m0J45l13K19l03K53K78j91L96l43m7K7k89
950b17L9p3J08K81q5L17j67L6j66k95m0qP1N4K91J51k38N3p8p7Ok41J88K13q8
975C5L46j81K3k09Q8l22J98o1J89L38k26k50R8q7l03N4j84L37J87p5J32L41l88
$$ plain form
815 630 258 -67 -320 -548 -360 -412 20 127 381 372 731 235 -571 -511 -268 -199 -156 199 317 622 236 -123
837 -123 -164 -368 -701 -418 55 266 398 519 338 49 5 -551 -421 -303 -124 146 395 298 371 137 294 -659
859 -659 -421 -481 -358 293 308 516 567 226 -69 -131 -650 -282 -237 -89 183 426 362 381 100 -410 -657 -308 -100
882 -100 30 387 288 366 327 114 9 -376 -603 -479 -62 439 423 468 123 202 -166 -526 -483 -736 -62 158 204
905 204 215 630 203 -41 -192 -148 -387 -86 -54 353 506 85 -85 -195 -146 -215 -100 -41 146 377 384 317 35
928 35 -38 -260 -429 -144 -160 240 478 180 -9 -49 96 -217 2 -301 -48 230 39 435 92 45 72 -217
950 -217 -178 -251 -143 138 53 370 203 239 73 -222 -262 -270 -199 -145 146 297 59 112 34 -43 -37 -278 -90 123 35
975 35 381 200 223 14 102 -220 -22 -83 106 444 218 -32 66 -21 -324 -270 -454 -117 70 -5 127 468 80
998H0j17j51j76M53j82Q9K73k92L08j17k3k71K74k05n4J13J76k17R5mj5m9j97
1021b09k38M76j27K60J63J72m66l33J14j69P0L74o4P0M6k34J15j25N0l91L70j78
1043b54J65K30oj96j69L87m05N7J6J36Q2j47M68O4m86j7j29j9P1j26M88j74K11
1066B47m8l51J09n0o3K57l35K67r6M01m27K70k81r5K03k20p4L32L47j85l1j23
1088E4p5q6R8j75Q3J75K3n3J26j63L1p1N6q7n2N7M27J11j56k36k40r4N7j89J99
1113a80n4L27j31J95R4k92Ll5m3J4M52j20O1m61M0N9n7j09J87m7L30l05L58l49
1137f3Q4m5j14J91k20J37J81j60J69k43M19r2n44J26k18J60K13J58J5k01K69R9
1159C21m12P1k03M63m90K80J55Jj8L04m96j20j75K01QL39j94j39K03J07k48R3
$$ plain form
998 80 -37 -188 -364 89 -93 -4 269 -23 285 168 145 -126 148 -57 -111 2 178 -39 56 52 37 -12 -209
1021 -209 -447 29 -98 162 325 497 31 -302 -188 -357 -287 87 23 93 139 -95 20 -105 -55 -446 -76 -254
1043 -254 -89 141 135 -61 -230 157 -248 -191 -175 -39 43 -104 364 428 -58 -75 -204 -223 -152 -278 210 36 247
1066 247 199 -152 -43 -93 -156 101 -234 33 -63 338 -89 181 -100 -195 8 -212 -286 46 393 208 177 54
1088 54 -21 -107 -9 -184 -101 74 97 44 170 7 38 -33 23 -64 -116 -59 368 479 323 87 -153 -247 -190 -379 -180
1113 -180 -234 93 -38 157 251 -41 -38 -73 -116 -102 350 230 291 -170 -130 -71 -128 -237 -50 -97 233 -72 286 -63
1137 -63 21 -24 -138 53 -167 -30 151 -9 160 -83 336 244 -300 -174 -392 -232 -19 139 154 -47 222 321
1159 321 -91 -20 -223 240 -250 30 185 186 168 472 -24 -144 -319 -118 -110 229 35 -104 99 206 -42 51
1181E1l73J08J85j6K67qK16l51j83K88m83J20j13L08Q6J16K72j46l38j04%J47
1203D9r3q6K83N8p2j44p2l1l5k05M06k88J01K13K55M1n43J79k76J09J79j8k9K63
1227B44n5R0k59J34l18o3P4J95P0M09o27K00Q8k65j71J58J84j24J50O4J3j04J15
1250B02n1k58k39L34k06L65j21O8P5j88J04j62k44n7N48k55L19R8j46J56l88j68
1272b14Qk01K55J11L95k14J56n2j94j99N4L5RP0J30N9J3N8j54k67O7q5K48m20
1296c32M27K01k9j82j30L7j17K18o7rj7n6K90k94P5J31k44j85L25l31K41k7J34
1319E9N06n20l8k29L00k59L08k17K53J36j65Q0k12j51qk19qL74l9K65j5k91L12
1342B22j35j75J95k40P4l1J83K83k45j76n5j14P9k18J27K87J89j89J37k66Q8K30
$$ plain form
1181 51 -322 -214 -29 -45 222 214 430 79 -104 184 -299 -179 -292 16 102 218 490 344 6 -98 -98 49
1203 49 -44 -130 153 211 139 -5 -77 -108 -143 -348 58 -230 -129 84 339 380 -163 16 -260 -151 28 10 -19 244
1227 244 189 279 20 154 -164 -227 -153 42 112 521 -106 94 182 -83 -254 -96 88 -36 114 178 191 87 202
1250 202 151 -107 -346 -12 -218 147 26 94 169 -19 85 -77 -321 -378 170 -85 234 332 186 342 -46 -214
1272 -214 -206 -407 -152 -41 354 140 296 244 50 -149 -95 -60 -51 19 149 208 221 279 125 -142 -75 -160 88 -332
1296 -332 95 296 267 85 -45 -8 -125 93 26 17 0 -56 234 -60 15 146 -98 -283 42 -289 -48 -75 59
1319 59 565 45 7 -222 78 -181 127 -90 163 299 134 214 2 -149 -157 -376 -384 -10 -49 216 201 -90 222
1342 222 87 -88 107 -133 -59 -90 93 376 131 -45 -100 -214 -135 -353 -226 61 250 61 198 -68 20 250
1364B50n28K27j7J02R5k8N6r7N8q2k73N6J96j60K61l4L66m60%J07k20J25j48M05
1388B57l58K16J22L8j51q3L4k45n4j4L25N9l05L07j33L9j51J36L9k1n4N8j01J35
1412I5k17J20k43L37k5j07k2K16J10l18K07k51J2j01l8K50L18k57o9K2R2k10j37
1435b16k4n5JM41o7j27K22j27K7r8n4J91O0k94J23K15j50J12m11K49j69rK23r6
1459c3Qq2RK03k7k15J7K61j82J07r9j30L82k11J09O1l38J72J55m13N2M84j09m37
1483b56N43m22Q2l10L77n7j18Q1K9L38l1j18k08J85l0j68J52j86J7L00j87J14
1505A27Q6k13j96K42n6j10J68j09Rj33K54j53K32l34P9K78nn3L0j30Q6j26k11
1528b38K58J3l3j77L90j08K0j14O2k10p2J67K09l17L84m17K71j65K18m18J87J84
$$ plain form
1364 250 -278 -51 -68 34 129 101 157 60 118 36 -237 -181 15 -145 116 82 448 -12 -12 95 -125 0 -148 257
1388 257 -101 115 237 275 124 41 75 -170 -224 -238 87 146 -159 148 15 54 -97 39 78 57 3 61 -40 95
1412 95 -122 -2 -245 92 67 -40 -62 154 264 -54 153 -98 -86 -187 -225 25 343 86 17 39 131 -79 -216
1435 -216 -240 -295 -294 147 80 -47 175 48 75 -23 -77 114 174 -120 3 218 68 180 -231 18 -151 -160 63 -33
1459 -33 -25 -107 -98 105 78 -137 -120 141 -41 66 -33 -163 219 8 117 178 -160 12 167 -246 -194 290 181 -256
1483 -256 287 -135 -53 -363 14 -43 -161 -80 -51 287 256 138 -70 115 85 -83 69 -117 -100 200 13 127
1505 127 213 0 -196 46 -10 -120 48 -61 -52 -185 69 -84 148 -186 -107 171 166 113 143 13 99 -27 -238
1528 -238 20 33 0 -177 213 105 125 11 73 -137 -209 -42 167 -150 234 -183 88 -77 141 -277 -90 94
1550I4k37n0L45j44j23j20K89k59J42J37o4J10K14j2n43L89k22j21K0J97j24K52
1572A70P7k03j84K11K00l75J33o5Q6j60k0L22l64M10l73M4L25k35J91k62l3J72
1594F7q4J4L80j77l52j03L88m06L36J13j38k8j01J95r8j55L25m2k06J78k58l3
1616a85o5L02jj72L77j81J39n42K86k36K70j28q3J11j06K38j62r4M56j91r6J67
1638A04j59j84L06k49J23j21J47J87k86J66j69J52k11J78K3l3K54l50R2J17M6
1659A33j50l4k12J87K7p3J48q9k0L9q5P0J45J43k63L94l96NJ36r6M8l00J14J09
1683b0Q0j47j53Q5K78o13M91K09m6k99J27J81m44J72j11K50j63j45K07p7K39L70
1705D71l63L6j34q2L8j55O9P0Q7Q2j61J96m43L09q8J80j28MN8N0J11j20j5j78
$$ plain form
1550 94 -143 -193 152 8 -115 -235 54 -205 -63 74 10 120 334 322 -221 168 -54 -175 -155 42 -82 170
1572 170 247 44 -140 71 271 -104 29 -36 50 -110 -130 192 -172 238 -135 -91 234 -1 190 -72 -105 67
1594 67 -17 -3 377 200 -152 -255 133 -273 63 176 38 10 -91 104 6 -149 176 134 -72 106 -152 -185
1616 -185 -250 52 51 -121 256 75 214 -328 -42 -278 -8 -136 -219 -108 -214 24 -138 -232 224 33 -63 104
1638 104 -55 -239 67 -182 -59 -180 -33 154 -132 34 -135 17 -194 -16 7 -26 228 -122 -30 87 133
1659 133 -17 -51 -263 -76 -49 -122 26 -63 -83 -44 -129 -59 86 229 -34 360 -36 -31 105 9 57 -243 -129 -20
1683 -20 60 -87 -240 -155 123 -490 1 210 164 -135 -8 173 -271 -99 -210 40 -123 -268 -61 -138 101 471
1705 471 108 144 10 -72 -34 -189 -120 -50 37 119 -42 154 -289 20 -68 112 -16 -12 46 96 207 87 72 -106
1729a06P3M0N9k80J14J48R3j98L07l45j10K21j72L97l34K15k5P8j39o9k18L64
1751A13l3k39K67O8k52J14n6p7j0K62k77L92l82j3J12J20P8m48L23j68N6K04j64
1774a0O9R0k46K48r6q8J21j5o1j01J85L9M1k36j31J76r7L16k00k5o7j58M49j16
1798H7j08J0K86q0k89l3J32j90L08om2n7k25M8o8J88L18r3k34jJ46k22L47k14
1822Hm0J8J3n8J45m31L82l25O00l87K65j09m05K83P6J35n05M53o9j44L15m08K54
1845F6J53j50K8j39J33q7j85R1k61J27L59k74K71L9k71M7J78k05l54M77M6j29
1867d0o3K78p2K06k22j13jk6m0J13ro8Q9q5J3J24j60K12j70J57jo0m7P9q6pr4
1894i3q2L3M2O7J84j78KJ96m20L80k24O1P8O9j5J19j83j84lK03M4k11K88j23k64
$$ plain form
1729 -106 -33 7 66 -214 -100 48 141 -57 250 -95 -205 16 -156 241 -93 122 97 175 36 -33 -251 113
1751 113 80 -159 108 176 -76 38 -18 -95 -105 157 -120 272 -110 -123 -11 109 187 -261 62 -106 -50 154 -10
1774 -10 59 149 -97 151 55 -33 88 73 12 -89 96 135 176 -60 -191 -15 -112 204 4 -21 -88 -246 203 87
1798 87 -21 -11 275 195 -94 -127 5 -185 123 117 75 18 -207 -159 -227 -39 279 186 -48 -49 97 -125 222 8
1822 8 -32 -14 -1 -59 86 -345 37 -288 312 -75 190 81 -324 -41 35 170 -335 118 49 -95 220 -188 66
1845 66 219 69 97 -42 91 4 -181 -90 -351 -224 135 -139 132 171 -100 -53 125 -80 -434 43 89 -40
1867 -40 -103 175 103 309 87 -26 -27 -53 -93 20 11 -57 32 -53 -40 84 -76 136 -34 123 122 62 15 94 8 1 -93
1894 -93 -175 -142 -100 -33 151 -27 -25 171 -249 131 -93 -32 46 115 100 219 36 -148 -151 52 96 -115 173 50 -214
1919b14QL8L34j18J4j0j80M78k95K95k75l88Q7K05q6J27J54o9k9k48M44m37M3
1942a22L1j6L14j24j12L46j4j82k36L00l79K33p7q8r5L93j76J59n8j55J22j43
1964g9J41k51K06M6M9j63N2o1o5K20j0m3o4j13L45l35J11j74J69j25K61l51O7
1987a67K52K67r5O0m72L50k33J14j19L21k78k38L52j45J83k29J04j66J12o4J68
2008G7R5l32L04j06k38L14j76k8J33o3K02K9k57J82k9K48j56j59Q3k70J26j8J28
2031H9J70j78k7J59j37j09q3J20K10j18k41J61k9j92o7J55J86Jl10K38j90L10
2053A18J51j39j66j62L90j27o9Q7J04O2m02JL00k88L68J01k35p4k06N7k00N88
2075B59P5k31k18J22L7j11J90P3k59P9K60k69j21O1Q8K19l61J48n8l5K32k18J15
$$ plain form
1919 -214 -206 -168 166 48 62 52 -128 350 55 350 75 -313 -226 -21 -107 20 174 105 76 -172 272 -165 -122
1942 -122 -91 -107 207 83 -29 317 303 121 -115 185 -194 39 -38 -126 -221 172 -4 155 97 -58 64 -79
1964 -79 62 -189 17 63 112 -51 1 -60 -125 95 85 42 -22 -135 210 -125 -14 -188 -19 -144 117 -234 -167
1987 -167 85 352 257 317 -155 195 -38 76 -43 278 0 -238 114 -31 152 -77 27 -139 -27 -91 77
2008 77 172 -160 144 38 -200 114 -62 -90 43 -20 182 211 -46 136 107 355 199 40 123 -147 -21 -39 89
2031 89 259 81 54 213 76 -33 -116 4 214 96 -145 16 -13 -205 -272 -117 69 70 -240 -2 -192 118
2053 118 269 130 -36 -198 192 65 -4 83 187 249 -153 -152 148 -140 228 329 94 20 -186 -129 -329 259
2075 259 334 103 -115 7 44 -67 123 196 -63 16 276 7 -114 -53 35 254 -107 41 -17 -52 180 -38 77
2098G7l58P2L03l10R6L4L60k79O5l4j09L0N8R5k09j15R5J45kL09l7k53j96K93
2122A30k50M23m85K68j88MP7n9J82j09p2J98J4q8K0j37J08n16N02L2j38j15K00
2145AQ5k9O2Lk05o1J39J52MJ9m03K93p9J44k32J29j7j41J49l1M0k36M6K14J16
2170A62l47K45r7j64L62k68N0j11L08j66p2J51M7j31j14L17n8J16k39j01o0K29
2192E9J33k52m8QJ08j68J02N5j58r4J75J20J20k66n7J25J63j4K1k25R5L05l65
2215e8j33J82q1Nm1J27n5Q2O2r2j09K88m83J32M3O0L23k53mj89P0P1J89Q2P1m24
2241a35J30K2L3l01N9J02N4j86L55k34J32o8J36m4L5j33n2%o7L71l1r9j86R7J68
2266A58n8k94J44J72J49l27J1J89J1l03J63J85l27M41m6J05l81K36N2k58m58L39
$$ plain form
2098 77 -281 -209 94 -216 -120 -86 274 -5 60 26 -83 -53 5 100 -109 -224 -129 16 14 323 286 33 -163 130
2122 130 -120 303 -182 86 -102 -98 -21 -80 102 -7 -79 119 133 45 65 -72 36 -480 22 54 -84 -199 1
2145 1 86 57 119 122 -83 -144 -5 147 151 170 -233 60 -19 125 -107 22 5 -136 13 -18 22 -214 -168 46 162
2170 162 -185 60 -37 -201 161 -107 -57 -168 140 -26 -98 53 100 -31 -145 172 114 230 -9 -110 -170 59
2192 59 192 -60 -108 -100 8 -160 -58 -3 -161 -255 -80 40 160 -106 -163 -38 125 111 132 -93 2 307 -58
2215 -58 -191 -9 -90 -85 -126 1 -54 28 90 -2 -111 177 -306 -174 -131 -71 252 -1 -5 -194 -124 -53 136 218 289 -135
2241 -135 -5 17 50 -251 -192 -90 -36 -222 133 -101 31 -37 99 55 90 -43 -95 -95 -162 209 178 79 -107 -10 158
2266 158 100 -194 -50 122 271 -56 -45 144 155 -148 15 200 -127 314 268 373 -8 228 280 22 -436 -97
2288i7J96l93N03j40J46p2k42L6j01J75p6Kr5j0J55p7l6L88r2m02K84l4M4J98
2312B60k3j23p6k42L45k0k9K1r4k3L01m86J84R9l55K84J41Q5k56n9qj09K37Kj52
2337i6L03j51k15k23J78P8L3L93q9l51K46p0k21K12j92K20J72j30m3J77l10J12
2359C3J55k23j13J25O4j74J96k56K84j45J2p5J89j13K93j39j9k13J2L76n1k67
2381d9P7k82L61p3J94k77j8j08J14l8L55k73K09k36J24k18K33O5j12O8j92K73
2403A97o4k47l1J0K69k10J01J02k92K33J22j75k39L75k56j14j6J33M24k88k12
2424a78k3K04m1J66j96K27O3k30N0R0j81J8Q5K05k71pj11L56k89l05M32l1l30
2447b97M87j64jRj13K00j89j62M31m23O3KL13j24j23J04L7p6L47l48J65j14j61
$$ plain form
2288 -97 99 -294 209 69 215 143 -99 -63 -164 11 -65 -63 -158 -168 -13 -90 -126 262 170 -232 52 18 62 260
2312 260 237 114 38 -204 141 121 92 113 19 -4 297 -189 -5 94 -261 23 164 249 -7 -66 -74 -183 54 56 -96
2337 -96 207 56 -159 -382 -204 -126 -93 300 211 -140 106 36 -185 27 -165 55 227 97 54 231 -79 33
2359 33 188 -35 -148 -23 41 -133 63 -193 91 -54 -42 -117 72 -41 252 113 94 -119 -107 269 218 -49
2381 -49 28 -254 107 34 228 -49 -67 -175 -61 -99 256 -17 192 -44 80 -138 95 160 48 116 -76 197
2403 197 133 -114 -145 -135 134 -76 25 127 -165 68 190 15 -224 151 -105 -219 -235 -102 322 34 -178
2424 -178 -201 3 -38 128 -68 159 222 -8 42 132 -49 -31 54 259 -12 -19 -130 226 -63 -368 64 33 -297
2447 -297 190 26 25 34 -79 121 -68 -230 201 -222 -159 -157 156 32 -91 13 50 -26 321 -27 138 24 -137
2470a37R8j24K30l19K45P8p7J40l5l51K05j72L06j80K0Q3q2J6L8L5N6j01Q2k51
2494a97L35j04k44O5J29J47l99J97L1K20l58J22k2J60m2k51K66J90p3k18j36L14
2516A32j82K15l8l2j17N2J9l04J78O9M7q3J45j02l9l2J43L43n93J23J68j74q3
2539a45K7m0K15j22k8Om5J82j2K08r8j87j06K65j64k10L00k49K14q8r1J5j05J13
2563a45M0J14L1q0K1NJ06p1L23n83M1L95l82J53j15L52k80O2k70K92J10q5n1j47
2587a64n5K38j86L9M70l13k98K19k6J37k77K57j98L1K79k19J58l33J64K57l11
2608a31J32p7R1k09j86N09K5k56J39j50J1R9J33J53m05L36k31M67n24Q0q9j78
2630b61M13j30k03J35K2n2J03n2J81k63K74k12L36j51k6j92P7J63K9l4J4r3o4
$$ plain form
2470 -137 -39 -163 67 -252 -7 71 -6 134 99 -252 -47 -219 87 -93 -73 10 -72 -56 -18 17 73 -28 54 -197
2494 -197 138 34 -210 -145 -16 131 -268 -71 -40 180 -178 -56 -78 82 40 -211 55 245 172 -46 -182 132
2516 132 -50 165 127 95 -22 30 49 -255 -77 -8 39 -44 101 -1 -40 -72 71 414 -179 -56 112 -62 -145
2539 -145 -118 -158 57 -65 -93 -87 -132 50 38 246 148 -39 -145 120 -44 -254 46 -203 11 -77 -168 -153 -258 -145
2563 -145 -105 9 40 -40 -19 -14 92 21 344 -239 -198 197 -185 -32 -147 205 -75 -13 -283 9 119 34 -17 -164
2587 -164 -219 19 -167 -128 342 29 -269 -50 -76 61 -216 41 -157 -126 153 -66 92 -241 -77 180 -131
2608 -131 1 -76 15 -194 -380 129 154 -102 37 -113 -102 -3 130 283 -122 214 -17 450 -74 6 -83 -261
2630 -261 152 22 -181 -46 -24 -76 27 -25 156 -107 167 -45 291 140 114 -78 -1 162 191 157 171 78 14
2653A4J22Q9k66R9j1%q6lj73J80J24j93J22K70m23K76j66M6j01O5J07k03r0L28
2677A27j48J62O3k1L2j94m9N8j33r9L17j34j22L58j69j46J22j31J59j71J54M3
2699G8r4R3j87O0j8j14K34O0l84Q7K30k54K07K46k90k2P5n3JJ10j07J76j32j19
2723a17R0L5N73o85L65m44j37J07L05J57j80j28N3J91L0K9k19l53K93O1j68N6
2745h6M5K0L38j45L6j87k8M9q4j47L06k33J37K85l14L98m95j39M3J63j33M31k29
2768C1j38l12M25J0N7l88K33j27M66j64j72RJ01K23m85K32J3j77M24j57J12n4
2790A62p6J40k60k60O40j02k77J38n7l6Pj17j55L50o7J51o2j10j6m4k01M22k53
2813h3K9J89K40n02J19K31m4k58j24J42j47K72L08m13R8l6j4O4k17J75j5j16K3
$$ plain form
2653 14 136 225 -41 58 47 47 -39 -42 -215 -35 89 -104 18 288 -135 141 -25 21 -80 -15 92 -111 -201 127
2677 127 -21 141 204 183 215 21 -28 30 -103 -202 115 -19 -141 217 48 -98 24 -107 52 -119 35 78
2699 78 -16 77 -110 -50 -68 -182 52 112 -272 -185 45 -209 -2 244 -46 -68 7 -46 -45 65 -42 134 2 -117
2723 -117 -27 8 581 -104 261 -183 -320 -213 92 249 69 -59 -6 185 215 244 25 -328 -35 26 -142 -86
2745 -86 -41 -21 317 172 208 21 -7 42 -42 -189 117 -116 21 306 -8 390 -105 -244 -201 -38 -171 260 31
2768 31 -107 -419 6 16 73 -315 -82 -209 257 93 -79 -70 31 254 -231 1 14 -163 261 104 216 162
2790 162 86 226 -34 -294 346 244 -33 105 48 12 19 -98 -253 97 30 181 119 9 -7 -51 -252 170 -83
2813 -83 -54 135 375 -127 -8 223 179 -79 -203 -61 -208 64 372 -41 57 21 7 71 -146 29 14 -102 -79
2836g9j02R4J61k41L02j68J0J8J51l52M06j85J7o6J41k97L3K46k45M45m44L29
2858A74j50j60J14J44J36m02J20RJ03k27J62j09M9J57J37l53J34K7j88M6m4L50
2880B29k29j81j98M27o4j26L36j64mJ24q4J25j98j06L1M8P4j91J57j04j11M35
2902B26o8L24m40j6O3k35J96j71J40j63l0L52k76L02j63j67kp3L53o2j58m2K76
2925A66l27J35L02Q6l65j81J34M9j59J7L33r9j28m6J86j82O4Q2k47L93k96r9K75
2948I3j42m5j30J24j71K68L29k41o4j41J09k35K44O7j3j6j64J30Q1r4k7o4m2J55
2972A1p8J01o7%K54k21j75L68k82K9K58m48J72j09L05j74J09J1j99J02%Nl04L49
2996A7K11k11n5r5J11J47k0l67P19n34K23N0J6k8k82L2Q5L1j67J40m9M7K09m8
$$ plain form
2836 -79 -181 -87 74 -167 135 -33 -23 -5 146 -206 200 15 32 -34 107 -190 -157 89 -156 289 -155 174
2858 174 24 -136 -22 122 258 -144 -24 -15 88 -139 23 -86 -37 120 257 -96 38 65 -123 -77 -121 229
2880 229 0 -181 -379 48 -16 -142 194 30 26 150 66 191 -7 -113 -82 -34 40 -151 6 -98 -209 226
2902 226 158 482 42 26 89 -146 50 -121 19 -144 -174 178 -98 204 41 -126 -128 -201 152 90 -68 -110 166
2925 166 -161 -26 276 362 -3 -184 -50 -1 -160 -143 190 91 -37 -83 103 -79 -15 67 -180 213 -83 -182 93
2948 93 -49 -94 -224 -100 -271 -3 326 85 21 -120 -11 -246 -2 65 52 36 -128 2 83 -11 -38 -102 -144 11
2972 11 -67 34 -33 -33 221 0 -175 193 -89 -60 198 -250 -78 -187 118 -56 53 64 -135 -33 -33 -28 -332 17
2996 17 228 17 -38 -133 -22 125 105 -262 457 -77 146 196 212 184 -98 -66 19 50 -117 23 -26 21 230 182
3020A82n2k4J5j6j34j27K14j37J37j05j8R7j44L45k41P5k63O9M8P9j72K59J09
3043A96k40k4k43L45K4k57L21j99k48M36k25q0O9l9p5J72K09J17n2j03k08R4K32
3066B22k03q0k3J05p8n2K06pj92K58J90k79j81J76j48LJ8J8L3P6J30k65K17k90
3090a46o9R0J96J0o3J1J30J2l49J78K90l89L27k36k6K31M7k99j90K25J44P8l33
3113a31J82j22J94j84J64k48J63k06J90J76l07J84J83m42n0K55qJ56k2j20j67
3134a60L18k65J49o3L12l95j30J04j23L76k22j14J70K52k69K20r9O1n30L12L2
3155f4k2K80j20j79K07q7KJ8m3K79k99J97j50l13L50j86Q9J64j88P9l3J87l57
3178a89J49j41q1J91J03p7j22J28j44J12J29j40Rm7R1p0J21j19m3K05Q5k18J85
$$ plain form
3020 182 130 106 121 105 -29 -156 58 -79 58 -47 -65 32 -112 233 -8 67 -196 -127 -79 0 -172 87 196
3043 196 -44 -68 -311 34 58 -199 122 -77 -325 111 -114 -194 -125 -164 -239 -67 142 259 207 104 -104 -10 222
3066 222 19 -61 -84 21 -57 -109 97 90 -102 156 346 67 -114 62 -86 -83 -65 -47 -14 62 192 -73 144 -146
3090 -146 -215 -125 71 81 18 29 159 171 -178 0 290 -99 228 -8 -34 197 244 -55 -245 -20 124 202 -131
3113 -131 51 -71 123 -61 103 -145 18 -188 2 178 -129 55 238 -204 -254 1 -7 149 127 7 -160
3134 -160 158 -107 42 -21 291 -104 -234 -130 -253 123 -99 -213 -43 209 -60 160 61 122 -408 -96 -64
3155 -64 -86 194 74 -105 102 15 17 35 -8 271 -28 169 19 -294 56 -130 -41 123 -65 14 -19 168 -189
3178 -189 -40 -181 -262 -71 32 -45 -167 -39 -183 -71 58 -82 -73 -120 -29 -99 22 -97 -140 65 150 -68 117
3201A17J04k45K1%j55L7K68j13r4r6K32K42j12k88M6k4j97Q01n70N6K63m74N38
3224C57m23P6j14J71QL30j80j61J37k57nP7p1J65k02K4k40N8J61j46L22L4j58
3247c7K53Mo56L19R2j67J70m1J99j13k28m3J37J33k82J83j17L35j31k10J56k08
3269b52N22k24j06N61m91J45k36M15m57L13k02R7r7P5m3K15j56m4r9p4J64Q3m5
3292F4k3j80J25K19j11Q1j97M2m7m3R5o1K10j36l9K58l96l0J55K26n94L66j45
3315a61M77j86J5j72J24j63K03o9k44M19k07J1o9kk45M39m94L16PJ02j99Kk1O
3339a11n0O4K51l44M18l04n5N4J4J54j45K89l23R3j12J51j7n1n3r1K76j28J2k02
3363b10K19L9J8k06J43R3j88L16o6l12n1K12K50j68L4P3k24j1J66l42P3p4J87
$$ plain form
3201 117 221 -24 -3 -3 -158 -121 147 34 -60 -156 76 318 206 -82 -36 -60 -257 544 -26 30 293 -181 357
3224 357 -66 10 -104 67 75 405 225 64 201 -56 -61 16 -55 110 -92 -68 -308 -250 -89 -235 87 121 -37
3247 -37 216 220 -436 -117 -25 -192 -22 -63 136 23 -205 -248 -111 22 -260 -77 -194 141 10 -200 -44 -252
3269 -252 270 46 -60 501 10 155 -81 334 -123 190 -12 85 -12 63 20 235 79 35 -64 -138 26 109 64
3292 64 41 -139 -14 205 94 175 -22 20 -27 -70 25 -36 174 38 -1 257 -139 -169 -14 212 -382 -16 -161
3315 -161 316 130 145 -27 97 -66 137 68 -176 243 36 47 -22 -24 -269 170 -324 -8 -1 101 -98 -96 -117 -111
3339 -111 -161 -97 154 -190 228 -76 -131 -77 -63 91 -54 235 -88 5 -107 44 27 -24 -77 -168 108 -20 -8 -210
3363 -210 9 48 66 -140 3 96 -92 224 158 -154 -205 7 257 89 123 196 -28 -39 127 -215 -142 -216 -29
3386b9k4J11j37k00L27M7J73j26j31K39p3n30N29l81J02j8n4nK02k49J90n1K92
3409B04k52J66k19mq4M6jJ44q7k6j18J72MO9K6q2R0o5pj51j4K49j78J93r2K09
3435A92l99K99mO6p6k2j07j77K60j03K66l53K67P0j72j25K8J47M8Q2k69j57K41
3458Bk7J43j1k33M10l18j28M26n07O44l59j70%K5K99k60J9Rjj8J48j32J2o8M19
3483C24j25j92o4R2o4J88J5n3J59m78K73J07l76K83n8q0%Q9j2J80l13J16k63L67
3507A15jK7m02K16K50j88J46k91K81k40K15M5r3j11J6J7j85J00L56j89O7k60J85
3530G6n9O6j76L41l07R1n7q9K20k93J81P7j15L64n24P7J85k28o1P4m0j13M25k56
3554a41kJ76l84L41L82m10P7j69K43J05m21K10K39l09M1K03ok72J23J10ql7j78
$$ plain form
3386 -29 -53 58 -79 -279 48 95 268 142 11 250 177 -353 176 -205 -103 -121 -175 -180 22 -227 -37 -88 204
3409 204 -48 118 -101 -105 -189 -143 -144 0 -87 -113 -231 -59 -55 14 40 -42 48 -17 -24 -175 -189 60 -118 75 -17 192
3435 192 -207 92 88 154 78 56 -51 -228 32 -71 195 -158 109 179 7 -118 -90 57 105 187 -82 -239 2
3458 2 -25 118 107 -126 284 -34 -162 264 -243 401 42 -128 -128 -103 196 -64 -45 -36 -37 -55 93 -39 -27 -95 324
3483 324 199 7 -57 35 -29 159 174 121 280 -198 75 182 -194 89 31 -49 -49 40 28 208 -105 11 -252 115
3507 115 114 141 -261 -45 205 17 163 -128 153 -87 128 173 80 -31 -15 2 -183 -83 273 84 151 -109 76
3530 76 17 83 -93 248 -59 32 -25 -114 106 -187 -6 71 -44 320 -204 -127 58 -170 -231 -157 -197 -310 115 -141
3554 -141 -143 33 -351 -10 372 -38 39 -130 113 218 -203 7 246 -63 -22 181 175 -97 26 136 128 91 -87
3577h7J55j19K69j86k42K78j07O9o3l4n7L60m06j15N29n1k7j91J5q0k12M02k18
3600a18j66K14L24q3k38K35j41R5k67J87j27r5j36K68K10k49M7j12J12jn9L65
3622B65l03J91l27J31M2n6R6l7J17L3j0n6q4j3j13J23J57m2J59k30L2r3N7K65
3646C04m81K40P9j29k02N29l03j10M9j78J76K88q2m7j77P0J59j15j95O0P6L1m0
3669Bq3J63j80J93J0K01k50k01L07j73l6l5J65l07K56K30m4m88L21j59PK96k95
3692a00j63M37J04n16J78m4L37j26j4Ml3l7K7m5j5r1J13j38jM7K58l04R4j45J18
3717e5R3j86n3l2J90J53J94l35l2J35q9Jk00M13j02k49j05K67l5K28j94Q5J05
3740A97J0p1K64l46q4r1j4J8N0n9R1kp4K46j80K1O4J27l23K26k04L71j06k50J17
$$ plain form
3577 -87 68 -51 218 32 -210 68 -39 30 -33 -67 -124 236 -170 -285 244 193 166 -25 -10 -90 -302 100 -118
3600 -118 -284 -70 254 171 -67 168 27 122 -145 42 -85 -180 -316 -48 162 -87 -40 -152 -40 -41 -100 265
3622 265 -38 153 -174 -43 -1 -57 39 2 119 152 142 86 2 -11 -124 -1 156 114 273 43 75 -18 39 304
3646 304 -177 63 142 13 -189 340 37 -73 -24 -202 -26 262 180 133 -44 26 185 70 -125 -65 11 42 2
3669 2 -81 82 -98 95 105 306 56 -145 162 -11 -47 -82 83 -224 32 262 218 -270 51 -108 -101 195 -100
3692 -100 -263 174 278 -238 -60 -104 233 107 93 97 64 27 54 9 -6 -97 16 -122 -123 -76 182 -122 -28 -173 -55
3717 -55 38 -148 -201 -233 -43 110 304 -31 -63 72 -17 -16 -216 197 95 -154 -259 8 -27 201 7 92 197
3740 197 207 136 400 54 -30 -121 -135 -117 -67 -126 -35 -37 -111 135 -45 -24 40 167 -156 70 -134 237 131 -119 -2
3765bl5o2j9j49L45k61K6L42j7k40L4j63J62q2R9l19J33L34k07j75K94j47N2N3
3789dl1%K41J24l61J53j11J71m08J44r1K32j28K60l00K41l35K71J31j27J18j67
3811B3j36J33J58k56K09k53R6M32n46J15O3J10k15R6K5j64J92l4M0Nl6R1J76j45
3835A79j28j02J12Lj0l23K59n2L4J11j94J04l94L67N5L3O0r1j32L6j31q2L66l10
3859b30K34k5R0p2j3M2J39k45j77J06K06J68k60J25k18L55n06J16K7L73k18q7
3881g0jM6L90k26k84K2K9r8M50l11qP4p1j66K01r5K31k51L25l45K19J44m35K29
3905aJ7j69J35N9J91k09J49N7r6k6k66Q0N6n2L6K68l68M15j61k37p4M1J68j28
3929a15qK81j65K03m78K96P6j79k52L5K43o4L31j31J45l34K71j64J69j30Q1jk54
$$ plain form
3765 -2 -37 -99 -118 -267 78 -183 -157 185 168 -72 -38 -201 -39 -121 -22 -341 -208 126 -81 -256 38 -109 -57 -4
3789 -4 -35 -35 206 330 -31 122 11 182 -226 -82 -173 59 -69 191 -109 132 -203 68 199 72 190 23
3811 23 -113 20 178 -78 131 -122 -26 406 -140 -25 38 148 -67 29 54 -110 82 48 88 93 57 148 324 179
3835 179 51 -51 61 64 54 -269 -10 -62 -28 83 -111 -7 -401 -34 21 54 114 23 -109 -73 -204 -286 80 -230
3859 -230 4 -21 69 -3 -16 26 165 -80 -257 -151 55 223 -37 88 -130 225 -281 -165 -138 235 17 -70
3881 -70 -71 -25 365 139 -145 -123 -94 -192 258 -53 -61 13 -58 -224 -23 -118 113 -138 187 -158 61 205 -230 -1
3905 -1 16 -153 -18 41 232 23 172 229 133 107 -159 -79 -23 -75 -39 229 -139 276 115 -122 -196 -155 13 -115
3929 -115 -123 158 -7 196 -282 14 90 -89 -341 -306 -63 -127 204 73 218 -116 155 -9 160 30 111 110 -144
3952a44J27N2J48j43k1k19L69k60J62k64J21K25m11M04j38j59N2J47k63M52j24
3973A13m5k25K00p7k01J90J7l9j64K03J08r8K80M1m16K48k06J17k4O9k33O9K65
3996A92l16n6j8J55RM3jl29M41j42J37j83J25R0j04m07L87p4o6J7j3J49l33M79
4020A82k61K05j04J28k58K18O9l60K66l28j4L39j3j27n2J3J34jL04m60K68j13
4042C5j57q5K64j36K72j77l3O3L6q0p0K75Q7k62K54m31J13j06J23O4p4L9L77m72
4066h1n1J14J05M0j97K37j61J7j82K40l75P53j52m06K1m0o7K46P1j60j88K39Q3
4089A06r1J25j54l45K07K62j33P3j74L6J06K42j54p6mJ9j27O7o6K4n5R4K05q5
4113A02j44O7J16j78J45k56L22k79J75l08K50J04J20j27j66j94J35J75L3J5m22
$$ plain form
3952 -144 -17 35 183 40 19 -200 169 -91 71 -193 -72 153 -258 146 8 -151 -99 48 -215 237 113
3973 113 68 -157 43 -34 -235 -45 -28 -67 -231 -28 80 -18 262 303 -113 135 -71 46 22 91 -142 -73 192
3996 192 -124 -180 -198 -43 -34 9 8 -321 120 -22 115 -68 57 147 43 -364 23 -51 -117 -100 -113 36 -297 182
4020 182 -79 126 22 150 -108 110 179 -181 85 -243 -257 82 69 -58 -110 -97 37 36 340 -120 148 35
4042 35 -122 -207 57 -79 193 16 -17 46 82 2 -68 207 294 32 286 -145 -32 -138 -15 49 -25 14 391 -81
4066 -81 -132 -18 87 127 -70 167 6 23 -159 81 -294 459 307 -99 -78 -118 -185 61 132 -28 -216 23 106
4089 106 15 140 -14 -359 -152 110 -23 50 -124 -88 18 260 106 30 26 45 -82 -15 -81 -57 -112 -18 187 102
4113 102 -42 25 141 -37 108 -148 174 -105 70 -238 12 116 236 109 -57 -251 -116 59 92 107 -315
4134c15L41p3J18l84J88rK19j30K30l24P0J0k1Q3j1J66J11k71L9J14k07J47Op3
4158B4L7k02M31k99J84k23J1n1J72j75J63k08L6J57j20J37k09K42k67L39k5k06
4180e2r5R0R5r9J36k67K34K66n31K80k55L15n0K48k09k74M34n64L02k8K33K7l80
4203a44l4J90K9j55J87j01J19m76O61j50o9j28o1L02m39M75j30k14K27k7q8O5
4225C9Q4K3j61k00K70J33J32m91Q9J60p7K54k73L7RL1J95m06l9j61M41m1nJ34
4249A77k07M9j47K05k27K99j88j72J50K8N1K36p3o7j58o8K23o0n1l23L76Q1R9
4272B33l36J82j88J84j42q0K04j26J95j07j14M89o09J17L69k61m9pJ86j06r2q9
4294a47K75j79J97j72p3L6k3l0J8J78l68L4K72M6o8j23J97J36l06J53k65J44K77
$$ plain form
4134 -315 26 -47 71 -313 -125 -134 85 -45 185 -139 -69 -59 -80 3 -8 158 269 -2 37 151 -56 91 97 24
4158 24 61 -141 290 -9 175 -48 -37 -88 84 -91 72 -136 -100 57 -63 74 -135 107 -160 179 154 -52
4180 -52 -147 -57 38 -61 75 -192 42 308 -223 57 -198 117 67 315 106 -168 266 -298 4 -24 209 236 -144
4203 -144 -178 12 41 -114 73 -28 91 -385 276 126 57 -71 -132 170 -269 206 76 -138 89 62 -26 39
4225 39 123 146 -15 -215 55 188 320 -171 -82 78 1 255 -18 19 28 59 254 -152 -191 -352 89 48 43 177
4249 177 -30 19 -128 77 -150 149 -39 -211 -61 -33 18 254 181 114 -44 -112 111 51 0 -323 53 134 233
4272 233 -103 79 -109 75 -67 -147 57 -69 126 19 -95 394 -215 -98 271 10 -39 -46 140 34 -58 -147
4294 -147 128 -51 146 -26 -99 -63 -86 -116 -98 80 -288 -254 18 64 -4 -127 70 206 -100 53 -212 -68 209
4317B09k46r8K57L1O6j65J8j77N2L3m9J4l8R0j23K37o3l7j04O6m7p9J06J14O5
4342A32P3m54L81r8o4k46K64K19m03L39j86j65L55j48ok54P3j4J81K10j23QJ14
4365A88n57K59R2k4N7l6K12j90J96l43J69n2j8J93rl90L38k18j75L40j43l0L94
4388B53l31l6J70k19M51k82J67N5j81l4k8j19K0J02k3J20j8k99K8J84j6r3j12
4411b41K23n2r0Q3J75o8L0j71n8L08l73M26j34j65J00k2j03M09m10L00jl59J13
4434h0k9O7p8J62J22r3J74l25J48K05k16l6p1j6K20p1m7o3Q2J2j44p7R9L8j3M
4460b6j30j57L46q9J95j10J15j70k68O09l34k2j62J07J00p4L80j53j98O6r5KL29
4483B61k05j24K54j52p2j95K93R1N8k0j79l5P8P8r9L33l18J49k75N2l04L64l3
$$ plain form
4317 209 -37 -135 122 153 219 54 72 -105 -53 -20 -69 -55 -93 -3 -126 111 48 11 -93 -27 -74 -153 -47 67 132
4342 132 205 -249 132 34 -30 -276 -12 207 -196 143 -43 -208 147 -1 -7 -261 -188 -202 -21 189 66 74 188
4365 188 -369 -110 -18 -42 15 -21 191 1 197 -146 23 -29 -47 146 137 -253 85 -133 -308 32 -111 -141 253
4388 253 -78 -114 56 -163 288 6 173 228 47 13 -15 -134 -114 -12 -35 85 67 -232 -204 -20 -36 -129 -241
4411 -241 -18 -70 -160 -77 98 30 60 -111 -169 139 -234 192 58 -107 -7 -29 -132 277 -133 167 166 -193 -80
4434 -80 -109 -42 -120 42 164 71 245 -80 68 273 57 21 -50 -66 154 83 36 -27 55 67 -77 -154 -55 -17 -30 -26
4460 -26 -156 -313 33 -56 139 29 144 -26 -294 315 -19 -41 -203 -96 4 -70 310 157 -41 25 -70 -68 261
4483 261 56 -68 186 34 -38 -233 60 151 209 189 10 -25 53 131 32 365 47 196 -79 -27 -331 33 0
4506@kJ52p3P0j29K32j60l35K03J42k95mL55l59L63l98J20m0J32Rk5j75oJ44R3
4531A4j00j20K14N1p7P1K06k56j27M1p3K63j09J38n6k68K11k3l2K54j84k85K71
4554B4l02L98o6k95L81j51K18k61M6J9j1L34k54l19K42j93L75Qj34M1m3k44J68
4577a9p0J43L8J16l60J36J69m13J58J5J4L38k21jK14o6q4R4k34j61J53J44l65
4600b62K61k01J80Qk8k85M03k42J43Q5l2L9mk43L5Q6J7K95m29J06J85l26J22J30
4624D3l1N1K26l15O1M3j38J6J31j68P1KJ00k48r2K58j00p1K48n7k67j0M6K61Q6
4649A46k83j7K59k55J09P1J99p8K40l17k3K06l83K01K87o7N2m52o8J73Q0o6Kj00
4673h4o4P5j5P9k13K72j29k72O1J32K28N3j12K29j56j87J39j87J01m4J59m00L31
$$ plain form
4506 0 -2 150 77 147 18 250 90 -245 -42 100 -195 -199 156 -203 160 -238 -118 -158 -26 -17 -42 -217 -223 -79 14
4531 14 -86 -206 8 59 -18 53 259 3 -124 -83 -156 107 -2 136 80 -188 23 0 -32 222 38 -247 24
4554 24 -278 120 54 -241 140 -11 207 -54 -8 11 0 334 80 -239 3 -190 185 193 59 100 57 -187 -19
4577 -19 -89 54 92 208 -152 -16 153 -260 -102 -87 -73 265 44 43 257 191 107 201 -33 -194 -41 103 -262
4600 -262 -1 -202 -22 -14 -42 -327 76 -166 -23 62 30 69 65 -178 -143 -57 -40 255 -174 -68 117 -209 -87 43
4624 43 12 63 289 -26 35 78 -60 -44 87 -81 -10 -8 92 -156 -248 10 -90 -161 87 30 -237 -247 -201 60 146
4649 146 -137 -154 105 -150 -41 30 229 151 391 74 51 257 -126 75 362 295 347 -105 -173 0 80 14 16 -84
4673 -84 -148 -73 -88 -9 -222 50 -79 -351 -290 -158 70 123 11 240 84 -103 36 -151 -50 -94 65 -335 -4
4696dk83L31R1j72J40l50M70j9j50k69J67k4m4J63jl1K31n65K22k3N2N5Q1k55
4720a87L19k72K33k71J55k27K15P%k00L82j37n6R5N5j4k46J78j79L31j18j35K1
4743e1R6j22R7P6Q8r4r1p7K59j64k41J87k10O5k0L47j23j05k8j04K42k52J29p1
4767a67J22J8j20J95K20K4l99N6L12l06k24M12j40k6J77K4j02o4J81j94O8j4k8
4790B5j82l7M8J09q6p5K61M9j76J15j94K83j45J02J69k07k42J09L06k49J67j55
4812ej72J93OM0j70K29J3j14J81l33J70j85j94M38r3N0L6J00k14r9J43j64J03
4835d1m3J21q0K36k41j50K57P8k4q9j48Q1J63j71J00l77J44J1J28P2j58J12RK58
4859B48j76k55J73p2J2J00K40r1J62k27j1J69n32J1J98r2J23J43p5j33l18M96
$$ plain form
4696 -4 -287 44 135 -37 103 -247 223 204 54 -215 -48 -72 -116 47 46 15 246 -319 -97 -120 -68 -13 68 -187
4720 -187 132 -140 93 -178 -23 -250 -35 -28 -28 -228 154 17 -39 56 111 97 -149 29 -150 181 63 -72 -51
4743 -51 45 -77 20 96 184 90 -1 -78 181 17 -224 -37 -247 -182 -202 145 22 -83 -111 -215 27 -225 -96 -167
4767 -167 -45 -27 -147 48 268 292 -107 -51 261 -45 -269 143 3 -23 154 178 76 12 193 -1 67 53 25
4790 25 -157 -194 -146 -37 -123 -198 63 112 -64 51 -143 140 -5 97 266 59 -183 -74 232 -17 150 -5
4812 -5 -177 16 22 62 -108 121 134 20 201 -132 38 -147 -341 97 4 54 90 190 -24 -123 20 -144 -41
4835 -41 -84 37 -43 193 -48 -198 59 137 113 24 -124 -43 120 -51 49 -328 -184 -173 -45 27 -131 -19 -10 248
4859 248 72 -183 -10 -82 -70 30 270 179 341 114 103 272 -260 -249 -51 -143 -20 123 48 -85 -403 93
4881I3J5j12R1k84j86J01J09L55l42K17j82J12j82j9M6J4J12J20j55L5J66r5n5
4904b6J61k74J62J01l24J25R3J32l5j04j87J51m8J23l36L16R4l96K55K5L9mJ76
4927B19l79j35L79j83j39K13l46K82J28Nm77M12n6J45n6J56j33M3k9Pj50K36J45
4950B87m36K27l21J72K27n8j61J46k63L10mj3k73R5K6P8q5N6P4l59J47L8K60l84
4974b14J81O3j61L02r2j62N7K29j44q4M2J51r1l09j51L24j70K13J1q0m0n1J25
4997e1M5p0P9j32K83m18K61J9j93K90k99K43l26L34o7Qj0K5o6k48K38J20j97K73
5021A41j69k01J04J43l14N01j09J97k39K19j72j00J67l1k47L3J75kp6j99K2O9
5043h8J0J31j84n8K90L26l81l2j19QK24k50K32j86j5J6J4K0M4J19p8Rr5k8r7K39
$$ plain form
4881 93 108 -4 87 -197 -383 -282 -173 182 -160 57 -125 -13 -195 -214 -168 -154 -42 78 -77 -42 124 29 -26
4904 -26 135 -139 23 124 -200 -75 18 150 115 11 -176 -25 -73 50 -286 30 124 -272 -17 8 47 43 219
4927 219 -160 -295 84 -99 -238 -25 -371 -89 39 44 -433 -21 -77 68 12 168 35 78 49 56 -94 142 287
4950 287 -149 78 -243 -71 156 98 -63 83 -180 130 126 113 -160 -65 -39 39 -46 10 84 -275 -128 -90 170 -214
4974 -214 -33 30 -131 171 79 -83 -26 203 59 -25 17 168 77 -232 -383 -59 -229 -16 -5 -85 -125 -176 -51
4997 -51 -6 -76 3 -129 154 -264 -3 16 -177 113 -186 57 -269 65 -2 6 -4 21 -45 -293 -55 65 -132 141
5021 141 -28 -229 -125 18 -296 205 96 293 54 273 101 1 168 137 -110 -77 98 96 20 -179 -157 -88
5043 -88 -78 53 -131 -189 101 427 46 14 -105 -97 127 -123 109 -77 -92 -76 -62 -42 2 121 43 52 -43 -71 -168 71
5069G1j78P8J00l84L40j66P6j9J20P5L0k95L95m07J45J29k59j25L39j27k51O07
5091B94k66p0J41N0k41kj78L95n6j51J00j66j01L14j3j36J29p4k24L57j14Qj67
5114a71M09j5l18L9J59j60J0K2K7Q9k60J95k77J10K03k24L4M1N3K25j99K65k25
5137C2l6r0J10J84l24K04K1j20L12j62p9j54K28j98o5R7J9K07j81R4l92L51k32
5160a74L30L2k76K97j95J0j2j31K26j64Q5l96O29j54j71J06p2p7J18J49m71N10
5182A99k13J4k64K64N9j33J72J43o6j91j59P2k4L4K10k71L35j13k08J94%q4j18
5205a48N46l32K4k84J89p9j20l1J73M9P7k93K97k07J8O2k39L97k78L07l12j5K43
5228D4Mj73K92J0K2j41J25Q1m43J68j10L15k55R4J68n9q1j73K75k05k00K89K63
$$ plain form
5069 71 -107 -29 71 -313 27 -139 -63 -82 38 113 143 -152 243 -164 -19 110 -149 -274 65 -62 -313 294
5091 294 28 -42 99 149 -92 -94 -272 123 67 -84 16 -150 -251 63 50 -86 43 -31 -255 102 -12 -4 -171
5114 -171 238 223 -95 -56 103 -57 -47 -25 2 91 -169 26 -251 -141 62 -162 -128 -87 -34 191 -8 257 32
5137 32 -4 -94 16 200 -124 80 101 -19 293 131 52 -102 126 -72 -137 -40 -21 186 5 99 -293 58 -174
5160 -174 156 188 -88 209 14 24 12 -119 107 -57 28 -368 261 107 -64 42 -30 -107 11 160 -311 199
5182 199 -14 0 -264 0 59 -74 98 241 175 -16 -175 -103 -127 -93 117 -154 181 68 -140 54 54 -30 -148
5205 -148 398 66 90 -194 -5 -84 -204 -235 -62 -13 64 -229 68 -139 -121 -59 -298 99 -179 128 -184 -199 44
5228 44 48 -125 167 177 199 58 183 264 -179 -11 -121 194 -61 33 201 142 61 -112 163 -42 -242 47 310
5251C10l75J31p0Q0J2Q9j32k04o4L0M03j84J04k62P5l4l7p0K4p5K72k60N10k90
5275a7j05J35mk15k14K63L39j51J16K02k21j65M4L4j3J30k21p0R6j67M14l0j19
5298F1m4O2j97L68k37K10k56J96j13J03j06j11L34m84L34J00k03o8K19j61Q3j17
5320b7NJ42n5k39N62o72K90J1j75K70j22K05l54L73m10J51J04Mj39Pj40K23q7
5343g3j83N8L61mk74pP9j91K66j48O1L4K33n18N9K03O3J14j99P2P5j15J12j83
5367a05Q0k06L09j55J69K14m08Oj66J93J84M9m8j25J45p0q1j49Q7O2M05j90q5
5390A15k90J52K30n24M24j93J7K18L7r6P7k71J10j99L01k93M02k47n3r3J34J38
5412I6Q9j12j71Q3Nj32K15j4l9p5N6J91l14O4l1j31L0Q5j17K8K01J68k54M68m54
$$ plain form
5251 310 -65 66 -4 76 88 177 45 -159 -223 -193 210 26 130 -132 -57 -91 -128 -198 -174 -249 23 -237 273 -17
5275 -17 -122 13 9 -206 -420 -157 182 31 147 349 128 -37 7 41 28 158 -63 -133 -37 -204 210 180 61
5298 61 17 79 -118 250 13 223 -33 163 50 153 47 -64 270 -214 120 220 17 -51 168 7 90 -27
5320 -27 -22 120 65 -174 388 -284 6 17 -158 112 -10 195 -159 214 -196 -45 59 63 -76 -69 -209 14 -73
5343 -73 -256 -198 163 159 -115 -122 -43 -234 32 -116 -55 -21 212 -306 -247 -44 19 133 -66 6 81 -34 78 -105
5367 -105 -25 -231 78 -77 92 306 -102 -96 -262 -69 115 164 116 -9 136 66 -15 -164 -77 -15 390 200 115
5390 115 -175 -23 207 -317 107 -86 -69 149 186 90 167 -104 6 -193 108 -185 217 -30 -83 -176 -42 96
5412 96 185 73 -98 -15 -10 -142 73 59 20 -55 1 192 -122 -58 -89 -220 -190 -105 -222 -194 7 175 -79 389 -65
5437f5j23N76m52J50p0J84o7j92K23j38l6j35K34k10M5j31L56J55l04K19k45k4
5459e0r2nL74j80j76L09k70j06Pq6K66j20O3K29j83J2j96L80m01J00P0j59M93
5482B79m45J53j16J48J1k58N6M23l04K34k82M2L6N7j40J24J36k19R4L7k10J74
5504C0q8J30k39J2K60l65J25K6j15K00K7j8M4k53L13m5rl59K36R1N6J1j05j06
5528a41J02Q8J33k15K05j78l97M95m9j2j36o0j00J13Q6M50l19N0R9j73J18j17
5550D2q8K47l42N4J11O4q3J25k27j07J02K12n0J44l55L93k26j43K81j41j91K80
5572A02k9o9J86q3Rj91j27P2J29j57j9J39NJ65r9j05K21q6nl20O7K40k41L2J37
5597b7k50M24k69K85M3m90M30k85K70q1kk41pL06J67m77R5Q1K37k94N5J36k00
$$ plain form
5437 -65 -188 388 -64 86 16 200 133 -59 164 26 -10 -145 89 -121 -76 -207 149 304 0 219 -26 -50
5459 -50 -142 -147 227 47 -129 180 -90 -196 -189 -275 -9 -129 -66 163 -20 -8 -204 176 -225 -125 -55 -214 279
5482 279 -166 -13 -129 19 30 -228 -172 251 -53 181 -101 -59 -23 34 -106 18 154 -65 29 66 -144 30
5504 30 -58 72 -167 -155 105 -260 -135 -109 -224 -24 3 -15 29 -224 89 44 35 -324 -88 3 59 70 -35 -141
5528 -141 -39 49 182 -33 172 -6 -403 92 43 31 -105 -165 -265 -152 -66 384 65 115 214 41 159 42
5550 42 -46 201 -141 -87 24 88 5 130 -97 -204 -102 110 60 204 -151 242 16 -127 154 13 -178 102
5572 102 73 4 190 107 116 -75 -202 -130 -1 -158 -177 -38 -33 132 33 -72 149 63 58 -262 -195 45 -196 -164 -27
5597 -27 -277 147 -122 163 206 -284 146 -139 131 50 48 -193 -200 106 273 -204 -109 -28 209 -85 -30 106 -94
5620i4N8O5j92k9L44r7j86J48mO8m9L9J5o1P5k19K29Nj65Q2j21j73M09l12J1J27
5646b7m4J60l52K85L39o27L29q6O0J62k00l1J34P0J31r1m0j60p9k7K12l4n8L8
5670F4j83o4K67j50r3L99k7k18N7m7p5j04j44L23Q6j75M2p1J78r9J38j82j26p3
5694b77J81N5j87N3M6L91k42R0j10j67M37m63J3j66L48Q6j00J44j68q4K22r8j62
5717a58J14M1J22m15L49l36J03J35r4K99M9j39R3m25n0L62Nq6j70o3M53n00K78
5740c3j38K61Pj11r9K00j8j03j20K68J70k66J78k48k57J68J17J60l23J96K3j68
5762a36p3M7K21r6q5K48J90j87j65J41j73R3l1k4m8P7k3P0K3K9r6m1J08j32LK43
5788A83j70Nj56J48K7j37Q0J38r5J02j8J15l42J19J25K6l8k02PL8r5K64j12j99
$$ plain form
5620 -94 -36 29 -163 -192 152 55 -131 17 13 81 32 71 86 25 100 -119 110 115 -50 32 -89 -262 147 -165 -154 -27
5646 -27 -71 89 -263 22 361 -266 63 -23 37 199 -1 -32 102 172 303 212 172 12 -67 -94 118 84 26 64
5670 64 -119 -183 84 -66 -159 240 213 -5 52 5 -70 -174 -318 5 91 -84 -42 -113 65 -34 104 -78 -204 -277
5694 -277 -96 -41 -228 -175 -129 262 20 110 0 -167 270 -193 -180 -346 2 88 -12 132 -36 -120 102 4 -158
5717 -158 -44 -3 119 -296 53 -283 -180 -45 -139 160 209 70 163 -262 -312 50 55 -31 -201 -264 189 -311 -33
5740 -33 -171 90 97 -14 -113 87 69 -34 -154 114 284 18 196 -52 -309 -141 -24 136 -187 9 32 -136
5762 -136 -209 -162 59 -37 -122 126 316 129 -36 105 -68 25 -6 -30 -78 -1 -24 46 69 98 2 -39 69 -63 -60 183
5788 183 13 18 -138 10 37 -100 -20 118 23 125 107 222 -120 -1 124 150 112 -90 -83 -45 -140 124 12 -187
5812a87J13r4L56n6J16m67K41K51l46j75L09n7J48k8j44K82O7k45Q5q9J8kj4O5
5836A47q8j10K59q8m0l0k09J29L39j70k18p1l6K78r6pJ26j12J0J75r4l76J78K44
5860A40M7l32L63k39j77L06L6k14J38j79l5J70k6j23r2J53K23k53J40l26L31j56
5882a05K77q2k80j5P9k4J52oj22R4O2K66l00j99L33j17p3J2o6j33K15PL19m22
5906a28K04j41O6k5k81K47J96K2j30J52J5k07M7K89o22J83QJ1P7K46k39J45j73
5929c8J58k6J49k74K33k52n2K68l64nK06J41k55L61l12MN7J33RK48n87L20j10
5952A2r5K63k41l03M20j2j91L11m80L13J65l19O0J0m3K6Q6q6J22j09N0r4M62q4
5976B43R8k2l76K91j95qj77J89l3j2J89j30j0m4r1K87n62J66J47K7J50J1l49K00
$$ plain form
5812 -187 -74 -168 188 132 248 -219 22 273 -73 -248 61 4 152 124 -20 262 329 84 169 80 98 96 82 147
5836 147 59 -51 208 120 80 50 -159 -30 309 139 -79 -150 -186 92 -4 -11 115 3 13 188 94 -282 -104 140
5860 140 187 -145 218 -21 -198 108 144 -70 68 -111 -146 24 -2 -125 -217 -64 159 -94 46 -280 51 -105
5882 -105 172 90 -190 -205 -126 -150 2 -4 -126 -32 30 296 -4 -203 130 13 -60 -48 -114 -247 -32 -25 294 -128
5906 -128 76 -65 1 -24 -305 -58 138 160 30 182 197 -10 37 326 -296 -113 -105 -94 -17 229 -10 135 -38
5929 -38 120 94 243 -31 202 -50 -102 166 -198 -203 3 144 -111 250 -62 -58 -1 132 141 389 -198 122 12
5952 12 -83 180 -61 -364 56 44 -147 164 -316 -3 162 -157 -97 -87 -130 -104 -18 -104 18 -91 -41 -135 327 243
5976 243 341 319 -57 234 39 31 -146 43 10 -2 187 57 47 3 -88 199 -363 -197 -50 -23 127 138 -211 -11
6000a1n9O2Q1o0l4j52L25j77J21j08n3L00j83R8N6k27j5R9k1j44M2K52Rq0j04
6025A7o9K18l24J10K59l61L02l17j87M68k0J5Q6j94K94l26J64p8J00k60Q0J0R8
6048H5MM2j23M4k19L7Q6J82j03J59J70J60m19m58N98m72M99r1m3J45m88K77jJ50
6072B21l33J71L11n08J34O4l02J4J49J58O3m03K81j16M8R6k48J31M5p6mO0KJ69
6096A27l58j16M99J34k89OP4m36L63j41J43p3N4R6k46J77J49k2p9j39J70J37l17
6119h7L61j68l05J60K33j71Q4J50j78p9o4K77o9j27l38M11j05K72l45J99j2j99
6141a00L16l19L44k40j84M10j23j25J2L21j32l44K46j79O3j95L23r2o6J64j86
6162h6P9r8L83l04j60K08J59j08j8N6j63O7j42O2R9p2l8J4j59J67J01J4O5J67
$$ plain form
6000 -11 -70 -8 73 13 -21 -173 152 -25 96 -12 -65 235 52 150 206 -21 -36 63 42 -102 -60 192 201 121 17
6025 17 -52 166 -158 -48 211 -150 152 -165 -352 116 96 111 197 3 297 -29 135 57 157 -103 -23 -13 85
6048 85 89 131 8 52 -167 -130 -44 138 35 194 364 524 105 -353 245 -227 272 181 138 283 -205 72 71 221
6072 221 -112 59 370 -138 -4 60 -242 -228 -79 79 142 -261 20 -96 -48 48 -200 -69 -24 -100 -104 -44 -42 127
6096 127 -231 -347 152 286 -3 3 77 -359 4 -137 6 -67 -13 83 -163 14 163 141 62 -77 93 230 -87
6119 -87 274 106 -199 -39 194 23 107 257 79 0 -64 213 144 17 -321 90 -15 257 -88 111 99 -100
6141 -100 216 -103 241 1 -183 227 104 -21 -9 312 180 -164 82 -97 -34 -229 94 2 -64 100 -86
6162 -86 -7 -105 278 -26 -186 22 181 73 55 111 -52 15 -127 -65 34 -38 -76 -62 -221 -54 47 61 126 293
6186B93r9K1l72J88J53j16l32L21n0ro0K39o7j25K93k29K39l1l41m8j24K12j63
6209b07K17k1o5P7J11l3j89K17r0n0N2k13L45J1N1j66K09j94l09K25P1o3L34n17
$$ plain form
6186 293 194 215 -157 31 184 68 -264 57 7 -2 -62 177 110 -15 278 49 288 257 -84 -132 -256 -44 -207
6209 -207 10 -11 -76 1 112 79 -110 107 17 -33 19 -194 151 162 213 47 256 62 -247 -22 49 -14 320 -197
$$ [...]
8191A01
##END NTUPLES=NMR FID
##END=
