##TITLE=1H_DE-75H2
 200.13MHz, D2O,
 8 sc
 
 6.2.2025
##JCAMPDX= 6.0         $$ Bruker NMR JCAMP-DX V2.0
##DATA TYPE= NMR FID
##DATA CLASS= NTUPLES
##ORIGIN= UXNMR, Bruker Analytische Messtechnik GmbH
##OWNER= pz
$$ XWIN-NMR		Version 3.5
$$ Thu Feb  6 13:43:06 2025 Russian Standard Time (UT+4h)  she@DPX200
##.OBSERVE FREQUENCY= 200.1313
##.OBSERVE NUCLEUS= ^1H
##.DELAY= (6, 6)
##.ACQUISITION MODE= SIMULTANEOUS
##.ACQUISITION SCHEME= undefined
##.AVERAGES= 8
##.DIGITISER RES= 18
##SPECTROMETER/DATA SYSTEM= spect
##.PULSE SEQUENCE= zg30
##.SOLVENT NAME= D2O
##.SHIFT REFERENCE= (INTERNAL, D2O, 0, 14.3821)
##AUDIT TRAIL= $$ (NUMBER, WHEN, WHO, WHERE, WHAT)
$$ ##TITLE= Audit trail, XWIN-NMR		Version 3.5
$$ ##JCAMPDX= 5.01
$$ ##ORIGIN= Bruker BioSpin GmbH
$$ ##OWNER= she
$$ F:/spectra/data/she/nmr/H-C/1/audita.txt
$$ ##AUDIT TRAIL=  $$ (NUMBER, WHEN, WHO, WHERE, WHAT)
(   1,<2025-02-06 13:41:56.25 +0400>,<she>,<DPX200>,
      <created by zg, POWCHK disabled, PULCHK disabled
       configuration hash MD5:
       00 E9 B6 7A A2 85 ED C7 34 08 36 98 17 FE 4E 26
       data hash MD5: 16K
       EF 67 D4 28 92 87 16 ED 1F 6F AF BD 2A 77 E4 AA>)
$$ ##END=
$$ 
$$ hash MD5
$$ D8 93 45 6A 81 5F 81 B6 6C 2C 8B B0 05 42 CC 36
##$RELAX= 
##$RELAX= 
##$RELAX= 
##$RELAX= 
##$RELAX= 
##$RELAX= 
$$ Bruker specific parameters
$$ --------------------------
##$DU= <F:/spectra>
##$EXPNO= 1
##$NAME= <H-C>
##$PROCNO= 1
##$TYPE= <nmr>
##$USER= <she>
##$AMP= (0..31)
100 100 100 100 100 100 100 100 100 100 100 100 100 100 100 100 100 100 
100 100 100 100 100 100 100 100 100 100 100 100 100 100 
##$AQSEQ= 0
##$AQ_mod= 1
##$AUNM= <au_zg>
##$AUTOPOS= <>
##$BF1= 200.13
##$BF2= 200.13
##$BF3= 200.13
##$BF4= 200.13
##$BF5= 200.13
##$BF6= 200.13
##$BF7= 200.13
##$BF8= 200.13
##$BYTORDA= 1
##$CFDGTYP= 0
##$CFRGTYP= 5
##$CHEMSTR= <none>
##$CNST= (0..31)
1 1 145 1 1 1 1 1 1 1 1 1 1 1 1 1 1 1 1 1 1 1 1 1 1 1 1 1 1 1 1 1 
##$CPDPRG= <>
##$CPDPRG1= <>
##$CPDPRG2= <>
##$CPDPRG3= <>
##$CPDPRG4= <mlev>
##$CPDPRG5= <mlev>
##$CPDPRG6= <mlev>
##$CPDPRG7= <mlev>
##$CPDPRG8= <mlev>
##$CPDPRGB= <>
##$CPDPRGT= <>
##$D= (0..31)
0 0.7 0 0 0 0 0 0 0 0 0 0.03 0 0 0 0 0 0 0 0 0 0 0 0 0 0 0 0 0 0 0 0 
##$DATE= 1738834915
##$DBL= (0..7)
120 120 120 120 120 120 120 120 
##$DBP= (0..7)
150 150 150 150 150 150 150 150 
##$DBP07= 0
##$DBPNAM0= <>
##$DBPNAM1= <>
##$DBPNAM2= <>
##$DBPNAM3= <>
##$DBPNAM4= <>
##$DBPNAM5= <>
##$DBPNAM6= <>
##$DBPNAM7= <>
##$DBPOAL= (0..7)
0.5 0.5 0.5 0.5 0.5 0.5 0.5 0.5 
##$DBPOFFS= (0..7)
0 0 0 0 0 0 0 0 
##$DE= 6
##$DECBNUC= <off>
##$DECIM= 32
##$DECNUC= <off>
##$DECSTAT= 4
##$DIGMOD= 1
##$DIGTYP= 9
##$DL= (0..7)
0 120 120 120 120 120 120 120 
##$DP= (0..7)
150 150 150 150 150 150 150 150 
##$DP07= 0
##$DPNAME0= <>
##$DPNAME1= <>
##$DPNAME2= <>
##$DPNAME3= <>
##$DPNAME4= <>
##$DPNAME5= <>
##$DPNAME6= <>
##$DPNAME7= <>
##$DPOAL= (0..7)
0.5 0.5 0.5 0.5 0.5 0.5 0.5 0.5 
##$DPOFFS= (0..7)
0 0 0 0 0 0 0 0 
##$DQDMODE= 0
##$DR= 18
##$DS= 0
##$DSLIST= <SSSSSSSSSSSSSSS>
##$DSPFIRM= 0
$$ [...]
##$SUBNAM0= <"">
##$SUBNAM1= <"">
##$SUBNAM2= <"">
##$SUBNAM3= <"">
##$SUBNAM4= <"">
##$SUBNAM5= <"">
##$SUBNAM6= <"">
##$SUBNAM7= <"">
##$SUBNAM8= <"">
##$SUBNAM9= <"">
##$SW= 18.0517328524113
##$SWIBOX= (0..15)
0 0 2 0 0 0 0 0 0 0 0 0 0 0 0 0 
##$SW_h= 3612.71676300578
##$TD= 16384
##$TD0= 1
##$TE= 0
##$TE2= 300
##$TE3= 300
##$TEG= 300
##$TL= (0..7)
0 120 120 120 120 120 120 120 
##$TP= (0..7)
150 150 150 150 150 150 150 150 
##$TP07= 0
##$TPNAME0= <>
##$TPNAME1= <>
##$TPNAME2= <>
##$TPNAME3= <>
##$TPNAME4= <>
##$TPNAME5= <>
##$TPNAME6= <>
##$TPNAME7= <>
##$TPOAL= (0..7)
0.5 0.5 0.5 0.5 0.5 0.5 0.5 0.5 
##$TPOFFS= (0..7)
0 0 0 0 0 0 0 0 
##$TUNHIN= 0
##$TUNHOUT= 0
##$TUNXOUT= 0
##$USERA1= <user>
##$USERA2= <user>
##$USERA3= <user>
##$USERA4= <user>
##$USERA5= <user>
##$V9= 5
##$VALIST= <valist>
##$VCLIST= <CCCCCCCCCCCCCCC>
##$VD= 0
##$VDLIST= <DDDDDDDDDDDDDDD>
##$VPLIST= <PPPPPPPPPPPPPPP>
##$VTLIST= <TTTTTTTTTTTTTTT>
##$WBST= 1024
##$WBSW= 4
##$XGAIN= (0..3)
0 0 0 0 
##$XL= 0
##$YL= 0
##$YMAX_a= 711609
##$YMIN_a= -687424
##$ZGOPTNS= <>
##$ZL1= 120
##$ZL2= 120
##$ZL3= 120
##$ZL4= 120
##$ABSF1= 10
##$ABSF2= 0
##$ABSG= 5
##$ABSL= 3
##$ALPHA= 0
##$AQORDER= 0
##$ASSFAC= 0
##$ASSFACI= 0
##$ASSFACX= 0
##$ASSWID= 0
##$AUNMP= <proc_1d>
##$AZFE= 0.1
##$AZFW= 0.1
##$BCFW= 1
##$BC_mod= 2
##$BYTORDP= 1
##$COROFFS= 0
##$CY= -3
##$DATMOD= 1
##$DC= 2
##$DFILT= <>
##$DTYPP= 0
##$F1P= 0
##$F2P= 0
##$FCOR= 0.5
##$FTSIZE= 0
##$FT_mod= 4
##$GAMMA= 1
##$GB= 0.15
##$INTBC= 1
##$INTSCL= 1
##$ISEN= 128
##$LB= 0.25
##$LEV0= 0
##$LPBIN= 0
##$MAXI= 10000
##$MC2= 0
##$MEAN= 0
##$ME_mod= 0
##$MI= 1.114404
##$NCOEF= 0
##$NC_proc= 0
##$NLEV= 6
##$NOISF1= 3.799351
##$NOISF2= 2.8
##$NSP= 1
##$NTH_PI= 0
##$NZP= 0
##$OFFSET= 14.38212
##$PC= 1
##$PHC0= -121.3874
##$PHC1= 26.79221
##$PH_mod= 1
##$PKNL= yes
##$PPARMOD= 0
##$PSCAL= 0
##$PSIGN= 0
##$REVERSE= no
##$SF= 200.129724274929
##$SI= 16384
##$SIGF1= 3
##$SIGF2= 2
##$SINO= 400
##$SIOLD= 16384
##$SREGLST= <1H.CDCl3>
##$SSB= 0
##$STSI= 0
##$STSR= 0
##$SW_p= 3205.1282051282
##$SYMM= 0
##$S_DEV= 0
##$TDeff= 0
##$TDoff= 0
##$TI= <>
##$TILT= no
##$TM1= 0
##$TM2= 0
##$TOPLEV= 0
##$USERP1= <user>
##$USERP2= <user>
##$USERP3= <user>
##$USERP4= <user>
##$USERP5= <user>
##$WDW= 1
##$XDIM= 8192
##$YMAX_p= 0
##$YMIN_p= 0
$$ End of Bruker specific parameters
$$ ---------------------------------
##NTUPLES= NMR FID
##VAR_NAME=  TIME,          FID/REAL,        FID/IMAG
##SYMBOL=    X,             R,               I
##VAR_TYPE=  INDEPENDENT,   DEPENDENT,       DEPENDENT
##VAR_FORM=  AFFN,          ASDF,            ASDF
##VAR_DIM=   8192,          8192,            8192
##UNITS=     SECONDS,       ARBITRARY UNITS, ARBITRARY UNITS
##FACTOR=    0.0002768,     1,               1
##FIRST=     0,             0,               0
##LAST=      2.2672688,     0,               0
##MIN=       0,             -687424,         0
##MAX=       2.2672688,     711609,          0
$$ Real data points
##PAGE= N=1
##DATA TABLE= (X++(R..R)), XYDATA
$$ plain form
0 0 0 0 0 0 0 0 0 0 0 0 0 -1 0 -8 7 -8 8 -8 16 -16 16 -24 24 -32 32 -40 48 -52 64 -71 83 -92 104 -122 132
35 132 -151 170 -187 212 -233 262 -290 320 -356 393 -434 478 -525 582 -637 705 -778 853 -945
54 -945 1044 -1161 1290 -1439 1620 -1829 2086 -2407 2816 -3369 4145 -5332 7342 -11424 23138
69 23138 -134502 -599765 -687424 -541784 -232663 149099 523452 711609 656436 369036 -22795
80 -22795 -386059 -601038 -599738 -346898 32793 361209 538559 539441 325631 -43462 -406864
91 -406864 -612884 -607325 -396946 -54501 311438 564878 596445 395439 70238 -254003 -477702
102 -477702 -517773 -344474 -31615 292739 508928 541952 380947 90060 -228977 -469540
112 -469540 -548184 -431618 -158597 164791 408070 479045 363456 116832 -170366 -397094
$$ packed form
0@%%%%%%%%%%%jJqJ5j5J6j6K4l2L2m0M8n6O4p2Q8j00J16j35J54j75J96k26K54
35A32k83L21l57L99m45M95n52O10o76P49q27R12j003J107j219J342j483J631j798
54i45J989k205K451k729L059l449L915m493N223o185P514r477J2674j8766L4562
69B3138j57640m65263q7659J45640L09121L81762L74353J88157n5173k87400l91831
80b2795l63264k14979J300K52840L79691L28416J77350Q82k13810l69093l63402
91d06864k06020N559K10379L42445L65939K53440L1567k01006l25201l24241k23699
102d77702m0071J73299L12859L24354K16189L3024j61005k90887l19037k40563
112d69540p8644J16566K73021L23388K43279P0975j15589k46624k87198k26728
$$ plain form
122 -397094 -481664 -389850 -150621 153849 409641 512358 424293 193218 -89128 -327359
132 -327359 -440903 -387407 -188280 78873 309593 418931 373366 186678 -79718 -323916
142 -323916 -446153 -407251 -228939 25511 264137 398248 386072 235882 4242 -222408
152 -222408 -361005 -361136 -219517 10994 236234 375220 382145 249541 24205 -205210 -355109
163 -355109 -375934 -262221 -59537 154795 307623 343210 246541 55262 -156130 -310979
173 -310979 -348389 -253010 -65658 142024 297934 347483 274071 106030 -95743 -257864 -319912
184 -319912 -260429 -104868 88324 245915 308749 253956 104008 -84838 -244221 -315813 -273822
195 -273822 -135064 49072 211019 292975 266430 142816 -29721 -186818 -270165 -248621 -132430
$$ packed form
122c97094q4570R1814K39229L04470K55792J02717q8065k31075k82346k38231
132c27359j13544N3496J99127K67153K30720J09338m5565j86688k66396k44198
142c23916j22237L8902J78312K54450K38626J34111j2176j50190k31640k26650
152b22408j38597j31J41619K30511K25240J38986O925j32604k25336k29415j49899
163c55109k0825J13713K02684K14332J52828L5587r6669j91279k11392j54849
173c10979l7410R5379J87352K07682J55910M9549p3412j68041k01773j62121o2048
184c19912N9483J55561J93192J57591O2834n4793j49948j88846j59383p1592M1991
195b73822J38758J84136J61947Q1956k6545j23614j72537j57097q3347K1544J16191
$$ plain form
206 -132430 32562 186569 273566 260027 152203 -9326 -166789 -261789 -260339 -165700 -14720
217 -14720 138013 233810 238952 155787 14789 -132112 -230221 -241805 -164053 -25909 122287
228 122287 224932 245510 178471 47942 -95971 -198991 -227089 -171950 -52206 86774 189886
239 189886 220073 168921 54588 -80210 -185082 -223783 -181358 -74170 56720 163451 209894
250 209894 178478 80094 -44541 -148404 -195785 -169957 -79477 42005 147508 200072 178812
261 178812 92733 -25180 -132156 -190495 -178285 -101088 8688 111695 172033 166352 96720
272 96720 -9349 -110892 -171543 -167994 -102579 -455 101982 167282 171928 114861 19102 -81298
284 -81298 -150561 -160845 -110138 -20135 75335 141332 154156 109727 23988 -72466 -142299 -159409
$$ packed form
206a32430J64992J54007Q6997j3539j07824j61529j57463r5000J450R4639J50980
217a4720J52733R5797N142q3165j40998j46901r8109j1584P7752J38144J48196
228A22287J02645K0578o7039j30529j43913j03020k8098N5139J19744J38980J03112
239A89886L0187n1152j14333j34798j04872l8701M2425J07188J30890J06731M6443
250B09894l1416r8384j24635j03863m7381K5828R0480J21482J05503N2564k1260
261A78812q6079j17913j06976n8339J2210P7197J09776J03007O0338n681o9632
272I6720j06069j01543o0651L549O5415J02124J02437O5300M646n7067r5759j00400
284h1298o9263j0284N0707R0003R5470O5997J2824m4429q5739r6454o9833j7110
$$ plain form
296 -159409 -119781 -37702 56819 128286 150496 118205 44067 -44935 -116029 -142319 -113984 -42584
308 -42584 45055 114407 142138 119535 53522 -32710 -105653 -138351 -120705 -59731 20603 92034
320 92034 127659 114575 58118 -19358 -88874 -125215 -115686 -63295 12099 82609 123644 118950
332 118950 71676 -686 -70479 -112224 -111136 -69711 -3619 63556 107933 111257 70840 4402
344 4402 -62090 -105350 -110809 -77877 -16283 50672 98165 107623 76962 19090 -44077 -89468 -101514
357 -101514 -75487 -21440 40644 88619 103527 79904 27150 -33795 -80962 -98745 -81148 -33464
369 -33464 25891 74678 93681 76855 32180 -23660 -70982 -93378 -80581 -37141 19154 67366
381 67366 90376 80464 41869 -10280 -57282 -82947 -76998 -41556 9009 55500 80879 76078 43283
$$ packed form
296a59409L9628Q2079R4521P1467K2210l2291p4138q9002p1094k6290K8335P1400
308d2584Q7639O9352K7731k2603o6013q6232p2943l2698J7646O0974Q0334P1431
320I2034L5625j3084n6457p7476o9516l6341R529N2391P5394P0510M1035m694
332A18950m7274p2362o9793m1745J088M1425O6092O7175M4377L324m0417o6438
344D402o6492m3260n459L2932O1594O6955M7493R458l0661n7872o3167m5391j2046
357a01514K6027N4047O2084M7975J4908k3623n2754o0945m7167j7783J7597M7684
369c3464N9355M8787J9003j6826m4675n5840m7322k2396J2797M3440N6295M8212
381F7366K3010r912l8595n2149m7002k5665N949L5442N0565M6491K5379m801l2795
$$ plain form
394 43283 -4996 -52505 -81042 -79218 -48929 -1881 44065 73052 74826 49241 5879 -39582
406 -39582 -69536 -71820 -47126 -4523 39102 68651 73377 52095 11841 -32606 -64750 -72356 -53852
419 -53852 -16509 26068 57499 66583 51380 16354 -25040 -56535 -66933 -52484 -18862 21909
431 21909 53872 66724 55633 24390 -15137 -47867 -61993 -53110 -24163 12878 44397 59521
443 59521 52118 24943 -11705 -43842 -60215 -54630 -28941 6235 37828 55746 52836 29778 -2772
456 -2772 -34336 -52457 -50245 -28909 2757 33992 52851 52407 32761 1747 -29692 -50016 -51389
469 -51389 -34125 -5480 24709 45149 47392 32333 4719 -24571 -45101 -48031 -33704 -7548
481 -7548 22137 43634 49065 36818 11884 -16919 -38316 -44470 -34549 -12179 15502 36863 42970
$$ packed form
394D3283m8279m7509k8537J824L0289M7048M5946K8987J774k5585m3362m5461
406c9582k9954k284K4694M2603M3625K9549M726k1282m0254m4447l2144p606J8504
419e3852L7343M2577L1431R084j5203l5026m1394l1495j0398J4449L3622M0771
431B1909L1963J2852j1091l1243l9527l2730j4126Q883K8947L7041L1519J5124
443E9521p403k7175l6648l2137j6373N585K5689L5176L1593J7918k910k3058l2550
456b772l1564j8121K212K1336L1666L1235J8859m44j9646l1014l1439k0324j373
469e1389J7264K8645L0189K0440K243j5059k7614k9290k0530k930J4327K6156
481g548K9685K1497N431j2247k4934k8803k1397o154R921K2370K7681K1361O107
$$ plain form
494 42970 34382 12473 -14908 -36456 -44564 -37151 -16900 9909 32224 41802 36427 16892 -7990
507 -7990 -28888 -39014 -34519 -16691 8293 28935 40172 36710 19820 -4335 -25912 -38031 -36441
520 -36441 -21173 1099 22113 34546 33331 19308 -1518 -22078 -35156 -34894 -21719 -683 20371
533 20371 33997 35185 23811 4253 -16412 -29688 -31927 -22287 -4191 15266 29121 31684 22538
546 22538 4627 -15036 -29428 -32884 -25078 -8119 11076 26418 31517 24319 8778 -9450 -23916
559 -23916 -29184 -23073 -8233 9655 23738 29518 24582 11162 -6667 -22206 -28630 -24355 -11906
572 -11906 4530 19923 26716 23642 11828 -4362 -19223 -27107 -24561 -13442 3185 17833 25309
585 25309 24346 14462 -909 -15762 -23550 -22881 -13765 799 15035 23384 23173 14843 397 -13555
$$ packed form
494D2970q588k1909k7381k1548q108P413K0251K6809K2315R578n375j9535k4882
507g990k0898j0126M495J7828K4984K0642J1237l462j6890k4155k1577j2119J590
520c6441J5268K2272K1014J2433j215j4023k0826k0560j3078K62J3175K1036K1054
533B0371J3626J188j1374j9558k0665j3276k239R640J8096J9457J3855K563r146
546B2538j7911j9663j4392l456P806J6959J9195J5342N099p198j5541j8228j4466
559b3916n268O111J4840J7888J4083N780m936j3420j7829j5539o424M275J2449
572a1906J6436J5393O793l074j1814j6190j4861p884K546J1119J6627J4648P476
585B5309r63r884j5371j4853p788O69R116J4564J4236Q349k11q330j4446j3952
$$ plain form
599 -13555 -22502 -23684 -16225 -2315 11509 20593 22564 15550 2868 -10255 -19849 -21784 -15910 -3262
613 -3262 10199 19627 22183 16634 4827 -7862 -17823 -21465 -16585 -6007 6617 16793 20604 16256
627 16256 5977 -6042 -16209 -20285 -16294 -7037 4671 14897 19520 16439 7977 -3378 -13739
640 -13739 -18837 -16541 -8273 2853 13450 18183 16288 9017 -1501 -11856 -17401 -16050 -9548 818
654 818 11136 16615 15894 9794 -460 -10360 -16027 -16060 -10578 -618 9259 15186 15882 11137 1534 -8271
670 -8271 -14213 -15620 -10506 -1732 7171 13716 15354 11248 2704 -6567 -12970 -15123 -11456 -3205 5350
685 5350 12095 14787 10957 3843 -4587 -11538 -14391 -11649 -4529 3833 10841 14190 11974 5226 -2859
700 -2859 -9984 -13145 -11564 -4991 2502 9433 13197 11497 5494 -2146 -9207 -12985 -11743 -6660 623
$$ packed form
599a3555q947j182P459J3910J3824R084J971p014j2682j3123r594j935N874J2648
613c262J3461R428K556n549j1807j2689r961l642M880J0578J2624J0176L811m348
627A6256j0279j2019j0167m076L991R257J1708J0226M623l081q462j1355j0361
640a3739n098K296Q268J1126J0597M733j895p271j0518j0355n545J351O502J0366
654H18J0318N479p21o100j0254r900n667l3N482R960R877N927O96m745r603r805
670h271n942j407N114Q774Q903O545J638m106q544r271o403k153L667Q251Q555
685E350O745K692l830p114q430o951k853K742P120Q362P008L349k216o748q085
700b859p125l161J581O573P493O931L764j700o003p640p061l778J242N083P283
$$ plain form
715 623 7983 12023 11305 6781 -473 -7228 -11129 -10827 -6387 430 7362 11482 11507 7702 791 -6536
731 -6536 -10778 -11217 -7765 -1666 5223 9528 10628 7319 1364 -4853 -9379 -10495 -7720 -2082 4590
746 4590 9237 10586 8298 2640 -3582 -7997 -9886 -7742 -3141 3092 8218 10065 8140 3029 -2967
761 -2967 -7892 -10052 -8306 -4018 1824 6945 9433 8138 3778 -1297 -6392 -8579 -7967 -3974 1037
776 1037 6284 9162 8488 4879 -438 -5785 -8031 -8469 -5165 -144 5023 7707 7270 4461 -15 -4484
792 -4484 -8096 -7921 -4848 -410 4444 7423 8138 5553 1679 -3653 -6916 -7606 -5709 -1209 3316 6500
808 6500 7171 5332 1750 -2863 -6750 -7546 -5702 -2059 2481 5730 6842 5985 2614 -1569 -5342 -6884
824 -6884 -5802 -2229 1866 5267 6632 6167 2989 -1616 -4668 -6714 -6100 -3291 704 4183 6227 5465
$$ packed form
715F23P360M040p18m524p254o755l901L02M440O817O932M120K5l805o911p327
731f536m242m39L452O099O889M305J100l309n955o217m526j116K775N638O672
746D590M647J349k288n658o222m415j889K144M601O233N126J847j925n111n996
761b967m925k160J746M288N842N121K488j295m360n075n095k187O12L993N011
776A037N247K878o74l609n317n347k246m38L304N021N167K684m37k809m476m469
792d484l612J75L073M438M854K979P15k585l874n332l263o90J897M500M525L184
808F500O71j839l582m613l887p96J844L643M540L249J112q57l371m183l773j542
824f884J082L573M095L401J365m65l178m605l052k046O14K809L995L479K044p62
$$ plain form
840 5465 2988 -819 -3952 -5977 -5751 -3191 567 4050 5893 6055 3990 328 -3213 -5532 -5593 -3819
856 -3819 -390 2461 4977 5320 3861 160 -2994 -5482 -5775 -4183 -1004 2369 4727 5541 4407 1459
872 1459 -1889 -4031 -4816 -3787 -1142 1948 4317 4863 4529 1742 -1677 -4060 -5159 -4206 -2303 1104
888 1104 3694 4444 3907 1911 -1061 -3669 -4701 -4462 -2031 781 3449 4653 4402 2314 -165 -2842
904 -2842 -4436 -4052 -2628 351 2706 4024 3736 2631 -148 -2453 -4178 -4316 -3049 -590 1889 3947
920 3947 4069 3083 556 -1801 -3309 -4091 -2283 -231 2035 3738 3937 2844 1108 -1685 -3514 -4155
936 -4155 -3301 -1602 1000 2744 3672 2571 1118 -1032 -3051 -3379 -2923 -1104 1056 2802 3844 3290
952 3290 1874 -587 -2365 -3353 -2932 -1740 443 2220 3432 2746 1297 -136 -2202 -3374 -3043 -2050
$$ packed form
840E465k477l807l133k025K26K560L758L483J843J62k065l662l541k319o1J774
856c819L429K851K516L43j459l701l154k488k93J592L179L373K358Q14j134k948
872A459l348k142p85J029K645L090K369N46l34k787l419k383j099R53J903L407
888A104K590P50n37j996k972k608j032K39K431K812K668J204k51k088k479k677
904b842j594L84J424K979K355J318k88j105k779k305j725j38J267K459K479K058
920C947J22r86k527k357j508p82J808K052K266J703J99j093j736k793j829o41
936d155Q54J699K602J744R28j101j453k150k019l28M56J819K160J746J042n54
952C290j416k461j778r88M21J192K183J777J212o86j449j433k066j172L31R93
$$ plain form
968 -2050 -157 1945 2676 3144 1801 377 -1766 -2963 -2942 -1707 -4 1622 3003 3111 1957 408
984 408 -1217 -2576 -2960 -1827 -701 863 2497 2724 2033 591 -1265 -2511 -2555 -1869 -978 961 2370
1001 2370 2844 2563 945 -721 -1787 -2495 -2221 -1301 546 1745 2371 2126 925 -298 -1787 -2785 -2390
1018 -2390 -1163 243 1642 2566 2459 1125 -197 -1392 -2133 -2376 -1060 104 1511 2008 2021 1330 147
1035 147 -895 -2085 -2207 -1676 -253 1094 1835 1715 1269 226 -971 -2093 -2232 -1331 -291 707 1894
1052 1894 2260 1640 659 -708 -1552 -1829 -1448 -608 587 1512 1866 1361 493 -496 -1572 -1872 -1635 -873 417
1071 417 1472 1613 1530 836 -169 -1249 -1606 -1535 -660 543 1168 1500 1465 687 -367 -1028 -1756 -1504 -870
1090 -870 46 841 1427 1474 989 -120 -717 -1480 -1595 -812 52 849 1561 1718 1127 315 -650 -1022 -1448 -962
$$ packed form
968b050J893K102P31M68j343j424k143j197K1J235J703J626J381J08j154j549
984D08j625j359l84J133J126J564J634K27o91j442j856j246m4O86Q91J939J409
1001B370M74k81j618j666j066p08K74R20J847J199O26k45j201j223j489r98L95
1018b390J227J406J399R24j07j334j322j195p41k43J316J164J407M97J3o91j183
1035A47j042j190j22N31J423J347P41j20m46j043j197j122j39R01J040R98J187
1052A894L66o20r81j367q44k77L81Q40J195R25L54n05q68r89j076l00K37P62J290
1071D17J055J41q3o94j005j080l57P1Q75J203O25L32l5p78j054o61p28K52O34
1090h70R16P95N86M7m85j109n97p63j15P83Q64P97P12J57n91q12r65l72m26M86
$$ plain form
1110 -962 -187 347 1340 1372 1036 170 -569 -1432 -1454 -1463 -543 254 931 1458 1043 603 -386 -905 -1159 -876 -567
1131 -567 352 1136 1406 1270 594 -348 -782 -1182 -1128 -834 6 835 1030 1176 518 -139 -948 -1146 -862 -624
1151 -624 240 405 1180 819 911 303 -558 -806 -1230 -666 129 850 935 1104 998 172 -443 -811 -935 -1092 -282
1172 -282 395 895 1039 851 486 -570 -550 -875 -885 34 68 949 969 943 335 -64 -839 -1123 -907 -589 214
1193 214 637 1101 679 25 -123 -502 -1095 -893 -84 -30 1013 1187 1122 592 156 -374 -658 -694 -616 -366 272
1214 272 932 834 697 26 -687 -853 -858 -659 -22 376 682 666 723 187 -437 -572 -618 -459 -233 358 548 857
1236 857 379 307 -283 -546 -986 -750 -83 312 738 612 801 -181 -495 -541 -679 -498 -162 110 606 906 859
1257 859 349 -19 -213 -529 -713 -411 19 446 674 494 120 -91 -424 -543 -643 -613 173 164 650 611 283
$$ packed form
1110i62P75N34R93L2l36q66p39q63k2rR20P97O77N27m15m40r89n19k54K83L09
1131e67R19P84K70j36o76r42m34m00N4K94Q40Q29J95J46o58o57q09j98K84K38
1151f24Q64J65P75l61R2o08q61k48m24N64P95P21Q5J69j06q26o15l68j24j57Q10
1172b82O77N00J44j88l65j056K0l25j0R19L4Q81K0k6o08l99p75k84K16L18Q03
1193B14M23M64m22o54j48l79n93K02Q09N4J043J74o5n30m36n30k84l6P8K50O38
1214B72O60r8j37o71p13j66nJ99O37L98L06j6N7n36o24j35m6J59K26N91J90L09
1236H57m78p2n90k63m40K36O67L95M26j26J89r82l14m6j38J81L36K72M96L00m7
1257H59n10l68j94l16j84L02M30M27K28j80l74k11l33j19j00L0P86rM86l9l28
$$ plain form
1278 283 58 -620 -404 -530 -408 -81 285 730 611 222 224 -173 -527 -721 -432 -271 125 346 423 645 85
1299 85 -179 -453 -313 -537 -78 376 431 601 468 462 -129 -402 -620 -588 -224 142 228 535 456 390 38 -512 -365
1322 -365 -547 -284 39 334 592 230 267 114 -284 -332 -310 -71 279 504 354 396 297 -105 -380 -436 -450 -224
1344 -224 171 378 407 410 311 32 -300 -493 -588 -284 46 188 415 224 220 104 172 -353 -374 -205 -24 -16 375 82
1368 82 81 27 181 -102 -343 -476 24 131 172 344 269 600 -40 -49 -349 -126 -193 12 313 380 546 6 -74 -152
1392 -152 -258 -359 -292 113 144 433 346 56 69 -62 -251 -393 -169 7 286 316 449 64 142 -214 -225 -275 -284
1415 -284 -181 -226 -146 188 365 -139 49 -346 -410 -129 50 -68 246 211 -4 160 -5 -129 -6 -326 41
1436 41 224 401 283 244 121 141 -161 -413 173 -342 232 202 99 69 380 -81 -172 -321 -333 -51 106 346
$$ packed form
1278B83k25o78K16j26J22L27L66M45j19l89Kl97l54j94K89J61L96K21P7K22n60
1299H5k64k74J40k24M59M54N5J70j33on91k73k18L2L64L66Q6L07p9o6l52n50J47
1322c65j82K63L23K95K58l62L7j53l98m8K2K39L50K25j50M2r9m02k75n6j4K26
1344b24L95K07K9Lr9k79l32j93r5L04L30J42K27j91mj16O8n25k1J69J81QL91k93
1368H2jn4J54k83k41j33N00J07M1J72p5L31o40rl00K23o7K05L01O7J66n40q0p8
1392a52j06j01O7M05L1K89q7k90J3j31j89j42K24J76K79L0J33l85P8l56j1n0r
1415b84J03m5Q0L34J77n04J88l95o4K81J79j18L14l5k15J64j65j24J23l20L67
1436D1J83J77j18l9j23K0l02k52N86n15N74l0j03l0L11m61r1j49j2K82J57K40
$$ plain form
1458 346 326 253 184 187 -86 -130 -234 -53 163 310 453 235 128 128 -424 -108 -314 -199 172 72 329 5 219
1481 219 -45 -308 17 -382 -192 135 31 -57 453 127 181 -138 -16 -412 -355 25 198 32 315 214 285
1502 285 92 -50 -355 -383 19 -187 57 103 52 -59 8 -53 41 -45 79 -118 -80 141 220 108 -99 -61 98
1525 98 -247 -27 152 -215 113 370 142 -51 -32 -108 -195 -45 -118 -135 -74 290 -96 51 136 -360 -161 -220 -295
1548 -295 306 -206 230 322 237 92 -113 -230 -289 -57 -204 267 373 111 104 3 11 -122 -99 113 -114 73 352
1571 352 72 -21 -16 21 -416 -221 -141 60 405 374 253 347 74 -54 -332 11 -162 83 -94 86 65 -36 97
1594 97 -130 50 -95 -86 164 -234 48 46 171 169 69 -249 -310 -136 -8 -86 -113 295 -64 199 -84 -76 -92 -130 -78
1619 -78 208 13 333 77 99 129 -14 -94 -23 -259 218 -50 133 -13 237 303 -111 31 -254 -111 279 49
$$ packed form
1458C46k0p3o9Lk73m4j04J81K16J47J43k18j07%n52L16k06J15L71j00K57l24K14
1481B19k64k63L25l99J90L27j04q8N10l26N4l19J22l96N7L80J73j66K83j01P1
1502B85j93j42l05k8M02k06K44M6n1j11O7o1R4q6J24j97L8K21P9j12k07L8J59
1525I8l45K20J79l67L28K57k28j93J9p6q7J50p3j7O1L64l86J47Q5m96J99n9p5
1548b95O01n12M36R2q5j45k05j17n9K32j47M71J06k62pj01Qj33K3K12k27J87K79
1571C52k80r3NL7m37J95Q0K01L45l1j21R4k73j28k78L43j73K45j77J80k1j01J33
1594I7k27J80j45RK50l98K82kJ25kj00l18o1J74J28p8k7M08l59K63k83Qj6l8N2
1619g8K86j95L20k56K2L0j43q0P1k36M77k68J83j46K50O6m14J42k85J43L90k30
$$ plain form
1641 49 181 254 166 0 122 -232 -31 -67 -130 62 116 218 59 143 114 70 -294 -4 -196 253 -92 -1 184
1664 184 -66 206 -122 -80 -108 15 90 -422 168 306 264 -258 -222 -8 -125 69 93 322 49 -9 292 -4
1686 -4 -127 -36 -149 -342 145 9 -13 34 117 -292 -17 -301 -103 -231 -20 -43 416 348 260 57 -54 -325 75
1709 75 -200 -30 173 16 -152 185 -95 -157 -32 124 105 94 454 272 -87 229 4 41 -142 -287 -291 -404
1731 -404 -153 -16 152 58 112 -164 33 -5 -70 -11 11 62 206 -27 -4 -33 122 168 -60 84 -65 40 233
1754 233 169 39 -274 -154 273 56 -199 15 -58 -25 -106 27 155 288 -254 -19 -128 198 15 15 127 146
1776 146 20 -255 236 43 -151 61 84 383 169 -127 -160 95 -106 -17 -70 39 -3 94 67 48 54 -147 133
1799 133 -63 1 -121 59 94 -113 21 150 -29 115 3 -225 3 -184 96 54 29 16 102 5 -41 -74 -104
$$ packed form
1641D9J32P3q8j66J22l54K01l6o3J92N4J02j59Q4k9m4l64K90j92M49l45R1J85
1664A84k50K72l28M2k8J23P5n12N90J38m2n22L6K14j17J94K4K29k73n8L01k96
1686dj23R1j13j93M87j36k2M7Q3m09K75k84J98j28K11k3M59o8q8k03j11k71M00
1709G5k75J70K03j57j68L37k80o2J25J56j9j1L60j82l59L16k25L7j83j45mj13
1731d04K51J37J68r4N4k76J97l8o5N9K2N1J44k33K3k9J55M6k28J44j49J05J93
1754B33o4j30l13J20M27k17k55K14p3L3q1J33J28J33n42K35j09L26j83%J12J9
1776A46j26k75M91j93j94K12K3K99k14k96l3K55k01Q9n3J09m2R7k7j9Ok01K80
1799A33j96O4j22J80L5k07J34J29j79J44j12k28K28j87K80m2k5j3Q6r7m6l3l0
$$ plain form
1822 -104 217 -21 -124 -99 78 -56 36 -83 -178 -163 84 -103 88 171 46 145 192 -32 148 -141 -8 -122
1844 -122 -396 -92 18 33 -1 63 -24 -148 -168 -13 73 231 325 60 102 -186 -204 -139 45 -167 54 -112 73
1867 73 -4 -111 -54 -56 -95 88 43 169 -73 -72 -230 10 52 1 88 84 67 -17 178 -104 -118 45 -192 -128 241 -228
1893 -228 20 -87 -82 209 19 -137 -59 219 141 75 -338 -102 41 -41 232 -144 163 48 25 -140 -335 -94
1915 -94 10 144 -1 -78 319 225 -58 7 -22 -98 -101 89 186 13 -201 -61 7 -177 67 140 157 -17 51 109 47
1940 47 -48 -108 -93 -29 -102 -47 -73 -80 -81 17 56 -2 -180 147 -158 -54 135 9 123 187 -15 81 -200 -70 -97 -104 128
1967 128 -85 -49 210 79 -208 96 191 -47 179 -57 -159 -34 51 154 -114 -178 -145 -253 42 57 78 129 -65
1990 -65 -73 172 -260 -54 -84 -128 -53 17 -30 168 -65 48 -168 -134 -17 -179 -64 -251 111 -62 -50 207 319
$$ packed form
1822a04L21k38j03K5J77j34R2j19r5J5K47j87J91Q3j25R9M7k24J80k89J33j14
1844a22k74L04J10J5l4O4q7j24k0J55Q6J58R4k65M2k88j8O5J84k12K21j66J85
1867G3p7j07N7kl9J83m5J26k42Jj58K40M2n1Q7mj7q4J95k82j4J63k37O4L69m69
1893b28K48j07NK91j90j56P8K78p8o6m13K36J43q2K73l76L07j15k3j65j95K41
1915i4J04J34j45p7L97r4k83O5k9p6lJ90R7j73k14J40O8j84K44P3J7j74O8N8o2
1940D7r5o0J5O4p3N5k6pjR8L9n8j78L27l05J04J89j26J14O4k02R6k81J30k7pK32
1967A28k13L6K59j31k87L04R5k38K26k36j02J25Q5J03k68o4L3j08K95J5K1N1j94
1990f5qK45m32K06l0m4P5P0m7J98k33J13k16L4J17j62J15j87L62j73J2K57J12
$$ plain form
2013 319 -54 244 84 -156 -169 -7 14 24 -22 -48 -140 86 26 183 50 34 33 20 39 -146 77 55 -82 -348
2037 -348 80 -86 74 -4 -255 264 -10 29 -242 98 13 -163 -55 -30 -130 123 111 111 -84 -16 29 -32 -172
2060 -172 145 -90 -143 -8 33 94 -399 39 -162 -163 -33 -38 138 24 -152 23 -33 43 57 4 -175 -213 185 -4
2084 -4 -306 -59 -55 -221 55 73 -147 119 233 111 -1 -173 60 2 57 -67 253 -85 -61 -93 -19 137 190 243
2108 243 -53 -379 296 116 -325 51 91 5 -56 -49 258 -29 -35 -70 53 11 -186 11 101 11 -53 -48 95 -106 -45
2133 -45 2 69 52 -190 -10 13 289 39 246 124 -68 -31 141 -156 -238 -245 287 -131 -198 79 -96 282 -80
2156 -80 -147 -139 -109 -345 -194 -214 207 88 -191 -102 107 -39 99 -115 47 56 -123 -158 199 192 -167 -92 21 278
2180 278 -137 -133 -125 25 -44 -246 169 26 -49 -27 -318 -108 -167 -6 267 45 -68 -3 160 28 -21 -9 240 -114
$$ packed form
2013C19l73K98j60k40j3J62K1J0m6k6r2K26o0J57j33j6jj3J9j85K23k2j37k66
2037c48M28j66J60p8k51N19k74L9k71L40q5j76J08K5j00K53j2%j95O8M5o1j40
2060a72L17k35n3J35M1O1m93M38k01jJ30nJ76j14j76J75n6P6J4n3j79l8L98j89
2084dl02K47Mj66K76J8k20K66J14j22j12j72K33n8N5j24L20l38K4l2P4J56N3N3
2108B43k96l26O75j80m41L76M0q6o1PL07k87ol5J23m2j97J97R0r0o4NJ43k01O1
2133d5M7O7j7k42J80K3K76k50K07j22j92L7J72k97q2pN32m18o7K77j75L78l62
2156h0o7QL0k36J51k0M21j19k79Q9K09j46J38k14J62Rj79l5L57pl59P5J13K57
2180B78m15MQJ50o9k02M15j43p5K2k91K10n9J61K73k22j13O5J63j32m9J2K49l54
$$ plain form
2204 -114 -15 -88 -11 -112 -96 -104 275 -68 -31 65 101 95 -76 32 -257 280 269 21 91 112 -69 0 167 -66 142
2229 142 130 83 -24 216 -149 81 209 -82 35 -6 -141 50 50 10 44 -216 -59 -237 473 -27 -4 -75 124
2252 124 50 13 20 217 -59 -146 -81 88 21 -188 309 -130 208 49 -123 -20 201 34 -98 -24 224 -70 20
2275 20 229 65 16 -165 134 25 82 -30 -273 201 216 5 -8 -43 193 -221 70 231 280 -128 -15 59 -181
2298 -181 -158 -37 136 119 -92 53 -315 19 22 -8 -221 -157 24 -10 -68 222 118 -70 207 0 29 137 106
2321 106 64 30 -334 49 108 -72 -136 21 52 -91 -171 300 151 94 -9 -214 39 107 -19 -137 310 -196 15
2344 15 -117 -75 174 82 -182 -109 -339 146 -135 1 1 93 -145 17 148 79 306 30 28 23 -48 19 40 180 -59
2369 -59 38 6 100 -80 130 57 -177 46 -45 169 -122 55 281 284 91 133 161 -49 -19 -23 -203 74 -134 11
$$ packed form
2204a14R9p3P7j01J6qL79l43L7R6L6oj71J08k89N37j1k48P0K1j81O9J67k33K08
2229A42j2m7j07K40l65K30J28k91J17m1j35J91%m0L4k60J57j78P10n00K3p1J99
2252A24p4l7PJ97k76q7O5J69o7k09M97m39L38j59j72J03K21j67j32P4K48k94R0
2275B0K09j64m9j81K99j09N7j12k43M74J5k11j3l5K36m14K91J61M9m08J13P4k40
2298a81K3J21J73j7k11J45l68L34Ll0k13O4J81l4n8K90j04j88K77k07K9J08l1
2321A06m2l4l64L83N9j80o4J57L1j43q0M71j49n7j03k05K53O8j26j18M47n06K11
2344A5j32M2K49r2k64P3k30M85k81J36%R2k38J62J31o9K27k76knp1O7K1J40k39
2369e9R7l2R4j80K10p3k34K23r1K14k91J77K26Lj93M2K8k10L0mj80K77k08J45
$$ plain form
2393 11 -21 -4 207 -263 -42 -193 -22 66 252 -52 -129 -17 176 -214 10 11 -164 -124 8 179 69 -19 55
2416 55 -37 -43 63 51 -196 -15 214 15 -45 -224 89 -32 24 -63 -75 60 245 160 -440 -36 279 178 102 109
2440 109 139 5 167 -77 -107 -76 93 163 143 151 19 -175 221 -82 49 209 162 -162 114 -114 -3 -28 -151
2463 -151 257 85 70 54 74 376 -84 97 47 -3 -296 -170 -121 42 118 -8 -212 20 -220 96 94 -42 127
2486 127 -146 -137 -137 -32 -162 -105 -11 68 85 -187 -89 167 165 -381 23 91 -258 -228 -234 108 -116 63 -65 61 31
2511 31 151 113 449 215 -53 -147 -309 -173 282 394 140 -167 130 121 -186 57 369 -107 -14 60 -156 -221 -95
2534 -95 -124 -118 -86 -8 -271 176 68 -79 -31 126 270 -155 -24 -38 124 -239 -229 125 -114 45 -305 24 132
2557 132 123 25 -99 105 -86 -21 44 -74 51 93 8 113 -238 -12 26 88 178 -146 -62 -261 -26 -92 -11 -172
$$ packed form
2393A1l2J7K11m70K21j51J71Q8J86l04p7J12J93l90K24Jj75M0J32J71j10q8P4
2416E5r2oJ06j2k47J81K29j99o0j79L13j21N6q7j2J35J85q5o00M04L15j01p6P
2440A09L0j34J62k44l0L1J69P0k0Qj32j94L96l03J31J60m7l24K76k28J11k5j23
2463a51M08j72j5j6K0L02m60J81n0n0k93J26M9J63P6j26k04K32k40L16kj36J69
2486A27k73R%J05j30N7R4P9J7k72R8K56kn46M04O8l49L0oL42k24J79j28J26l0
2511C1J20l8L36k34k68r4j62J36M55J12k54l07K97rl07K43L12m76R3P4k16o5J26
2534i5k9OL2P8k63M47j08j47M8J57J44m25J31j4J62l63J0L54k39J59l50L29J08
2557A32rr8j24K04j91O5O5j18J25M2q5J05l51K26L8O2R0l24Q4j99K35o6Q1j61
$$ plain form
2581 -172 -125 198 237 2 123 -134 17 115 -81 -393 -12 288 75 -117 101 -94 -123 -62 28 -50 59 -50
2603 -50 106 -46 2 11 -123 -41 -116 66 -19 138 6 -96 -23 -51 -177 206 17 -59 -183 14 -69 -25 -63 -25 -26
2628 -26 219 66 -22 -16 -219 13 32 -171 77 122 79 59 -99 -136 -172 -82 106 -46 145 -42 210 1 79 -90
2652 -90 -239 265 87 -240 -20 148 263 168 272 -137 -284 192 -151 52 -19 -352 -21 19 215 172 -85 38
2674 38 101 -204 232 -77 -207 126 -114 343 -413 -46 -47 169 -47 -104 17 115 156 27 12 46 -43 201 209 -207
2698 -207 -97 122 -137 -42 60 18 -237 200 -294 -27 97 -133 -43 40 38 -166 -136 -94 -42 122 74 95 67 11
2722 11 -7 -43 353 68 -58 45 -176 -29 47 -322 7 -30 79 -65 -90 161 68 240 240 -41 -218 -162 -47
2745 -47 -105 90 -40 189 -291 244 140 81 52 -53 -26 -217 -116 -94 -98 -52 42 20 132 -29 -194 -52 14 -169
$$ packed form
2581a72M7L23L9k35J21k57J51R8j96l12L81L00k13j92K18j95k9O1R0p8J09j09
2603e0J56j52M8Rj34Q2p5J82q5J57j32j02P3k8j26L83j89p6j24J97q3M4l8L8j
2628b6K45j53q8Ok03K32J9k03K48M5m3k0j58l7l6R0J88j52J91j87K52k09P8j69
2652i0j49N04j78l27K20J68J15r5J04m09j47M76l43K03p1l33L31M0J96m3k57J23
2674C8O3l05M36l09j30L33k40M57p56L67jK16k16n7J21R8M1j29j5L4q9K44Qm16
2698b07J10K19k59R5J02m2k55M37m94K67J24k30R0Q3kk04L0M2N2J64m8K1k8n6
2722A1j8l6L96k85j26J03k21J47P6l69L29l7J09j44k5K51r3J72%k81j77N6J15
2745d7n8J95j30K29m80N35j04n9k9j05K7j91J01K2mM6R4k2J12j61j65J42O6j83
$$ plain form
2769 -169 -256 -41 0 53 -281 -31 123 26 31 -97 -72 125 -232 -82 -44 -35 34 2 -119 -261 -28 19 -55 -122 -156
2794 -156 -158 -34 195 173 -13 -108 -176 -161 28 -76 31 100 170 -22 46 20 -129 -151 1 46 188 -63 -332 -81
2818 -81 -147 36 196 132 -175 -150 -55 108 -26 159 223 -96 132 7 -65 190 -279 -206 -145 24 94 -215 -119 14
2842 14 20 -215 -77 -207 -50 68 -197 -90 -92 -144 257 8 -221 46 53 236 5 -108 95 -42 -220 38 165
2865 165 -120 80 123 -155 -15 179 -248 -72 156 190 -112 116 95 -356 94 -46 -25 -15 64 -31 -138 -32
2887 -32 -299 172 37 -71 37 -359 56 -201 205 -52 -123 -56 -275 -48 90 185 143 -82 164 132 -185 113
2909 113 118 -145 92 -6 30 -66 66 114 33 -25 95 65 -44 -5 -59 278 -121 -56 174 129 79 223 -8 143 110
2934 110 64 -58 -62 45 97 -53 65 -91 27 149 -382 -343 -86 25 117 102 275 310 -41 -28 -206 -242 -157 -101
$$ packed form
2769a69q7K15M1N3l34K50J54r7Nj28K5J97l57J50L8RO9l2j21j42K33M7p4o7l4
2794a56kJ24K29k2j86r5o8J5J89j04J07O9P0j92O8k6j49k2J52M5J42k51k69K51
2818h1o6J83J60o4l07K5R5J63j34J85O4l19K28j25p2K55m69P3O1J69P0l09R6J33
2842A4Ok35J38j30J57J18k65J07kn2M01k49k29K67PJ83k31j13K03j37j78K58J27
2865A65k85K00M3k78J40J94m27J76K28L4l02K28k1m51M50j40K1J0P9r5j07J06
2887c2k67M71j35j08J08l96M15k57M06k57p1O7k19K27J38R5m2k25K46l2l17K98
2909A13Nk63K37r8L6r6J32M8q1n8J20l0j09L9n4L37l99O5K30m5n0J44k31J51l3
2934A10m6j22mJ07N2j50J18j56J18J22n31L9K57J11R2j5J73L5l51J3j78l6Q5N6
$$ plain form
2958 -101 -79 119 187 -50 -8 -8 71 145 20 114 92 -251 161 -55 18 -134 232 17 -39 143 -116 30 -60 101
2982 101 118 -144 -5 -110 140 72 -32 189 151 200 34 330 -1 -20 -48 -80 -3 -89 -93 -52 -68 -159 33 -411 24
3007 24 185 -188 32 149 51 -100 94 146 -129 -339 -174 83 117 280 -174 -36 -179 122 48 -158 -63 -231
3029 -231 171 -201 159 -18 -131 -48 247 -151 78 153 83 -28 -174 -212 -71 68 257 22 -112 -15 -258 42
3051 42 129 -144 -44 -266 113 45 -63 -148 181 -258 -193 -258 28 28 269 -118 -86 84 43 55 -117 162 -280 -43
3075 -43 -10 -130 83 -101 145 6 -247 -81 -22 -53 67 -120 -35 -74 10 117 -27 164 116 -26 -23 2 -24 56
3099 56 -294 -131 142 -69 -130 86 -19 -64 -2 -193 -36 -58 -29 12 101 -71 202 -137 81 47 -82 1 84 336
3123 336 -297 -46 -31 -95 9 248 127 -188 245 71 -98 31 -103 -35 -20 -224 38 43 353 -228 109 -37
$$ packed form
2958a01K2J98O8k37M2%P9P4j25R4k2l43M12k16P3j52L66k15n6J82k59J46r0J61
2982A01J7k62J39j05K50o8j04K21l8M9j66K96l31j9k8l2P7q6mM1j6r1J92m44M35
3007B4J61l73K20J17r8j51J94N2k75k10J65K57L4J63m54J38j43L01p4k06R5j68
3029b31M02l72L60j77j13Q3K95l98K29P5p0j11j46l8J41J39J89k35j34R7k43L00
3051D2Q7k73J00k22L79o8j08q5L29m39O5o5K86%K41l87L2J70m1J2j72K79m42K37
3075d3L3j20K13j84K46j39k53J66N9l1J20j87Q5l9Q4J07j44J91m8j42LK5k6Q0
3099E6l50J63K73k11o1K16j05m5O2j91J57k2K9M1Q9j72K73l39K18l4j29Q3Q3K52
3123C36o33K51J5o4J04K39j21l15M33j74j69J29j34O8J5k04K62NL10n81L37j46
$$ plain form
3145 -37 -292 19 139 43 71 -117 56 99 157 -392 188 -90 197 -88 -130 14 -178 257 190 -119 118 -27
3167 -27 6 -17 -150 -65 -82 226 -25 -123 -64 138 265 -10 56 -100 -47 -69 71 -75 62 -126 -40 171 -162 321
3191 321 6 -53 -13 165 -55 11 -186 -30 -142 -95 103 111 11 117 343 84 -223 213 -80 31 195 74
3213 74 44 287 41 15 2 -239 -380 -30 118 -181 155 -103 -172 -24 197 56 172 -74 92 -36 -81 -6
3235 -6 117 -63 317 -84 -101 75 -1 -134 -21 76 141 -39 65 191 -42 1 -174 -100 17 166 73 299 62
3258 62 -8 60 -69 140 92 -216 360 237 -131 -40 45 -22 257 45 168 -123 165 -103 -82 127 182 258 111
3281 111 -83 -181 -80 155 148 10 -108 -66 75 -34 60 -222 93 85 309 -28 -227 29 -308 264 -69 -82 -95
3304 -95 -208 -130 -134 -232 170 62 -165 31 11 156 33 74 35 117 30 19 8 -95 55 243 -108 39 -130 -32
$$ packed form
3145c7k55L11J20r6K8j88J73M3N8n49N80k78K87k85m2J44j92M35o7l09K37j45
3167b7L3k3j33Q5j7L08k51r8N9K02J27k75O6j56N3k2J40j46J37j88Q6K11l33M83
3191C21l15n9M0J78k20O6j97J56j12M7J98Qj00J06K26k59l07M36k93J11J64j21
3213G4l0K43k46k6j3k41j41L50J48k99L36k58o9J48K21j41J16k46J66j28m5P5
3235fJ23j80L80m01j7J76p6j33J13R7O5j80J04J26k33M3j75P4J17J49r3K26k37
3258F2p0O8j29K09m8l08N76j23l68R1Q5o7K79k12J23k91K88k68K1K09N5P6j47
3281A11j94r8J01K35pj38j18M2J41j09R4k82L15qK24l37j99K56l37N72l33j3j3
3304i5j13P8mr8M02j08k27J96k0J45j23M1l9Q2q7j1j1j03J50J88l51J47j69R8
$$ plain form
3328 -32 -49 -43 -265 -119 7 51 -22 -237 186 42 199 147 -38 -41 86 108 -40 121 197 -32 41 -105 157 1
3352 1 -32 -57 -34 171 82 185 80 -41 -79 -162 4 201 196 -109 -78 86 -65 -12 -155 -71 -33 338 98 55 46 50
3378 50 -28 270 -115 238 217 -230 158 185 368 16 56 -9 -1 -59 106 35 -256 -190 -228 44 -8 -140 144 -284
3402 -284 13 -44 -30 -103 -81 78 -34 152 74 -62 -174 93 -4 306 109 -66 -177 51 -16 305 -9 -84 -307
3425 -307 -142 -77 -107 99 -23 -12 281 93 50 -165 173 171 -251 49 302 -72 -39 126 11 -15 -109 195 68
3448 68 98 -111 -61 -44 -158 18 -81 41 147 82 106 42 3 -165 21 -54 219 227 327 -34 -133 157 22 -8 87
3473 87 -185 -33 19 46 -148 -39 195 58 235 -84 62 -176 45 37 56 -120 -177 116 -128 36 -319 27
3495 27 50 -11 -11 58 -112 120 -158 227 -99 108 -68 -239 144 -207 139 -16 22 -126 200 91 396 44
$$ packed form
3328c2j7Ok22J46J26M4p3k15M23j44J57n2j85lJ27K2j48J61P6k29P3j46K62j56
3352Al3k5K3K05q9J03j05j21l8q3J66J97nl05L1J64j51N3j43Q4L8L71k40m3rM
3378E0p8K98l85L53k1m47L88K7J83l52M0o5Qn8J65p1k91O6l8K72n2j32K84m28
3402b84K97n7J4p3K2J59j12J86p8j36j12K67r7L10j97j75j11K28o7L21l14p5k23
3425c07J65O5l0K06j22J1K93j88m3k15L38km22L00K53l74L3J65j15k6r4L04j27
3448F8L0k09N0J7j14J76r9J22J06o5K4o4l9j68J86p5K73QJ00l61r9K90j35l0R5
3473H7k72J52N2K7j94J09K34j37J77l19J46k38K21qJ9j76n7K93k44J64l55L46
3495B7K3o1%O9j70K32k78L85l26K07j76j71L83l51L46j55L8j48L26j09L05l52
$$ plain form
3517 44 -66 147 -345 10 -79 22 -219 -68 125 -71 -11 -37 0 40 39 174 141 -207 62 193 -13 195 231
3540 231 147 -4 -205 -125 12 89 88 -49 -66 -143 35 -128 39 118 -18 47 5 23 -198 132 16 14 -104 265
3564 265 -119 121 -155 -9 274 -17 52 -34 -141 5 84 185 -46 -265 -15 -58 -13 48 -273 33 229 71
3586 71 -3 205 161 420 37 -35 64 -298 164 52 142 -67 77 -17 -166 -30 -155 -50 11 -70 -284 157 -103
3609 -103 430 -25 -39 -55 -53 -103 200 -12 -155 -87 122 -8 -143 -55 168 109 81 -263 -32 193 141 143 33 134
3633 134 269 335 -99 -81 -12 -6 -21 -44 105 -27 -118 129 254 -29 130 -119 181 -35 6 30 37 57 85 -31 -15
3658 -15 -101 138 194 11 -98 111 42 -384 131 60 -228 -184 -47 128 -1 -161 -1 -227 -37 -159 -91 87
3680 87 -127 -93 -70 394 160 -253 -67 -25 210 18 15 -69 146 232 -100 -186 147 -32 93 38 184 -184 -202 -62
$$ packed form
3517D4j10K13m92L55q9J01k41J51J93j96O0k6L7M0jJ35l3l48K69J31k06K08L6
3540B31q4j51k01Q0J37P7jj37j7p7J78j63J67P9j36O5m2J8k21L30j16kj18L69
3564B65l84K40k76J46K83k91O9q6j07J46P9J01k31k19K50m3M5O1l21L06J96j58
3586G1p4K08m4K59l83p2R9l62M62j12R0k09J44r4j49J36j25J05O1q1k14M41k60
3609a03N33m55j4j6Kn0L03k12j43O8K09j30j35Q8K23n9k8l44K31K25n2Kj10J01
3633A34J35O6m34J8O9Oj5k3J49j32r1K47J25k83J59k49L00k16M1K4PK0K8j16J6
3658a5q6K39N6j83j09K09o9m26N15p1k88M4J37J75j29j60J60k26J90j22O8J78
3680H7k14L4K3M64k34m13J86M2K35j92lq4K15Q6l32q6L33j79J25n5J46l68j8J40
$$ plain form
3704 -62 -56 66 271 91 -116 170 228 139 119 30 138 279 151 -17 134 137 -116 65 5 -72 -159 -130 44 69 311
3729 311 77 -129 37 95 -242 -155 33 143 303 -32 -273 -126 -2 -171 87 49 104 99 189 -330 -48 -155
3751 -155 171 129 -91 167 -146 -54 62 2 39 -162 303 -317 183 102 -70 77 -99 -45 -235 -114 -155 104
3773 104 -177 -189 61 -37 15 283 223 -353 29 112 -20 -31 53 15 101 0 -89 6 165 145 121 73 16 -219 -29
3798 -29 -116 -64 -265 -122 -103 51 19 -409 195 25 32 7 152 76 -35 -47 309 119 -126 -21 -26 215 -25 134
3822 134 253 394 66 -138 -29 -102 119 66 -3 -186 -12 141 -155 -74 27 400 73 75 178 -118 -10 -193
3844 -193 -25 87 -267 -113 -398 -16 63 83 -159 156 -85 -132 158 88 348 -279 145 58 -45 -57 -18 -115 77
3867 77 -173 165 196 -4 38 -307 -59 -103 -192 -234 168 89 -135 -10 148 14 -28 41 -92 82 172 117 -33 35
$$ packed form
3704f2OJ22K05j80k07K86N8q9k0q9J08J41j28j68J51Lk53J81o0p7q7K9J74K5K42
3729C11k34k06J66N8l37Q7J88J10J60l35k41J47J24j69K58l8N5nR0n19K82j07
3751a55L26m2k20K58l13R2J16o0L7k01M65o20N00q1j72J47j76N4j90J21m1K59
3773A04k81j2K50r8N2K68o0n76L82Q3j32j1Q4l8Q6j01q9R5J59k0k4m8n7k35J90
3798b9q7N2k01J43J9J54l2m28O04j70Pk5J45p6j11j2L56j90k45J05nK41k40J59
3822A34J19J41l28k04J09p3K21n3o9j83J74J53k96Q1J01L73l27KJ03k96J08j83
3844a93J68J12l54J54k85L82P9K0k42L15k41m7K90p0K60o27M24q7j03j2L9r7J92
3867G7k50L38L1k00M2l45K48m4q9m2M02p9k24J25J58j34m2O9j33J74R0n5j50O8
$$ plain form
3891 35 -423 243 103 -138 -151 -126 -79 -19 44 -35 96 -64 22 -166 -8 -192 -132 227 81 203 -114 44 168
3914 168 -14 60 -5 81 115 44 -156 43 -34 25 148 17 169 15 -12 -89 319 87 321 -107 -52 -232 -43
3937 -43 111 -458 -50 -77 81 187 50 -30 -120 89 -53 -47 84 102 146 315 -43 169 -296 93 -227 81 316
3960 316 -219 -27 -79 117 91 142 76 5 -73 27 36 144 -170 -31 179 192 -18 -120 73 116 84 109 168 360
3984 360 45 -14 -136 -151 40 -113 -175 -114 -169 -24 -161 111 -89 130 143 -118 31 -331 151 53 188 23
4006 23 211 -23 324 -170 7 96 132 -41 149 168 -94 214 17 -90 -182 133 209 -48 91 155 283 142
4028 142 -31 127 -189 -97 -274 22 169 167 -235 300 -75 48 -145 -12 -109 -256 -151 121 -33 -127 -170 160
4050 160 13 60 36 18 -61 105 -37 -70 -235 -209 96 -115 -276 -48 68 63 153 -64 -55 167 -385 -149 74 -297
$$ packed form
3891C5m58O66j40k41j3K5M7O0O3p9J31j60Q6j88J58j84O0L59j46J22l17J58J24
3914A68j82P4o5Q6L4p1k00J99p7N9J23j31J52j54k7p7M08k32K34m28N5j80J89
3937d3J54n69M08k7J58J06j37q0r0K09j42OJ31J8M4J69l58K12m65L89l20L08K35
3960C16n35J92n2J96k6N1o6p1p8J00RJ08l14J39K10J3k10j02J93M3l2K5N9J92
3984C60l15n9j22j5J91j53o2O1n5J45j37K72k00K19J3k61J49l62M82r8J35j65
4006B3J88k34L47m94J77Q9L6j73J90J9k62L08j97j07r2L15P6k57J39O4J28j41
4028A42j73J58l16R2j77K96J47km02N35l75J23j93J33r7j47J05K72j54r4m3L30
4050A60j47M7k4j8p9J66j42l3j65K6L05k11j61K28J16nR0k17RK22n52K36K23l71
$$ plain form
4074 -297 -83 88 -34 73 -88 38 175 -37 -104 -47 -77 -76 -28 105 108 291 28 47 -24 278 210 43 183 84
4098 84 129 -117 -138 273 -50 -151 252 205 202 -248 -39 259 -422 -50 -290 -70 110 35 187 215 248 33 -46
4121 -46 119 -219 -87 75 -46 159 102 -293 -44 -139 15 51 25 17 -153 -69 203 324 -69 265 77 -118 67
4144 67 19 75 33 90 19 71 316 -58 235 175 -186 88 -248 -37 199 -155 -112 -17 14 -192 -149 -76 250 203 52
4169 52 -255 197 -49 -2 89 -98 -276 -54 -239 -154 119 -111 -15 -37 86 83 128 -133 -55 77 7 61 143 -48
4193 -48 -229 -62 402 197 144 149 306 43 8 -59 -81 -62 379 -40 -134 82 -25 401 30 -177 54 2 6 124
4217 124 -105 -115 21 58 218 110 71 87 73 -242 -49 76 174 -244 -114 120 -211 -153 -35 -306 24 222
4239 222 54 9 -144 -56 -98 126 164 -147 -242 123 49 185 -109 235 161 89 -171 -185 -7 -27 170 145 26 71
$$ packed form
4074b97K14J71j22J07j61J26J37k12o7N7l0JM8J33LJ83k63J9p1L02o8j67J40r9
4098H4M5k46k1M11l23j01M03m7lm50K09K98o81L72k40K20J80p5J52K8L3k15p9
4121d6J65l38J32J62j21K05n7l95K49r5J54L6k6qj70Q4K72J21l93L34j88j95J85
4144F7m8N6m2N7p1N2K45l74K93o0l61K74l36K11K36l54M3R5L1k06M3P3L26m7j51
4169E2l07M52k46M7R1j87j78K22j85Q5K73k30R6k2J23lM5k61P8J32p0N4Q2j91
4193d8j81J67M64k05n3NJ57k63l5o7k2J9M41m19r4K16j07M26l71k07K31n2MJ18
4217A24k29j0J36L7J60j08l9J6j4l15J93J25R8m18J30K34l31N8J18k71L30J98
4239B22j68m5j53Q8m2K24L8l11r5L65p4J36k94L44p4p2k60j4J78k0J97k5j19M5
$$ plain form
4263 71 -5 -208 295 58 102 67 81 -196 -52 -44 -291 95 -133 -33 13 -46 -251 -11 -144 172 26 372 -41
4286 -41 -286 176 -100 -70 -61 83 -30 116 116 -162 200 -7 226 -64 56 -111 -226 137 -15 -247 51 33
4308 33 82 -38 -54 170 189 -217 31 295 -208 25 -11 104 -81 -75 153 -204 -85 -11 -177 -95 119 45 -80
4331 -80 307 75 273 -43 65 -178 -118 226 37 -161 -14 104 -204 66 -198 111 186 -31 105 53 136 324
4353 324 25 -72 -224 -4 148 78 -260 -139 143 -54 228 -152 -28 71 97 -134 75 168 286 50 -53 -356
4375 -356 162 162 -93 -160 210 -14 -226 48 -81 9 -155 -93 168 128 123 -62 -34 95 -12 -66 -76 106 -45 79
4399 79 81 19 -330 28 -234 282 -100 260 -224 110 260 -231 228 140 -21 90 62 159 -10 -43 19 -355 169
4422 169 -67 -79 -37 28 178 -42 56 138 132 39 310 113 -39 -24 -34 40 21 142 -25 29 -58 113 76 -30 54
$$ packed form
4263G1p6k03N03k37M4l5J4k77J44Qk47L86k28J00M6n9k05K40j33L16j46L46m13
4286d1k45M62k76L0RJ44j13J46%k78L62k07K33k90J20j67j15L63j52k32K98j8
4308C3M9j20j6K24J9m06K48K64n03K33l6J15j85OK28l57J19P4j66Q2K14p4j25
4331h0L87k32J98l16J08k43O0L44j89j98J47J18l08K70k64L09P5k17J36n2Q3J88
4353C24k99r7j52K20J52p0l38J21K82j97K82l80J24R9K6k31K09R3J18k36j03l03
4375c56N18%k55o7L70k24k12K74j29R0j64O2K61m0nj85K8J29j07n4j0J82j51J24
4399G9Ko2l49L58k62N16l82L60m84L34J50m91M59q8j61J11k8R7j69l3O2l74N24
4422A69k36j2M2O5J50k20R8Q2or3K71j97j52J5j0P4j9J21j67N4q7J71l7j06Q4
$$ plain form
4447 54 86 130 -103 -213 -40 121 81 24 -131 -92 -84 -3 154 162 127 -122 -201 309 145 -55 132 38 91 -42 116
4472 116 16 148 -104 105 -153 -47 151 53 144 191 368 -142 62 -34 91 -8 -29 20 2 -50 10 -40 -57 -90
4496 -90 -119 -18 137 145 53 88 -144 -15 -117 -239 -143 -90 -31 18 8 10 95 -275 -20 102 96 -39 96 -125 -226
4521 -226 131 -332 66 161 82 188 121 252 -18 -15 71 78 92 -68 -278 249 114 13 34 208 -40 -53 -57 44
4545 44 89 141 -54 -208 146 1 -57 -15 228 148 224 -14 93 -48 -56 91 206 159 114 222 -302 26 -181 262
4569 262 313 -267 -152 -180 232 -59 -146 -37 -100 -178 -184 -73 -155 98 170 61 134 -255 -254 73 -81 21 126 69
4593 69 56 24 335 36 159 -68 -84 0 146 288 89 204 29 111 11 63 54 -71 -149 166 194 -203 82 8
4617 8 -268 96 -84 -201 110 -218 13 108 44 102 10 -120 357 29 109 -152 18 -1 -97 46 166 214 8
$$ packed form
4447E4L2M4k33j10J73J61m0n7j55L9QQ1J57Ql5k49p9N10j64k00J87r4N3j33J58
4472A16j00J32k52K09k58J06J98r8R1M7J77n10K04r6J25r9k1M9j8n2O0n0j7l3
4496i0k9J01J55Qr2L5k32J29j02j22R6N3N9M9j0KQ5l70K55J22oj35J35k21j01
4521b26L57m63L98R5p9J06o7J31k70LQ6PJ4j60k10N27j35j01K1J74k48j3mJ01
4545D4M5N2j95j54L54j45n8M2K43q0P6k38J07j41qJ47J15m7m5J08n24L28k07M43
4569B62N1n80J15k8M12k91q7J09o3p8oJ11q2K53P2j09P3l89JL27j54J02J05n7
4593F9j3l2L11k99J23k27j6Q4J46J42j99J15j75Q2j00N2rj25p8L15K8l97K85p4
4617Hk76L64j80j17L11l28K31R5o4N8r2j30M77l28Q0k61J70j9r6J43J20M8k06
$$ plain form
4640 8 96 20 -16 58 -196 -150 -167 235 -58 20 -122 -113 99 48 31 180 -311 -86 111 -177 144 -14 -56 -185 -58
4665 -58 31 -133 116 -27 -254 32 -41 -183 37 86 -46 -34 139 -53 -42 -77 -230 -156 -176 -40 -2 216 71
4688 71 149 -104 155 -53 74 -109 80 187 -185 357 66 -42 -69 39 47 50 27 19 111 16 -169 85 237 90
4712 90 -1 -265 20 95 -73 -2 -62 172 149 121 193 177 295 -27 45 31 -135 1 95 57 150 -147 -169 -35 131
4737 131 326 -26 231 314 -61 -35 -195 -49 -60 68 -19 -38 65 61 -163 90 -154 -107 -244 92 262 73 -71
4760 -71 -306 196 -201 -140 -13 130 27 -111 -84 126 193 93 -260 139 47 205 -236 -79 -20 -168 177 -258
4782 -258 47 78 75 7 -9 -87 -127 -108 -138 182 -66 -196 59 0 -300 -94 36 104 199 -82 55 193 106 52 175
4807 175 49 -29 71 -190 316 325 -112 235 -55 -58 -3 98 -279 11 -346 -16 221 192 126 291 75 -213 45
$$ packed form
4640HQ8p6l6P4k54M6j7M02k93P8j42RK12n1j7J49m91K25J97k88L21j58m2j29J27
4665e8Q9j64K49j43k27K86p3j42K20M9j32J2J73j92J1l5j53P4k0J36L8K18j45
4688G1P8k53K59k08J27j83J89J07l72N42k91j08k7J08QLk3qR2r5j85K54J52j47
4712I0r1k64K85P5j68P1o0K34k3k8P2j6J18l22P2j4j66J36R4l8R3k97k2J34J66
4737A31J95l52K57Q3l75K6j60J46j1J28q7j9J03mk24K53k44M7j37L36J70j89j44
4760g1k35N02l97O1J27J43j03j38K7K10O7j00l53L99r2J58m41J57N9j48L45m35
4782b58L05L1lo8j6p8m0J9l0L20k48j30K55n9l00K06J30O8R5k81J37J38q7n4J23
4807A75j26p8J00k61N06Rm37L47k90lN5J01l77K90l57L30K37k9o6J65k16k88K58
$$ plain form
4830 45 3 -21 86 102 -19 94 24 -20 -173 -160 -72 60 100 -208 -79 118 46 245 181 299 -102 120 -64 96
4854 96 -172 148 -16 102 -216 89 166 64 35 -65 68 -109 -116 80 16 139 32 47 -34 148 -10 156 173
4877 173 305 -112 170 319 -8 142 83 -176 129 -188 -76 89 213 -72 97 259 111 -182 1 73 164
4898 164 -5 -74 135 328 271 247 -46 140 20 175 76 179 -29 -4 25 -85 -181 102 41 79 18 -25 125 -78
4922 -78 -31 -161 -70 2 -125 109 97 357 98 -125 195 -107 295 -162 219 12 -102 -94 1 52 -42 29 -37 91
4946 91 51 -109 -103 68 -65 -20 -61 -19 -260 -12 91 44 -81 57 62 -143 -82 -66 -193 -45 -132 67 322 -98
4970 -98 -101 -157 -176 -119 310 -215 -122 13 -57 -117 82 -181 207 -39 -107 49 109 134 201 -79 -59 -58 -46 59 37 -117
4996 -117 -190 37 37 23 -200 -153 -61 10 95 76 40 133 -82 -202 -13 -47 67 60 -44 -46 -27 -353 69 -52 104 -64
$$ packed form
4830D5m2k4J07J6j21J13p0m4j53J3Q8J32M0l08J29J97p2J99o4J18m01K22j84J60
4854I6k68L20j64J18l18L05P7j02k9j00J33j77pJ96o4J23j07J5q1J82j58J66J7
4877A73J32m17K82J49l27J50n9k59L05l17J12J65J24k85J69J62j48k93J83P2R1
4898A64j69o9K09J93n7k4k93J86j20J55r9J03k08K5K9j10r6K83o1L8o1m3J50k03
4922g8M7j30R1P2j27K34j2K60k59k23L20l02M02m57L81k07j14QR5N1r4P1o6J28
4946I1m0j60OJ71j33M5m1M2k41K48J03m7j25J38Nk05O1J6j27J48q7J99K55m20
4970i8ln6j9N7M29n25R3J35p0o0J99k63L88k46o8J56O0K5O7k80K0JJ2J05k2j54
4996a17p3K27%j4k23M7R2P1Q5j9l6R3k15j20J89l4J14pj04kJ9l26M22j21J56j68
$$ plain form
5022 -64 165 -129 96 -214 156 -50 18 169 141 95 -123 213 -13 -119 15 81 110 -90 91 231 179 -177
5044 -177 -229 167 283 27 158 47 18 180 -127 186 63 129 -208 -19 111 148 3 70 44 56 139 55 -100
5067 -100 98 -7 18 -133 0 36 132 -19 130 176 144 -124 158 -2 -144 -160 -322 22 57 -23 -170 9 43
5090 43 130 156 203 124 236 -60 91 -470 40 -114 255 -73 -96 543 -30 302 10 -193 310 162 7 134
5112 134 -141 19 57 -78 -24 -162 -57 81 -30 281 206 165 -162 22 164 -20 -129 34 -275 345 137
5133 137 -186 71 -32 36 -122 -17 169 68 127 -147 -92 -15 -29 -57 -76 -80 224 41 89 -1 0 -43 -181 -57 3
5158 3 -23 85 153 184 80 30 163 -99 -30 163 6 79 84 165 -113 -97 -22 -7 163 2 -117 127 113 35 125 26
5184 26 58 -45 -199 -22 -18 185 96 144 37 -245 54 28 -136 -29 36 -156 107 50 10 116 -89 -197 136
$$ packed form
5022f4K29k94K25l10L70k06O8J51k8m6k18L36k26j06J34O6K9k00J81J40n2l56
5044a77n2L96J16k56J31j11k9J62l07L13j23O6l37J89J30L7j45O7k6J2Q3q4j55
5067a00J98j05K5j51J33L6R6j51J49M6l2k68K82j60j42j6j62L44L5q0j47J79L4
5090D3Q7K6M7p9J12k96J51n61N10j54L69l28k3O39n73L32k92k03N03j48j55J27
5112A34k75J60L8j35N4j38J05J38j11L11p5m1l27J84J42j84j09J63l09O20k08
5133A37l23K57j03O8j58J05J86j01N9k74N5P7j4k8j9mL04j83M8r0Jm3j38J24O0
5158Ck6J08O8L1j04n0J33k62O9J93j57P3NQ1k78J6P5J5J70j61j19K44j4p8R0r9
5184B6L2j03j54J77MK03q9M8j07k82K99k6j64J07O5j92K63n7m0J06k05j08L33
$$ plain form
5207 136 39 -75 79 64 -195 -24 62 190 138 -11 131 2 13 -110 -35 91 -39 125 62 -17 70 291 225
5230 225 -3 102 76 88 -157 259 -5 27 -17 76 19 136 190 79 -108 -59 180 118 -13 -257 97 150 -102
5253 -102 68 82 11 52 4 -97 -284 -110 2 6 -136 80 -185 -206 59 -138 12 181 -215 -67 47 -233
5275 -233 23 -54 341 -87 274 63 72 322 -366 30 -160 -201 58 148 86 -129 89 15 -98 -291 -140 129
5297 129 41 -171 37 113 -107 -107 254 37 -56 -86 126 12 -47 119 22 76 -108 226 183 -67 151 106 -39 -184
5321 -184 -75 346 364 -228 -233 89 -167 29 -71 -43 61 -68 39 -101 143 50 3 -414 37 58 -105 283
5343 283 -156 201 -117 -13 167 -175 -12 46 17 111 -168 -66 -15 -113 87 -122 -18 -134 109 -85 127 120
5365 120 -112 13 -61 48 -25 -134 -114 -89 46 316 275 -91 132 52 -172 120 -60 -69 113 -355 -48 153 -133
$$ packed form
5207A36r7j14J54j5k59J71Q6J28n2j49J42j29J1j23P5J26j30J64o3p9Q7K21o6
5230B25k28J05k6J2k45M16k64L2m4R3n7J17N4j11j87M9K39o2j31k44L54N3k52
5253a02J70J4p1M1m8j01j87J74J12Mj42K16k65k1K65j97J50J69l96J48J14k80
5275b33K56p7L95m28L61k11RK50o88L96j90m1K59R0o2k15K18p4j13j93J51K69
5297A29q8k12K08P6k20%L61k17r3l0K12j14n9J66r7N4j84L34m3k50K18m5j45j45
5321a84J09M21J8n92nL22k56J96j00K8J04j29J07j40K44r3m7m17M51K1j63L88
5343B83m39L57l18J04J80l42J63N8k9R4k79J02N1r8K00k09J04j16K43j94K12p
5365A20k32J25p4J09p3j09K0K5J35K70m1l66K23q0k24K92j80rJ82m68L07K01k86
$$ plain form
5388 -133 112 53 19 -132 -155 -15 -67 106 -100 237 189 53 -244 169 -187 -105 -79 -108 -21 77 67 120 51 -122
5412 -122 -248 44 195 -85 -192 -70 74 142 320 -287 -71 210 0 -81 -287 61 -239 207 -402 207 81
5433 81 153 207 2 106 154 -105 89 -43 -33 72 -193 -29 -229 65 -132 -264 11 -445 -80 333 119 46
5455 46 -141 -151 -380 -122 164 5 -67 -105 -131 -232 171 62 77 146 -247 225 183 99 -138 -4 -78 10 -118 -189
5479 -189 56 -17 39 197 43 237 34 -39 208 -280 -117 -161 -8 -295 -70 -91 -365 217 -111 177 -40 -382
5501 -382 -174 74 299 5 41 -211 -275 33 -160 -193 -83 -174 86 91 79 101 62 205 62 -30 40 -186 -244 -449
5525 -449 8 285 -179 -31 218 1 -112 217 84 33 41 74 31 185 -135 -274 -89 -198 -87 -47 -118 -110 -30
5548 -30 133 8 -68 -112 -71 -74 -315 198 223 46 92 -23 -188 -143 202 -59 78 -4 -56 23 28 191 16 180 166
$$ packed form
5388a33K45n9l4j51k3J40n2J73k06L37m8j36k97M13l56Q2K6k9Q7R8j0N3o9j73
5412a22j26K92J51k80j07J22J44O8J78o07K16K81k10q1k06L48l00M46o09O09j26
5433H1P2N4k05J04M8k59J94j32J0J05k65J64k00K94j97j32K75m56L65M13k14p3
5455D6j87j0k29K58K86j59p2l8k6j01M03j09J5O9l93M72m2q4k37J34p4Q8j28p1
5479a89K45p3N6J58j54J94k03p3K47m88J63m4J53k87K25k1k74N82l28K88k17l42
5501c82K08K48K25k94L6k52o4L08j93l3J10r1K60Nj2K2l9J43j43r2P0k26n8k05
5525d49M57K77m64J48K49k17j13L29j33n1QL3m3J54l20j39J85j09J11M0p1QQ0
5548c0J63j25p6m4M1lk41N13K5j77M6j15j65M5L45k61J37q2n2P9NJ63j75J64j4
$$ plain form
5573 166 -14 33 145 -233 257 76 -79 -179 -40 2 -137 -16 -135 72 35 102 96 113 -19 8 -120 48 106
5596 106 132 412 48 7 -210 26 -176 -53 218 -176 174 144 -149 88 -326 176 -85 -97 78 -27 -83 -215
5618 -215 215 207 -46 38 235 150 -28 -274 45 80 -76 55 294 151 -241 116 66 71 -43 -153 113 245 92
5641 92 135 154 -112 -435 -163 82 -37 256 -190 -25 227 4 23 94 -158 -162 109 36 66 49 93 -41 -58 -68
5665 -68 -214 -293 -124 -267 130 -224 30 -56 95 184 191 204 25 -15 207 -191 98 -82 -3 -131 108 96 -297
5688 -297 44 140 51 165 64 -26 -269 190 32 76 249 -269 43 -109 236 -188 -154 -28 -152 -46 75 70
5710 70 35 -208 -36 213 73 228 -112 -163 -41 -181 186 -169 42 -135 116 46 -10 -194 -211 33 29 19 125
5733 125 -77 82 -77 -86 182 3 -209 176 -160 104 109 -105 114 -138 106 -87 13 67 168 128 -217 -81
$$ packed form
5573A66j80M7J12l78M90j81j55j00J39M2j39J21j19K07l7O7oJ7j32K7j28J68N8
5596A06K6K80l64m1k17K36k02J23K71l94L50l0k93K37m14N02k61j2J75j05n6j32
5618b15M30qk53Q4J97q5j78k46L19L5j56J31K39j43l92L57n0Nj14j10K66J32j53
5641I2M3J9k66l23K72K45j19K93m46J65K52k23J9P1k52mK71p3L0j7M4j34j7j0
5665f8j46p9J69j43L97l54K54q6J51Q9PJ3j79m0K22l98K89j80P9j28K39j2l93
5688b97L41R6q9J14j01r0k43M59j58M4J73n18L12j52L45m24L4J26j24J06J21n
5710G0l5k43J72K49j40J55l40n1J22j40L67l55K11j77K51p0n6j84j7K44mj0J06
5733A25k02J59j59rK68j79k12L85l36K64Nk14K19k52K44j93J00N4J01m0l45J36
$$ plain form
5755 -81 -137 -60 0 -9 57 -200 -23 61 34 -53 -101 100 -169 -128 -170 56 46 -5 1 111 -15 -10 81 -149 -59 52 -77
5782 -77 102 1 13 13 -5 215 -33 -166 -71 138 13 -165 -9 218 152 240 -38 13 -12 -58 -43 -11 206 -123
5806 -123 -121 -186 -50 -79 -238 193 105 -157 163 -221 29 100 71 267 -33 -219 -106 -103 260 25 156 -84 -118
5829 -118 -49 -176 152 -119 -31 67 -200 7 67 96 159 27 12 -84 -213 -35 142 -181 191 -34 167 52 -158
5852 -158 -174 -48 231 -6 51 -314 -87 -11 162 119 0 47 46 62 140 169 -52 41 -120 65 -111 -103 -86 164 158
5877 158 41 -106 2 -189 -117 173 -129 -269 196 -85 -119 109 136 -147 141 124 -163 171 258 -6 -31 -379
5899 -379 11 -33 -197 122 61 34 239 92 -83 -129 -171 -105 53 -43 3 128 12 3 -100 -313 48 68 80 104
5923 104 104 43 -65 163 -44 -71 -12 242 -131 -111 12 -13 -145 -130 -27 157 -96 220 101 99 -144 -52 159 -96
$$ packed form
5755h1n6P7O0rO6k57J77Q4k7q7m8K01k69M1m2K26j0n1OJ10j26NR1k30R0J11j29
5782g7J79j01J2%j8K20k48j33R5K09j25j78J56K27o6Q8k78N1k5m6J5L2K17l29
5806a23Ko5J36k9j59M31q8k62L20l84K50P1k9J96l00j86J13LL63k35J31k40l4
5829a18O9j27L28k71Q8R8k67K07O0K9O3j32j5r6j29J78J77l23L72k25K01j15k10
5852a58j6J26K79k37N7l65K27P6J73m3j19M7jJ6P8K9k21R3j61J85j76QJ7K50o
5877A58j17j47J08j91P2K90l02j40M65k81l4K28K7k83K88j7k87L34Q7k64k5l48
5899c79L90m4j64L19o1k7K05j47j75m6m2O6J58r6M6J25j16rj03k13L61K0J2K4
5923A04%o1j08K28k07k7N9K54l73K0J23k5j32J5J03J84k53L16j19kk43R2K11k55
$$ plain form
5947 -96 241 213 120 -111 116 -53 -132 -67 123 -337 172 -12 -51 30 -8 -133 -88 -142 -219 64 179 -225 -17 114
5971 114 83 256 63 -148 -94 43 -213 227 -81 -216 -147 -38 -142 -243 -52 -54 21 37 56 227 -137 -9 43
5994 43 57 175 -132 19 -251 -276 -395 -45 138 -120 45 63 98 192 23 -135 -82 12 -42 -155 68 -36 -23
6017 -23 -38 28 -58 -13 269 183 -155 -228 4 48 0 21 79 -72 105 -189 -158 -217 112 -9 -46 -179 -95 -114 118
6042 118 144 114 335 -124 69 91 -30 -75 214 -62 -86 -29 183 -8 -54 195 -137 -277 -37 -43 -24 309 -58
6065 -58 -47 90 170 -16 -47 36 -153 3 -22 -32 -4 -145 -179 221 -79 -145 -113 -178 -285 -258 151 -15 81 243 -168
6090 -168 -193 -115 114 327 -57 155 37 -20 98 -192 142 45 171 342 82 -244 -246 19 54 -188 67 54 -31
6113 -31 67 -69 24 11 9 -100 -39 32 -124 -84 132 75 7 -5 -190 47 89 -6 283 76 -194 34 -40 146 104
$$ packed form
5947i6L37k8r3k31K27j69p9O5J90m60N09j84l9Q1l8j25M5n4p7K83J15m04K08J31
5971A14l1J73j93k11N4J37k56M40l08j35O9J09j04j01J91kP5J6J9J71l64J28N2
5994D3J4J18l07J51k70k5j19L50J83k58J65J8L5R4j69j58N3R4n4j13K23j04J3
6017b3j5O6q6M5K82q6l38p3K32M4m8K1N8j51J77k94L1n9L29j21l7j33Q4j9K32
6042A18K6l0K21m59J93K2j21m5K89k76k4N7K12j91m6K49l32j40K40oJ9L33l67
6065e8J1J37Q0j86l1Q3j89J56k5j0K8j41l4M00l00o6L2o5j07K7M09j66R6J62m11
6090a68k5P8K29K13l84K12j18n7J18k90L34r7J26J71k60l26kK65L5k42K55j3q5
6113c1R8j36R3j3kj09O1P1j56M0K16n7o8j2j85K37M2r5K89k07k70K28p4J86m2
$$ plain form
6138 104 101 -137 -55 -51 224 -141 73 13 -17 -15 -6 -283 85 -46 25 160 27 -197 75 169 71 -115 57 281 -35
6163 -35 -68 144 -191 -102 215 -112 -15 203 57 2 240 26 -41 -95 -48 45 -131 146 65 -90 118 -131 -233
6186 -233 32 195 -48 3 136 -33 -48 -269 -8 -5 44 411 131 98 -140 39 -198 -235 -21 22 112 -32 16
6209 16 218 186 312 -63 155 149 -79 -10 -122 -141 197 142 18 96 131 -123 177 13 -110 -310 19 -145 54
6232 54 50 101 36 -69 -9 -52 4 -161 220 -210 159 61 -7 221 -228 -51 -10 -27 84 22 -121 50 139 -40 114
6257 114 65 -210 -244 -115 2 270 6 65 -284 -66 53 -165 -66 -161 165 -65 112 186 120 -152 54 85 150
6280 150 -69 -56 -211 144 -91 41 -33 86 34 -27 -189 -167 -133 105 224 -34 52 47 -256 162 15 276 25
6303 25 -19 76 28 48 -72 -135 81 45 -249 218 49 -15 39 143 91 63 -111 137 5 -17 121 -46 171 17
$$ packed form
6138A04lk38Q2MK75l65K14o0l0KRk77L68j31P1J35j33k24K72R4r8j86J72K24l16
6163c5l3K12l35Q9L17l27R7K18j46n5K38k14o7n4M7R3j76K77q1j55K08k49j02
6186b33K65J63k43N1J33j69j5k21K61LM9L67k80l3k38J79k37l7K14M3R0j44M8
6209A6K02l2J26l75K18ok28O9j12j9L38n5j24P8L5k54L00j64j23k00L29j64J99
6232E4mN1o5j05O0m3N6j65L81m30L69r8o8K28m49J77M1j7J11o2j43J71Q9j79J54
6257A14m9k75l4J29J17K68k64N9l49K18J19k18R9r5L26k30J77P4o6k72K06L1O5
6280A50k19J3j55L55k35J32p4J19n2o1j62K2L4K38J19k58Q6nl03M18j47K61k51
6303B5m4R5m8K0j20o3K16l6k94M67j69o4N4J04n2k8j74K48j32k2J38j67K17j54
$$ plain form
6327 17 83 -88 -68 -100 -234 -14 -40 -41 8 -86 24 -68 65 82 -5 70 -202 -16 -42 112 114 276 -144 -132 -89 140
6353 140 22 -187 204 180 -49 5 147 -38 -100 -79 -72 -124 -159 -185 -34 86 136 -99 57 120 -18 -134 -79 -35
6377 -35 264 -99 28 54 75 -77 -41 40 -91 119 283 -37 -3 -10 35 20 181 -132 -145 8 -138 -168 5 134
6401 134 -103 19 -138 90 346 -96 116 173 -33 -71 51 133 80 -146 -207 45 92 -182 91 117 40 -68 -165
6424 -165 -51 154 -158 133 139 10 14 -39 223 -116 -98 39 -159 220 -82 77 60 131 -240 -34 67 -81 83
6447 83 -156 517 -28 171 26 -64 224 -89 -107 -43 -252 324 56 -214 33 33 15 168 -30 130 -169 -36
6469 -36 61 -207 -87 82 -236 63 38 -168 -280 132 142 142 56 100 -4 3 -12 -111 -137 -161 75 -242 313 -433 35
6494 35 -104 102 37 91 -166 -90 -218 -126 82 252 326 -60 -55 130 122 246 -175 -155 115 180 -201 117 15 -34
$$ packed form
6327A7O6j71K0l2j34K20k6jM9r4J10r2J33J7q7P5k72J86k6J54KJ62m20J2M3K29
6353A40j18k09L91k4k29N4J42j85o2K1Pn2l5k6J51J20N0k35J56O3j38j16N5M4
6377c5K99l63J27K6K1j52L6Q1j31K10J64l20L4pM5j5J61l13j3J53j46l0J73J29
6401A34k37J22j57K28K56m42K12N7k06l8J22Q2n3k26o1K52M7k74K73K6p7j08r7
6424a65J14K05l12K91Oj29Mn3K62l39J8J37j98L79l02J59j7P1l71K06J01j48J64
6447H3k39O73n45J99j45r0K88l13j8O4k09N76k68k70K47%j8J53j98J60k99J33
6469c6R7k68J20J69l18K99k5k06j12M12J0%q6M4j04Pj5r9k6k4K36l17N55p46M68
6494C5j39K06o5N4k57P6j28R2K08J70P4l86NJ85qJ24m21K0K70O5l81L18j02m9
$$ plain form
6518 -34 -167 93 186 -270 211 -233 131 55 -137 1 21 246 313 -43 45 123 287 -325 -81 47 19 9 112
6541 112 -55 -71 -88 33 69 -457 160 264 186 16 64 -62 65 -160 -251 80 -240 3 130 218 -248 -55
6563 -55 -149 40 31 105 187 -41 78 65 -100 222 -149 39 -164 -34 -31 101 5 78 -105 -52 267 52 191 -52
6587 -52 -51 -147 -94 -187 69 56 92 19 -49 19 159 -129 -141 -207 94 139 107 -60 -18 -141 59 -106 116 -112 20
6612 20 -76 3 244 -58 -32 0 149 -150 31 154 188 157 78 190 -196 -8 22 -31 256 -100 -156 -18 -30 -84
6636 -84 -80 120 48 203 -66 32 29 -146 -44 -161 41 4 162 256 -289 138 -149 -38 -127 77 2 38 43 273 368
6661 368 -136 211 4 100 86 -12 28 -62 7 -73 -231 -15 275 -7 185 286 -36 -91 84 -84 83 60 105
6684 105 249 -214 2 -102 33 -62 31 190 122 182 131 -409 35 -34 222 223 100 -138 -41 -139 -117 -152 8 -204
$$ packed form
6518c4j33K60R3m56M81m44L64p6j92J38K0K25O7l56Q8P8J64o12K44J28k8j0J03
6541A12j67j6j7J21L6n26O17J04p8j70M8j26J27k25r1L31l20K43J27Q8m66J93
6563e5r4J89rP4Q2k28J19j3j65L22l71J88k03J30LJ32r6P3j83N3L19k15J39k43
6587e2Jr6N3r3K56j3L6p3o8O8J40k88j2o6L01M5l2j67M2j23K00j65K22k28J32
6612B0r6P9K41l02K6L2J49k99J81J23L4l1p9J12l86J88L0n3K87l56n6J38j2n4
6636h4MK00p2J55k69R8lj75J02j17K02l7J58R4n45M27k87J11q9K04p5L6NK30R5
6661C68n04L47k07R6j4r8M0r0O9q0j58K16K90k82J92J01l22n5J75j68J67k3M5
6684A05J44m63K16j04J35r5R3J59o8O0n1n40M44o9K56Jj23k38R7r8K2l5J60k12
$$ plain form
6708 -204 -87 53 164 -223 -184 319 338 242 -1 128 261 124 127 -79 116 -102 -96 -168 54 210 73 100 51
6731 51 98 175 -97 170 37 235 -194 96 195 -57 -59 8 -32 58 152 308 114 122 -213 -53 278 26 -32 -93 -138
6756 -138 -76 78 -52 -185 117 -26 -326 145 -86 -225 50 -266 147 119 -75 -6 286 89 287 -164 156
6777 156 21 21 -157 -16 192 34 -157 -276 -79 -323 100 -69 -211 240 116 61 38 266 -167 204 14
6798 14 61 298 -62 67 -59 -10 -156 -269 -282 -103 -44 -37 61 90 18 -72 -112 12 2 -53 -68 -151 276 93 -43
6823 -43 -45 249 -90 -47 100 -26 495 -138 167 -233 -80 -216 0 -148 -199 196 241 243 111 139 69 68 -111 114
6847 114 43 7 -206 304 71 -116 -90 -78 -214 116 -143 -253 50 159 167 -96 -12 -73 -78 17 9 -184 -184 -67 -126
6872 -126 226 52 114 -71 133 323 206 -75 -159 172 -201 -8 76 -7 137 -19 -48 96 197 -56 -74 -36
$$ packed form
6708b04J17J40J11l87L9N03J9r6k43J29J33j37Lk06J95k18Op2K22J56j37K7m9
6731E1M7P7k72K67j33J98m29K90R9k52kO7m0R0R4J56j94Ql35J60L31k52n8o1m5
6756a38O2J54j30j33L02j43l00M71k31j39K75l16M13k8j94O9K92j97J98m51L20
6777A56j35%j78J41K08j58j91j19J97k44M23j69j42M51j24n5k3K28m33L71j90
6798A4M7K37l60J29j26M9j46j13j3J79N9PR8K9p2r0m0J24j0n5j5q3M27j83j36
6823d3kK94l39M3J47j26N21o33L05m00J53j36K16j48n1L95M5Kj32K8p0jj79K25
6847A14p1l6k13N10k33j87K6J2j36L30k59j10L03J09Qk63Q4o1nR5qj93%J17n9
6872a26L52j74O2j85K04J90j17k81q4L31l73J93Q4q3J44j56k9J44J01k53j8L8
$$ plain form
6894 -36 29 -126 34 183 -82 173 462 -18 57 69 62 -32 193 -60 220 -17 6 -130 -367 -126 -31 208 80
6917 80 66 111 15 -44 36 -169 92 84 269 142 76 -47 -62 192 287 -110 64 -157 195 70 -62 -29 -18 11 64
6942 64 -200 -174 179 -7 214 -96 184 80 -98 4 -207 -25 -212 234 127 71 -86 35 251 -78 -61
6963 -61 -145 80 68 213 -129 202 69 -62 141 -111 83 -152 -203 70 25 96 81 -78 32 -58 213 -290 95
6986 95 98 35 109 -231 -142 -77 -227 -133 295 -207 -69 177 210 -93 -97 -231 -69 -200 91 -77 -52 -89 8 -140 -19
7011 -19 72 111 -241 71 8 123 85 90 289 11 15 49 107 82 336 91 -197 -53 -62 193 91 -79 -117 55 -193
7036 -193 197 49 -107 24 -306 126 14 -112 138 30 -23 57 61 205 62 139 -130 124 -33 -84 -86 -172 318
7059 318 -77 83 252 13 -114 -131 94 -45 -72 -79 -124 -353 -131 -134 70 41 -128 -180 277 47 39 -169 40 -150
$$ packed form
6894c6O5j55J60J49k65K55K89m80P5J2pr4K25k53K80k37K3j36k37K41R5K39j28
6917H0j4M5r6n9Q0k05K61qJ85j27o6j23j5K54R5l97J74k21L52j25j32L3J1K9N3
6942F4k64K6L53j86K21l10K80j04j78J02k11J82j87M46j07n6j57J21K16l29J7
6963f1q4K25j2J45l42L31j33j31K03k52J94k35n1K73m5P1j5j59J10r0K71n03L85
6986I5Lo3P4l40Q9O5j50R4M28n02J38K46L3l03mj34J62j31K91j68K5l7R7j48J21
7011a9R1L9l52L12o3J15l8NJ99k78ML4N8k5K54k45k88J44rK55j02j70l8J72k48
7036a93L90j48j56J31l30M32j12j26K50j08n3Q0MJ44j43P7k69K54j57n1kq6M90
7059C18l95J60J69k39j27j7K25j39k7pm5k29K22lK04k9j69n2M57k30qk08K09j90
$$ plain form
7083 -150 -343 -101 108 -118 -107 -19 23 -154 13 -414 146 77 163 -190 48 117 199 -115 100 9 96 -55 -241
7106 -241 -48 -162 79 210 -174 40 34 5 156 17 40 -56 204 25 31 142 -97 -178 211 -22 84 -196 -108
7129 -108 176 83 292 -225 22 140 26 -134 40 31 -140 -248 49 -80 64 -250 -125 -37 -251 -159 90 271
7151 271 145 -7 -210 272 42 -18 197 42 -56 42 -82 97 16 -76 71 -162 34 -72 30 -111 263 166
7173 166 -209 -247 114 -165 291 -170 -111 200 -135 5 -5 -148 -201 -41 219 23 203 -46 -287 219 52
7194 52 55 59 -147 -261 8 -51 254 66 119 -235 -46 -62 -19 35 -94 336 7 -382 11 223 157 395 255 -177
7218 -177 207 92 94 85 0 177 -303 -65 91 -57 279 -143 64 -110 -310 -14 -119 266 -51 -47 89 -205
7240 -205 -50 -55 -386 -81 -195 159 -199 -94 -7 -278 30 24 -23 -12 100 -78 165 -185 38 -93 -202 156
$$ packed form
7083a50j93K42K09k26J1Q8M2j77J67m27N60o9Q6l53K38O9Q2l14K15r1Q7j51j86
7106b41J93j14K41J31l84K14ok9J51j39K3r6K60j79OJ11k39q1L89k33J06k80Q8
7129a08K84r3K09n17K47J18j14j60J74rj71j08K97j29J44l14J25Q8k14R2K49J81
7151B71j26j52k03M82k30o0K15j55r8R8j24J79q1r2J47k33J96j06J02j41L74r7
7173A66l75l8L61k79M56m61N9L11l35J40j0j43n3J60K60j96J80k49k41N06j67
7194E2LMk06j14K69n9L05j88N3l54J89j6M3N4j29M30l29l89L93K12o6K38j40m32
7218a77L84j15Krq5J77m80K38J56j48L36m22K07j74k00K96j05L85l17MJ36k94
7240b05J55nl31L05j14L54l58J05Q7k71L08om7J1J12j78K43l50K23j31j09L58
$$ plain form
7262 156 -120 -201 -34 -43 -215 109 -4 16 -168 109 59 100 89 127 -128 165 1 -62 -142 12 -64 110 27 69
7286 69 -10 -12 110 -2 -110 -158 145 -94 125 174 -197 -43 18 87 184 41 241 -120 -105 53 -19 279 -162 -379
7310 -379 126 -9 26 85 -124 68 -227 -113 -68 34 173 193 -46 129 67 171 66 91 -144 -77 -53 -145 128
7333 128 -144 180 61 47 -16 -73 -224 -150 7 69 -69 -91 -74 211 -113 102 -38 -37 -149 -27 98 -279 -14
7356 -14 37 10 123 68 42 122 57 18 109 -6 129 64 -78 132 -26 -1 -63 23 -53 -1 109 -56 179 98 -173
7381 -173 -206 53 -31 -70 169 -160 -76 -95 120 222 66 104 102 152 -32 67 71 -98 -49 35 119 -145 -187 -68 -99 -105
7407 -105 -44 183 62 446 148 43 73 -122 -111 -1 -23 178 75 46 113 -126 -2 -101 131 -96 192 262 45
7430 45 84 -129 -109 -12 -66 -41 167 -7 38 -247 -38 5 186 187 220 -10 -413 166 -86 -147 -128 29 199 -115
$$ packed form
7262A56k76q1J67rj72L24j13K0j84K77n0M1j1L8k55K93j64o3q0J54p6J74q3M2
7286F9p9kJ22j12j08m8L03k39K19M9l71J54O1O9R7j43K00l61J5J58p2K98m41k17
7310c79N05j35L5N9k09J92k95J14M5J02J39K0k39J75o2J04j05K5k35O7K4r2K73
7333A28k72L24j19j4o3n7j51P4J57O2j38k2J7K85l24K15j40Jj12J22J25l77K65
7356a4N1k7J13n5k6Q0o5l9R1j15J35o5j42K10j58K5o2Q6p6N2J10j65K35q1k71
7381a73l3K59q4l9K39l29Q4j9K15J02j56L8kN0j84R9Mj69M9Q4Q4k64m2J19l1o
7407a05O1K27j21L84k98j05L0j95J1J10k2K01j03k9O7k39J24r9K32k27K88P0k17
7430D5L9k13K0R7n4K5K08j74M5k85K09M3J81JL3k30m03N79k52o1J9J57J70l14
$$ plain form
7454 -115 116 -219 -19 282 19 -3 7 99 8 -63 71 -34 -118 8 -29 248 -207 -129 -13 179 -49 62 126
7477 126 87 14 -245 144 -277 23 -67 19 -189 44 129 -60 -199 191 41 142 -83 -7 362 49 43 87 211
7500 211 -128 243 76 -106 43 -8 -171 -111 -107 -186 220 108 168 -81 110 -168 -99 -155 -250 -105 -200 -134 93 49
7524 49 186 -27 147 -15 -95 -44 29 27 -113 12 273 -180 -59 41 94 143 -182 -91 -57 312 -26 187 -288
7547 -288 -17 54 -8 117 -45 103 -304 -71 64 -101 74 41 -55 203 -44 23 -120 -190 69 -20 -238 -149 59
7570 59 17 -2 96 -108 -110 90 -254 -182 90 -11 -15 338 -18 211 -20 -3 -50 -278 -211 46 -32 -189 -39 -262
7594 -262 19 90 227 -32 120 143 96 -52 -24 145 -15 -4 155 -20 -62 -36 195 -62 -53 -5 172 -112 -196 -134
7618 -134 69 -12 -30 -63 -44 221 90 -189 52 -178 -16 -59 162 -68 135 -179 9 78 -325 46 177 145
$$ packed form
7454a15K31l35K00L01k63k2J0R2r1p1J34j05q4J26l7K77m55P8J16J92k28J11O4
7477A26l9p3k59L89m21L00r0Q6k08K33Q5j89j39L90j50J01k25P6L69l13oM4J24
7500B11l39L71j67j82J49n1j63O0Mp9M06j12O0k49J91k78O9n6r5J45r5O6K27m4
7524D9J37k13J74j62q0N1P3kj40J25K61m53J21J00N3M9l25R1L4L69l38K13m75
7547b88K71P1o2J25j62J48m07K33J35j65J75l3r6K58k47O7j43p0K59q9k18Q9K08
7570E9m2j9R8k04kK00l44P2K72j01mL53l56K29k31J7m7k28O7K57p8j57J50k23
7594b62K81P1J37k59J52K3m7j48K8J69j60J1J59j75m2K6K31k57RM8J77k84q4O2
7618a34K03q1j8l3J9K65j31k79K41k30J62m3K21k30K03l14J88O9m03L71J31l2
$$ plain form
7640 145 -193 -13 -39 -133 -107 161 -129 4 47 135 -43 40 59 213 -96 259 -1 -116 -126 -83 -79 -132 -72 20 240
7665 240 86 110 99 -34 237 -121 -30 -45 -233 19 109 146 153 -142 -20 -57 -58 170 181 -114 -32 95 86 47 -81
7690 -81 33 -89 13 -266 190 -79 -39 -328 -87 198 244 -83 -130 71 -104 8 -2 -27 -57 -44 30 -8 -313
7713 -313 26 311 -185 -242 37 47 194 145 229 -119 190 -411 132 19 119 117 252 9 -351 -119 -8 165
7735 165 138 -4 -98 55 111 -69 -310 242 50 -43 -118 -158 -434 -1 -184 -157 -202 -155 179 -169 -175 17 140 143
7759 143 -363 -16 206 -194 -86 -282 -42 141 -13 104 -93 176 -61 -31 -54 -131 11 -27 220 113 152 130
7781 130 -113 -251 160 -16 51 -265 378 -34 -123 -125 204 -11 -37 -28 13 28 -216 -222 -123 -37 -84 -23 -111 93 56 1
7807 1 -139 272 227 -29 122 12 211 -4 57 225 -73 -53 -28 2 -7 -79 65 -122 -14 18 51 29 26 19 24 -177
$$ packed form
7640A45l38J80k6r4K6K68k90J33M3Q8j78Q3J9J54l09L55k60j15j0M3Mn3O0R2K20
7665B40j54K4j1j33K71l58R1j5j88K52R0L7Pk95J22l7jK28J1k95Q2J27rl9j28
7690h1J14j22J02k79M56k69M0k89K41K85M6l27m7K01j75J12j0k5l0J3P4l8l05
7713c13L39K85m96n7K79J0J47m9Q4l48L09o01N43j13J00kJ35k43l60K32J11J73
7735A65k7j42r4J53N6j80k41N52j92r3p5m0k76M33j83K7m5M7L34l48oJ92J23L
7759A43n06L47K22m00J08j96K40J83j54J17j97K69k37L0k3p7J42l8K47j07L9k2
7781A30k43j38M11j76O7l16O43m12q9kL29k15k6RM1J5k44oR9Q6m7O1q8K04l7n5
7807Aj40M11m5k56J51j10J99k15O1J68k98K0K5L0rp2J44j87J08L2L3k2lpNk01
$$ plain form
7833 -177 -67 103 154 160 -61 123 92 -81 209 -123 -3 74 116 127 -43 -175 -221 -55 -19 -141 -88 130 50 27
7857 27 -286 38 -441 -17 -161 -173 19 160 192 -21 -119 133 -103 -51 58 181 46 135 -135 173 -265 -133
7879 -133 16 120 -49 104 195 48 5 -142 182 64 38 88 -137 -1 -2 74 39 260 163 173 -23 -154 63
7902 63 -148 152 58 -15 117 205 108 -52 -260 -24 -281 79 190 45 41 -120 18 45 -147 163 29 -7 -236
7925 -236 -33 58 -76 84 -189 -101 200 48 34 69 -126 -12 -157 40 -81 26 220 170 -265 -207 -10 -4 -84
7948 -84 -381 -235 -28 -16 26 -198 9 -187 -170 -104 159 -241 303 132 96 24 -114 -101 55 -59 -116 -233 342
7971 342 -27 21 29 58 -62 235 205 182 -143 66 100 -148 236 -179 163 -52 -189 193 147 -161 104 -159 46
7994 46 42 -94 79 182 -122 40 37 231 84 77 28 -28 -171 -186 -321 -40 34 233 323 26 128 -112 -61 81
$$ packed form
7833a77J10J70N1Ok21J84l1j73K90l32J20P7M2J1j70j32m6J66L6j22N3K18q0k3
7857B7l13L24m79M24j44j2J92J41L2k13r8K52k36N2J09J23j35Q9k70L08m38J32
7879a33J49J04j69J53R1j47m3j47L24j18k6N0k25J36jP6l5K21r7J0j96j31K17
7902F3k11L00r4p3J32Q8r7j60k08K36k57L60J11j45mj61J38K7j92L10j34l6k29
7925b36K03R1j34J60k73Q8L01j52j4L5j95J14j45J97j21J07J94n0m35N8J97Oq0
7948h4k97J46K07J2M2k24K07j96J7O6K63m00N44j71l6p2j38J3J56j14n7j17N75
7971C42l69M8QK9j20K97l0k3l25K09L4k48L84m15L42k15j37L82m6l08K65k63K05
7994D6mj36J73J03l04J62lJ94j47pm9n6j43j5j35K81P4J99R0k97J02k40N1J42
$$ plain form
8018 81 -19 -12 144 -208 -200 171 -151 31 267 -29 257 206 237 232 178 49 60 249 198 -100 -133 8 330 -242
8042 -242 49 -113 -117 -38 29 -142 -114 -116 -123 -199 -25 324 -17 -113 -173 60 68 -205 -132 -9 24 -76 148 -9 -207
8067 -207 -57 69 117 -125 41 299 5 173 -73 -353 -17 -250 -74 31 -172 88 -20 -208 -32 248
8087 248 52 42 -46 365 69 -336 243 -25 -172 31 -114 -20 71 179 12 -45 62 75 215 -61 3 -1 -181
8110 -181 -119 259 -22 116 18 17 44 79 -95 73 35 46 -203 78 -116 156 12 -72 -56 14 -69 39 1 181
8134 181 6 -172 -237 -112 -49 -168 147 -149 44 101 -64 74 -251 -2 107 -100 -109 -95 84 -251 102 4
8156 4 74 189 129 17 25 40 -138 191 -188 37 157 28 84 -129 167 3 17 49 261 -7 72 82 -196 -86
8180 -86 174 -50 -276 20 -181 134 139 206 218 -197 50
$$ packed form
8018H1j00PJ56l52QL71l22J82K36k96K86n1L1nn4j29J1J89n1k98l3J41L22n72
8042b42K91j62mP9O7j71K8kpp6J74L49l41r6o0K33Qk73P3J23L3j00K24j57j98
8067b07J50J26M8k42J66K58k94J68k46k80L36k33J76J05k03K60j08j88J76K80
8087B48j96j0q8M11k96m05N79k68j47K03j45R4R1J08j67n7J07J3J40k76O4mj80
8110a81O2L78k81J38r8jK7L5j74J68l8J1k49K81j94K72j44q4J6P0q3J08l8J80
8134A81j75j78o5J25O3j19L15k96J93N7j65J38l25K49J09k07rJ4J79l35L53r8
8156DP0J15o0j12QJ5j78L29l79K25J20j29N6k13K96j64J4L2K12k68P9J0k78J10
8180h6K60k24k26K96k01L15NO7J2m15K47
8191E0
$$ Imaginary data points
##PAGE= N=2
##DATA TABLE= (X++(I..I)), XYDATA
$$ plain form
0 0 0 0 0 0 0 0 0 0 0 -8 8 -13 16 -16 24 -24 38 -40 52 -64 72 -93 104 -128 152 -173 205 -232 269 -310 352
31 352 -405 456 -517 589 -660 741 -828 926 -1035 1149 -1281 1417 -1570 1738 -1918 2119
47 2119 -2335 2573 -2837 3122 -3442 3792 -4189 4627 -5121 5690 -6336 7093 -7985 9056
61 9056 -10375 12035 -14213 17200 -21572 28627 -41922 76040 -366054 -632038 -49222 267796
73 267796 570852 606006 477666 104021 -260928 -556149 -598318 -446737 -102361 286217
83 286217 610862 675742 518071 203849 -155860 -488559 -620413 -512207 -212622 135001
93 135001 427401 550778 468861 183014 -188727 -490286 -598598 -506628 -242073 111627
103 111627 426715 572457 508755 267758 -52763 -336765 -480428 -442525 -237018 65412
$$ packed form
0@%%%%%%%%%qJ6k1K9l2M0m8O2p8R2j16J36j65J97k32K80l25L78m37N01n79O62
31C52p57Q61r73J106j249J401j569J754j961K184k430K698k987L308l656M037
47B119m454M908n410N959o564P234p981Q816r748J0811j2026J3429j5078J7041
61I056j9431K2410k6248L1413l8772N0199p0549J17962m42094k65984N82816L17018
73B67796L03056L5154j28340l73645l64949k95221m2169J51581L44376L88578
83B86217L24645O4880j57671l14222l59709l32699j31854J08206K99585L47623
93A35001K92400J23377q1917k85847l71741l01559j08312R1970K64555L53700
103A11627L15088J45742o3702k40997l20521k84002j43663L7903K05507L02430
$$ plain form
113 65412 355531 518053 483419 262744 -51593 -338505 -500694 -490719 -315342 -35843 247956
124 247956 434524 453333 291417 13278 -262985 -428858 -433663 -281584 -23354 249933
134 249933 436315 466036 331101 86593 -178858 -376623 -432988 -320645 -89052 163840
144 163840 347588 398122 294193 77868 -167991 -356541 -419353 -333151 -130194 118041
154 118041 322539 403010 334086 150316 -81153 -279246 -364430 -305561 -131084 91728 281207
165 281207 366481 319738 159349 -61148 -260645 -363966 -336181 -188386 24949 220989
175 220989 324507 304595 172445 -22309 -206952 -314486 -305563 -182139 11256 201016
185 201016 317925 320780 208417 24366 -162711 -284090 -298414 -202913 -34437 143215 264120
$$ packed form
113F5412K90119J62522l4634k20675l14337k86912j62189R975J75377K79499K83799
124B47956J86568J8809j61916k78139k76263j65873m805J52079K58230K73287
134B49933J86382K9721j34935k44508k65451j97765n6365J12343K31593K52892
144A63840J83748N0534j03929k16325k45859j88550o2812Q6202K02957K48235
154A18041K04498Q0471o8924j83770k31469j98093q5184N8869J74477K22812J89479
165B81207Q5274m6743j60389k20497j99497j03321K7785J47795K13335J96040
175B20989J03518j9912j32150j94754j84643j07534Q923J23424J93395J89760
185B01016J16909K855j12363j84051j87077j21379j4324R5501J68476J77652J20905
$$ plain form
196 264120 283100 195479 33539 -143139 -268175 -296187 -217122 -60500 115469 245071 283679
207 283679 220239 78626 -88148 -216522 -261078 -206088 -72516 88710 216253 264343 214424
218 214424 85273 -72324 -201847 -259477 -224093 -107669 43344 174058 237943 210332 103677
229 103677 -39586 -167576 -232636 -208462 -108209 30228 159443 231996 218606 126297 -7888
240 -7888 -135768 -211289 -206599 -126450 -1666 122363 198439 198298 125300 5086 -119503 -199820
252 -199820 -205447 -137636 -23730 97635 182743 198822 142259 34897 -82842 -165677 -185178
263 -185178 -134625 -33018 81983 165498 187572 142499 46433 -67410 -155841 -186252 -149583
274 -149583 -60305 48074 135203 169631 140426 58305 -44916 -129986 -166428 -142044 -63427
$$ packed form
196B64120J8980q7621j61940j76678j25036k8012P9065J56622J75969J29602L8608
207B83679o3440j41613j66774j28374m4556N4990J33572J61226J27543M8090m9919
218B14424j29151j57597j29523n7630L5384J16424J51013J30714O3885k7611j06655
229A03677j43263j27990o5060K4174J00253J38437J29215P2553j3390r2309j34185
240g888j27880p5521M690Q0149J24784J24029P6076j41p2998j20214j24589q0317
252a99820n627O7811J13906J21365Q5108J6079n6563j07362j17739q2835j9501
263a85178N0553J01607J15001Q3515K2074m5073r6066j13843q8431l0411L6669
274a49583Q9278J08379Q7129L4428k9205q2121j03221q5070l6442K4384P8617
$$ plain form
285 -63427 39990 127744 168577 148571 76283 -21125 -108237 -154941 -143458 -78010 14468 99388
297 99388 146013 136810 75361 -13079 -96743 -145803 -142379 -87301 -715 84858 138374 138816 89704
310 89704 10541 -71029 -125458 -131669 -87351 -10116 69933 124044 132404 92498 19309 -61421
322 -61421 -118463 -131553 -97082 -29102 47535 105197 122487 93516 30257 -44495 -101918 -120803
334 -120803 -94370 -33000 39547 97114 120015 100572 45081 -27749 -88135 -113201 -95650 -44404
346 -44404 21227 79127 107613 95497 46102 -20628 -78645 -107516 -97161 -52361 10492 68468
358 68468 100917 96392 56555 -4268 -62364 -94780 -90788 -53774 2346 58094 93642 94132 59310
371 59310 3189 -52737 -87943 -91635 -62627 -11081 44533 81724 87073 59776 10301 -42284
$$ packed form
285f3427J03417Q7754M0833k0006p2288r7408q7112m6704J1483O5448R2478Q4920
297I9388M6625r203o1449q8440q3664m9060L424N5078Q6586Q5573N3516M42m9112
310H9704p9163q1570n4429o211M4318P7235Q0049N4111Q360l9906p3189q0730
322f1421n7042j3090L4471O7980P6637N7662J7290k8971o3259p4752n7423j8885
334a20803K6433O1370P2547N7567K2901j9443n5491p2830o0386k5066J7551N1246
346d4404O5631N7900K8486j2116m9395o6730n8017k8871J0355M4800O2853N7976
358F8468L2449m525l9837o0823n8096l2416L992L7014N6120N5748L5548M90l4822
371E9310n6121n5926l5206l692K9008N1546N5614L7191N349k7297m9475n2585
$$ plain form
383 -42284 -78678 -86015 -62454 -15754 37198 76352 87288 66608 22035 -28770 -67460 -80819
395 -80819 -64039 -23395 25973 64701 78024 62401 23708 -23851 -63053 -79549 -67795 -30475
407 -30475 17167 56784 74972 65319 32583 -11010 -49226 -69327 -62909 -31804 11398 49505
419 49505 69872 64483 35118 -5938 -45125 -67976 -65793 -39544 50 38255 61593 61271 38110
432 38110 1135 -36027 -59912 -60859 -38946 -2985 34528 59033 62168 42691 8558 -27921 -53872
445 -53872 -58804 -42286 -10349 24966 50418 56067 41170 10825 -24088 -50043 -58141 -44763 -15444
458 -15444 18903 45599 54753 44496 17887 -14752 -41019 -51236 -42053 -16330 15397 40972
470 40972 51981 44184 19603 -11805 -38149 -51117 -45441 -23171 6143 32200 45751 42312 22424
$$ packed form
383d2284l6394p337K3561M6700N2952L9154J0936k0680m4573n0805l8690j3359
395h0819J6780M0644M9368L8728J3323j5623l8693m7559l9202j6496J1754L7320
407c0475M7642L9617J8188r653l2736m3593l8216k0101O418L1105M3202L8107
419D9505K0367n389k9365m1056l9187k2851K183K6249L9594L8205K3338l22k3161
432C8110l6975l7162k3885r47K1913L5961L7513K4505L135j9477l4133l6479k5951
445e3872m932J6518L1937L5315K5452N649j4897l0345l4913k5955q098J3378K9319
458a5444L4347K6696R154j0257k6609l2639k6267j0217R183K5723L1727K5575
470D0972J1009p797k4581l1408k6344j2968N676K2270K9314K6057J3551l439j9888
$$ plain form
483 22424 -6080 -31563 -45472 -42263 -22591 4743 30472 45649 44477 26975 518 -24865
495 -24865 -41524 -42056 -26377 -1745 22692 38922 40224 25876 1899 -23057 -39691 -41366 -28711
508 -28711 -6087 18393 36422 40106 28956 7850 -15493 -32849 -37295 -27270 -7225 15844
520 15844 33620 38394 29721 10157 -13390 -30988 -37558 -30776 -13287 9052 27362 34296 28720
533 28720 11466 -9171 -26728 -34291 -28620 -12898 8067 25896 34708 30950 16268 -3588 -21768
546 -21768 -31476 -29215 -15987 2972 20305 29667 28164 16020 -3079 -20719 -30456 -29349 -17886
559 -17886 -74 17486 28307 28822 18431 2046 -14972 -25855 -27610 -17835 -1361 14757 25758
572 25758 27830 19139 3563 -13067 -24511 -27476 -19823 -5250 10778 22672 25844 18803 5211
$$ packed form
483B2424k8504k5483j3909L209J9672K7334K5729J5177j172j7502k6457k5383
495b4865j6659n32J5679K4632K4437J6230J302j4348k3977k4956j6634j675J2655
508b8711K2624K4480J8029L684j1150k1106k3343j7356m446J0025K0045K3069
520A5844J7776M774q673j9564k3547j7598o570O782J7489K2339J8310O934n576
533B8720j7254k0637j7557p563N671J5722K0965J7829Q812l758j4682j9856j8180
546b1768r708K261J3228J8959J7333R362j503j2144j9099j7640r737J107J1463
559a7886J7812J7560J0821N15j0391j6385j7018j0883j755R775J6474J6118J1001
572B5758K072q691j5576j6630j1444k965P653J4573J6028J1894L172p041j3592
$$ plain form
585 5211 -10036 -22169 -25957 -19608 -6417 8459 20707 25396 20492 8215 -6365 -18419 -23847
598 -23847 -19625 -8444 6006 18281 23652 19564 8967 -5290 -17668 -23350 -20606 -10758 2838
611 2838 15360 21702 19928 10717 -2110 -14180 -20108 -19148 -11077 1658 13651 20561 19869 11904
625 11904 -212 -12207 -19569 -19523 -12453 -759 10448 18134 18706 12814 1267 -9704 -17322 -18919
639 -18919 -13549 -2358 8631 16636 18796 13114 2684 -7847 -15696 -18193 -13682 -3791 6628 14895
653 14895 18047 13834 5078 -5863 -13749 -17375 -13764 -5200 4534 12984 16737 13484 6049 -3804 -12584
668 -12584 -16477 -13993 -6906 2950 11570 15760 13487 7014 -2030 -10736 -15020 -13371 -7256 1554 10286
683 10286 14607 13525 8062 -564 -9279 -13847 -13417 -8394 -381 8247 13415 13069 8320 421 -7921
$$ packed form
585E211j5247j2133l788O349J3191J4876J2248M689m904j2277j4580j2054n428
598b3847M222J1181J4450J2275N371m088j0597j4257j2378n682K744R848J3596
611B838J2522O342j774r211j2827j2070n928R60Q071J2735J1993O910o92p965
625A1904j2116j1995p362M6P070J1694J1207P686N72n892j1547j0971p618j597
639a8919N370J1191J0989Q005K160n682j0430j0531p849k497M511R891J0419Q267
653A4895L152m213q756j0941p886l626L611Q564R734Q450L753l253p435r853q780
668a2584l893K484P087R856Q620M190k273o473r044q706m284J649O115Q810Q732
683A0286M321j082n463q626q715m568M30N023Q013Q628N168l46m749p899q342
$$ plain form
698 -7921 -12875 -13464 -8932 -1046 7293 12131 13351 9320 1903 -5912 -10966 -12322 -9223 -2302 5407
713 5407 10912 12105 9263 2252 -4914 -10687 -12908 -10058 -3307 3695 9234 11696 10121 4258 -2842
728 -2842 -8739 -11398 -9508 -3951 2961 8508 11417 9989 4564 -2040 -7738 -11524 -10027 -5188 912
743 912 6866 10203 9407 5193 -782 -6789 -9974 -9506 -5206 168 6247 9925 9709 6106 435 -5240
759 -5240 -9277 -9092 -6216 -874 4987 8843 9034 6647 767 -4602 -8703 -9206 -6656 -1812 3870 7592
775 7592 8943 6712 1834 -3312 -7210 -8261 -6401 -2217 3285 7686 8726 7016 2732 -2553 -6664
790 -6664 -8278 -7291 -3494 1782 5983 7840 6618 2873 -1866 -5707 -7590 -6841 -3116 1549 5784 7872
806 7872 7188 3781 -431 -4661 -7090 -6908 -3819 253 4265 7146 6150 3752 -203 -3914 -6995 -6920
$$ packed form
698g921m954n89M532P886Q339M838J220m031p417p815n054j356L099O921P709
713E407N505J193k842p011p166n773k221K850O751P002N539K462j575n863p100
728b842n897k659J890N557O912N547K909j428n425o604n698l786J497M839O100
743I12N954L337p96m214n975o007l185M68M300N374O079L678k16l603n671n675
759e240m037J85K876N342N861L856J91k387n880n369m101n03K550M844N682L722
775G592J351k231m878n146l898j051J860M184N502M401J040j710m284n285m111
790f664j614R87L797N276M201J857j222l745m739l841j883P49L725M665M235K088
806G872o84l407m212m230k429J82L089M072M012K881r96k398l955l711l081P5
$$ plain form
822 -6920 -4333 -362 3915 6600 6628 4547 944 -3068 -5858 -6074 -4280 -953 3257 5875 6588 4830
838 4830 1269 -2679 -5779 -6644 -4853 -1918 1932 4828 5685 4848 1726 -2120 -4906 -5994 -4856 -1839
854 -1839 1689 4885 6214 5445 2470 -968 -4336 -5657 -5187 -2434 1008 3580 5103 4390 2415 -1042
870 -1042 -3807 -5357 -4973 -2699 364 3417 4935 5083 3382 384 -2774 -4775 -4564 -3055 -114 3057
886 3057 4540 5028 3161 310 -2720 -4646 -4809 -3439 -997 1979 3932 4613 3251 752 -2004 -4152
902 -4152 -4377 -3353 -1246 2186 3598 4924 4017 1591 -978 -3159 -4378 -3529 -1559 1050 3160 4065
918 4065 3249 1449 -1250 -3492 -4280 -3790 -1742 574 2783 4044 3675 2218 -209 -2269 -3476 -3368
934 -3368 -2010 310 2540 3756 3724 2115 -307 -2258 -3836 -3711 -2597 -479 2086 3331 3417 2111
$$ packed form
822f920K587L971M277K685K8k081l603m012k790k16J794L327M210K618P13j758
838D830l561l948l100q65J791K935L850K896Q57q37l122l846k786j088J138L017
854a839L528L196J329p69k975l438l368j321M70K753L442K572J523p13j975l457
870a042k765j550L84K274L063L053J518J48j701k998l158k001K11J509K941L171
886C057J483M88j867k851l030j926j63J370K442K976J953O81j362k499k756k148
902d152k25J024K107L432J412J326r07k426k569k181j219Q49J970K609K110R05
918D065q16j800k699k242p88M90K048K316K209J261l69j457k427k060j207J08
934c368J358K320K230J216l2j609k422j951j578J25J114K118K565J245Q6j306
$$ plain form
950 2111 412 -1694 -3048 -3050 -2449 -248 1802 3241 3316 2481 742 -974 -2732 -3482 -2810 -794 1143
967 1143 2549 2971 2409 896 -1062 -2646 -3210 -2602 -1035 677 2444 3178 2482 1299 -440 -2076 -2691
984 -2691 -2227 -1206 601 2292 2879 2390 1288 -517 -1977 -2679 -2789 -1343 -141 1169 2633 2446 1552
1001 1552 -163 -1490 -2267 -2528 -1384 -21 1419 2438 2577 1840 320 -1086 -2314 -2440 -1785 -214
1017 -214 820 2295 2463 1805 454 -1187 -2349 -2495 -2000 -671 781 1919 2271 1798 757 -752 -1891
1034 -1891 -2412 -1805 -508 688 1984 2238 1887 978 -443 -1445 -2177 -1641 -1014 24 1536 1994 1724
1051 1724 1197 -285 -1543 -2192 -1918 -999 283 1285 1693 2141 1178 138 -656 -1863 -1811 -1305 -235 965
1069 965 1245 1765 1027 27 -1001 -1914 -1908 -1340 -196 656 1500 1783 1204 424 -423 -1108 -1506 -1188 -492 493
$$ packed form
950B111j699k106j354kO01K201K050J439P5q35j739j716j758p50O72K016J937
967A143J406M22n62j513j958j584n64O08J567J712J767P34o96j183j739j636o15
984b691M64J021J807J691N87m89j102j805j460p02j10J446J202J310J464j87q94
1001A552j715j327p77k61J144J363J440J019J39p37j520j406j228j26O55J571
1017b14J034J475J68o58j351j641j162j46M95J329J452J138L52m73j041j509j139
1034a891n21O07J297J196J296K54l51r09j421j002p32N36O27J038J512M58k70
1051A724n27j482j258o49K74R19J282J002M08M48r63j040p94j207N2N06J070J200
1069I65K80N20p38j000j028r13ON68J144Q52Q44K83n79p80q47o85l98L18O96R85
$$ plain form
1089 493 1394 1504 1159 296 -238 -1378 -1520 -1529 -832 254 1117 1469 1495 485 -413 -1070 -1574 -1462 -702 238
1109 238 1187 1616 1202 877 58 -550 -1484 -1501 -737 45 745 1287 1283 798 -11 -847 -1373 -1425 -829 55 531
1130 531 1345 1291 1280 157 -846 -872 -918 -809 -352 414 1114 1247 1056 420 -386 -1319 -1186 -1092 -429 217 794
1151 794 1061 963 448 -434 -858 -979 -724 -672 119 867 1029 945 319 -15 -619 -1097 -984 -340 76 724 1207
1172 1207 1158 666 -139 -543 -1134 -1190 -872 -40 398 997 1078 268 283 -590 -956 -890 -653 -132 568 882 836 766
1194 766 165 -546 -878 -905 -709 -410 383 769 840 981 326 -489 -719 -746 -615 -125 505 698 961 969 179 -381
1216 -381 -454 -1076 -898 -244 -73 538 1042 725 138 -275 -540 -824 -689 -358 -206 419 994 569 249 164 -456
1237 -456 -804 -529 -252 49 743 693 765 450 290 -347 -958 -671 -534 -186 426 915 445 349 320 -332 -477
$$ packed form
1089D93R01J10l45q63n34j140j42rO97J086Q63L52K6j010q98o57n04J12P60R40
1109B38R49M29m14l25q19o08r34j7P64P82P00N42mm85q09q36n26n2N96Q84M76
1130E31Q14n4j1j123j003k6m6J09M57P66P00J33j91o36q06r33J33R4O63O46N77
1151G94K67r8n15q82m24j21K55N2P91P48J62q4o26l34o04m78J13O44M16O48M83
1172A207m9m92q05m04n91n6L18Q32M38N99Q1q10J5q73l66O6K37N21P00L14m6p0
1194G66o01p11l32k7J96K99P93L86P1J41o55q15k30k7J31M90O30J93K63Qp90n60
1216c81p3o22J78O54J71O11N04l17n87m13k65k84J35L31J52O25N75m25l20q5o20
1237d56l48K75K77L01O94n0P2l15j60o37o11K87J37L48O12M89m70r6k9o52j45
$$ plain form
1258 -477 -529 -258 -19 188 810 574 741 258 -204 -513 -649 -474 -40 91 443 402 328 146 -74 -558 -631
1279 -631 -429 -70 -192 388 490 540 402 -29 -384 -680 -424 -559 126 362 657 745 217 -41 -403 -520 -604
1300 -604 -225 86 412 283 206 90 151 -547 -867 -198 -252 13 217 540 608 344 44 -28 -398 -401 -198 -113 40
1323 40 307 715 352 -98 -362 -546 -487 -349 -146 22 467 468 360 386 60 -327 -254 -686 -76 -92 451 520 493
1346 493 104 -195 -306 -359 -305 -353 81 215 434 333 236 -23 -242 -388 -240 -248 236 592 265 517 162 -240
1368 -240 -162 -300 -358 -406 -118 56 30 330 107 257 -339 -280 -202 -311 -207 127 -85 534 24 148 -36 -331
1390 -331 -548 -191 -187 -14 447 144 238 -88 -264 -266 -283 -389 -75 -119 107 254 17 291 -108 -362 -244 -186 -159
1413 -159 28 348 348 513 205 -39 -274 -147 -266 6 152 92 212 344 230 -180 -135 -344 -402 -42 -136 -258
$$ packed form
1258d77n2K71K39K07O22k36J67m83m62l09j36J75M34J31L52m1p4j82k20m84p3
1279f31K02L59j22N80J02N0j38m31l55k96K56j35O85K36K95Q8n28k58l62j17q4
1300f04L79L11L26j29p7j16O1o98l20O69n4K65K04L23O8k64l00p2l70lK03Q5J53
1323D0K67M08l63m50k64j84N9J38K03J68M45Jj08K6l26l87P3m32O10j6N43O9k7
1346D93l89k99j11n3N4m8M34J34K19j01r7k59k19j46J48qM84L56l27K52l55m02
1368b40P8j38n8m8K88J74k6L00k23J50n96N9P8j09J04L34k12O19n10J24j84k95
1390c31k17L57MJ73M61l03R4l26j76kj7j06L14m4K26J47k37K74l99k54J18N8K7
1413a59J87L20%J65l08k44k35J27j19K72J46o0J20J32j14m10M5k09n8L60r4j22
$$ plain form
1435 -258 158 363 83 215 -153 -440 -345 -201 -165 252 587 192 19 163 49 -269 -284 -252 -119 -68 302 304
1457 304 -73 -77 -387 -242 -183 -225 168 -110 374 86 39 172 -21 -6 -180 -216 -342 36 -65 179 321 155
1479 155 -122 119 -5 -315 -348 -34 76 298 331 167 26 -10 -99 -270 -127 -67 129 92 376 294 100 -49
1501 -49 -229 -115 -483 -187 -1 276 413 90 -9 -212 -89 -289 -262 -124 -23 88 232 334 161 47 -201
1522 -201 -178 -23 -279 -140 312 40 234 302 -54 -5 -438 -134 139 193 118 204 -19 310 -38 -300 -62 -219
1544 -219 -194 -19 -17 438 169 164 21 -395 -169 -404 -185 40 221 -86 128 183 29 14 -390 -306 249 -264 -67
1567 -67 270 625 154 -99 -17 15 -223 -500 92 -119 113 60 304 232 182 -293 -338 -369 35 44 44 290 257 40
1591 40 195 -239 -139 -287 -56 49 248 226 -19 -184 -88 -323 197 -142 -112 -110 16 339 -187 136 -292 -5
$$ packed form
1435b58M16K05k80J32l68k87R5J44L6M17L35l95j73J44j14l18j5L2J33N1L70K
1457C04l77ml10J45N9m2L93k78M84k88m7J33j93J5j74l6j26L78j01K44J42j66
1479A55k77K41j24l10l3L14J10K22L3j64j41l6q9j71J43O0J96l7K84q2j94j49
1501d9j80J14l68K96J86K77J37l23r9k03J23k00K7J38J01J11J44J02j73j14k48
1522b01K3J55k56J39M52k72J94O8l56M9m33L04K73N4p5Q6k23L29l48k62K38j57
1544b19K5J75KM55k69nj43m16K26k35K19K25J81l07K14N5j54j5m04Q4N55n13J97
1567f7L37L55m71k53Q2L2k38k77N92k11K32n3K44p2n0m75m5l1M04R%K46l3k17
1591D0J55m34J00j48K31J05J99k2k45j65R6k35N20l39L0KJ26L23n26L23m28K87
$$ plain form
1613 -5 -109 53 185 208 196 39 114 -160 84 128 -223 -141 148 93 -109 71 -123 -82 14 111 165 144 -159 189
1637 189 202 76 -91 133 -129 46 63 -94 185 58 -59 -54 -73 58 -17 -230 -117 -132 -93 -91 29 182 87 159
1661 159 -46 -227 -53 -256 -32 -6 40 160 -88 20 61 65 193 -25 -107 258 21 -144 15 22 -114 138 -236
1684 -236 -229 -17 -169 -84 107 19 71 -82 -193 149 -255 -96 -19 111 48 -8 -252 -30 -89 -30 32 -17 -1 -199
1708 -199 -92 299 276 -81 -260 151 -62 238 267 -33 -114 70 -20 70 169 135 -197 -272 -119 -132 -61 164 123 56
1732 56 64 20 -175 127 -54 -288 -61 23 -123 377 228 96 -145 -152 -142 161 142 -104 453 111 107 -252 64 183
1756 183 -80 -28 -143 -32 263 132 146 54 -2 -12 -87 -234 -35 16 29 187 -22 -44 -104 -240 118 -185 -98 182
1780 182 73 9 401 126 70 -92 -175 -147 113 202 119 -137 45 198 21 354 43 -103 -443 32 -7 242
$$ packed form
1613ej04J62J32K3j2j57P5k74K44M4l51Q2K89n5k02J80j94M1R6R7N4k1l03L48
1637A89J3j26j67K24k62J75J7j57K79j27j17Nj9J31p5k13J13j5L9KJ20J53r5P2
1661A59k05j81J74k03K24K6M6J20k48J08M1MJ28k18q2L65k37j65J59Pj36K52l74
1684b36PK12j52Q5J91q8N2j53j11L42m04J59P7J30o3n6k44K22n9N9O2m9J6j98
1708a99J07L91k3l57j79M11k13L00K9l00q1J84r0R0R9l4l32p5J53j3P1K25m1o7
1732E6Qm4j95L02j81k34K27Q4j46N00j49j32k41pJ0L03j9k46N57l42ml59L16J19
1756A83k63N2j15J11K95j31J4r2n6j0p5j47J99N1J3J58k09k2o0j36L58l03Q7K80
1780A82j09o4L92k75n6j62q3K8K60Q9q3k56J82J53j77L33l11j46l40M75l9K49
$$ plain form
1802 242 73 -161 194 41 -10 -139 18 85 321 344 106 -98 208 89 172 -184 -56 29 -59 -24 97 -57
1824 -57 -135 -33 -44 -16 118 4 -74 170 25 354 -8 -64 115 -69 -23 27 -42 46 -21 -57 195 301 233 -5
1848 -5 -144 8 73 60 150 165 -130 158 -93 -83 -169 -168 -9 1 173 71 27 59 -129 58 -55 -306 20 85 114
1873 114 -28 -73 70 113 -133 453 -25 -223 -121 104 -21 16 -209 55 85 -102 195 -79 -33 144 -6 -207
1895 -207 13 118 44 -135 -7 136 65 -16 -43 125 303 -58 -158 66 -53 -74 261 367 -225 5 166 130
1917 130 -12 4 -227 80 121 -224 -113 -92 -138 143 -153 121 110 10 -81 -110 -103 82 35 -76 -236 -244 -177 144
1941 144 -40 131 -154 -1 89 93 173 -263 -38 -103 102 -324 -378 43 -44 -32 -218 98 -220 237 -125 -84 181
1964 181 38 -48 255 39 216 154 169 90 -46 53 153 -128 50 27 -90 -329 -16 -33 -290 -118 -15 -155
$$ packed form
1802B42j69k34L55j53n1j29J57O7K36K3k38k04L06j19Q3l56J28Q5q8L5J21j54
1824e7p8J02j1K8J34j14p8K44j45L29l62n6J79j84M6N0o9Q8o7l6K52J06o8k38
1848ej39J52O5j3R0J5k95K88k51J0q6JJ59J0J72j02m4L2j88J87j13k51L26O5K9
1873A14j42m5J43M3k46N86m78j98J02K25j25L7k25K64L0j87K97k74M6J77j50k01
1895b07K20J05p4j79J28J43p1q1k7J68J78l61j00K24j19k1L35J06n92K30J61l6
1917A30j42J6k31L07M1l45J11K1m6K81k96K74j1j00r1k9PJ85m7j11j60qO7L21
1941A44j84J71k85J53R0MQ0m36K25o5K05m26n4M21q7J2j86L16l18M57l62M1K65
1964A81j43q6L03k16J77o2J5p9j36R9J00k81J78k3j17k39L13j7k57J72J03j40
$$ plain form
1986 -155 -177 25 -84 -10 -23 82 158 145 -9 62 219 139 81 -65 -94 7 127 79 13 -25 118 12 83 -251
2010 -251 -142 -57 95 45 -100 -282 64 -135 -2 -111 265 89 11 30 -74 -143 232 -23 235 165 -147 -146 246
2033 246 193 -150 106 235 196 215 -143 135 -239 -86 85 168 -108 -45 -6 177 165 -33 84 -91 127 -51
2055 -51 83 -270 -26 -216 -276 -163 -26 4 13 -131 -223 -62 111 297 348 -263 104 109 -35 -169 -6 -159 -113
2078 -113 93 169 -236 103 155 -202 119 -226 84 -13 25 -283 241 363 3 127 161 -68 121 -134 -36 11
2100 11 -96 -129 -90 -77 25 -6 -145 -87 -41 298 377 -177 30 -77 -109 161 5 236 -185 -78 -7 -250 -69
2123 -69 -130 98 135 273 283 -76 124 176 58 -9 -80 168 -29 -268 195 -81 200 -35 -84 -265 58 -29 68
2146 68 -93 222 -17 172 75 -68 178 -23 -176 186 -17 -14 -236 123 212 -41 157 -300 83 -312 149 132
$$ packed form
1986a55k2K02j09P4j3J05P6j3j54P1J57q0n8j46k9J01J20m8o6l8J43j06P1l34
2010b51J09Q5J52n0j45j82L46j99J33j09L76j76p8J9j04o9L75k55K58p0l12JL92
2033B46n3l43K56J29l9J9l58K78l74J53J71Q3k76O3L9J83j2j98J17j75K18j78
2055e1J34l53K44j90o0J13J37L0Rj44r2J61J73J86N1o11L67Nj44j34J63j53M6
2078a13K06P6m05L39N2l57L21l45L10r7L8l08N24J22l60J24L4k29J89k55R8M7
2100A1j07l3L9J3J02l1j39N8M6L39P9n54K07j07l2K70j56K31m21J07P1k43J81
2123f9o1K28L7J38J0l59K00N2j18o7p1K48j97k39M63k76K81k35m9j81L23q7R7
2146F8j61L15k39J89r7j43K46k01j53L62k03Lk22L59Q9k53J98m57L83l95M61j7
$$ plain form
2168 132 -22 -81 -236 89 -91 18 -50 9 -91 104 42 201 -216 -29 18 47 -105 173 -7 -40 -43 32 28 87
2192 87 -70 19 54 25 126 154 197 89 44 -38 125 30 -111 -209 243 -111 97 -109 58 -63 111 -128 166
2215 166 202 198 -169 -1 37 131 99 -375 53 -195 45 124 -143 19 -5 121 -89 17 -16 109 -124 40 160
2238 160 250 291 180 117 -49 202 85 -222 -110 -219 -83 -173 -174 -264 39 84 163 85 205 88 67 13 99 59 106
2263 106 -136 181 -177 -91 267 -73 118 -44 -55 151 33 -255 -176 -190 141 -260 70 3 140 -57 -11 269
2285 269 -103 254 51 -17 22 73 -248 240 13 1 217 24 -164 -42 -62 -65 -265 -83 -81 207 -38 -105 -130 49
2309 49 46 261 -57 -235 -13 65 82 41 290 10 30 -91 177 -112 -143 -156 12 58 -75 37 -162 43 -320
2332 -320 202 -54 201 -23 -148 308 -50 -117 -262 257 -240 109 -72 343 83 -153 163 -204 -21 34 -3
$$ packed form
2168A32j54n9j55L25j80J09o8N9j00J95o2J59m17J87M7K9j52K78j80l3lP5mN9
2192H7j57Q9L5k9J01K8M3j08m5q2J63r5j41r8M52l54K08k06J67j21J74k39K94
2215A66L6ml67J68L8R4l2m74M28k48K40P9k67J62k4J26k10J06l3J25k33J64J20
2238A60R0M1j11o3j66K51j17l07J12j09J36r0jr0L03M5P9p8J20j17k1n4Q6m0M7
2263A06k42L17l58Q6L58l40J91j62j1K06j18k88P9j4L31m01L30o7J37j97M6K80
2285B69l72L57k03o8L9N1l21M88k27j2K16j93j88J22k0lk00J82KK88k45o7k5J79
2309D9lK15l18j78K22P8J7m1K49k80K0j21K68k89l1j3J68M6j33J12j99K05l63
2332c20N22k56K55k24j25M56l58o7j45N19m97L49j81M15k60k36L16l67J83N5l7
$$ plain form
2353 -3 -84 -128 44 -75 59 79 32 223 -181 98 -78 -291 103 11 -117 14 -27 -27 -83 -137 13 16 -96 131 157
2378 157 -280 -107 -32 124 -140 96 -63 -297 -114 -156 -93 -166 116 -107 77 -124 255 -237 86 -175 -97 -8
2400 -8 -199 258 5 -343 -267 274 -120 -120 -168 46 -159 121 -3 -122 -158 16 270 26 17 25 -13 -54 252 199 1
2425 1 241 12 -344 -95 -225 239 -237 -46 -79 -143 241 -301 233 139 247 186 -140 92 55 -72 -182 -107 144
2448 144 -174 -315 100 -52 67 -381 -374 77 -14 15 80 108 14 131 -241 -4 -213 -9 -48 -113 131 106 221
2471 221 -123 -200 -139 184 -28 -306 347 -83 304 -2 -20 -120 -221 36 -244 23 -133 80 -68 223 -142
2492 -142 55 99 -289 44 95 -55 -192 -178 224 -80 -59 131 115 -3 288 -80 56 54 -188 -243 72 -78 -11
2515 -11 265 48 284 -305 -129 206 -68 86 63 316 163 291 -115 33 -163 134 -115 204 213 -243 -63
$$ packed form
2353cq1m4J72j19J34K0m7J91m04K79j76k13L94r2j28J31m1%n6n4J50Lj12K27K6
2378A57m37J73P5J56k64K36j59k34J83m2O3p3K82k23J84k01L79m92L23k61P8Q9
2400hj91M57k53l48P6N41l94%m8K14k05K80j24j19l6J74K54k44rQl8m1L06n3j98
2425AK40k29l56K49j30M64m76J91l3o4L84n42N34r4J08o1l26K32l7j27j10P5K51
2448A44l18j41M15j52J19m48PM51r1K9O5K8r4J17l72K37k09K04l9o5K44k5J15
2471B21l44p7O1L23k12k78O53m30L87l06j8j00j01K57k80K67j56K13j48K91l65
2492a42J97M4l88L33N1j50j37J4M02l04K1J90j6j18K91l68J36kk42n5L15j50O7
2515a1K76k17K36n89J76L35k74J54k3K53j53J28m06J48j96K97k49L19Rm56J80
$$ plain form
2536 -63 -144 -129 -73 535 151 -95 -280 -210 181 -154 40 -8 105 -124 178 -133 70 97 -289 -132 -68 -140 146
2559 146 134 -131 -15 -51 12 -49 108 -157 242 -69 129 -35 -54 -88 -119 272 -150 -13 305 282 133 -57 120
2582 120 142 -3 190 -336 -12 124 -91 -47 95 117 138 9 -139 -52 -170 -32 -133 17 121 66 -38 -196
2604 -196 97 -25 92 -113 -46 131 42 -48 -306 -112 149 53 72 1 -88 -164 -138 44 21 271 286 -114 -354 60
2628 60 34 -42 -239 -171 -52 25 -47 -122 122 -187 -239 -54 128 -64 -186 212 48 132 176 175 152 150 -41 239 10
2653 10 128 313 216 -82 9 76 218 -149 -28 -56 257 -133 -151 -35 -36 -112 26 169 119 223 30 212 173 -139
2677 -139 163 76 -61 -50 -202 -95 -50 -141 113 -21 -58 139 -212 16 -52 108 -20 108 186 17 144 79 47
2700 47 -68 -27 -72 -50 83 -131 23 -47 157 221 56 206 -102 -394 131 -84 107 -173 -163 279 -372 -268
$$ packed form
2536f3q1J5N6O08l84k46j85P0L91l35J94m8J13k29L02l11K03K7l86J57O4p2K86
2559A46j2k65J16l6O3o1J57k65L99l11J98j64j9l4l1L91m22J37L18k3j49j90J77
2582A20K2j45J93n26L24J36k15M4J42K2K1j29j48Q7j18J38j01J50J04n5j04j58
2604a96K93j22J17k05O7J77q9r0k58J94K61r6J9p1q9p6K6J82k3K50J5m00k40M14
2628F0k6p6j97O8J19P7p2p5K44l09n2J85J82j92j22L98j64Q4M4jk3kj91K80k29
2653A0J18J85r7k98R1O7J42l67J21k8L13l90j8J16jp6J38J43n0J04j93J82l9l12
2677a39L02q7j37J1j52J07M5r1K54j34l7J97l51K28o8J60j28J28P8j69J27o5l2
2700D7j15M1m5K2J33k14J54p0K04O4j65J50l08k92N25k15J91k80J0M42o51J04
$$ plain form
2722 -268 -47 -183 -69 94 151 -64 76 -84 104 -44 210 36 -50 -4 140 209 328 195 52 -77 95
2743 95 -11 -64 116 -45 -22 47 9 -15 25 -16 -23 -21 74 -19 96 145 11 435 34 78 -124 -61 81 27 191 81
2769 81 112 208 272 164 -148 217 40 143 66 -38 -109 176 -15 -43 84 140 -72 -486 36 77 59 142 -81 -2
2793 -2 130 193 184 163 -106 38 -161 -11 -65 -103 97 207 309 313 -49 29 56 -16 92 -5 -125 11 278 62 -62
2818 -62 -129 -15 -257 41 218 184 -31 -181 -71 -42 -26 -8 -31 -256 134 -40 150 101 35 -50 -219 -26 77
2841 77 65 -72 -88 -234 -126 -92 98 -159 105 142 -9 -33 -51 -183 89 41 -244 -28 -129 -22 -29 353 26
2864 26 -150 -109 -38 139 91 201 -176 -143 292 296 144 -2 71 6 165 -230 18 173 183 -140 173 30 191
2887 191 194 -329 -21 -208 159 95 -1 77 180 51 200 -388 -104 19 -120 -7 -22 -117 -81 150 43 -106 -45
$$ packed form
2722b68K21j36J14J63N7k15J40j60J88j48K54j74q6M6J44O9J19j33j43j29J72
2743I5j06n3J80j61K3O9l8k4M0m1pKR5r3J15M9j34M24m01M4k02O3J42n4J64j10
2769H1L1R6O4j08l12L65j77J03p7j04p1K85j91k8J27N6k12m14N22M1j8Q3k23P9
2793bJ32O3rk1k69J44j99J50n4l8K00J10J02Ml62P8K7p2J08r7j20J36K67k16j24
2818f2o7J14k42K98J77l4k15j50J10K9J6J8k3k25L90j74J90m9o6q5j69J93J03
2841G7j2j37j6j46J08L4J90k57K64L7j51k4j8j32K72m8k85K16j01J07pL82l27
2864B6j76M1P1J77m8J10l77L3M35Mj52j46P3o5J59l95K48J55J0l23L13j43J61
2887A91Ln23L08j87L67o4r6P8J03j29J49n88K84J23j39J13j5r5L6K31j07j49O1
$$ plain form
2910 -45 -84 -107 1 242 -181 -62 13 22 53 -109 54 -125 -120 -102 -112 -36 -24 -129 136 60 -56 -108 -27 -214 -61
2935 -61 43 -17 319 62 -2 118 71 -5 -218 -216 -54 62 -165 47 -123 284 -18 71 -94 273 192 -13 79
2958 79 115 180 -198 36 111 46 149 -58 -9 261 -66 -110 -77 -18 225 -212 117 263 112 47 -108 -82 104 366
2982 366 -173 -35 53 -31 -1 -307 234 36 -125 438 209 67 60 224 268 33 53 261 202 -22 33 -131 21
3005 21 -61 -326 -158 -75 225 -290 324 -51 58 -85 35 81 84 -95 -82 222 40 -2 83 -228 18 -44 20 22
3029 22 -11 -380 8 364 -12 -100 -144 25 79 -124 131 -95 -49 185 264 239 52 -191 -20 249 -71 -223 173
3052 173 -205 -35 -230 -99 34 78 18 -241 121 64 119 -11 -93 134 -62 -140 -65 -60 -117 137 32 -156 177
3075 177 61 91 188 -207 50 304 -12 69 201 -74 -148 168 29 99 3 -45 197 73 -73 -1 -98 -43 15 134
$$ packed form
2910d5l9k3J08K41m23J19P5RL1j62J63j79NJ8j0P6J2j05K65p6j16n2Q1j87J53
2935f1J04o0L36k57o4J20m7p6k13KJ62J16k27K12j70M07l02Q9j65L67q1k05R2
2958G9L6O5l78K34P5o5J03k07M9K70l27m4L3N9K43m37L29J46j51o5j55K6J86K62
2982C66n39J38Q8q4L0l06N41j98j61N63k29j42pJ64M4k35K0K08n9k24N5j64J52
3005B1q2k65J68Q3L00n15O14l75J09j43J20M6Lj79J3L04j82m2Q5l11K46o2O4K
3029B2l3l69L88L56l76q8m4J69N4k03K55k26M6K34P9k5j87k43J71K69l20j52L96
3052A73l78J70j95J31J33M4o0k59L62n7N5j30q2K27j96p8P5Nn7K54j05j88L33
3075A77j16L0R7l95K57K54l16Q1J32k75p4L16j39P0r6m8K42j24j46P2r7N5N8J19
$$ plain form
3099 134 -80 95 379 -124 48 -28 -17 -101 -238 67 -142 112 13 114 -5 214 104 215 10 146 140 -254
3121 -254 -115 21 -123 -30 -77 303 61 -139 66 41 -47 -98 127 64 -249 81 45 -22 -11 43 256 157 -183 126
3145 126 94 6 168 -137 18 4 315 106 172 143 -219 72 -136 29 -122 -138 -173 -117 -110 97 270 183 125 126 -2
3170 -2 -150 -55 8 126 73 -290 41 33 -36 148 50 244 185 -54 38 -113 44 117 -271 122 69 85 142 8 70
3195 70 140 158 -78 -85 -25 -203 -143 -21 -348 83 -310 107 -112 -96 235 45 -60 -46 -86 12 202 -139 -70 -57
3219 -57 134 -348 0 172 -4 83 -37 25 316 -30 -78 7 100 -132 -86 94 74 136 298 94 121 20 -68 -93
3243 -93 -33 91 -24 353 -202 1 85 -20 140 57 -124 228 -140 -181 -203 196 75 -145 -51 -86 139 -20 35
3266 35 109 -72 -18 -105 62 -5 -174 105 -245 -90 75 -1 38 115 -388 69 -80 68 211 48 -192 -59 271
$$ packed form
3099A34k14J75K84n03J72p6J1q4j37L05k09K54r9J01j19K19j10J11k05J36ol94
3121b54J39J36j44R3m7L80k42k00K05k5q8n1K25o3l13L30l6o7J1N4K13r9l40L09
3145A26l2q8J62l05J55j4L11k09O6k9l62K91k08J65j51j6l5N6PK07J73q7n8Jj28
3170bj48R5O3J18n3l63L31qo9J84r8J94n9k39R2j51J57P3l88L93n3J6N7j34O2
3195G0P0J8k36pO0j78O0J22l27M31l93M17k19J6L31j90j05J4m0R8J90l41O9J3
3219e7J91m82L48J72j76Q7j20O2K91l46m8Q5R3k32M6J80k0O2J62k04K7j01q8k5
3243i3O0J24j15L77n55K03Q4j05J60q3j81L52l68m1k2L99j21k20R4l5K25j59N5
3266C5P4j81N4q7J67o7j69K79l50J55J65p6L9P7n03M57j49J48J43j63k40J33L30
$$ plain form
3289 271 -234 -171 141 321 235 -30 -33 20 69 369 145 4 0 -110 -68 161 -82 25 238 -68 -9 199 53
3312 53 9 330 -139 -30 172 -224 -109 93 -45 41 62 -99 -192 -48 -112 -157 -171 118 -107 71 135 25 125
3335 125 106 34 -66 -9 247 -44 -28 113 72 -148 -163 -30 92 80 119 -20 -71 -49 352 -114 -35 266 -259 -79
$$ packed form
3289B71n05O3L12J80q6k65lN3M9L00k24j41mj10M2K29k43J07K13l06N9K08j46
3312E3m4L21m69J09K02l96J15K02j38Q6K1j61r3J44o4m5j4K89k25J78O4j10J00
3335A25j9p2j00N7K56k91J6J41m1k20j5J33J22j2L9j39n1K2M01m66P9L01n25J80
$$ [...]
8191A88
##END NTUPLES=NMR FID
##END=
