##TITLE=1H_DE-75H
 200.13MHz, D2O,
 8 sc
 
 30.1.2025
##JCAMPDX= 6.0         $$ Bruker NMR JCAMP-DX V2.0
##DATA TYPE= NMR FID
##DATA CLASS= NTUPLES
##ORIGIN= UXNMR, Bruker Analytische Messtechnik GmbH
##OWNER= pz
$$ XWIN-NMR		Version 3.5
$$ Thu Jan 30 16:38:41 2025 Russian Standard Time (UT+4h)  she@DPX200
##.OBSERVE FREQUENCY= 200.1313
##.OBSERVE NUCLEUS= ^1H
##.DELAY= (6, 6)
##.ACQUISITION MODE= SIMULTANEOUS
##.ACQUISITION SCHEME= undefined
##.AVERAGES= 8
##.DIGITISER RES= 18
##SPECTROMETER/DATA SYSTEM= spect
##.PULSE SEQUENCE= zg30
##.SOLVENT NAME= D2O
##.SHIFT REFERENCE= (INTERNAL, D2O, 0, 14.3821)
##AUDIT TRAIL= $$ (NUMBER, WHEN, WHO, WHERE, WHAT)
$$ ##TITLE= Audit trail, XWIN-NMR		Version 3.5
$$ ##JCAMPDX= 5.01
$$ ##ORIGIN= Bruker BioSpin GmbH
$$ ##OWNER= she
$$ F:/spectra/data/she/nmr/H-C/1/audita.txt
$$ ##AUDIT TRAIL=  $$ (NUMBER, WHEN, WHO, WHERE, WHAT)
(   1,<2025-01-30 15:20:23.93 +0400>,<she>,<DPX200>,
      <created by zg, POWCHK disabled, PULCHK disabled
       configuration hash MD5:
       00 E9 B6 7A A2 85 ED C7 34 08 36 98 17 FE 4E 26
       data hash MD5: 16K
       89 C0 9D CC 11 17 F9 A7 03 90 CA 90 F9 F4 55 00>)
$$ ##END=
$$ 
$$ hash MD5
$$ 3A 48 AE 45 EA 64 40 0E B4 AF F9 FC EC 9D 13 52
##$RELAX= 
##$RELAX= 
##$RELAX= 
##$RELAX= 
##$RELAX= 
##$RELAX= 
$$ Bruker specific parameters
$$ --------------------------
##$DU= <F:/spectra>
##$EXPNO= 1
##$NAME= <H-C>
##$PROCNO= 1
##$TYPE= <nmr>
##$USER= <she>
##$AMP= (0..31)
100 100 100 100 100 100 100 100 100 100 100 100 100 100 100 100 100 100 
100 100 100 100 100 100 100 100 100 100 100 100 100 100 
##$AQSEQ= 0
##$AQ_mod= 1
##$AUNM= <au_zg>
##$AUTOPOS= <>
##$BF1= 200.13
##$BF2= 200.13
##$BF3= 200.13
##$BF4= 200.13
##$BF5= 200.13
##$BF6= 200.13
##$BF7= 200.13
##$BF8= 200.13
##$BYTORDA= 1
##$CFDGTYP= 0
##$CFRGTYP= 5
##$CHEMSTR= <none>
##$CNST= (0..31)
1 1 145 1 1 1 1 1 1 1 1 1 1 1 1 1 1 1 1 1 1 1 1 1 1 1 1 1 1 1 1 1 
##$CPDPRG= <>
##$CPDPRG1= <>
##$CPDPRG2= <>
##$CPDPRG3= <>
##$CPDPRG4= <mlev>
##$CPDPRG5= <mlev>
##$CPDPRG6= <mlev>
##$CPDPRG7= <mlev>
##$CPDPRG8= <mlev>
##$CPDPRGB= <>
##$CPDPRGT= <>
##$D= (0..31)
0 0.7 0 0 0 0 0 0 0 0 0 0.03 0 0 0 0 0 0 0 0 0 0 0 0 0 0 0 0 0 0 0 0 
##$DATE= 1738236023
##$DBL= (0..7)
120 120 120 120 120 120 120 120 
##$DBP= (0..7)
150 150 150 150 150 150 150 150 
##$DBP07= 0
##$DBPNAM0= <>
##$DBPNAM1= <>
##$DBPNAM2= <>
##$DBPNAM3= <>
##$DBPNAM4= <>
##$DBPNAM5= <>
##$DBPNAM6= <>
##$DBPNAM7= <>
##$DBPOAL= (0..7)
0.5 0.5 0.5 0.5 0.5 0.5 0.5 0.5 
##$DBPOFFS= (0..7)
0 0 0 0 0 0 0 0 
##$DE= 6
##$DECBNUC= <off>
##$DECIM= 32
##$DECNUC= <off>
##$DECSTAT= 4
##$DIGMOD= 1
##$DIGTYP= 9
##$DL= (0..7)
0 120 120 120 120 120 120 120 
##$DP= (0..7)
150 150 150 150 150 150 150 150 
##$DP07= 0
##$DPNAME0= <>
##$DPNAME1= <>
##$DPNAME2= <>
##$DPNAME3= <>
##$DPNAME4= <>
##$DPNAME5= <>
##$DPNAME6= <>
##$DPNAME7= <>
##$DPOAL= (0..7)
0.5 0.5 0.5 0.5 0.5 0.5 0.5 0.5 
##$DPOFFS= (0..7)
0 0 0 0 0 0 0 0 
##$DQDMODE= 0
##$DR= 18
##$DS= 0
##$DSLIST= <SSSSSSSSSSSSSSS>
##$DSPFIRM= 0
$$ [...]
##$SUBNAM0= <"">
##$SUBNAM1= <"">
##$SUBNAM2= <"">
##$SUBNAM3= <"">
##$SUBNAM4= <"">
##$SUBNAM5= <"">
##$SUBNAM6= <"">
##$SUBNAM7= <"">
##$SUBNAM8= <"">
##$SUBNAM9= <"">
##$SW= 18.0517328524113
##$SWIBOX= (0..15)
0 0 2 0 0 0 0 0 0 0 0 0 0 0 0 0 
##$SW_h= 3612.71676300578
##$TD= 16384
##$TD0= 1
##$TE= 0
##$TE2= 300
##$TE3= 300
##$TEG= 300
##$TL= (0..7)
0 120 120 120 120 120 120 120 
##$TP= (0..7)
150 150 150 150 150 150 150 150 
##$TP07= 0
##$TPNAME0= <>
##$TPNAME1= <>
##$TPNAME2= <>
##$TPNAME3= <>
##$TPNAME4= <>
##$TPNAME5= <>
##$TPNAME6= <>
##$TPNAME7= <>
##$TPOAL= (0..7)
0.5 0.5 0.5 0.5 0.5 0.5 0.5 0.5 
##$TPOFFS= (0..7)
0 0 0 0 0 0 0 0 
##$TUNHIN= 0
##$TUNHOUT= 0
##$TUNXOUT= 0
##$USERA1= <user>
##$USERA2= <user>
##$USERA3= <user>
##$USERA4= <user>
##$USERA5= <user>
##$V9= 5
##$VALIST= <valist>
##$VCLIST= <CCCCCCCCCCCCCCC>
##$VD= 0
##$VDLIST= <DDDDDDDDDDDDDDD>
##$VPLIST= <PPPPPPPPPPPPPPP>
##$VTLIST= <TTTTTTTTTTTTTTT>
##$WBST= 1024
##$WBSW= 4
##$XGAIN= (0..3)
0 0 0 0 
##$XL= 0
##$YL= 0
##$YMAX_a= 680205
##$YMIN_a= -687551
##$ZGOPTNS= <>
##$ZL1= 120
##$ZL2= 120
##$ZL3= 120
##$ZL4= 120
##$ABSF1= 10
##$ABSF2= 0
##$ABSG= 5
##$ABSL= 3
##$ALPHA= 0
##$AQORDER= 0
##$ASSFAC= 0
##$ASSFACI= 0
##$ASSFACX= 0
##$ASSWID= 0
##$AUNMP= <proc_1d>
##$AZFE= 0.1
##$AZFW= 0.1
##$BCFW= 1
##$BC_mod= 2
##$BYTORDP= 1
##$COROFFS= 0
##$CY= -3
##$DATMOD= 1
##$DC= 2
##$DFILT= <>
##$DTYPP= 0
##$F1P= 0
##$F2P= 0
##$FCOR= 0.5
##$FTSIZE= 0
##$FT_mod= 4
##$GAMMA= 1
##$GB= 0.15
##$INTBC= 1
##$INTSCL= 1
##$ISEN= 128
##$LB= 0.25
##$LEV0= 0
##$LPBIN= 0
##$MAXI= 10000
##$MC2= 0
##$MEAN= 0
##$ME_mod= 0
##$MI= 1.114404
##$NCOEF= 0
##$NC_proc= 0
##$NLEV= 6
##$NOISF1= 3.799351
##$NOISF2= 2.8
##$NSP= 1
##$NTH_PI= 0
##$NZP= 0
##$OFFSET= 14.38212
##$PC= 1
##$PHC0= 257.7708
##$PHC1= -5.407778
##$PH_mod= 1
##$PKNL= yes
##$PPARMOD= 0
##$PSCAL= 0
##$PSIGN= 0
##$REVERSE= no
##$SF= 200.129724274929
##$SI= 16384
##$SIGF1= 3
##$SIGF2= 2
##$SINO= 400
##$SIOLD= 16384
##$SREGLST= <1H.CDCl3>
##$SSB= 0
##$STSI= 0
##$STSR= 0
##$SW_p= 3205.1282051282
##$SYMM= 0
##$S_DEV= 0
##$TDeff= 0
##$TDoff= 0
##$TI= <>
##$TILT= no
##$TM1= 0
##$TM2= 0
##$TOPLEV= 0
##$USERP1= <user>
##$USERP2= <user>
##$USERP3= <user>
##$USERP4= <user>
##$USERP5= <user>
##$WDW= 1
##$XDIM= 8192
##$YMAX_p= 0
##$YMIN_p= 0
$$ End of Bruker specific parameters
$$ ---------------------------------
##NTUPLES= NMR FID
##VAR_NAME=  TIME,          FID/REAL,        FID/IMAG
##SYMBOL=    X,             R,               I
##VAR_TYPE=  INDEPENDENT,   DEPENDENT,       DEPENDENT
##VAR_FORM=  AFFN,          ASDF,            ASDF
##VAR_DIM=   8192,          8192,            8192
##UNITS=     SECONDS,       ARBITRARY UNITS, ARBITRARY UNITS
##FACTOR=    0.0002768,     1,               1
##FIRST=     0,             0,               0
##LAST=      2.2672688,     0,               0
##MIN=       0,             -687551,         0
##MAX=       2.2672688,     680205,          0
$$ Real data points
##PAGE= N=1
##DATA TABLE= (X++(R..R)), XYDATA
0@%%%%%%%%%%%%%qJ4j4J6j6K4l2L2m0M8n6O4p2Q8j00J14j31J47j70J93k18K46
35A29k76L13l50L92m37M83n39N98o61P30q05Q89r79J080j191J313j447J593j760
54i25J945k151K390k665K986l361L814m377N086o020P307r201J2283j8144L3289
69B2256j50071m49971j09765J21789L15402L90605L66938J73022o4991k85559
79C29655l84043l56514j96436K4882K58311L74671L33103J74744k3118k34346
89C00909l64388l39795j79047K5996K23226L45211L37810J99618p003k07919l19826
100A4792l08599j88638o760J82462L00704L04117J94274R109j83362k97905k98660
111b78466j99082l0283J57798K87607K99880J97193K7630j45630k61955k78332
$$ y = [0, 0, 0, 0, 0, 0, 0, 0, 0, 0, 0, 0, 0, 0, -8, 6, -8, 8, -8, 16, -16, 16, -24, 24, -32, 32, -40, 48, -52, 62, -69, 78, -92, 101, -117, 129, -147, 166, -184, 208, -229, 254, -285, 313, -348, 382, -423, 466, -513, 567, -624, 689, -758, 835, -925, 1020, -1131, 1259, -1406, 1580, -1781, 2033, -2344, 2742, -3278, 4029, -5172, 7111, -11033, 22256, -127815, -577786, -687551, -565762, -250360, 140245, 507183, 680205, 615214, 329655, -54388, -410902, -607338, -582456, -324145, 50526, 383629, 558373, 535255, 300909, -63479, -403274, -582321, -556325, -333099, 12112, 349922, 549540, 542537, 334618, 14792, -293807, -482445, -489205, -306743, -6039, 298078, 492352, 501461, 318099, 20194, -278466, -477548, -507831, -350033, -62426, 237454, 434647, 462277, 316647, 54692, -223640]
121b23640j88861l1504J32229K47593K77778K04996M6553j29095k47286k69137
131a80374j97812n7512J06316K29116K60116J89956N5829r4300k13013k55760
141a57438j97592o2559R3890K11674K49422J95023O9275p7108j92705k35987j92612
152b96717p9204O4537J84712K32015J89040P5860o1527j77305k26189j89600q3867
163c68245N0658J66845K18371J88061Q8970m0244j54231k08035j82844r0401L5883
174b95212J47877K02875J81122R3318k9359j39766j96099j80234r8929J8419J28349
185a67639J87847J76504R9043j3811j21020j81191j71797r9089R739J13890J75214
196G690J72026J04439j820j05604j68343j67546j05068m465R6935J59811J61954
$$ y = [-223640, -412501, -444005, -311776, -64183, 213595, 418591, 465144, 336049, 88763, -180374, -378186, -435698, -329382, -100266, 159850, 349806, 405635, 311335, 98322, -157438, -355030, -417589, -323699, -112025, 137397, 332420, 401695, 324587, 131882, -104105, -296717, -375921, -311384, -126672, 105343, 294383, 370243, 308716, 131411, -94778, -284378, -368245, -317587, -150742, 67629, 255690, 344660, 304416, 150185, -57850, -240694, -331095, -295212, -147335, 55540, 236662, 329980, 300621, 160855, -35244, -215478, -314407, -295988, -167639, 20208, 196712, 295755, 281944, 160924, -20267, -192064, -291153, -281414, -167524, 7690, 179716, 284155, 282335, 176731, 8388, -159158, -264226, -268691, -171756, -11945, 150009]
207A50009J04250Q509r0719j55694j61106j06164j3504Q4136J48811J58379J08526
218B35433J9460p5571j41061j53029j07745k2258P0492J35607J48527J07135K7509
229B44499o3813j30907j47433j10334l1664N7431J24125J41995J09251L4547n1761
240A75936j16554j38113j08389l7325M7553J13310J35710J08261M0810m2007j06400
251G2792j31168j08193m5034L5938J01060J27789J06191M4946l2601r6585j24206
262d9071j05617m7612K7928R1151J21562J06231N0712k3039q6386j16187j02795
273a33123n1914J8646Q1002J12916J01746N3229j4794p7423j11119j02186n4818
284a77838J1110P1835J05697R9878N7327o515o7114j01832r8175n7529M087O3772
$$ y = [150009, 254259, 262768, 172049, 16355, -144751, -250915, -264419, -180283, -31472, 126907, 235433, 254893, 179322, 38261, -114768, -222513, -244771, -174279, -38672, 109855, 216990, 244499, 180686, 49779, -97654, -207988, -239652, -182221, -58096, 83899, 193150, 227697, 175936, 59382, -78731, -187120, -224445, -176892, -63582, 72128, 180389, 221199, 179192, 72792, -58376, -166569, -211603, -175665, -74605, 53184, 159375, 204321, 171720, 75135, -49071, -154688, -202300, -174372, -83221, 38341, 144572, 195284, 172245, 85859, -30328, -133123, -185037, -166391, -85389, 27527, 129273, 182502, 167708, 90285, -20834, -123020, -177838, -166728, -94893, 10804, 110682, 168009, 161494, 94380, -7452, -105627, -163156, -159069, -95297]
296i5297R9507R7216N8808p40n8866r6007r6456o0720l195N4949R2004R3471O0243
309A44917N588n1196q8265r2259o1528p783M7904Q5613R1314O2870J0818m3955
321A04038q1607q8422o2837j3922M0352P8554Q6734O1904J5453l6601p5938q6255
333e8547o3253j7320L3995P2255Q3018O4137K0002l0326o9029q1079o3258k1259
345a30664K7671O6524P9496O3057K3394k4844o4249p7968o3015k4822K2086N9986
357d3348P5041O2785K6866j9349n7676p3941o2462k7145J7269N5299P1772O2178
369H7289K9188j4354n2631o9887o1242l0267J2436M9462O7859O0969L0456j0428
381I8850m7644o6374o0048l1833Q301M4511O4407N9966L3204o280m2752o1811
$$ y = [-95297, 4210, 101426, 160234, 159494, 100628, 4621, -91835, -152555, -155750, -100801, -8797, 84674, 144917, 150505, 99309, 11044, -81215, -142743, -150526, -102622, -17009, 74305, 137175, 147993, 104038, 22431, -65991, -128828, -142750, -102398, -23844, 62890, 124794, 140247, 103646, 27708, -58547, -121800, -139120, -105125, -32870, 50148, 114285, 134287, 103961, 34932, -46147, -109405, -130664, -102993, -36469, 43027, 106084, 129478, 104634, 40385, -37583, -100598, -125420, -103334, -43348, 31693, 94478, 121344, 101995, 44319, -29622, -92084, -119229, -101960, -46661, 25111, 87289, 116477, 102123, 49492, -20395, -81637, -111904, -99468, -50006, 17853, 78822, 109278, 98850, 51206, -15168, -75216, -107049, -98748, -54237, 10170, 70136, 103340, 97060, 54308, -7503]
393g503n8883l2791L951M0341O0390N8132L4015k585l8110n8482n7632l5399L74
406i4182L5774N6699N6807L5086J094l3350n4909n5309l5961k304L1265N3427
418e863N5552L6377M056k9593n1194n4343l6758n877K7306M9427N2997L6874O538
431H5499k5373m8244n2379l6897q080K3551M6889N1831L7602R132k1715m4438
443A7378n0512l7270j0399J9900M3224M9489L6981J1525j8656m1782m8831l7131
455f6084j2694J6261L9750M8254L7108J3939j5667l8160m6286l7183j4486J4418
467f0830L7051M5535L7176J5638j2594l5649m4563l7024j6590J0730L3599M3743
479A6222L6556J6780r529l2695m2177l6857j7724Q640L1313M1652L6364J8722
$$ y = [-7503, -66386, -99177, -95226, -54885, 5505, 63637, 97652, 95067, 56957, -1525, -59157, -94556, -94182, -58408, -1709, 55098, 90184, 91278, 57928, 3019, -52290, -88251, -90555, -59290, -5863, 49689, 86066, 90122, 60529, 9335, -45008, -81766, -87643, -60337, -10910, 42087, 78961, 85499, 60126, 11882, -40497, -77394, -85474, -61923, -15034, 36797, 74399, 83531, 61816, 17378, -33134, -70404, -80803, -60903, -17679, 31810, 68791, 80316, 61660, 19878, -28953, -66084, -78778, -62517, -22767, 25487, 62595, 76534, 60867, 22707, -23579, -60762, -75248, -60830, -23779, 21756, 58932, 74570, 61976, 26327, -18236, -55260, -71850, -61120, -27521, 16222, 52778, 69558, 60029, 27334, -14843, -51700, -69424, -60784, -29471, 12181, 48545, 67267]
491F7267o949k9252m0421l6485j8769N662K8262L9154L6378J8808n129k6619l8546
504f639l6326j9717L765K5278L7260L5868K0493k141k4103l6271l5274k0472J650
517e6629K3199L5112L4899K0836k22k1706l4842l4318k1505p20K0205L3148L4026
530C1483K1828J333j9497l2292l3554k1619k289J8127L2072L2666K2342L626j6806
543C7420l0660l2868k2482l881J6097K9573L1988K2174L920j4939k8593l1732
555b3983k2252n056J4009K7457L1140K2622N993j2744k6685l0608k2943o119J2000
568c7169K6224L0101K2660O789j0743k5511k9920k2240p798J0224K3933K8874
580A5424K2634Q455r423k3304k8185k2777q546Q323K2552K7748K2675R490p470
$$ y = [67267, 60318, 31066, -9355, -45840, -64609, -58947, -30685, 8469, 44847, 63655, 58526, 31907, -6639, -42965, -62682, -58917, -33639, 3621, 39489, 59982, 57841, 33738, -2533, -37807, -58279, -56629, -33430, 1682, 36581, 57417, 57195, 35489, 647, -33671, -55176, -55896, -35691, -2543, 31483, 53311, 54644, 35147, 2855, -30699, -52318, -54607, -36480, -4408, 28258, 50600, 54226, 37420, 6760, -26108, -48590, -52471, -36374, -6801, 25187, 47361, 51281, 36342, 7749, -23983, -46235, -51291, -37282, -9825, 21315, 43937, 49930, 37186, 10501, -20107, -43050, -49169, -37169, -10945, 19156, 41816, 48605, 37862, 12351, -17569, -39809, -47607, -37383, -13450, 15424, 38058, 46513, 37090, 13786, -14399, -37176, -45722, -37399, -14847, 12901, 35576, 45066, 37596]
593C7596k1647k7022k2499j0135O189K1100K6860K2398R891n684j9962k6281k2027
606c1223j1085N255J9240K5159K2387J1310m546j8085k4697k2127j1502L435J7521
619a8958K4312K2063J2095l255j6449k3734k2349j2146K721J5656K2963K2092
631B5011J2130j789j5293k1951k1919j2786J454J4232K2291K1246J2810o64j3655
644B1117k1343k1372j2843J7J2876K0945K1175J3115K60j2007k0513k0788j3421
657c2782q37J1338J9838K0679J3347J711j0994j9191k0341j3651k156J0303J9151
670c585J9716J3835K623r542j8436j9885j3378l145Q989J7420J9656J3999K930
683C1197p855j7353j9206j3868m169Q074J6163J8613J4559M270p318j5624j8373
$$ y = [37596, 15949, -11073, -33572, -43707, -37518, -16418, 10442, 32840, 42731, 37047, 17085, -9196, -31223, -42308, -37053, -17813, 7346, 29733, 41043, 36497, 18412, -6285, -28412, -39914, -36479, -18958, 5354, 27417, 39512, 36257, 19808, -3926, -26275, -38421, -35700, -20044, 2919, 25011, 37141, 35352, 20059, -1892, -23811, -36597, -35143, -20911, 1380, 22626, 35436, 34772, 21117, -226, -21598, -34441, -34424, -21548, -603, 20572, 33687, 33947, 21940, 1427, -19361, -32782, -33619, -22281, -2443, 18236, 31583, 33294, 22300, 3109, -17232, -30883, -33039, -22736, -3585, 16131, 29966, 32589, 23047, 4611, -15274, -28652, -31797, -22808, -5388, 14268, 28267, 31197, 23342, 5989, -13217, -27085, -31254, -23180, -7017, 11596, 26155, 30425, 23107, 7483, -10890]
696a0890j4455m921O978J5334J8132J4065N331n997j4735j7794j4480n800N677
709b3555J3979J7597J4469N930n095j3608j7404j3810o809M846J2879J7325J4430
722B1174O400l760j2606j6722j4512o449L270J2117J6073J4253O902k802j1884
735A1454j5491j4760o819K225J1168J5582J4564P222k035j0860j4963j4212p505
748b4430K119R895J4973J3584Q237j670r734j4475j3902q186J162R168J4053J4170
762A4964P600k89r082j4035j3510q167O03Q217J3851J3399Q378K47q070j3103
776A003j3474q798o34P826J2811J3124Q531R35p179j2496j2884q938j772P158
790a4787J2369J2942Q977J678o001j2120j2653r189j692N755J1510J2440R364
$$ y = [-10890, -25345, -30266, -23288, -7954, 10178, 24243, 29574, 23577, 8842, -8952, -23432, -29232, -23555, -9576, 8021, 22490, 28420, 23325, 9717, -7687, -21497, -28306, -23460, -10581, 6744, 21174, 27574, 23814, 11208, -5514, -20026, -26475, -23205, -11088, 4985, 19238, 26140, 23338, 11454, -4037, -18797, -25616, -23391, -12223, 3359, 17923, 25145, 23110, 12250, -2713, -16925, -24430, -22311, -12416, 2557, 16141, 24378, 22708, 12974, -1501, -15403, -23589, -22427, -13259, 794, 14964, 22564, 22275, 13193, -842, -14352, -22519, -21916, -13699, 152, 13551, 21929, 22176, 14106, 1003, -12471, -21269, -21903, -14077, -1266, 11858, 20389, 21324, 14145, 1649, -11235, -20173, -21945, -14787, -2418, 10524, 19501, 21179, 15178, 3058, -9595, -18784, -20476, -14721, -3211, 9229, 18593]
803A8593K157n725j1027j2718r231k530N025J0791J2386R255L015m775j0562j2024
817g370r337l009M377J0172J2217R027L568l763r797j2081r493l702L530R405
831f256J1462R715L795l439q908j1458r516l930K872Q958J1118R664M380k651
845A5806q327j1013r709m687K440Q392J0757R587M715k721p507j0717r383m922
859a7289J650P466J0285R761M968j528p100j0276r346n063J225O952J0202R051
873A0958N489q98o680r695r720n155M67N928R550R734N018J37o050r160r551n657
889a5285J21N766R083R173N951M28n592q942q903n798q36N212Q800Q715N815J042
905A4750n035q323r158n959r83M326Q646Q637O172J465m470p984q766o235j136
$$ y = [18593, 20750, 15025, 3998, -8720, -17951, -20481, -15456, -4665, 7721, 16976, 19991, 15216, 4654, -7370, -16707, -19716, -15339, -5167, 7050, 16077, 19645, 15882, 6085, -5996, -15489, -19191, -15661, -6256, 5206, 14921, 18716, 15277, 6369, -5089, -14605, -18535, -15663, -6705, 4413, 14077, 18457, 15806, 7479, -3534, -13243, -17930, -15490, -7098, 3659, 13246, 17961, 15240, 7733, -2984, -12367, -17289, -15639, -8173, 2112, 11873, 16841, 15313, 8213, -2063, -11409, -16472, -15247, -8295, 1907, 10958, 16447, 15549, 8869, -826, -10546, -15701, -15234, -9306, 244, 9978, 14996, 15133, 9083, -77, -9628, -15285, -15164, -9398, -315, 8858, 14809, 15237, 9645, 703, -8200, -13998, -14834, -9622, -822, 7893, 13708, 14750, 9715, 1392, -7766, -13725, -14708, -10382, -1736, 6901, 13073, 14538, 10068, 2084, -6682, -12917, -14053]
920a4053L684Q103Q718O351J571l702p831q416o481j746L019P559Q334O352J968
935A3430k852p108q186o700k304L038O914Q043O998K392k988o722p836o403k940
950a3224K453O434P920O353K709j944o147p998o500l052J999N965P753O584L335
965A2640j730n682p726o260l452J329N654P194O616L607j261n044p481o490m004
980a2090J164N082O874O759L723j080m602o868o390l940O26M807O866O274M287
995A1492p20m263o407o842m090J16L924O926O270L980K73m120o180o490m268m75
1011a0874L940O160O654M084N66l504n995o294l989r19L031N955O359M196R30
1026A0300k963n839o445m108j254K886N497O140M486J053k409n655n859m372j381
$$ y = [-14053, -10369, -2266, 6452, 12803, 14374, 10672, 2841, -5575, -12056, -13802, -10783, -3224, 5110, 11462, 13430, 10578, 3470, -4716, -11416, -13720, -10682, -3768, 4275, 11273, 13665, 10677, 3955, -3881, -10284, -13224, -10771, -4337, 3583, 9936, 12645, 10701, 4554, -3444, -9944, -12996, -10997, -5032, 2721, 9305, 12640, 10910, 5228, -2498, -8758, -12210, -10881, -5227, 1967, 8583, 12190, 10929, 5885, -1596, -8086, -12090, -10926, -5844, 1030, 7789, 11512, 10432, 5830, -1038, -7428, -11368, -10742, -5935, 931, 7205, 11492, 10772, 6509, 102, -6740, -10830, -10714, -6790, 136, 6406, 10386, 10659, 6539, 359, -6131, -10399, -10874, -6934, -774, 5880, 9964, 10530, 7026, 1031, -5263, -9252, -10171, -7140, -1185, 5174, 9370, 10300, 7337, 1498, -4947, -9055, -10309, -7423, -1926, 4214, 8700, 9753, 7344, 1689, -4170, -8542, -9923]
1041i923K564N068O125M692J302k188n076o025m587j431J828M946N919M318K156
1056I688k073m758n762m754k079J867M855N534M518J969j315l990n692m811j893
1071h696Q80M207N449M969K093j257l736n656m472k439O64L885N550M498K354
1086H293p10l318n287m709k337P42L163N039M652K495m43l331m584m768k772J73
1102g702L186M712M875K625j32k808n045m363k836j87L111M357M548K777O6k151
1118E033m510m771k986M9K315M095M739L046K86k438m085m433l011o42K178M165
1134i70M260L259L41j947l485m657k969q33J969L651M187L233J020j937l520m250
1150b648l130j188J773L218M057L551J099j221l696l850l490j181J217L606L833
$$ y = [-9923, -7359, -2291, 3834, 8526, 9828, 7640, 2564, -3461, -8048, -9479, -7651, -2705, 3214, 7532, 9688, 7615, 2857, -2905, -7659, -9738, -7871, -3016, 2518, 7036, 9005, 7690, 3700, -1992, -6803, -8696, -7816, -3609, 1840, 6809, 8902, 7645, 3909, -1747, -6219, -8658, -7994, -4109, 1441, 5939, 8293, 7583, 4265, -1022, -5731, -8068, -7326, -4163, 876, 5528, 8023, 7580, 4249, -335, -5103, -7875, -7702, -4516, 196, 5071, 7696, 7564, 4756, -289, -4652, -7488, -7675, -4564, -207, 4341, 7118, 7184, 5033, 523, -4248, -7234, -7185, -4870, -775, 3964, 7010, 7296, 4858, 773, -3660, -6671, -7313, -5135, -970, 3290, 6549, 6890, 4943, 1458, -3199, -6168, -7001, -5032, -1381, 2806, 6039, 7059, 5122, 1602, -2648, -5778, -6966, -5193, -1975, 2082, 5633, 6732, 5511, 1815, -2035, -5525, -6706, -5489, -1883, 1950]
1165A950L469J295j263l263m076k989j406J033K832L872L069J718p44l164l802
1180a469l275j448P16K749L837L419J345l97k905l596l090j644N42K480L707L029
1196D000J817l74k534l443l258k014M33K324L448K993J941j28k280l083l055k334
1212e547L93J850L346L446K007l97j883l056l132k114j43J845L114L431J964J10
1228E234j773k987l413k005j62J657K974K813K569K92j738k619l346j924p05J476
1244c657K545L291K109P14j248k775l120k209l46J055K341L067K563K73r00k422
1260A281l294k088q68J350K677K698K076P60q89k230k956k295p48P67K421K782
1276A444J986J301j213k016k499k569j120J115J800K935J961J194p44j783k796
$$ y = [1950, 5419, 6714, 5451, 2188, -1888, -4877, -6283, -5250, -2418, 1454, 4523, 6241, 5497, 2333, -1469, -4744, -6192, -5476, -2727, 1110, 4529, 5874, 5477, 2572, -1024, -4114, -5758, -5216, -2736, 971, 4000, 5817, 5443, 2909, -534, -3792, -5806, -5373, -3049, 399, 3392, 5333, 5205, 2925, -158, -3213, -5547, -5154, -3304, 42, 3488, 5495, 5098, 3215, 159, -2973, -5087, -5230, -3385, -271, 3160, 5124, 5234, 3461, 474, -2939, -4944, -5106, -3449, -475, 2338, 4907, 5199, 3461, 842, -2504, -4428, -5133, -3657, -1112, 2179, 4288, 5002, 3754, 979, -2141, -4350, -4696, -3641, -1300, 1767, 4330, 4603, 3703, 1281, -2013, -4101, -4969, -3619, -942, 1756, 3832, 4592, 3703, 1473, -1483, -3778, -4526, -3759, -1338, 1444, 3430, 4731, 3518, 1502, -997, -3566, -4686, -3571, -1771, 1164, 3125, 4319, 3575, 1792, -1004]
1291a004k385o06K97K010K371K230J220o49j216k905k653p87M50J441K539K302
1307B655J297j26j448k631k364j065J24J780J853K371J411j84j674k123k236j097
1323c457q1J456K116J875J241K86j101k325j949j430J01J104J764K302J364K94
1339C560j147k166j981j493j25R30J931J996J535N3o98j715k168j955J33Q39J925
1356e46J754J455P71r65j753j949j631m84N40J843K089J693M62r15j448j933j765
1373b782m13O88J297K086J594N85m75j293k188j688n94L85J689K029J299P56l97
1390B578j438j911j831l71N11J622J684J256P88j94j329j761j826p46L77J421
1406a170J486J556P32k48r18j920j232p25j3J165J692J413P71J4j230j843j092
$$ y = [-1004, -3389, -3995, -3698, -1688, 683, 2913, 4133, 3484, 2268, -637, -3290, -4077, -3627, -2186, 353, 2655, 3952, 3826, 2378, -253, -2617, -3682, -3558, -1778, 75, 2446, 3857, 3673, 1999, -124, -2360, -3457, -3538, -2082, 34, 1909, 3150, 3436, 2335, 10, -1939, -3369, -3268, -2164, -400, 1902, 3266, 3560, 2413, 247, -1734, -3227, -3352, -2422, -491, 1505, 3040, 3093, 2395, 680, -1488, -3443, -3310, -2471, -546, 1208, 2663, 3434, 2469, 716, -1233, -2864, -3348, -2808, -965, 1124, 2817, 3279, 2364, 916, -1017, -2782, -3195, -2507, -1210, 876, 2470, 3055, 2580, 1287, -901, -2589, -3183, -2798, -1109, 920, 2219, 2975, 2578, 1140, -771, -2602, -2973, -2462, -840, 844, 2100, 2888, 2694, 1365, -396, -2222, -2968, -2591, -1170, 316, 1872, 2604, 2356, 1438, -482, -1714, -2439, -2452, -1287, 405, 1818, 2589, 2603, 1373, -470, -1562]
1423a562j111J02J248J289J481J043j54o96j567j646o14j13J040J352J325P93
1439B210L30p49j594j435r66m07J163J246J459J043mq96j114j485r17j7N34J083
1457e16J940P86M6p34j135j588p04n24P49J066J421Q16N23k56j568j030j157m21
1475b286O85J137J156R88O29p60q95j263j239j52L91R17J303J067J98k41q29j264
1493d58j220l70L97Q15J167J130N28m83q88j067o92q88J07J266J207Q86M21k58
1511A600j047o40j623kK04N31J023J120L55j37m90j220r72n35K85O81J033R77
1529A143O81o09k00j070j095k92MN90Q31Q69O73J95o03j461n19o95l04Q37P59
1548b66J235M32J71m69q79r40m86m02O20N66J044P92J19o72o88p61q32k94L87
$$ y = [-1562, -2673, -2571, -1323, -34, 1447, 2490, 2336, 1640, 73, -1573, -2187, -2300, -1260, 92, 1417, 2210, 2540, 1791, 197, -1238, -2204, -2611, -1448, -202, 1257, 2300, 2296, 1400, 286, -1199, -2116, -2133, -1599, -516, 1424, 2210, 2256, 1522, 387, -1201, -1905, -2429, -1680, -614, 807, 1623, 2146, 1890, 322, -708, -1865, -2286, -1601, -464, 692, 1680, 2309, 1549, 654, -609, -1848, -2000, -1609, -692, 611, 1678, 1876, 1635, 806, -458, -1678, -2048, -1651, -836, 331, 1461, 1989, 1506, 618, -449, -1141, -2029, -1922, -656, 551, 1437, 1858, 1600, 553, -87, -1710, -1712, -1508, -977, 46, 1166, 1521, 1384, 894, -326, -1298, -1833, -1548, -867, 166, 1143, 1824, 1215, 1015, -55, -1150, -1442, -1438, -848, -17, 852, 1525, 1720, 1117, -344, -863, -1558, -1862, -1025, -266, 969, 1401, 1572, 1103, 224, -716, -1202, -1604, -984, -418, 626, 1418, 1537, 865, 177, -584, -1416, -1710, -1323]
1567a323R63J009M01N74l40r81j016o69j22L64P63Q78O31K27k75l89j326o06j05
1586a342N8Q26R00R25q9l04o63p66n47k92k9R49Q51M51K91J54q26q00p64l67K59
1607a125O85M34Q80O59m77m26q78o56l75j66Q96P69O68J94J22n97p87m72n40J55
1627a037J31Q82P13M21K32n22q53n47o94R3N45O87N41L64J10l55p54n73l80l07
1647a303N87P21M46O52k1m85m86n10n93R6J79P09M74N37rk43p51l70o66j25M67
1668f94M87M53N65L11k52p50l69n67l59N10M68O02O06j26q5o19n87o15J3r7P25
1689c80O98L56K26j61m68n19m87l60M36L90N83J33M32K69q97k58o26l79J95N59
1709b58M16O08k6J63l00q16m33m45M72J83N41N79J95Om78k43q83m8oL07N41N28
$$ y = [-1323, -360, 649, 1050, 1624, 1284, 303, -713, -1382, -1504, -1140, -377, 501, 1132, 1359, 1084, 695, -631, -1237, -1342, -1284, -458, 442, 1367, 1278, 974, 311, -455, -1002, -1294, -1323, -374, 477, 928, 1219, 1373, 547, -253, -1017, -1384, -1125, -440, -6, 874, 1533, 1056, 630, -248, -904, -1279, -1445, -549, 220, 888, 1082, 1204, 607, -180, -652, -1192, -1037, -906, -24, 689, 1110, 1342, 820, -33, -580, -1274, -1181, -636, 51, 592, 956, 1066, 711, -43, -616, -996, -1303, -716, 5, 451, 1103, 1082, 597, 111, -399, -992, -896, -717, -8, 466, 1003, 994, 751, 0, -370, -1036, -1161, -694, -207, 246, 811, 1122, 870, 120, -249, -816, -1175, -665, -197, 405, 1011, 885, 800, 181, -406, -1021, -1008, -1105, -380, 318, 674, 900, 739, 271, -248, -735, -1095, -659, -269, 314, 447, 879, 1148, 251, -7, -633, -1012, -817, -258, 158, 766, 740, 903, 603, -213, -646, -1091, -619, -436, 105, 684, 879, 885, 407, 164, -719, -767, -773, -466, 75, 603]
1731F03J55Mp01j29p84L9L9o3Q59M90K40J00k93n48n54j47J12j41P07O03L58k06
1753G43j49p41l38k02j97L26N19M07K2N00n61j15p37k15K5J02K84M98P32l04k56
1774C43L7o99k55j73M03J13M23M07N6k49n38m08J55p1R3J73O9R91k65k15k45k76
1796a31k93k66J4P74J14L48q0j77l17j0l53l71L23J97L99K61m8L21l34m69p9j29
1818c06J02l3L24J84K74P5k29n20j54k96j4J11N51L14J72J23m49k42k57n64K81
1839e53L7O18O5M61r7j99n67k47o2j07L58K16M28K71o2l53m21K5k24j62J19L58
1861i8O52k54j2qk71l20j02N5oJ13L05L54P5o8m28k72l49J53q8L07O21O7K63m24
1885B65l53J33j78j10K15j6J62K84j15l7J30l10n93L09k89L74K64K55K05j07j41
$$ y = [603, 758, 762, 61, -68, -852, -813, -774, -837, 22, 512, 752, 852, 559, 11, -543, -690, -578, -719, -12, 591, 949, 743, 594, -147, -485, -687, -884, -558, -39, 368, 390, 890, 329, 214, -523, -738, -713, -611, -327, 171, 903, 599, 343, 380, -319, -574, -747, -344, -231, 192, 599, 655, 406, -132, -540, -385, -456, -363, -190, -121, 870, 605, 390, 145, -131, -424, -690, -676, 98, 212, 560, 480, 303, -14, -24, -377, -748, -425, -228, 171, 432, 384, 705, 371, -98, -177, -306, -204, -237, 87, 271, 545, 620, 391, -129, -283, -579, -593, -482, 69, 383, 555, 678, 229, -13, -270, -834, -553, -516, 102, 167, 628, 531, 332, -235, -482, -544, -651, -293, -77, 351, 622, 560, 207, -214, -189, -413, -575, -456, -98, 554, 300, 288, 280, 9, -311, -413, -358, -364, -251, 54, 408, 483, 415, -13, -285, -634, -481, -569, -262, 359, 426, 689, 265, -88, 45, -133, -243, -28, -44, 118, 402, 287, 250, 380, 70, -523, -214, -503, -129, 135, 390, 595, 488, 347]
1906C47l93n95L72n0K67o1N16j57J86l66M1m83nm1K89M62j50K33j49nk78l67J85
1929b02k88L18K95J69K53l74J1k87l18j24K74j60L18K95J91J59j80k43o99K75
1949c17k10J54J44J90M49J16k38j37m75r8j14K26M49l4L37O4j67n89m2Jj07j64
1971e62N29K2K65M5p1l76oJ28k57k5N15J23j26j3r4M9l87n8l90K76M78J35L08
1994E08k73J7m25m2j66j01L17J58J51K18k7k27M2k02n89M94l41M89jJ65L0N3k64
2017a6kk75j08o8M57J42L69k05n4j39k45j64k12L05J28K66p7L43J78m72k98J17
2039c0n9k75K07R1M49j03J38n91L25k69l2j6O7l4N38l4j06j13k96L2j80n9o6M55
2063C9K11Nj47P3o6k12J82k11n14Q32L4J7j20k32J95k43J03k07K14K41q7L05n96
$$ y = [347, -46, -641, -269, -319, -52, -113, 403, 246, 432, 66, 107, -376, -381, -422, -133, 329, 179, 412, 263, 258, -20, -387, -202, -490, -172, 123, 292, 545, 171, 182, -105, -423, -547, -273, -433, -115, 180, 371, 530, 350, 107, -592, -317, -527, -373, -229, -39, 410, 526, 288, 151, -324, -422, -536, -310, 139, 105, 442, 506, 339, -250, -292, -291, -398, -562, -33, -11, 254, 299, 228, -148, -154, -26, -283, -308, 207, 330, 204, 191, 97, 146, -241, -299, -689, -413, 65, 200, 508, 235, 252, -173, -215, -381, -482, -165, -7, 144, 362, 335, 108, 150, -52, -641, -147, -488, 1, 0, 165, 195, 248, -16, -18, -293, -401, -469, -12, 130, 499, 294, 240, 101, -144, -308, -520, -215, -87, 179, 102, 445, 623, 151, -147, -30, -89, -364, -157, -66, 383, 280, 418, -173, 152, -117, -149, -165, -98, -132, 406, 372, 266, 153, -143, -111, -291, -350, -416, 39, 250, 255, 108, 181, 115, -97, 85, -126, -640, 192, 226, 243, 123, -109, 86, -157, -54, -261, -47, 194, 107, 412, -184]
2086a84L80j56l3j51K67l19J88J39K92j8l24o6j09j61J56Q1O1M1L9j52K08l57
2108a78o0K2j57K18K11K86J5j20l04M55m12m84K4N10k34M20K0J05j78l54K15j67
2130a47R9q3J48J98J51k26P1p7l58J33N9k44L78l51M98j03P0r5J2k27R0j75rK22
2154C4J15R5j29m28K02j06J3J78k02K06K71m38J70Q9o9k09J56j22J88m3K4L12
2176C07j03l33J94%j08j79K41P9p6J07J24j93m03K85Kj08n8K48K0J24j60K61j51
2199A20j32J08j45L18n39K43l4J42J46k60M4Mk25KJ85K17j14j13L70n9k74k02
2221a98J75R5k2J93k98J84k04K30k01L5l37J77J96j27J95j63K92r9k65p3l9M20
2243A66m50J74K44k53K59k50K59m04L44k37K49N6m39L46N5O8j66k03R2k53P1J86
$$ y = [-184, 196, 40, 7, -144, 123, -196, -8, 131, 423, 405, 81, 15, -94, -255, -99, -18, 43, 84, 123, -29, 179, -178, -238, -216, -373, -155, 56, 342, 357, 237, -67, 388, -24, -508, -484, 26, -208, 212, 232, 337, 159, -195, 20, -147, -48, -131, 17, 215, 366, 140, 211, 134, -224, -91, -32, -276, 102, -249, 249, 146, 216, 121, 133, -94, -4, -179, -188, 34, 149, 244, 115, -313, -111, -217, -204, -26, -228, -22, 249, -189, -19, 70, 1, -208, -52, -174, 14, -29, -5, 307, 204, -129, 65, 65, -43, -222, 19, 98, 22, 129, 253, 60, -343, -58, -56, -164, -222, 26, 46, 170, 10, 271, 120, -12, 96, -49, 269, -270, -27, -61, 81, 227, -33, 11, 15, -210, -208, -23, 194, 80, -33, 337, 278, 4, -198, -23, 72, 50, 243, -55, 129, -75, 155, -46, -11, -348, -171, 25, -102, 93, -70, 222, 123, -142, -215, -254, 166, -284, -110, 134, -119, 140, -110, 149, -255, 89, -148, 101, 157, -282, 64, 119, 187, 21, -182, -90, -343, -272, -86]
2265h6L2J4J1K34l21n0Q0o3j7J21J69J33r5j12j37J1r9J69kk90K87J92j05J8J30
2290B24j58l92L4M14m0j7J36k10K02j37k12J11J99n4j09J25l8j3M8k10K85k79
2312i1oJ21j3q5O3J5J65J27l68K48k72J93N8l10L10r3j04M2j56J7J41p2J76J07
2336B13m36L76K98k34P3l73l6P9M7J0K3J02Q6r3m7k45O8o2J33q5P1j08M36n0m35
2361a89J88O3j42k29K3M53j69j58M10J58k50k6J64k56o8%RR7j27M5j3j37L71l24
2385a07K8l3K00r9K85r9k60n0K1m9j17N53l18K15q0J29o1p1m19R0L65j97j06j2
2409a92K09R9r7o7p7r3P6K7K98l1j70J49j09K78l72j28J62J7L2r2J90n1j62J52
2433D8j9j0m1n6O0L6J27P0j87R5j43l2J8P3j97K39J28l91N22n37J53J39j47K6
$$ y = [-86, -54, -40, -29, 205, -116, -166, -86, -149, -166, -45, 124, 257, 162, 50, -87, -76, -175, -6, -8, -298, -11, 181, 76, 94, 224, 66, -326, -292, 122, 82, 65, 201, -9, 193, 56, -156, -45, 154, 100, -9, 116, 78, 65, 113, -97, 188, -91, -97, 24, 11, -74, -11, 4, 169, 296, -72, 176, -96, 97, 155, -155, 155, 62, -42, 0, -156, -139, 2, -70, 106, 213, -223, 153, 451, 217, 290, -83, -119, -40, 7, 17, 40, 142, 228, 135, 88, -157, -89, -151, -18, -103, -32, -140, 296, 246, -189, -1, 62, -80, -309, -286, 167, -2, -160, 250, 408, 158, 132, 296, 40, -28, -28, -19, 78, -49, -4, -17, -154, 217, -107, -79, -112, 88, -11, 274, 175, -85, -135, -114, -163, -280, 273, -45, 170, 90, 219, 158, 87, -332, -242, 123, -74, -180, -192, 17, 116, 19, -48, -125, -218, -142, -115, 183, 152, -18, 131, 22, 300, -72, -200, -38, -21, 11, -81, 109, 58, -104, 48, 29, 19, -22, -78, -18, 18, 145, 215, 28, 123, -20, -52, -34, 39, -158, 81, 209, -182, 340, -197, -44, 95, -52, -26]
2457b6j54J61m9J66r1K1j15j55LN6l9L27r2K77j52K09l19n0j88j95M61N4j52L02
2481B60k63P0M4o1k47R3J47k86L26KL3Rj18j47J06j16J30j42q0L03M0j47N0k39
2505b33J5K6J42l3j03M11j0qj57K21n2l38k86J98J34K35po1j50J0J27P2K5l4k66
2530a22M08k83n4M7N6M9oj81q6J35J38M9J2j1J85l40J67l12qK08J26l22L27j25
2554E7k47J88o3K80j25k77L77K6J44l62j58Q5J67k93K90j18J18J22j34l30J47
2575a06%N7k2J45o0n8J72J29l66K05j12j68P8J95l06M6K88J45q0k0k15N1l37M19
2599H0q9J06J78k15N8p5k2k11K33j78K54q4K77j19kr5O9k14j62J5L65k22n5K41
2623A33l8L0k11qj23P4K04n7J34O2j78K17l43K08m17L0R7L88q7M2P8k42P0N1k80
$$ y = [-26, -180, -19, -68, 98, 7, 28, -87, -242, -239, -183, -222, 105, 13, 290, 138, 347, 28, -22, -210, -405, 56, 110, -42, 260, -3, 67, 111, 50, -197, -104, 43, -243, 83, 85, 118, 127, 9, -138, -32, -148, -18, -160, -240, 63, 103, -44, 6, -233, -218, -192, -50, -83, -186, 225, 215, 207, 50, 271, 219, -119, -405, -207, -73, 162, 155, 94, -56, -46, 81, 153, 178, 144, -122, 286, 3, -51, -4, 52, 101, 95, -86, -172, -37, 101, 150, 162, 151, 336, -4, 163, -149, -157, 51, 177, -145, 182, 57, -190, -2, -65, 215, 90, -187, 190, 216, 360, -2, -160, -75, 92, -201, 89, -29, 89, 211, 77, -253, -106, -106, -49, -71, 74, 14, -44, 128, 257, -109, 96, -16, -184, -106, 89, -217, -171, 117, 262, 182, 162, -53, -2, -339, 80, -9, 97, 275, 60, 118, 43, 21, -190, 43, -135, 119, 35, 312, 193, 191, 96, 165, -49, -211, -196, 169, -53, -108, 133, 95, 125, -86, -94, -217, -143, 61, 4, 138, 200, 22, 239, -104, 104, -313, -283, -186, 202, 115, 157, 235, -7, 63, 114, -166]
2648a66j63K19J32j97K60l4J9o1L4l72J62K70K9k80k3K74l43M00j13n2o1L3J56
2671A23j45j53L96L1k54L00n19P3l6M9K42j82M7O9J74k57L2k62j0J64Q2J97k91
2694a30J24M1J64r2k46n5J96M2J11r8J17k47J24k14p4J81j38M64j22k62J87k5
2716D8k11P1J20j99n8L69q4l8OqK81j56o0l48l5K26J30M3j93O9n5K52j76j5L0
2741Ik17L76%r3J1j49K23j02j61k10K20K0O2qJ5J18j43k65K38K4K61k00j46K45
2765A28j25k12K16j07j17j15J58m5N40l83K65j4k4n8l48j55K92O0M0J1j86N4K62
2788A37k58K68j16o9n1J79k0l8j18M1Q0l21L33j02p8L32lj97j78L39k41o6O3K27
2812A43n5k83M54k99K03q5J64m73J91K1O8J14j97K13j21k91N51k03k13J01O3j5
$$ y = [-166, -329, -110, 22, -175, 85, 51, 70, 9, 43, -329, -167, 103, 132, -148, -171, 103, -240, 160, 47, -5, -66, -33, 123, -22, -175, 221, 252, -2, 298, -221, -148, -184, -135, 107, -75, -28, 41, 215, -42, -10, -272, -282, -118, -36, 161, -130, -6, 35, 199, 107, -139, -194, 2, 44, 155, 57, 174, -73, 51, -163, -237, -56, -194, 270, 148, -114, 73, 48, -163, -92, 28, -171, -229, 140, 56, 18, 24, 16, 297, 141, 81, -267, -302, -76, 54, 97, -96, -27, -82, 170, -6, -21, 9, -208, 168, 168, 75, 86, -63, 160, 58, -103, -313, -93, -73, -11, -19, -4, 114, -29, -294, -56, -32, 229, 29, -117, 128, 3, -209, 7, -100, -217, -332, -174, -219, 321, -62, 203, 189, 165, 107, -241, -396, -104, -44, -4, 7, -179, -125, 137, -121, 147, 31, -38, -89, 90, 70, 32, -86, -45, 35, -286, 47, -55, -133, 199, 196, -1, -179, 160, -81, -147, -84, 143, 88, -195, 259, -40, 163, 78, 242, -231, -40, -19, 49, 163, -34, 179, 58, -233, 318, 115, -98, 3, 66, 51]
2834E1N8K1l78J51J45p5r7P4K8L5k1K79k27K8j69N2R1P1k03j56L95j88J60p0l6
2859A9q9j16J93M9k65J81k73O89m51nk31J24L5J84j63k97N14l4J18m10P7Q2K56
2882A87l53L19o5%l1r9Nl46M15N2km45L98J13l11L26l96L28l84j08N96o8l7j0
2906H4Q7l39M51n32K6L08n3j29J08J57o7rJ79j29m20m1P7L77l33O9O2j8Q7J10
2930A12k50J1m8M96j95r7J58j90J18j37l34L65k70K07j37J77K93l26J25p9m6K3
2952b4j32R7j15J71O9j64J77j20n4J36K0k84K63j40R7J13o3j83L40l96M8J85l
2975C8m2j14J32j04K71k24k10K95l32K63J93l08J16L88j60j88j22n7J15L60k73
2996C7j24K01k03M0J26j35M1L2K82k21J7j19P0J26l9j10L72p13J78m6M12k78j54
$$ y = [51, 109, 130, -248, -97, 48, -27, -124, -50, -22, 13, -8, 271, 44, 72, -97, -45, 46, 117, -86, -242, 153, -35, 125, 55, 19, -70, -186, 7, 56, -209, -28, -301, 388, -63, -68, -299, -175, -140, 44, -119, -416, 98, 64, 182, -228, -151, -69, 187, -166, 153, 88, 88, 57, -42, -37, -383, 32, 84, 82, -363, 35, 148, -163, 163, -233, 95, -289, -397, 199, 131, 94, 84, 171, -168, 283, -249, -223, 85, 32, -97, 11, 168, 101, 92, 271, 142, -278, -319, -242, 135, -198, -129, -67, -85, 2, 112, -138, -127, -175, 321, 126, 29, 187, -3, 115, -22, -356, 9, -261, -54, -191, -14, 279, -47, 78, -1, -47, -24, -156, -59, -174, -3, 66, -98, 79, -41, -95, 41, 61, -223, 40, -100, -3, 110, 47, -136, 204, -192, -144, 41, 38, -4, -118, 14, -90, 181, -43, -253, 42, -290, -27, 166, -142, -26, 362, 202, 14, -108, -165, -50, 310, 37, -87, 114, -89, -49, 77, -58, -17, 15, 297, 76, 93, -26, 44, 170, 131, 21, 393, -320, -142, -188, 224, -54, -208]
3019b08K35J32j50p2j49p0K56J10k65L34k08j42J0k9L1Q4rJ09j4J10n3r5J99k85
3043a39J26j00J94j03JJ07q3j2J73k52l6K55l69M26j40m1O7k13K23p9o0o3JL56
3067B39k32O6k25L88j86j41P8p6N0J12R6r7J24k98K41n98M57lK5K0n2J09k99K46
3091D4J49j74M3k05J20K48l10L71l47L67j75N3j21N7k16J26p9Pj37J51Q5j98o5
3114b06R4K05q1J62M8j40O7j70J15l8J73p9O4Jk24K15j54j80L57m37J73K86k35
3137A6R2j72q9MK18J07k01k7j17K95k9J8r5J0m5o3L5M8l4J90l40K11j43q2q7M00
3163A20J66k19j61M5k36L07rk17J70J51j84Rj13J80q0L58k35nL2j07p5L7R7O2
3187I3j98J73N8m16L24m44L52j43J17L7L43r3k16O7l16J64J97l1M9j40L3n5K42
$$ y = [-208, 27, 159, 9, -63, -212, -282, -26, 84, -181, 153, -55, -197, -187, -216, -185, -101, -110, -1, -15, 95, 42, -53, 146, -139, -13, -113, 81, -22, -21, 86, 3, -9, 164, -88, -124, 131, -238, 188, 48, 7, 74, -139, 84, 5, -55, -118, -117, 239, 7, 73, -152, 236, 50, -91, -13, -89, -39, 73, 169, 72, 196, -102, 139, -459, -2, -5, 20, 40, -12, 97, -202, 44, 193, 19, 62, -143, -23, 225, -85, 286, -61, 306, 131, 184, 63, 120, -96, 30, -49, -42, -179, -28, 57, -141, -206, -112, 93, 12, 174, 222, 82, 149, -21, 94, 56, 229, 150, 214, 215, -9, 206, 52, -128, 229, -208, -35, 251, 16, 108, -64, -153, -149, 69, 176, -25, -52, -169, 126, 97, 115, 20, 30, -15, -78, -43, 5, -29, 161, -179, 32, -111, -193, -280, 120, 286, 67, -94, -49, -285, 22, 13, -204, -34, 117, -67, -58, -171, 9, -71, 287, 52, 47, 79, -28, -103, -66, 31, 93, -105, 68, 126, -290, 34, -410, -58, -201, -84, -47, 296, 203, -13, 54, -262, -98, 99, 68, 117, -23, 10, -45, 197]
3210A97k82J90k55K23k57m9L09l61J66L74l14m88P39m82M39k27J40r0N8q9j3P2
3232@K55k21j44R3L05k82P3K1k64K07j61J90J46n07K09O4j14R6r1J37j65L47m9
3255A45K3l9m27M26M7o1l45L00j24J92J65n21K75Q3k98K52k17L55k64J85l20n8
3277b26p2J95j2L01Ml82K81q5j78J1pJ20j87J91J58j04j5P8j32j29J86j49l4J49
3301c8K5N3mQ5L6K6k92J65k63J39M14n07j2M84l82k07l1M42J02j08k24J9J69K
3325I3n0p9K08n15L04j70R4l6J64L2J87m38K24q9K28r0K03l35r5J94m0J50M8j28
3349F4O2j17K38K5k22j04N23p94L04k80Q5J97J96j5j70k75jJ32k01M35n9k00m1
3372b18K68j79Q7j00L47k56J40l16J28l3J58j64O5J41k61M0K10J17j68K73l35
$$ y = [197, -85, 105, -150, 73, -184, -233, 76, -285, -119, 255, -59, -547, 192, -290, 149, -78, 62, -28, 30, -59, -72, 0, 255, 34, -110, -17, 288, 6, 79, 100, -164, 43, -118, 72, 218, -289, -80, -16, -130, -34, -125, 12, -153, 194, 145, 168, 129, -298, 128, 175, 114, -231, 69, -55, 137, 302, -219, 56, 139, -159, 93, -124, 231, -33, 152, -168, -226, -298, -103, -115, 186, 190, -192, 89, 4, -174, -163, -170, -50, -237, -46, 112, 8, -7, 71, -61, -190, -4, -153, -187, -38, -13, 40, 36, 121, 157, 183, -109, 56, -207, -68, 346, -161, -173, 311, -71, -278, -309, 133, 235, 127, -97, -78, 91, 93, 43, -36, 172, -343, -39, -209, -115, -151, 13, 45, 232, -206, 18, -71, 157, 67, 270, -65, -160, 34, -6, 144, 192, 64, 126, 9, 247, 272, 50, -54, 469, -325, -21, -301, -216, -19, 177, 162, -8, -283, -284, -152, -353, 82, 23, -177, -218, 50, -129, -42, -142, 205, -51, 89, -227, -99, -132, 26, -138, -73, 68, -193, -153, 57, 174, 6, 279, -56]
3393e6L3j38J08L71m13K83j47k7J32M0qj29m2L1J9p2Q3j0k73L00q5P5j08J60O0
3418A87P9k74o6j66J45j85J76Q3j45J55j45K38P1k4j24j20L17j88j26J81J10j84
3440eO9j77L30k9m87O56j96j06J92k52P0k82J70J92j29j35O1M75j15j50l54P4
3462a28j24J63J22j26Q5J35P2k81M1q3J00J17K42l58r2M0M3K75o0k05j30M5l9
3485a46J63K70o00K35L25k56N4L7P2j74J91o7Q4k19M0np6L39l52M2J47j11N7k35
3509a85K71l63K22J56L6l32K11j01J91q0kr3n0L3P9M1p0R7J14l00j46N58l60J95
3533A22j07q3k64M00N9l2O1l0J76k87k3J10l0j9j1J53j91k03K65j08j04J11K4
3556a1j03J82r3M9l33L71k18K33j27L6l10M32ok05K28l20L22l76M23k78L9K4J98
$$ y = [-56, -23, -161, -53, 318, -95, 188, 41, 14, 146, 186, 178, 49, 7, 38, 57, -15, 68, 58, -215, 85, 0, 75, -33, 127, 187, 266, -8, -74, -240, -95, -280, -104, -21, -166, -11, -156, 82, 153, 129, 5, -115, 202, 14, -112, 69, 179, -5, 64, -113, 217, 188, -299, 357, 161, 55, 247, -5, 65, -217, -47, 145, 16, -119, -58, 417, 302, 152, -202, -128, -252, -89, 33, -93, -8, 127, 199, -82, -41, -124, -24, 93, 335, -23, -115, -75, -32, 243, 183, -22, -152, -107, -146, 17, 287, -313, -78, 247, -9, 45, 82, 154, -20, 171, 104, 188, -31, 9, 4, -72, 267, -85, -43, 104, -7, 50, -185, 86, -277, -55, 101, 137, -195, 16, -85, 106, 26, 24, -69, -119, -86, -7, 34, -36, 61, 175, -125, -271, 287, -73, 122, 15, -68, -332, 68, 127, 95, 156, 126, 302, 15, -8, 102, 72, 53, 42, 195, 4, -199, 66, -42, -146, -35, -11, -114, 68, -25, 24, -309, 62, -156, 77, -50, -14, -324, 108, 102, -103, 125, -195, 127, -249, 174, -104, -65, -41, 157]
3579A57k41J58K2j66L05j49K03n03L3j1L2K64m4K09j34l87J38K05J95l32L13l33
3601f6rQ7k38K74r2L2r8K65k54JK8K5P3J55j79O4k48LJ99J23j53J50o3k39lK40
3627G7j82J44K15k01j29J68j85K4J75J23m99K38j2J6j44K80Mk57K16j07L10l10
3649c6K10n7k73M3L32j70j46J59o7J5J28J79q1j42j01k22L47K0m57N82j38j44
3671a9J17j81K45j60p4J00j0r8N0o2j62L43Nl11M23l91M39m50K59k25O13l13k9
3694A09k26K30j27Q1m6N8L7r6k29K25j84J09K97l27J61k57J23o2L07k60J18K07
3716B48n7j39m1JN9k02J12K25k21p5j8RK1J41j64K17J80k73j01J74p9K7k72K66
3740C8n8m6N4N1j34K60l70m9r2K99pl2J75l04K41m10M36k73J24M19l93L26j13
$$ y = [157, -84, 74, 96, -70, 235, 86, 289, -214, -181, -192, -160, 104, 60, 269, 135, -252, -114, 91, 286, -46, 267, -66, -75, 12, -226, 48, -44, -12, -110, 155, -99, -98, -70, -45, 28, 183, 4, 68, -180, -177, 22, 145, -8, 142, 79, -160, -163, 77, -105, 39, 254, 53, -76, 92, -93, -69, 106, 229, -270, -32, -44, -28, -172, 108, 112, -145, 71, -36, 274, -36, 174, 117, -156, -113, 219, 49, -97, 62, -5, 10, 138, 317, 236, 94, -7, -229, 118, 138, -319, 263, 125, -19, 98, -83, 162, 2, -72, 28, 18, -80, -30, -92, -254, 89, 94, -217, 206, -185, 254, -196, 63, -162, 451, 138, 109, -117, 113, -14, 67, 21, 79, 116, 20, -209, 16, -168, -59, 238, -89, 72, -185, -62, -124, 183, -77, 41, 248, 191, 52, 11, 12, 71, -131, -19, 206, -15, -90, -108, -99, -78, 63, -101, 116, 296, 23, -78, 96, 17, 44, -228, 38, -20, -66, -12, 39, -95, 165, -205, -254, -346, -47, -54, -86, 89, -215, 26, -384, 52, -221, -97, 322, -71, 255, 142]
3763A42j46J01l2j82O9M7j1l42L12L79k09P3j94k27M27k68J03K1n7Q3J55j90K4
3786G8j18k33J91K76j78K40mk53j17J80j91p0K08j23M8Q0j67L32k20J17m08J78
3808a54K26K8k93K89j93Q4k63M09l8J19o8m30K29J04j36J66j00j14P4j61m5K61
3830fK40k72K3K22k76K41Jj28J22l57J22J38Q0j81p1MQ4J7O1M8K96n65J44Kj67
3855a78J97j28N5k19O3J24K74j18M0o7L13q0l10O3J49l6j54J97m03J54L19l37
3877h2N5l00M89m9l07M35k58M9r6n8O8j01J89n5J46n2j16K38RM6l85J06k56K54
3901c1J21J37Q9j46O2k12j12J5Q9n2rJ32r9K19j21j38q6m9K4K44l59K99K9L26
3925C72l57j89K79j82Qk9Q2K3J29l82p7M05j10K58k89lJ03j65L19m83N09k92p4
$$ y = [142, -4, 97, 65, -117, -48, -1, -12, -354, -42, 337, 128, 201, 7, -220, 207, -61, 42, 63, 6, 89, 244, 54, 78, -40, -273, -82, 194, 16, 256, 252, -1, -118, 62, -129, -199, 9, -114, -66, 14, -153, 179, -41, 76, -332, -154, 72, 100, -193, 96, -97, -13, -276, 133, 95, 214, 146, -284, -55, 49, -87, 79, -21, -135, -61, -222, -267, -6, 234, -38, -15, 207, -69, 172, 173, 45, 167, -190, -68, 70, 150, -31, -102, -98, -14, 3, 64, 112, 408, -157, -13, -11, -178, 19, -109, -54, -273, -210, -86, 188, 70, 110, 43, 356, 276, -34, 29, 178, 142, -12, 185, -218, -64, 255, -82, -27, -327, 162, 113, -194, 241, -17, 32, -64, -122, -54, -155, 34, -21, 125, 73, -43, 195, 204, 250, -135, -29, -285, -31, 90, 227, 316, 170, 232, 20, -92, -77, 12, -40, -49, 83, -16, 203, 82, -56, -142, -191, -167, 77, -282, 17, 46, 372, 15, -174, 105, -77, -69, -98, -16, 7, 136, -246, -323, 82, -28, 230, -59, -62, 41, -124, 195, -288, 221, -71, -145]
3948a45J22j96J64J71l28J64J89j12J70l18J77O0k04J20j21J72R0L0l42K28j05
3969a4l64L28J9j93N47n20o1M77l93K51j10J13l51M06j26J08k76PK05R9K2k69
3991i5M0J26k2J66l27N6k09L21J86m59K23L12l14kR3l43L92l07K46j82j53L08
4013E6l4K00m29J76Nm2o3M1k52K31J17l39K82K24q2j59L4j18j10L98J01k9k55
4036d7R4n4k38K92l3j08kK95k87J47j12p2Q7J0j24L41j28p8j6j6L62o70K05K13
4060F1l5j49J76l05L89j40J18k16R9j1Ok06J27J15Q6K1j28j14J08n9P1O4J0k42
4084a54K57j33K92jl15K33k85L1P6o8P1J05j05J29k27K30l22j5J77j23M32k11
4106G4l13K85j16M3j19j6M7L11l25K54n1j19P2p2J95J63o58M57k73P0j8K70j3
$$ y = [-145, -23, -219, -55, 116, -212, -48, 141, 29, 199, -119, 58, 118, -86, 34, -87, 85, 175, 205, -137, 91, -14, -378, -50, -31, -224, 323, -197, -258, 219, -174, 77, -33, 80, -271, 135, 9, 117, -159, -152, 53, 152, 174, -95, -55, 71, 49, 215, -112, -56, -265, 56, 242, -217, 6, 318, 4, 2, 95, -248, 144, -163, 83, -99, -252, 56, 22, 222, -207, -31, -26, -68, -131, -90, -342, -111, 6, -333, -51, 173, 91, -68, -34, -152, -262, 136, 237, 208, -47, 47, -7, -245, 47, 14, -94, -96, 199, -88, 59, -53, -125, -38, -28, -152, 189, 61, -17, -33, -49, 313, -357, -152, 61, 26, -123, 53, -252, 137, -3, 115, -101, -2, -13, -7, -213, -86, 29, 115, 136, 8, -106, 2, -57, 14, 78, 88, -154, 103, -30, 262, 261, -54, 179, -106, -75, 1, -67, 4, 109, 4, 133, -94, 136, -186, -201, -24, -147, 285, 74, -239, 46, -70, -27, -146, -162, -115, 196, -129, 125, 74, -45, 27, -45, 150, 313, -345, 112, -161, -91, -109, 161, 148]
4129A48l05L39j87M4m1Mk20L78p2l1J81N6j29%j85j46K09j05J50k56J07K43j01
4152H1j59L25j1k86j92L29k44M74j02k2l27J24J3j21J22j86J75Q9n8j47J14k11
4174b20K75jm0Q2k64J74lk97J12L16j49NL37l83n2r0M95l76J11l1j07K52q6m8
4198A2n1Q3j4k24J79j76o0J67K34j61k48N49j63k22N0J80r2j17R2j58J62J18l4
4221A06p0N2k37K39K06k89j40K82j60K89j32k55K01K5Nn7J26k96q3K39k2j52J00
4244b3P0k50J52M5k45J46k1J66J99j18j24Jj83K89K9l48Q5m4L49j12j46kL25l88
4268a48L86l49K76j94Oj05K60K6l9k78L8K30j64L3J3L8O0l02J58Q7j28jK81O4
4292B48k46m8L1R3M4k91J0L81j77k42J00L12k2m69L17j87J95J61k56q0K81m9k29
$$ y = [148, -157, 182, -5, 39, -2, 2, -218, 160, 88, 57, 238, 294, 165, 165, -20, -166, 43, -62, 88, -168, -61, 182, 81, -78, 247, 236, -50, -242, 87, -157, 317, 215, 193, -134, -10, 3, -118, 4, -182, -7, 82, 24, -123, -9, -220, 55, 54, 14, 96, -168, 6, 3, -294, -182, 134, -15, -10, 327, -56, -108, -198, 297, -79, 32, 1, -106, 146, 60, 12, -39, 44, 30, -194, -15, -191, -251, -84, 150, -11, -259, 290, 127, -95, -45, 135, 43, -74, 18, -140, 22, 140, 106, 36, 88, -149, 90, 296, 7, -133, 149, -11, 278, 146, -109, 92, 117, 122, 65, 191, -105, -188, 51, 29, -123, -23, 47, -203, -51, -6, -251, -105, -126, 40, 239, 121, -3, -2, -185, 104, 133, -215, -130, -174, 175, 63, -83, -85, 240, -148, 238, -111, 165, -29, -23, -128, 132, 158, 119, -159, -121, 109, -55, -22, -9, 29, 89, -213, -55, 32, -96, -97, 184, 248, 2, -46, -15, 78, 122, -169, -159, 222, 45, -197, -97, 215, 193, -276, 41, -146, 49, 210, -46, -126, 155, 106, -123]
4315a23J29J1q5K28j71P4p7M7n7N09m54j66N5P9q7Qn7%M7q3Q9K04J25p5k62Ok2
4342a08k9M82m02j8jJ62LK96m82P8m2qk28O9Q0j4J94K20l05l27M06J00j79J21
4366F8J96O1k71r3p9J22l90M33J96K9j35n39L35J70j73P2j20K37l03K42p4R6J22
4389B02M4k11J45l68R7k13K27j9q6L77k75J62p5n7R0J61j63j03NJ52M2l54K01
4412a9J33j44om4JO4J33l05K36j01o8JJ61j08J69j50R4K13j28k04L92l23q6j25
4436b14K94j39K6K14k5l17J18j15QO6j56KO5K56k06j3J42L62m23mn5L15j08J5
4460A08j25J01P7l06K9M6J73J8J9j31L0r9K09j64j31L89k56M6k41L33k52P2l8
4483i3j01L76l28K01j85J72J85k11j19J69L0j66J13k00k8K13m7J13j39L00r6k04
$$ y = [-123, 6, 17, -68, 160, -11, 63, -14, 33, -24, 485, 31, -135, -80, -1, -88, -80, -137, -137, -90, -173, -84, 120, 245, 170, -92, -86, -108, -137, 345, -57, -75, -76, 86, 89, 385, -97, -19, -61, -69, -297, -228, -148, -162, 32, 252, -53, -380, 26, 126, -53, 68, 264, 325, 54, -39, -118, 4, -386, 47, 243, 272, 137, -402, -67, 103, -70, 2, -118, 119, -184, 58, -16, 80, 202, 246, 35, 180, -188, -91, -304, -77, -96, -182, 195, -80, 82, 7, -50, 40, 201, 38, -65, -60, 92, 134, -220, -19, 114, -30, -36, -80, -79, -15, 118, -187, 49, -52, -120, -119, 42, -66, 103, -47, 47, 260, 132, -72, 320, -3, -89, -214, 80, -59, -33, 181, 156, -161, -43, -158, -150, -84, -240, -238, -173, 83, -123, -136, 6, 368, -55, -59, -114, 201, 93, 108, -17, 84, 161, -145, -116, -70, 103, 121, 140, 9, 39, -60, 149, -15, -146, 243, -13, 33, -208, 125, -127, -55, -93, -194, 182, -146, 55, -130, 42, 227, 16, -103, 66, 96, -70, 43, -157, -185, 28, -19, 94, -45, 255, 159, -45]
4505d5K03m8P6l25J72J5J66m44L27j38j07NKJ69q5j70K83j19m2N9L4r2K48p1O
4530G9j49l7K76m62M01J51l37N2J0J17J0j72K23nK5K7j58k78m3N00m93J72Q5j02
4554a08J39l5n5R0j12k38K82J11j75Q4K9N9j66J97j08m7L5L85l22R1j9J28l29
4577h4J48P5k10j40M02l33K06j6J7j35n2K34j24k20L34j28l0J68j95J67r1P4r0
4600b3l5J17K80l48j37J98N0j26q0Q2J07r2p5j45K16O1K14j70l44M25m20QJ74
4623f3l6J96J33l83L21Jk95n2J53l0k22J97j6J9Q9J60j85j13j70M44r7r3j33K05
4647C0k18R4L22J1k19j90M1L20k52j3J63q0N7l15M52j20k50j18L7J60j82J15N9
4670i6J92M9J1j9j28k7J50mRl7n6j34j4l03L99o6J43k97L79k80n3J49n7J75k05
$$ y = [-45, 158, 110, 186, -139, 33, 48, 214, -230, 97, -41, -148, -143, -141, 28, -57, -227, 56, -63, -105, -46, -12, -104, 144, 73, 79, -70, -107, 169, -293, 108, 259, -78, -26, -16, 101, 111, -61, 162, 157, 182, 209, 51, -227, -270, 230, -263, -91, -6, -108, 31, -4, -59, 31, -81, -319, -37, 74, -101, -17, 12, 71, -95, 102, -6, -53, -18, 367, 45, 136, 117, 245, -84, 64, 139, -71, -211, 191, -142, 64, 48, 65, -70, -122, 112, -12, -232, 102, -26, -56, 112, -83, 84, -7, 67, -23, -58, 59, 339, -9, -146, 52, 102, -24, -104, -22, 85, -7, -82, -227, -11, 50, 264, 94, -250, 175, -245, -237, -63, -99, 97, 230, -153, 168, 169, -126, -178, -25, -55, -277, -80, -96, -77, 12, 172, -13, -126, -296, 148, 51, -42, -175, 30, -188, -94, 228, 239, 20, -170, -129, 191, -61, -74, 89, 9, 66, -249, 203, 83, -167, -285, -248, -88, -270, -155, -96, 96, 145, 156, 137, 9, -18, 132, 128, 137, 100, 44, -90, -104, -407, -8, -74, 69, -228, 151, -129, -182, -33, -90, 85, -120]
4695a20k4J47NN4j48L7j18Q1L99n58K87J35k13L01l81j2l7M26o31J51M09l00J43
4718C3j07KO4qo5L36k41O1j93J06K32j50N3J06l41J3J38j01k16K52L93o89J13
4741b09M1L15l1Lj45N5j31p6K65J8r4k49J7K81j14r6J86Q5m24M03l28J37q1L35
4765A63k69O3j41K56n4j14P9J54j71R8j12j79J58K82m6j77J18P5q3J4j33N8Q2
4788A21j10k74P1L74m31J88k9K0m2R7j44O9j36RN37o62K44J65j83L17p4k31L25
4811B21m59L30k66q1M7n4N55l54L21l42j25J58Q9m7K4j17j56J67M1l8o9J5J75
4834C5j05n2L47k93m7m1J50l06L50J03k55j47J84k32M31l27L75r4r5K18l03K60
4856A56j71n1JJ03J37K0m3k84J28L6j59K50j32R7j38J34j03k2l6Oj08m2K48j9
$$ y = [-120, -144, 3, 8, 62, -86, -49, -167, -86, 313, -245, 42, 177, -36, 265, -116, -128, -165, 261, -370, -219, 190, -110, 33, -74, -72, -8, -16, -81, 255, 14, 75, -118, -12, 220, 70, 123, 229, -112, -99, 39, -62, -278, -26, 367, -322, -209, -168, 147, 116, 119, -26, 29, -102, -178, 87, 105, 11, -238, -221, 60, -54, -150, 36, 121, -303, 100, -228, -91, -172, 163, -106, -43, -184, 72, 18, -96, -17, 137, -34, 64, -48, -227, -69, 213, 167, -10, 108, 183, 100, 114, -19, 39, 121, 11, -263, -192, 182, -249, -61, -90, -70, -112, -15, -159, -90, -226, -217, 320, -342, -98, 67, -116, 201, 127, -104, 221, -238, 92, -174, -255, -208, -262, 293, -61, 260, -82, -207, -49, 40, -7, 17, -100, -256, -89, -48, -86, -155, -140, 35, -70, -122, 225, -68, -115, -156, -6, -312, 38, 141, -114, -261, -77, -309, 122, -205, 170, 76, -19, 199, -104, 156, -15, -66, -65, 38, 175, 195, 152, -132, -4, 32, -127, 123, -9, 88, -50, 84, -19, -41, -77, -71, -179, -221, 27, 8]
4880Hn7j02J00K81k68R1l9K04k50m5k10K16J26n1q7L8o6Q4j3l3M35n85Q9K54j11
4905Ij60K70L4m28J89J24j73J20J16m8j17P9J5j73J36oK7j18j1J8O7n6j20R8J59
4930E1L8K1j56J9R1J2k93K63Q8l34Q1L43o0k32L9m0J99j89k0j6N5K02r8j81j2
4955a29M8J29j92J85j71J65p9J51j51j19K74k14rJ3Qjj82K44J05K5k56J22j04
4978a38P5K61m04M03l3j3m71K31j1l2K22j64J79j22J02K41j91j75%lK06j7k13
5001f7J57N1j08J78l59K60J8l32L90o4j78l6P4Q8j94J26O7l03n2L18J17j70n7
5024g6J70j17J81l61R7N9J75k5l3l23J55N0J05K83l24J78l17L80l8l61K10j43
5046g5j58J75n3q4J75J4P0p5r9j41M22j39L85n35K00L1j34K27N5k58o4J02j05
$$ y = [8, -49, -151, -51, 230, -38, 53, 14, 218, -32, -77, -287, -71, 55, 4, -83, -45, -111, -27, -40, -73, 362, -223, -134, 120, 9, -151, 119, 153, -275, -86, 38, -135, -15, 101, 53, -64, 15, 30, -143, -7, -13, 14, -104, -115, -97, -30, -86, -206, -108, 51, 89, 110, -46, -27, 64, 76, -217, 46, 134, -200, -119, 224, 164, -68, -29, -69, 130, -59, -79, -95, -40, 162, 64, -117, -129, -81, 48, -144, 41, -130, 35, -44, 107, -44, -163, 111, -103, -112, -99, -91, -92, -274, -30, 75, 100, -156, -34, -138, -63, 198, -206, 197, 164, 151, -320, -89, -100, -132, 90, -74, 105, -17, 85, 326, 135, -40, -40, -43, 163, 146, -67, 90, 141, 33, 211, -148, 112, 130, -202, 188, 124, -54, -90, -16, 72, -122, 4, 71, -232, -284, 34, 151, -19, -76, 94, -23, 158, -203, -106, -47, 128, 103, 70, -253, -98, -48, 57, 340, 16, 194, -123, 257, 219, -142, 68, -75, -233, -58, -111, -195, -20, -6, 64, -11, -110, -251, 171, 32, 417, -118, 82, 113, -21, 206, 261, 3, -61, 41, -64]
5069f4J80m19K56j81M12k1m1k79M91j02j85o6J07k33L34j41qL11j49k45mP1J42
5092A66k08J52j54N5J16k87J34Jl8k38J76J56L08k59j00R6J45k26J87l82K16o0
5114d4k43L33K2k03pm3K72n8qP7J92k28j49l4K46k52J83km3n4k4m4j6K43p9K8
5140F5J23k50o9j14J71Q0l3l6J80k44J0J54k49M27j45r7l4J93k4j72L52k01k0
5163F7j63K11j69J67k19K52n3j6K56j34L1l33K03l06K69J85j49J51m33L49l61
5184a95K64m34M59k08n9lR2J35L9j97K98k55J00J04k63L8K7J79k70j52K30L17
5206B46j69K44m08J73l57J96j7K5k50L19j69K37l82M47rj85R1n7q4P8K9Nn3k40
5230b90K74k09K93k57J41l1J73k53j23J89q6K60j12m6J48j17K49l00n7R9j74K82
$$ y = [-64, 116, -303, -47, -228, 184, 163, 122, -157, 334, 232, 47, -19, 88, -145, 189, 48, 40, 351, 202, -43, -47, 24, 166, -42, 110, -44, 11, 127, -160, -26, -25, -63, -301, -125, 31, 339, 80, -20, 76, 221, -5, 182, -200, 16, -44, -287, 46, 68, -135, -142, -185, 87, 29, 21, 98, 290, 62, -87, -121, 125, -127, 56, 54, 11, -43, -67, -111, -127, 116, 37, 65, 188, -62, -131, -245, -74, 6, -27, -63, 117, -127, -117, 37, -212, 215, 70, -27, -61, 132, 108, -64, 288, 87, 67, -96, 115, -54, 113, -106, 146, 93, 77, 333, 199, 230, -103, 100, -206, 63, 248, 99, 250, -183, 166, -195, 69, -365, 94, -114, -173, -176, -84, 51, 90, -107, 191, -64, 36, 140, -123, -85, -58, 121, -149, -301, -71, 246, 77, 321, -87, 86, -271, -75, -92, -67, -317, 2, -167, 70, -312, 135, 126, -59, 32, -25, -109, -31, -2, 3, -50, -290, -16, -225, 68, -189, -48, -79, 94, -159, -282, -93, -179, 81, -31, -77, 71, -46, 203, -97, -154, -55, -229, 53]
5252E3k24K2J23k15O6K18J56j86P7jo7m9Q0k05K18j27NJ04j05J81j27l31M02j0
5276E8J92l05P4J82j1P6k87j55K66j77r1J89l42J45K72P0k79m8K01OJ88O7j04
5299A87l28J61k15K02N8pn9L0l5J52j87J14j8k46L98l95J70K16j39q7lL08l73
5322i6J84n9k9k39J44J63k38K50j98J54j76K81m5M4k98Q4J09r9J43Qr0k7j31M68
5346C07n67M50k84K93n66J75j6J36L1J5k1o1J94o9j97k26N27q9K4k53J62J31Q7
5369A83j90J17j76n9j64N47m10J83k64J09J31J39j42R1k05rK90k59j10l6R2J56
5391A4K28j00K60l66j09M6j8J73j74q6L6J76p3n6Q1J54OL1k97m8K70j94J59l64
5415b51L18k64L69j98p4j12N4J77K8k76M6L23p2r6Q7k48J95j96M8J80n2J39r5
$$ y = [53, -171, -149, -26, -241, -175, 43, 199, 13, 90, 89, 22, -27, 53, -152, 66, -61, -56, 48, -57, 124, -3, -334, 68, 58, 250, -55, 19, 201, 190, 266, -21, -176, 90, -87, -178, 11, -331, -186, 86, 156, -123, -171, 30, 36, 224, 291, 187, -141, 20, -195, 7, 65, 58, -1, 29, -6, 146, -41, 73, 55, -191, 207, -188, -18, 198, 59, -28, -31, 277, -96, 88, 29, 0, -239, -95, 68, -170, 80, -118, 36, -140, 141, 96, 140, -158, -74, 35, -64, 79, 87, -3, -30, -161, 307, -260, 190, -94, 199, -367, -192, -208, -72, -41, -26, -47, -108, 86, 17, -180, -406, 121, 32, 56, -197, -35, 96, 183, -7, 110, -66, -125, -289, 258, -152, 31, -233, -124, 7, 146, 4, 95, -110, -119, 171, -88, -198, -234, -142, 14, 242, 142, 402, 36, -73, -27, -45, 128, -46, -132, -96, 80, 7, -49, 32, 186, 192, 223, -74, -122, 148, -46, 113, -251, 67, -197, 172, -26, -100, -212, -158, 19, 47, -229, -183, 140, 68, -28, 59, -189, 6, -190, -142, 38, -14, 125, 30]
5438C0R0l09K98J35j25j66R3J29p8j88K76k6l07n4K03j9j82N03m78P5R0J1K6J3
5462D0O9pj15k2R3j99K91o9n8J71j83q2O8n5K19m9j21N7j43L07p3k41N2k4N7k54
5488b71K75L24k27q0ol6M8j03j72J81K2J4k9n4K63k37P9m4l8K41J59m62K72j78
5512e9j2O7Lm3Q7R5o2j24o6K07j39j81L65j38P6k8l6J60J0j49j56M7j19J73K81
5537B59l04J42J71j85l5N9J48m23L02j78j56N14j75k05l4j87K53N6J22o3r1L15
5559C05r7Ql15k21L90j17J29j50m5L00j6k47l33M08L02n48Q8k28K26J44k68K09
5581g6j49K10Q9j90l6K44l9J40m59J16LK03o0J08k32m6N1J65K3j15k8l31M66k62
5605b05J62P4R0j71K42l63L66l12M4J86J05j61m5L3L1l43K51j2K8R0k96M46k70
$$ y = [30, 120, -189, 109, 244, 119, -47, 46, 175, 97, -91, 185, 159, -148, -202, 1, -18, -200, 303, -175, -100, -10, 1, 27, 40, 109, 102, -13, -35, 58, -141, 150, 81, 23, 194, 11, -71, -3, -58, 161, 112, -9, 48, -95, 212, 139, -102, -50, -74, -17, -271, 4, 328, 101, 21, 15, -21, 27, -76, -248, -67, -45, -31, -60, -114, 149, -88, -9, -53, -91, 150, 309, -153, 119, -59, -71, -4, -1, -44, 43, 138, 76, -48, -114, 93, -46, -227, 138, 0, 76, 48, 12, 172, 182, 33, -123, -76, -195, -22, 259, -45, 97, 268, 83, 48, 107, 255, -168, 134, -44, -200, 314, 139, -66, -100, -287, -34, 22, 144, 81, -10, 305, 208, 216, -99, -320, 70, -47, 82, -68, -113, 187, 171, -76, -409, -1, 301, -247, -159, -387, -161, -17, -285, -76, -225, -15, 74, -116, -152, 92, 53, 193, -266, -150, -147, 56, -4, 104, -128, -174, -123, 42, 65, -50, -78, -409, 57, -205, -43, 31, 121, -50, 192, -171, 195, -117, -73, 113, 218, 57, 12, 45, 76, -267, -16, -28, 0, 90, -206, 240, -30]
5628c0J62l96O4J88j95J91k41pL05J37k6j49o8Q9M1k32J66o2J41L1r6L6J30j29
5652E0n0J01m2j94J67l1p2O2k11J62j39r0J3L4J61O7K09l88K37j52k05L39k31
5675b03K30q9j5M03k27l13J59j9J87j76o6qL13K7j78k00J55j47L41j11j1j34k03
5698b85K33j16K6L20k27K16k60J79p7j09l1PJ54N2L0L5j59o8J67j23M5k21K04
5721hK1l6m1J48j28J38l13j03O38l36J96k31K8k08J5J12J6J22o1J29l03L87m07
5744b25J56J49r5K12M3j51J10o1j42K3k0j00J30p7k1j8K39k58J96p5p4K45k06
5767b0j65M7o1K14K4j39J93k63N49n26j68R1R2J42n7j5j01P0J33j21J41J28k08
5790b0J25k59J5n3J37P4nn8k31J85K01j14k30oK90j38r8M04k74j51Q9P4L9l7K46
$$ y = [-30, 132, -264, -200, -12, -207, -16, -257, -264, 41, 178, 152, 3, -65, 24, 65, -167, -1, -63, 78, 109, 13, 49, 179, 50, 0, 101, 59, -135, 32, 1, -71, -9, -220, -58, -197, -287, -274, -240, -79, -12, 197, -191, 46, -106, -311, 28, -203, 27, -62, -77, 326, 99, -214, -55, -74, 113, -63, -129, -137, 176, 203, 25, -175, -20, -167, 174, 63, 52, -82, -285, -52, -168, -142, 178, -49, 167, -93, 86, 9, -100, -131, -124, 30, 82, 112, 147, -12, -80, 87, -36, 9, -212, -8, 13, -23, -64, 84, -44, 94, -219, -322, 316, -20, 176, -55, -27, -235, -220, -108, -92, 30, -31, 98, -205, 182, -225, -69, 80, -15, 197, 240, 89, 199, 138, -4, 19, -1, -101, 29, -48, -69, -87, 152, -106, 90, 15, -59, 186, -20, -185, -138, -199, 15, 39, -100, 93, -170, 379, -147, -315, -224, -132, 10, -47, -62, -163, -93, 40, -81, 60, 188, -20, 105, -154, -139, -192, -55, 19, 14, -44, -275, -90, 111, -3, -233, -239, 51, -87, -185, 219, -55, -206, -117, -43, -4, -41, 205]
5815B05k43m5K92k61K35k00P2j13K58j18k43J97k0K8j59j24K42J53M4l05N8Q9
5837D2k67L34j5j72pN1q8n7J63P9j3N7r6l06K97P6o2L4j08j90R6R4k7j77L15j73
5863a20M0N2j00K35k69L07k82N6K3n8K29j96K44m0L2j12r6J29k65M5K14j23k72
5886c27N21j90R1rm5oJ17l61Q1K45l47K63K0L0j0j08P9j5L52o09J61j9j24j3K0
5911b03J33J3O5K26k70P2J00k88K85j9L1j86K26l03K17j45R2J12l21J44m6J50
5933H5j3M3j9L4j21J81O5p3l14K73m19J86K54j20l39P2M9M80k94M4l42K35K56
5956B03k09J04k92K99k17j28j5J25K33j11j49N70n01n8L61m2M2k44L17k75j84
5977a71K84k61L5k0NK40k25R4K94l01P7J19j00P9m34K20J03k79P1J57l7J7m3j7
$$ y = [205, -38, -83, 209, -52, 183, -17, 55, -58, 200, 82, -161, 36, 16, 44, -115, -239, 3, 156, 200, -105, -47, 42, -225, 109, 94, -78, -85, -34, -122, -179, -16, 63, 50, 107, 11, -295, 2, 78, 16, 50, -58, -248, -152, -58, -85, -262, 53, -120, -80, -28, -128, 107, -162, 145, -137, -81, -58, -116, 113, -83, 161, 121, 153, 41, -55, 74, -191, -146, 68, -55, -327, 194, 4, 95, 86, 41, 35, 152, -209, -128, 117, -230, 33, 53, 83, 73, -35, 44, 29, 381, -228, -67, -86, -210, -223, -203, -70, -57, 8, 234, -36, 36, 136, -152, 133, 114, 145, -41, 185, -118, 99, -46, 46, 158, -163, -19, -65, 85, 72, 115, 96, 130, 9, 190, 255, 182, -132, 141, -278, -92, 162, 42, -297, -225, -176, 304, 10, 54, -288, -53, 203, -6, 98, -194, 105, -112, -240, -255, -130, 103, -8, -157, 413, -88, -146, 215, 173, 215, -29, 288, 13, -171, 113, -148, -113, -133, -128, 112, -113, -19, 275, -26, 51, 170, 70, 149, -285, -65, 38, -241, -170, -13, -50, -33, -76, -93]
6001i3K59l04M34l06L7k69J20K41l3k23J73m0Q4k1j47J70j03J9l1J00o0k48K79
6024C8J68Pm22L09j47K12j75M6m8l04M31M2n00L81K58k91M6k0N0Q8j27nk21K97
6048A13l4q8j16q3K31K8M0o2Q4k81K75j65J30n4O6j46J13j69J05J01j31J37j9
6071G5k9j40K69o1J2j63O7J0k48J33K23k04n8L14j06jj84k0J76np4O0l36K85n1
6096e6R6n0R4o5Q8K9k24K8j08J8J2J54J6k48L29N6l03K22k07J41j32P4M05m27
6120e8l1K2J54l3o7l1r4Q6k09M84l22k7O44o71J14k76L07k58L61j3q7k42L79o8
6144F4k23q9J40L13j10l7J2k19M0J06J28o8j21J28J08l87O2P2J97k6l4j78J89
6167F7j79K05k6j59J0l9K1j6k01K07j3L55k03K6j40J66J0j31K35m5k06K25l08
$$ y = [-93, 166, -138, 296, -10, 27, -242, -122, 119, 86, -137, 36, -4, 80, 59, -88, 82, -21, -2, -33, 67, 7, -241, 38, 206, 213, -209, 100, -47, 165, -10, 36, -12, -316, 115, 157, -343, 38, 296, 5, 51, 31, 81, 169, 42, 37, -184, 113, 79, -9, -125, -208, 23, 51, 91, 29, 113, -168, 107, -58, 72, 18, 84, -62, 51, -118, -13, 88, -43, 94, 75, 46, -94, 175, 114, 126, -37, 30, 40, -208, -75, 148, -56, -114, 200, 94, 93, -91, -111, 65, 60, -14, 46, -290, -5, -56, 40, -10, 84, 19, 107, 136, -88, -60, -168, -150, -138, 16, 32, -216, 113, 169, -134, 88, -119, 22, -110, -36, 369, -58, -89, -67, 87, 54, -13, -44, -138, -52, -261, 223, -99, -126, 518, -153, -39, -315, -8, -266, 95, 82, -5, -247, 132, 64, -159, -248, -108, 205, 95, 58, 70, -149, -109, -3, 125, 57, -64, 64, 172, -215, -153, -81, 116, 90, 56, -122, 67, -112, 93, 67, -92, -82, -121, -100, -116, -317, -110, -123, 232, 29, 55, -85, 81, 91, -40, 195, 150, -56, 169, -139]
6190a39j6K56k05k25J81k9N67j86j06k5k96L00J8l94K81J73j15K01l02k8o6L25
6212A70J18n92J72j66K79l6R9m7j33Qp4K50j52J07J39k27K14p5k09JK76r0j7l9
6236b4k16L42j01J4prj32K44J36k88j78K32r1j09J99n2Q2K6J12k61O9j73J88K28
6260B31m29K64q1o8J30j57J66m7L4J12K4l26J35O7j08J44k24L56l00L2K54L1k90
6283e0k02J44J56J2j37n7k1lK50k76M4J68J38j81o4J49l3j07J45Q3m51N17l28
6306a04K76m84N81n7P1k09j01j25N4J21J03m49M06N5l32M58j83k78J83J89j90
6327a5j5K2L3n3q3L14j57l6K05q7o3l52K24Q4j18J50L6j85L7j5J29j36K6K12j31
6352B6J26M4j25k04J78J19j88J66j09k3R6j12j62J11J44p1n3J54k84J28J55l66
$$ y = [-139, -155, 101, -104, -329, -148, -177, 390, 204, 98, 73, -223, 77, 95, -299, -18, 155, 40, 241, -61, -89, -155, 170, 288, -304, -132, -298, -19, -55, 44, -3, -136, -128, -202, 48, -104, 3, 142, -85, 129, 54, -155, -154, 122, 32, 15, -24, -240, 102, 1, 15, 8, -1, -133, 111, 247, -41, -219, 13, -78, -187, 12, -40, 42, 68, 180, -81, -12, -185, 3, 231, -198, 66, -15, -83, 47, -110, 56, 9, 43, 155, 179, -147, -12, 55, -53, 91, -133, 223, -77, -45, 209, 240, -50, -252, -108, 48, 60, -77, -134, -155, -158, 92, -184, -140, 28, 166, -15, -79, 70, 37, -70, 75, 158, -293, 224, -104, 172, -312, 269, 212, 283, 74, -27, -152, -98, 23, 126, -323, 83, 138, -194, 264, 81, -197, -14, 175, -15, -30, -8, 25, -28, -111, 203, 46, 10, 215, 128, 65, -287, -63, 21, -97, 53, 89, -96, -59, -74, 55, -81, -55, 157, 26, 152, 196, 71, -133, 45, 164, -24, 142, 33, 10, 106, -6, -168, -57, 87, 16, -37, 117, -167, -39, 116, -250]
6374b50K22M53n81K9J47M7Kj8p2k37J48k61J55M31l16J07O7J5j29j0j7N2j31J86
6398C9j21j0J65j5O1q6q3O2j77L77k25K3O2j11N5n1J99m59P4K59Q7q1K13o59N50
6423A48p3k67K38j04j00J05m2J38K39m10J21j17J80j23M35n39J48j2J4j41Q9j19
6445a92K23k84P4L55j10j26l6K1J55j53k0N6J64k06l5K01k42K85p7j97M5L91l85
6468i3J55N1l26L33j2j7M3k34p5K45O9l53k6K57J73n12P31n05J62L9k92M0Q9O5
6492Gpj25K45l54K10K77l11J07J30l8j26j30L7m9J54O8m12L84j11K01J9o0j69
6515e3O4l91K62O9J08K4j58j81J61rJ47p2K4k84L03j10L1Q8J85j77J15l7J08m56
6539b39L05k92K49J73j15l73K44k39J15L48k2n21j26P04l05L9r3j32K75k8R2k88
$$ y = [-250, -28, 425, -156, -127, 20, 67, 69, 51, -21, -258, -110, -371, -216, 215, -101, 6, 73, 88, -41, -51, -68, -16, -147, 39, -82, -92, 73, 58, 119, 33, -50, 12, -165, 212, -13, 10, 72, -39, 16, -35, 164, -295, -221, 38, 125, 44, 257, -402, 148, 75, -192, 46, -58, -158, -53, -95, 43, 282, -128, -7, -124, 56, -67, 368, -171, -23, -35, -21, -162, -73, -192, 31, -253, -179, 176, 66, -60, -96, -75, 80, -73, -93, -37, 127, -79, -114, 87, -155, 130, 53, -144, -99, 292, -93, 62, 113, -213, 120, 108, 91, 134, -100, -175, 70, 139, -214, -240, 17, 190, -322, 409, -96, 66, 105, -187, -147, -58, 7, 0, -125, 120, -234, -24, 253, -58, 49, 179, 141, 15, -115, -78, -127, 27, 95, -317, 67, -44, 157, 176, 116, -53, 11, -380, -118, -49, 59, 83, -75, -256, -95, -104, 43, -29, -5, -289, 14, -96, -65, 23, 208, 31, 146, 109, 217, -239, 66, -226, 23, 196, 81, -292, -48, -287, -172, 176, 154, -367, -493, 211, -94, -55, -148, -280, -5, -33, 59, -229]
6561b29L23k42L27l9k10K58k42K0J42n7r4K29j36j93j64K64K52km02M28k97J87
6583A23j42j37m8K97pk5Rk34J31j78K10J47j91J84l56K40q0j43j92N83L2m73K21
6606b9P7n6qj93J34l0NN1L69k75J0J35k12k64K80K34k66K66Kj36j7J62m04J06
6630e9Q1j7p1L2k93L65j66M5J50l5k26L34p0O4K6k88J52P2J90k34K41m07kM13
6654B97k71J29m3j09j3j68Nl1L73k77K18o7k87L9K15j79J03O3O4N6m8k1j81Q6
6678d7LK33m30J35K01j16j72L9P5J52J03j51j52P3L06k10N4q9j18J65q4K9j23
6701a24lO7l9%K99l77R3j43J66L0q2P2k26J49o5O4K78l05L2m2J01P8j53L71k28
6726A3J17j94J08M4j4J54j89J63j71R5O1k57J2J8J46j28j53K46P3l6m1m0N6j29
$$ y = [-229, 94, -148, 179, 140, -70, 188, -54, -34, 108, 51, -43, 186, 50, -143, -307, -43, 209, 207, -195, 233, -64, 123, -19, -156, -204, 93, 86, 61, 70, -164, -33, -211, -1, 146, -45, 139, -217, 23, -57, -200, -392, 191, 223, -250, -29, 48, -8, -16, -209, -75, -105, -100, -49, 320, 45, 55, 190, -22, -286, -6, 228, -38, 228, 230, 94, 77, 239, -165, -59, 22, 5, -66, -34, -327, 38, -128, -83, 67, 32, -194, 140, 70, 134, 160, -128, 24, 96, 286, 52, 293, -114, -116, 297, 26, 155, 112, 3, -10, -178, -173, -204, 169, -108, 110, 43, -244, -205, 10, -169, -66, -3, 61, 117, 69, 48, -133, -47, -44, 189, -241, -106, 95, -21, -193, -154, -79, 73, 176, 25, -127, -54, 252, 42, 96, 7, -111, 54, -30, -1, -124, -127, -60, -99, -99, 200, -177, -84, -227, -61, -31, -113, -41, -267, -118, -183, -119, 159, -146, -114, -156, -55, 23, -130, 241, 13, 130, -64, 44, 88, 74, 228, 39, 202, 31, 126, 187, -70, -58, -40, 106, -22, -175, 71, 144, 108, 67, 27, 83, -46]
6750d6r6R5J50l70J04M21j13k62L51j05j14J66j40J58k68q2J57j96K05l1j87L34
6772A31Q9q6n4J1m40K67K25j94L91m08j31p2K34J10j15O5j34K22k86K37k01K7
6794a12j02J71m9K77k62J7J20k01M4L85k04n6m5K1j01K93j88j47J34k41J64j34
6816b16M12k77K62j10j83k9rL51k06K74l50N7k13K8L73l57P1J06j29L10k06N1
6838A0j73J82Kj10K40j92J25j33m9L1mN9R7k19J13j56J88J8j83l7J40k2l7M02
6862B92k20o2Q8j08J32n5L7k18q4j32M47k88P2O7p3K91m28M33k4k72L77j42j43
6885a3R7j18J98lk50J15m4j31M51n8l85J77o5n1p0M15l80L95k48j44k91L54J41
6908I2M1j82J96l16K86j97N1K56k20Lj61J27o9J61J61j84J06l91K56j48L2K32
$$ y = [-46, -142, -47, 103, -267, -163, 258, 145, -117, 234, 129, 15, 181, 41, 199, -69, -151, 6, -190, 15, -16, -203, 131, 220, 134, 80, 91, -349, -82, 143, -51, 340, -68, -199, -271, -37, 73, -42, 23, -111, 111, -175, 62, -139, -112, -214, -43, -92, 185, -77, -60, 60, -141, -97, 288, 84, 28, -17, 4, -97, 196, 8, -139, -5, -246, -82, -216, 196, -81, 181, 71, -112, -141, -150, 201, -5, 269, -81, -24, -237, -209, 164, -193, -122, -16, -145, 165, -41, 10, -163, 19, 21, -89, 151, -41, 84, -49, -98, -67, -71, -12, 85, -134, -21, -177, 11, 29, -154, -191, -51, -73, -110, 292, 72, 10, 98, -10, 122, 67, 104, -114, -198, -330, 117, -171, -99, -32, -105, 186, -242, 191, 167, -105, 272, 130, -13, 84, -34, 164, 161, -89, 26, -18, -149, 302, 244, -141, 36, -29, -80, -150, 265, -115, 280, 32, -112, -403, -49, 92, 133, -49, 147, -169, 117, -80, -29, 227, 7, 10, -151, -24, -93, 68, 229, 45, 151, -240, 16, -132, -100, 132]
6930A32r6l2j48P6j43L31J17l72O6M6l9K2J51k16Q2O7K13m35M18j86Q0k7j8j97
6954a08pL35l36Mj00O4N2J54k36J43k30L45l09L91p4k51L37k70J89j84L63j88
6976H4P3j00p3k11L61N1J54l3k81k45J90l6L15m73pM36m06J53m4j03J85j23K61
6999A28L0j21k37L40l32K08J31j16J87J2m53K25q9R8J4m6L1J07k01M2K58k54n3
7022i1N7J7Q6j42J64k46q8M45k55J91j1j95K33l07j9o8J6N2J49K29l10J71J5P
7046A00n8J68j73j37K22j33J69k35m3L8L9K84m35m6J22J67o6J66m7j73J35L6P7
7069A77N2l82K69L8o6n3j96J34J33M0k93K04k87J81p9R9m8J09k5k72K20j54N3
7092a46J44o5OK03j34K13m0j92j21K23j34K09l19r4J1K58l6j25m2J39J76K12n78
$$ y = [132, 36, 4, -144, -68, -211, 120, 237, -135, -69, -23, -62, -40, 111, -105, -23, 44, 257, -178, 240, 54, 134, 107, 89, -108, -115, 220, -116, -112, -212, -148, -96, 58, -178, -35, -265, 80, -229, 162, 88, -163, 174, -96, 93, -91, 272, 84, 157, 57, -16, -227, 134, 185, 339, 306, 25, -220, -30, -66, 249, -224, -231, 205, -201, -48, -92, -195, -10, -133, 128, 158, 37, -200, 140, -192, 16, 147, 31, 218, 230, -223, 2, -87, 11, 25, -21, 10, 117, -84, -42, 216, -38, -91, -34, -17, 69, -73, 91, -155, -243, 202, -53, 138, 127, -68, 165, -142, -161, -229, -213, -161, -12, 217, -93, 78, 93, 100, 42, 210, 37, -100, 122, -11, 158, -77, -120, -82, -43, 241, -194, -240, -118, 49, -17, 149, 102, -71, 64, 100, 177, 229, -153, 116, 154, 88, 35, -161, -27, 106, 146, -147, 57, -230, -49, -128, -29, -77, 32, 7, -265, -45, -199, -146, -2, -67, -61, 142, 8, 221, 181, -11, -132, 91, -43, 166, -153, -247, -236, 22, -14, -139, -181, -42, 134, 346, -232]
7115b32J36P4L12j17l41K92j08l20M18Jo4J43j54k69M44l83J18j62K89q5k67K01
7137g4J10M25l75n3L0J04j79j88O6J80J79j32r5J8P6J28n34J30K43pj5k35J15
7160h3M57l86o8J49k66j9L52r4J83m30o1L01j59K85q5j44K3K8o5o5N61o85K20
7183e1J1r5J41k80L90j85J38k35lL11k27J34j80j53M54l84L74O8Qj17r6n4M8J95
7207B12j86l5J5Ml41M91j33l12J06j19K37%q3J57j08J98J54k14K18j84K13k83
7229Gj05J2PJ89m3R1p4k63L88m36M12l49J45O5n3Q6M4m12L14j93J67K44l77L21
7253A87m55R9J00rO1k72K25m3j43L03j89J49l6q3L3J35l2K85m8n40O26m95O2k55
7277c35L07n8L32j56pj95K41J71n41M42N2n87N42k98J92J1l28L20k31J78n2L16
$$ y = [-232, -96, -22, 290, 173, -168, 124, 16, -304, 114, 115, 51, 194, 40, -229, 215, -168, -50, -212, 77, -8, -275, -74, 36, 461, 86, 33, 63, 167, -12, -200, -134, 46, 225, 93, -2, 16, 92, 220, -314, -184, 59, 52, 37, -198, -83, 374, -12, -80, 69, -197, -216, 136, 42, 225, -205, -266, 35, -124, 161, 76, -68, -45, -17, -82, -147, 414, -271, -51, -40, -135, 6, -274, 116, -69, 69, -166, -169, 142, -85, 49, -131, -284, 170, -214, 160, 228, 236, 119, 23, -31, 17, 212, 26, -9, 6, 10, -331, 160, 27, -285, -179, -298, -61, -61, -144, 13, -95, 103, 257, 43, 261, 77, 290, 7, -98, -86, -79, 110, 67, 158, 84, -179, 209, -227, 185, -164, -19, 46, -7, 79, 123, -289, 25, -168, -1, 243, -134, 187, -268, -169, -69, -78, -17, -289, -64, -107, -250, 53, -136, 13, -23, -106, -73, 62, 30, 315, 267, -273, 353, -142, -80, -335, -28, -86, 246, 90, 83, -112, 129, 300, -241, 201, 253, -334, 208, -90, 102, 113, -215, 105, -126, 52, 0, 316]
7299C16k28j47J19J88j26l8k04j0Q5K78l08L32k00l9O9k16J09o5J38o2o8K26j48
7322AL00l71Q6k05o7pL7J88rK3J26j63J54j78J20Nj28K43m5j89j24L98m28p7K56
7347e4n20M77L17k25p9j3q0K63o0J86j12l1K38m95L03j38KJ94j37j81m8L01p8
7370C0k2j3q7N9P5J14j40j75M94m70OJ09J14L76l18Q1M8k79q1k11J29J03R9L28
7394C69o04K77q4j53L12k24K85j67Q4j18L3l70M58l35J46L47m08J98j12J16k99
7415b49N64j98J6J10n7j7Rl15l7O2J64P1J17L8j96kj84K7j6J96k52K37l5m23L68
7440bN2J53k12J88m7k38P1P0n4J09j83J54k65L77n8k9j52J46P8k07J31l28K11
7463c5p4K45k69J11k6J7l0J61k27J02j67p5L22k09K10J35m96L81l47J12J77p0
$$ y = [316, 88, -59, 60, 248, 122, 84, -120, -130, -45, 233, -75, 257, 57, 18, 87, -129, -20, -85, 53, -9, -77, 149, 1, 301, -70, 16, -189, -256, -263, -226, -38, -47, -24, 102, -61, 93, -85, 35, 40, -88, 155, 110, -79, -203, 195, -233, -310, -54, -574, -97, 220, -5, -84, -97, -177, 86, 26, 212, 100, 69, 307, -188, 115, -23, -21, 173, 36, -145, -193, 108, 30, 8, -5, -92, -33, 42, 156, 16, -159, 335, -135, -129, -20, 94, 470, 152, 233, 281, 2, -79, -290, -161, -58, 41, 369, -235, 42, -42, -195, 117, -107, 178, 11, 95, -23, 10, -360, 98, -237, -91, 256, -152, 46, -66, 50, -249, 315, 117, 133, 243, 186, 169, 178, -137, -174, -112, 52, 123, 240, 278, 82, 80, -104, -77, -93, 103, -149, 88, 53, -370, -2, 50, 203, -9, 179, 132, -106, -35, 35, -19, 90, -93, 61, -204, 173, 115, 86, -66, 80, 158, -49, 82, -246, -35, -109, 136, -133, -22, -48, -31, -61, 100, -127, -25, -192, -267, 55, -154, 56, 191, -305, 76, -271, -159, 18, -52]
7485e2p5Q9j2M1K11j20j24Q6m4O6J51m44M7K06j45L24k08J55k34j00K88r3n2K3
7509a6j79J44L21l63N75k80l6l68K16L38l50j24N7J02k14J11K17p0l3j19J61J04
7531A94l44Q3k37L96J03l19k19M35k5k09k1K90n9m5j45J04r5R0O2j55L10r0L09
7554D13m27q9J75j42L0J77k86M75m22m8o2K31K3J25k28k41M33k5k46K03jj6j31
7577g9J65r3k22M70k18J85k22Q1j47O4L92l71MK01M3k20K18k61J58k11L24l78
7599a17K6K00q1k72L80j40j35K0J23J40m1m2k20L12p1n1J45k12KL74l88o6K59
7622A45j17j76J22K13p7m64L72Q8q5p5J08ok00L40l17J12J3q7k3O5J27K6l49j49
7646c94L69J00j77K18K2l82J81J26Mj67J68p0oj36K5J04j50Q4O6m8j44K53r8J60
$$ y = [-52, -127, -38, -50, -9, 202, 82, -42, 44, 0, 66, 217, -227, -180, 26, -119, 205, -3, 152, -82, -182, 106, 13, -39, -16, -195, -51, 270, -93, 482, 202, 166, -202, 14, 352, 2, -122, -65, 37, -177, -66, 151, 81, 48, -71, 90, 194, -150, -67, -304, 92, 195, -124, -343, 92, 67, -142, -163, 127, 68, 23, -122, -18, -113, -23, 39, -116, 194, 104, 413, -14, -103, 72, -70, -40, 137, -149, 326, -96, -144, -206, 25, 48, 173, -55, -296, 137, 112, -134, 69, 68, 52, -79, 86, -7, -229, 241, 23, 208, -14, 67, -80, -16, 376, 5, 9, 210, 253, 33, 251, -10, 148, -63, 261, -117, -91, 109, 28, -244, 136, -4, -139, -119, 4, 144, 103, 61, -159, 153, 82, 31, 176, -36, -34, 340, -48, -114, 145, 28, -148, -26, 187, 110, -354, 18, 106, 21, -54, 54, 48, -152, 188, -129, -17, -4, -91, -114, -49, 78, 104, -245, -394, -25, 75, -102, 116, 138, -244, -63, 63, 67, -100, 68, -2, -8, -144, -119, -15, -165, -81, -15, -63, -207, 46, -52, 108]
7670A08m18K55K29l84J34K0K21k09M4J2j80R5j03J00K94n4j41j28J9J14m7j92
7692b11L80j25J28k30M4p9j9m9J42k15R3K62o98N76K15l51N4NL5K29r0l08L45
7715A33r2n5j7M5L17k05L6k18O3PP2K99k32m60R8Q5L4J61R6k38j12L82l6l59L4
7740a62k7P8L8N6J01k65K71k26L9K7M0K39n25M47J65k43r0J45j19n5p2%P9N9j85
7765a85K56j46r6J45R9K45n00J37k00J31K48k93R0Nk05L29l01K88k82M97l00J37
7787I9j92j32L12k55J89q2P6j72k62K37n1M65j28k13o7N0o4L29k78J78k17K18
7809D0K71j27j21M3j07p8K1j26J5J42l9q1L17m08J89Q4l9J16l04L94l47q1J45
7832h1K41j62j98J12m6L36L3j09%j99K1r8k3J45m1J68j93P8J04j05q7K45j88j29
$$ y = [108, -310, -55, 174, -210, -76, -56, 165, -44, 0, 12, -168, -73, -176, -76, 218, 164, 23, -105, -86, 28, -19, -211, 169, 44, 172, -58, -14, -93, -112, -161, -19, -234, -141, 121, -577, -1, 214, -137, -83, -78, -43, 186, 96, -212, 133, 41, -14, -31, 14, 331, 126, 162, -56, 7, 14, 86, 385, 153, -307, -209, -124, -90, 71, 167, -71, -183, 199, 163, -196, -162, -189, -111, -73, -17, 84, -181, 90, -136, -97, -70, -30, 209, -316, 131, 296, 53, -37, 108, -11, -66, -138, -138, -59, 0, -185, 71, -75, -171, -26, 73, 318, -182, -45, -245, -114, 134, -159, -69, -64, -269, 60, -241, 47, -235, 262, -38, 99, -93, -225, 87, -168, 21, -61, 15, -157, -419, -182, -233, 232, 104, -109, -176, -126, -190, 139, -139, 39, -178, 40, 311, 184, 63, 106, -1, -79, -58, -184, -169, -27, -66, -147, 170, -238, -49, 35, -4, 112, -192, 202, -145, -226, -81, 160, -2, -200, -88, -134, 202, 235, 126, 126, -73, -52, -150, -173, -28, -69, 99, -94, -16, 88, -17, -104, 141, -47, -176]
7856a76K13k31L26j36J8q7j05K71J24j10j45m5J75J3k20k8J24p9J73k09j21J61
7878i4O4R7j49J76N2j66k37J40L80J1m30j45K20O8J0k30M21m4J88m28l7O9J4O2
7902A2J35m6j36R5j47J57K03k60j30J92k87K82j04j86J64m2j82L25L6k09K17K
7924I1l2l29N12k80r1L7l4J7Q6L5l4P9R8k30l0K32J6l39o0J32R7rK73j63j29j72
7950b27j66J85k8J13j37J79L2o2J69L8j33%J82j79K0N3j63J42l8or4J54O4l6j09
7975d7J08k72O1M77l24m6j5J97k66N6j16J45L12r2P1k23J4J45j42l41P4K88L9
7998A03j73j03J16K00k83J90J1j14K78j4m16M07j02N0j51r0J62j30K5K65l94O4
8020i9J88j46K2M0l10p4M14K91p10L05n1j28M84k47M14m73pL30k75l01N05Rl0
$$ y = [-176, 37, -194, 132, -4, 14, -73, -178, 93, 217, 107, -38, -83, 92, 105, -115, -143, -19, -98, 75, -134, -255, -94, -30, 67, -82, 94, 146, -20, -257, -117, 263, 274, -156, -301, -81, -13, -3, -233, 188, 144, 332, -96, -133, -64, -50, 12, 147, 101, -35, 60, -87, 70, 273, 13, -117, 75, -212, 70, -34, -220, -56, -98, -280, 45, 81, -128, 89, 91, 59, -270, 242, -38, -129, -92, -126, -109, -23, 12, -22, 57, 155, -75, -105, 127, 143, -196, -256, -124, -27, -36, 237, 74, -55, -227, -393, -208, -236, -123, -260, -81, -49, -111, 58, 96, -37, -37, 145, -34, -14, 39, -124, 18, -20, -26, -120, 34, 98, 62, -47, 61, -211, -150, 327, 3, -43, -58, 139, -127, -71, -187, -42, 270, 178, 249, 26, 40, 185, 43, -298, -224, 64, 103, -70, -173, -57, 143, -140, 50, 61, -53, 225, 211, -205, 202, 100, 150, -1, -91, 71, -59, -34, 231, -163, -99, 89, -57, -35, 5, -305, -379, 35, 326, -384, -79, -130, -258, 226, -21, 393, -80, -87, 243, -32, -333, 172, 181, 151]
8043A51l11K31p3K03l53K0j59K67p6M8K29j54N7k6q2j6J49l8L2k9m9k60N05l03
8067c7j3J2k5l6J33J08j59J41o5%N0r9J54j67J83k98J92j16J75k98J2L09m15L19
8091F0J56n31L47K5l3j10q7L40Jj66K79l31l0p8J12K65k1K3l84L15j37M71m51
8114C5L1P7j22J56k05p9J08J4J38j3p5j10L0J08j28o3J98P7j14l22K33r5nR0k6
8139f2J72O1k92M6M31l82j22K26n3n4J44l0J15l06J49J48M7k81j39K69m03L15
8161aO7q0r9K2J61l42M72j67j4p1K60k05j96K52M8o3m3Kk17K97j8p3j72K38RO0
8187A27O3n4kj33
$$ y = [151, -160, 71, -2, 201, -152, -132, -291, -24, -100, -52, 177, 23, 80, 54, -28, -44, 105, 67, 99, 70, 21, -239, 266, -37, -50, -38, -63, -99, 34, 142, -17, 124, 59, 59, 109, 10, 164, -3, 180, -118, 74, -42, 133, -165, -153, 156, -259, 60, 216, -315, 32, 57, 24, -86, -173, 167, 168, 2, 281, -50, -80, -158, -46, 219, 198, 221, -163, 152, 15, 486, 35, 66, 143, 21, 177, -28, -107, 1, 15, 153, 140, 65, -45, -15, 93, -35, -98, 100, 177, 63, -259, -26, -121, -126, -36, -62, 110, 171, -121, -75, 356, -26, -148, 78, 25, -29, 115, 85, 200, -106, 43, 191, 238, -43, -182, 87, -316, -1, 66, -14, -113, -91, 70, -272, 200, 33, 19, -52, 208, 3, -193, 59, 107, 44, 1, 3, -214, 83, 65, -8, -180, 58, 67, 127, 190, 136, 134, 1]
8191A
$$ Imaginary data points
##PAGE= N=2
##DATA TABLE= (X++(I..I)), XYDATA
0@%%%%%%%%%qJ6j6K4l2M0m8N6p2Q8j10J34j60J85k17K57k97L50m07M66n38O16
31C27p02P98r02J022j152J297j456J627j820K028k256K505k774L072l393L745
47A966m132M556n023N532o095O717p409Q184r050J0036j1163J2466j3999J5819
61H405j8034K0801k4364K9157l5988M6596o5496J09573m12399k49210N49306L30998
73B89345L08179K3386j49611l79313l63088k87194m3348J54401L47392L76722
83B76871L02698O0236j59004l26075l60053l03468r4507J34197L06145L40197
93A77237K76825R3229j17385k91270l39612k67102q4952J13398K69999L27571
103A57938K72897J10796q5484k50917l20312k66472j08652P6586K27938L00650
$$ y = [0, 0, 0, 0, 0, 0, 0, 0, 0, 0, -8, 8, -8, 16, -16, 24, -24, 32, -40, 48, -62, 72, -88, 97, -120, 137, -160, 190, -217, 249, -289, 327, -375, 423, -479, 543, -609, 688, -768, 859, -961, 1067, -1189, 1316, -1458, 1614, -1779, 1966, -2166, 2390, -2633, 2899, -3196, 3521, -3888, 4296, -4754, 5282, -5881, 6585, -7414, 8405, -9629, 11172, -13192, 15965, -20023, 26573, -38923, 70650, -341749, -590959, -41653, 289345, 597524, 620910, 471299, 91986, -271102, -558296, -601644, -447243, -99851, 276871, 579569, 639805, 480801, 154726, -205327, -508795, -603302, -469105, -162960, 177237, 454062, 547291, 429906, 138636, -200976, -468078, -553030, -439632, -169633, 157938, 430835, 541631, 456147, 205230, -115082, -381554, -490206, -413620, -185682, 114968]
113A14968K62781J15362p7241k33651k97335k53422j17845N9703K11613K81087
123F6020K48393J30599l3516j92109k76757k47566j22267M0098J83192K61081
133E7168K44189J30900l1779j76179k50860k38287j41851R777J60176K45111K34196
144B42561J35802j0559j50131k30411k24074j35476J956J38432K24691K27788
154B20579J46075P747j30800k15181k19388j44419j5470J17358K02966K12719
164A82186J42187J7943j11286j96722k09413j45252k5611J01419J88692K06771
174A50914J46996L3163r0332j77986j98079j43808l5873Q2847J69759J93453J44780
185B75834M0984p6672j64768j91337j45898m7097O7140J54451J83152J43572N1776
$$ y = [114968, 377749, 493111, 415870, 182219, -115116, -368538, -486383, -426680, -215067, 66020, 314413, 445012, 411496, 219387, -57370, -304936, -427203, -387105, -203913, 57168, 301357, 432257, 400478, 224299, -26561, -264848, -406699, -396922, -236746, 8365, 242561, 378363, 367804, 217673, -12738, -236812, -372288, -370332, -231900, -7209, 220579, 366654, 374401, 243601, 28420, -190968, -335387, -350857, -233499, -30533, 182186, 324373, 342316, 231030, 34308, -175105, -320357, -345968, -244549, -55857, 150914, 297910, 331073, 240741, 62755, -135324, -279132, -315005, -232158, -62399, 131054, 275834, 316818, 240146, 75378, -115959, -261857, -308954, -241814, -87363, 95789, 239361, 291137]
196B91137n8533j46166j78289j41885n2630N4404J40843J74633J42294N7450m6230
207B37028j32024j68665j42339o3241L9203J24399J61504J38754O3638l3954j18375
218A05928j57885j38441o6573K8774J12378J54028J37286P0090k1572j02744j46674
229b5405j35312p2448J6397R7704J42484J32875P2966j2530r2947j38494j31249
240a45959p6147N750Q6235J32950J29551P7549k583p9854j27063j25680p6947
251b02198j695P4798J23768J25052P9665N537p1169j18978j22164q0765r600O4476
263a33273J13007J18314Q0539J3016o0130j09767j17034q0391j4701N5563J05035
274b9822J14971Q2253J9656m9914j00067j11735q2848k1713M5980R5948J08369
$$ y = [291137, 232604, 86438, -91851, -233736, -286366, -231962, -91119, 83514, 225808, 283258, 237028, 105004, -63661, -206000, -269241, -230038, -105639, 55865, 194619, 258257, 224303, 105928, -51957, -190398, -256971, -228197, -115819, 38209, 175495, 245585, 224013, 121269, -25405, -160717, -233165, -216768, -119064, 23420, 156295, 229261, 216731, 123784, -14710, -145959, -222106, -216356, -130121, 2829, 132380, 209929, 207346, 127492, 429, -125251, -202198, -203893, -129095, -5327, 119725, 199390, 204927, 133758, 14780, -107384, -188149, -197749, -133273, -20266, 98048, 178587, 191603, 131473, 21706, -95328, -175719, -190420, -134857, -29822, 85149, 167402, 187058, 137144, 37077, -74658, -157506, -179219, -133239, -37291, 71078]
285G1078Q1079K4463m2132r2314j07026q2821k7286L7593Q7790J04478Q2880K9792
297A67574l3499q2375j00752q1591l1548K9218P9812R9170Q1559L3577k6647p5547
309E8951r6663q1510l6295K1859P1092R3586Q0492L7788j9166o7875r0793p9865
321a08399l8211J6102O4543Q8960P9793M0667j3309o0408q5417p8620m2847J0138
333a27008N7584Q2798P6768M2264p118n4194q0932p6396m4182M554N1072P8291
345C501P6207M4804j773m7491p5140p4347m6270O25M5516P2397P2825M6203K345
358A19402m1656p0528p2692m7949m409L9363O7624P1296M6922O590l6149o5422
370A2392o9516m7743p721L4179O3032O8566M8194J0252l1642o0932o7260m8236
$$ y = [71078, 152157, 176620, 134488, 42174, -64852, -147673, -174959, -137366, -49576, 54902, 137782, 167574, 134075, 51700, -49052, -130643, -162191, -132973, -53161, 46009, 127568, 161145, 134498, 58951, -37712, -119222, -155517, -133658, -62566, 31020, 111512, 149300, 130134, 62259, -28534, -108399, -146610, -130508, -65965, 22995, 102788, 143455, 130146, 69738, -15679, -94299, -137146, -127008, -69424, 13374, 90142, 132406, 125288, 71094, -9838, -86234, -130416, -125862, -74790, 3501, 79708, 124512, 122739, 75248, 108, -74239, -120509, -119884, -74368, -1971, 70854, 117057, 119402, 77746, 7218, -65474, -113423, -117832, -78469, -10845, 60451, 107373, 113963, 77814, 12392, -57124, -104867, -112588, -78409, -15377, 53189, 101383, 111635, 79993, 19061, -48199, -96435]
382i6435j1314K8994N7759O5345M8353J3249k6577n6875o4528m8645j3960K4603
394h0031N4099O3096M8550J6260k2089n1608o1348m8446j7081J9731M9770O0028
406C0931M8609J8364j8438m7920n9263m7823j9806J5379M5522N7572M8282K0755
418I2164j3946m3252n6115m7619k1276J2093M1601N5122M7423K2805j0632l9853
430C8515n3412m7185k3763Q712L7844N1764M6460K4314p618l6067n0901m6106
442e7443k4570N838L4470M9360M6262K5704m225l2405m7838m5380k5891K928L0457
455d2733M6502M4850K6555k156k9319m5386m4584k6922M35K6960M3788M4504K7005
468F9499J047k5300m2277m3271k7685j530K3979M1463M2841K8208K652k2453m0456
$$ y = [-96435, -107749, -78755, -20996, 44349, 92702, 105951, 79374, 22499, -42029, -90674, -104634, -80031, -25932, 37164, 85714, 101974, 79885, 28277, -33071, -81517, -98598, -78867, -29097, 30931, 79540, 97904, 79466, 31546, -27717, -75540, -95346, -79967, -34445, 23127, 71409, 92164, 78218, 34966, -21149, -68768, -90044, -77951, -36350, 18772, 66195, 89000, 78368, 38515, -14897, -62082, -85845, -77133, -39289, 12475, 58935, 83249, 75631, 39564, -11337, -57443, -82013, -76175, -41705, 7655, 53917, 79621, 75396, 42991, -4847, -50227, -76118, -73190, -42733, 3769, 48619, 75174, 73018, 43699, -1687, -46271, -73193, -72758, -45798, -2010, 42494, 69499, 70546, 45246, 2969, -40302, -67987, -69517, -45538, -4075, 38766, 66974, 69626, 47173, 6717]
481F717m2226k8270m557K0680L9023M1442K8438M784j9577l7137m1005k8277o145
494f6110J8536L6316M0655K8963P286j7074l5191l9074k9364q172J5497L3660
506a4072L8287K9246Q651j4320l2574l8327k8955j0291J3707L1437L7360K9529
518D9678J0243j1911k9695l6450k9394j1112J1243K8851L5781K9523J1660j0272
530D8145k7728l5640k8808j2987Q687K6696L4404K8916J2621p374k5318l3409
542a1795k8732j3347O842K4435L2696K9199J3676n565k3428l2219k8563j4647
554e1448M888K2602L1379K7638J4819l973k1639l0444k8387j4543K842K0960K9695
567D389K7861J5859k636j9497k9027k7201j6118K270J8578K7665K7053J6341q09
$$ y = [6717, -35509, -63779, -68336, -47656, -8633, 32809, 61247, 66031, 46454, 9317, -31688, -59965, -66110, -47574, -11258, 29397, 58360, 65646, 48572, 13381, -25693, -55057, -63229, -47732, -14072, 24215, 53461, 62112, 47792, 15218, -23109, -52064, -62355, -48648, -17211, 20149, 49678, 59921, 48010, 18315, -18135, -47529, -58641, -47398, -18547, 17234, 46757, 58417, 48145, 20417, -15223, -44031, -57018, -48331, -21635, 12769, 41685, 54306, 46932, 21614, -11795, -40527, -53874, -47032, -22597, 10099, 39298, 52974, 47409, 23981, -8238, -36801, -51448, -46560, -23958, 7421, 35059, 49878, 45905, 24266, -6178, -34565, -49108, -46266, -25306, 4389, 32250, 48109, 45473, 25976, -3051, -30252, -46370, -44100, -25522, 2143, 29196, 45537, 44728]
580D4728j7805k7346k7304j6666L06J6906K6529K6800J6721M01j5850k6016k6221
593b4817j7056p84J4782K5019K5886J7524J622j3542k4707k5614j7241k730J3269
606b8389K3749K5427J7427K820j2386k2948k5189j7381l553J1331K1828K4982
618A7718J7941M430j0989k1438k4326j7562m847R810K1152K3608J7747N244r045
631B9443k0496k3329j7441o097Q424J9443K3186J7785O689q162j9029k2786j7557
644b9927o564P182J7942K2210J7794P368o743j7570k1396j8013p350O088J6797
657a2182K1081J7859Q090n573j6218k0811j7802q161M818J5407J9985J8040Q555
670C3088m099j5085j9614j8176q715L527J4345J9460J7829R166k979j3361j9404
$$ y = [44728, 26923, -423, -27727, -44393, -44087, -27181, -652, 26148, 42869, 43270, 27420, 1404, -24817, -41873, -42657, -27875, -2856, 23030, 40554, 42176, 28634, 3927, -21687, -38928, -41658, -28389, -4640, 20787, 38214, 41034, 28648, 5700, -19489, -36870, -40423, -29092, -7264, 17718, 35659, 40089, 29100, 7662, -16664, -34226, -39073, -29263, -8111, 15497, 33244, 38488, 29443, 8947, -14382, -31823, -37920, -29496, -10053, 13133, 30918, 37607, 29445, 10416, -12370, -29927, -36491, -29309, -11367, 10843, 28637, 36005, 29262, 11692, -9704, -27717, -35067, -28979, -12182, 8899, 26758, 34848, 29275, 13057, -7754, -25556, -33717, -28899, -13492, 6493, 24533, 33088, 28989, 13904, -5710, -23886, -32601, -29074, -14729, 4731, 22560, 31726, 28747, 15386, -4018]
683d018j7962r126K539J3153J8699J7171R781k195j1894j8344j7772r884J694
696b8158J1728J7701J7345R880j011j0512j7358j7472j0083J54J0596J7171J6902
709A6883J0466K77r861j7081j6815j0356l44Q831J6169J6541J0880R35q509j6000
723B016j5977j1146j447Q370J4867J6701J0772K128p656j5016j5862j1116k162
736b5528P165J4102J5739J1400K582p215j4040j5217j1233k968O416J3396J5357
749I956J1408L384n690j3531j4964j1405l296N514J2695J4731J1208M003n078
762A8935j2588j4541j1628l870M795J1526J4702J1387M485m624j1196j3933j1499
775a8049m624L853J1091J3941J1280N364l875j0595j3446j1607n407L174J0073
$$ y = [-4018, -21980, -31106, -28567, -15414, 3285, 20456, 30237, 28042, 16148, -2196, -19968, -29852, -28158, -16430, 1271, 18616, 28496, 27485, 16973, -385, -17857, -27940, -27786, -17190, -19, 16883, 27349, 27626, 17765, 684, -16131, -26487, -26831, -18000, -1831, 14710, 25590, 26525, 18016, 2016, -13961, -25107, -26554, -18184, -3317, 13384, 24156, 26284, 18628, 3612, -12250, -23366, -25528, -18363, -4261, 11478, 22878, 25460, 18245, 4205, -11012, -22245, -25213, -18797, -5401, 9956, 21364, 24748, 19058, 5527, -9437, -20842, -24138, -18624, -5929, 8802, 20010, 24013, 18935, 6347, -8194, -19822, -23692, -18897, -7371, 7331, 18718, 23203, 18579, 7383, -6550, -18049, -22673, -18820, -7729, 6212, 17492, 22856, 18981, 8386, -5060, -16667, -22074, -18900, -8827]
788h827J3531J1171N620k860r742j3075j1274n856K103R839J2681J1367O162j979
802A8861q489j2947j1544n946J335Q845J2109J1315O123j209p845j2109j1727
815a3228o444P05Q034J1810J1280O606m35o953j1629j1296o888K06O967J1390
829A25J1353O847Mo724j0770j1010p292m45O011J0478J1425P002N85n653j0593
844A343j0730p523q73N351J0372J0905P631J369n535r678j1016o738k203N331
858a1994R299J0693P265J765m676r384j0409p525k184M347R201J0165Q004K003
872A6570l883r061r858p478k345L718Q182J0128P769K624l414q529r824p939k587
887a5927L015P868R331Q286L089k929p509r617p838l302K651P351R536P979L385
$$ y = [-8827, 4704, 15875, 21495, 18635, 8893, -4182, -15456, -21312, -19209, -9370, 3311, 14678, 20840, 18861, 10372, -2575, -14119, -20065, -18730, -9885, 2224, 13539, 19662, 18453, 10608, -1501, -13228, -19672, -18967, -10933, 877, 12157, 18763, 18328, 11375, -254, -11550, -18438, -18232, -11265, 125, 11478, 18325, 18329, 11605, 835, -10175, -17467, -17912, -11901, -1423, 10002, 17004, 17589, 11936, 1343, -9387, -16910, -17783, -12432, -2060, 8845, 16476, 17845, 12310, 2632, -8384, -15122, -17325, -11994, -2695, 7998, 15263, 17028, 12352, 2968, -7441, -14966, -17150, -12803, -3602, 6563, 14567, 16570, 12687, 3626, -6232, -13710, -16055, -12337, -4155, 5973, 13742, 16366, 12952, 4423, -5401, -13340, -15927, -12912, -5044, 4287, 12573, 15662, 12733, 5224, -4393, -12231, -15533, -12882, -5531, 4005, 11984, 15369]
902A5369k270o873r177q130l853J971O920Q960P995L583j891o199q833q148l881
917a4457J439O385Q577P952M425j421n905q758p771m125J222N666Q305P448M793
932A3775q97n321q706p911m284L00N434Q154P566M599p7m918p644q151m399j27
948a2607M771P763P593M827K26m061p453q006n098o12M750O774P688N025O01m043
964H138o849p632n153o44L593O779P438N438P45k765o765p693n162j430L299O378
980b285P318N268J618l106o173p352n434j923L011O176P210N423J303k060n878
995C116p027n425k126K371O033P031N293K043k208n298o905n798k080J824N349
1010c807O771N250K533j814n129o415n375k581J500M998O385N683K783j665m188
$$ y = [15369, 13099, 6226, -2951, -11081, -14934, -12963, -6043, 2917, 10912, 14495, 12604, 6405, -2428, -10576, -14457, -13018, -6633, 1944, 9896, 14321, 12900, 6995, -1763, -9534, -13659, -12437, -6771, 1534, 8982, 13775, 12878, 7557, -1149, -9060, -13344, -13044, -7610, 544, 8110, 12709, 12632, 7714, 70, -8081, -12480, -12607, -7836, -73, 7520, 12347, 12573, 8512, 1059, -6947, -12045, -12657, -7907, -1133, 6555, 11580, 12181, 8138, 1289, -6343, -11496, -12140, -8547, -1768, 5670, 11108, 11853, 9088, 2323, -5370, -10532, -11962, -8663, -2285, 5033, 10301, 11919, 8813, 2640, -4712, -10146, -12069, -9058, -2882, 4328, 9751, 11054, 8994, 3116, -3911, -9336, -11462, -9091, -3058, 3973, 9266, 11309, 9101, 3803, -3102, -8900, -10980, -9156, -3807, 2964, 8214, 10747, 8933, 3804, -2611, -7986, -10567, -9067, -4069, 2316, 7999, 10782, 9117, 4929]
1025D929o557n634k991J423M348N892N843K934r84m346o201n486k839N60L994
1040e115O006N333K866q4l780n938n393l153J53L925N858N127L460k33l617n135
1056B80n672l551j55L286N736N093L693J50l227n457n185l674RL140M886N292
1072D644L251P97k715m877n335l529o70K678M470N483L511O73k294m600n370l618
1088g501j102K399M672M946L644J215k094m317m902l852j406K112M283M763L670
1103F530J511j557m377m486m140j387J306M088M818L814J744j395l777m916l610
1118e834j938J069L990M764L656J880j028l455m678l842j894Q88L308M290M079
1133E255K030r13l233m395l888k134P29L169M155M025K190m00l075m138m059k023
$$ y = [4929, -1628, -7262, -10253, -8830, -4482, 1410, 7253, 10187, 9203, 4857, -1344, -6830, -9669, -9109, -5115, 891, 6224, 9090, 9006, 5226, -712, -6105, -9258, -9105, -5180, 678, 5805, 9265, 9032, 5415, 280, -5392, -8943, -9098, -5812, -76, 5017, 8710, 8860, 5633, 176, -5009, -8683, -8674, -5534, -648, 4644, 7895, 8692, 5977, 1100, -4235, -7764, -8434, -5756, -1286, 4197, 7708, 8381, 6087, 1487, -3883, -7501, -8603, -6204, -1532, 3414, 7058, 8273, 6179, 1862, -3040, -6892, -8298, -6186, -1903, 2860, 6530, 8041, 6484, 2107, -2379, -6519, -7906, -6600, -2512, 2306, 6120, 7864, 6469, 2692, -2224, -5834, -7772, -6703, -2713, 2051, 5707, 7587, 6559, 3104, -1574, -5416, -7310, -6422, -3114, 1176, 5255, 7285, 6372, 3139, -1256, -5144, -7278, -6549, -3380, 775, 4800, 6990, 6590, 3515, -623, -4682, -6705]
1149f705N11K796L792L992K273m8k728m054m123k132M97J991L985L860K596m58
1165F045k222l712m052k148M3J688M038L862K539J49k178l319l783k596p07K462
1181c891L463L640K347N44k162k910l551l199l59J735L438L414K602P95j565l281
1197A060l575k365j011J495L147L485K662N81r56l262l471k492j002J088K892
1212a724L410K848R36j190k500l540k544j036P81K781L177K795J013k80k900l180
1228a153k903j172P70K378L253K774J198p22k326k960k810j519O49K416K936K863
1244C672J298n85k183k945k638j745P77J803L498K319J739m96j939l056k511j937
1260d929N19J741K923K796J444L2k154k431k731j538J13J463K341K895J692N36
$$ y = [-6705, -6194, -3398, 394, 4386, 6659, 6611, 3883, -171, -4294, -6426, -5929, -3938, 47, 3907, 6503, 6045, 3823, 111, -3941, -6089, -6046, -4358, -320, 3542, 6081, 6230, 4052, 733, -3050, -5646, -6353, -3891, -428, 3212, 5559, 6103, 3941, 1031, -2520, -5719, -6078, -4343, -905, 2509, 5111, 5906, 4341, 1060, -2515, -4880, -5891, -4396, -1249, 2236, 4898, 5479, 4523, 1261, -2210, -4702, -5704, -4616, -1724, 1686, 4534, 5470, 4280, 1780, -1760, -4304, -5340, -4559, -1778, 1399, 4194, 5207, 4927, 2027, -1153, -4056, -5228, -4458, -2080, 1173, 3947, 5145, 4423, 2097, -863, -3673, -5192, -4543, -2127, 809, 3672, 4970, 4385, 2202, -743, -3381, -5126, -4349, -2546, 952, 3271, 5010, 4514, 2575, -481, -2992, -4929, -4410, -2669, 254, 3050, 4494, 4526, 2372, -59, -2790, -4328, -4215, -2752, -411, 2484, 4176, 4712]
1276D712k184k129l050j581P8J325K606K532J454N04j511k265k523k037l8J287
1292b820K533K373J792L57j380k288k637j795l41J454K009K419K080K83r40k367
1308G32k244j938n95J150K120K311J882L75o12k113k471j672p70O84J884K698
1324A421J945M70o88j871k435j589j041O40J918K208J589J063n17k113j636k203
1340b839p01N27J673K298J477J394p97j573j866k025j026L47J781J765J759R34
1356C128jj413k334j843q51M07J131K094J775J028m1j147k314j416j299J12J100
1373a884J758J936J189J98j370j678j693j530OJ269J706J843J297k6j041j702
1389B78j922j335J90O61J914J457J585R2r39j627j872q49l31O93J524J612J203
$$ y = [4712, 2528, 399, -2651, -4232, -4154, -2829, -223, 2309, 3763, 4267, 2756, 491, -2032, -4069, -4107, -2820, -287, 2086, 3878, 4235, 2855, 567, -2070, -3865, -4206, -2752, -743, 1676, 3756, 4039, 3099, 732, -1512, -3450, -4045, -2895, -775, 1536, 3418, 3793, 3181, 1068, -1403, -3075, -3845, -3161, -1277, 1421, 3366, 3836, 3148, 1277, -1158, -2747, -3788, -3148, -1230, 978, 2567, 3630, 3113, 1000, -636, -2839, -3540, -3013, -1340, 958, 2435, 3829, 3032, 1459, -407, -2432, -3458, -3111, -1330, 435, 2194, 3128, 3127, 1714, -620, -2463, -3314, -2907, -1776, 318, 2093, 3121, 3080, 1933, -381, -1797, -3096, -2984, -1884, -126, 1810, 2999, 3197, 1827, 149, -1544, -3074, -3068, -1799, -93, 1750, 3047, 3021, 1980, 278, -1644, -2979, -2789, -2128, -214, 1243, 2828, 2920, 1981, 354, -1518, -2367, -2698, -2005, -481, 1131, 2334]
1406B334J39n57j366j584j446j27P39J217J904J126L33r37j048j819j189m14N88
1423b107J433J502J103N67l83j551j501j293n57Q65J161J508J401K44m63j140
1439G89j370j336n07L29R87J513J497K17P4j143j412j314q71N11Q98J563J326
1456A751N78m24p90j389j059j034N04R54J318J137M56R6r56j317j330q49K76J026
1474a052J103J483L00Kp20r40j270q39m9N73J698Q23P22K62j030j035q83r43m11
1493b206R20J421R37O38L71p06j151j155q90J77L79O49J904M86n1l79q39j407
1511i02n64j87J42J487Q92P44L30p56r77r72o93m52L94J086J283N90M91q87o23
1530D26r87r48r1K48R22R67Q63K48o8j131q68q61l49J90Q18J098Q99K84k26r48
$$ y = [2334, 2473, 1916, 550, -1034, -2480, -2607, -1868, -651, 1253, 2379, 2712, 1775, 727, -1092, -2281, -2695, -2107, -674, 828, 1931, 2498, 2115, 564, -937, -2230, -2787, -1922, -761, 747, 2148, 2392, 1929, 789, -581, -1917, -2424, -2095, -1108, 405, 1902, 2119, 2193, 1050, -362, -1676, -2547, -2036, -1138, 425, 1751, 2329, 1905, 1115, -274, -1333, -2367, -1863, -909, 409, 1546, 2002, 2098, 1142, -175, -1505, -2354, -2078, -1052, 51, 1534, 1834, 1836, 1116, 176, -1094, -1933, -1982, -1409, 289, 1112, 1834, 2096, 1066, 31, -852, -1795, -2206, -1286, 135, 1072, 1710, 2081, 1375, 224, -931, -1821, -1644, -1265, -616, 1288, 1774, 1723, 1344, 505, -902, -1466, -1653, -1511, -24, 868, 1612, 1942, 1186, 209, -763, -1456, -1908, -1514, -428, 855, 1445, 1936, 1049, 426, -561, -1509, -1600, -1352, -430, 537, 1400, 1648, 1580, 449, -419, -1280, -1629, -1439, -621, 477, 1376, 1660, 1434, 486]
1550D86r93r59n9L01P08J022M92M59l12m45r24j137j32k8P14J105Q92J52j0n61
1570G71j191p43j82k6R29N66P21M25N9o35r28o65l95P3J84R44J029L93n1n41r05
1591a68n18o98L03L01P40Q19K91P00j018n40r15m07l86N55Q21P42O18j72r7m57
1611E14q78j020O2P05M07P04P21j87l91m41p59o84r3N25L59J213R5K95m25m19
1631C03q33k32m85K83N50N41O80K90j68n40n91n69l36J38O89P61J39O37m24n66
1651B67o86l19n04K25P70P43L71Q0k1n62p41k78k44K7M37N19P21J25k06j86o06
1672f8n11n42P7N74P65M62L58j56o73l82p13k08P6M75L57O38K62P8l60n86p09
1693g86k83J58L06O32L67K30L60l21p38q95J36k0J34Q90Q8M04O4j82j87q82N9
$$ y = [486, -507, -1466, -1525, -1224, -516, 506, 998, 1457, 1145, 700, -224, -1361, -1493, -1521, -807, 298, 1190, 1342, 1332, 771, -420, -1163, -1345, -1371, -442, 124, 845, 1270, 1329, 694, -234, -899, -1294, -1221, -1037, -93, 936, 1329, 1278, 737, -168, -686, -1384, -1081, -780, -40, 779, 1070, 1770, 752, 212, -703, -1110, -1496, -941, -120, 622, 1240, 1068, 971, 514, -364, -1384, -1322, -617, -210, 494, 1215, 1028, 637, 196, -563, -1247, -1340, -815, -456, 757, 852, 1147, 722, 303, -530, -762, -1247, -964, -414, 127, 807, 1097, 929, 389, -202, -771, -1107, -969, -280, 481, 620, 1257, 833, 267, -419, -738, -1242, -1017, -247, 496, 867, 947, 926, 364, -377, -655, -899, -872, -435, 84, 805, 930, 724, 538, -68, -579, -1121, -1044, -470, 295, 757, 1115, 959, 286, -96, -809, -1017, -941, -466, -109, 529, 791, 869, 509, -77, -786, -1069, -911, -605, 27, 394, 624, 984, 663, -75, -970, -834, -854, -720, 170, 258, 662, 726, 544, 357, -525, -466]
1714d66l86K46O90L54K14M24o58k22l61p04O2J56O33K78J46K99Ro25k43l58j17
1735f29J42K51N12N55P6l41k90n10j5o60M73M28J14K56K90J83p61k61l79r2m5
1756g03M91M98K76J42J00m41l54p06J04o6M62J68R81n8l97k87j61m16k35q5N72
1777a15P0P88j66p7j29k38m71l31K48J03K47O74O1N2l38j90m84k22J35k23O49
1798D3J52N74k25m3l35p21k11L0L64N78R7L13J08l73l54n28Q8n8K47L36K53l1
1820C04L31j27n14l52m39J94K7N38K60M54j89k41k65j84l70J80j33L10L52L86
1840E22r9M81q58q2m54k15M51J6O48p6J69ol49k74j43q6k45M93K15K52J14K4m53
1863D5l20j60k1m9N47N7J96J54J02o28j71k63j56K40K85L80L7q5M63l76m97l7
$$ y = [-466, -852, -606, 84, 438, 652, 1076, 418, 196, -165, -869, -807, -651, -18, 260, 406, 705, 714, 89, -154, -512, -629, -487, -236, 276, 831, 907, 566, 276, -234, -249, -909, -436, -8, 106, 362, 652, 835, 74, -187, -566, -658, -703, -212, 286, 562, 704, 804, 363, 9, -697, -593, -659, -197, -29, 952, 894, 497, 210, 49, -367, -602, -687, -115, -45, 743, 577, 500, 371, 133, -338, -669, -421, -318, -71, 603, 664, 716, 378, 188, -296, -518, -383, -606, 43, 195, 769, 544, 501, 166, -555, -766, -736, -372, 206, 303, 616, 724, 351, -3, -531, -443, -501, -254, 82, 335, 304, 635, 508, -6, -358, -797, -603, -576, -38, 222, 676, 487, 246, -19, -203, -573, -393, -526, -216, 136, 522, 423, 904, 46, -36, -490, -705, -254, -238, 410, 334, 503, 497, 148, -126, -269, -355, -600, -107, 108, 360, 474, 498, 45, -275, -435, -456, -505, 42, 99, 295, 449, 551, -77, -248, -511, -667, -427, -142, 238, 275, 190, 653, 277, -220, -257]
1885b57j08k45J86O16j31N27p4k95k30o9n34K50L89Q4J05J78R2k20l03o3j95J08
1907a89j26N14J2R4J90qn68j06n31K29L18K30L36l60M77k14j95l90M2m5K06j18
1929b02L06K73K93m32j28k06K0l22J78K27QL55O0p8k08m14j47r8J81J97J06M41
1951D10rK44p14R2j71l31qO11N0K68j18J84m95N1l10k86J78J69M17M8kQ0k59l02
1975b03j20r9J3J79L98J16R9j90qj02m08K64j65J80K07Q4J0K9l8k32j07l64M31
1998b6j89J81J85j22K66k04r6l93L0L44l82J51M05J36j71J94k99K57l78k50K72
2019h9Q4N6K85j36J67n73Q7j79J4J20N8L55r0K22l16J57n25m3o9K87J56J18p4
2042G2m0O6oJ59m38K70m73K40k37O81l63m0K24J41l68j50l8M67Q0j13K02K4n48
$$ y = [-257, -365, -610, -424, 192, 61, 588, 514, 219, -11, -80, -614, -364, 25, 109, 214, 392, 484, 264, -39, -102, -297, -189, -315, 199, 211, 305, 495, 487, -81, -187, -718, -489, -171, 59, 395, 35, 512, 298, 103, -287, -245, -290, -84, -202, 104, 377, 670, 238, 110, -96, -76, -398, -220, 7, 15, 370, 430, 352, 144, -270, -417, -515, -334, -137, -31, 410, 401, 645, -69, 23, -148, -479, -487, 124, 174, 442, 324, 508, 13, 64, -246, -532, -354, -185, 232, 280, 278, 358, 99, -203, -323, -422, -409, -230, 168, 284, 383, 193, 185, 83, -325, -61, -226, -46, 161, 245, 255, 284, 246, 14, -93, -457, -26, -215, -34, 151, 29, 295, 91, -5, -398, -368, -24, -406, -255, 150, 286, 115, 309, 10, 267, -111, -361, -89, -5, 51, 336, 200, 367, -206, -119, -298, -284, -164, -106, 249, 159, 381, 65, 222, -303, -346, -415, -128, 28, 146, 72, 32, 98, 92, 251, -187, 83, -390, -150, -387, 294, -69, -109, 115, 256, -112, -262, -300, 167, 247, 134, 336, 360, -188]
2065a88k45M01k06j80K06J39K93K09o6l48l07pk0PJ16L32J11j40J62j25m36k4
2087c16K4K22j20M58q6j29N2k1L5l00m9J86p4M06k41K59o1j70L1j5l89pL36n9
2111b8K38j92j14N0J0l97K70k27O42m1L4l7l50R8m6K39k23o0j61N3M45J35q7P3
2135C24n22L31j34j37o9P3K45O4L9j40j14j8m0r9J01l8jQ86p27l6j11Mj5K1j4
2160a27J83K82j89J70k73l6k25O3P3j6L4L3K75j12J08j35k43R8r3J29j56M28k67
2183DJ06K23q8j67j27k51P8J82J68KK3p7J10k54k44J81R8M64m41J8k43K87k19
2206a67N5J14j69O4k45J39L37k98N1L09j00j23N6o0J84m1l13J13L28j25k13l4
2228a38L00m78K54K18k6J4k3J22j04j33l06L43j89J14K90q4K32m41qN4O9j36n2
$$ y = [-188, -433, -32, -238, -418, -212, -73, 220, 429, 363, 15, -292, -299, -319, -312, -196, 136, 247, 107, 269, 144, -292, -316, -292, -70, -190, 268, 182, 53, 105, 84, 119, -181, -230, -44, -118, 288, 47, 306, 245, 75, 106, 91, -298, -305, 31, -28, 210, 18, -96, -46, -36, -433, -163, -390, 252, 211, 245, 208, -142, -44, -90, 149, -74, -134, -295, -242, 203, 338, 251, 324, -198, 133, -1, -138, -207, -134, 111, 175, 214, 74, -40, -58, -98, -197, -96, -134, -135, 751, 24, -12, -123, -119, -134, -113, -127, 56, 338, 149, 319, 46, 10, -215, -152, -79, -95, -61, -28, 247, 135, 243, 108, -135, -37, -130, -1, -157, 271, 4, 110, 333, 245, 78, -49, -300, -222, -40, 128, 130, 153, 76, 186, -68, -312, -131, -33, 431, -10, 8, -235, 52, -167, -112, 2, -167, -103, -348, -209, 128, -170, -119, 190, 90, -33, 23, -37, 147, 106, -207, -94, 234, 109, -104, -138, 162, -316, -62, 156, 130, 144, 121, 243, 139, 6, -300, 43, -146, -32, 258, 174, 406, -35, -43, 11, 80, -56, -108]
2251a08M8Q0j21K66k27J47j30j39K22R5l13p1M06j80L9J36j6j16j0J1j34J36R6
2274A17oQ4q6j58j63K79j02j60M27q3m6k53K17o4o22M88R2j78R9L55k36J15k47
2297a31NK0K38j37j18j76L50l8J04Lj22p3j30j46Q0N93m78L01j96P4j92L09l26
2320a86j01L93l53N0Q2K68j70K22k69kl03R7K78j88M10l06J21J24j15K4j71P7
2342a8Q1k16n3J86K70Q5l80J75j59k27K26m3j78L87P1q9p5k4K4j74q7K10L65l58
2366aOO2l41J61K99m91M21k09K60l2K40k15j27N1k15J19p4K05p2p1J5J87k6n47
2390c95J80N8k1j15L93j22K36k1L5j33k35p8J58J40j65K52k91K39J57k45k11J74
2412a0k89M88m63K13OQ1K6p7Q0l02L90m89K85P2J21l0J43j26j27o1K1J81l34J49
$$ y = [-108, -60, 20, -101, 165, -62, 85, -45, -184, 38, 133, -180, -251, 155, -25, 14, 150, 134, 18, 8, 19, -115, 21, 117, 111, 195, 109, -49, -212, 67, -35, -195, 232, 149, 103, -150, 67, 3, -619, -131, -39, -217, -118, 237, 1, 116, -131, -126, -106, 132, -5, -123, -299, 51, 13, 117, 120, -2, -75, -205, -351, -271, 322, -156, 145, -51, 23, -169, 140, -186, -287, 106, -247, -197, -115, 153, -17, 205, -64, -66, -369, -272, 6, -182, 228, -78, 43, 167, 52, 76, -95, -18, 63, -153, -206, -20, 250, 335, -45, 130, -29, -256, -30, -73, -251, 136, 207, 118, 43, 19, 43, -131, -218, -8, 357, -1, 5, 67, -274, -113, 186, -305, 116, -93, 167, 135, 375, 160, 33, 84, -131, -12, -86, 119, 47, -24, -9, 178, 152, -395, -215, -157, -178, -293, 100, -22, 214, 193, 228, 95, -140, -218, -60, 80, -85, 167, -124, 115, 272, 27, -184, -10, -299, 189, -274, -61, -55, 26, 52, -25, 55, -247, 143, -346, -61, 11, 132, 102, 245, 119, -8, -69, -48, 133, -201, -52]
2436e2k0J41Q2K08k04J2j10J0o8j86L11j33K62l49J81o8QK9n4l9J00n3J92j10
2460I0k34J88k18o3n4J53l5L03j77L0J50l60L20m9k39K43Q5m5J99j47j14K57r9
2483A84m21p2N43n87O80k68l43M06j30l3j28O1P4j80j32M08K5k92P2JP2j69J15
2506a14J77l10L68L01j88k91J00j25M5j15K36j74o2K29l6M6J96j51j42m8L7J28
2528A07J28j45J76k27k8p4k3J97k17J48Q2j59K01l82J43n0j20L63m5l54L9K54
2550A4J64k27j81R5j5J42k1k9j61L16N8J42m32K25l0lO7j45jJ69j15k62J34R1
2574er7L29l76j4J42L73k97M2O3jk00%o8O6NJ35K7j42K06j63k96L30j24K57j34
2599E8J52Q7l25J87q8q1O6k20J24%K3Q1j73L32j65j10j39m9J81j83K80j3K29j47
$$ y = [-52, -72, 69, 151, 359, 155, 167, 57, 67, -1, -187, 124, -9, 253, -96, 85, 17, 25, 54, 0, -39, 61, 8, 200, 90, -144, 44, -174, -237, -291, -138, -173, 130, -47, -17, 133, -227, 93, 44, -195, 48, 133, 88, 287, 140, 26, 283, 184, -237, -309, 234, -353, 327, 59, -284, 122, -8, -41, -169, -108, -34, -214, -346, 62, 87, -205, -133, -132, -60, -229, -114, 63, -247, 121, 422, 234, -57, 43, -82, -37, -152, 84, -90, -152, 77, 41, 87, 283, 132, -10, -58, -21, 107, 235, 90, 266, 39, 11, -63, -86, 111, -106, 42, 124, -35, 166, -216, -73, -123, -243, 120, 75, -279, -240, 14, 178, -49, -230, -135, -150, -8, -29, -58, -219, 97, 155, 297, -135, 90, 60, 57, 124, -21, -22, 147, 32, -230, -96, -5, -102, 227, -149, -163, -21, 352, 55, 97, 160, 159, -41, -41, -109, -43, -38, 97, 124, -18, 188, 25, -271, 59, -65, 192, 58, 210, 297, -28, 159, 71, -10, 56, -164, -40, -40, -17, 64, -109, 223, 58, -52, -191, -240, -59, -242, 38, 25, 254, 107]
2623A07k68J13k79J53J72K7J48j51J88k39jk64M23k52Q0lJ28K7N4j89K94k07k66
2646b05J40j17J76R5K2j98m8L75j45k38j50J65j11p3K08M96k85R4j11j41j12K29
2668F6l19K49q3L20r6Rl39j0J21K10j89N9J98p5k21J86j6j59r1p7K47j57K30o1
2692BO2m7j1j19K31k77j05L08j2K92k35j58O3N0l44J56J1M9J59K87j53k22K4l4
$$ y = [107, -161, -48, -327, -174, -2, 25, 173, 22, 210, -29, -30, -294, 129, -123, -43, -46, 82, 109, 163, -26, 268, 61, -205, -65, -182, -6, 89, 111, -87, -135, 240, 95, -143, -293, -128, -239, -312, -104, 392, 107, 201, 90, -51, -163, 66, -253, -4, -87, 233, 137, 146, -193, -203, -82, 128, -61, -2, 196, 121, -100, 86, 70, -89, -180, -257, -10, -167, 63, 2, 64, 17, 6, -113, 118, -159, -264, 44, 32, 324, 89, -69, -6, 44, -300, -144, -133, -84, 75, 362, 209, -13, 11, -23]
$$ [...]
8191B75
##END NTUPLES=NMR FID
##END=
