##TITLE=1H_DE-74_oil
 D2O
 8 sc, 
 7.11.2024
##JCAMPDX= 6.0         $$ Bruker NMR JCAMP-DX V2.0
##DATA TYPE= NMR FID
##DATA CLASS= NTUPLES
##ORIGIN= UXNMR, Bruker Analytische Messtechnik GmbH
##OWNER= root
$$ XWIN-NMR		Version 3.5
$$ Fri Nov  8 16:16:29 2024 Russian Standard Time (UT+4h)  she@DPX200
##.OBSERVE FREQUENCY= 200.1315
##.OBSERVE NUCLEUS= ^1H
##.DELAY= (6, 6)
##.ACQUISITION MODE= SIMULTANEOUS
##.ACQUISITION SCHEME= undefined
##.AVERAGES= 8
##.DIGITISER RES= 18
##SPECTROMETER/DATA SYSTEM= spect
##.PULSE SEQUENCE= zg30
##.SOLVENT NAME= D2O
##.SHIFT REFERENCE= (INTERNAL, D2O, 0, 15.7039)
##AUDIT TRAIL= $$ (NUMBER, WHEN, WHO, WHERE, WHAT)
$$ ##TITLE= Audit trail, XWIN-NMR		Version 3.5
$$ ##JCAMPDX= 5.01
$$ ##ORIGIN= Bruker BioSpin GmbH
$$ ##OWNER= she
$$ F:/spectra/data/she/nmr/H-F/1/audita.txt
$$ ##AUDIT TRAIL=  $$ (NUMBER, WHEN, WHO, WHERE, WHAT)
(   1,<2024-11-08 16:15:38.34 +0400>,<she>,<DPX200>,
      <created by zg, POWCHK disabled, PULCHK disabled
       configuration hash MD5:
       00 E9 B6 7A A2 85 ED C7 34 08 36 98 17 FE 4E 26
       data hash MD5: 16K
       4B C1 61 37 AE 13 01 C7 3F 6F 55 56 A9 B5 6E B7>)
$$ ##END=
$$ 
$$ hash MD5
$$ EA AD 1E CC 80 AF 2D DD BC E6 28 CA 89 90 F2 96
##$RELAX= 
##$RELAX= 
##$RELAX= 
##$RELAX= 
##$RELAX= 
##$RELAX= 
$$ Bruker specific parameters
$$ --------------------------
##$DU= <F:/spectra>
##$EXPNO= 1
##$NAME= <H-F>
##$PROCNO= 1
##$TYPE= <nmr>
##$USER= <she>
##$AMP= (0..31)
100 100 100 100 100 100 100 100 100 100 100 100 100 100 100 100 100 100 
100 100 100 100 100 100 100 100 100 100 100 100 100 100 
##$AQSEQ= 0
##$AQ_mod= 1
##$AUNM= <au_zg>
##$AUTOPOS= <>
##$BF1= 200.13
##$BF2= 200.13
##$BF3= 200.13
##$BF4= 200.13
##$BF5= 200.13
##$BF6= 200.13
##$BF7= 200.13
##$BF8= 200.13
##$BYTORDA= 1
##$CFDGTYP= 0
##$CFRGTYP= 5
##$CHEMSTR= <none>
##$CNST= (0..31)
1 1 145 1 1 1 1 1 1 1 1 1 1 1 1 1 1 1 1 1 1 1 1 1 1 1 1 1 1 1 1 1 
##$CPDPRG= <>
##$CPDPRG1= <>
##$CPDPRG2= <>
##$CPDPRG3= <>
##$CPDPRG4= <mlev>
##$CPDPRG5= <mlev>
##$CPDPRG6= <mlev>
##$CPDPRG7= <mlev>
##$CPDPRG8= <mlev>
##$CPDPRGB= <>
##$CPDPRGT= <>
##$D= (0..31)
0 1.2 0 0 0 0 0 0 0 0.06 0 0.03 0 0 0 0 0.0002 0 0 0 0 0 0 0 0 0 0 0 0 
0 0 0 
##$DATE= 1731068137
##$DBL= (0..7)
120 120 120 120 120 120 120 120 
##$DBP= (0..7)
150 150 150 150 150 150 150 150 
##$DBP07= 0
##$DBPNAM0= <>
##$DBPNAM1= <>
##$DBPNAM2= <>
##$DBPNAM3= <>
##$DBPNAM4= <>
##$DBPNAM5= <>
##$DBPNAM6= <>
##$DBPNAM7= <>
##$DBPOAL= (0..7)
0.5 0.5 0.5 0.5 0.5 0.5 0.5 0.5 
##$DBPOFFS= (0..7)
0 0 0 0 0 0 0 0 
##$DE= 6
##$DECBNUC= <off>
##$DECIM= 24
##$DECNUC= <off>
##$DECSTAT= 4
##$DIGMOD= 1
##$DIGTYP= 9
##$DL= (0..7)
0 120 120 120 120 120 120 120 
##$DP= (0..7)
150 150 150 150 150 150 150 150 
##$DP07= 0
##$DPNAME0= <>
##$DPNAME1= <>
##$DPNAME2= <>
##$DPNAME3= <>
##$DPNAME4= <>
##$DPNAME5= <>
##$DPNAME6= <>
##$DPNAME7= <>
##$DPOAL= (0..7)
0.5 0.5 0.5 0.5 0.5 0.5 0.5 0.5 
##$DPOFFS= (0..7)
0 0 0 0 0 0 0 0 
##$DQDMODE= 0
##$DR= 18
##$DS= 0
##$DSLIST= <SSSSSSSSSSSSSSS>
##$DSPFIRM= 0
$$ [...]
##$SUBNAM2= <"">
##$SUBNAM3= <"">
##$SUBNAM4= <"">
##$SUBNAM5= <"">
##$SUBNAM6= <"">
##$SUBNAM7= <"">
##$SUBNAM8= <"">
##$SUBNAM9= <"">
##$SW= 24.0689530833862
##$SWIBOX= (0..15)
0 0 2 0 0 0 0 0 0 0 0 0 0 0 0 0 
##$SW_h= 4816.95568400771
##$TD= 16384
##$TD0= 1
##$TE= 0
##$TE2= 300
##$TE3= 300
##$TEG= 300
##$TL= (0..7)
0 120 120 120 120 120 120 120 
##$TP= (0..7)
150 150 150 150 150 150 150 150 
##$TP07= 0
##$TPNAME0= <>
##$TPNAME1= <>
##$TPNAME2= <>
##$TPNAME3= <>
##$TPNAME4= <>
##$TPNAME5= <>
##$TPNAME6= <>
##$TPNAME7= <>
##$TPOAL= (0..7)
0.5 0.5 0.5 0.5 0.5 0.5 0.5 0.5 
##$TPOFFS= (0..7)
0 0 0 0 0 0 0 0 
##$TUNHIN= 0
##$TUNHOUT= 0
##$TUNXOUT= 0
##$USERA1= <user>
##$USERA2= <user>
##$USERA3= <user>
##$USERA4= <user>
##$USERA5= <user>
##$V9= 5
##$VALIST= <valist>
##$VCLIST= <CCCCCCCCCCCCCCC>
##$VD= 0
##$VDLIST= <DDDDDDDDDDDDDDD>
##$VPLIST= <PPPPPPPPPPPPPPP>
##$VTLIST= <TTTTTTTTTTTTTTT>
##$WBST= 1024
##$WBSW= 4
##$XGAIN= (0..3)
0 0 0 0 
##$XL= 0
##$YL= 0
##$YMAX_a= 192762
##$YMIN_a= -191934
##$ZGOPTNS= <>
##$ZL1= 120
##$ZL2= 120
##$ZL3= 120
##$ZL4= 120
##$ABSF1= 10
##$ABSF2= 0
##$ABSG= 5
##$ABSL= 3
##$ALPHA= 0
##$AQORDER= 0
##$ASSFAC= 0
##$ASSFACI= 0
##$ASSFACX= 0
##$ASSWID= 0
##$AUNMP= <proc_1d>
##$AZFE= 0.1
##$AZFW= 0.1
##$BCFW= 1
##$BC_mod= 2
##$BYTORDP= 1
##$COROFFS= 0
##$CY= 11.3945322036743
##$DATMOD= 1
##$DC= 2
##$DFILT= <>
##$DTYPP= 0
##$F1P= 15.6554695791079
##$F2P= 12.8336369535428
##$FCOR= 0.5
##$FTSIZE= 0
##$FT_mod= 4
##$GAMMA= 1
##$GB= 0.15
##$INTBC= 1
##$INTSCL= 1
##$ISEN= 128
##$LB= 0.24
##$LEV0= 0
##$LPBIN= 0
##$MAXI= 10000
##$MC2= 0
##$MEAN= 0
##$ME_mod= 0
##$MI= 1.114404
##$NCOEF= 0
##$NC_proc= 0
##$NLEV= 6
##$NOISF1= 3.799351
##$NOISF2= 2.8
##$NSP= 1
##$NTH_PI= 0
##$NZP= 0
##$OFFSET= 15.70392
##$PC= 1
##$PHC0= -26706.91
##$PHC1= 4.787439
##$PH_mod= 1
##$PKNL= yes
##$PPARMOD= 0
##$PSCAL= 0
##$PSIGN= 0
##$REVERSE= no
##$SF= 200.130013532006
##$SI= 16384
##$SIGF1= 3
##$SIGF2= 2
##$SINO= 400
##$SIOLD= 16384
##$SREGLST= <1H.CDCl3>
##$SSB= 0
##$STSI= 0
##$STSR= 0
##$SW_p= 3612.71676300578
##$SYMM= 0
##$S_DEV= 0
##$TDeff= 0
##$TDoff= 0
##$TI= <>
##$TILT= no
##$TM1= 0
##$TM2= 0
##$TOPLEV= 0
##$USERP1= <user>
##$USERP2= <user>
##$USERP3= <user>
##$USERP4= <user>
##$USERP5= <user>
##$WDW= 1
##$XDIM= 8192
##$YMAX_p= 0
##$YMIN_p= 0
$$ End of Bruker specific parameters
$$ ---------------------------------
##NTUPLES= NMR FID
##VAR_NAME=  TIME,          FID/REAL,        FID/IMAG
##SYMBOL=    X,             R,               I
##VAR_TYPE=  INDEPENDENT,   DEPENDENT,       DEPENDENT
##VAR_FORM=  AFFN,          ASDF,            ASDF
##VAR_DIM=   8192,          8192,            8192
##UNITS=     SECONDS,       ARBITRARY UNITS, ARBITRARY UNITS
##FACTOR=    0.0002076,     1,               1
##FIRST=     0,             0,               0
##LAST=      1.7004516,     0,               0
##MIN=       0,             -191934,         0
##MAX=       1.7004516,     192762,          0
$$ Real data points
##PAGE= N=1
##DATA TABLE= (X++(R..R)), XYDATA
$$ plain form
0 0 0 0 0 0 0 0 0 0 -7 7 -7 7 -13 14 -14 21 -22 28 -33 40 -47 54 -63 73 -85 97 -112 129 -147 164 -187 211
32 211 -238 266 -299 334 -371 411 -460 510 -563 625 -692 766 -848 938 -1039 1154 -1281 1432
50 1432 -1603 1802 -2041 2332 -2689 3148 -3753 4594 -5828 7776 -19239 192762 66314 -128972
64 -128972 -51933 19049 142736 -14757 -186656 42003 164956 -46276 -94317 -25386 78506
75 78506 87634 -99282 -103731 107071 88550 -80438 -69546 16891 88882 33734 -138349 -19208
87 -19208 131748 7255 -79446 -44527 43274 104838 -56251 -127556 80352 92092 -46836
98 -46836 -71031 -17534 100132 39897 -121562 -34397 111469 30386 -77819 -46948 42116
109 42116 84044 -35061 -102874 38408 95516 -28243 -74886 -2119 62769 46172 -80755
$$ packed form
0@%%%%%%%%pJ4j4J4k0K7k8L5m3N0o1P3q7J01j17J36j58J82k09K41k76L11l51L98
32B11m49N04n65O33p05P82q71R70j073J188j317J458j614J786j977K193k435K713
50A432l035L405l843M373n021N837o901Q347j0422J3604k7015K12001j26448j95286
64a28972P7039P0982J23687j57493j71899K28659J22953k11232m8041O8931J03892
75G8506R128j86916m449K10802j8521j68988J0892Q6437P1991n5148j72083J19141
87a9208J50956j24493q6701L4919Q7801O1564j61089p1305K07908J1740j38928
98d6836k4195N3497J17666o0235j61459Q7165J45866q1083j08205L0871Q9064
109D2116M1928j19105o7813J41282N7108j23759m6643P2767O4888j6597j26927
$$ plain form
120 -80755 -56577 90064 39725 -57686 -47918 24409 74484 -13928 -89632 15936 80644 -7719
132 -7719 -59182 -24039 57248 47873 -63222 -51440 56186 51196 -40716 -49587 14314 60436
144 60436 6172 -77776 -4073 72524 5476 -51120 -24107 35573 51536 -36801 -65167 45335
156 45335 52464 -29116 -44188 -1325 57053 14476 -66159 -16104 62494 16605 -46170 -26873
168 -26873 29456 46494 -27233 -54241 26244 50220 -16745 -42913 -1152 40464 21419 -50056
180 -50056 -24617 50527 18777 -31626 -27465 15665 43244 -11190 -51715 13055 46347 -7002
192 -7002 -33708 -13281 34555 27271 -40373 -29323 37723 28309 -27188 -28690 11064 37456 -1830
205 -1830 -47552 3741 42765 -663 -32438 -11938 26223 26205 -27331 -32658 29994 26563 -18703
$$ packed form
120h0755K4178J46641n0339r7411R768P2327N0075q8412p5704J05568O4708q8363
132g719n1463L5143Q1287r375j11095J1782J07626m990r1912q871O3901M6122
144F0436n4264q3948P3703P6597o7048n6596K7013N9680J5963q8337k8366J10502
156D5335P129q1580j5072M2863N8378m2577q0635N0055P8598m5889o2775J9297
168b6873N6329J7038p3727k7008Q0485K3976o6965k6168M1761M1616j9045p1475
180e0056K5439P5144l1750n0403M161M3130K7579n4434m0525O4770L3292n3349
192g002k6706K0427M7836p284o7644J1050O7046r414n5497j502L9754K6392l9286
205a830m5722N1293L9024m3428l1775K0500L8161j8n3536n327O2652l431m5266
$$ plain form
218 -18703 -25414 3053 34018 3525 -38536 -4727 36046 6617 -26727 -14700 19103 27313
230 27313 -19608 -31464 19028 28588 -12145 -26248 929 26610 9951 -33344 -10863 32781
242 32781 8953 -21569 -15582 13602 25072 -11606 -29995 12293 27067 -7825 -21295 -4491
254 -4491 23142 11918 -26646 -13474 24490 14166 -18325 -15903 9326 22937 -4681 -28297
266 -28297 5900 25722 -2604 -20366 -5568 18325 14608 -19786 -17898 21474 14727 -13727 -15507
279 -15507 4764 21391 -943 -24896 601 23076 1092 -17447 -7220 13627 15444 -15093
291 -15093 -17739 14360 16230 -9490 -15733 2625 17299 3764 -21454 -4013 20982 3691 -14853
304 -14853 -8598 11023 14579 -9979 -17849 10072 16225 -7076 -13663 -766 15576 5490 -18043
$$ packed form
218a8703o711K8467L0965l0493m2061L3809M0773k9429l3344J2027L3803Q210
230B7313m6921j1856N0492R560m0733j4103K7177K5681j6659m3295K2481M3644
242C2781k3828l0522N987K9184J1470l6678j8389M2288J4774l4892j3470J6804
254d491K7633j1224l8564J3172L7964j0324l2491K422K5229J3611k7618k3616
266b8297L4197J9822k8326j7762J4798K3893l717l4394J888L9372o747k8454j780
279a5507K0271J6627k2334k3953K5497K2475k1984j8539J0227K0847J817l0537
291a5093k646L2099J870k5720o243J8358J4674j3535k5218J7441K4995j7291j8544
304a4853O255J9621L556k4558p870K7921O153k3301o587J2897J6342j0086k3533
$$ plain form
317 -18043 -6192 16659 7068 -12829 -9076 7720 14061 -5752 -16733 6242 15348 -2896 -13209
330 -13209 -1606 12822 6951 -13777 -8908 14291 7698 -9890 -9488 5044 13125 -3378 -14932
343 -14932 2180 14324 -921 -11976 -3171 10154 8206 -11590 -9137 10843 9147 -7374 -9854
356 -9854 3900 11273 -508 -13304 100 12479 1319 -9830 -4159 8577 7768 -7863 -9631
369 -9631 7742 9457 -5447 -8611 1120 10293 896 -11449 -1952 10731 3333 -8972 -5329 6586
383 6586 8212 -5515 -9619 5322 9528 -3431 -8591 426 9125 2524 -9626 -3801 9819 4001
397 4001 -7511 -5532 4893 7860 -3855 -9146 3327 9185 -1764 -8104 -684 7334 3678 -8242
411 -8242 -4740 7703 4941 -5554 -5599 3092 7530 -1639 -8873 1318 8678 -512 -7054 -1920 6098
$$ packed form
317a8043J1851K2851r591j9897L753J6796O341j9813j0981K2975R106j8244j0313
330a3209J1603J4428n871k0728M869K3199o593j7588M02J4532Q081j6503j1554
343a4932J7112J2144j5245j1055Q805J3325j948j9796K453J9980j696j6521k480
356i854J3754P373j1781j2796J3404J2379j1160j1149N671J2736q09j5631j768
369i631J7373J715j4904l164R731R173r397j2345R497J2683p398j2305L643J1915
383F586J626j3727m104J4941M206j2959n160R017Q699o601j2150N825J3620n818
397D001j1512J979J0425K967j1715n291J2473N858j0949o340P420Q018l656j1920
411h242L502J2443k762j0495m5Q691M438r169p234J0191P360r190o542N134Q018
$$ plain form
426 6098 4174 -6466 -5714 6013 5553 -4933 -5184 1733 6735 -97 -8245 -320 7893 821 -6464
441 -6464 -2289 4676 4854 -4627 -6255 4859 5218 -3118 -5398 1070 6094 1020 -6687 -1516 7101
456 7101 1505 -4916 -2888 3719 4948 -3203 -5813 2831 5488 -1875 -4737 176 5367 1958 -6052
471 -6052 -2328 5869 2592 -4427 -3127 3046 4483 -1937 -5652 1816 5611 -1322 -4483 -642 4470
486 4470 2139 -4857 -3171 4958 2995 -3416 -3127 1645 4498 -1107 -5380 637 4842 135 -4319
501 -4319 -1459 3176 2793 -3834 -3453 3606 3005 -2317 -3390 1065 3881 86 -4398 -353 4435 391
517 391 -3447 -1859 2776 3004 -2682 -3657 2191 3393 -1775 -3395 337 3623 805 -4133 -839 3726
533 3726 1179 -3166 -1966 2361 2889 -1638 -3531 1763 3397 -1008 -2891 -29 2990 999 -3354
$$ packed form
426F098j924j0640P52J1727m60j0486k51O917N002o832q148P925Q213p072p285
441f464M175O965J78r481j628J1114L59q336k280O468N024n074p707N171Q617
456G101n596o421K028O607J229q151k610Q644K657p363k862M913N191l409q010
471f052L724Q197l277p019J300O173J437o420l715P468L795o933l161L841N112
486D470k331o996J686Q129j963o411K89M772K853n605m273O017M205m707m454
501d319K860M635l83o627L81P059o01n322j073M455K816l795m484M045M788m044
517C91l838J588M635K28n686r75N848J202n168j620L732L286k818m938L294M565
533C726k547m345J200M327N28m527j893N294J634m405j883K862L019j991m353
$$ plain form
548 -3354 -1566 3377 1501 -2715 -1945 1908 3011 -1027 -3437 659 3206 -506 -2659 -508 2675
563 2675 1555 -2882 -1965 2817 1904 -1734 -2151 784 2819 -455 -3183 268 2798 -80 -2404 -1005
579 -1005 2264 1657 -1909 -1723 1937 2266 -1184 -2344 346 2166 126 -2877 -128 2542 348 -1985
595 -1985 -1139 1769 1793 -1323 -2415 1297 2018 -767 -1891 134 2158 348 -2504 -927 2431 670
611 670 -1798 -1622 1357 1952 -1370 -2333 1062 2171 -336 -1678 -453 1869 674 -2329 -994 1701
627 1701 1062 -1195 -1436 649 1407 -626 -1957 421 1821 79 -1727 -390 1709 880 -1432 -1688
643 -1688 1434 1249 -1246 -1253 291 1592 -18 -1904 33 1403 128 -1186 -777 1152 1133 -1023 -1146
660 -1146 906 1007 -550 -1456 155 1278 -51 -1236 -376 1678 509 -1121 -594 561 1117 -850
$$ packed form
548c354J788M943j876m216P70L853J103m038k410M096K547l712k153K151L183
563B675j120m437R17M782r13l638m17K935K035l274k728L451K530k878k324J399
579a005L269o07l566J86L660L29l450j160K690J820k040l003K749K670k194k333
595a985Q46K908K4l116j092L712P21k785j124K025K024j810k852J577L358j761
611F70k468J76K979N95l322r63L395J109k507j342J225K322j195l003J335K695
627A701o39k257k41K085P58k033j331K378J400j742j806J337K099q29k312k56
643a688L122j85k495pJ544J301j610j886J937J370j275j314M09J929j9k156j23
660a146K052J01j557r06J611J123j329j185Q60K054j169j630N27J155N56j967
$$ plain form
676 -850 -1158 557 904 -714 -1073 -454 1076 320 -1482 -464 1029 395 -665 -622 541 1193 -507 -1224
694 -1224 303 1184 -145 -977 -61 942 491 -909 -684 980 636 -625 -618 170 748 -39 -859 35 927
713 927 -11 -563 -88 715 697 -584 -496 635 617 -547 -478 136 869 -93 -882 -335 920 258 -351 -162
733 -162 409 848 -28 -408 397 529 88 -580 81 579 167 -667 -376 739 -12 -473 -405 151 570 -121
753 -121 -442 202 642 -379 -609 16 408 -108 -357 -276 454 255 -443 -531 116 404 -39 -358 -93 555 -25
774 -25 -172 -391 432 395 -130 3 100 345 36 -551 -43 291 -235 -345 -210 375 227 -264 118 201 -73 -458
796 -458 -295 51 252 -192 -74 203 132 -26 -167 -4 124 273 116 52 -6 247 -24 -303 246 86 38 -144
818 -144 -161 208 221 -153 -102 349 24 -151 57 303 218 -38 -355 158 -94 85 211 146 198 73 -299 -2
$$ packed form
676h50l08J715L47j618l59O19J530p56j802J018J493o34j060M3J163O52j700p17
694a224J527Q81j329q32R16J003m51j400K25J664l44j261PP88N78p87q20Q94Q92
713I27r38n52M75Q03j8j281Q8J131j8j164O9O14P33r62p89N47J255o62o09J89
733a62N71M39q76l80Q05J32m41o68O61M98m12q34K91J115p51m61O8N56M19o91
753a21l21O44M40j021k30O25L92n16k49Q1P30j99o98q8O47K88m43l19K65O48n80
774b5j47k19Q23l7n25J33R7K45l09n87N08L34n26j10J35N85j48m91L82Q3k74l85
796d58J63L46K01m44J18K77p1j58j41J63J28J49j57o4n8K53k71k79N49j60m8j82
818a44j7L69J3l74N1M51l25j75K08K46q5k56l17N13k52J79J26o5N2j25l72K97
$$ plain form
840 -2 464 24 110 -348 285 -133 -111 -110 50 68 8 -49 269 83 -217 -12 -144 294 276 -44 -105 -7 44 210 87
865 87 5 -84 -4 234 220 231 193 -145 46 -158 -7 -119 -94 101 -69 159 -71 63 151 359 -164 -159 282 -28
889 -28 -24 -216 -177 -166 -265 74 241 -65 -144 43 81 -13 98 -305 99 86 -57 -182 -7 -14 43 198 -38 99 155
914 155 -31 -335 -39 253 -45 -172 -35 -4 279 6 168 272 261 -378 14 -156 238 355 -11 149 282
935 282 -5 -239 20 123 155 -134 -233 289 244 -165 -56 65 207 73 -89 -74 164 74 -47 -128 -123 -169 -35
958 -35 -214 37 -230 -102 -210 -48 -111 -21 -156 84 177 12 -128 -8 140 -75 -120 -50 -228 -133 -235 -360 236
981 236 196 -55 4 159 68 -59 -122 -18 309 61 -40 -382 96 -99 -169 -267 -7 -146 111 -38 -89 171 261
1004 261 -143 -52 160 76 -71 103 65 392 -61 -104 6 -24 134 0 -51 85 -68 40 -51 215 133 -81 -50
$$ packed form
840bM66m40Q6m58O33m18K2JJ60J8o0n7L18j86l00K05j32M38j8l20o1R8N1J66j23
865H7q2q9Q0K38j4J1l8l38J91k04J51j12K5J95j70K28k30J34Q8K08n23NM41l10
889b8Mj92L9J1r9L39J67l06p9J87L8r4J11m03M04j3j43j25J75pN7J55k36J37N6
914A55j86l04K96K92k98j27J37L1K83k73J62J04j1o39L92j70L94J17l66J60J33
935B82k87k34K59J03L2k89r9N22m5m09J09J21J42j34j62J5K38r0j21q1Nm6J34
958c5j79K51k67J28j08J62o3R0j35K40R3j65j40J20J48k15m5P0j78R5j02j25N96
981B36m0k51N9J55r1j27o3J04L27k48j01l42M78j95p0r8K60j39K57j49n1K60R0
1004B61m04R1K12q4j47J74l8L27m53m3J10l0J58j34n1J36j53J08r1K66q2k14L1
$$ plain form
1027 -50 -20 238 353 102 186 -143 79 -83 132 302 366 42 60 -74 -192 157 -127 -384 -105 36 -77 -204
1049 -204 -20 258 -348 -238 124 145 142 -93 236 226 144 124 -294 -89 -128 -44 -3 33 147 128 -415 -40 0 -104
1073 -104 -239 -116 70 -87 65 -248 192 -144 -13 -326 -228 -111 101 -227 103 233 -65 -340 -46 188
1093 188 410 -86 52 240 355 -73 -148 59 280 -109 -494 -33 163 472 -202 -259 -119 32 -134 22 149
1114 149 209 136 -88 -60 234 -96 -22 -231 -337 228 -326 -233 -303 -63 183 -192 -353 88 -84 -164 -190 35 241
1137 241 189 -254 243 18 -68 -200 94 -57 25 -101 57 47 125 -292 -171 -61 32 75 -120 -15 236 261 -88
1160 -88 -81 156 247 24 52 169 -97 -150 256 271 178 -104 -50 -279 -20 69 -151 25 -93 327 15 117 300
1183 300 -39 55 -76 267 58 -68 -180 29 71 -50 89 123 93 -118 155 -96 35 49 119 -126 172 60
$$ packed form
1027e0L0K58J15k51Q4l29K22j62K15J70O4l24J8j34j18L49k84k57K79J41j13j27
1049b04J84K78o06J10L62K1lk35L29j0q2k0m18K05l9Q4M1L6J14j9n43L75M0j04
1073a04j35J23J86j57J52l13M40l36J31l13R8J17K12l28L30J30k98k75K94K34
1093A88K22m96J38J88J15m28p5K07K21l89l85M61J96L09o74n7J40J51j66J56J27
1114A49O0p3k24K8K94l30P4k09j06N65n54R3p0K40K46l75j61M41j72q0k6K25K06
1137B41n2m43M97k25q6j32K94j51Q2j26J58j0P8m17J21J10R3M3j95J05K51K5l49
1160h8PK37R1k23K8J17k66n3M06J5r3k82N4k29K59Q9k20J76j18M20l12J02J83
1183C00l39R4j31L43k09j26j12K09M2j21J39L4l0k11K73k51J31J4P0k45K98j12
$$ plain form
1205 60 -71 -13 -217 130 164 184 -94 259 386 -124 -34 35 96 -396 -185 -55 112 188 70 133 -72 215 -327
1228 -327 -286 41 232 -18 -435 10 91 -68 -222 64 134 450 -390 2 11 -34 -103 -4 -19 34 -7 -446 1 353
1252 353 -210 -160 112 -42 -88 201 -131 204 195 -189 -137 -93 219 243 -153 -325 369 19 -164 -60 289 358 -110
1275 -110 -130 7 57 -31 26 161 -42 -19 -139 147 385 95 -167 -232 244 136 -186 -271 -30 4 249 169 150
1298 150 173 36 -6 -249 -11 216 154 -28 148 -33 12 -53 -26 34 63 -24 100 37 -79 -41 -4 -4 -154 -185 15
1323 15 225 327 -106 -298 -184 -36 -8 -197 -178 99 -136 -215 -212 153 322 -242 -18 -42 56 167 63 -220 -66
1346 -66 7 -164 11 -113 138 229 -200 302 180 82 197 11 270 -116 43 -32 87 -177 -224 79 -7 305
1368 305 -269 89 142 161 -175 -72 -101 -47 215 -94 -256 6 348 -156 -55 -79 73 -132 -133 -56 -234 -328 -360
$$ packed form
1205F0j31N8k04L47L4K0k78L53J27n10R0O9O1m92K11J30J67P6j18O3k05K87n42
1228c27M1L27J91k50m17M45Q1j59j54K86P0L16q40L92Rm5o9R9j5N3m1m39M47L52
1252C53n63N0K72j54m6K89l32L35rl84N2M4L12K4l96j72O94l50j83J04L49O9m68
1275a10k0J37N0q8N7J35k03K3j20K86K38k90k62o5M76j08l22q5K41L4K45q0j9
1298A50K3j37m2k43K38K27o2j82J76j81M5o5K7O0K9q7J24o3j16L8L7%j50l1K00
1323A5K10J02m33j92J14J48K8j89J9K77k35p9LL65J69n64K24k4R8J11j04k83J54
1346f6P3j71J75j24K51R1m29N02j22r8J15j86K59l86J59p5J19k64m7L03q6L12
1368C05n74L58N3J9l36J03k9N4K62l09j62K62L42n04J01k4J52k05jP7j78r4l2
$$ plain form
1391 -360 201 -112 -4 -236 96 -378 58 -42 -269 452 -4 -193 112 169 224 188 47 301 116 76 41 -139
1413 -139 -161 21 60 174 201 163 115 -155 -185 218 122 -216 -351 -272 182 -203 -15 101 -262 -401 189 92 270
1436 270 224 -114 77 25 16 -11 -153 104 -429 231 -6 -159 152 -30 -155 265 -121 -230 201 -195 123 -102
1458 -102 -160 -9 197 -75 -53 -57 72 358 -330 -278 -72 399 149 -216 108 35 116 -29 146 -38 43 144 19
1481 19 289 19 -198 -69 -177 27 -257 -65 51 28 195 -171 -83 53 -190 -104 167 10 304 -462 -43
1502 -43 322 -346 -201 -154 -17 -120 172 -173 269 -65 171 -60 -61 62 -113 307 208 217 -28 7 -97 -90 33
1525 33 125 -242 -157 148 73 -336 -452 -40 237 -64 91 25 -37 302 218 -150 -46 -149 145 80 -100 -92 231
1548 231 330 54 -131 -111 -195 117 -65 -4 -52 30 -5 38 29 190 214 82 -28 -104 124 -25 -37 282 14 293
$$ packed form
1391c60N61l13J08k32L32m74M36j00k27P21m56j89L05N7N5l6j41K54j85m0l5j80
1413a39k2J82L9J14K7l8m8k70l0M03r6l38j35P9M54l85J88J16l63j39N90r7J78
1436B70m6l38J91n2rk7j42K57n33O60k37j53L11j82j25M20l86j09M31l96L18k25
1458a02n8J51K06k72K2mJ29K86o88N2K06M71k50l65L24p3Q1j45J75j84Q1J01j25
1481A9K70k70k17J29j08K04k84J92J16k3J67l66Q8J36k43Q6K71j57K94p66M19
1502d3L65o68J45M7J37j03K92l45M42l34K36k31jJ23j75M20r9Rk45L5j04PJ23
1525C3R2l67Q5L05p5m09j16M12K77l01J55o6o2L39q4l68J04j03K94o5j80QL23
1548B31R9k76j85K0q4L12j82O1m8Q2l5M3rJ61K4j32j10p6K28j49j2L19k68K79
$$ plain form
1572 293 78 -226 -129 286 97 289 -299 -19 10 66 80 103 -61 -72 196 -145 35 -202 83 -11 80 299 -185
1595 -185 -192 30 44 192 -141 69 -96 105 -198 -496 -140 -64 148 -124 -238 90 120 117 118 -93 -115 -214 9 80
1619 80 -15 -165 25 -259 55 208 -80 161 -329 -63 -8 -8 193 -47 -278 -115 108 252 -24 133 -209 -48
1641 -48 140 -96 162 49 144 81 296 50 27 -405 3 441 158 139 -17 -217 75 42 93 115 169 273 -150
1664 -150 -224 -165 11 -102 -113 9 401 -343 -208 -362 238 -121 -223 -105 -209 -103 118 315 202 87 13
1685 13 -75 -252 122 -219 131 -220 9 308 -171 101 95 -57 185 -134 247 -290 165 -60 -27 90 102 91
1707 91 13 177 -237 133 46 134 -165 -233 -219 32 305 266 -98 -120 182 61 -28 -6 -196 203 -171 -74 -10 196
1731 196 172 -199 74 181 -86 113 -197 95 26 -50 -241 333 334 -167 -211 9 110 120 -309 82 203 -78
$$ packed form
1572B93k15l04R7M15j89J92n88K80K9N6J4K3j64j1K68l41J80k37K85r4R1K19m84
1595a85pK22J4J48l33K10j65K01l03k98L56P6K12k72j14L28L0lJk11k2r9K23P1
1619H0r5j50J90k84L14J53k88K41m90K66N5%K01k40k31J63K23J44k76J57l42J61
1641d8J88k36K58j13R5o3K15k46k3m32M08M38k83j9j56k00K92l3N1K2N4J04m23
1664a50p4N9J76j13j1J22L92p44J35j54O00l59j02J18j04J06K21J97j13j15p4
1685A3q8j77L74l41L50l51K29K99m79K72oj52K42l19L81n37M55k25L3J17J2j1
1707I1p8J64m14L70q7Q8k99o8J4K51K73l9l64k2L02j21q9K2j90L99l74R7O4K06
1731A96k4l71K73J07k67J99l10K92o9p6j91N74Jn01m4K20J01J0m29L91J21k81
$$ plain form
1753 -78 -79 -100 203 -65 197 -51 96 75 108 -372 259 -85 -51 253 304 -66 -67 -37 71 39 -117 -11 105 -47
1777 -47 -26 -27 -20 -22 -178 85 91 68 195 -129 -71 -274 -193 -28 -160 -116 273 -185 213 131 171 11 135 34 266
1802 266 93 -300 -215 123 156 182 193 -13 -63 -51 -167 60 -97 -37 -92 -219 79 -112 -184 226 65 292 197
1825 197 -91 -151 22 -202 -6 87 -192 13 84 7 58 145 -103 26 -159 240 167 31 -133 220 465 -361
1847 -361 -12 297 132 -56 -264 -99 -147 -161 118 -65 132 218 -55 -159 -132 -62 143 187 -25 -28 116 39 -63
1870 -63 51 -62 -124 -36 -25 -139 82 95 25 514 41 -159 151 270 238 122 60 -24 -173 117 -90 -12 -51 35
1894 35 -47 -169 -92 -1 -78 281 221 69 125 -144 120 102 13 -8 -166 212 183 -183 40 -173 -126 -110 277 211 -6
1919 -6 28 -198 -4 -21 -5 111 109 27 70 318 -50 171 -18 184 -305 -3 139 -68 -17 -7 58 -3 -85 -265 134
$$ packed form
1753g8jk1L03k68K62k48J47k1L3m80O31l44L4L04N1l70jL0J08l2j56J06J16j52
1777d7K1jPkj56K63Ok3J27l24N8k03Q1J65j32M4L89m58L98q2M0j60J24j01K32
1802B66j73l93Q5L38L3K6J1k06n0J2j16K27j57O0n5j27K98j91p2M10j61K27r5
1825A97k88o0J73k24J96R3k79K05P1p7N1Q7k48J29j85L99p3j36j64L53K45q26
1847c61L49L09j65j88k08J65m8j4K79j83J97Q6k73j04K7P0K05M4k12lJ44p7j02
1870f3J14j13o2Q8J1j14K21J3p0M89m73k00L10J19l2j16o2q4j49K90k07P8l9Q6
1894C5q2j22P7R1p7L59o0j52N6k69K64j8q9k1j58L78k9l66K23k13M7J6L87o6k17
1919fL4k26J94j7J6J16kq2M3K48l68K21j89K02m89L02J42k07N1J0O5o1q2j80L99
$$ plain form
1944 134 -21 144 123 160 -216 -214 167 120 3 346 195 -79 -166 18 18 -22 102 87 2 -147 181 215 -42 -197
1968 -197 147 -115 -303 154 83 46 -327 23 -128 -193 194 70 -31 -193 83 199 97 -82 -164 -162 -263 48
1990 48 98 -84 177 14 108 -173 -61 182 4 -309 -49 238 -152 275 46 -404 38 -126 49 -180 216
2011 216 -57 113 -157 -172 136 6 -33 -161 43 72 -62 234 -238 -192 -127 -20 95 -74 -77 130 -428 193
2033 193 177 90 -18 96 50 14 101 14 143 174 -136 109 371 -296 98 -196 86 -177 55 -150 80 229
2055 229 -212 -87 59 -152 144 -203 35 155 136 -89 -224 -162 -158 -265 -183 107 124 491 -232 29 -216 24
2077 24 -15 49 36 55 25 74 144 -56 -54 -70 -26 146 126 35 -227 184 61 -9 -137 36 92 -25 303 84 -362
2102 -362 -157 174 15 123 -202 49 -9 17 -235 -139 -85 305 -174 -174 223 -29 -1 -229 87 311 -27 -27 -84
$$ packed form
1944A34j55J65k1L7l76KL81m7j17L43j51k74q7J84%m0J24j5q5j49L28L4k57j55
1968a97L44k62j88M57p1l7l73L50j51o5L87j24j01j62K76J16j02j79q2Kj01L11
1990D8N0j82K61j63R4k81J12K43j78l13K60K87l90M27k29m50M42j64J75k29L96
2011B16k73J70k70j5L08j30l9j28K04K9j34K96m72M6O5J07J15j69lK07n58O21
2033A93j6q7j08J14m6l6Q7q7J29L1l10K45K62o67L94k94K82k63K32k05K30J49
2055B29m41J25J46k11K96l47K38J20j9k25j35O2Mj07Q2K90J7L67p23K61k45K40
2077B4l9O4j3J9l0M9P0k00Kj6M4J72k0r1k62M11j23p0j28J73N6j17L28k19m46
2102c62K05L31j59J08l25K51n8K6k52R6N4L90m79%L97k52K8k28L16K24l38%n7
$$ plain form
2125 -84 -359 -80 170 -240 -224 24 96 -176 50 -183 -229 122 283 -181 -1 323 -111 40 -122 -195 -199 -341
2147 -341 -81 -67 -188 50 -49 -174 -25 -132 -70 -320 -84 -51 7 -64 -8 -112 44 -63 93 233 128 66 249
2170 249 350 -64 111 -128 -140 76 -102 134 178 198 26 364 155 -199 -55 347 64 114 226 -167 -137 131
2192 131 -154 87 -103 -97 68 123 73 115 53 57 127 265 86 211 -28 143 -305 327 283 49 226 -222 11
2215 11 68 272 16 133 -215 -299 353 -224 61 -271 -15 14 -171 145 -124 -29 55 -237 330 70 106 58 -107
2238 -107 186 -65 143 -12 257 -1 -172 8 -231 -44 170 76 4 58 -182 16 -23 126 272 -214 -142 130
2260 130 -82 168 194 -150 100 -112 -112 -93 107 37 -350 -59 255 144 -259 -307 -73 312 -138 -367 -201 147
2282 147 85 9 -124 -102 208 -69 246 -16 293 -54 -242 81 189 172 -162 8 -213 -112 -47 197 68 -261
$$ packed form
2125h4k75K79K50m10J6K48P2k72K26k33m6L51J61m64J80L24m34J51j62p3mj42
2147c41K60J4j21K38r9j25J49j07O2k50K36L3N8p1N6j04J56j07J56J40j05o2J83
2170B49J01m14J75k39j2K16j78K36M4K0j72L38k09l54J44M02k83N0J12l93L0K68
2192A31k85K41j90OJ65N5n0M2o2MP0J38j79J25k39J71m48O32m4k34J77m48K33
2215A1N7K04k56J17l48q4O52n77K85l32K56K9j85L16k69R5Q4k92N67k60L6m8j65
2238a07K93k51K08j55K69k58j71J80k39J87K14r4p2N4k40J98l9J49J46m86P2K72
2260A30k12K50K6l44K50k12%J9K00p0l87K91L14j11m03m8K34L85m50k29J66L48
2282A47o2p6j33K2L10k77L15k62L09l47j88L23J08j7l34J70k21J01O5K44j29l29
$$ plain form
2304 -261 222 144 -123 -46 5 45 -31 -64 182 -179 195 159 187 -110 376 32 -29 -219 -69 150 171 39 124 -313
2328 -313 -46 266 26 122 -28 111 -461 -267 -56 -177 180 172 -19 -101 -109 279 -24 -31 -66 211 108 187 -112
2351 -112 -25 80 -92 95 -57 -119 -201 -135 -57 -77 131 -28 70 82 -108 128 -97 141 6 265 188 -142 -174
2374 -174 14 6 -35 -160 -97 134 -140 -57 -3 -71 167 -21 -118 5 156 -48 -338 -13 -27 179 18 -127 -163
2397 -163 -141 -125 88 -115 20 -34 -217 212 204 -20 -85 -96 -42 12 -177 88 -143 -25 61 165 389 -83 44
2420 44 -98 -197 -224 -225 -299 -164 159 155 136 -53 -23 -34 15 227 103 52 -200 -111 -148 -42 -147 -93 50 106 167 143
2446 143 102 -47 -47 -52 74 86 -179 209 114 0 294 128 -160 -57 92 45 -17 -49 -24 203 191 -204 -180 -98 -167
2471 -167 158 -177 -40 -62 -7 -107 -83 269 16 29 -206 29 -140 -157 55 -348 152 -52 -104 19 42 -324
$$ packed form
2304b61M83p8k67P7N1M0p6l3K46l61L74l6K8k97M86l44o1j90J50K19K1j32Q5m37
2328c13K67L12k40R6j50J39n72J94K11j21L57qj91q2qL88l03pl5K77j03P9k99
2351a12Q7J05j72J87j52o2q2O6P8k0K08j59R8J2j90K36k25K38j35K59p7l30l2
2374a74J88qm1j25O3K31k74Q3N4o8K38j88r7J23J51k04k90L25j4K06j61j45l6
2397a63K2J6K13k03J35n4j83M29qk24o5j1N4N4j89K65k31J18Q6J04K24m72J27
2420D4j42r9k7jp4J35L23mj9j89L0j1M9K12j24n1k52Q9l7J06j05N4J43N6O1k4
2446A43m1j49%nJ26J2k65L88r5j14K94j66k88J03J49m7o2l2K5K27j2l95K4Q2o9
2471a67L25l35J37k2N5j00K4L52k53J3k35K35j69j7K12m03N00k04n2J23K3l66
$$ plain form
2493 -324 -367 -9 -96 44 13 115 -119 115 -131 -237 164 -258 -124 21 -35 -104 -8 -17 -66 100 62 163 -39
2516 -39 -55 -46 -58 129 -111 -40 -209 -159 239 -129 -120 285 -28 -148 242 70 232 -263 -53 -114 -19 -210 -42 83
2540 83 -140 -113 -38 -40 56 171 89 -14 -123 85 -162 -297 62 108 -100 197 287 -238 -162 35 11 129 -213 37
2564 37 38 65 118 -137 -87 244 91 31 -331 62 -65 9 -174 -23 -79 -52 -25 -344 119 -292 125 253 44 -217
2588 -217 160 -113 136 -27 -42 -200 224 -187 53 -56 -29 10 -169 -135 224 -158 -12 -208 -87 154 -79
2609 -79 28 -139 2 8 -263 211 206 178 -160 24 308 2 36 126 91 196 216 -317 69 -136 -56 91 -163 -252
2633 -252 17 102 456 -129 -180 -327 -23 451 -254 -25 -137 -62 -11 -14 -122 -35 212 110 -2 -113 -104 139 -67
2656 -67 148 -110 64 -273 -355 2 22 -294 -314 -51 45 -81 14 -153 -149 89 83 183 -21 124 -16 -66 -33 -33 -66
$$ packed form
2493c24m3L58q7J40l1J02k34K34k46j06M01m22J34J45n6o9R6rm9J66l8J01k02
2516c9j6Rj2J87k40P1j69N0L98l68RM05l13j20L90j72J62m95K10o1R5j91J68J25
2540H3k23K7P5kR6J15q2j03j09K08k47j35L59M6k08K97R0n25P6J97k4J18l42K50
2564C7JK7N3k55N0L31j53o0l62L93j27P4j83J51n6K7K7l19M63m11M17J28k09k61
2588b17L77k73K49j63j5j58M24m11K40j09K7L9j79L4L59l82J46j96J21K41k33
2609g9J07j67J41Ok71M74nk8l38J84K84l06L4R0l5J05K0n33L86k05Q0J47k54q9
2633b52K69Q5L54n85n1j47L04M74p05K29j12P5N1lj08Q7K47j02j12j11RK43k06
2656f7K15k58J74l37q2L57K0l16k0K63R6j26R5j67MK38oJ00k04J45j40n0L3%l3
$$ plain form
2681 -66 -20 -132 -157 102 -90 232 -328 105 62 -102 -3 -257 -11 220 45 -52 -35 -361 48 -126 -25 -21 -10
2704 -10 -89 69 21 98 -13 158 118 -18 -129 -424 112 20 64 340 117 21 189 142 199 -116 97 -288 -4
2727 -4 -68 229 -63 -36 131 -91 230 80 -286 121 -80 155 -230 -67 369 -118 221 300 -29 70 -286 -170
2749 -170 -89 -157 -45 -81 83 154 19 -180 91 -275 -98 192 223 -162 225 413 177 289 28 172 121 43
2771 43 -18 39 101 -258 167 -149 -59 -21 -18 -83 186 -41 -12 -3 -70 -26 39 252 1 114 -244 -28 -329 -19 -368
2796 -368 105 -25 -82 -179 70 -307 106 222 101 -188 60 -417 117 122 -117 -313 -90 316 -44 168 -286
2817 -286 -128 -68 196 -39 5 -69 -105 -43 116 -280 -119 -153 -6 -119 -104 132 57 -164 -113 90 293 -187 -294
2840 -294 -288 240 5 -23 85 -440 226 -205 -201 -53 292 -13 171 -110 12 154 -75 -112 131 158 -115 -190 -191
$$ packed form
2681f6M6j12k5K59j92L22n60M33m3j64R9k54K46K31j75r7J7l26M09j74J01MJ1
2704a0p9J58m8P7j11J71m0j36j11k95N36r2M4K76k23r6J68m7N7l15K13l85K84
2727do4K97k92K7J67k22L21j50l66M07k01K35l85J63M36m87L39P9l29R9l56J16
2749a70Q1o8J12l6J64P1j35j99K71l66J77K90L1l85L87J88k36J12k61J44n1p8
2771D3o1N7O2l59M25l16R0L8Lo5K69k27K9Ro7M4O5K13k51J13l58K16l01L10l49
2796c68M73j30n7r7K49l77M13J16j21k89K48m77N34Nk39j96K23M06l60K12m54
2817b86J58O0K64k35M4p4l6O2J59l96J61l4J47j13J5K36p5k21N1K03K03m80j07
2840b94ON28k35k8J08n25O66m31MJ48L45l05J84k81J22J42k29l7K43K7k73p5j
$$ plain form
2863 -191 -5 -161 200 -408 123 -179 -191 197 140 -37 -102 -83 -256 -28 -97 -487 310 333 55 -20 -248 -109
2885 -109 -83 -70 332 -82 222 80 128 164 -7 -148 -117 73 40 287 200 88 265 -102 -134 -92 -185 247 183 -118
2909 -118 96 -14 -82 101 8 -65 294 -48 12 299 145 -182 52 37 157 22 32 -151 308 182 -253 -42
2931 -42 -117 -178 57 59 -157 48 -509 -106 105 -9 -190 -133 -104 -42 67 -230 -84 17 -396 20 -88 147 26
2954 26 90 419 -31 -66 36 -196 -12 -181 27 144 110 -243 253 38 -53 263 275 -101 -166 57 -288 -30
2976 -30 -184 84 85 150 134 42 -117 -76 -102 27 10 264 388 -62 -180 228 -31 -100 57 292 -91 6 -30 139
3000 139 193 -213 15 70 -172 90 147 141 16 228 68 -160 1 241 -50 -293 152 -141 -63 348 120 156
3022 156 153 -66 49 13 21 -73 -49 87 43 184 137 -63 -83 11 0 -94 -40 33 49 219 91 -228 -84 127 -146
$$ packed form
2863a91J86j56L61o08N31l02j2L88n7j77o5J9j73K28o9l90P97K3k78p5k28J39
2885a09K6J3M02m14L04j42M8L6j71j41L1J90l3K47q7j12J77l67l2M2r3M32o4l01
2909a18K14j10o8J83r3p3L59l42O0K87j54l27K34j5J20j35J0j83M59j26m35K11
2931d2p5o1K35Kk16K05n57M03K11j14j81N7K9O2J09k97J46J01m13M16j08K35j21
2954B6O4L29m50l5J02k32J84j69K08J17l4l53M96k15r1L16J2l76o5K23l45K58
2976c0j54K68JO5j6r2j59M1k6J29j7K54J24m50j18M08k59o9J57K35l83R7l6J69
3000A39N4m06K28N5k42K62N7oj25K12j60k28J61K40k91k43M45k93P8M11k28L6
3022A56lk19J15l6Qr4K4J36m4J41m7k00k0R4j1r4N4P3J6J70j28l19J44K11k73
$$ plain form
3047 -146 11 129 -15 80 85 -206 283 53 28 239 369 -46 -48 250 -82 84 -14 -38 -326 -201 -120 -57 12 281
3071 281 -141 -52 189 -103 137 -135 3 -283 -121 -45 114 -320 -4 105 225 4 -31 187 -107 -14 -344
3092 -344 63 119 -105 125 78 144 -126 334 21 205 -83 -162 -186 118 -135 91 151 208 36 121 320 83 42
3115 42 29 -56 -58 95 203 51 213 100 -56 -157 -39 -191 158 146 72 100 155 -211 -39 -21 108 193 32 -62
3139 -62 185 -81 -258 72 158 64 200 -68 -65 -56 -3 129 -134 -8 -260 189 -19 160 142 146 90 -140 -62 104
3163 104 -251 -7 -132 10 -131 -62 -175 -13 -12 149 -61 37 -158 152 -56 -346 -38 -160 122 290 -17
3184 -17 222 72 -403 -372 25 -162 197 55 19 162 -29 -105 -152 153 319 180 83 -147 41 -328 0 108
3206 108 445 19 -37 139 -163 -138 28 108 -87 -122 -23 -7 -103 -124 1 53 -37 -174 2 -104 -232 -132 353
$$ packed form
3047a46J57J18j44R5Nk91M89k30k5K11J30m15kK98l32J66r8k4k88J25Q1O3O9K69
3071B81m22Q9K41k92K40k72J38k86J62P6J59m34L16J09J20k21l5K18k94R3l30
3092c44M07N6k24K30m7O6k70M60l13J84k88p9k4L04k53K26O0N7j72Q5J99k37m1
3115D2j3q5kJ53J08j52J62j13j56j01J18j52L49j2p4K8N5l66J72J8J29Q5j61r4
3139f2K47k66j77L30Q6r4J36k68LRN3J32k63J26k52M49k08J79j8Mn6k30P8J66
3163A04l55K44j25J42j41O9j13J62JJ61k10R8j95L10k08k90L08j22K82J68l07
3184a7K39j50m75L1L97j87L59j42l6J43j91p6m7L05J66j39r7k30J88l69L28J08
3206A08L37m26n6J76l02K5J66Q0j95l5R9J6r6k1J25N2r0j37J76j06j28J00M85
$$ plain form
3229 353 -71 -203 42 -99 175 -67 -172 -172 -334 -28 -186 79 75 -41 68 -76 -93 108 28 148 287 -30
3251 -30 -222 15 -30 -226 39 44 54 138 -80 462 260 -233 -207 68 -210 -2 -15 -158 37 201 -161 -250 -179
3274 -179 -188 99 -241 -110 59 327 -75 -138 -62 210 -268 322 49 -104 105 -322 -76 10 53 -83 92 -47
3296 -47 82 83 -307 415 -168 74 -55 -52 -313 -29 3 -304 261 -273 -228 -33 -60 91 132 -175 209 -279 -50
3319 -50 -224 -192 492 115 326 163 -228 210 -29 -13 152 61 105 56 50 -36 -252 -24 -85 -200 -96 -133 203 -51
3343 -51 147 195 94 20 -190 327 8 42 43 -114 -273 -51 133 -313 -6 -85 88 -54 -96 -169 156 26 -26
3366 -26 -3 2 -81 127 56 -165 -86 116 121 32 37 138 58 182 -24 50 193 84 -132 -104 67 158 -151 113 -57
3391 -57 -53 -72 71 -139 -130 -193 -93 133 -116 -110 -136 -180 62 -199 -225 332 -96 -178 36 -212 48 92 -207 -23 -109
$$ packed form
3229C53m24j32K45j41K74k42j05%j62L06j58K65mj16J09j44j7K01q0J20J39l17
3251c0j92K37m5j96K65NJ0Q4k18N42k02m93K6K75k78K08j3j43J95J64l62q9P1
3274a79rK87l40J31J69K68m02o3P6K72m78N90k73j53K09m27K46Q6M3j36J75j39
3296d7J29Jl90P22n83K42j29Lk61K84L2l07N65n34M5J95k7J51M1l07L84m88K29
3319e0j74L2O84l77K11j63l91M38k39J6J65r1M4m9oq6k16K28o1j15J04l7L36k54
3343e1J98M8j01p4k10N17l19L4Jj57j59K22J84m46L07p9J73j42m2p3L25j30n2
3366b6K3Nq3K08p1k21P9K02Nq9NJ01q0J24k06P4J43j09k16K8J71R1l09K64j70
3391e7Mj9J43k10Ro3J00K26k49Ok6m4K42k61k6N57m28q2K14k48K60M4k99J84q6
$$ plain form
3416 -109 -10 -29 130 -43 -63 -143 -2 60 68 102 -121 99 313 95 108 70 -22 151 166 175 23 7 474 94 -65
3441 -65 62 107 198 86 230 23 -64 115 109 -318 -11 135 -111 -24 214 344 -223 -132 86 -37 15 -196 -82
3464 -82 -4 325 -31 133 -43 63 239 219 470 -197 59 -37 95 119 -54 292 -142 15 159 -73 158 430
3486 430 71 137 -71 368 252 161 276 -76 -17 -200 -236 -239 55 259 199 116 -212 -62 -137 -21 135 159 -80
3509 -80 -21 -188 -107 229 156 -21 -6 81 -239 249 129 381 106 -181 131 236 -118 144 157 -62 53 -44 -17
3532 -17 97 52 68 60 162 -142 -52 57 -45 68 -28 192 47 154 181 70 102 -187 -97 -96 -15 284 -57 -73 -30
3557 -30 109 10 -285 -219 121 145 -80 67 -74 1 46 93 24 261 222 -22 207 156 270 136 41 17 377 -86
3581 -86 77 296 -55 -6 76 93 52 -33 85 132 -77 -338 -238 3 24 103 153 -10 -28 -12 151 -17 -201 -72
$$ packed form
3416a09R9j9J59j73k0q0J41O2QL4k23K20K14k18J3l8r2J73J5Rj52j6M67l80j59
3441f5J27M5R1j12J44k07q7J79om27L07J46k46Q7K38J30n67R1K18j23N2k11J14
3464h2P8L29l56J64j76J06J76k0K51o67K56r6J32K4j73L46m34J57J44k32K31K72
3486D30l59O6k08M39j16r1J15l52N9j83l6lK94K04o0q3l28J50p5J16J56K4k39
3509h0N9j67Q1L36p3j77J5Q7l20M88j20K52k75k87L12J05l54K62J3k19J15r7K7
3532a7J14m5J6qJ02l04R0J09j02J13r6K20j45J07K7j11L2k89R0JQ1K99l41j6M3
3557c0J39r9k95O6L40K4k25J47j41P5M5M7o9K37l9k44K29n1J14j34r5k4L60m63
3581h6J63K19l51M9Q2J7m1q5J18M7k09k61J00K41K1P9N0j63j8J6J63j68j84J29
$$ plain form
3605 -72 124 97 -123 -110 86 -19 -43 140 95 -18 -29 -143 246 -42 -96 90 103 -28 93 -23 -7 -139 24
3628 24 69 -328 -79 -329 38 181 -124 22 -151 -299 140 243 62 31 -45 104 -13 -201 173 78 35 -64
3650 -64 -17 50 293 -34 1 -19 343 85 -139 -109 -146 83 -96 127 233 -20 -327 -42 190 20 -398 -167
3672 -167 161 78 200 -142 82 -45 114 25 -112 122 53 -164 -260 45 88 195 86 -170 54 -144 150 -204
3694 -204 -42 -291 -16 119 -125 -1 -62 72 216 -61 -4 -19 26 74 78 118 16 -72 -81 208 44 212 -48 51
3718 51 18 -25 -137 -118 44 29 60 -110 334 -65 38 -209 -137 101 -189 11 -562 -65 231 -161 292 84
3740 84 117 113 200 228 -298 119 33 52 211 -245 -12 258 133 -101 -73 -61 42 269 -63 111 114 -239 16 155
3764 155 114 108 -104 402 124 33 101 -122 -48 21 -78 -144 -294 19 18 152 39 44 53 -31 259 -128 -245 85 -9 267
$$ packed form
3605g2J96k7k20J3J96j05k4J83m5j13j1j14L89k88n4J86J3j31J21j16J6j32J63
3628B4M5l97K49k50L67J43l05J46j73j48M39J03j81l1p6J49j17j88L74r5m3r9
3650f4M7O7K43l27L5k0L62k58k24L0l7K29j79K23J06k53l07K85K32j70m18K31
3672a67L28q3J22l42K24j27J59q9j37K34o9k17r6L05M3J07j09k56K24j98K94l54
3694b04J62k49K75J35k44J24o1J34J44k77N7j5M5M8MM0j02q8rK89j64J68k60R9
3718E1l3m3j12J9J62j5L1j70M44l99J03k47P2K38k90K00n73M97K96l92M53k08
3740H4L3mQ7K8n26M17q6J9J59m56K33K70j25k34K8J2J03K27l32J74Ll53K55J39
3764A55m1ok12N06k78r1O8k23P4O9r9o6j50L13jJ34j13NRq4K90l87j17L30r4K76
$$ plain form
3790 267 -143 -54 130 66 15 103 68 53 99 81 -171 -90 -117 -154 -242 -67 -72 143 227 112 27 91 70 -91 -63 -118 -74
3817 -74 315 162 -163 114 62 182 -114 -13 -57 -252 -55 -156 77 154 54 -28 35 17 31 -182 58 254 -20
3840 -20 10 -312 -208 -4 -88 -71 41 -197 -66 170 229 -234 -41 228 251 149 -28 99 40 31 19 -248 -74
3863 -74 -48 91 -12 -130 -141 148 171 -126 -245 200 3 167 25 -49 -80 111 70 14 109 -135 274 -69 246
3886 246 -11 -224 -31 97 -250 -126 -71 -100 -74 -2 -7 238 11 -44 228 -250 -83 103 -67 -14 -227 -113 -59
3909 -59 -107 134 49 -293 -57 82 109 -21 -173 131 -48 -223 174 -28 -90 56 -185 80 -30 -127 66 0
3931 0 -62 90 1 -133 188 3 53 -441 24 25 -296 -33 -52 -284 -372 -164 81 37 -97 -186 131 -210 -225 -414
3955 -414 -81 -136 -245 90 95 -486 448 73 71 245 -75 107 -209 -173 -284 174 95 -225 -374 153 -173 29
$$ packed form
3790B67m10Q9J84o4n1Q8l5j5M6j8k52Q1k7l7q8J75nK15Q4j15q5O4k1j61K8n5M4
3817g4L89j53l25K77n2J20k96J01m4j95J97j01K33P7j00q2O3j8J4k13K40J96k74
3840b0L0l22J04K04q4J7J12k38J31K36N9m63J93K69K3j02j77J27n9rj2k67J74
3863g4K6J39j03j18j1K89K3k97j19M45j97J64j42p4l1J91m1n6R5k44M09l43L15
3886B46k57k13J93J28l47J24N5k9K6P2nK45k27n5K72m78J67J86j70N3k13J14N4
3909e9m8K41q5l42K36J39K7j30j52L04j79j75L97k02o2J46k41K65j10r7J93o6
3931@o2J52q9j34L21j85N0m94M65Jl21K63j9k32q8K08K45m4j34q9L17l41j5j89
3955d14L33n5j09L35Nn81R34l75kJ74l20J82l16L6j11M58p9l20j49N27l26K02
$$ plain form
3977 29 -33 -323 -18 144 -76 83 38 174 36 -66 -138 179 -60 -107 -104 140 -102 -150 87 -42 -99 108 84
4000 84 -92 -194 -107 -109 20 12 -62 27 -254 -99 -94 80 169 14 -73 -108 -32 -520 -153 344 -176 38 36 -42 234 -70
4026 -70 -259 247 -88 173 46 195 -94 121 209 65 171 -14 -570 209 34 -10 -207 -9 -149 73 -69
4047 -69 123 -4 -394 -20 144 194 143 117 130 38 219 207 -130 -146 -162 -15 -107 -84 -174 -10 -2 -263 91 -204 260
4072 260 181 179 -206 77 300 -199 -169 -62 109 -47 -109 -16 -177 27 -95 -191 -355 -60 7 -275 68 -242 -110
4095 -110 -177 130 -208 -264 -98 116 -35 107 -87 215 148 -273 -16 110 -110 114 -165 99 310 -157 124
4116 124 117 166 -96 1 79 95 243 138 117 117 -82 -249 -191 272 14 -103 43 151 137 -95 12 -22 3 -156
4140 -156 -288 -195 259 318 38 -96 -154 30 2 -20 256 -117 -94 22 3 -233 143 3 -124 159 39 20 -197
$$ packed form
3977B9o2k90L05J62k20J59m5J36j38j02p2L17k39m7LK44k42m8K37j29n7K07k4
4000H4j76j02Q7kJ29qp4Q9k81J55NJ74Q9j55q7l5P6m88L67M97n20K14kp8K76l04
4026g0j89N06l35K61j27J49k89K15Q8j44J06j85n56P79j75m4j97J98j40K22j42
4047f9J92j27l90L74J64N0n1k6J3r2J81j2l37j6j6J47r2K3r0J64Qk61L54k95M64
4072B60p9kl85K83K23m99L0J07J71j56o2R3j61K04j22r6j64K95O7k82L43l10J32
4095a10o7L07l38n6J66K14j51J42j94L02o7m21K57J26k20K24k79K64K11m67K81
4116A24pM9k62R7P8J6J48j05k1%j99j67N8M63k58j17J46J08j4k32J07l4K5j59
4140a56j32R3M54N9k80j34n8J84k8k2K76l73K3J16j9k36L76j40j27K83j20j9k17
$$ plain form
4163 -197 -96 -185 -112 -139 25 -281 62 -121 -279 71 248 87 -21 -16 85 -132 -82 -49 164 267 -74 138
4185 138 -110 137 -38 -28 -117 -87 -102 -214 -87 -198 -219 -259 -144 -95 -279 -48 162 -83 80 -163 0 202
4207 202 -79 -217 -145 112 -67 -224 -139 -203 348 63 -119 -18 181 -81 319 299 240 -71 -272 -56 -129 -20
4229 -20 -56 44 -55 42 -21 -157 4 193 217 30 -196 269 -82 -351 88 79 254 96 105 81 -24 56 -21 -75 116
4254 116 129 -121 146 -18 -3 -39 -326 -1 79 45 -3 193 -245 8 104 -174 -238 -119 -294 -433 244 43 -130
4277 -130 220 51 -102 198 121 156 85 -247 32 103 26 -58 -194 85 95 319 -234 -357 5 -31 36 -222 -66
4300 -66 -4 -86 100 -56 1 -63 280 -106 275 346 -294 -385 -101 238 81 40 -50 5 294 -137 87 20 353 57
4324 57 -21 -36 -21 -51 -92 32 -291 145 -141 -176 -131 286 133 112 82 -84 -92 -154 -169 -191 -143 180 25 -147 129
$$ packed form
4163a97J01q9P3k7J64l06L43j83j58L50J77j61j08NJ01k17N0L3K13J03l41K12
4185A38k48K47j75J0q9L0j5j12J27j11k1m0J15M9j84K31K10k45J63k43J63K02
4207B02k81j38P2K57j79j57Q5o4N51k85j82J01J99k62M00k0n9l11k01K16p3J09
4229b0l6J00r9R7o3j36J61J89K4j87k26M65l51k69M39rJ75j58Rk4j05Q0p7n4J91
4254A16J3k50K67j64J5l6k87L25Q0l4m8J96m38K53R6k78o4J19j75j39O77k01j73
4277a30L50j69j53L00p7L5p1l32K79P1p7q4j36K79J0K24n53j23L62l6O7k58J56
4300f6O2q2J86j56N7o4L43l86L81P1o40r1K84L39j57m1r0N5K89m31K24o7L33k96
4324E7p8j5J5l0m1J24l23M36k86l5M5M17j53k1l0j66qo2j5k2M8L23j55j72K76
$$ plain form
4349 129 202 6 97 -47 383 -89 -156 227 -68 -44 39 -173 -197 124 203 209 116 -130 6 165 160 142 111 214 -323
4374 -323 -281 -54 -180 50 -81 -64 180 49 -48 -122 -218 -47 -282 104 100 195 22 -197 222 76 -184 -181 212
4397 212 -188 -123 58 3 -138 -365 50 142 -243 -26 60 -51 5 -59 62 -83 -106 92 12 -282 71 -150 270
4420 270 -206 125 -173 -72 -117 14 127 -34 75 -170 -44 -175 197 -52 -105 70 581 -21 152 193 102
4441 102 215 43 224 -9 -207 -49 91 62 21 235 -137 -30 -74 -421 94 165 173 127 -7 53 -277 464 324
4464 324 200 -190 94 -189 92 154 -35 -34 293 234 164 132 216 300 -43 -222 -142 -128 -185 113 -67 -76 150 188 -209
4489 -209 136 -15 68 -51 26 114 -70 -145 -94 78 -20 33 2 1 -53 -4 -24 156 228 -52 -268 279 129 -192 244
4514 244 105 -20 -37 130 53 -102 -70 123 -168 -25 67 220 150 98 266 252 87 84 96 -222 -57 133 263
$$ packed form
4349A29P3j96R1j44M30m72o7L83k95K4Q3k12k4L21P9Or3k46J36J59nj8l1J03n37
4374c23M2K27j26K30j31J7K44j31r7p4r6J71k35L86mR5j73k19M19j46k60LL93
4397B12m00O5J81n5j41k27M15R2l85K17Q6j11N6o4J21j45k3J98q0k94L53k21M20
4420B70m76L31k98J01m5J31J13j61J09k45J26j31L72k49n3J75N11o02J73M1r1
4441A02J13j72J81k33j98J58J40k9m1K14l72J07m4l47N15P1Qm6j34O0l30P41j40
4464C24j24l90K84k83K81O2j89JL27n9p0l2Q4Q4l43j79Q0J4n7K98j80rK26L8l97
4489b09L45j51Q3j19P7Q8j84p5N1J72r8N3l1jn4M9k0J80P2k80k16N47j50l21M36
4514B44j39j25j7J67p7j55L2J93k91J43R2J53p0n2J68j4j65lJ2l18J65J90J30
$$ plain form
4537 263 36 112 -277 -59 -238 42 7 181 -33 76 -228 -24 233 -70 -140 235 58 -75 135 -77 -39
4558 -39 32 58 114 210 -86 -115 108 295 -148 -56 56 -234 52 220 225 40 -3 244 -159 -79 210 -29 214 197
4582 197 -85 -35 193 -205 173 -15 -91 82 -159 54 53 -110 119 11 -213 465 -77 -239 92 -174 -145 -194
4604 -194 47 -40 -56 276 190 156 22 7 -27 6 -36 -145 -372 -42 -52 -51 -121 -152 135 38 -157 -164 126 230 153 -243
4630 -243 10 -48 -7 238 -72 65 5 -10 -545 -82 55 120 -159 96 -217 13 53 -60 61 -179 -184 -48 279
4653 279 19 236 -163 -1 390 91 -288 -107 -4 76 198 -147 121 -250 33 89 78 33 -251 -97 -99 106
4675 106 -186 14 -381 110 178 -116 -73 -7 -220 136 -107 -274 -144 10 -23 194 -171 166 -122 -18 -191
4696 -191 -232 -102 122 85 259 -238 124 66 -98 51 -19 -65 -240 -213 153 430 -29 -58 -35 108 66 -127 -49
$$ packed form
4537B63k27P6l89K18j79K80l5J74k14J09l04K04K57l03p0L75j77j33K10k12L8
4558c9P1K6N6R6k96k9K23J87m43R2J12k90K86J68Nj85m3K47m03Q0K89k39K43j7
4582A97k82N0K28l98L78j88p6J73k41K13jj63K29j08k24O78n42j62L31k66K9m9
4604a94K41q7j6L32q6l4j34j5l4L3m2j09k27L30j0Jp0l1K87r7j95pK90J04p7l96
4630b43K53n8M1K45l10J37o0j5n35M63J37O5k79K55l13K30M0j13J21k40nJ36L27
4653B79k60K17l99J62L91k99l79J81J03Q0J22l45K68l71K83N6j1m5k84J54kK05
4675A06k92K00l95M91O8k94M3O6k13L56k43j67J30J54l3K17l65L37k88J04j73
4696a91m1J30K24l7J74m97L62n8j64J49p0m6j75K7L66K77m59k9K3J43m2j93P8
$$ plain form
4719 -49 -111 49 -141 -56 -23 -232 34 -14 42 -68 239 -237 -240 11 -59 -36 -28 -26 60 4 -118 -19 -36 50 91 5 89
4746 89 98 -166 36 16 -9 282 -96 -151 -21 217 -275 -145 -59 58 -28 -288 -120 -30 -114 -114 109 149 -24 319
4770 319 82 -97 -67 -244 61 -215 73 -18 -43 10 16 -24 136 308 -378 -6 -146 -201 173 -31 -12 6 101 -63
4794 -63 98 -104 55 -3 37 -82 13 -174 -380 4 -5 -13 -69 -195 -298 -190 -123 -97 128 172 175 -301 -115 324 -326
4819 -326 85 -75 -173 -14 -21 -405 -187 88 96 -238 -88 249 -327 117 99 -128 147 36 14 133 99 -36 69
4842 69 50 -251 -236 -38 30 -16 -44 133 -204 43 196 -100 -31 -217 136 30 -103 -158 -195 0 -26 141 110 -93
4866 -93 -96 80 362 197 64 -73 61 221 82 19 36 -126 -99 158 20 116 118 -242 -137 9 -194 238 -115
4889 -115 20 -64 72 -349 24 206 533 63 -178 -379 34 -43 -280 216 246 -267 -118 273 -90 123 -22
$$ packed form
4719d9o2J60j90Q5L3k09K66m8N6j10L07m76lK51p0K3QKQ6n6j22R9j7Q6M1q6Q4
4746H9Rk64K02k0k5K91l78n5J30K38m92J30Q6J17q6k60J68R0q4%K23M0j73L43
4770C19k37j79L0j77L05k76K88r1k5N3Om0J60J72o86L72j40n5L74k04J9J8R5j64
4794f3J61k02J59n8M0j19R5j87k06L84rqn6j26j03J08O7K6K25M4Lm76J86M39o50
4819c26M11j60r8J59pl84K18K75Ql34J50L37n76M44j8k27K75j11k2J19l4j35J05
4842F9j9l01J5J98O8m6k8J77l37K47J53k96O9j86L53j06j33n5l7J95k6J67l1k03
4866i3lJ76K82j65j33j37J34J60j39o3J7j62K7K57j38R6Kl60J05J46k03M32l53
4889a15J35q4J36m21L73J82L27m70k41k01M13p7k37M96L0n13J49L91l63K13j45
$$ plain form
4910 -22 -100 -79 -99 25 -169 134 141 473 293 182 -14 -80 108 -203 -5 31 48 186 288 155 -381 39 51
4933 51 3 -74 -236 107 175 339 -408 -186 -52 37 -167 146 -63 59 3 62 123 -91 288 -74 -470 -224 -132
4956 -132 49 -114 -161 200 75 315 -35 -169 -43 -136 -53 44 71 -61 53 -10 226 79 4 -440 -17 -129
4978 -129 -92 -24 -36 95 384 59 192 276 -17 6 -48 254 -50 161 -333 -29 -83 -91 -447 -224 -39 -294 -74
5001 -74 343 -22 -13 -114 -141 -17 -225 -15 147 -203 27 102 26 -34 29 -62 48 107 69 97 -48 123 -274 358
5025 358 -103 191 -98 -151 131 -147 -325 -213 40 -99 -28 -92 238 -9 -122 35 129 -192 108 145 303 -20
5047 -20 -130 94 20 -12 195 -105 140 236 49 174 145 -34 -51 82 47 245 -39 -83 130 207 -86 -80 98 -92
5071 -92 -7 -137 -223 51 237 135 -229 272 36 125 -1 254 89 -195 86 5 223 -43 -423 258 -97 161
$$ packed form
4910b2p8K1k0J24j94L03PL32j80j11j96o6J88l11J98L6J7J38J02j33n36M20J2
4933E1m8p7j62L43O8J64p47K22J34Q9k04L13k09J22n6N9O1k14L79l62l96K46R2
4956a32J81j63m7L61j25K40l50j34J26r3Q3R7K7j32J14o3K36j47p5m44M23j12
4978a29L7O8j2J31K89l25J33Q4k93K3n4L02l04K11m94L04n4ql56K23J85k55K20
5001g4M17l65Rj01k7J24k08K10J62l50K30P5p6o0O3r1J10N9l8K8j45J71l97O32
5025C58m61K94k89n3K82k78j78J12K53j39P1o4L30k47j13J57R4l21L00L7J58l23
5047b0j10K24p4l2K07l00K45R6j87J25k9j79j7J33l5J98k84m4K13P7k93OJ78j90
5071i2Q5j30q6K74J86j02l64N01k36Q9j26K55j65k84K81q1K18k66l80O81l55K58
$$ plain form
5093 161 106 116 250 -360 -164 264 -26 -37 -130 30 168 67 375 44 -59 -221 -160 138 115 -159 -263 15
5115 15 -160 128 -154 91 -142 92 -10 -78 20 109 -132 120 275 -113 135 153 -60 105 38 20 258 -34
5137 -34 -175 -106 106 47 -284 -13 -25 -249 -346 169 -114 -107 -243 92 -266 -197 175 8 -188 82 -221 -20 213
5160 213 339 -21 128 -60 67 72 -434 -96 -209 -87 19 407 116 -246 -26 72 -20 -294 -178 61 -42
5181 -42 -30 -77 109 224 -256 116 -282 107 -227 -241 49 61 30 92 -94 170 -119 -135 -242 -49 1 -324 147
5204 147 345 -209 -323 -307 -149 -251 217 36 -20 86 -62 52 -75 114 -42 -384 -115 -314 41 34 42 169
5226 169 302 94 16 -233 -16 -103 -22 -153 270 -74 250 34 -59 106 -186 -203 8 38 -133 -153 80 73 -81
5249 -81 88 -216 -117 -228 317 52 80 -312 204 75 160 -4 116 -92 19 156 217 188 -172 -20 -119 -28 68
$$ packed form
5093A61n5J0J34o10J96M28k90j1r3J60J38j01L08l31j03j62O1K98k3k74j04K78
5115A5j75K88k82K45k33K34j02o8R8Q9k41K52J55l88K48J8k13J65o7j8K38k92
5137c4j41O9K12n9l31K71j2k24r7N15k83Pj36L35l58O9L72j67j96K70l03K01K33
5160B13J26l60J49j88J27Nn06L38j13J22J06L88k91l62K20R8r2k74J16K39j03
5181d2J2m7J86J15m80L72l98L89l34j4K90J2l1O2j86K64k89j6j07J93N0l25M71
5204A47J98n54j14J6J58j02M68j81n6J06j48J14j27J89j56l42K69j99L55pQJ27
5226A69J33k08p8k49K17q7Q1j31M23l44L24k16r3J65k92j7K11L0j71k0K33pj54
5249h1J69l04R9j11N45k65K8l92N16j29Q5j64J20k08J11J37O1k9l60J52r9R1R6
$$ plain form
5272 68 -215 -83 219 150 23 -505 -110 -206 -59 77 -44 -24 -253 -164 291 -21 -41 -27 25 19 -360 63 -270
5295 -270 -177 -274 -145 -244 -116 194 -55 -35 -43 -63 -41 -172 -195 -109 -37 373 42 -19 477 -84 -75 -87 142 -302 -51
5320 -51 -52 166 67 -14 -198 75 34 134 -88 309 -102 257 235 246 122 -48 69 133 -59 150 118 -160 -154 -63
5344 -63 -71 -121 -34 -80 92 -164 -129 199 239 64 188 72 -246 51 9 -90 264 73 -26 -143 -33 62 56 -141 69
5369 69 28 -72 -154 -9 -146 -64 168 -54 40 0 19 148 138 -129 -158 193 -111 83 29 -97 25 -64 103 128
5393 128 193 -164 55 64 -2 84 -42 -40 -76 -46 -45 1 92 124 -128 6 16 -185 335 73 -160 -11 -57 370 -380
5418 -380 197 201 -91 -206 -232 161 91 -100 -285 63 220 47 -36 158 134 27 -25 104 -98 105 259 -316
5440 -316 -241 85 167 -108 214 8 69 -20 84 -38 181 147 -89 4 76 6 -13 -390 62 153 3 -197 -71
$$ packed form
5272F8k83J32L02o9j27n28L95r6J47J36j21K0k29Q9M55l12k0J4N2ol79M23l33
5295b70R3r7J29r9J28L10k49K0qk0K2j31k3Q6P2M10l31o1M96n61Rj2K29m44K51
5320e1jK18r9q1j84K73m1J00k22L97m11L59k2J1j24j70J17O4j92K09l2k78OR1
5344f3qn0Q7m6J72k56L5L28M0j75J24j16l18K97m2r9L54j91r9j17J10R5oj97K10
5369F9m1j00q2J45j37Q2K32k22R4m0J9J29j0k67k9L51l04J94n4j26J22q9J67K5
5393A28O5l57K19Ro6Q6j26Kl6L0JM6R1L2k52J34J0k01N20k62k33J49m6M27p50
5418c80N77Mk92j15k6L93p0j91j85L48J57j73q3J94k4j07n2J29k02K03J54n75
5440c16P5L26Q2k75L22k06O1q9J04j22K19l4k36R3P2p0j9l77M52R1j50k00J26
$$ plain form
5463 -71 149 -209 162 14 193 -46 147 -390 -105 46 235 -25 -95 11 -40 285 -21 -226 -340 39 -333
5484 -333 -150 -13 25 -185 176 -314 155 90 157 250 127 80 145 69 -207 -18 154 232 118 -92 466 -269 178
5507 178 -54 -34 126 -288 -130 269 60 -146 -147 -216 -203 -197 77 -203 231 246 -27 -124 -131 21 348 -48 268 -86
5531 -86 428 -30 159 -122 -189 -117 40 -94 -120 -30 0 -298 -133 203 152 -23 77 -78 -148 158 -52 -172 -341
5554 -341 -38 -174 -284 -44 -36 -27 79 -11 44 -385 -103 80 -215 15 141 -119 -26 -243 -141 -50 -1 -45 14 169
5578 169 -52 -55 -79 -121 98 26 -82 6 -212 -122 -48 1 -144 266 68 76 -10 -197 10 -180 -181 87 -193 123 44
5603 44 94 38 -111 460 -45 -1 135 -24 -220 118 -366 258 -77 88 292 -24 362 -2 294 132 -206
5624 -206 198 157 107 62 19 250 32 4 480 -218 -290 -70 105 391 28 -94 -215 5 85 12 163 -53 57
$$ packed form
5463g1K20l58L71j48J79k39J93n37K85J51J89k60p0J06n1L25l06k05j14L79l72
5484c33J83J37L8k10L61m90M69o5O7R3j23m7O5p6k76J89J72P8j14k10N58p35M47
5507A78k32K0J60m14J58L99k09k06jo9J3OK74k80M34J5k73r7pJ52L27l96L16l54
5531h6N14m58J89k81o7P2J57j34k6R0L0k98J65L36n1j75J00j55p0L06k10j20j69
5554c41L03j36j10K40QRJ06r0N5m29K82J83k95K30J26k60R3k17J02R1M9m4N9J55
5578A69k21lk4m2K19p2j08Q8k18R0P4M9j45M10j98Qq6j87K07j90jK68k80L16p9
5603D4N0n6j49N71n05M4J36j59j96L38m84O24l35J65K04l16L86l64K96j62l38
5624b06M04m1n0m5m3K31k18k8M76o98p2K20J75K86l63j22j21K20Q0p3J51k16J10
$$ plain form
5647 57 -249 -108 -328 221 4 -107 30 26 118 -164 -139 70 36 -137 -308 -108 52 -31 -108 -67 14 -36 165 -178
5671 -178 145 -148 -97 -44 -111 -258 -135 -185 13 -166 89 -53 -80 -28 171 312 194 232 92 -149 41 35 13
5694 13 -375 -19 -294 127 -90 -3 -320 95 117 -181 233 -107 138 -253 -45 -276 -492 147 414 -11 131
5715 131 -158 32 63 -46 -55 -146 -21 -183 -297 -133 177 -176 -91 -195 -194 121 200 186 81 -20 148 150 181 -151
5739 -151 -45 102 -245 63 -72 -63 -58 167 321 253 -13 145 -153 -96 187 -221 7 76 -76 10 64 -40 -30
5762 -30 -26 87 -2 -116 185 -172 6 -156 -222 356 206 48 31 357 4 97 -42 -157 271 -8 270 -10
5784 -10 4 -363 -175 -270 306 -28 327 -145 -60 42 -55 303 -35 -206 -88 91 27 39 -43 226 -218 330 171
5807 171 174 269 35 170 247 130 91 -136 122 107 3 -73 -19 123 -255 11 145 76 -130 -172 -11 -137 -268
$$ packed form
5647E7l06J41k20N49k17j11J37mR2k82K5K09l4j73j71K00J60q3p7M1Q1n0K01l43
5671a78L23k93N1N3o7j47J23n0J98j79K55j42k7N2J99J41j18L8j40k41J90ok2
5694A3l88L56k75M21k17Q7l17M15K2k98M14l40K45l91K08k31k16O39K67m25J42
5715A31k89J90L1j09rr1J25j62j14J64L10l53Q5j04JL15P9j4j05j01J68KL1l32
5739a51J06J47l47L08j35RNK25J54o8k66J58k98N7K83m08K28O9j52Q6N4j04J0
5762c0MJ13q9j14L01l57J78j62o6N78j50j58j7L26l53R3j39j15M28k79K78k80
5784a0J4l67J88r5N76l34L55m72Q5J02r7L58l38j71J18J79o4J2q2K69m44N48j59
5807A71LR5k34J35P7j17l9k27K58j5j04p6N4J42l78K66J34o9k06m2J61j26j31
$$ plain form
5830 -268 187 127 134 148 57 28 196 -95 16 -46 93 -59 -26 104 140 19 39 -201 -2 -240 11 -311 237
5853 237 -202 -102 8 -34 -43 -206 233 25 160 219 -19 -72 -188 -76 -125 123 -369 -46 -102 -95 7 163 145
5876 145 27 -35 -134 -18 -107 85 263 169 27 -158 -128 9 211 164 -231 -256 -24 214 29 -2 -122 -210 -159
5899 -159 -40 77 43 -169 130 -114 -236 -50 -27 -127 -303 45 75 27 -98 99 98 -29 121 -39 0 145
5921 145 -104 150 -115 76 159 39 -325 -62 203 279 11 -241 41 -240 -103 -94 -35 368 -18 191 -117 65
5943 65 294 132 -17 -114 23 -28 92 161 146 -17 38 6 46 -187 105 -242 -139 -36 -143 -23 -55 248 151
5966 151 -19 255 -43 -44 -117 155 74 -14 120 164 -169 -350 -209 158 -164 -120 -215 205 82 426 198 -341 23
5989 23 61 100 39 -95 90 98 -180 -222 -46 -211 90 159 -137 -239 40 -129 9 -89 -101 49 86 -52 180 205
$$ packed form
5830b68M55o0PJ4r1k9J68k91J11o2J39j52L3J30L6j21K0k40J99k38K51l22N48
5853B37m39J00J10m2rj63M39k08J35N9k38n3j16J12m9K48m92L23n6PJ02J56j8
5876A45j18o2r9J16q9J92J78r4j42j85L0J37K02m7l95k5K32K38j85l1j20q8N1
5899a59J19J17l4k12K99k44j22J86K3j00j76L48L0m8j25J97jj27J50j60L9J45
5921A45k49K54k65J91Q3j20l64K63K65P6k68k52K82k81J37RN9M03l86K09l08J82
5943F5K29j62j49r7J37n1J20O9j5j63N5l2M0k33K92l47J03J03j07J20l2L03r7
5966A51j70K74k98jp3K72q1q8J34M4l33j81J41L67l22M4r5M20j23L44k28n39L64
5989B3L8L9o1j34J85Qk78m2J76j65L01O9k96j02K79j69J38r8j2J50L7j38K32K5
$$ plain form
6013 205 -368 -114 340 126 -36 -39 -125 -391 207 66 -75 143 -116 -12 -171 -202 86 25 -158 -110 -77 14 17
6036 17 -166 -24 -141 -102 197 -135 -78 299 221 -46 182 -130 -119 249 29 -94 326 -10 14 68 48 100 39
6059 39 36 208 196 -80 -129 86 -129 -130 -112 -55 69 322 38 16 65 -176 -50 -109 46 192 204 -46 67 -51
6083 -51 -309 -75 -122 319 -45 115 37 50 -64 -207 -190 -164 131 -212 145 -152 23 174 3 34 136 -252
6105 -252 -200 149 -183 91 -4 -83 122 -3 149 -80 -182 -167 296 148 70 17 -192 87 -210 -78 246 -294
6127 -294 76 -25 -106 197 140 -96 127 128 122 142 -89 -28 -64 -463 29 5 -25 124 24 97 172 73 289 4 -59
6152 -59 69 46 19 -36 114 -34 274 -391 157 -66 -45 -227 118 -118 -295 125 -78 -333 -216 14 -168 -25
6174 -25 83 -344 126 -97 -229 -295 -123 200 132 -202 69 -8 155 -183 -235 -542 -19 87 48 -364 -76 -271
$$ packed form
6013B05n73K54M54k14j62lq6k66N98j41j41K18k59J04j59l1K88o1j83M8L3R1L
6036A7j83J42j17L9K99l32N7L77p8k67K28l12J1L68k20j23M20l36K4N4k0N2o1
6059C9lJ72j2k76m9K15k15jJ8N7J24K53k84k2M9k41J26n9J55J46J2k50J13j18
6083e1k58K34m7M41l64J60p8J3j14j43J7K6K95l43L57k97J75J51j71L1J02l88
6105b52N2L49l32K74r5p9K05j25J52k29j02J5M63j48p8n3k09K79k97J32L24n40
6127b94L70j01q1L03n7k36K23JoK0k31O1l6l99M92k4l0J49j00P3P5r9K16k85o3
6152e9J28k3k7n5J50j48L08o65N48k23K1j82L45k36j77M20k03k55J17K30j82J43
6174b5J08m27M70k23j32o6J72L23o8l34K71p7J63l38n2l07N23J06l9m12K88j95
$$ plain form
6196 -271 -195 217 128 -123 16 -15 -214 268 72 223 -145 -31 -39 139 -156 138 67 -103 70 151 107 1 174
6219 174 -66 20 182 -35 -34 75 -149 -44 135 -143 -160 -34 -247 -331 152 25 -137 118 -124 -68 84 45
6241 45 -4 53 142 59 71 -144 -271 -332 -4 70 -255 20 140 -274 -95 135 73 -20 11 63 99 -257 240 80
6265 80 -24 -74 112 202 -222 175 228 21 182 146 44 65 -3 234 346 434 -190 195 241 -11 249 -250 173
6288 173 -55 -69 234 -302 97 120 -122 79 20 -143 -161 60 -81 -82 -129 192 -241 4 270 -141 -77 114 148
6311 148 94 29 -52 -207 28 -135 -27 9 240 14 -319 8 -16 -36 -13 -180 -81 -150 18 -89 -16 41 46 -160
6335 -160 -21 157 -137 201 551 127 204 -38 96 -314 202 -144 189 -103 22 215 -143 14 -177 170
6355 170 -94 179 125 175 25 116 334 -104 -146 42 -106 60 25 169 257 61 -110 205 100 22 -532 -139
$$ packed form
6196b71P6M12q9k51J39l1j99M82j96J51l68J14qJ78k95K94p1j70J73Q1m4j06J73
6219A74k40Q6J62k17JJ09k24J05J79k78j7J26k13q4M83j27j62K55k42N6J52l9
6241D5m9N7Q9q3J2k15j27o1L28P4l25K75J20m14J79K30o2r3L1N2L6l56M97j60
6265H0j04n0J86R0m24L97N3k07J61l6j02K1o8K37J12Q8o24L85M6k52K60m99M23
6288A73k28j4L03n36L99K3k42K01n9j63j8K21j41jm7L21m33K45K66m11O4J91L4
6311A48n4o5q1j55K35j63J08L6K31k26l33L27k4k0K3j67R9o9J68j07P3N7Nk06
6335a60J39J78k94L38L50m24P7k42J34m10N16l46L33k92J25J93l58J57j91L47
6355A70k64K73n4N0j50R1K18m38m2J88j48J66l5J44Q8j96j71L15j05p8n54L93
$$ plain form
6377 -139 -1 -154 -199 -245 -336 69 -118 130 166 -52 186 -568 101 185 -247 -83 183 -37 56 232 -177 -68
6399 -68 14 -110 263 107 16 -102 -24 221 -14 241 68 -87 211 -52 -168 -2 149 -174 344 -131 -94 99
6421 99 220 226 -195 62 -171 210 -100 279 195 -4 -24 -279 111 -11 77 -197 -201 -46 -181 39 -94 -47 -64
6444 -64 15 -79 121 0 38 2 -16 0 135 -151 49 -58 -142 -78 -141 84 -80 -92 60 -336 -114 -47 -160 -119
6468 -119 173 -27 -476 42 -102 26 -161 245 233 -252 164 10 -19 97 115 105 -363 -88 -142 -2 40 122
6490 122 3 164 -223 27 -203 119 -317 -78 14 288 26 66 9 -151 285 53 94 -238 -305 55 -59 -155
6512 -155 -189 -132 -125 -211 73 -100 -140 24 -300 -345 140 302 78 -74 -37 127 61 -143 -23 -265 85 -7 176
6535 176 -517 -184 60 -265 -125 149 331 22 -167 -475 315 94 71 323 -257 179 -250 293 378 137 57
$$ packed form
6377a39J38j53m5m6r1M05j87K48L6k18K38p54O69Q4m32J64K66k20R3J76m09J09
6399f8Q2j24L73j56r1j18P8K45k35K55j73j55K98k63j16J66J51l23N18m75L7J93
6421I9J21Om21K57k33L81l10L79q4j99k0k55L90j22Q8k74mJ55j35K20j33M7j7
6444f4P9r4K00j21L8l6j8J6J35k86K00j07q4O4o3K25j64j2J52l96K22O7j13M1
6468a19K92k00m49N18j44J28j87M06j2m85M16j54k9J16J8j0m68K75n4J40M2Q2
6490A22j19J61l87K50k30L22m36K39R2K74k62M0n7j60M36k32M1l32o7L60j14r6
6512a55l4N7Pq6K84j73m0J64l24m5M85J62k24j52L7J64o6k04J20k42L50r2J83
6535A76o93L33K44l25J40K74J82l09j89l08P90k21k3K52n80M36m29N43Q5k41q0
$$ plain form
6556 57 97 -292 12 160 278 263 139 -198 -198 -150 350 82 -143 -343 -178 338 255 164 50 -30 -131 139 -39
6579 -39 273 -372 95 -185 -91 41 -185 -134 -253 141 -69 96 151 12 262 -165 -74 146 -181 -63 -41 -87
6601 -87 -3 -40 30 48 71 18 -127 -112 135 258 -178 -36 -154 119 37 -99 -158 -20 9 30 183 116 158 -194 -62
6626 -62 -116 93 -155 -126 65 -39 -62 123 -23 149 -6 43 292 130 -115 -36 -61 -13 151 194 -280 133 57
6649 57 18 183 130 44 -96 -176 -14 145 195 131 1 71 141 -106 117 -123 -52 -273 29 -147 138 -79 238
6672 238 -35 18 95 17 179 0 -36 3 -321 -41 -184 141 172 -291 74 -224 -190 231 -3 256 -4 -49 -146
6695 -146 43 184 188 -194 -67 -120 -73 -145 198 50 360 -151 246 41 90 132 266 -249 223 -12 -91 -263 -16
6718 -16 174 154 12 84 -76 -20 149 92 -47 131 -11 91 -139 7 -13 -49 -22 -58 164 -273 -60 84 -123
$$ packed form
6556E7M0l89L04J48J18j5j24l37%M8N00k68k25k00J65N16q3r1j14q0j01K70j78
6579c9L12o45M67k80R4J32k26N1j19L94k10J65N5j39K50m27R1K20l27J18K2m6
6601h7Q4l7P0J8K3n3j45J5K47J23m36J42j18K73q2j36n9J38K9K1J53o7M2l52J32
6626f2n4K09k48K9J91j04k3J85j46J72j55M9K49j62k45P9k5M8J64M3m74M13p6
6649E7l9J65n3q6j40q0J62J59N0o4j30P0P0k47K23k40P1k21L02j76K85k17L17
6672B38k73N3P7p8J62j79l6L9l24K80j43L25L1m63L65k98L4M21k34K59k60m5r7
6695a46J89J41Ml82J27n3M7p2L43j48L10n11L97k05M9M2J34n15M72k35p9j72K47
6718a6J90k0j42P2j60N6J69n7j39J78j42J02k30J46k0l6K7l6K22m37K13J44k07
$$ plain form
6741 -123 46 19 -122 -95 63 57 -69 14 126 47 31 -88 -26 171 168 -121 -252 -184 32 56 134 170 174 -366 -17
6766 -17 -185 44 -59 -179 -90 9 -27 144 253 44 -51 -22 328 -28 -63 -149 -244 -182 252 -57 105 266 -6
6789 -6 310 -146 -28 253 21 213 87 -29 -122 -258 -19 171 -206 116 110 140 -149 -2 -139 -326 64 230
6811 230 190 30 -187 57 82 57 207 38 -59 -127 25 53 -158 81 -387 -30 158 -196 10 -127 -43 180
6833 180 279 71 110 -78 -123 125 -68 -102 129 17 334 -276 -1 -210 -302 1 -388 57 -244 -47 -155 125
6855 125 -9 217 195 -149 -413 93 -30 -70 -18 -129 -104 -85 -113 -323 -197 -136 -254 145 -179 274 155 47
6877 47 314 193 118 -51 -108 -177 282 164 137 -18 -157 130 -211 -122 29 -197 -51 -406 78 -126 0 122
6899 122 -103 288 -244 34 62 -204 -29 113 -171 163 13 -193 93 23 176 398 -46 -178 93 -161 -169
$$ packed form
6741a23J69k7j41K7J58oj26Q3J12p9j6j19O2J97lk89j31O8K16K4P8L6Mn40L49
6766a7j68K29j03j20Q9R9l6J71J09k09r5K9L50l56l5q6r5O2M34l09J62J61k72
6789fL16m56J18K81k32J92j26j16r3j36K39J90l77L22oL0k89J47j37j87L90J66
6811B30m0j60k17K44K5k5J50j69r7o8J52K8k11K39m68L57J88l54K06j37Q4K23
6833A80R9k08L9j88m5K48j93l4K31j12L17o10K75k09r2L03l89M45l01J97j08K80
6855A25j34K26k2l44k64N06j23m0N2j11K5J9k8k10J26O1j18L99l24M53j19j08
6877D7K67j21p5j69n7o9M59j18k7j55j39K87l41Q9J51k26J46l55M84k04J26J22
6899A22k25L91n32K78K8k66J75J42k84L34j50k06K86p0J53K22m44j32K71k54q
$$ plain form
6920 -169 -89 -30 -81 38 130 -107 484 382 -63 -150 29 102 112 -91 -223 452 90 -181 -9 -45 233 73 69
6943 69 -43 214 -367 -63 134 145 193 42 111 -254 -129 -29 157 -377 89 -289 223 17 -70 50 103 216
6965 216 -164 -40 82 339 -241 144 196 121 163 19 69 -182 -209 58 -106 -59 -194 -119 -230 129 170 95 155
6988 155 -87 -110 70 -4 144 -154 40 94 242 -40 134 71 -204 118 103 -44 -144 75 -100 -372 -164 129
7010 129 3 -3 166 28 7 -62 -189 120 -163 95 -14 -45 -306 68 -120 -3 -185 128 -12 -139 -62 -81
7032 -81 19 178 402 56 4 -106 -47 18 -101 -177 53 278 -139 -9 198 18 26 36 -33 -72 231 -60 -303
7055 -303 40 -86 -155 33 -143 624 147 39 -46 -267 150 258 12 -337 -197 432 77 -10 90 -225 -491
7076 -491 227 190 -330 -107 79 -28 -101 -14 498 115 82 61 86 254 -251 359 6 29 98 -161 129 341 28
$$ packed form
6920a69Q0N9n1J19R2k37N91j02m45q7J79P3J0k03j32O75l62k71J72l6K78j60m
6943F9j12K57n81L04J97J1M8j51O9l65J25J00J86n34M66l78N12k06q7J20N3J13
6965B16l80J24J22K57n80L85N2p5M2j44N0k51k7K67j64M7j35P5j11L59M1p5O0
6988A55k42k3J80p4J48k98J94N4J48k82J74o3k75L22j5j47j00K19j75k72K08K93
7010A29j26oJ69j38k1o9j27L09k83K58j09l1k61L74j88J17j82L13j40j27P7j9
7032h1J00J59K24l46n2j10N9O5j19p6K30K25m17J30K07j80QJ0o9l9L03k91k43
7055c03L43j26o9J88j76P67m77j08q5k21M17J08k46l49J40O29l55q7J00l15k66
7076d91P18l7n20K23J86j07p3Q7N12l83l3k1K5J68n05O10l53K3O9k59K90K12l13
$$ plain form
7099 28 -19 10 -95 -12 -367 -29 22 295 203 -283 -124 -89 -8 -102 -289 165 -55 -260 308 183 -113 -78 57
7122 57 30 -28 172 91 193 -332 40 -15 251 27 98 68 -167 117 222 52 74 100 -104 -125 -69 203 28 150
7146 150 -2 4 489 84 193 -102 -186 242 -2 -101 -92 -121 -184 -170 18 105 123 6 -134 130 -98 35 17 352
7170 352 72 69 58 70 -95 221 153 -50 363 -132 99 -64 -12 -251 -75 -150 68 9 14 -83 107 -37 196 -110
7194 -110 -225 -245 45 397 -71 -104 43 -2 -28 -217 -119 -99 244 141 -103 48 -68 8 -208 99 -234 30
7216 30 -260 158 301 -101 22 -249 47 123 -69 12 -126 -91 -57 7 -46 411 153 -92 129 344 28 134
7238 134 46 -11 21 -55 -20 59 35 153 168 226 -176 89 84 67 110 96 -152 -9 -161 -80 -34 235 -80 127 -221
7263 -221 186 -80 221 133 -589 12 -81 -246 -162 49 72 -33 50 202 -309 324 -287 -9 -107 -27 123 184 -99
$$ packed form
7099B8m7K9j05Q3l55L38N1K73r2m86J59L5Q1r4j87M54k20k05N68j25k96L5J35
7122E7k7n8K00q1J02n25L72n5K66k24P1l0k35K84J05j70K2K6k04k1N6K72j75J22
7146A50j52OM85m05J09k95q4M28k44r9Rk9o3J4J88Q7J8j17j40K64k28J33j8L35
7170C52k80lj1J2j65L16o8k03M13m95K31j63N2k39J76p5K18n9Nr7J90j44K33l06
7194a10j15k0K90L52m68l3J47m5k6j89R8K0L43j03k44J51j16P6k16L07l33K64
7216C0k90M18J43m02J23k71K96P6j92Q1j38L5L4O4n3M57k58k45K21K15l16J06
7238A34q8n7L2p6L5P9k4J18J5N8m02K65nj7M3j4k48J43j52Q1M6K69l15K07l48
7263b21M07k66L01q8p22O01r3j65Q4K11K3j05Q3J52n11O33o11K78r8Q0J50O1k83
$$ plain form
7286 -99 -14 -303 108 249 58 318 -94 -220 -74 -37 312 190 216 71 -167 -45 168 48 -61 -422 145
7307 145 253 -136 64 -104 -56 -150 67 -1 277 103 49 258 1 -100 -227 16 -120 -313 178 -4 -29 29
7329 29 186 21 153 77 14 -220 98 -8 -249 -232 151 -9 -51 56 -133 88 13 -8 184 -81 -92 280 -67
7352 -67 -172 -38 -79 -96 -27 -192 -336 47 -222 -26 -63 -136 -55 114 67 151 123 -90 297 211 -131 124 152 -329
7376 -329 11 -213 92 -172 37 -241 -109 79 336 -192 175 -26 -304 297 -86 -96 157 -68 71 -208
7396 -208 -35 174 189 175 -147 70 317 -89 -21 248 -147 -319 13 2 5 -227 131 361 94 188 21 1 -36
7419 -36 97 -123 -146 58 364 104 105 -22 -26 305 -254 -46 -57 -85 -45 -250 -128 281 -255 -88 -147 -42 -159
7442 -159 -119 142 -95 -302 -19 16 -9 -95 -100 159 1 206 72 -190 -31 -161 127 51 -400 -127 214 -150
$$ packed form
7286i9Q5k89M11J41j91K60m12j26J46L7L49j22K6j45k38J22K13j20j09l61N67
7307A45J08l89K00j68M8r4K17o8K78j74n4K09k57j01j27K43j36j93M91j82k5N8
7329B9J57j65J32p6o3k34L18j06k41J7L83j60m2J07j89K21p5k1J92k65j1L72l47
7352f7j05J34m1j7O9j65j44L83k69J96l7p3Q1J69m7Q4k8k13L87q6l42K55K8m81
7376c29L40k24L05k64K09k78J32J88K57n28L67k01k78O01l83j0K53k25J39k79
7396b08J73K09J5j4l22K17K47m06O8K69l95j72L32j1Lk32L58K30k67R4j67k0l7
7419c6J33k20k3K04L06k60Jj27mL31n59K08j1k8M0k05J22M09n36J67n9J05j17
7442a59M0K61k37k07K83L5k5q6nK59j58K05j34k62J59j30K88p6m51K73L41l64
$$ plain form
7464 -150 -72 180 60 -167 7 198 -11 392 112 -217 -231 -247 -102 161 -126 95 33 328 116 -23 -3 -195
7486 -195 24 111 250 65 173 338 32 -432 233 170 125 -131 -87 7 132 -101 -83 -205 -110 -89 -66 -155 -123 -126
7510 -126 38 -28 -337 -204 -107 8 235 -162 55 176 -31 139 -95 -58 261 -117 -90 -98 71 -123 -19 383
7532 383 176 -85 46 -199 26 -85 -75 -43 117 -61 -245 214 -277 56 -167 36 -116 44 238 -99 -58
7553 -58 85 -237 -114 178 -223 -65 55 193 55 -181 17 29 170 -49 110 72 118 402 87 -172 66
7574 66 46 161 -177 -137 200 33 74 135 21 -185 -171 -238 -17 40 411 -53 135 77 44 -143 2 89 54 118
7598 118 311 306 -187 194 121 138 -471 97 -351 60 275 49 128 -18 -253 71 -29 72 -121 -182 65 -376
7620 -376 -325 -18 234 -75 -23 -39 -324 -138 -209 -10 -27 128 -270 84 20 -228 247 9 12 13 188 -21 -255
$$ packed form
7464a50P8K52j20k27J74J91k09M03k80l29j4j6J45K63k87K21o2K95k12j39K0j92
7486a95K19Q7J39j85J08J65l06m64O65o3m5k56M4R4J25k33J8j22R5K1K3q9L2l
7510a26J64o6l09J33R7J15K27l97K17J21k07J70k34L7L19l78K7qJ69j94J04M02
7532C83k07k61J31k45K25j11J0L2J60j78j84M59m91L33k23K03j52J60J94l37M1
7553e8J43l22J23K92m01J58J20J38j38k36J98J2J41k19J59l8M6K84l15k59K38
7574F6k0J15l38M0L37j67M1O1j14k06J4o7K21N7L71m64J88n8l3j87J45Q7l5O4
7598A18J93nm93L81p3J7o09N68m48M11K15k26P9j46k35L24j00J01j93o1K47m41
7620c76N1L07K52l09N2j6k85J86p1J99j7J55l98L54o4k48M75k38LJJ75k09k34
$$ plain form
7643 -255 -139 -151 24 76 83 198 -88 30 5 -125 -97 101 250 64 230 227 -11 -133 140 -75 57 74 -22
7666 -22 125 -133 28 204 -88 -72 -160 63 -168 -199 211 -248 210 41 -48 -251 -20 -131 119 34 -179 136
7688 136 -253 -55 218 102 127 -17 -165 -331 0 -6 41 280 -69 11 205 -99 34 -335 -99 83 -44 77
7710 77 -14 -75 54 341 97 31 -263 -142 148 103 77 -60 0 -247 27 201 -56 -137 66 -106 23 -365 -156
7733 -156 -12 42 236 314 -14 301 24 -260 254 68 135 10 -116 -3 -134 109 136 -44 62 -12 184 301
7755 301 -233 -149 -16 138 110 -33 -28 32 241 50 -11 -218 65 -187 -75 -234 -86 -84 -362 173 -112 43 -2
7778 -2 -266 -176 74 -37 160 118 113 13 -87 98 -130 30 169 -235 -159 -112 -118 -150 31 -210 67 78 -100 2
7802 2 -138 160 132 3 189 -82 -71 111 -98 -113 68 -110 27 122 -158 -204 72 49 -136 73 -296 170 110
$$ packed form
7643b55J16j2J75N2PJ15k86J18k5j30K8J98J49j86J66lk38j22K73k15J32J7r6
7666b2J47k58J61J76k92J6q8K23k31l1M10m59M58j69q9k03K31j11K50q5k13L15
7688A36l89J98K73j16K5j44j48j66L31oM7K39l49Q0J94l04J33l69K36J82j27J21
7710G7r1o1J29K87k44o6k94J21K90m5k6j37O0k47K74J74k57q1K03j72J29l88K09
7733a56J44N4J94P8l28L15k77k84N14j86O7j25j26J13j31K43K7j80J06p4J96J17
7755C01n34Q4J33J54k8j43NO0K09j91o1k07K83k52J12j59J48Kk78N35k85J55m5
7778bk64R0K50j11J97m2nj00j00J85k28J60J39m04P6M7ol2J81k41K77J1j78J02
7802Bj40K98k8j29J86k71J1J82k09j5J81j78J37R5k80m6K76k3j85K09l69M66o0
$$ plain form
7825 110 -4 -209 19 424 284 -276 -33 -23 70 -107 252 63 -236 322 390 -398 -68 -242 153 -110 -314
7846 -314 -49 41 -174 266 -82 -115 29 -130 64 -162 135 15 -68 -143 -176 -426 -83 73 214 109 -136 -127
7868 -127 48 -111 227 -100 -9 -53 186 37 112 4 70 -133 -53 230 81 204 -278 -128 -398 185 -140 -355
7890 -355 224 102 -198 38 6 12 -69 44 204 -109 120 110 -344 97 100 -69 154 170 79 -119 -142 81 -253
7913 -253 21 201 -86 -237 -118 66 228 10 -247 -212 12 -150 174 123 -61 -84 41 269 186 -93 -88 -50
7935 -50 -71 -111 -20 -110 12 70 86 231 145 102 184 -68 -63 -120 74 -167 -313 143 -28 -293 -77 0 -80 27 88
7960 88 41 -117 129 113 174 160 155 232 176 -212 419 75 -160 213 309 -135 89 118 148 223 -131 168 -15 119
7984 119 110 206 -88 242 -32 -10 -8 67 410 -312 56 -43 78 152 15 68 -324 -35 187 -23 -219 199 -51
$$ packed form
7825A10j14k05K28M05j40n60K43J0R3j77L59j89k99N58O8p88L30j74L95k63k04
7846c14K65R0k15M40l48l3J44j59J94k26K97j20q3p5l3k50L43J56J41j05k45R
7868a27J75j59L38l27R1m4K39j49P5j08O6k03Q0K83j49J23m82J50k70N83l25k15
7890c55N79j22l00K36l2Oq1J13J60l13K29j0m54M41Lj69K23J6r1j98k3K23l34
7913b53K74J80k87j51J19J84J62k18k57L5K24j62L24n1j84k3J25K28q3k79NL8
7935e0k1m0R1r0J22N8J6J45q6m3Q2k52Nn7J94k41j46M56j71k65K16P7q0J07O1
7960H8m7j58K46j6O1j4nP7n6l88O31l44k35L73R6m44K24K9L0P5l54K99j83J34
7984A19rR6k94L30k74K2KP5L43p22L68r9J21P4j37N3l92K89K22k10j96M18k50
$$ plain form
8007 -51 -213 290 92 -338 -235 111 116 -123 -145 17 199 0 89 149 123 -65 -158 -215 -30 5 123 47 -115 -225
8031 -225 108 -74 -130 97 134 69 -228 132 315 -4 353 -205 -217 -178 -130 457 -200 -119 -13 -59 -217 -186 73
8054 73 13 -110 181 104 -126 52 -108 -57 336 446 102 221 142 157 123 152 -19 -171 -30 152 -42 4 -150
8077 -150 -54 210 -22 2 -23 -83 -388 288 107 316 101 180 -86 -54 -27 -42 147 81 62 -40 -60 233 199 -54
8101 -54 162 6 -45 -81 210 -282 -20 49 87 235 -37 313 45 -71 39 86 -61 39 133 37 198 -10 217
8124 217 -366 42 89 165 -16 193 -136 -125 -179 27 -156 -152 -21 -24 333 -242 159 -366 -261 102 150 67 -81
8147 -81 -340 -190 15 31 11 -261 205 -162 -230 256 125 85 -185 -75 -248 -33 -38 108 -128 -97 16 -138 -116
8170 -116 -24 8 -6 165 -77 -74 29 57 131 105 22 56 176 8 -50 -117 43 -6 -69 -68 332
$$ packed form
8007e1j62N03j98m30J03L46Nk39k2J62J82j99Q9O0k6j88r3n7J85L5J18p6j62j10
8031b25L33j82n6K27L7o5k97L60J83l19L57n58j2L9M8N87o57Q1J06m6j58L1K59
8054G3o0j23K91p7k30J78j60N1L93J10l44J19p9J5l4K9j71j52J41J82j94M6j54
8077a50R6K64k32K4k5o0l05O76j81K09k15P9k66L2K7j5J89o6j9j02k0K93l4k53
8101e4K16j56n1l6K91m92K62O9L8J48k72L50k68j16J10M7j47J00R4r6J61k08K27
8124B17n83M08M7P6j81K09l29J1n4K06j83MJ31lL57n75M01n25J05L63M8q3j48
8147h1k59J50K05J6k0k72M66l67o8M86j31m0k70J10j73K15nJ46k36L1J13j54K2
8170a16R2L2j4J71k42LJ03K8P4k6q3L4J20j68n8o7J60m9o3JM00
8191C32
$$ Imaginary data points
##PAGE= N=2
##DATA TABLE= (X++(I..I)), XYDATA
$$ plain form
0 0 0 0 0 0 7 -7 7 -7 7 -14 14 -21 22 -28 35 -42 49 -58 71 -83 95 -112 130 -150 171 -197 224 -254 286
29 286 -326 365 -412 459 -513 575 -638 710 -788 876 -969 1073 -1188 1314 -1455 1612 -1790
46 -1790 1988 -2214 2477 -2781 3140 -3573 4104 -4776 5655 -6859 8618 -11424 16619 -29353
60 -29353 118535 113746 -191934 -31344 55983 102132 -12851 -168565 23163 189022 -56440
71 -56440 -125605 14142 79783 60779 -86413 -102302 108042 97265 -97219 -78554 53212
82 53212 70678 17144 -116817 -31712 143938 7790 -107834 -19647 56129 75728 -44263
93 -44263 -124085 71537 114098 -72637 -74160 12243 82823 34904 -114987 -37964 119612 31020
105 31020 -96969 -35482 57526 65011 -34708 -97381 38119 101438 -35834 -85942 16111
$$ packed form
0@%%%%Pj4J4j4J4k1K8l5M3n0O3p7R1j07J29j54J78k07K42k80L21l68M21m78N40
29B86o12O91p77Q71r72J088j213J348j498J664j845K042k261K502k769L067l402
46a790L778m202M691n258N921o713P677q880J0431j2514J5477k0042K8043m5972
60b9353J47888m789l05680J60590Q7327M6149j14983j55714J91728J65859k45462
71e6440o9165J39747O5641j9004j47192j5889K10344j0777j94484J8665J31766
82E3212J7466n3534j33961Q5105J75650j36148j15624Q8187P5776J9599j19991
93d4263p9822J95622M2561j86735j523Q6403P0580m7919j49891P7023J57576q8592
105C1020j27989O1487R3008P485r9719o2673J35500O3319j37272n0108J02053
$$ plain form
116 16111 65961 25144 -68664 -57219 90247 47713 -77093 -39642 38348 60945 -16577 -84621
128 -84621 14346 89083 -15338 -69429 -6253 55485 39184 -61247 -50910 61374 51725 -49619
140 -49619 -50195 28795 52571 -1376 -70496 -6859 78793 2782 -62669 -12973 41765 37360 -33652
153 -33652 -61755 42475 61088 -41353 -45233 12841 48988 10391 -63475 -15925 65836 15827
165 15827 -55599 -19693 36316 36769 -27056 -52583 28144 52704 -22472 -46573 8630 40151
177 40151 12230 -44441 -25495 53456 20877 -42378 -20907 21882 35531 -11887 -48808 11845
189 11845 51133 -11765 -39275 -2257 32162 22473 -38244 -29412 40293 28872 -33079 -28008 19148
202 19148 31856 -4825 -43960 2175 46984 -3691 -37499 -5085 28658 19343 -25719 -31184
$$ packed form
116A6111M9850m0817r3808J1445J47466m2534j24806L7451P7990K2597p7522o8044
128h4621R8967P4737j04421n4091O3176O1738j6301j00431J0337J12284r649j01344
140d9619n76P8990K3776n3947o9120O3637Q5652p6011o5451M9696N4738m405p1012
153c3652k8103J04230J8613j02441l880N8074L6147l8597p3866M7550Q1761n0009
165A5827p1426L5906N6009M53o3825k5527Q0727K4560p5176k4101N5203L1521
177D0151k7921n6671J8946P8951l2579o3255K1471M2789J3649m7418l6921O0653
189A1845L9288o2898k7510L7018L4419r689o0717Q832O9705j1421o1951N071M7156
202A9148J2708l6681l9135M6135M4809n0675l3808L2414L3743r315m5062n465
$$ plain form
214 -31184 29861 30310 -26705 -24140 10014 29386 1510 -37121 -4205 38039 5171 -31863 -9378
227 -9378 21834 21661 -18471 -30520 20224 30183 -16218 -27108 6979 25838 5443 -30247 -11610
240 -11610 35036 9093 -27782 -11240 17023 20858 -12497 -28442 12187 29659 -11226 -23770
252 -23770 2107 21238 9780 -25740 -13561 26102 14032 -21882 -14678 13990 18808 -5814
264 -5814 -26510 5462 27981 -5204 -22859 -1486 18794 10101 -18695 -17436 21234 16878 -18765
277 -18765 -14196 8777 18567 -2434 -23796 1071 24478 -345 -20359 -3612 14668 11530 -14169
290 -14169 -17186 15463 17003 -12526 -15901 6516 15857 1096 -19501 -4596 22226 3284 -17850
303 -17850 -5677 12500 12137 -9779 -16986 9891 17718 -9312 -14496 3310 14399 4097 -17361
$$ packed form
214c1184O1045M49n7015K565L4154J9372k7876l8631L2916M2244l2868l7034K2485
227i378L1212j73m0132j2049N0744R959m6401j0890L4087J8859k0395l5690J8637
240a1610M6646k5943l6875J6542K8263L835l3355j5945M0629J7472m0885j2544
252b3770K5877J9131j1458l5520J2179L9663j2070l5914P204K8668M818k4622
264e814k0696L1972K2519l3185j7655K1373K0280q693k8796J259L8670m356l5643
277a8765M569K2973R790k1001k1362K4867K3407k4823k0014J6747J8280l138k5699
290a4169l017L2649J540k9529l375K2417R341j4761k0597J4905K6822j8942k1134
303a7850J2173J8177l63k1916p207K6877P827k7030n184J7806J1089j0302k1458
$$ plain form
316 -17361 -6116 17737 6755 -14843 -7668 10236 11046 -6402 -16333 6055 16416 -5057 -14215
329 -14215 588 12943 4247 -13164 -8306 14417 8774 -12245 -8304 7362 11431 -3932 -14479
342 -14479 2990 15246 -1870 -13433 -1132 10769 6139 -10908 -8696 11398 9198 -9338 -9711
355 -9711 5369 10266 -1691 -12526 -18 13484 95 -11591 -2507 9559 6290 -8358 -9017
368 -9017 7801 10080 -6860 -9066 3262 9343 116 -11285 -2042 11365 2471 -9996 -3542 7564
382 7564 6260 -5958 -9446 5818 9546 -4625 -9011 1825 9088 1489 -9495 -3347 10132 3880
396 3880 -8949 -4224 5670 6740 -4361 -8731 3712 9194 -2486 -8276 822 7193 2483 -7781
410 -7781 -4539 8225 4736 -7010 -5194 4696 6110 -2327 -8154 1471 9069 -1183 -7619 -868
$$ packed form
316a7361J1245K3853j0982k1598P175J7904Q10j7448r931K2388J0361k1473r158
329a4215J4803J2355q696j7411M858K2723n643k1019L941J5666M069j5363j0547
342a4479J7469J2256j7116j1563J2301J1901m630j7047K212K0094k200j8536l73
355i711J5080M897j1957j0835J2508J3502j3389j1686R084J2066l269j4648o59
368i017J6818K279j6940k206J2328O081r227j1401R243J3407q894j2467O454J1106
382G564j304j2218l488J5264L728j4171m386J0836P263p599j0984O148J3479o252
396C880j2829M725R894J070j1101m370J2443N482j1680n790R098O371m710j0264
410g781L242J2764l489j1746J816R890J414q437n827R625P598j0252o436O751
$$ plain form
424 -868 6426 3279 -6053 -5501 6503 5932 -5629 -5373 3135 6030 -884 -7828 -27 8327 558 -6986
440 -6986 -1326 5371 3876 -4515 -5758 5169 5794 -4126 -5697 2477 5472 249 -6345 -1405 7198
455 7198 1246 -5893 -2023 4139 3840 -3592 -5654 3190 5942 -2854 -5290 1237 4907 1234 -5607
470 -5607 -2350 6028 2232 -5134 -2953 3420 3984 -2150 -5492 1828 5658 -1671 -4803 -53 4488
485 4488 1604 -4534 -2802 4772 3230 -4467 -3053 2500 3947 -1223 -5379 739 5207 -592 -4754
500 -4754 -476 3788 2085 -3288 -3298 3982 3123 -3339 -3238 1850 3579 -501 -4263 -198 4529 476
516 476 -4063 -897 3061 2394 -2835 -3433 2986 3266 -1963 -3296 759 3314 369 -4116 -872 4110
532 4110 880 -3139 -1401 2812 2386 -1506 -3363 1540 3513 -1447 -2937 522 2876 334 -3299
$$ packed form
424h68P294l147r332N52J2004n71j1561K56Q508K895o914o944P801Q354p769p544
440f986N660O697j495q391j243J0927O25r920j571Q174K995n223o594M940Q603
455G198n952p139L870O162k99p432k062Q844K752q796k436O527L670l673o841
470e607L257Q378l796p366K181O373N64o134l342P320L830p329l132M750M541
485D488k884o138J732P574j542p697J414N553J447n170m156O118M468n799m162
500d754M278M264j703n373j0P280q59o462J01N088J729m080l762M065M727m053
516D76m539L166L958o67n229n98O419K80n229j333M055K555k945m485L244M982
532D110l230m019J738M213m26l892j857M903J973m960j490L459K354k542l633
$$ plain form
547 -3299 -1875 3341 1879 -3050 -1517 1798 2014 -1259 -3415 1123 3036 -522 -3052 -151 2849
562 2849 1348 -2648 -1647 2783 1616 -2289 -1842 1508 2103 -488 -3049 343 3032 30 -2765 -55
578 -55 1862 1338 -2130 -1904 2061 2160 -1736 -1907 954 1742 -332 -2510 -394 2692 153 -2177 -621
595 -621 1679 1629 -1354 -1823 1655 2419 -1487 -2107 386 2102 106 -2211 -856 2395 709 -2248 -1182
612 -1182 1381 1589 -941 -2023 1147 1888 -1013 -1682 474 1460 393 -2119 -751 1896 1028 -1550
628 -1550 -1086 1387 1656 -500 -1663 140 1915 -257 -1814 -243 1583 1056 -1361 -981 1558 1154
644 1154 -1501 -1164 881 1258 -217 -1702 141 1825 -117 -1492 -332 1453 755 -1076 -1340 1103
660 1103 1177 -785 -1106 431 1551 -23 -1166 -290 1286 214 -1336 -341 815 842 -651 -1286 764
$$ packed form
547c299J424N216j462m929J533L315K16l273k156M538J913l558k530K901L000
562B849j501l996J001M430j167l905M47L350N95k591k561L392K689l002k795K710
578e5J917n24l468K26L965R9l896j71K861P88k074k178K116L086k539k330J556
595f21K300n0k983m69L478P64l906o20K493J716j996k317J355L251j686k957J066
612a182K563K08k530j082L170P41k901o69K156R86j067k512J368K647q68k578
628a550M64K473K69k156j163J803J775k172j557J571J826n27k417L80K539m04
644A154k655L37K045L77j475j485J843J684j942j375J160J785o98j831k64K443
660A103P4j962l21J537J120j574j143Q76J576j072j550R95J156K7j493o35K050
$$ plain form
677 764 1359 -387 -1205 174 1034 258 -1186 -518 1306 241 -851 -553 937 921 -846 -1066 412 923
695 923 -311 -864 132 757 189 -1106 -741 576 612 -843 -440 418 628 -220 -1179 -36 771 -89 -1171
714 -1171 -325 565 455 -610 -687 545 745 -506 -910 481 631 -107 -912 103 554 -232 -620 44 569
733 569 374 -350 -828 474 567 -144 -450 337 590 317 -606 -569 721 51 -405 -335 333 397 -354 -556 352
754 352 576 -30 -576 10 608 69 -433 -83 817 94 -512 -307 -19 336 93 -274 -223 698 168 -387 7
775 7 361 175 -193 -131 145 464 -482 -214 241 300 39 -199 304 316 142 -468 -258 -127 209 -351 -127 413
797 413 188 -350 -170 34 234 -128 -454 -308 274 288 -347 -237 87 76 -99 -62 146 293 36 -264 -19
818 -19 208 -188 2 -512 204 65 -108 -84 68 283 -14 -402 210 -51 -86 -59 -118 43 106 -92 -398 404
$$ packed form
677G64N95j746q18J379Q60p76j444O68J824j065j092K98J490j6j767k20J478N11
695I23j234n53R96O25n68j295L65J317L6j455M03Q58K10q48r59J143Q07q60j082
714a171Q46Q90j10j065p7J232K00j251m04J391J50p38q05J015M51p86l88O64N25
733E69j95p24m78J302R3p11l06P87K53k73r23L7J290o70m56P0O68O4p51k02R08
754C52K24o06n46N86N98n39n02L50R00p23o06K05K88L55k43l67N1R21n30n55L94
775GL54j86l68O2K76L19r46K68M55N9k61k38N03J2j74o10K10J31L36n60K24N40
797D13k25n38J80K04K00l62l26J46N82J4o35J10L24j1j75L7K08J47k57l00K45
818a9K27l96J90n14P16j39j73K4J52K15k97l88O12k61l5K7n9J61O3j98l06Q02
$$ plain form
840 404 -14 -165 -185 108 293 77 192 48 253 -68 -106 -87 -63 385 -129 -139 -145 348 -184 61 61 -217 309
863 309 -324 -291 284 -170 -76 60 -63 422 47 -82 136 181 -126 -77 -343 -4 -99 -221 -21 60 -159 -5
885 -5 251 -44 83 -39 -174 243 229 -224 -159 -42 108 319 -190 -117 20 69 255 83 -100 -38 -374 4 53
908 53 183 -376 209 -4 321 3 -141 23 210 -459 -25 319 232 -189 -60 71 -195 41 -122 -117 -158 -27
930 -27 20 -1 196 307 2 18 186 -155 -163 -24 -3 123 46 133 168 -3 -56 -229 -35 -50 156 448 -96 -52 169
955 169 -76 -69 128 206 21 2 179 162 245 77 43 54 107 365 -90 -147 97 50 -55 16 -105 -325 -327 -196 313
980 313 140 -110 -628 7 -120 -32 -220 -230 195 195 121 -249 39 290 -22 -152 324 -88 26 -77 -350 -161
1002 -161 23 -211 -11 -148 -450 -4 -93 176 287 89 -90 59 259 9 -4 450 39 -43 5 -101 -160 48
$$ packed form
840D04m18j51k0K93J85k16J15j44K05l21l8J9K4M48n14j0oM93n32K45%k78N26
863C09o33L3N75m54R4J36j23M85l75j29K18M5l07M9k66L39r5j22K00Q1k19J54
885eK56k95J27j22j35M17j4m53O5J17J50K11n09P3J37M9J86j72j83O2l36L78M9
908E3J30n59N85k13L25l18j44J64J87o69M34L44q7m21J29J31k66K36j63Nm1J31
930b7M7k1J97J11l05J6J68l41qJ39K1J26p7Q7L5j71n3j73J94j5K06K92n44M4K21
955A69k45PJ97P8j85j9J77j7Q3j68l4J1N3K58m55n7K44m7j05P1j21k20kJ31N09
980C13j73k50n18O35j27Q8j88j0M25%p4l70K88K51l12j30M76m12J14j03k73J89
1002a61J84k34K00j37l02M46q9K69J11j98j79J49K00k50j3M54m11q2M8j06n9K08
$$ plain form
1024 48 54 -138 15 322 -138 -92 -9 -158 49 134 -125 89 184 -244 -102 112 129 -70 -158 -132 279 -210 -114 -27
1048 -27 254 -123 -296 -92 72 167 143 -192 157 241 -316 339 -293 259 -223 -200 108 15 6 -115 -77 -49 120
1071 120 -34 -555 98 -23 222 -21 -258 82 184 -4 -148 -127 -1 136 -112 159 -90 47 -218 -301 91
1092 91 172 -90 -14 186 164 -179 -201 246 159 -80 55 26 294 -80 -113 -319 144 -27 -113 -172 103 113 210 103
1116 103 89 -81 -36 -56 -116 66 -69 -118 -26 320 108 84 -419 -67 83 63 -225 -59 -234 315 -346 75 120
1139 120 121 -215 -58 -198 176 -22 -261 39 -270 165 4 -6 -52 143 -20 249 116 251 -171 -220 -470 -86
1161 -86 -36 -43 70 269 80 163 -192 -196 281 124 -390 43 -201 147 190 -335 118 65 16 194 80 -185 -75
1184 -75 -11 54 125 -118 -517 -109 -98 36 29 125 -87 -36 -133 -134 -41 -38 281 -39 43 136 59 1 -112 232 -5 -311
$$ packed form
1024D8Oj92J53L07m60M6Q3j49K07Q5k59K14R5m28J42K14J7j99q8K6M11m89R6Q7
1048b7K81l77j73K04J64R5k4l35L49Q4n57O55o32N52m82K3L08r3rj21L8K8J69
1071A20j54n21O53j21K45k43k37L40J02j88j44K1J26J37k48K71k49J37k65q3L92
1092I1Q1k62P6K00k2l43k2M47q7k39J35k9K68l74l3k06M63j71q6n9K75J0R7j07
1116A03j4j70M5k0o0J82j35m9R2L46k12k4n03L52J50k0k88J66j75N49o61M21M5
1139A20Jl36J57j40L74j98k39L00l09M35j61j0m6J95j63K69j33J35m22m9k50L84
1161h6N0pJ13J99j89Q3l55mM77j57n14M33k44L48M3n25M53n3m9J78j14k65J10
1184g5O4O5P1k43l99M08J1J34pR6k12N1r7jR3LL19l20Q2R3p7n8j13L44k37l06
$$ plain form
1210 -311 -226 -65 196 146 -291 -49 -41 55 -102 -142 15 318 -280 204 315 17 -299 -41 -278 -118 173 -213
1232 -213 296 229 -14 -161 -121 160 -343 -113 -1 11 360 -94 -91 -372 81 77 -556 105 -62 149 116 -462 45
1255 45 249 90 -358 295 49 265 44 -70 191 -172 -150 92 124 273 -16 128 35 -121 -171 -125 -93 -255
1277 -255 -48 -218 -48 -63 128 88 -34 83 -50 0 215 -106 174 -85 17 166 397 72 -432 1 361
1298 361 82 -234 -108 144 85 -221 122 206 101 12 -177 252 -227 -135 -241 -33 82 35 -220 -197 179 162
1320 162 -202 174 249 329 111 -64 -175 -112 13 58 60 262 26 -408 -147 -100 28 -249 -161 -63 72 250 -199
1343 -199 35 165 -105 -409 -62 265 65 98 -14 38 -135 -89 65 246 58 115 -184 -206 82 27 222 -225
1365 -225 392 127 20 226 287 -16 -307 -134 -326 254 222 18 -43 -22 293 -258 -307 -24 149 -294 112 -319
$$ packed form
1210c11Q5J61K61n0m37K42QR6j57m0J57L03n98M84J11k98l16K58k37J60K91l86
1232b13N09o7k43j47M0K81n03K30J12J2L49m54Lk81M53mo33O61j67K11l3n78N07
1255D5K04j59m48O53k46K16k21j14K61l63K2K42L2J49k89J44r3j56n0M6L2j62
1277b55K07j70J70j5J91m0j22J17j33N0K15l21K80k59J02J49K31l25n04M33L60
1298C61k79l16J26K52n9l06L43Q4j05q9j89M29m79R2j06K08J15m7k55K3L76j7
1320A62l64L76P5Q0k18j75j11O3J25M5KK02k36m34K61M7J28k77Q8R8J35J78m49
1343a99K34J30k70l04L47L27k00L3j12N2j73M6J54J81j88N7k99k2K88n5J95m47
1365b25O17k65j07K06O1l03k91J73j92N80l2k04o1K1L15n51m9K83J73m43M06m31
$$ plain form
1387 -319 -526 75 -221 98 348 -27 -275 -12 220 61 -90 -47 -43 161 -130 -10 -260 232 175 58 52 59 177
1410 177 -162 -191 86 9 202 -192 -337 430 60 -468 127 -100 178 -234 -92 79 30 56 -398 -30 163
1431 163 17 353 -339 250 106 -170 -359 195 44 -244 -90 -148 201 191 -76 -192 -52 147 -224 104 217
1452 217 109 -70 285 31 -5 27 187 57 -41 -188 -329 209 -38 -40 -58 204 33 65 -38 45 -31 22 -120
1475 -120 243 76 149 77 16 -24 3 -42 194 277 176 133 -418 -129 80 -48 -226 273 169 146 -274 -164 -113
1498 -113 75 66 211 210 400 -218 -152 -111 131 287 -101 58 -141 -105 -68 180 -56 5 164 37 352 17 61
1521 61 178 -29 32 56 159 -283 -182 -104 20 124 -30 236 -110 132 -24 -82 161 -177 204 -33 29 -336
1543 -336 -278 -111 34 130 6 -61 243 191 -80 54 -104 69 176 55 170 -44 -26 49 146 -78 -345 42
$$ packed form
1387c19k07O01k96L19K50l75k48K63K32j59j51M3MK04k91J20k50M92n7j17oPJ18
1410A77l39k9K77p7J93l94j45P67l70n28N95k27K78m12J42J71m9K6m54L68J93
1431A63j46L36o92N89j44k76j89N54j51k88J54n8L49j0k67j16J40J99l71L28J13
1452B17j08j79L55k54l6L2J60j30r8j47j41N38k47kj8K62j71L2j03Q3p6N3j42
1475a20L63j67P3p2o1m0K7m5K36Q3j01m3n51K89K09j28j78M99j04k3m20J10N1
1498a13J88rJ45jJ90o18O6M1K42J56l88J59j99L6L7K48k36O1J59j27L15l35M4
1521F1J17k07O1K4J03m42J01P8J24J04j54K66l46K42j56n8K43l38L81k37O2l65
1543c36N8J67J45R6j24o7L04n2k71J34j58J73J07j21J15k14J8P5R7k24k67L87
$$ plain form
1565 42 -119 -271 -72 -21 145 60 -19 114 -70 15 380 36 -123 -111 -102 -45 35 -85 98 159 156 -34 80 -27
1589 -27 -207 91 81 184 51 40 113 -31 -169 -109 259 353 -156 76 232 9 61 -29 -116 -194 -126 -288 -201 85
1613 85 68 121 -82 136 -19 73 -47 211 162 -62 28 -93 362 -45 105 -6 96 -61 351 285 -141 192
1635 192 30 -46 -33 -173 -261 -19 234 215 -368 -148 -122 -161 100 -313 -74 -264 183 227 -393 85 168 388 157
1658 157 83 -90 90 -7 -43 -12 70 185 -335 319 188 187 -301 -16 289 233 -88 124 -15 29 -91 -180 -193 276
1682 276 11 338 303 -128 -141 37 91 -210 83 -206 99 -226 191 20 46 132 -197 85 49 -157 -91 232
1704 232 -133 -203 59 -89 -149 143 -33 -230 133 -20 83 8 -91 63 182 134 105 36 60 -48 -84 119 317
1727 317 237 -164 170 -2 -107 357 38 -15 96 -18 238 5 -38 -162 186 22 -237 -29 54 -175 -69
$$ packed form
1565D2j61j52J99N1J66q5p9J33j84Q5L65l44j59J2RN7Q0j20J83O1lj90J14j07
1589b7j80K98j0J03j33j1P3j44j38O0L68R4n09K32J56k23N2r0q7p8O8j62Q7K86
1613H5j7N3k03K18j55R2j20K58m9k24R0j21M55m07J50j11J02j57M12o6m26L33
1635A92j62p6J3j40q8K42K53j9n83K20K6l9K61m13K39j90M47M4o20M78Q3K20k31
1658A57p4j73J80r7l6L1Q2J15n20O54j31jm88K85L05n6l21K12j39M4j20q9j3M69
1682B76k65L27l5m31j3J78N4l01K93k89L05l25M17j71K6Q6l29K82l6k06O6L23
1704B32l65p0K62j48o0K92j76j97L63j53J03p5r9J54J19m8k9o9K4j08l6K03J98
1727C17q0m01L34j72j05M64l19n3J11j14K56k33m3j24L48j64k59K08Q3k29J06
$$ plain form
1748 -69 80 144 164 93 52 -60 -371 -131 -9 -130 -105 159 -41 -222 130 83 -73 22 130 4 208 52 -8
1771 -8 -48 188 -156 44 -107 -132 -105 24 -73 -216 -128 -42 -67 119 26 -61 -53 321 74 124 -107 -146 -90 61 -39
1796 -39 79 48 -73 -60 -15 143 276 -16 206 -128 91 -120 185 148 13 -111 -103 -78 -52 47 -56 -47 270 -37
1820 -37 -15 150 -18 140 5 61 -161 -92 121 94 92 -143 210 170 124 -282 160 159 -354 -139 -156 190 -391 -142
1844 -142 131 -39 271 -85 -1 154 158 177 233 -85 125 24 -81 -42 269 269 -127 0 42 154 -221 338 -117
1867 -117 65 -8 -126 53 -183 108 4 121 141 -273 28 270 -82 31 -78 200 64 -1 -56 65 -40
1888 -40 -104 20 -285 -88 46 36 -406 141 5 -49 -62 70 -152 330 -44 -139 335 -147 -312 258 -55 39
1910 39 153 -56 -106 -101 408 -1 -172 457 -129 40 232 188 -100 -152 -165 405 85 192 385 -6 -429 -140
$$ packed form
1748f9J49O4K0p1m1j12l11K40J22j21K5K64k00j81L52m7j56R5J08j26K04j56o0
1771hm0K36l44K00j51k5K7J29r7j43Q8Q6k5J86r3q7QL74k47N0k31l9N6J51j00
1796c9J18l1j21J3M5J58J33k92K22l34K19k11L05l7j35j24QK5K6R9j03RL17l07
1820c7K2J65j68J58j35N6k22O9K13k7kk35L53m0m6m06M42jn13K15j7L46n81K49
1844a42K73j70L10l56Q4J55MJ9N6l18K10j01j05L9L11%l96J27M2J12l75N59m55
1867a17J82p3j18J79k36K91j04J17K0m14L01K42l52J13j09K78j36o5n5J21j05
1888d0o4J24l05J97J34j0m42N47j36n4j3J32k22M82l74r5M74m82j65N70l13R4
1910C9J14k09n0NN09m09j71O29n86J69J92m4k88n2j3N70l20J07J93l91m23K89
$$ plain form
1932 -140 199 60 61 181 -147 -9 -167 17 236 -116 -34 199 -221 -79 76 -157 65 87 -93 30 45 -175
1954 -175 -82 -9 -33 1 8 216 -293 43 146 2 -253 183 75 0 -292 115 206 78 126 53 -167 -34 34 28
1978 28 -63 -70 190 -34 123 159 -27 -123 -174 11 -8 73 419 -281 75 65 -234 138 -67 -121 -6 366 133 -104
2002 -104 -3 60 -2 -316 -77 104 44 89 182 -214 -186 202 -80 -152 -182 127 -353 -209 -111 -321 288 -59 -116
2025 -116 218 219 -139 335 -47 305 -203 -126 -131 171 -134 2 -41 49 -235 330 29 77 37 -241 -129 -91 194
2048 194 -52 -101 -117 -26 127 -213 83 410 70 4 186 9 128 -139 -333 -152 -155 274 239 38 4 -265 136
2071 136 -106 -264 -75 101 -149 0 125 -75 -232 -40 151 167 74 -152 -378 -13 231 -170 -76 139 121
2092 121 88 -201 216 5 -119 -41 45 42 -10 95 -226 368 97 -182 22 -21 -64 -176 -264 -30 -52 -219 -121 -22
$$ packed form
1932a40L39j39JJ20l28J38j58J84K19l52Q2K33m20J42J55k33K22K2j80J23J5k20
1954a75R3P3k4L4PK08n09L36J03j44k55M36j08p5k92M07R1j28M8p3k20J33O8o
1978B8r1pK60k24J57L6j86r6n1J85j9Q1L46p00L56j0k99L72k05n4J15L72k33k37
2002a04J01O3o2l14K39J81o0M5R3l96K8L88k82p2l0L09m80J44R8k10O09l47n7
2025a16L34Jl58M74l82L52n08P7nL02l05J36m3R0k84N65l01M8m0k78J12L8K85
2048A94k46m9j6R1J53l40K96L27l40o6J82j77J19k67j94J81lM29l5k01l4k69M01
2071A36k42j58J89J76k50J49J25k00j57J92J91J6r3k26k26L65K44m01R4K15j8
2092A21l3k89M17k11j24P8Q6ln2J05l21N94k71k79K04m3m3j12q8K34k2j67R8R9
$$ plain form
2116 -22 -377 -126 132 50 77 233 148 152 -166 -226 -140 -196 -175 -203 100 -84 -30 -126 -213 -234 97 21 279 15 -83 104
2142 104 299 91 -123 44 4 25 -154 -271 -231 85 -65 -331 -56 316 -121 85 -343 -114 7 147 3
2163 3 42 -74 240 34 -37 221 -10 -184 -4 58 -68 -79 70 99 -26 -272 406 -149 341 -29 -14 194 161
2186 161 -118 -76 -15 18 16 211 -100 -152 33 5 -72 -47 481 147 164 -36 -25 -10 107 -31 17 -39 -225 -92 35
2211 35 -131 -146 -17 -90 65 162 -116 203 144 -104 137 -87 -229 -178 206 -298 -36 89 311 -300 -18 99
2233 99 -131 -76 -234 -70 -56 56 -217 123 -287 189 -318 -197 -117 98 -11 -108 4 56 15 43 83 -41 230
2256 230 7 172 123 -102 -58 -285 -168 95 -103 -180 -134 -9 -132 28 -54 -42 194 -267 150 110 -232 -32
2278 -32 64 -243 133 -373 21 172 40 78 31 14 -114 351 -9 -87 27 48 112 -118 63 -70 -18 -107 40
$$ packed form
2116b2l55K51K58q2K7J56q5Ml18o0Q6n6K1k8L03j84N4r6q7k1L31p6K58k64r8J87
2142A04J95k08k14J67m0K1j79j17M0L16j50k66K75L72m37K06m28K29J21J40j44
2163CL9j16L14k06p1K58k31j74J80O2j26j1J49K9j25k46O78n55M90l70J5K08l3
2186A61k79M2O1L3kJ95l11n2J85k8p7K5N28l34J7k00J1J5J17j38M8n6j86J33J27
2211C5j66j5J29p3J55R7k78L19n9k48K41k24j42N1L84n04K62J25K22o11K82J17
2233I9k30N5j58J64J4J12k73L40m10M76n07J21Q0K15j09r7J12N2m1K8M0j24K71
2256B30k23J65m9k25M4k27J17K63j98p7M6J25j23J60q2J2K36m61M17m0l42K00
2278c2R6l07L76n06L94J51j32L8m7j7j28M65l60p8J14K1O4k30J81j33N2q9J47
$$ plain form
2301 40 130 -33 177 -187 125 235 147 -70 253 377 91 -171 -83 186 -214 72 -126 -180 244 34 63 -183
2323 -183 230 -173 164 -149 76 54 -127 -3 88 -221 -192 37 -35 86 240 217 -76 339 -256 59 110 86
2345 86 0 -28 109 -10 64 55 -115 -202 -143 144 -141 -73 -276 -113 242 5 146 -21 -247 48 3 34 42 290
2369 290 110 -136 -13 24 179 -192 -315 -13 -159 6 114 -168 132 129 -227 -149 -97 -180 -37 200 -103 -90
2391 -90 133 -76 -322 -170 265 34 55 154 -22 31 179 -225 -49 16 -138 -176 237 213 -168 117 -33 255
2413 255 -151 206 78 149 -171 245 178 -254 52 370 261 140 146 319 -185 17 30 46 123 -39 12 161 -51
2436 -51 -140 -22 58 67 -56 102 -185 267 -41 -306 -15 15 48 -185 66 42 -74 -128 132 -37 4 33 64 -96
2460 -96 77 -361 152 -12 -120 15 -88 -56 -129 109 -50 160 -286 87 -88 -71 71 182 -312 14 -201
$$ packed form
2301D0R0j63K10l64L12J10q8k17L23J24k86k62Q8K69m00K86j98n4M24k10K9k46
2323a83M13m03L37l13K25k2j81J24R1l09K9K29p2J21J54k3k93M15n95L15N1k4
2345H6q6k8J37j19P4rj70q7N9K87k85O8k03J63L55k37J41j67k26K95m5L1QK48
2369B90j80k46J23L7J55l71j23L02j46J65J08k82L00ll56P8N2q3J43K37l03J3
2391i0K23k09k46J52M35k31K1R9j76N3J48m04J76O5j54l8M13k4l81K85j50K88
2413B55m06L57j28P1l20M16o7m32L06L18j09j21OJ73n04K02J3J6P7j62N1J49k12
2436e1q9J18Q0Rj23J58k87M52l08k65K91L0L3k33K51k4j16n4K60j69M1K9L1j60
2460i6J73m38N13j64j08J35j03L2p3K38j59K10m46L73j75J7J42J11m94L26k15
$$ plain form
2481 -201 209 70 49 -141 196 -38 46 -153 154 103 0 171 -201 24 117 64 -23 148 178 194 -74 271 -146
2504 -146 -22 238 122 100 87 -293 -108 126 20 -246 -160 -72 24 -169 52 -168 139 104 -298 -386 52 -227
2526 -227 -190 -23 -62 -175 -392 35 -3 101 -216 31 253 22 -120 3 -392 -8 7 -110 -110 -58 -20 -68 -80
2549 -80 -314 -60 188 85 172 205 205 -31 80 129 -350 54 413 -277 90 38 111 -533 320 -40 -3 -59 152
2572 152 240 157 -4 -127 20 267 -149 12 220 -179 34 -6 -53 -78 -23 -87 156 -317 -97 30 158 80 49
2595 49 -86 -46 215 248 61 104 148 -276 -161 -84 209 -85 188 -281 -57 13 39 133 -121 -242 33 17 -83
2618 -83 -208 75 97 182 -142 -150 105 162 -201 139 -73 92 -246 171 84 -179 200 -216 17 -259 -386 124
2640 124 40 -167 138 -121 121 88 189 171 20 -25 65 -255 12 -2 -171 53 15 133 9 86 148 -74 289
$$ packed form
2481b01M10j39k1j90L37k34Q4j99L07n1j03J71l72K25R3n3q7J71L0J6k68L45m17
2504a46J24K60j16k2j3l80J85K34j06k66Q6Q8R6j93K21k20L07l5m02q8M38k79
2526b27L7J67l9j13k17M27l8J04l17K47K22k31j42J23l95L84J5j17%N2L8m8j2
2549h0k34K54K48j03Q7L3%k36J11M9m79M04L59o90L67n2P3o44Q53l60L7n6K11
2572A52Q8q3j61j23J47K47m16J61K08l99K13m0m7k5N5o4K43m73K20J27J28p8l1
2595D9j35M0K61L3j87M3M4m24J15P7K93k94K73m69K24P0K6R4k54j21K75j6j00
2618h3j25K83K2Q5l24qK55N7l63L40k12J65l38M17q7k63L79m16K33k76j27N10
2640A24q4k07L05k59K42l3J01j8j51m5R0l20K67j4j69K24l8J18j24P7O2k22L63
$$ plain form
2663 289 -270 -198 -92 155 -152 -147 130 -73 39 10 192 82 263 241 -26 -134 -16 -132 -131 16 209 -6
2685 -6 -130 114 -10 -62 432 -49 -29 -85 -36 107 48 139 47 145 -320 41 49 -316 221 -8 1 240 -59 118 5
2710 5 -2 -140 -223 -64 -47 386 201 -183 -280 -49 -371 28 -19 -258 -44 -221 -371 190 -335 -67 -65 -100 -210 115
2734 115 87 -305 -212 -8 41 -33 -248 72 -1 -62 169 -79 22 201 12 -73 189 -158 113 -166 252 -95
2756 -95 257 -170 70 260 103 192 236 369 -184 -80 -196 114 75 163 112 -70 217 31 -317 13 -198 57
2778 57 -37 -335 59 55 2 -314 55 21 5 -215 99 185 -147 -19 136 72 -243 104 -311 -70 94 -129 -101
2801 -101 -72 -109 80 168 131 9 110 91 -194 21 -121 -86 196 130 117 154 -144 -136 -117 -63 -205 81 -186 -50
2825 -50 -38 45 -86 205 497 11 22 -22 -76 121 72 92 249 135 -145 31 -120 -239 419 -100 142 189 -47
$$ packed form
2663B89n59P2J06K47l07NK77k03J12k9J82j10J81k2k67j08J18j16JJ47J93k15
2685fj24K44j24n2M94m81K0n6M9J43n9R1r2R8m65L61Ql65N37k29RK39k99J77j13
2710Epj38q3J59J7M33j85l84r7K31l22L99m7k39K14j77j50N61n25K68Kl5j10L25
2734A15k8l92R3K04M9p4k15L20p3o1K31k48J01J79j89q5K62l47K71k79M18l47
2756i5L52m27K40J90j57Q9M4J33n53J04j16L10l9Q8n1j82K87j86l48L30k11K55
2778E7r4k98L94mn3l16L69l4j6k20L14Q6l32J28J55o4l15L47m15K41J64k23K8
2801a01K9l7J89Q8l7j22J01j9k85K15j42L5K82o6j3L7k98QJ9N4j42K86k67J36
2825e0J2Q3j31K91K92m86J1m4n4J97m9K0J57j14k80J76j51j19O58n19K42M7k36
$$ plain form
2848 -47 -180 118 -398 -110 -67 328 35 81 39 -82 20 -286 449 -129 -56 170 -52 -82 80 194 55 262
2870 262 -191 127 -30 202 246 -142 285 109 -29 -107 -38 108 149 84 332 -301 25 -141 -9 -118 25 135
2892 135 -132 -276 -129 19 -240 -101 -259 144 295 75 -2 36 130 13 -80 68 -160 59 35 -190 -71 -101
2914 -101 186 -216 -54 4 -25 -90 -69 163 -44 188 -177 11 70 165 53 -233 168 48 111 -67 262 159
2936 159 122 218 -33 52 -213 262 307 109 225 -97 46 240 10 61 -249 -119 -23 -35 -161 51 167 -46
2958 -46 -76 64 44 -47 225 14 -92 -80 -158 -133 150 -28 -240 10 132 149 253 -199 159 -218 404 144 36
2981 36 -62 -120 78 168 -143 68 -49 43 116 -147 151 -83 225 -107 -43 223 -92 246 -135 275 144 -78
3003 -78 17 93 239 -198 -307 -83 107 327 197 125 -63 -132 208 88 131 -107 222 -88 88 -116 9 -30
$$ packed form
2848d7j33K98n16K88M3L95k93M6m2j21J02l06P35n78P3K26k22l0J62J14j39K07
2870B62m53L18j57K32M4l88M27j76j38p8O9J46M1o5K48o33L26j66J32j09J43J10
2892A35k67j44J47J48k59J39j58M03J51k20p7L8R4j17r3J48k28K19k4k25J19l0
2914a01K87m02J62N8k9o5K1K32k07K32l65J88N9R5j12k86M01j20O3j78L29j03
2936A59l7R6k51Q5k65M75M5j98J16l22J43J94k30N1l10J30R6j2j26K12J16k13
2958d6l0J40k0r1K72k11j06J2p8K5K83j78k12K50J22J7J04m52L58l77O22k60j08
2981C6r8n8J98R0l11K11j17R2P3k63K98k34L08l32O4K66l15L38l81M10j31k22
3003g8R5P6J46m37j09K24J90K20j30p2j88o9L40j20M3k38L29l10J76k04J25l9
$$ plain form
3025 -30 70 192 193 3 128 155 -356 184 75 -134 -246 76 334 160 -148 38 -256 160 -170 -186 -34 153
3047 153 -201 -136 146 -160 -4 -194 -37 -117 -194 -72 -11 -219 -12 151 -101 83 145 -215 -366 266 -109 -328
3069 -328 174 -39 226 -249 134 19 74 -41 -118 -141 -8 -18 30 177 207 45 155 4 89 -26 -45 12 -79
3092 -79 120 36 180 -40 -381 -226 -251 -225 -207 271 177 -255 -237 111 60 79 271 -112 348 -106 -166 242 259 -20
3116 -20 241 98 -228 -130 62 -82 43 2 -252 57 69 117 47 179 -61 37 198 -274 -38 -18 183 -47 -123
3139 -123 -26 117 235 151 -180 -322 -197 263 -53 1 -230 -134 210 159 80 -81 -96 -304 63 239 33 -145
3161 -145 248 133 153 36 -375 -209 229 170 20 34 -8 146 -209 -11 5 140 44 140 120 -408 -21 -142 58
3184 58 55 258 90 99 -173 -52 38 222 -425 -333 156 122 -127 174 -147 -90 232 -40 196 -105 7 -78 283
$$ packed form
3025c0J00J22Jj90J25K7n11N40j09k09j12L22K58j74l08J86k94M16l30j6J52J87
3047A53l54O5K82l06J56j90J57q0p7J22O1k08K07J63k52J84O2l60j51O32l75k19
3069c28N02k13K65m75L83j15N5j15p7k3J33j0M8J47L0j62J10j51Q5j15j9N7r1
3092g9J99q4J44k20l41J55k5K6J8M78r4m32J8L48n1J9J92l83M60m54o0M08J7k79
3116b0K61j43l26R8J92j44J25m1k54L09J2M8p0J32k40R8J61m72K36K0K01k30p6
3139a23R7J43J18q4l31j42J25M60l16N4k31R6L44n1p9j61j5k08L67J76k06j78
3161a45L93j15K0j17m11J66M38n9j50J4m2J54l55J98J6J35r6R6k0n28L87j21K00
3184E8lK03j68Rk72J21R0J84o47R2M89l4k49L01l21N7L22k72K36l01J12q5L61
$$ plain form
3207 283 -34 -78 38 -113 -53 -173 -228 260 91 -220 -7 238 60 -120 -325 215 84 279 -119 -43 29 117
3229 117 39 -28 181 -201 218 97 111 -88 152 -112 -205 -38 6 134 -309 217 265 34 -160 -117 -148 -28 39
3252 39 46 -163 83 102 159 -140 -163 150 271 -180 -9 -74 172 -15 202 -103 -69 -120 -5 74 -49 -516 -227
3275 -227 262 94 230 -28 111 -39 333 -15 108 -51 -255 -47 -103 256 212 -113 -272 -55 201 -79 -328
3296 -328 72 168 136 285 -249 166 26 8 12 -278 -178 -272 216 -81 -107 11 -21 -149 260 116 205 -64 6
3319 6 108 87 171 -46 175 -12 -70 -32 -87 -94 100 24 -167 85 111 57 218 205 -211 149 16 -49 29 54 -48
3344 -48 -130 -404 40 14 -48 225 179 -32 57 147 198 81 35 -113 111 136 -137 -107 27 144 -6 125 122 20
3368 20 -290 198 319 -304 -78 -227 -48 -65 -267 -316 -100 93 -311 21 257 155 -49 -380 -124 179 99
$$ packed form
3207B83l17m4J16j51O0j20n5M88j69l11K13K45j78j80k05N40j31J95l98P6P2Q8
3229A17p8o7K09l82M19j21J4j99K40k64r3J67M4J28m43N26M8k31j94M3l1J20O7
3252C9Pk09K46J9N7k99k3L13J21m51J71o5K46j87K17l05L4n1J15P9j23m67K89
3275b27M89j68J36k58J39j50L72l48J23j59k04K08n6L59m4l25j59K17K56k80k49
3296c28M00R6l2J49n34M15j40j8Mk90J00r4M88k97k6J18l2j28M09j44Q9k69P0
3319FJ02k1Q4k17K21j87n8L8n5pJ94p6j91K52K6n4J61j3m16L60j33o5P8K5j02
3344d8q2k74M44k6o2K73m6k11Q9R0N1j17m6j48K24K5k73L0J34J17j50J31lj02
3368B0l10M88J21o23K26j49J79j7k02m9K16J93m04L32K36j02k04l31K56L03q0
$$ plain form
3389 99 101 -96 -4 153 58 94 18 -66 119 159 -184 38 -92 13 256 4 329 -20 -130 -80 -143 282 -128 276
3413 276 168 -65 60 238 46 157 79 150 27 120 128 53 294 -45 206 -86 77 -240 -26 64 71 -249 37
3436 37 -99 144 -66 -199 -158 265 169 217 -165 -88 -160 175 141 36 -249 125 -152 29 -80 -49 321 59 -80
3459 -80 -116 -71 -161 284 -277 102 -193 134 107 59 235 559 96 -273 28 -13 -25 75 233 209 -197 -232 -78
3482 -78 -9 264 22 80 280 352 -34 -185 -65 157 -88 80 37 -277 -156 -8 -285 51 166 -74 -74 -30 -201
3505 -201 -124 125 242 -35 51 -161 -309 -149 -38 297 -110 60 -69 -32 -41 -364 352 64 149 401 -32 -126
3527 -126 -290 179 61 201 49 174 26 101 -120 155 285 -201 -199 27 -44 -80 199 326 43 -287 -168 -71
3549 -71 94 47 111 5 -215 -45 95 -6 284 78 10 -56 160 -135 -302 -54 110 -65 -175 -40 -322 107
$$ packed form
3389I9Kj97R2J57r5L6p6q4J85M0l43K22j30J05K43k52L25l49j10N0o3M25m10M04
3413B76j08k33J25J78j92J11p8P1j23R3Qp5K41l39K51k92J63l17K14R0Pl20K86
3436C7j36K43k10j33M1M23r6M8l82P7p2L35l4j05k85L74k77J81j09L1L70k62j39
3459h0l6M5r0M45n61L79k95L27k7m8J76L24m63l69L01m1j2J00J58k4m06l5J54
3482g8O9K73k42N8K00P2l86j51J20K22k45J68m3l14J21J48k77L36J15k40%M4j71
3505b01P7K49J17k77Q6k12j48J60J11L35m07J70j29L7rl23P16k88Q5K52m33r4
3527a26j64M69j18J40j52J25j48P5k21K75J30m86KK26p1l6K79J27k83l30J19R7
3549g1J65m7O4j06k20J70J40j01K90k06o8o6K16k95j67K48J64j75j10J35k82M29
$$ plain form
3571 107 -9 282 -60 172 -27 -308 -169 20 229 55 -72 36 270 280 202 -35 -296 159 -79 -83 129
3592 129 -78 -226 -92 96 -36 -54 -64 86 -82 165 -9 -187 87 219 20 311 307 -26 -206 159 -154
3613 -154 71 -24 288 56 121 14 59 -74 -78 -123 -71 173 33 55 75 -218 -36 318 141 245 177 -280 1
3636 1 37 66 -1 -180 -3 123 117 -312 116 -5 209 116 -66 -168 89 183 55 -136 314 -152 86 41 127 -270
3660 -270 42 -155 39 142 118 -218 6 -133 26 267 76 -85 40 -78 -157 -117 87 46 -160 157 139 39
3682 39 111 111 126 -35 90 -176 -26 -97 76 181 33 89 -4 46 37 12 -151 -80 53 210 -328 -298 89 237 257
3707 257 -50 89 -59 40 85 -280 -47 168 123 283 -351 -324 311 -50 62 -132 -166 -288 -53 -136 -58 110
3729 110 44 -15 172 -163 -80 280 -273 239 -267 -41 -107 -80 -83 -7 2 -143 -76 -66 40 -270 476 -124 -34 184
$$ packed form
3571A07j16K91l42K32j99k81J39J89K09j74j27J08K34J0p8k37k61M55k38mK12
3592A29k07j48J34J88j32j8j0J50j68K47j74j78K74J32j99K91ml33j80L65l13
3613a54K25r5L12k32O5j07M5j33mm5N2K44j40K2K0k93J82L54j77J04o8m57K81
3636AL6K9o7j79J77J26om29M28j21K14r3j82j02K57R4j28j91M50m66K38m5Q6l97
3660b70L12j97J94J03k4l36K24j39J59K41j91j61J25j18p9M0K04m1k06L17j8j00
3682C9P2%J5j61J25k66J50p1J73J05j48N6r3N0rk5j63P1J33J57n38L0L87J48K0
3707B57l07J39j48R9M5l65K33K15m5J60o34K7O35l61J12j94l4j22K35q3P8J68
3729A10o6n9J87l35Q3L60n53N12n06K26o6K7lP6Rj45O7J0J06l10P46o00R0K18
$$ plain form
3753 184 6 -93 24 10 56 29 -29 115 -129 153 -100 25 -42 -4 37 -97 200 -159 163 122 61 37 -176 -61
3777 -61 -111 262 18 -37 -18 188 26 -3 -1 34 -161 -374 42 285 166 25 -186 100 -101 468 -130 -91 -199
3800 -199 -185 90 -307 -7 34 -256 181 -173 -148 216 -46 -69 -93 -61 -84 -14 -117 -185 204 -302 -59 4 208
3823 208 91 65 72 221 -50 -232 -397 274 -25 -120 -187 -74 -2 91 21 -72 -33 191 328 -115 22 302 -227
$$ packed form
3753A84j78r9J17j4M6k7n8J44k44K82k53J25o7L8M1j34K97l59L22m1o1k4k13J15
3777f1n0L73k44n5J9K06j62k9KL5j95k13M16K43j19j41k11K86k01N69n98L9j08
3800a99J4K75l97L00M1k90M37l54K5L64k62k3k4L2k3P0j03o8L89n06K43O3K04
3823B08j17k6PJ49k71j82j65O71k99r5o7J13P2R3p0r3L9K24J37m43J37K80n29
$$ [...]
8191F5
##END NTUPLES=NMR FID
##END=
