##TITLE=1H_DE-73_oil
 D2O
 8 sc, 
 5.11.2024
##JCAMPDX= 6.0         $$ Bruker NMR JCAMP-DX V2.0
##DATA TYPE= NMR FID
##DATA CLASS= NTUPLES
##ORIGIN= UXNMR, Bruker Analytische Messtechnik GmbH
##OWNER= root
$$ XWIN-NMR		Version 3.5
$$ Tue Nov  5 15:39:26 2024 Russian Standard Time (UT+4h)  she@DPX200
##.OBSERVE FREQUENCY= 200.1318
##.OBSERVE NUCLEUS= ^1H
##.DELAY= (6, 6)
##.ACQUISITION MODE= SIMULTANEOUS
##.ACQUISITION SCHEME= undefined
##.AVERAGES= 8
##.DIGITISER RES= 18
##SPECTROMETER/DATA SYSTEM= spect
##.PULSE SEQUENCE= zg30
##.SOLVENT NAME= CDCl3
##.SHIFT REFERENCE= (INTERNAL, CDCl3, 0, 15.7039)
##AUDIT TRAIL= $$ (NUMBER, WHEN, WHO, WHERE, WHAT)
$$ ##TITLE= Audit trail, XWIN-NMR		Version 3.5
$$ ##JCAMPDX= 5.01
$$ ##ORIGIN= Bruker BioSpin GmbH
$$ ##OWNER= she
$$ F:/spectra/data/she/nmr/H-F/1/audita.txt
$$ ##AUDIT TRAIL=  $$ (NUMBER, WHEN, WHO, WHERE, WHAT)
(   1,<2024-11-05 15:38:32.23 +0400>,<she>,<DPX200>,
      <created by zg, POWCHK disabled, PULCHK disabled
       configuration hash MD5:
       00 E9 B6 7A A2 85 ED C7 34 08 36 98 17 FE 4E 26
       data hash MD5: 16K
       94 3F B4 61 6D B8 F8 B5 A9 0A 14 A5 EF CC 59 11>)
$$ ##END=
$$ 
$$ hash MD5
$$ 64 49 ED 1D C0 14 E3 33 6A 7F 7B F7 4E 3D 79 5B
##$RELAX= 
##$RELAX= 
##$RELAX= 
##$RELAX= 
##$RELAX= 
##$RELAX= 
$$ Bruker specific parameters
$$ --------------------------
##$DU= <F:/spectra>
##$EXPNO= 1
##$NAME= <H-F>
##$PROCNO= 1
##$TYPE= <nmr>
##$USER= <she>
##$AMP= (0..31)
100 100 100 100 100 100 100 100 100 100 100 100 100 100 100 100 100 100 
100 100 100 100 100 100 100 100 100 100 100 100 100 100 
##$AQSEQ= 0
##$AQ_mod= 1
##$AUNM= <au_zg>
##$AUTOPOS= <>
##$BF1= 200.13
##$BF2= 200.13
##$BF3= 200.13
##$BF4= 200.13
##$BF5= 200.13
##$BF6= 200.13
##$BF7= 200.13
##$BF8= 200.13
##$BYTORDA= 1
##$CFDGTYP= 0
##$CFRGTYP= 5
##$CHEMSTR= <none>
##$CNST= (0..31)
1 1 145 1 1 1 1 1 1 1 1 1 1 1 1 1 1 1 1 1 1 1 1 1 1 1 1 1 1 1 1 1 
##$CPDPRG= <>
##$CPDPRG1= <>
##$CPDPRG2= <>
##$CPDPRG3= <>
##$CPDPRG4= <mlev>
##$CPDPRG5= <mlev>
##$CPDPRG6= <mlev>
##$CPDPRG7= <mlev>
##$CPDPRG8= <mlev>
##$CPDPRGB= <>
##$CPDPRGT= <>
##$D= (0..31)
0 1.2 0 0 0 0 0 0 0 0.06 0 0.03 0 0 0 0 0.0002 0 0 0 0 0 0 0 0 0 0 0 0 
0 0 0 
##$DATE= 1730806711
##$DBL= (0..7)
120 120 120 120 120 120 120 120 
##$DBP= (0..7)
150 150 150 150 150 150 150 150 
##$DBP07= 0
##$DBPNAM0= <>
##$DBPNAM1= <>
##$DBPNAM2= <>
##$DBPNAM3= <>
##$DBPNAM4= <>
##$DBPNAM5= <>
##$DBPNAM6= <>
##$DBPNAM7= <>
##$DBPOAL= (0..7)
0.5 0.5 0.5 0.5 0.5 0.5 0.5 0.5 
##$DBPOFFS= (0..7)
0 0 0 0 0 0 0 0 
##$DE= 6
##$DECBNUC= <off>
##$DECIM= 24
##$DECNUC= <off>
##$DECSTAT= 4
##$DIGMOD= 1
##$DIGTYP= 9
##$DL= (0..7)
0 120 120 120 120 120 120 120 
##$DP= (0..7)
150 150 150 150 150 150 150 150 
##$DP07= 0
##$DPNAME0= <>
##$DPNAME1= <>
##$DPNAME2= <>
##$DPNAME3= <>
##$DPNAME4= <>
##$DPNAME5= <>
##$DPNAME6= <>
##$DPNAME7= <>
##$DPOAL= (0..7)
0.5 0.5 0.5 0.5 0.5 0.5 0.5 0.5 
##$DPOFFS= (0..7)
0 0 0 0 0 0 0 0 
##$DQDMODE= 0
##$DR= 18
##$DS= 0
##$DSLIST= <SSSSSSSSSSSSSSS>
$$ [...]
##$SUBNAM2= <"">
##$SUBNAM3= <"">
##$SUBNAM4= <"">
##$SUBNAM5= <"">
##$SUBNAM6= <"">
##$SUBNAM7= <"">
##$SUBNAM8= <"">
##$SUBNAM9= <"">
##$SW= 24.0689170037331
##$SWIBOX= (0..15)
0 0 2 0 0 0 0 0 0 0 0 0 0 0 0 0 
##$SW_h= 4816.95568400771
##$TD= 16384
##$TD0= 1
##$TE= 0
##$TE2= 300
##$TE3= 300
##$TEG= 300
##$TL= (0..7)
0 120 120 120 120 120 120 120 
##$TP= (0..7)
150 150 150 150 150 150 150 150 
##$TP07= 0
##$TPNAME0= <>
##$TPNAME1= <>
##$TPNAME2= <>
##$TPNAME3= <>
##$TPNAME4= <>
##$TPNAME5= <>
##$TPNAME6= <>
##$TPNAME7= <>
##$TPOAL= (0..7)
0.5 0.5 0.5 0.5 0.5 0.5 0.5 0.5 
##$TPOFFS= (0..7)
0 0 0 0 0 0 0 0 
##$TUNHIN= 0
##$TUNHOUT= 0
##$TUNXOUT= 0
##$USERA1= <user>
##$USERA2= <user>
##$USERA3= <user>
##$USERA4= <user>
##$USERA5= <user>
##$V9= 5
##$VALIST= <valist>
##$VCLIST= <CCCCCCCCCCCCCCC>
##$VD= 0
##$VDLIST= <DDDDDDDDDDDDDDD>
##$VPLIST= <PPPPPPPPPPPPPPP>
##$VTLIST= <TTTTTTTTTTTTTTT>
##$WBST= 1024
##$WBSW= 4
##$XGAIN= (0..3)
0 0 0 0 
##$XL= 0
##$YL= 0
##$YMAX_a= 11732
##$YMIN_a= -12020
##$ZGOPTNS= <>
##$ZL1= 120
##$ZL2= 120
##$ZL3= 120
##$ZL4= 120
##$ABSF1= 10
##$ABSF2= 0
##$ABSG= 5
##$ABSL= 3
##$ALPHA= 0
##$AQORDER= 0
##$ASSFAC= 0
##$ASSFACI= 0
##$ASSFACX= 0
##$ASSWID= 0
##$AUNMP= <proc_1d>
##$AZFE= 0.1
##$AZFW= 0.1
##$BCFW= 1
##$BC_mod= 2
##$BYTORDP= 1
##$COROFFS= 0
##$CY= 11.3945322036743
##$DATMOD= 1
##$DC= 2
##$DFILT= <>
##$DTYPP= 0
##$F1P= 15.6554695791079
##$F2P= 12.8336369535428
##$FCOR= 0.5
##$FTSIZE= 0
##$FT_mod= 4
##$GAMMA= 1
##$GB= 0.15
##$INTBC= 1
##$INTSCL= 1
##$ISEN= 128
##$LB= 0.24
##$LEV0= 0
##$LPBIN= 0
##$MAXI= 10000
##$MC2= 0
##$MEAN= 0
##$ME_mod= 0
##$MI= 1.114404
##$NCOEF= 0
##$NC_proc= 0
##$NLEV= 6
##$NOISF1= 3.799351
##$NOISF2= 2.8
##$NSP= 1
##$NTH_PI= 0
##$NZP= 0
##$OFFSET= 15.70392
##$PC= 1
##$PHC0= -26629.37
##$PHC1= 19.18744
##$PH_mod= 1
##$PKNL= yes
##$PPARMOD= 0
##$PSCAL= 0
##$PSIGN= 0
##$REVERSE= no
##$SF= 200.130013532006
##$SI= 16384
##$SIGF1= 3
##$SIGF2= 2
##$SINO= 400
##$SIOLD= 16384
##$SREGLST= <1H.CDCl3>
##$SSB= 0
##$STSI= 0
##$STSR= 0
##$SW_p= 3612.71676300578
##$SYMM= 0
##$S_DEV= 0
##$TDeff= 0
##$TDoff= 0
##$TI= <>
##$TILT= no
##$TM1= 0
##$TM2= 0
##$TOPLEV= 0
##$USERP1= <user>
##$USERP2= <user>
##$USERP3= <user>
##$USERP4= <user>
##$USERP5= <user>
##$WDW= 1
##$XDIM= 8192
##$YMAX_p= 0
##$YMIN_p= 0
$$ End of Bruker specific parameters
$$ ---------------------------------
##NTUPLES= NMR FID
##VAR_NAME=  TIME,          FID/REAL,        FID/IMAG
##SYMBOL=    X,             R,               I
##VAR_TYPE=  INDEPENDENT,   DEPENDENT,       DEPENDENT
##VAR_FORM=  AFFN,          ASDF,            ASDF
##VAR_DIM=   8192,          8192,            8192
##UNITS=     SECONDS,       ARBITRARY UNITS, ARBITRARY UNITS
##FACTOR=    0.0002076,     1,               1
##FIRST=     0,             0,               0
##LAST=      1.7004516,     0,               0
##MIN=       0,             -12020,          0
##MAX=       1.7004516,     11732,           0
$$ Real data points
##PAGE= N=1
##DATA TABLE= (X++(R..R)), XYDATA
0 0 0 0 0 0 0 0 0 0 0 0 0 0 0 0 0 0 0 0 -7 7 -7 7 -7 7 -7 12 -14 14 -14 19 -21 21 -26 28 -33 35 -40 41 -48 53 -57
41 -57 64 -71 80 -88 96 -109 122 -134 152 -170 195 -224 261 -308 374 -472 628 -928 1680 -7387
61 -7387 -12020 7169 8836 4824 -2105 -9826 -7630 7708 11732 444 -8567 -6395 -607 6727 8050
76 8050 -720 -9503 -6031 4178 8235 3158 -3302 -7625 -4521 6058 9198 -132 -7027 -5610 -199
91 -199 6450 7526 -2164 -9678 -3613 5200 6322 2648 -4055 -8036 -1515 7372 6216 -1795 -6477 -4051
107 -4051 1919 6050 4056 -3143 -7061 -2086 5018 5418 273 -4104 -4988 -679 5864 5039 -2428 -5566
123 -5566 -2674 2046 5465 2951 -3869 -5785 -585 4459 4340 17 -4594 -4324 1344 5346 2867 -2585
139 -2585 -4804 -1639 2924 4265 1381 -3639 -4635 453 4442 2747 -982 -3491 -3066 1269 4932 1939
155 1939 -3253 -3618 -571 2474 3706 633 -3841 -3369 1139 3745 2110 -1445 -3443 -1875 2020 3768
171 3768 921 -2903 -3032 69 2689 2621 -150 -3220 -2491 1564 3198 1105 -1416 -2772 -1421 2193
187 2193 3220 33 -2719 -2070 300 2364 2241 -749 -3100 -1473 1724 2618 701 -1741 -2332 -479
203 -479 2120 2379 -371 -2538 -1495 859 2066 1359 -936 -2485 -950 1824 2036 120 -1509 -1871
219 -1871 -162 2109 1755 -742 -2056 -1050 905 1902 944 -1226 -2068 -325 1683 1620 -144 -1631 -1370
236 -1370 314 1812 1268 -955 -1832 -506 1048 1481 526 -1246 -1670 43 1609 1116 -427 -1352 -1046
253 -1046 503 1650 744 -1050 -1423 -265 1038 1258 140 -1234 -1253 320 1447 806 -593 -1238 -668
270 -668 697 1398 405 -1089 -1168 75 1015 949 -66 -1200 -926 535 1239 465 -632 -1044 -404 777
288 777 1152 108 -1049 -854 188 965 745 -314 -1079 -634 594 1081 243 -717 -870 -169 766 916 -101
307 -101 -979 -643 336 825 494 -389 -940 -368 698 845 61 -692 -696 5 757 690 -250 -873 -426 409 743
328 743 313 -471 -792 -166 676 688 -79 -634 -499 120 695 502 -359 -759 -249 467 600 157 -508 -631 -28
349 -28 675 506 -212 -591 -379 217 622 304 -420 -646 -105 483 483 29 -498 -517 125 596 335 -277 -522 -231
371 -231 299 556 168 -422 -523 27 466 397 -68 -478 -378 206 556 215 -309 -445 -115 338 466 31 -443
392 -443 -386 118 425 259 -164 -441 -244 254 458 82 -329 -372 -34 359 362 -57 -425 -266 174 368 175 -206
414 -206 -392 -144 282 365 4 -314 -282 37 325 270 -122 -386 -178 196 331 102 -227 -327 -33 305 285 -51
436 -51 -282 -217 91 309 200 -157 -319 -100 226 261 64 -218 -272 25 301 206 -85 -275 -162 118 279 125
458 125 -181 -269 -40 224 220 -10 -216 -200 52 259 129 -146 -237 -87 144 197 54 -215 -221 22 227 144 -52
481 -52 -191 -140 106 225 86 -146 -208 -34 169 193 18 -189 -154 70 188 81 -76 -179 -72 144 194 39
503 39 -151 -165 13 148 136 -28 -166 -108 78 182 65 -85 -151 -39 127 154 7 -160 -108 39 143 86 -77
526 -77 -175 -59 104 139 11 -107 -130 -15 139 116 -47 -155 -68 55 129 59 -69 -161 -14 107 107 -1 -105 -96 15
551 15 128 90 -81 -128 -42 58 81 34 -93 -126 8 117 71 -41 -105 -66 51 129 45 -77 -102 -19 88 98 -8
576 -8 -93 -97 34 93 29 -39 -105 -60 52 99 20 -90 -74 21 76 62 -29 -101 -69 42 78 29 -56 -73 -16 54 52 27 -92 -61
606 -61 39 78 36 -30 -85 -45 45 66 17 -65 -52 2 53 97 -16 -70 -20 32 84 42 -46 -80 -1 61 74 15 -59 -70 18 68
636 68 47 -34 -78 -7 46 48 25 -31 -68 1 42 52 -28 -83 -37 2 71 39 -42 -73 -8 37 60 4 -47 -80 35 60 57 -25 -69
667 -69 -25 38 72 26 -39 -55 -7 43 47 -12 -34 -62 17 74 48 -31 -46 -32 36 84 18 -62 -28 0 43 26 -8 -75 -46 24 53
698 53 26 -34 -77 -27 44 49 -25 -58 -39 10 42 20 -31 -60 -42 33 73 20 -24 -42 -3 30 27 9 -50 -17 19 40 38 -27 -35 -22 17
731 17 32 18 -24 -36 7 52 32 -6 -54 -21 25 53 21 -21 -44 -3 66 32 -6 -45 -35 2 38 18 -31 -16 -2 16 56 7 -35
762 -35 -12 16 25 35 -16 -22 -32 3 38 27 -16 -54 1 38 20 23 -19 -30 7 25 33 -1 -31 -3 15 45 11 -33 -27 8 46 30 -3
795 -3 -18 -12 21 35 16 -9 -5 13 21 28 19 -15 -45 5 30 36 -1 -28 -23 27 21 23 -7 -25 -10 6 28 -6 4 -31 9 30 21 -12 -37 -16
831 -16 19 27 -4 -21 -28 -2 18 15 2 -21 -26 5 31 6 -15 -17 2 18 2 3 -13 -27 20 12 6 -2 -40 -27 7 28 20 -1 -7 2 20 19 -9
868 -9 -27 1 10 17 7 2 -5 -5 7 10 -6 -17 -31 -17 21 14 1 -16 11 38 25 14 4 -34 8 18 32 -25 -22 -1 -3 34 -3 -12 -7 8 23
905 23 22 -2 -23 -28 -5 42 11 0 -34 -25 25 41 23 7 -15 1 -5 26 -1 -33 -18 3 22 20 -28 -41 -18 11 14 1 -32 -16 14 21
939 21 27 -1 -19 -30 17 34 0 -6 -18 0 22 27 -13 -37 -16 11 14 2 -2 -21 0 18 10 11 -12 -23 5 39 14 -9 -15 -21 12 16 4 -19
975 -19 -15 -2 15 -2 -17 -9 12 7 20 17 -11 -37 -7 23 6 3 -33 -11 17 20 13 -3 -5 -13 9 22 6 -4 -5 15 25 18 1 -21 0 11
1011 11 13 23 -5 -29 -3 12 11 -7 -19 -12 -1 19 4 0 -25 -15 19 3 14 5 -7 -7 14 15 -20 -7 -6 6 -1 -1 -25 -20 -21 7 9 -4 -13
1048 -13 6 -2 9 17 -19 -7 24 5 -12 -5 -22 -5 -18 3 32 -2 -13 -11 3 5 -1 -11 3 1 17 -4 1 -22 -15 7 -1 4 11 -38 -18 -4
1084 -4 10 6 6 -6 8 27 19 7 -32 -11 21 23 9 -22 -10 -13 24 0 -2 -14 -21 -10 12 12 1 -9 11 -13 -3 -4 -15 -7 -1 -12 15 -7
1120 -7 -19 5 10 26 -4 -7 -7 23 7 3 -24 10 -4 2 -1 -10 -25 -7 -28 0 -5 2 2 -21 9 1 6 -15 -18 -33 -13 6 -10 -16 10 5 -12 16
1158 16 -10 -5 6 8 4 -14 6 -4 9 2 7 5 -9 -1 24 -15 0 -12 -16 7 8 20 22 -14 -7 15 10 29 -8 18 -12 -15 6 13 -13 -11 4 5
1196 5 2 9 2 10 3 -4 4 -5 -7 -4 -3 10 1 17 -1 4 15 -10 7 -2 2 31 9 -2 -7 -9 -1 8 -16 0 -10 4 -14 -3 13 -8 -10 -15 16 4 -13
1237 -13 2 -4 6 -1 -2 -12 -9 -17 -8 0 -34 -3 -15 -3 17 3 3 0 -2 6 -2 17 -5 -12 2 -7 -1 -22 -20 -5 -5 -15 0 0 -5 -5 21 12 -16 -6 -11
1278 -11 -24 8 15 10 -2 4 2 15 6 20 5 -4 14 3 -13 -8 -12 3 3 15 -14 -11 -3 -3 10 -14 -14 -2 0 16 6 -12 -9 -16 -26 1 -7 -18 11
1317 11 -8 -2 4 -9 10 -5 13 -7 -14 -10 -19 -6 -6 14 -1 2 -13 18 0 14 11 16 15 -7 20 16 -21 4 7 15 -9 -15 4 4 19 -14 7 10
1355 10 -18 21 1 3 23 1 -13 6 3 -11 -4 14 2 7 -1 4 -13 1 6 3 12 0 -8 -12 -23 7 -6 -14 3 9 21 -21 -7 18 -1 -7 -4 -6
1393 -6 10 -7 5 14 23 13 -7 1 7 2 14 -6 -11 1 5 7 6 -15 14 9 -8 7 -7 4 0 16 -5 6 10 -4 1 -24 -15 -19 -14 -8 -10 -6 -14 -19 -12 -5
1435 -5 -7 -12 20 5 -8 -2 10 3 3 -13 -2 -12 3 25 -17 15 18 -2 5 3 -5 9 -1 10 4 -4 -6 14 5 -2 11 7 12 -13 17 25 4 -12 8
1474 8 -7 -14 -1 13 -7 -7 5 -22 -15 -21 2 10 4 -21 2 13 -1 -2 12 5 11 18 2 -10 19 5 7 0 -1 6 -20 10 6 18 3 -20 -8 -9 -16
1513 -16 -14 -10 -1 19 2 1 -6 1 -5 6 -8 7 13 6 4 13 -8 -9 -12 -11 10 -10 13 -14 -13 12 -4 -9 10 17 3 -3 -8 -1 -29 -2 -12 -5 11 -14 -7
1554 -7 -8 1 -5 -3 -5 9 -3 -11 -2 2 28 1 4 -14 -17 11 15 14 -14 2 4 -4 -11 7 -6 11 4 -1 9 -2 2 8 -4 -6 8 0 8 -12 12 4 8 -5 7
1597 7 -1 5 -6 4 -7 -9 -10 9 -3 -3 -6 4 10 2 4 10 5 0 6 8 -1 4 -7 -9 -10 8 9 -4 7 -1 15 7 -21 15 19 -3 -16 13 12 -3 5 18 -18
1640 -18 -2 -3 -8 -9 8 -14 -18 14 -10 2 -13 8 0 28 -15 -2 -11 12 -16 -1 9 9 11 -20 0 -4 12 -18 19 -11 -19 -3 12 20 7 -15
1676 -15 -17 -7 -10 5 -1 -3 12 12 1 9 -1 5 -7 11 15 -6 0 8 12 11 1 -3 18 3 2 -14 -1 -15 -1 -4 -1 -11 9 0 11 15 -8 -9 2 20
1716 20 -6 8 20 7 -2 -1 11 9 16 0 3 1 10 -1 2 -24 -21 0 25 -2 -9 -1 10 -4 11 22 9 11 6 -15 -3 10 4 -17 7 10 -4 -2
1754 -2 -10 4 -13 -9 -3 2 5 -2 14 17 -10 -13 -7 5 -2 -17 0 -15 4 29 -4 -16 -10 -5 -11 2 6 -5 -25 9 2 6 -25 7 5 -15 18 -1 -9 5
1794 5 -1 -1 8 9 -2 -15 4 2 8 -13 13 13 0 12 7 1 6 2 -1 -4 -33 -6 -7 7 6 -35 9 3 -9 -7 -4 1 0 1 2 14 3 -8 -1 6 -3 7 -13
1837 -13 15 -3 4 9 1 11 -8 -1 6 -3 -27 15 2 26 20 22 -10 5 -14 -3 16 10 4 -14 -1 -1 -16 -17 10 -15 17 20 5 5 20 8 7 -2
1875 -2 -2 -7 -25 -7 -6 9 3 -2 5 -6 11 -25 6 -12 16 -8 20 -1 -7 13 8 -27 -8 -9 -9 -12 6 -11 -10 -9 5 8 -10 15 -8 16 -2 -18
1913 -18 17 -17 12 13 -2 7 21 -16 -2 -9 -2 -17 11 18 -25 0 4 1 -16 -4 5 -1 -25 -14 -6 5 -7 -13 6 -8 -1 -14 0 -5 -4 6 -3 -5
1951 -5 10 21 -13 3 21 8 10 8 1 -3 -18 -16 2 0 8 7 5 -7 -2 14 11 14 6 -2 -4 -2 -17 5 12 -6 21 8 -38 -14 -6 -5 -9 -4 -15 1 7 -24
1993 -24 -4 -7 7 -8 -2 -12 -3 3 -4 -9 -28 -11 13 -24 5 3 -5 -8 9 6 10 18 4 6 2 5 7 -8 -29 11 2 -5 15 -13 -2 7 -8 2 0 -1 -5
2034 -5 -3 1 -12 -13 11 -2 8 3 -3 -15 1 9 -5 -19 19 5 -5 10 -2 10 -3 -16 7 -6 13 10 21 18 7 -3 -17 0 15 -10 -4
2069 -4 21 6 9 21 13 2 5 -12 1 -17 -10 6 7 -5 -11 5 -10 -1 -1 7 -3 -10 -7 -20 0 0 -12 17 -27 -6 -10 -16 9 5 -3 -18 7 -16 4
2108 4 -14 -6 -4 -14 -10 2 12 -5 2 -8 6 -8 12 18 -1 12 9 -8 3 -7 -3 7 4 5 11 2 -2 -2 -5 -10 -6 -2 -10 10 -1 -10 -8 -5 -2 -4 8 -21
2150 -21 -8 -9 -4 -4 4 -21 -3 -12 -7 -2 -12 -9 6 -4 -6 11 -3 -14 5 0 -6 -6 23 -10 -13 12 -10 -9 12 2 -10 20 -6 -16 8 4 -15 5
2188 5 -29 6 -10 -19 -29 3 -2 -11 0 3 -2 -6 7 12 -7 2 5 -11 -12 5 3 -2 -11 -1 3 -12 0 -17 -12 -10 11 -13 -9 -14 -12 5 -20 -8 -10 -3 17
2229 17 -3 3 -6 0 16 8 1 15 31 -9 -2 3 3 6 -5 5 -1 6 -11 -24 1 1 4 13 15 -15 -11 0 9 14 -2 -13 26 -2 12 20 4 15 18 -10
2269 -10 -10 -16 14 10 -5 -6 3 9 -6 21 2 6 -11 20 8 14 6 1 7 -2 14 -12 7 6 6 7 -4 0 -7 -17 3 -11 4 -5 12 16 6 22 -14 -1
2309 -1 9 -5 -16 -5 10 -11 5 15 -10 -5 8 -11 -10 10 -18 -15 -16 -11 -3 10 -15 -18 5 7 3 -1 5 -1 0 1 17 -16 15 8 20 6 -4 11
2347 11 13 11 6 14 11 19 -3 5 3 9 28 -3 -7 14 -2 -7 -4 9 3 -18 5 -5 3 4 8 2 -3 13 10 -6 9 0 -4 -6 -3 -18 17 -3 -2 -6 10 5 -14
2390 -14 -2 22 10 -13 -5 13 -10 0 1 -9 8 -10 -6 19 -16 -5 3 -11 -7 2 1 -9 4 -11 -4 -3 -6 -4 10 -10 -5 -3 -13 -3 5 -9 -12 7
2428 7 0 -9 0 0 0 6 0 -21 9 5 -16 -19 -17 -9 22 2 12 -8 -7 -3 -5 -19 3 8 3 -11 18 -1 -5 13 9 -3 1 5 13 -2 -9 5 12 1 2 18 14
2471 14 -15 -1 17 -11 9 5 -1 -2 -10 -4 -15 -2 -22 -5 -3 -1 -7 -9 2 17 -20 -6 -16 -6 9 6 2 11 12 14 -13 -16 -9 -13 -5 -2 -9 -14 17 9 11 14
2513 14 16 -7 -12 -11 4 6 1 5 4 1 -24 4 12 -3 -22 10 -12 5 -7 -1 6 0 -4 16 -16 11 -2 -2 -34 5 7 1 -9 -15 7 -14 7 4 7 9
2553 9 2 5 0 -11 0 18 0 6 -1 23 -2 -36 3 8 31 14 18 -22 -8 1 -3 -1 6 4 10 -1 4 20 6 -3 2 -11 -21 -8 -1 7 -6 -5 18 3
2593 3 2 -15 -3 -10 -10 -7 -4 5 -9 -6 -4 -11 -12 6 -2 -11 -9 -5 -4 -7 -1 -1 -13 -5 -8 9 9 8 0 -11 4 27 -3 14 4 0 23 3 1 8 -10 -3 6 10 13 10
2639 10 2 0 17 -7 -3 6 12 8 11 -8 9 -29 4 -14 -7 -17 -5 8 -17 0 -7 -8 2 -5 20 11 -8 0 -8 8 -18 1 -10 -9 15 -14 -12 0
2677 0 8 -6 -4 -6 4 -2 3 0 -6 -8 9 3 -2 -4 -4 7 -1 3 6 14 -9 -4 13 2 -9 5 9 8 3 -6 21 -13 -9 -9 -3 -5 0 -7 1 -20 -8 8 -3 -4 -17
2722 -17 5 11 -11 8 1 7 12 -8 3 16 11 2 11 -2 -7 5 8 8 6 13 -12 15 -9 7 -6 2 -5 4 8 13 5 -4 12 3 0 -12 13 -11 0 1 6 -2
2764 -2 -4 12 0 -11 2 -8 5 -21 -10 -11 -12 -5 -26 -14 -5 0 -7 -19 -19 -14 -8 9 -4 -11 -7 4 -17 -13 6 -8 6 -15 2 -4 11 -5 14 2
2802 2 -8 -22 13 -4 -3 -2 -21 -4 4 14 -3 5 5 1 28 24 14 0 0 -15 26 -8 9 5 -6 -8 -11 11 -13 -13 3 4 -10 24 7 -7 -22
2839 -22 3 -6 -2 -12 10 -3 -8 0 4 -26 21 16 8 3 19 3 0 -2 7 30 14 18 24 1 11 -12 -13 5 -2 14 1 20 -4 11 -5 14 2 -15
2877 -15 1 0 -12 -4 -22 -17 -23 12 1 -31 -4 -14 -14 11 -7 -22 -12 -6 19 5 -5 4 13 -11 12 -3 -7 -8 -2 11 10 5 4 0 2 30 0 34
2915 34 -5 15 11 -7 -12 12 -4 -1 2 11 18 -8 -7 27 -9 -8 3 5 -3 0 1 13 1 -8 -4 -14 8 9 -1 -5 -25 4 -12 1 -21 -24 -1 3 -3 23
2955 23 -1 4 0 -5 9 -1 -1 -21 15 5 18 -1 14 2 -6 2 1 18 6 8 3 2 -2 5 19 7 5 0 -4 -1 15 9 8 15 6 -6 -2 12 1 -13 0
2996 0 -7 8 -11 -10 0 -6 2 -7 -3 -19 2 -7 -3 5 -5 1 14 2 -2 -7 -5 -1 5 6 18 20 15 12 15 -5 -3 9 14 1 2 15 3 -4 2 20 15 17 1 1 3
3041 3 6 -8 26 7 -1 -7 -21 4 11 6 1 -5 -3 -3 -11 -13 8 24 -1 7 -10 -10 -19 -14 20 -16 -3 -11 6 15 3 10 -3 -5 2 16 12 5 7 9 8 3 15 -4
3085 -4 16 7 0 39 10 5 -2 16 -3 2 13 -2 -16 0 4 21 13 -4 20 -18 7 -10 -5 -6 -9 6 4 -5 1 -10 7 20 -3 1 -13 8 -6 -1
3123 -1 -17 -5 -5 13 5 0 35 3 11 8 -2 11 9 20 20 2 12 14 25 9 12 4 13 -6 -2 1 10 3 4 -1 -2 -18 -5 11 -3 3 4 4 -1 12 1 -7
3165 -7 -17 -2 -11 -20 -20 3 7 -9 1 13 10 -8 -14 -18 17 12 8 18 15 -1 5 -3 6 -10 -1 23 13 10 9 17 10 3 20 -6 5 8 3 22 -3 12 -1
3206 -1 4 25 0 21 5 3 -2 -20 -15 -2 2 11 -20 8 -8 3 5 3 -3 2 0 -11 -26 -4 4 -9 5 -23 10 -3 -24 -10 6 14 -31 -20 19
3243 19 -10 3 8 -7 24 21 9 2 -5 8 8 -9 6 8 5 -10 -7 -4 -16 -1 -15 11 5 -4 -19 -3 -13 -4 10 -16 -19 -4 -12 9 -7 18 12 -3
3281 -3 -1 10 -2 6 1 3 3 -4 -6 19 -3 5 -13 -5 1 12 9 -1 13 9 -4 2 -2 3 17 12 6 -2 11 22 3 18 -7 12 19 -8 5 -3 11 -7 -3
3322 -3 31 10 15 2 -2 14 -8 8 -11 -11 6 2 -11 16 -19 -6 3 5 10 -6 -4 2 3 -19 -3 -11 3 4 8 -6 15 -3 7 -1 0 15 -2 7 3
3361 3 11 2 -2 2 7 -1 10 8 -1 -10 4 9 25 7 -16 1 1 -8 -11 13 5 -7 -12 -14 7 -13 -6 -13 4 -13 5 -9 -3 4 -15 -5 6 -1 4 -12 -4 0 -18
3404 -18 -13 -3 0 -9 -3 8 3 3 13 5 -2 14 6 -7 19 2 -7 12 10 -12 15 4 -2 8 -6 -8 8 -7 0 -12 12 6 -16 -9 -4 -18 -4 16 -16
3443 -16 -3 -9 -12 -3 -32 -14 -7 -4 5 -16 6 -6 -14 -1 -16 -4 2 -10 4 9 8 13 6 15 16 -5 6 6 15 -2 4 2 1 6 -2 18 18 15 -13 14 20 -17
3485 -17 14 4 15 -23 7 -19 5 -13 -5 -5 9 -25 -6 -3 -12 -17 -9 -8 -16 3 1 -19 -7 -17 -15 3 -1 16 -10 -7 1 -15 4 1 10 -8 4 2
3523 2 -13 -16 -6 14 28 5 17 16 6 -3 4 -8 4 16 14 17 2 14 4 0 -10 -5 9 17 9 -9 -14 -3 -16 3 -20 -9 -24 -4 -11 -10 1
3560 1 -24 -15 -2 23 -18 -23 -12 16 3 -8 5 1 -3 -9 -2 0 -9 5 -1 26 0 6 -24 12 -6 6 20 3 6 -7 3 2 13 17 18 -6 -3 5 24
3599 24 -5 3 2 15 -3 -3 -16 0 1 -5 0 -13 3 13 -18 -7 16 -13 -13 -8 1 1 -10 -6 -12 -8 5 -27 8 -9 8 -12 -1 3 6 -6 11 -3
3637 -3 4 -9 1 13 -14 16 2 4 26 -7 0 5 3 -1 20 -3 3 5 -15 -2 -16 19 3 -19 -4 5 -6 -15 -11 2 3 -9 -9 -15 2 -17 -33 -10
3675 -10 1 -19 -1 -20 -24 -9 -2 -18 -11 5 4 -6 1 18 3 7 -19 16 12 -3 -7 -4 -1 7 14 -6 29 9 3 -13 -1 -6 -18 -6 11 7 -2 -5 15
3714 15 13 5 7 -1 -4 5 7 -13 13 -7 0 5 3 0 -20 -3 -6 -15 -11 2 4 -19 -18 -9 -3 1 -6 -20 -1 17 -7 5 -9 -3 -18 6 6 6 -22 16 12 -3
3756 -3 -4 -1 12 13 23 -5 -9 2 6 6 -16 3 8 0 -8 16 23 -2 -1 -1 15 7 9 -1 -3 3 -8 -26 1 9 11 -20 -16 -1 1 20 -16 -4 7 4 -16
3797 -16 -16 5 14 14 5 10 6 -2 0 -14 6 8 9 6 -2 7 1 -4 0 2 -10 8 -5 -8 5 5 0 0 1 -9 -12 -21 -22 -14 -5 2 -5 -13 -6 -18 -17 -18 2 0 7 16 12 -6 2
3846 2 -7 -16 1 -8 -15 13 -3 -10 4 -13 2 -5 -10 -12 12 6 13 -1 14 11 7 4 10 -7 18 4 16 10 -6 15 -5 12 10 -5 11 12 18 6 4 -8
3886 -8 12 -5 -2 -11 -10 3 -27 0 -15 11 -18 -14 3 6 6 2 -15 3 -9 -5 12 -2 -3 -9 -1 6 10 5 3 5 9 -2 -6 -20 -1 -2 29 1 20 2
3926 2 -10 -9 3 4 12 3 -7 14 -12 0 -12 6 3 0 6 5 1 7 18 -13 2 13 -1 -6 4 18 -12 -6 -6 -8 8 -17 -5 -15 7 -3 -21 7
3964 7 1 1 -8 15 15 -10 -6 17 2 26 15 13 8 6 9 -3 17 -5 6 8 9 15 24 1 1 -5 6 13 2 25 6 0 -8 -1 6 -1 -9 2 -15 5 -14 -1
4006 -1 13 0 -4 -1 -12 -4 8 -10 16 9 -4 11 -4 -3 -25 -19 -8 -15 5 -6 2 -4 -2 23 -8 17 -9 2 22 -2 5 -3 -8 0 -13 -2 13 0
4044 0 -13 9 -21 4 1 6 -4 10 1 7 15 -10 -5 -22 11 -16 -7 -15 -10 1 -8 1 -4 -28 -1 7 -7 -5 -22 -12 8 -6 1 -4 -12 3 -11 3 10 8
4084 8 2 4 3 -6 5 18 24 -12 3 23 0 9 16 12 10 8 0 -4 -10 11 -3 21 9 -14 -7 9 -1 -16 -6 1 -17 -3 5 11 -16 -12 -15 -27 -21 -3 18
4125 18 12 15 2 6 -12 1 -11 -10 -15 -10 -25 -9 16 -3 1 6 12 8 9 5 -6 4 16 13 31 -4 19 12 3 30 5 -10 -2 -4 1 -8 4 -21 5 -8
4165 -8 13 -1 -4 -15 -17 -5 -7 3 -2 11 -10 2 -8 -5 8 -16 -11 -15 -4 15 -4 -16 1 8 11 -1 -21 -11 21 6 -3 1 18 10 -5 -7 -19
4202 -19 23 1 -3 9 5 -2 11 -2 9 3 -6 3 6 4 2 -11 10 -17 6 9 15 -17 2 -11 -8 -14 3 -2 -10 -20 -27 -18 5 13 -12 7 -8 -20 8
4241 8 -11 -12 11 -6 -15 15 -12 -9 2 11 -21 -4 -5 11 14 5 15 22 7 14 7 -10 7 3 4 5 16 -4 1 -4 2 7 -1 -2 0 6 10 -14 10 -9 0 -20
4283 -20 6 -12 6 3 -29 -7 -16 -20 -8 -5 -23 -8 -1 -6 2 -10 -7 15 21 21 8 -6 -8 5 -2 11 -2 0 9 5 8 -5 2 14 11 13 6 3 2 14 6 -2
4325 -2 6 17 1 14 14 7 -3 -5 -2 -8 -5 -12 -12 -13 -1 -6 -10 4 -1 -16 -4 19 17 -21 -15 -2 0 1 -17 10 -3 -3 -9 8 -5 0 11 -17 3 6 -9
4366 -9 -16 7 -7 -20 8 8 -2 15 25 26 11 3 13 -12 10 8 7 -2 18 5 0 1 7 14 7 -20 -12 6 4 -9 10 -6 -2 -27 -10 -13 -13 -10 13 -17
4406 -17 5 2 -9 -16 16 -9 -14 -8 -22 3 -4 -2 -9 -4 -6 -2 -22 11 11 -7 18 29 -5 10 3 2 -1 11 4 6 12 -7 6 24 15 10 -4 11 -9 -2
4446 -2 8 10 -13 -7 2 -17 8 -9 -4 -15 -9 3 -18 -21 -16 -5 -19 -23 -6 5 -23 -6 -2 10 20 -2 -1 -4 6 21 1 15 10 15 -1 2 1 11
4484 11 4 17 11 21 3 -3 6 0 26 -4 14 18 11 6 5 -6 13 6 8 -6 8 7 -17 0 -12 -22 -3 -1 -3 1 9 -14 -24 -8 -7 -18 -17 21 -18
4523 -18 -3 -10 -9 -8 -8 5 6 3 -4 -7 21 9 12 -6 6 11 10 -5 10 16 3 6 10 4 1 12 17 22 11 4 1 11 10 6 -9 13 -7 6 2 0 -8 -23 7
4566 7 -8 14 -20 9 -9 6 -13 -11 10 16 1 7 -19 -12 -5 -14 -11 -3 4 -1 2 5 3 8 14 4 6 6 4 30 11 5 11 19 12 12 3 -2 22 -2 3 1 -21 7
4610 7 18 7 7 6 -3 -3 -3 -2 -1 -20 -13 6 -20 -28 -6 17 -7 -19 10 0 -25 -4 12 -5 11 9 8 -7 2 -5 -9 11 -5 12 6 8 10 6 12 17 11
4651 11 4 21 -5 -8 10 -5 21 2 11 -3 -4 26 20 10 15 10 -11 4 -10 3 2 7 15 -25 -5 0 -13 2 -11 -12 -1 -5 -7 -10 -3 -12 -18 -3 -7 -3
4691 -3 -11 -11 -1 -27 0 -20 11 7 -2 2 24 2 -3 24 -7 6 13 6 -6 7 11 -10 29 -4 5 24 5 20 7 -9 11 17 -12 -9 -2 -7 4 11
4729 11 -12 15 2 -7 0 12 -2 -23 2 13 11 -12 -21 4 10 -3 -5 -5 12 13 6 -7 -5 -3 -5 -2 4 -4 -3 13 7 -8 9 14 -4 23 7 10 24 2
4769 2 2 25 18 9 18 -6 16 11 1 2 14 18 -9 18 -1 -6 -1 -31 -7 -24 -12 -13 -25 -4 -2 -8 -23 -1 -18 1 -6 -10 -20 7 6 -16 -5 -17
4807 -17 -15 -24 4 18 -7 -12 -2 7 0 -14 -17 -8 0 -10 7 11 -12 1 19 11 13 -5 28 9 -11 1 5 2 25 3 2 16 18 -3 -11 -18 6 -1 10
4846 10 3 13 2 0 0 -10 3 11 8 -7 4 -21 0 -17 -14 3 -6 1 -1 20 5 -18 -4 -6 7 -1 -6 -2 3 19 8 2 12 2 18 -9 -13 3
4884 3 -13 -2 2 1 15 1 6 11 -3 8 -10 21 -6 10 6 -5 -11 1 -6 -5 -6 9 -4 2 -18 -15 -21 -11 1 -20 -14 -5 -20 10 -4 -13 3 0 5
4923 5 3 -5 -13 16 7 0 -2 -8 -5 14 -16 1 20 -8 17 29 -5 31 11 -12 -7 6 -16 -5 -11 2 10 -14 5 2 -6 -10 5 -7 -15 0 5 5 -16
4962 -16 0 -4 -9 -30 -24 -12 -17 -9 1 -22 7 -7 14 2 -28 6 -11 2 16 -40 16 -10 1 8 3 1 4 -1 -7 2 23 25 13 6 -5 23 15 10
5000 10 25 -8 11 7 -9 -8 -7 -10 -10 0 -3 -42 -3 -17 -5 -23 0 -15 -21 2 -19 -29 13 -19 -15 20 -7 -6 -3 16 -18 -10 0 -12 -2 -5
5036 -5 4 12 0 8 -6 10 -4 -5 21 7 17 0 -2 7 21 23 1 20 4 20 8 6 20 -3 -9 -3 3 -1 7 -1 0 -14 -18 5 -15 -2 -3 -5 -13 -26
5076 -26 -17 -11 -10 -26 -31 -15 -19 16 -12 -20 -18 -19 -15 -12 15 -11 5 2 5 -3 -6 3 -6 -6 6 3 -15 -21 -9 -1 17 12 1 22 9 6 6 13 3 19 0 24
5118 24 -6 -1 -9 13 1 16 11 -37 13 8 -9 -5 -6 4 -11 -16 -10 -12 -10 5 -3 -15 2 -21 -15 12 12 0 -12 9 13 5 1 -2 -2 -2 -5 7 -1 -5 19
5159 19 14 -20 17 -6 15 16 23 9 7 8 -2 -14 14 -10 14 3 4 -9 -5 -10 -10 -5 -13 5 7 -18 -19 -10 -15 -19 -10 -32 4 -11 0 7 -2 -11 0 -11
5199 -11 10 -14 -25 12 -10 -6 3 -4 -16 12 16 17 -26 2 -8 23 16 3 31 16 -4 24 3 26 10 13 5 -1 6 -4 4 -5 14 -7 9 19
5235 19 -8 -6 -8 -2 -3 -2 -10 -6 -12 -17 -5 -13 -13 2 -5 4 -25 4 -23 1 -2 -5 2 -3 -9 -10 12 25 -12 -14 19 7 -7 -4 23 4 1 3 1 27 14 0
5277 0 9 16 6 -16 -9 -3 12 13 5 2 2 0 -8 -13 -6 13 -11 -12 -17 -13 -8 -28 28 9 -5 -22 -4 -8 -21 -6 -5 10 -18 -18 12 -3 -1 -15 1 -12 -11
5318 -11 4 15 2 9 16 -6 25 7 19 14 7 11 -4 -11 19 -13 11 18 -12 -6 -2 8 10 12 23 -15 -1 9 9 -11 4 5 -3 8 -2 -12 -5 -22
5356 -22 -16 -22 -1 -3 -13 -8 8 -15 -2 -3 -14 -1 2 -10 -3 6 -20 -21 -7 6 18 0 -21 2 -7 -4 -3 26 6 8 22 10 2 19 3 6 -6 1
5394 1 2 13 18 -9 13 10 39 -6 1 27 8 2 4 -4 3 -5 -13 -8 -9 4 -21 -10 -5 0 -16 -3 12 -8 -13 5 -15 -16 1 1 -7 10 -7 -1 31 -29
5434 -29 12 -5 -2 36 6 4 3 36 10 17 -1 5 14 8 23 -1 19 18 25 6 17 5 26 20 0 10 -3 23 -19 1 0 -4 -8 -2 -7 -8 -6 -19 -18
5473 -18 -7 7 -18 -7 0 5 -32 9 -3 10 -2 9 -13 4 -15 -4 6 -18 6 -7 10 9 26 5 21 19 -12 5 11 21 9 9 2 9
5507 9 -16 17 10 3 -8 4 1 9 6 -15 2 -9 -10 7 -12 -14 -14 -18 11 -17 -25 4 -1 -8 0 -2 -19 -15 -10 -1 4 2 -3 -6 10 -4 12 14 2 -8 4 1
5549 1 -3 12 6 26 0 18 7 5 -2 -3 11 4 6 6 14 21 26 8 2 -4 23 5 -7 -16 1 6 -25 5 -5 -25 9 2 -16 -3 -11 -5 -12 -6 1 -5 1 -14
5591 -14 26 -14 8 -24 -13 -10 1 6 12 -11 2 20 4 12 13 -9 7 4 20 17 1 5 29 25 19 1 0 -2 4 -16 7 17 -5 30 0 16 -5
5628 -5 -21 9 7 -3 32 -8 18 -1 -9 -1 -22 -6 -2 1 -14 -16 -10 -23 -20 2 -9 0 0 -14 -14 5 13 -1 22 9 -18 12 -3 5 -13 -6 1 -9
5666 -9 20 9 4 14 6 2 3 -3 15 3 8 27 12 -9 -3 0 14 9 -1 2 -3 -8 0 3 -22 -5 10 -1 -20 8 -20 7 -8 -15 -16 -9 -10 -5 -17 -4
5706 -4 -10 -4 -6 -23 0 -8 -25 -12 -6 8 -16 7 -11 -8 9 27 8 20 4 11 6 7 11 16 0 6 16 13 12 18 20 -3 3 12 -3 7 20 16 3 2 -22
5747 -22 -3 -11 -4 -16 1 -20 -19 -5 -15 -10 -1 -7 -13 -15 -5 3 -4 -7 0 7 4 -11 2 -9 15 2 20 20 -1 16 -6 13 5 5 23 17 8 6 21 10
5787 10 2 26 19 10 11 4 12 13 11 -7 -6 22 -4 -14 9 -14 -3 0 -14 -3 -15 3 -9 7 7 -8 -12 -2 -7 6 -2 -11 3 8 12 19 8 -14 -9 13
5827 13 1 -15 -12 2 16 1 2 -4 12 24 1 18 5 4 6 -6 10 14 18 25 25 2 7 2 2 -9 17 -1 -1 12 -12 -17 -14 0 0 12 3 12 -4
5866 -4 -8 1 -16 -5 -23 -4 -17 -4 -5 -2 -14 -24 -2 0 -5 2 -13 1 0 17 2 7 9 18 25 16 23 5 37 27 26 25 6 -1 -5 12 -3 -4 12 -11
5906 -11 8 33 14 15 -11 14 -12 -6 4 -2 -7 -7 -3 -22 -24 14 12 5 -22 6 -16 -25 -27 -23 -14 -22 3 -5 -27 -5 5 -22 8 8 -12 1 0 -4 5 -1
5946 -1 10 8 23 20 11 7 3 8 -4 3 15 17 15 -3 1 25 25 12 1 -14 23 -2 0 -2 2 -2 -7 8 0 11 -24 -29 -10 -22 -29 -11 -20 -6 -5 7 -11
5987 -11 4 -13 -5 -3 -21 7 -6 11 6 -5 21 16 17 2 8 12 16 19 15 11 8 20 16 13 23 11 17 5 -7 7 -11 6 -20 10 9 0 22 2 10
6026 10 1 1 2 3 16 -17 -1 -5 -7 -17 -24 11 0 -23 -15 -7 -10 -20 -1 -14 6 0 -11 9 -5 0 9 7 -1 -7 -18 -6 12 5 23 21 21 19 44 13
6066 13 -11 5 4 10 20 2 13 -4 3 8 -12 8 6 -4 19 -9 9 16 10 -5 -8 3 -14 -24 6 1 -20 -19 -6 -13 -10 -19 7 5 -3 1 -13 -26
6104 -26 15 7 5 -4 -8 -4 -2 -4 -4 9 8 -4 17 21 28 4 5 8 4 21 -10 14 4 9 13 -9 21 5 -18 0 2 28 1 -8 1 -4 -5 -5 -28 -1 -12
6145 -12 6 -18 -5 -10 -8 -14 4 -11 7 -9 0 -1 -29 3 -11 -4 3 -2 4 1 -1 21 4 -1 9 22 10 27 13 17 16 11 5 11 11 -2 18 17 -1 16
6185 16 20 7 3 25 -12 1 1 2 16 7 -10 18 6 -11 4 -7 -11 -1 -14 -6 -11 -1 -8 -15 -6 7 19 -8 -11 21 11 11 -7 1 2 -5 20 -6
6223 -6 -7 -1 5 29 6 10 7 25 8 21 2 14 18 25 9 25 23 6 7 13 7 1 37 4 -1 -2 1 -12 7 -11 -6 -23 -3 5 -4 -46 -30 -21 -11 -24
6263 -24 -2 -23 -26 5 -14 11 14 -4 -19 -8 6 19 -13 26 5 25 15 -6 18 11 -2 18 17 22 10 -1 20 0 13 2 5 -2 11 7
6297 7 -5 13 3 8 16 18 2 10 15 3 -18 -20 -14 -12 -7 -17 0 -19 -13 2 -27 7 3 -13 -15 -7 -17 -7 -16 2 -4 -9 -13 7 -1 12 13 12 -2 -7 3
6338 3 -5 7 -2 24 6 30 22 -9 9 1 11 4 22 19 2 6 6 -1 -6 -8 6 1 25 -6 -8 -4 1 11 -11 7 1 -6 -9 -1 2 -7 -8 -4 4 -17 2 -5 2 -3
6382 -3 -8 -12 -2 -9 1 -9 15 -7 2 4 24 3 10 2 15 4 -5 11 29 19 12 20 7 31 -3 -10 12 -9 8 20 8 13 -2 -13 -8 -10 -11 -11 -8
6421 -8 -7 2 5 -10 -4 4 -18 -19 -10 -21 -2 -26 -15 -16 -11 -4 8 -5 -8 -30 -7 5 -3 -12 -12 -9 7 -13 -13 -7 15 12 -1 8 -5 7 5 23 24 3 0 1
6463 1 24 15 19 -10 -10 11 13 -1 7 6 0 2 18 4 7 -15 -1 6 -12 -5 -7 -3 -10 -26 -31 -14 -7 -12 -23 -14 -14 26 -11 -6 -1 -6 15 9 -10 0 6 13 20 6
6507 6 3 7 19 22 -4 -4 3 26 14 23 13 -1 -1 -2 2 -2 22 4 14 -6 14 18 -2 13 1 8 12 -1 -1 -14 -13 2 -13 -10 -11 9 -4 -8 -18 8
6547 8 -26 27 2 9 8 -6 -18 -4 6 -6 -27 -1 8 6 19 2 4 1 18 -3 19 19 -1 20 -1 15 16 16 1 14 21 2 23 -3 18 -2
6583 -2 7 13 9 -7 -7 -9 15 -6 10 3 -7 17 -21 -7 3 -10 13 -27 -14 -16 2 -16 -15 1 -4 7 -17 9 -14 4 -3 -24 2 24 17 -6
6619 -6 -7 16 7 20 16 13 7 24 10 -5 9 8 34 11 12 17 -4 8 2 18 22 27 -2 -13 -7 -12 -7 -10 -9 -5 -2 -10 4 -10 0 18 -18 -6 -11 0 -19
6660 -19 -19 -9 -4 -8 1 0 -2 -13 -2 -17 9 -16 -6 8 10 10 8 20 24 12 10 5 13 2 39 18 9 14 15 13 10 6 7 22 11 19 15 9 -14 -7 24 7
6702 7 3 6 -14 0 -22 -11 -12 -5 -30 1 -4 6 -13 -22 1 -21 3 -8 1 -11 -6 1 -7 4 0 8 14 -3 7 -2 1 2 9 12 12 -4 4 20 24 20 12 4 9
6745 9 -3 26 31 -2 5 17 2 -4 0 8 6 5 -7 9 -4 5 -29 -4 -10 4 6 -22 -20 -14 3 11 6 -1 3 -10 17 1 -7 -31 -24 -1 21 14 -3 -12 -10
6786 -10 6 1 4 21 16 -4 18 11 18 -1 10 7 23 12 -18 10 33 5 5 4 3 -10 9 -17 16 -16 -7 -1 -4 -15 -6 -14 -21 0 -3 -9 10 -9 3
6825 3 -8 -6 -19 -5 -4 -16 -12 -8 -6 -9 -3 -1 -4 1 11 -12 -11 9 -14 6 5 1 13 -3 10 11 14 17 5 17 23 16 21 12 11 -6 15 3 -9 14 21 8
6867 8 2 9 2 10 13 -3 -15 -11 11 -6 6 3 -4 -17 4 -8 -22 -12 -16 -10 8 -5 -11 11 1 -15 -8 -13 7 15 -12 8 6 18 9 3 5 -1 12 8 11
6908 11 13 2 -9 3 -10 -2 14 -7 12 -1 13 -7 21 -14 1 9 -20 0 -26 -10 3 -2 -16 -1 3 -12 2 -5 -16 4 -7 -14 13 -22
6942 -22 -20 -36 -19 2 -8 4 21 -12 -6 -4 -13 2 -14 16 2 6 17 17 10 5 4 8 6 -4 25 11 13 -1 -11 5 4 6 8 17 -6 14 4 22
6980 22 6 -18 -5 -8 12 -12 -10 5 -14 -10 4 -13 -16 -12 -7 -13 -19 -15 7 -8 -12 7 7 11 11 -23 -4 -8 -12 12 -5 3 12 17 3 5 9 14 2 8 3 -6
7022 -6 4 -5 26 20 16 25 7 8 -8 7 10 2 -3 6 0 17 9 3 -17 -19 -16 8 7 1 -3 -1 -13 -2 -2 -25 2 -5 -6 -3 -30 -9 -8 -9 -1 -2 13 -25 -10 -18
7066 -18 0 3 4 18 28 3 -1 3 18 27 6 23 8 8 15 22 6 19 16 6 -6 23 12 -3 20 -3 11 6 -5 3 -7 3 8 -27 9 0 -9
7103 -9 2 -18 -26 -23 5 -11 -3 -25 7 -24 -1 5 -4 -29 2 -4 -16 4 -13 -5 -5 6 -18 18 17 6 19 21 7 27 31 10 12 19 20 22 26 9 5
7142 5 2 8 22 -5 -2 1 -1 1 -8 -22 7 -4 -6 -14 6 -17 -3 -1 5 -6 -13 -15 1 4 -2 -7 -12 1 -3 8 5 -1 10 21 4 -2 0 10 14 14 18 -11 11
7185 11 40 2 19 4 4 21 19 18 18 6 11 36 3 12 3 23 -2 -1 5 -5 20 -15 0 8 -15 -25 4 -5 -1 -6 -17 -20 -6 -8 -14 -6 -4 -21 -21 8
7225 8 -10 15 14 29 -2 -2 -2 -4 -4 0 15 -2 22 15 10 -12 36 13 20 10 12 3 1 22 10 -3 14 19 13 10 3 2 -3 -18 -1 6 -7 19 2 13
7265 13 4 -1 10 11 -15 5 -7 13 -11 -17 15 -12 -10 -14 -7 -6 -16 -10 -5 7 2 -6 -4 -2 1 19 -10 11 20 17 29 26 14 17 12 25 9 19 28 6 8
7306 8 8 18 -5 4 14 4 11 15 29 1 -25 6 18 6 -25 -5 12 -6 17 1 -9 8 -9 -7 -13 0 -10 -10 -16 -14 -6 -8 -5 3 4 -15 0 -20
7344 -20 -8 7 3 10 11 7 3 12 10 -1 14 28 26 16 20 36 31 6 5 20 2 28 12 -2 10 12 1 -16 20 -11 2 -8 -3 5 7 -21 -7 -4
7382 -4 -4 7 -7 -11 -13 -7 7 -5 -18 -21 -21 -13 -8 10 -23 -7 -12 5 0 0 -11 3 13 8 -11 11 8 10 7 -7 12 28 3 15 16 11 10 12 13 -15 8
7423 8 21 9 -3 6 9 -11 -8 8 -20 2 -1 2 -10 1 -6 13 -2 -21 -9 -19 9 -18 -7 -11 -16 8 -30 -16 -19 0 -23 -28 13 0 -9 -5 17
7460 17 14 9 2 4 8 18 -1 6 28 21 5 -1 -1 39 -4 4 14 5 4 19 16 -7 3 5 12 5 11 -10 5 10 -9 -18 -6 -20 -8 -13 -3 0 -2 -9 6 -4
7502 -4 -3 -2 -21 1 -2 -8 11 -19 -21 1 0 0 10 16 12 -2 6 28 26 22 6 15 10 -4 10 16 -4 2 -12 13 0 2 19 11 14 29 2 5 -5 3 4 3
7544 3 24 17 10 -16 7 5 -16 -4 -21 -13 -11 -5 -5 -28 -20 -3 -20 6 8 -10 -5 18 3 -13 -6 5 0 -4 -9 -13 3 3 9 -9 7 32 -2 -2 -5 23
7584 23 19 2 10 6 -14 7 8 6 19 -1 -3 26 -3 -23 -26 19 9 -11 2 13 -20 -32 -4 -24 16 -12 -25 -6 -2 -14 -11 0 5 5 8 -1 -23
7621 -23 2 -9 11 15 3 -11 5 -1 0 16 12 26 10 29 5 -7 15 30 11 6 14 17 12 22 1 18 16 26 -7 -5 -21 18 9 15 4 -10
7657 -10 14 0 11 5 -5 -12 -7 7 10 -6 2 -22 6 -16 -19 -12 -31 -20 7 -2 -11 -18 3 4 3 22 -23 0 1 8 5 -6 4 12 9 -17 7 19 11
7696 11 17 14 14 17 17 24 14 5 11 -12 20 17 -7 9 16 -9 -2 -4 -9 -7 6 6 2 -2 -2 -7 -19 -14 -33 -25 10 -10 -40 -10 8 -10 4 0 5 2 -14 -7 6
7739 6 -19 8 -2 14 -7 32 -1 22 33 8 11 -16 12 34 14 22 15 17 25 -2 -8 -16 -4 9 -11 -7 1 2 7 5 22 1 -24 -7 -5 -3 -15 -9
7777 -9 -4 -5 0 -17 7 -11 -10 -2 -7 -9 -20 8 0 -11 -4 -2 -2 -14 8 32 11 16 36 17 7 -4 21 13 11 33 18 25 16 24 25 31 -1 10 27 2
7817 2 15 -4 7 9 -12 8 13 6 3 2 0 -3 -18 9 14 -24 -5 -16 -24 -9 -13 -11 -5 -11 2 -11 -2 -2 13 -10 18 -11 -13 19 11 23 -10 0 -9 17
7857 17 32 30 1 9 13 2 31 6 16 1 31 15 16 3 3 10 36 -6 31 11 32 7 9 18 -9 6 9 8 10 0 -8 -11 -9 12 8 -16 -18 6
7895 6 0 -15 -9 -6 -27 -17 -16 -8 -12 -7 -5 -12 9 9 -6 13 -7 9 16 13 7 18 31 3 8 11 4 8 9 23 8 -8 6 5 -4 10 1 18 1 1 -4 -16
7937 -16 2 -7 -8 -6 -15 -6 -4 4 4 -9 -23 -13 -3 -1 3 -20 -22 -8 -16 -11 7 7 -4 10 14 -12 -13 -6 6 -16 5 -3 13 10 13 16 11 16 -1 4 18 -4
7979 -4 22 26 8 2 7 4 13 -7 8 3 12 17 12 -13 -22 4 -7 -25 -19 3 -29 1 5 -21 5 0 -16 -29 -10 -15 -21 -17 -15 15 -15 -3 -11 -7 -2 -13 -3
8020 -3 0 -5 5 24 8 -1 13 -9 21 21 14 10 17 -1 22 20 33 15 29 15 6 29 -1 1 23 12 6 -6 26 -7 5 -15 14 2 -9 -3 -2
8057 -2 -1 -28 -19 -8 -12 -2 -5 -2 -15 1 1 9 -19 -14 -14 -9 -13 1 3 0 -2 -15 13 -18 -18 5 9 0 2 15 15 0 -1 -8 12 33 6 16 14 12 4 0 2 14
8101 14 23 -3 -2 -8 22 -3 3 1 12 -10 -24 15 -4 -23 -10 -7 3 -20 -16 -18 -4 4 -15 -16 -8 -7 -13 -4 -18 -5 -10 4 -2 13 3 22 13 19 2
8140 2 24 2 18 29 10 25 38 18 11 8 5 15 5 5 6 6 15 13 16 -1 -1 -2 19 -19 -4 25 -8 -7 -24 -8 -16 -6 0 -12 10 -20 -24 -23 -8
8179 -8 -6 3 -29 -5 -9 -10 3 8 -9 -13 15 7
8191G
$$ Imaginary data points
##PAGE= N=2
##DATA TABLE= (X++(I..I)), XYDATA
0 0 0 0 0 0 0 0 0 0 0 0 0 0 0 0 0 0 0 0 0 0 0 0 -4 7 -7 7 -7 7 -7 7 -10 13 -14 14 -15 18 -21 22 -25 28 -29 32 -38 40
44 40 -46 50 -54 61 -68 78 -87 99 -113 129 -149 178 -215 274 -365 548 -1938 10142 11636 -1191
64 -1191 -5848 -8456 -2812 9633 10696 -3965 -11074 -4088 4337 7392 4932 -4273 -9701 -2979 7496
79 7496 7982 -404 -6557 -6035 -663 7595 7590 -3384 -8995 -3110 3779 6786 4187 -4786 -9465 -870
95 -870 8170 5564 -1362 -5766 -5962 1464 8492 4219 -4921 -7033 -1398 4679 5692 1193 -5119 -6160
111 -6160 559 6632 4254 -2549 -5339 -2940 1950 6015 3170 -4581 -5894 -178 4190 4548 527
126 527 -5198 -4829 1782 5656 2794 -2449 -4995 -2447 3300 5354 845 -4342 -4304 439 4315 3301
142 3301 -912 -4381 -3333 2245 5018 1311 -3012 -3508 -1170 2689 4419 360 -4520 -3106 1449
157 1449 3376 2415 -1038 -4201 -2173 2718 3898 599 -2846 -3129 -245 3037 3137 -614 -3677 -2229
173 -2229 1593 3210 1423 -1601 -3245 -1303 2648 3181 -220 -2560 -2196 -6 2744 2559 -1177 -3271
189 -3271 -1215 1648 2469 1089 -1738 -2999 -396 2626 2244 -540 -2442 -1701 691 2438 1591 -1353
205 -1353 -2722 -657 1838 2011 305 -1670 -2135 2 2372 1660 -923 -1994 -1101 754 2202 1069
221 1069 -1573 -2088 -203 1637 1633 16 -1742 -1669 495 2069 1095 -978 -1810 -705 1071 1772 521
238 521 -1533 -1714 230 1607 1110 -292 -1521 -1225 705 1808 608 -1132 -1396 -368 1012 1484 140
255 140 -1497 -1223 379 1370 879 -522 -1403 -753 844 1511 312 -1129 -1136 -67 1092 1121 -131 -1361
273 -1361 -877 632 1233 511 -599 -1172 -492 962 1173 5 -1030 -868 135 1033 864 -357 -1211 -548
291 -548 679 1017 280 -694 -1012 -180 915 924 -180 -1017 -636 292 880 600 -479 -1070 -301 699 820
310 820 58 -700 -803 -12 880 668 -354 -846 -440 357 816 342 -565 -859 -110 725 632 -71 -664 -603 178
331 178 812 473 -398 -744 -227 441 688 209 -570 -690 67 683 487 -152 -628 -432 272 709 270 -449
351 -449 -623 -103 445 564 28 -593 -526 162 605 323 -251 -568 -302 319 604 120 -481 -507 3 459 436
372 436 -54 -557 -384 262 535 229 -310 -472 -168 383 493 26 -475 -365 119 438 327 -164 -495 -239
392 -239 295 467 111 -324 -397 -40 409 403 -91 -432 -248 148 389 213 -220 -440 -115 315 358 -3 -335 -319
414 -319 14 341 255 -159 -391 -161 191 345 135 -249 -379 -52 318 273 -48 -323 -254 85 321 183 -204
435 -204 -309 -94 218 302 54 -253 -291 23 312 203 -82 -293 -161 147 311 138 -212 -250 -38 245 236 -3
457 -3 -250 -220 85 283 141 -131 -245 -110 135 251 44 -218 -213 13 218 153 -61 -251 -147 111 235 70
479 70 -168 -214 -56 167 220 -18 -205 -160 75 181 141 -71 -191 -103 147 193 32 -153 -154 -2 177 150 -49 -194
503 -194 -95 100 141 69 -92 -190 -45 126 161 4 -154 -112 30 164 116 -91 -172 -50 103 155 21 -126 -143 -1
527 -1 143 98 -52 -128 -88 56 168 56 -99 -142 -19 114 102 -9 -114 -103 34 136 64 -60 -125 -42 80 119
551 119 17 -114 -108 6 127 85 -34 -125 -78 53 132 61 -58 -93 -4 90 84 4 -108 -63 13 125 60 -46 -92 -61
577 -61 59 87 2 -105 -98 -4 76 75 -44 -114 -66 40 84 30 -49 -113 -47 81 79 -20 -73 -69 10 98 46 -43 -94 -43 57 68
607 68 18 -46 -51 -6 69 77 -18 -81 -34 35 70 36 -50 -79 -18 43 45 -8 -66 -59 17 55 29 -29 -87 -26 41 53 -1 -59 -66 -19 54
640 54 20 -4 -57 -60 15 70 29 -45 -74 -22 54 36 2 -54 -43 26 61 44 -28 -55 -28 25 55 34 -38 -44 -2 48 45 -4 -53 -55 39
673 39 62 39 -28 -73 -19 54 75 9 -64 -39 -23 57 39 1 -87 -21 40 36 8 -54 -55 -24 40 44 -26 -75 -70 -2 40 9 -27 -49 -32
706 -32 32 41 9 -32 -43 -6 55 27 -7 -61 -21 19 29 37 -32 -56 0 38 49 14 -35 -26 9 40 17 -4 -51 -17 27 53 19 -26
738 -26 -40 -9 35 47 -1 -34 -14 -27 36 10 -36 -44 -19 6 14 6 -40 -45 -10 27 21 -20 -41 -40 0 29 -4 -29 -31 -18 28 -2 0 -30 -33
773 -33 11 28 14 -7 -27 -12 8 48 23 -14 -28 4 27 38 8 -37 -13 15 39 10 7 -18 3 20 38 4 -51 -14 -14 19 14 8 -34
806 -34 -23 4 30 -4 -25 -21 8 -7 4 -16 -22 -21 -19 14 5 -23 -16 -12 17 23 3 -7 -35 11 27 19 1 -3 -14 40 12 32 -1 -17 -8 9
842 9 24 17 0 -33 -2 32 14 -8 -27 7 31 19 0 -5 -34 -6 23 11 -21 -34 -13 3 8 25 -24 -36 -12 11 16 3 -9 -28 -5
875 -5 22 5 -13 -7 -28 -9 7 9 -24 -37 -9 25 14 17 -22 -15 -7 15 19 -9 -16 7 15 22 10 -2 -15 22 46 22 -13 12 -8 21 28 29 6
912 6 -21 -1 14 3 -3 -16 -10 5 26 14 -8 -23 -41 16 11 -5 -27 -37 -19 8 15 -21 -33 -12 14 3 -1 -17 -27 6 17 19 -7 -22
946 -22 7 20 10 30 -7 -5 11 21 27 14 -1 -22 13 42 16 -21 -14 -7 21 12 -1 -10 -16 2 4 11 -6 -18 -10 -1 26 3 -34 -9 9 7 -3
983 -3 5 -35 -52 -15 9 -9 -17 -16 -2 11 12 20 -19 -23 14 38 7 -5 -32 -2 20 12 -3 -2 -24 10 9 8 6 -14 1 24 30 37 5 -12 -4 27
1021 27 34 2 -8 -6 -5 15 6 -6 -24 -12 6 13 -5 -12 0 -12 6 17 -8 -13 -4 -15 3 9 -3 -9 -16 1 15 1 -13 16 15 13 22 1 -3 -15
1059 -15 3 34 -9 -23 -12 -7 7 32 7 -37 -6 36 31 5 13 9 14 15 13 7 -6 -14 6 15 8 -13 -17 -5 16 4 0 -1 -18 16 -14 11 -13
1096 -13 -12 -13 -11 12 13 -22 -2 -5 -7 9 6 -13 1 2 20 14 -2 8 3 14 26 4 22 -4 -6 10 31 8 -4 24 10 19 13 -4 -7 -4 -8 8
1134 8 2 -21 -9 15 7 6 4 -10 -17 -5 28 -9 -17 1 -1 -1 -9 3 -11 -20 -6 -5 -10 -5 -6 -2 -3 -9 -5 13 3 3 14 11 3 3 15 -1 3 6 0 1 2 10 20
1179 20 -18 -2 22 10 29 26 8 13 7 34 7 2 14 -11 -2 10 15 -2 -16 24 4 23 -15 -24 9 -7 3 -4 1 -6 0 18 4 -16 -10 -16 -9
1216 -9 5 -1 -5 -4 4 11 16 -6 -9 2 13 15 20 13 31 -8 6 2 -5 -8 -5 19 8 4 24 14 -9 2 -8 -4 -7 3 -15 13 11 9 -1 8 -14 -12 -3 -13
1258 -13 -7 -7 -5 -2 -34 5 -16 -28 -10 2 -10 -10 -15 0 -7 9 -8 -10 -9 -3 1 11 -4 -8 10 13 -1 -4 21 3 21 -5 15 3 -17 3 11 5
1296 5 13 4 -1 2 4 -4 -10 -2 -10 9 11 -1 -8 0 2 -9 -9 -9 5 -19 -8 -10 -20 7 -14 -16 -14 -12 -5 -11 -14 -17 -2 0 -11 5 -9 3 33 -3 0 -15 -2
1339 -2 13 8 7 5 -4 1 -11 11 18 19 10 -5 2 -7 -10 -7 -5 -28 -4 -3 1 4 11 -9 -5 -8 7 3 -15 -14 -7 -18 -24 -5 0 -19 -6 7 -15 0 10 0 -1
1382 -1 -27 -23 4 -15 1 -2 -5 -3 -15 0 -10 -12 -11 -12 19 -5 1 9 21 19 13 4 11 0 -11 6 8 -3 -3 3 4 -2 0 9 8 9 7 -7 -11 16 18 0 -4 -9
1426 -9 4 3 -12 -2 -3 -3 -15 -13 -18 -12 -17 1 -17 -6 2 1 15 -13 10 8 -4 3 -19 0 -17 33 0 -9 5 4 34 7 6 19 3 9 3 18 11
1465 11 -1 -9 -7 23 4 6 7 -7 6 -2 -13 1 -11 10 4 -24 -10 -6 -4 -22 3 6 32 0 -7 4 4 3 -1 18 -3 28 7 19 -10 -14 2
1502 2 -2 -6 -8 -10 7 0 16 -2 -5 -15 -1 0 25 15 -3 0 -7 13 -7 1 -11 4 10 9 -9 -2 -10 -6 -3 -12 -1 13 8 5 9 5 -14 8 -33 2 -9
1543 -9 -18 12 -25 -14 0 -8 -13 -9 1 -5 9 7 -4 -7 0 -19 9 -14 -18 9 -11 3 -10 18 -12 4 5 7 20 -1 -10 -2 -1 29 9 10 5 29 7
1582 7 -6 5 19 0 1 0 3 6 10 -3 -2 -6 -10 0 -11 -19 -2 3 -10 4 -12 -3 -10 -6 -16 -12 -14 -4 12 4 14 -14 -5 -8 -5 -5 14 6 -2 2 -9 -24
1624 -24 -27 2 -5 10 6 9 6 6 10 -6 2 18 1 -11 -5 1 -7 -9 25 -3 -19 7 8 20 -13 1 4 -4 3 4 -5 -2 -6 -24 -9 -3 6 -2 -26 -27 -1 -4 -10
1667 -10 -16 17 0 -5 10 6 -12 -7 11 3 10 16 13 24 21 2 15 7 5 10 5 19 1 6 -1 8 4 6 13 11 13 18 8 -6 23 1 0 -9 8 15 -18 7 5
1710 5 -1 -19 -8 7 -8 -8 -11 -7 4 2 -2 -9 -16 -29 -18 -18 -9 -14 3 -4 -8 12 3 -14 3 -15 -8 9 14 13 9 9 8 -19 5 23 5 25 20 16 11 0
1752 0 6 1 -2 8 -21 -19 -1 -11 -1 11 -9 -3 -4 -4 4 9 -18 -9 -16 -1 -23 1 -2 -12 6 -18 3 3 -13 -10 0 -6 -14 12 6 -12 5 0 -11 -3
1792 -3 -9 -10 -2 -1 13 6 16 6 18 -1 -3 9 13 12 5 -19 0 13 -13 -12 11 5 7 -8 7 13 -6 8 11 -8 -5 0 -11 -14 7 -5 -3 -23 1 -8
1832 -8 -21 -17 -21 -13 -5 12 -12 0 4 0 -10 -18 20 -21 -12 -1 13 -24 25 1 14 -17 -15 6 3 21 12 -20 20 0 -1 4 -23 -6 4 16 -10
1869 -10 3 -6 -20 -26 11 -24 -5 -9 13 1 -2 -2 -28 0 4 1 5 -30 15 -2 7 5 -16 0 2 7 5 3 -4 1 -2 5 26 17 3 11 -7 26 13 -4
1909 -4 -2 11 12 9 30 -9 1 -21 -16 22 3 0 0 -2 -3 0 5 -8 -19 -5 -11 -9 -13 -40 -10 4 -15 -23 -5 -8 -8 -15 6 -14 12 -4 0 1 -11 -22
1949 -22 -4 1 16 -1 6 -8 6 8 -12 -1 -1 -14 19 -5 5 15 -6 -1 0 -16 -12 -15 -1 0 1 14 23 12 16 3 3 0 11 4 7 24 -8 9
1987 9 4 -13 -3 8 -2 -11 -8 -3 -13 -6 9 1 -9 -8 -7 -7 -5 11 -12 4 9 1 13 -12 3 -4 10 24 -9 5 1 6 -21 -12 -2 21 31 16 -9
2026 -9 -1 4 -3 5 14 -7 -8 1 8 -8 18 11 23 7 3 6 -23 3 -11 -1 0 -23 -18 2 -4 2 -10 -15 -38 -19 -27 -5 -9 7 0 -15 8 -3 0 -5 6
2067 6 -8 7 -4 14 10 2 7 14 10 23 8 -10 16 2 0 8 6 9 10 5 -1 -5 19 -7 26 -4 2 -9 14 21 -10 -14 19 -12 -12 -6 0 -13 -24 6
2107 6 -20 -7 -12 6 -12 1 -5 -8 -25 -10 -9 -3 19 4 -17 -22 -5 -2 13 5 4 2 5 5 21 7 7 8 -4 15 -4 3 6 17 -1 -1 -8 4 1 10 -2
2148 -2 5 -12 -1 -13 -4 5 6 8 0 -13 5 4 -11 -7 -16 5 0 -7 -6 -13 -1 -14 -12 -6 -14 -10 -14 15 -17 -5 0 10 3 6 -7 10 -19 -7 1 6 -9 -12 3
2191 3 7 -6 -11 -1 1 -22 1 -1 -9 2 14 -22 -3 -5 -7 7 -7 13 -13 -5 22 -10 -21 -21 0 9 -4 -23 -22 4 -20 8 -1 -10 -14 11 20 -2
2229 -2 -7 19 8 7 -1 -10 -10 -4 10 4 14 -13 0 -5 -6 -13 4 8 15 11 -5 -6 16 11 7 3 -4 -10 8 4 -9 3 -2 -4 -8 -16 11 -4 15 -8 5 -9 -4
2272 -4 -8 -23 -4 17 -16 -8 0 -7 0 -7 -22 -13 -4 0 -21 14 14 4 -10 -19 16 -8 0 8 3 -21 -4 -19 19 18 8 8 9 1 -7 -5 -1 -8 -2 3 -7 25 4
2315 4 2 8 12 3 -29 -1 0 -4 -16 -12 1 5 -5 6 -10 -6 -5 0 1 -8 8 18 -13 -19 -26 -10 2 -12 -12 3 -1 8 -7 -12 1 -10 -4 -1 6 12 -3 8
2357 8 3 18 -12 14 9 0 12 7 6 -3 2 12 -5 2 4 -2 -3 6 -4 8 3 1 -3 1 6 -13 12 -16 -10 -7 -31 -23 -12 -14 -1 -6 -7 -22 -13 -18 0 -30 -14
2400 -14 14 -14 -12 -28 2 -3 -6 -12 -8 7 26 14 12 7 -8 5 -11 0 6 -3 3 3 6 -22 10 1 -3 -3 -2 9 2 3 -6 -10 4 -2 -6 6 6 -16 -22 -21 -9
2443 -9 -12 -9 3 2 -21 -11 -23 5 -11 -1 -13 -2 5 1 -8 -16 6 -6 2 0 -13 -17 -2 11 10 -20 3 21 -6 22 -7 18 -12 -7 4 15 19
2480 19 7 16 10 0 8 -3 10 18 -9 -14 -6 8 -13 -1 6 7 -13 -23 -4 12 -12 -3 -3 -7 9 7 -1 -5 -19 -10 -17 -10 8 17 -22 -11 2 9 21 -23
2520 -23 7 6 -15 -12 -6 0 4 2 -8 10 17 -2 -18 -4 17 1 14 1 -1 -1 -11 0 -8 16 -20 2 19 -3 6 4 -3 -1 0 5 6 -10 7 7 14 -14
2560 -14 -2 8 -3 8 1 -17 6 6 2 7 -7 5 -5 7 -3 -27 -2 21 0 -1 25 12 9 11 7 4 32 15 -6 -9 9 12 2 -2 8 2 17
2597 17 -2 3 9 18 -7 -16 2 -13 -3 -14 -13 -4 -7 5 3 -19 -23 -21 -8 4 -3 -7 -11 -15 -19 5 4 0 6 -21 -2 -14 -21 -2 -16 5 6 8 -7 -5 1 12
2639 12 15 10 27 -2 -16 -15 -3 7 4 9 12 13 1 7 6 4 -3 16 6 6 1 -6 13 -9 12 -2 13 4 -24 5 -3 -17 -7 11 -8 -13 4 8 2 -7
2679 -7 -2 4 0 6 5 7 -12 -9 -5 12 1 7 -21 -2 0 3 -8 -4 8 17 17 4 0 -14 -7 15 24 13 -1 -5 23 28 7 0 -6 6 -8 -5 -7 -7 2 -6 -13 27
2723 27 -24 -2 1 -4 -7 14 1 -1 5 -17 -8 -12 -11 10 -2 14 3 -6 -4 -7 2 -17 5 -19 -8 14 -5 5 3 -6 5 0 0 -6 -15 18 -3 16 7 -10
2763 -10 31 -2 10 0 11 -18 9 -13 -8 -38 -1 6 -24 0 -10 14 1 -12 -6 3 -7 -6 2 -11 -8 -15 8 -25 6 -16 -17 11 6 -1 -10 8
2799 8 -6 -7 -11 -17 2 0 8 4 -6 0 18 5 -3 12 9 0 -9 9 -11 -8 -15 22 9 14 10 -11 -3 9 4 -9 11 -3 -24 3 -5 -4 10 10 11 9 -4 -4
2841 -4 -27 4 -4 -13 2 2 9 -3 9 -4 19 -7 6 14 0 -7 14 8 25 -2 8 -3 -13 8 17 -1 -10 16 1 -4 -6 -7 13 -4 1 29 -7
2878 -7 10 1 10 6 17 -2 -14 -14 1 -4 0 -10 -1 -15 6 -18 -4 -19 -22 -6 -13 -2 -6 -21 -2 2 -13 -16 -5 -1 4 8 -1 -14 -7 -7 -19 2 -15 11
2918 11 -12 13 4 5 5 -2 2 5 -6 9 -1 -14 10 -5 -13 -9 34 4 -5 -19 -2 -4 9 15 -10 -1 6 -2 13 1 -9 -9 -8 -1 -23 0 -13 -13 5
2957 5 -5 1 -2 -18 10 7 4 -4 -15 1 16 33 -3 -14 -7 -3 16 3 2 14 -4 14 3 13 18 -4 -10 8 8 -7 -20 10 -9 16 11 -1 -10
2994 -10 0 -3 -11 2 4 2 3 -11 2 2 -10 -18 1 -1 -14 -1 -9 10 5 -11 -7 5 1 9 -19 10 11 0 2 2 22 0 -11 10 19 -6 22 2 11
3033 11 -5 20 -5 10 22 2 18 4 3 3 -1 -2 14 -2 34 2 -9 -19 -20 -7 -13 -18 1 -13 -15 32 0 -11 0 11 17 0 -4 2 -5 14
3069 14 -12 -18 -3 -7 -14 7 17 -7 13 2 -12 8 5 4 1 4 17 -5 3 -1 6 27 33 9 7 23 13 14 -5 9 15 3 18 2 0 16 10 -3
3107 -3 18 6 15 10 1 19 -5 10 16 -13 2 20 -7 0 -3 -4 3 6 2 -13 5 -5 -4 8 5 -20 13 -5 12 10 -2 19 -16 -2 9 7 8 13 -3
3146 -3 2 13 16 4 10 4 12 29 13 11 32 3 12 6 -8 12 23 -7 13 -5 6 0 -1 4 -16 1 1 -7 5 6 6 -7 1 -9 -10 17 6 -10 -15 15
3186 15 -23 -9 -11 -1 14 -9 15 11 31 25 13 14 11 -10 -5 20 5 16 10 9 7 16 16 24 16 12 22 22 -18 11 8 -1 11 14 -5 -9 22 -1 0 13
3226 13 9 10 -8 7 13 23 -3 -14 16 2 -5 -16 -6 7 -3 6 9 13 6 7 8 -11 16 6 -11 -2 -32 6 -7 5 7 -4 -18 6 9 9 -4
3263 -4 10 6 9 -10 16 0 6 11 -2 9 10 -18 -14 14 4 -2 12 -2 10 -1 -3 6 -20 -4 -17 2 -2 15 4 15 -1 16 -4 -5 20 -10
3299 -10 -9 9 7 1 26 2 -11 3 -5 16 5 -16 -7 -9 -5 11 9 29 22 -7 13 -12 12 32 17 1 -4 -1 9 21 18 18 10 -4 -7 -3 7 18
3337 18 -3 -2 -6 6 5 3 1 -4 -11 9 1 -4 -5 -21 -11 -6 -5 2 -2 -23 9 -10 9 0 -7 2 27 -13 4 0 8 9 9 16 -1 15 16 27 -12 19 9 6
3379 6 37 14 8 -9 -5 23 13 21 6 9 5 23 -3 6 -2 -4 4 16 -6 -7 15 12 -5 -3 -6 15 0 7 10 13 -4 -13 3 15 4 -3 17 10 16 19 9
3420 9 13 -1 7 1 27 28 14 6 19 13 -6 27 1 4 10 6 8 14 -11 29 1 -5 6 17 27 -6 16 0 10 13 14 -1 9 -2 -6 6 0 -10 17
3459 17 2 -8 -1 -2 0 -12 -2 8 3 -5 13 20 -23 10 -2 -1 0 -8 2 1 6 4 9 12 15 3 17 24 -2 15 -4 11 -1 2 -5 -2 -2 16 10 -1 -7
3500 -7 3 12 -3 11 8 -1 -3 4 12 -1 -8 -6 17 4 -7 -12 -9 5 20 4 11 -12 -15 -12 -3 -9 9 9 -2 0 8 4 7 4 -8 3 -9 -12 -7 -7 -10 5 1 18
3544 18 -5 -5 8 6 2 16 12 -19 22 14 -6 25 -5 -3 1 8 15 11 24 -10 10 -5 3 11 3 11 -7 -15 -10 27 -1 -9 -12 -5 5 0 4 -6 5 13 3
3585 3 -17 -12 0 -14 1 -3 -2 6 9 4 -20 3 -2 -5 9 -5 15 16 18 10 -1 -3 0 6 -20 9 22 -7 5 -22 -1 14 3 -15 18 -9 5 16
3623 16 9 14 -4 7 6 20 -8 -23 -5 14 6 -25 4 6 8 0 1 4 -2 7 14 -2 3 10 11 -9 -6 21 -5 4 -7 16 -14 13 1 27 6 13 -2
3662 -2 -7 15 12 -22 -8 5 4 -1 -15 9 2 20 -6 2 -18 -2 -13 5 1 1 -29 -4 -3 -10 2 1 -14 -19 -35 -11 -13 -4 6 11 6 -23 9 1 3 -8
3702 -8 6 -27 3 1 1 14 11 -4 8 4 21 20 14 10 -19 30 -14 14 9 7 -5 15 2 9 13 -2 8 -6 -4 12 2 9 -13 3 10 -4 -21 0
3740 0 -8 -10 14 2 3 -13 -1 17 -5 1 1 11 -3 3 8 -6 -20 -3 1 -4 2 -1 10 -7 -14 -6 35 1 -3 2 5 -5 4 11 8 -21 19 -3 -1 4 1 -14
3782 -14 -2 -1 -21 -24 -8 -1 3 -9 -16 5 -7 4 10 9 5 8 -8 -21 -27 -16 20 -15 -1 -27 15 -17 -6 0 -1 18 -6 -16 20 17 15 -16 -12 -2
3820 -2 -5 2 6 8 7 3 -4 1 0 -8 7 11 7 12 -3 -5 2 3 13 41 -16 11 24 -10 -17 3 1 15 -19 19 -11 1 4 -13 21 -10 -9 -20 -3 -5 -18
3861 -18 -13 -12 -12 -8 -7 -7 -11 10 -8 0 7 -6 -2 1 -12 -15 0 -5 -5 2 -7 21 10 -15 -6 19 -16 -2 2 -6 9 3 11 7 -14 -15 13 -5 -18 -7 5 -5
3903 -5 -18 8 -6 2 13 -14 15 -19 -28 -10 -11 -7 0 -16 17 -7 -13 -5 -38 -10 -3 -7 -8 2 21 5 -13 -9 12 4 -9 -2 -12 3 4 5 -3 5 6 9
3943 9 -3 23 8 6 -9 0 -8 1 7 -8 18 -1 5 2 -7 -8 -8 -17 13 -23 1 -1 -17 -3 1 7 -7 -15 17 -8 -24 -18 7 -11 1 -14 -10 5 7 -12
3983 -12 -15 15 4 1 7 -11 9 12 1 9 -4 -10 1 14 16 -1 5 19 16 22 -13 -21 21 -3 -2 10 1 13 9 -14 4 -1 0 -4 28 3 8 2 -29 -5
4023 -5 -25 -13 3 5 3 3 3 -1 2 22 7 -14 -6 -2 -2 16 -9 -21 8 7 16 -2 13 3 -10 -2 15 9 -12 -5 -3 6 1 -1 12 -4 -2 1 4 10 -8 1
4065 1 5 -2 -18 -1 0 2 2 -9 -12 6 -4 -13 -1 6 -5 -12 -5 -6 10 -10 -11 12 -3 11 5 3 5 6 5 9 1 -10 -10 0 -5 7 13 6 22 0 -8 -3 11
4108 11 -8 9 4 5 -5 4 11 14 -2 -10 7 7 -11 -7 9 -16 4 3 2 -2 -9 -25 8 12 -3 -8 11 21 -2 -8 8 -4 23 2 -5 -3 6 10 -1 -17
4148 -17 0 10 -6 -4 -14 8 23 -1 -2 3 5 -1 6 8 -6 -1 -11 1 -2 20 -2 -1 17 -2 0 -2 11 11 3 10 -4 1 -1 -21 13 35 2 -3 -3 -28
4188 -28 -7 9 -7 -10 -6 0 -1 3 0 -13 -9 -17 7 4 -2 -5 -10 21 -7 -12 14 -11 0 -2 12 14 -5 -2 -4 14 0 -2 -9 1 -11 10 10 9 4 19 -19
4229 -19 -12 -11 -3 -10 -14 18 -5 4 -3 18 -10 10 7 -14 5 4 5 2 -23 -15 0 -13 10 11 -8 10 1 19 2 0 17 12 1 9 -2 -14 -1 -1 -4 -1
4269 -1 13 -3 8 0 2 3 13 3 20 -2 4 -19 9 5 15 -16 4 -1 12 -6 -5 1 -3 1 9 0 6 -22 -8 -25 -18 7 -4 -8 -2 -18 7 -4 -2
4308 -2 5 -7 4 -5 0 2 1 -2 -10 8 2 10 7 0 -3 -1 0 -9 -4 -18 2 12 6 -2 -1 -7 7 10 18 -22 6 17 2 -1 -5 9 -4 1 -3 -3 3 -4 -10 -4 -4 9 29
4355 29 33 2 -7 0 -6 -15 12 -14 -14 -13 -26 5 -14 -8 -2 -6 7 12 9 -1 19 -5 6 0 12 -3 -1 8 -7 7 14 -16 -5 23 -2 -4 6 9 16 9
4395 9 -12 17 -8 7 11 -8 0 9 8 -7 -4 -5 7 3 9 5 5 -22 7 1 3 10 -22 -15 6 -3 -6 15 -25 -7 -11 2 -10 -20 -13 -5 -10 -5 9 -10 -4 -15
4437 -15 4 7 7 12 -2 6 22 -11 -17 -9 -3 7 -8 21 -11 12 -8 -4 7 6 -12 -3 2 14 9 -2 -7 12 -2 11 -7 2 10 -22 -7 -11 -3 -2 -8 11
4477 11 11 -8 -5 -9 -9 0 9 11 -7 -7 -1 9 2 -1 1 -12 -8 1 18 -5 4 10 17 -10 -7 13 3 -4 6 -18 -1 -4 13 8 8 5 8 18 12 -6 0 1 4 -19
4521 -19 -8 7 -8 -7 -5 -13 -8 1 -2 -1 -8 -16 -4 -3 1 -25 -17 3 2 12 -1 -9 11 -19 -2 21 -6 2 -1 -10 -19 -10 -6 17 1 6 -20 7 24 13 -1
4562 -1 -12 -31 3 21 11 -9 15 6 -4 7 -5 10 6 12 -17 10 -9 -12 4 -4 -2 16 9 2 -14 -3 2 -2 10 22 20 -6 8 -9 -9 15 -10
4599 -10 15 -12 -1 4 -6 2 9 7 11 14 1 12 6 -1 -17 7 -10 -10 7 11 1 5 15 6 14 -5 11 1 -3 -13 -10 22 -20 -15 -9 29 0 -18 -5
4638 -5 -8 1 -2 1 -10 -2 -24 5 13 -11 -8 3 -9 -4 -6 -9 -5 2 5 -7 10 -3 13 4 20 4 7 3 1 -6 -17 30 -14 20 12 9 24 -6 11 8 25
4679 25 13 23 -1 13 3 17 -19 20 2 -5 -9 -16 6 20 -1 2 -8 3 -3 25 0 25 8 -18 -4 5 1 12 -12 -9 1 22 -12 3
4713 3 -2 24 0 4 13 2 -1 -9 6 0 10 8 18 0 8 22 4 -18 -4 -11 18 -13 -4 -2 -2 15 -2 6 -14 -6 -16 9 1 -3 -7 -7 -10 3 -14 6
4753 6 14 2 -1 -3 1 -2 27 0 21 -10 8 1 -17 18 2 15 3 2 8 15 17 19 -7 13 -6 27 11 13 10 6 20 -2 -9 28 6 10 10 0 10
4792 10 5 5 12 1 4 17 -18 -4 12 -8 -4 -3 -8 2 -21 -18 16 -7 -13 10 6 15 -14 -22 -6 8 1 -1 1 1 19 -12 7 -13 4 -21 0 -5 3
4831 3 19 9 -2 13 5 4 17 3 12 -30 -19 16 3 -6 6 2 0 18 11 -6 3 -7 -5 -11 3 3 8 -4 -3 21 -8 -3 10 5 8 -2 1 -1 -16 13
4871 13 18 -20 -25 -14 2 -14 -10 7 1 5 1 -10 -7 4 12 -3 -5 8 3 -5 5 -5 -3 3 4 14 -3 -15 -9 6 9 3 -11 -2 -6 2 -9 -6 -17 -1 -21
4912 -21 14 -3 6 -21 -5 1 -19 6 -25 -10 -7 4 -12 -7 -18 -10 -2 24 1 -12 1 -15 -8 4 3 -15 -9 -5 -17 -11 -11 -7 -17 3 0 3 -10 -11
4950 -11 4 -3 -3 4 10 -17 -1 -12 -2 3 -8 -10 -4 -7 11 8 20 -1 0 -6 3 10 -3 -17 -20 -8 -13 -5 -6 11 -2 4 -5 -4 -7 -11 20 -22 4 -4 1 -8 -6
4993 -6 -3 -15 -5 0 3 5 23 -23 -11 8 11 0 -7 15 8 16 12 2 -1 1 -3 -19 14 9 -4 -30 -1 15 17 -9 -21 9 -3 0 -13 -2 -13 -4 -6
5032 -6 -1 -7 3 0 -25 -3 -6 10 -5 -14 3 18 -1 9 23 -2 9 -2 -3 -1 -6 -16 13 12 27 1 17 16 -9 10 0 -7 19 11 2 2 17 -4
5070 -4 11 7 0 -10 -8 -14 11 -13 13 6 2 8 5 -7 -13 12 -1 4 9 -12 -1 -18 -1 -9 -6 16 11 -6 -10 -21 5 4 -18 1 -11 -7 -15 7 22 7
5110 7 -8 -5 -2 -15 -7 9 -12 -5 9 -1 14 3 1 23 18 5 12 -16 -1 4 -3 0 1 6 11 -3 1 0 -16 -10 -12 5 8 -1 -9 -8 7 -2 -5 -12 6 8 -17
5153 -17 1 7 1 2 -3 11 -8 2 4 -19 13 7 -9 -17 1 -12 -15 -10 4 -2 10 -14 17 19 -8 18 25 7 -19 16 10 5 14 5 -9 2 5 -17 0
5192 0 14 6 -5 -5 -3 8 -1 0 -3 -9 -3 8 2 1 15 -21 -6 -11 -12 4 -4 -4 8 -3 -6 14 4 4 8 7 3 -5 8 -4 -6 -9 12 21 11 4 26 -1 15
5235 15 17 -8 21 1 11 8 1 -4 4 4 18 -12 10 1 4 10 -3 5 2 10 -5 0 -17 2 8 2 4 -1 -4 0 -22 -1 0 29 14 -12 23 4 0 10 10
5276 10 0 4 -5 6 1 10 -6 -1 2 16 -7 2 13 6 5 -12 15 2 -2 -5 -12 -8 17 2 -6 4 9 -9 -1 20 5 -23 -21 1 0 21 -12 7 5 5
5316 5 4 -1 2 -4 3 -18 -2 -16 2 -15 11 2 -1 -3 1 -15 -18 11 9 8 -3 4 9 4 10 2 4 -16 12 8 12 -11 0 10 -6 -8 14 1 -10 -1 6 15 -14
5359 -14 17 0 -5 1 10 17 -7 -10 13 8 13 -16 13 -16 -7 -4 -12 13 24 -3 14 -13 10 7 19 -7 -3 0 3 2 -8 -28 -4 -22 -17 -22 -12 1 -3
5398 -3 14 -14 15 10 -1 -7 20 11 11 -2 8 12 -9 26 -4 7 8 20 12 2 -6 8 4 14 -8 17 22 11 3 7 5 15 17 15 1 8 -19 -3 20
5437 20 7 -7 9 -5 24 18 18 3 2 9 -5 4 12 6 -1 -5 -2 -15 6 -8 -3 1 6 -10 8 23 -3 -9 15 -11 -2 1 22 2 -7 -5 5 -2 3 -3 15
5478 15 4 -6 21 -2 -4 15 -8 0 -4 0 11 -8 -11 -9 24 0 10 -13 2 -11 7 12 4 11 22 9 3 -8 3 19 0 -6 16 -20 5 -1
5514 -1 5 -5 8 18 -4 3 4 -4 2 -7 -6 4 -7 12 5 9 -8 3 25 -23 14 1 -1 8 -28 10 6 16 -8 -2 -5 -9 5 2 11 -2 8 -4 13
5553 13 6 15 1 -9 2 -6 10 4 -1 3 15 17 1 0 -4 -6 -2 -9 -2 -12 2 17 -15 22 11 -7 8 20 2 15 0 -2 9 -5 16 -15 9
5590 9 25 -19 -3 5 4 6 10 17 7 -7 -4 -12 -11 -6 -14 -2 -9 11 4 1 2 -10 8 -15 -7 7 -6 6 5 11 24 -19 -4 5 5 14 6 7 -6 8 -7 -5
5632 -5 18 9 0 18 16 -6 -4 1 16 -7 8 4 8 6 14 1 2 -16 4 -11 7 -4 -10 9 22 11 1 21 6 8 -4 22 2 17 15 -6 4
5669 4 5 22 -3 3 15 1 4 20 10 -5 -4 -1 -3 -8 -13 -4 9 26 13 15 14 -6 7 4 -3 -10 -7 1 0 4 5 -13 6 -8 -9 -4 -4 -5 -5 4 -13 11 0
5712 0 -18 -11 23 -6 -11 2 0 -8 8 -3 -15 20 11 8 1 6 6 0 5 24 -6 -1 31 8 2 17 12 3 -3 -9 10 11 21 -15 9 16 -13 -7 4 -4 7
5753 7 -12 11 5 26 23 7 -14 3 -10 22 18 14 -1 17 -8 7 3 0 -7 -13 8 0 -4 6 9 -14 0 4 15 7 -1 6 -12 -13 -2 22 -6 -11 -8 -13
5793 -13 17 6 14 -14 5 -16 5 2 2 8 -2 -2 -13 -12 14 6 11 17 6 23 15 -1 6 -1 11 3 -7 8 7 23 3 -42 2 -8 -1 24 -17 28
5831 28 -6 -8 -8 5 2 15 26 -6 -9 -8 16 -6 -13 12 -18 8 11 12 -2 -12 -14 6 13 4 -21 -6 18 0 -7 -1 10 -2 -12 22 8 4 10 -12
5869 -12 3 1 -9 10 -8 13 2 3 7 -16 1 -5 -3 4 4 15 -8 -13 4 1 -5 -16 -12 -19 4 14 -10 12 5 7 -9 -2 -5 -4 12 6 -15 1 10 -9
5909 -9 16 8 -10 10 4 0 -20 17 -2 2 23 -21 25 4 -5 13 -7 0 6 4 -1 10 19 15 17 5 4 2 14 10 -13 7 11 3 14 13 4 13 14 0 29
5950 29 9 4 6 -12 12 -10 5 -3 12 7 5 10 -6 28 -9 3 -12 9 -1 16 -18 -2 8 8 12 -1 18 14 2 1 7 10 -7 10 -3 -8 -7
5987 -7 -7 17 7 -2 3 7 2 4 0 10 6 13 -4 -1 -11 -2 -1 16 7 -18 -8 13 17 17 19 6 8 18 -12 11 17 5 -13 1 -10 0 -2 21 12 -5 12
6028 12 -3 12 2 -4 2 2 12 11 0 16 15 12 3 -9 3 17 12 1 5 -14 7 -8 0 27 11 -6 14 2 -13 -8 22 13 -11 5 6 5 -8
6065 -8 22 2 6 2 5 -2 10 -10 -5 9 -18 4 4 -6 -8 0 11 27 -4 14 1 12 1 23 -17 8 3 -9 10 6 -7 -4 17 -1 -1 -1 -18
6102 -18 -10 8 2 5 -10 -6 -12 0 -8 3 -7 -8 -1 13 14 30 20 -17 1 12 24 -11 29 12 -4 -1 3 -5 12 7 16 5 20 -3 8 7 22 21
6140 21 24 6 -2 9 5 12 -9 20 2 26 -6 -2 32 -3 0 11 -1 -2 20 14 0 1 4 -20 -9 22 -24 13 18 11 -11 -2 7 9 9 -3 26 -11
6178 -11 10 3 9 -2 3 28 17 18 14 10 5 11 24 -3 -15 -6 -10 13 11 -7 -4 -5 -11 20 -10 1 7 6 8 1 -3 -3 -5 3 2 4 -1 17 3 -3 3 4 -3 -13 12
6223 12 -5 20 13 -15 5 -6 14 -2 7 10 18 -2 5 15 -7 12 11 20 3 13 5 3 5 7 -7 11 -2 15 -15 9 23 7 25 -17 2 3
6259 3 -2 -8 -10 8 8 -8 8 11 5 16 -9 6 -6 6 -5 4 5 10 21 13 6 14 15 11 0 -7 -6 15 -11 1 22 -8 1 -2 0 4 -2 -1 16 10 0 3 11
6302 11 -14 20 6 -6 3 -4 11 6 -4 -3 1 11 -4 23 10 4 10 18 13 0 3 15 -1 3 5 -15 -2 22 27 0 21 11 27 26 18 4 10 -6
6340 -6 -8 1 5 30 -3 -5 7 10 2 13 1 -15 15 5 12 3 10 10 30 2 0 3 -3 2 7 14 11 7 4 10 -11 10 -7 25 -3 7 -2 9 17 3 8 -4
6382 -4 -7 -13 -14 10 2 -10 13 13 -7 -4 -9 5 31 15 12 -3 3 7 4 19 -2 7 11 -14 -4 8 12 -12 11 -6 3 1 -1 17 -6 -2 25 19 5 0 -15
6423 -15 -24 -10 8 14 4 -10 4 10 -8 3 8 11 -19 16 7 -10 7 -11 -7 13 18 2 -7 -5 13 13 15 1 7 3 -9 6 -6 11 -16 10 -9
6460 -9 8 13 8 -15 20 8 13 7 -20 -1 -8 15 9 -12 -12 1 24 9 4 2 -12 0 18 8 25 8 9 29 3 8 -10 22 26 -7 5 -10 9
6497 9 11 -3 -8 12 -1 13 28 2 16 8 1 16 10 34 4 -6 8 -1 1 1 0 7 -2 -2 -3 -11 -4 15 26 18 26 24 -15 -21 -9 4 0 -3 3 -16 12 9
6539 9 -8 17 -4 7 17 -12 2 0 -12 -4 14 4 -6 -4 3 4 6 -1 -18 -2 -20 -2 8 -8 10 1 9 6 2 -1 -3 7 8 -5 7 -1 -8 27 1
6578 1 11 -4 13 34 6 7 8 -10 13 12 -7 19 4 15 12 19 -3 -6 16 14 26 -7 13 -4 -4 12 2 22 16 12 -8 11 -2 -17 5 1
6614 1 -25 17 -7 -6 10 1 5 5 14 3 2 5 9 5 12 3 0 7 4 -6 6 0 -6 29 2 7 15 -11 4 0 -17 16 8 21 -1 -17 6 1 5 11 21 -7
6656 -7 -1 6 2 8 10 11 -14 4 20 2 9 11 15 1 9 -2 6 0 -3 20 11 9 16 11 -10 -7 0 17 16 -3 2 6 -4 1 5 0 4 3 7 -8 6 10 15 10 0 -14
6702 -14 5 16 3 -2 14 7 4 1 22 3 -6 -4 11 26 7 8 0 18 6 4 28 7 20 12 3 12 6 -3 8 8 7 13 25 3 11 1 -19 17 2
6741 2 24 7 3 6 1 19 -12 1 1 0 -2 12 9 -2 0 -8 17 5 -8 11 -5 2 3 1 0 -19 -9 5 -9 9 7 -16 -6 8 -6 -19 13 7
6779 7 14 9 -1 6 7 6 18 -1 2 7 -6 10 15 3 27 16 10 9 -3 14 15 18 1 8 6 8 0 6 -6 8 5 8 15 -3 13 7 -2 -3 7 15 -1 23 5
6822 5 -16 10 -5 -8 13 5 15 8 -3 23 -12 7 11 -1 -11 -2 -14 3 -5 3 16 1 4 -2 16 16 -4 0 2 25 -5 7 -6 8 12 -7 16
6859 16 7 -6 -2 -8 -11 0 5 -9 -10 11 -19 3 1 10 -7 6 10 -5 -3 6 8 0 -1 7 -8 16 2 -14 2 24 12 -4 11 12 -6 8 0 6 -1 23
6899 23 15 18 12 10 11 8 1 6 0 -14 -4 15 2 0 17 11 13 3 8 8 4 8 6 5 2 12 -5 6 4 7 13 -14 -4 21 3 13 -2 -12 1 -3 5 11 4
6942 4 12 -3 7 -1 14 -7 -9 -5 -4 13 14 14 12 8 17 8 3 5 3 6 -4 -12 -6 -4 -7 -3 9 19 11 0 3 18 4 7 -3 0 1 6 -18 12 1 -10 5 -5
6986 -5 20 1 19 5 -5 1 -7 -13 8 9 -6 -1 -1 5 -13 2 9 -1 -8 7 -5 17 -13 36 0 1 8 21 -17 5 6 -4 -8 22 3 1 3 -14
7024 -14 17 -2 9 25 6 -5 14 -2 -5 -7 -6 2 -6 12 -23 6 -3 12 14 9 11 0 -2 -8 3 3 -7 -14 8 -2 -23 -5 1 1 -3 1 1 12 1
7063 1 -5 0 20 -8 6 15 13 11 2 8 4 3 7 -9 2 3 -10 -21 -4 15 18 -2 -7 9 8 10 9 10 -1 -8 -1 -2 4 5 -15 -13 9 8 0 12 12 -6 8 10
7107 10 -5 -5 -15 19 14 8 -2 -11 16 3 13 2 -20 -8 11 -3 2 5 11 20 7 -3 27 -1 15 13 15 8 -8 9 1 -7 19 16 4 12 21 7
7145 7 -10 -6 10 8 -9 7 -12 10 1 -1 -10 4 3 -1 -13 0 3 10 -18 0 0 4 -7 -3 11 23 1 -1 -2 -10 13 2 6 11 -1 -5 8 0 8 18 26
7186 26 7 -7 22 20 -9 17 18 -14 16 -10 -13 17 10 5 0 18 -13 0 7 -1 5 -7 -5 6 -2 17 2 -10 -13 11 -7 7 -3 4 -2 1 -4 23
7224 23 10 -12 -3 8 -18 -8 1 -4 0 9 7 23 -7 7 36 12 19 6 10 1 1 -11 4 15 -1 -8 1 -10 10 3 -7 1 -2 -6 9 4 3 -10 17
7263 17 -5 1 17 0 2 -17 5 -5 -7 4 2 -16 6 -19 -12 -5 -3 15 13 4 -5 15 -3 8 -5 -5 -1 0 -14 12 -9 -3 13 10 -1 10 7 6 -10
7302 -10 10 11 8 3 13 2 0 2 -7 -7 -1 2 -3 -11 0 8 -9 1 -8 -2 20 -4 5 -18 7 3 -9 17 1 7 -7 -4 -6 14 21 6 13 1 9 -4 1 -1
7344 -1 5 12 -3 -10 8 -6 15 4 5 -6 12 -1 2 7 10 3 -7 0 -2 -3 10 -2 15 12 6 18 3 -9 -11 -2 7 8 -15 3 6 -4 -6 12 7 -11 -6
7385 -6 -6 -4 -2 8 -17 5 9 17 0 -5 10 17 7 -1 -1 7 5 -6 -5 -23 6 19 27 1 -11 -3 3 13 -27 -6 3 1 -11 -4 23 16 2 -3 -7 -5 -16 -10
7427 -10 -7 -9 -1 -9 10 25 10 -14 -3 5 -2 -3 17 -25 -17 -10 3 -20 -4 -18 -21 16 6 -1 13 8 3 6 14 -15 14 -4 17 3 -10 -10 -5 -9 -8 -1
7467 -1 -1 -3 1 12 -1 6 13 3 -6 7 -2 2 4 1 -12 16 -9 6 -4 21 3 8 3 -8 3 -2 11 2 6 -3 23 10 19 -18 -6 2 11 11 5 -11 8
7508 8 7 16 6 16 -13 10 -10 -8 17 -17 6 -1 14 -10 13 1 -18 -22 8 -4 1 9 15 -4 11 -3 -4 5 4 -3 21 -14 3 10 -20 4 19
7545 19 -10 -9 15 -4 15 12 8 -1 -6 0 23 -12 -10 20 -10 -6 6 -5 -7 6 -3 11 17 -9 -4 -4 13 -16 0 4 1 12 7 7 -3 12 12 6 22 3
7585 3 7 4 2 6 -1 2 5 18 10 -17 3 4 9 -9 4 4 11 -7 19 4 13 8 -6 -12 -2 11 -4 -3 -20 2 8 16 18 3 -16 -16 2 10 12 -3 -16 15
7627 15 5 25 5 8 10 -13 2 -4 -3 8 13 -12 -12 -6 11 -16 18 -15 8 3 -6 -14 -11 8 1 -11 -12 -16 11 24 2 6 18 -1 -7 7 2 -6 19
7666 19 3 8 6 16 13 -10 14 0 14 3 8 -5 16 -20 -7 -7 18 -12 11 6 -15 0 13 7 2 -2 0 -8 -8 -5 1 -18 3 -1 -9 13 -5 -2 7
7705 7 9 -12 2 -20 -16 -11 -25 -2 -19 -12 -13 -11 -14 -23 -4 0 -9 1 -6 8 -2 5 12 -6 -11 11 13 6 11 7 23 -6 -2 12 13 4 3 2 8 6 5 24 13 -7
7749 -7 20 2 -3 15 -14 4 0 11 -2 10 -3 -5 -9 10 5 15 15 -7 -22 -2 18 0 -4 7 -11 -6 2 -8 3 -6 3 -3 -2 21 4 -13 6
7786 6 -1 5 -5 -6 7 11 20 -1 -4 -5 -5 22 -2 17 5 0 -3 4 -6 3 4 0 2 -15 -4 10 10 3 -28 -8 -23 3 -12 -9 -1 -4 -7 -21 -21 -21 -6 -4 -7
7829 -7 -9 8 3 -12 -17 -1 4 -13 -5 -11 17 -5 -10 16 -20 -5 0 9 9 -1 -10 0 24 5 -11 -1 -7 -2 13 8 -19 1 8 -8 -4 5 16 -1 4 20
7869 20 8 -26 -16 2 -16 -7 20 5 9 3 1 -6 3 15 10 17 10 -5 -13 -9 -2 0 -4 -10 -1 1 -5 7 15 7 13 19 7 18 8 -13 7 5 -8 -12 16 3
7911 3 -21 -7 10 2 -16 7 4 -4 5 3 0 11 -4 7 -14 -5 7 15 0 -4 8 0 -19 -2 -19 9 -19 -17 -24 8 3 -13 6 -2 -8 23 -21 14
7949 14 1 10 11 7 15 8 21 1 5 -8 -19 9 12 6 10 16 -2 9 -3 7 -1 8 4 4 -5 16 20 -3 19 -4 -6 3 19 9 -4 -11 -8 -4 4 -16 21
7990 21 -18 -7 -2 8 0 17 -24 20 14 -4 -4 6 8 -9 2 -2 4 4 -17 -8 15 -3 -9 -1 6 12 6 -4 1 -18 -4 6 -11 1 15 -4 17 9
8028 9 7 -1 -7 14 18 3 -17 13 -12 5 -5 -2 -1 5 2 -3 -8 -4 0 5 3 17 12 1 9 -16 -6 -16 -7 -7 11 9 1 -18 9 16 -3 -28 26 5 -17
8069 -17 26 14 -7 11 7 -11 0 21 2 5 1 9 -6 3 5 5 -8 -12 8 9 31 3 11 16 -3 4 -4 3 1 -12 -1 4 12 -12 -8 -12 3 -15 3 2
8109 2 -2 13 1 -5 0 -8 3 4 -11 10 -2 8 -3 -6 -6 -11 2 -7 16 1 2 14 -8 2 0 4 4 8 5 12 9 6 23 1 12 6 9 19 30 15 0
8150 0 7 -2 9 -12 24 3 4 -15 17 -5 20 5 -9 -5 13 15 12 4 22 -6 6 -12 2 -18 6 -15 7 5 -8 11 -8 -6 20 18 6 17
8186 17 7 1 9 17 4
8191D
##END NTUPLES=NMR FID
##END=
