##TITLE=1H_DE-73_13
 D2O
 8 sc, 
 7.11.2024
##JCAMPDX= 6.0         $$ Bruker NMR JCAMP-DX V2.0
##DATA TYPE= NMR FID
##DATA CLASS= NTUPLES
##ORIGIN= UXNMR, Bruker Analytische Messtechnik GmbH
##OWNER= root
$$ XWIN-NMR		Version 3.5
$$ Thu Nov  7 16:22:50 2024 Russian Standard Time (UT+4h)  she@DPX200
##.OBSERVE FREQUENCY= 200.1318
##.OBSERVE NUCLEUS= ^1H
##.DELAY= (6, 6)
##.ACQUISITION MODE= SIMULTANEOUS
##.ACQUISITION SCHEME= undefined
##.AVERAGES= 8
##.DIGITISER RES= 18
##SPECTROMETER/DATA SYSTEM= spect
##.PULSE SEQUENCE= zg30
##.SOLVENT NAME= D2O
##.SHIFT REFERENCE= (INTERNAL, D2O, 0, 15.7039)
##AUDIT TRAIL= $$ (NUMBER, WHEN, WHO, WHERE, WHAT)
$$ ##TITLE= Audit trail, XWIN-NMR		Version 3.5
$$ ##JCAMPDX= 5.01
$$ ##ORIGIN= Bruker BioSpin GmbH
$$ ##OWNER= she
$$ F:/spectra/data/she/nmr/H-F/1/audita.txt
$$ ##AUDIT TRAIL=  $$ (NUMBER, WHEN, WHO, WHERE, WHAT)
(   1,<2024-11-07 16:21:28.03 +0400>,<she>,<DPX200>,
      <created by zg, POWCHK disabled, PULCHK disabled
       configuration hash MD5:
       00 E9 B6 7A A2 85 ED C7 34 08 36 98 17 FE 4E 26
       data hash MD5: 16K
       14 C3 EE E1 51 86 CD 62 CD 37 E4 9D 05 8E B5 69>)
$$ ##END=
$$ 
$$ hash MD5
$$ 8B E9 22 D5 00 54 CD CF 06 A2 08 D0 B5 CD B6 02
##$RELAX= 
##$RELAX= 
##$RELAX= 
##$RELAX= 
##$RELAX= 
##$RELAX= 
$$ Bruker specific parameters
$$ --------------------------
##$DU= <F:/spectra>
##$EXPNO= 1
##$NAME= <H-F>
##$PROCNO= 1
##$TYPE= <nmr>
##$USER= <she>
##$AMP= (0..31)
100 100 100 100 100 100 100 100 100 100 100 100 100 100 100 100 100 100 
100 100 100 100 100 100 100 100 100 100 100 100 100 100 
##$AQSEQ= 0
##$AQ_mod= 1
##$AUNM= <au_zg>
##$AUTOPOS= <>
##$BF1= 200.13
##$BF2= 200.13
##$BF3= 200.13
##$BF4= 200.13
##$BF5= 200.13
##$BF6= 200.13
##$BF7= 200.13
##$BF8= 200.13
##$BYTORDA= 1
##$CFDGTYP= 0
##$CFRGTYP= 5
##$CHEMSTR= <none>
##$CNST= (0..31)
1 1 145 1 1 1 1 1 1 1 1 1 1 1 1 1 1 1 1 1 1 1 1 1 1 1 1 1 1 1 1 1 
##$CPDPRG= <>
##$CPDPRG1= <>
##$CPDPRG2= <>
##$CPDPRG3= <>
##$CPDPRG4= <mlev>
##$CPDPRG5= <mlev>
##$CPDPRG6= <mlev>
##$CPDPRG7= <mlev>
##$CPDPRG8= <mlev>
##$CPDPRGB= <>
##$CPDPRGT= <>
##$D= (0..31)
0 1.2 0 0 0 0 0 0 0 0.06 0 0.03 0 0 0 0 0.0002 0 0 0 0 0 0 0 0 0 0 0 0 
0 0 0 
##$DATE= 1730982087
##$DBL= (0..7)
120 120 120 120 120 120 120 120 
##$DBP= (0..7)
150 150 150 150 150 150 150 150 
##$DBP07= 0
##$DBPNAM0= <>
##$DBPNAM1= <>
##$DBPNAM2= <>
##$DBPNAM3= <>
##$DBPNAM4= <>
##$DBPNAM5= <>
##$DBPNAM6= <>
##$DBPNAM7= <>
##$DBPOAL= (0..7)
0.5 0.5 0.5 0.5 0.5 0.5 0.5 0.5 
##$DBPOFFS= (0..7)
0 0 0 0 0 0 0 0 
##$DE= 6
##$DECBNUC= <off>
##$DECIM= 24
##$DECNUC= <off>
##$DECSTAT= 4
##$DIGMOD= 1
##$DIGTYP= 9
##$DL= (0..7)
0 120 120 120 120 120 120 120 
##$DP= (0..7)
150 150 150 150 150 150 150 150 
##$DP07= 0
##$DPNAME0= <>
##$DPNAME1= <>
##$DPNAME2= <>
##$DPNAME3= <>
##$DPNAME4= <>
##$DPNAME5= <>
##$DPNAME6= <>
##$DPNAME7= <>
##$DPOAL= (0..7)
0.5 0.5 0.5 0.5 0.5 0.5 0.5 0.5 
##$DPOFFS= (0..7)
0 0 0 0 0 0 0 0 
##$DQDMODE= 0
##$DR= 18
##$DS= 0
##$DSLIST= <SSSSSSSSSSSSSSS>
##$DSPFIRM= 0
$$ [...]
##$SUBNAM2= <"">
##$SUBNAM3= <"">
##$SUBNAM4= <"">
##$SUBNAM5= <"">
##$SUBNAM6= <"">
##$SUBNAM7= <"">
##$SUBNAM8= <"">
##$SUBNAM9= <"">
##$SW= 24.0689170037331
##$SWIBOX= (0..15)
0 0 2 0 0 0 0 0 0 0 0 0 0 0 0 0 
##$SW_h= 4816.95568400771
##$TD= 16384
##$TD0= 1
##$TE= 0
##$TE2= 300
##$TE3= 300
##$TEG= 300
##$TL= (0..7)
0 120 120 120 120 120 120 120 
##$TP= (0..7)
150 150 150 150 150 150 150 150 
##$TP07= 0
##$TPNAME0= <>
##$TPNAME1= <>
##$TPNAME2= <>
##$TPNAME3= <>
##$TPNAME4= <>
##$TPNAME5= <>
##$TPNAME6= <>
##$TPNAME7= <>
##$TPOAL= (0..7)
0.5 0.5 0.5 0.5 0.5 0.5 0.5 0.5 
##$TPOFFS= (0..7)
0 0 0 0 0 0 0 0 
##$TUNHIN= 0
##$TUNHOUT= 0
##$TUNXOUT= 0
##$USERA1= <user>
##$USERA2= <user>
##$USERA3= <user>
##$USERA4= <user>
##$USERA5= <user>
##$V9= 5
##$VALIST= <valist>
##$VCLIST= <CCCCCCCCCCCCCCC>
##$VD= 0
##$VDLIST= <DDDDDDDDDDDDDDD>
##$VPLIST= <PPPPPPPPPPPPPPP>
##$VTLIST= <TTTTTTTTTTTTTTT>
##$WBST= 1024
##$WBSW= 4
##$XGAIN= (0..3)
0 0 0 0 
##$XL= 0
##$YL= 0
##$YMAX_a= 326422
##$YMIN_a= -328964
##$ZGOPTNS= <>
##$ZL1= 120
##$ZL2= 120
##$ZL3= 120
##$ZL4= 120
##$ABSF1= 10
##$ABSF2= 0
##$ABSG= 5
##$ABSL= 3
##$ALPHA= 0
##$AQORDER= 0
##$ASSFAC= 0
##$ASSFACI= 0
##$ASSFACX= 0
##$ASSWID= 0
##$AUNMP= <proc_1d>
##$AZFE= 0.1
##$AZFW= 0.1
##$BCFW= 1
##$BC_mod= 2
##$BYTORDP= 1
##$COROFFS= 0
##$CY= 11.3945322036743
##$DATMOD= 1
##$DC= 2
##$DFILT= <>
##$DTYPP= 0
##$F1P= 15.6554695791079
##$F2P= 12.8336369535428
##$FCOR= 0.5
##$FTSIZE= 0
##$FT_mod= 4
##$GAMMA= 1
##$GB= 0.15
##$INTBC= 1
##$INTSCL= 1
##$ISEN= 128
##$LB= 0.24
##$LEV0= 0
##$LPBIN= 0
##$MAXI= 10000
##$MC2= 0
##$MEAN= 0
##$ME_mod= 0
##$MI= 1.114404
##$NCOEF= 0
##$NC_proc= 0
##$NLEV= 6
##$NOISF1= 3.799351
##$NOISF2= 2.8
##$NSP= 1
##$NTH_PI= 0
##$NZP= 0
##$OFFSET= 15.70392
##$PC= 1
##$PHC0= -26718.37
##$PHC1= 20.18744
##$PH_mod= 1
##$PKNL= yes
##$PPARMOD= 0
##$PSCAL= 0
##$PSIGN= 0
##$REVERSE= no
##$SF= 200.130013532006
##$SI= 16384
##$SIGF1= 3
##$SIGF2= 2
##$SINO= 400
##$SIOLD= 16384
##$SREGLST= <1H.CDCl3>
##$SSB= 0
##$STSI= 0
##$STSR= 0
##$SW_p= 3612.71676300578
##$SYMM= 0
##$S_DEV= 0
##$TDeff= 0
##$TDoff= 0
##$TI= <>
##$TILT= no
##$TM1= 0
##$TM2= 0
##$TOPLEV= 0
##$USERP1= <user>
##$USERP2= <user>
##$USERP3= <user>
##$USERP4= <user>
##$USERP5= <user>
##$WDW= 1
##$XDIM= 8192
##$YMAX_p= 0
##$YMIN_p= 0
$$ End of Bruker specific parameters
$$ ---------------------------------
##NTUPLES= NMR FID
##VAR_NAME=  TIME,          FID/REAL,        FID/IMAG
##SYMBOL=    X,             R,               I
##VAR_TYPE=  INDEPENDENT,   DEPENDENT,       DEPENDENT
##VAR_FORM=  AFFN,          ASDF,            ASDF
##VAR_DIM=   8192,          8192,            8192
##UNITS=     SECONDS,       ARBITRARY UNITS, ARBITRARY UNITS
##FACTOR=    0.0002076,     1,               1
##FIRST=     0,             0,               0
##LAST=      1.7004516,     0,               0
##MIN=       0,             -328964,         0
##MAX=       1.7004516,     326422,          0
$$ Real data points
##PAGE= N=1
##DATA TABLE= (X++(R..R)), XYDATA
$$ [...]
$$ plain form
2416 -4915 720 5861 -1911 -5868 4029 4658 -4048 -3470 3184 3985 -4503 -3877 5967 1626 -5575 -587
2432 -587 4738 1172 -5760 -374 6600 -2024 -5576 3187 4585 -1838 -4814 2633 5099 -4831 -3362
2447 -3362 5442 2010 -4152 -2618 4588 2510 -6559 -341 5750 -1115 -4799 99 5296 -1270 -6165
2462 -6165 2783 4956 -3782 -3367 3184 3277 -3630 -3989 5406 2571 -5578 -663 4956 958 -4738 -905
2478 -905 6269 -352 -5894 2454 4253 -1720 -4372 1623 5226 -3682 -4607 4912 2735 -4013 -2656
2493 -2656 4250 2533 -5187 -1416 6089 -476 -4800 468 4540 -298 -5630 1282 5751 -3304 -3880
2508 -3880 3676 3319 -2851 -3963 4186 3306 -5578 -1439 4697 946 -4245 -1349 5547 170 -5953
2523 -5953 1567 4863 -1830 -3976 1406 5228 -2769 -4687 4226 3489 -4208 -2064 3649 2756 -4512
$$ packed form
2416d915N635N141p772l957R897O29q706N78O654Q01q488O26R844m341p201M988
2432e87N325l566o932N386O974q624l552Q763J398o423k976P447K466r930J469
2447c362Q804l432o162J534P206k078r069O218O091o865l684M898N197o566m895
2462f165Q948K173q738M15O551R3o907l59R395k835q149M915N619l998n696L833
2478i05P174o621n542Q348J799n973k652N995L603q908r25R519k177o748J357
2493b656O906j717p720L771P505o565m324N268M072m838n332O912M469r055n76
2508c880P556l57o170j112Q149q80q884M139O136l751n191K896O896n377o123
2523e953P520L296o693k146N382L822p997j918Q913p37p697K144N713q93p268
$$ plain form
2538 -4512 -2320 5835 165 -5229 772 3736 -12 -4698 665 5454 -2672 -4243 3165 3372 -2205
2553 -2205 -3821 3363 3688 -5038 -1984 4683 794 -3680 -1481 4565 1190 -5638 345 5469 -1683
2568 -1683 -3572 1470 3971 -1301 -5106 3273 3679 -4061 -2437 3048 2418 -3564 -2798 5359 677 -5202
2584 -5202 324 4386 198 -4450 221 5209 -1664 -4542 2895 3666 -2440 -3336 2435 3726 -4092
2599 -4092 -2923 4613 1412 -3818 -1377 3599 1826 -4886 -584 5159 -1201 -3921 908 3760 -1154
2614 -1154 -4486 2370 4162 -3280 -2715 3376 2332 -3291 -3011 3995 1686 -4964 -306 4410 -28
2629 -28 -3574 -224 4424 -234 -4719 2169 3421 -2271 -2956 1632 3833 -2852 -3319 4193 1882 -3641
2645 -3641 -1649 3398 1782 -4465 -1099 4784 -500 -4314 1041 3874 -840 -3624 1153 4246 -2714
$$ packed form
2538d512K192Q155n670n394O001K964l748m686N363M789q126j571P408K07n577
2553b205j616P184L25q726L054O667l889m474K199O046l375o828N983N124p152
2568a683j889N042K501n272l805Q379M06p740J624N485o30n982P66Q157m682n879
2584e202N526M062m188m648M671M988o873k878P437P71o106q96N771J291p818
2599d092J169P536l201n230K441M976j773o712M302N743o360k720M829K852m914
2614a154l332O856J792p442N65O091j044n623K80P006k309o650M658M716m438
2629b8l546L350M648m658m485O888J252n692o85M588K201o685m67P512k311n523
2645c641J992N047j616o247L366N883n284l814N355K833m714k784M777L093o960
$$ plain form
2660 -2714 -3139 3552 1948 -2768 -2517 3122 2877 -4445 -1037 4236 -117 -3424 -701 4169 -87 -4700
2676 -4700 1456 3929 -2008 -3448 1590 3407 -2063 -3220 3408 2460 -3922 -1436 3620 1484 -3437
2691 -3437 -1473 4217 377 -4403 834 3267 -714 -3113 471 4410 -2236 -3598 2946 2195 -1986
2706 -1986 -2628 2865 2649 -4155 -1889 3979 570 -3393 -349 3650 525 -3877 531 4245 -1900
2721 -1900 -3334 1946 2475 -1446 -3558 2636 2671 -4015 -1282 2819 1091 -2620 -1870 3838 491 -4335
2737 -4335 548 3397 -162 -3310 640 3844 -1271 -3716 2351 3054 -2845 -2140 2366 2682 -2796 -2241
2753 -2241 4118 899 -4033 -192 2986 949 -3776 197 4579 -1426 -2992 1625 2857 -1650 -2817
2768 -2817 2185 3131 -3244 -2300 2779 1578 -2593 -1534 2973 1132 -3828 -296 3749 -545 -2959
$$ packed form
2660b714m25O691j604m716K51N639k45p322L408N273m353l307K723M870m256m613
2676d700O156K473n937j440N038J817n470j157O628r48o382K486N056k136m921
2691c437J964N690l840m780N237K433l981k399L584L939o646j362O544p51m181
2706a986o42N493k16o804K266N868l409l963L044L999l125m402M408L714o145
2721a900j434N280N29l921k112O194L5o686K733M101j728l711P50N708l347m826
2737d335M883K849l559l148L950L204n115k445O067P03n899P05M506L16n478N55
2753b241O359l219m932L841L178k037m725L973M382o005j566M617J232m507j167
2768b817N002R46o375R44N079j201m171J059M507j841m960L532M045m294k414
$$ plain form
2783 -2959 348 3230 -542 -4299 1806 3449 -2489 -2237 2098 2900 -2468 -2461 3745 1187 -3577 -828
2799 -828 2896 1047 -3423 -247 3671 -601 -3229 1275 2981 -1247 -2726 997 3262 -2187 -2845
2814 -2845 3175 1794 -2399 -1606 2726 2078 -3635 -1077 3667 -423 -2827 200 3167 -267 -3619
2829 -3619 1723 3212 -2189 -2755 1997 2251 -2199 -2279 2619 1757 -3295 -1081 3231 522 -2697 -889
2845 -889 3313 525 -3844 1074 2717 -1173 -2841 798 3263 -1922 -2893 2659 1837 -2348 -1739 1991
2861 1991 1747 -3112 -1358 3163 -106 -2777 600 2798 -1 -3015 753 3118 -1565 -2620 1996
2876 1996 1991 -1584 -2615 1840 2338 -3010 -1305 2874 641 -2189 -1096 2803 591 -3742 606 3119
2892 3119 -817 -2636 740 2718 -1151 -2804 2004 2160 -2544 -1360 2158 1750 -2249 -1692 3182 648
$$ packed form
2783b959L307K882l772l757O105J643n938K52M335Q02n368PO206k558m764K749
2799h28L724j849m470L176L918m272k628M504J706m228j479L723K265n449o58
2814b845O020j381m193P93M332o48n713K558M744m090k404L027K967l434l352
2829c619N342J489n401n66M752K54m450q0M898q62n052K214M312k709l219J808
2845h89M202k788m369M918J643l890j668L639K465n185r71N552q22m185O09L730
2861A991k44m859J754M521l269k671L377K198k799l014L768K365m683j055M616
2876A996nl575j031M455M98n348J705M179k233k830J093L899k212m333M348K513
2892C119l936j819L376J978l869j653M808J56m704J184L518m08l999N57M874k534
$$ plain form
2908 648 -3361 -98 2585 298 -2361 128 3197 -728 -2968 1657 2255 -1519 -1775 1664 2574 -2497
2924 -2497 -1947 2699 1002 -2284 -1073 2626 669 -3272 -210 3382 -789 -2566 563 2250 -820
2939 -820 -2820 1645 2566 -2193 -1377 1894 1442 -2040 -1933 2545 1198 -3309 -301 2077 154 -2419
2955 -2419 -249 3005 -682 -2978 1214 2008 -1589 -1879 1742 2353 -1961 -2308 2890 1146 -2176 -946
2971 -946 2076 1347 -2697 -737 2954 -490 -2389 667 2330 -406 -2483 1338 2756 -1922 -1845 2146
2987 2146 1504 -1564 -1719 2141 1476 -3003 -783 2938 3 -2200 -361 2440 -5 -3194 990 2746
3003 2746 -1191 -1851 964 1879 -1290 -2051 2406 1340 -2166 -909 1885 897 -2348 -1097 3065 107
3019 107 -2829 597 2150 -426 -2355 638 2519 -1368 -2417 1847 1404 -1633 -1702 1672 1968 -2562
$$ packed form
2908F48m009L263K683k287k659K489L069l925k240M625N98l774k56L439R10n071
2924b497N50M646j697l286J211L699j957l941L062L592m171j777L129J687l070
2939h20k000M465R21m759Q16L271m52l482J07M478j347m507L008K378j923k573
2955b419K170L254l687k296M192P94l597k90L621O11m314l47N198j744l322J230
2971i46L022p29m044J960L691l444j899L056J663k736k077L821J418m678P7L991
2987B146o42l068j55L860o65m479K220L721k935k203J839K801k445l189M184J756
3003B746l937o60K815R15l169p61M457j066l506J257K794r88l245J251M162k958
3019A07k936L426J553k576j929K993J881l887j049M264m43l037o9L374K96m530
$$ plain form
3035 -2562 -1135 2464 203 -2600 -434 2334 398 -2837 621 2948 -956 -2125 910 1731 -1086
3050 -1086 -2382 1778 1836 -2241 -1222 1848 622 -1529 -1219 2285 571 -2814 143 2406 -402 -1931
3066 -1931 404 2565 -769 -2368 1516 1860 -1397 -1715 1143 1667 -1506 -1328 2551 868 -2478 -565
3082 -565 1724 573 -2656 77 2793 -630 -2276 1058 1618 -1090 -2232 1179 1685 -2283 -1089 2082
3098 2082 877 -1443 -1254 2271 979 -2489 110 2243 -218 -1908 81 2236 -151 -2317 828
3113 828 2067 -1376 -1526 1174 1501 -1722 -1498 1999 799 -2189 -600 2086 614 -2233 -485 2629
3129 2629 -572 -2245 497 1838 -811 -1764 986 2017 -1363 -1865 1477 1100 -1609 -1054 1324 1045
3145 1045 -2303 -612 2680 -165 -2039 258 1643 -54 -2531 598 1959 -1387 -1739 923 1476
$$ packed form
3035b562J427L599k261k803K166K768j936l235L458K327l904j169L035Q21k817
3050a086j296M160N8m077J019L070j226k151L10L504j714l385K957K263k808j529
3066a931K335K161l334j599L884L44l257l18K858N24l173J78L879j683l346J913
3082e65K289j151l229K733K716l423j646L334N60k708j142L411N06l968J194L171
3098B082j205k320J89L525j292l468K599K133k461j690J989K155k387k166L145
3113H28J239l443j50K700L27l223K24L497j200k988J589K686j472k847J748L114
3129B629l201j673K742J341k649r53K750J031l380n02L342l77k709N55K378k79
3145A045l348J691L292k845j874K297J385j697k477L129J361l346l52K662N53
$$ plain form
3160 1476 -1152 -1722 1643 1268 -2053 -914 1806 604 -1690 -473 2318 385 -2228 414 1850
3175 1850 -682 -1803 559 1961 -1000 -2066 1528 1443 -1205 -975 1155 1109 -1777 -677 2165 79
3191 79 -2033 -68 1701 87 -2383 166 2258 -1017 -1615 921 1395 -848 -1679 1132 1529 -1841
3207 -1841 -640 1526 537 -1558 -404 2038 139 -2269 422 1838 -555 -1595 185 1740 -791
3222 -791 -1824 1658 1408 -1173 -1188 1078 1292 -1003 -1151 1899 711 -2015 -67 1444 207 -1682
3238 -1682 -37 1878 -567 -1802 997 1149 -913 -1407 937 1707 -1367 -1353 1653 681 -1413 -741 1451
3255 1451 670 -1848 20 2238 -362 -1433 355 1420 -267 -1546 1101 1536 -1480 -1007 1301 1009
3271 1009 -1467 -1156 1588 629 -1941 -452 1572 228 -1420 -404 1746 -247 -2006 1001 1346 -597
$$ packed form
3160A476k628n70L365l75l321J139K720j202k294J217K791j933k613K642J436
3175A850k532j121K362J402k961j066L594q5k648K30K130m6k886J100K842k086
3191G9k112J965J769j614k470K549K092l275n98K536M74k243q31K811L97l370
3207a841J201K166r89k095J154K442j899k408K691J416k393j040J780J555k531
3222g91j033L482k50k581j5K266K14k295j48L050j188k726J948J511j237j889
3238a682J645J915k445j235K799J52k062m94K344P70l074J4L006r72k094O72K192
3255A451p81k518J868K218k600j071J788J065j687j279K647M35l016M73K308k92
3271A009k476L11K744r59k570J489K024j344j648J016K150j993j759L007L45j943
$$ plain form
3287 -597 -1707 1036 1444 -1292 -1491 1462 630 -1271 -752 1397 528 -1716 -619 1722 -85 -1579
3303 -1579 579 1204 50 -1734 601 1775 -1235 -1043 1018 563 -593 -1276 1464 1019 -1780 -491
3319 -491 1412 135 -1036 -801 1693 -30 -1703 593 1522 -460 -870 761 1169 -767 -1557 1509
3335 1509 1002 -1700 -283 884 938 -917 -775 1725 277 -1740 150 1410 -42 -1736 129 1718
3351 1718 -633 -1082 1243 1210 -774 -834 1456 986 -1412 -866 1467 367 -1210 -112 1312 440 -2008
3368 -2008 544 1785 -870 -1262 151 1297 -836 -1790 877 980 -1106 -521 862 871 -1150 -1085 1897
3385 1897 380 -1696 116 954 305 -1056 201 1254 -265 -1633 1053 1210 -849 -1062 771 1327
3401 1327 -1110 -1033 1432 473 -1208 -432 1161 744 -1457 -330 1539 -513 -1164 463 1308 -75 -1477
$$ packed form
3287e97j110K743M08k736j99K953q32j901N19K149q69k244J097K341j807j494
3303a579K158O25j154j784K335J174l010J92K061m55j156o83K740m45k799J289
3319d91J903j277j171K35K494j723j673K296R29j982m10J631M08j936p90L066
3335A509n07k702J417J167N4j855J42K500j448k017J890J260j452j694J865J589
3351A718k351m49K325l3j984o0K290m70k398N46K333j100j577J098J424q72k448
3368b008K552J241k655l92J413J146k133r54K667J03k086N85J383Rk021O5K982
3385A897j517k076J812Q38o49j361J257J053j519j368K686J57k059k13J833N56
3401A327k437P7K465r59j681P76J593m17k201J127J869k052o51J627Q45j383j402
$$ plain form
3418 -1477 1020 1298 -1087 -798 1140 464 -847 -666 1169 543 -1390 -191 1427 40 -952 -82 1312
3435 1312 -319 -1815 901 1171 -810 -915 493 1427 -1288 -985 1516 587 -1146 -203 1134 347 -1062
3452 -1062 -476 1838 35 -1492 427 965 -64 -1126 426 1436 -824 -1038 856 501 -927 -952
3468 -952 1339 997 -1576 -248 1374 158 -969 -152 963 150 -1010 200 1347 -764 -1012 687
3484 687 928 -511 -914 1173 691 -1226 -481 914 450 -992 -683 1495 241 -1342 210 1100 -144
3501 -144 -1231 474 1531 -566 -1267 919 713 -444 -647 816 687 -1128 -542 1371 93 -1097
3517 -1097 -187 661 596 -1086 134 1249 -406 -1144 397 657 -224 -1146 746 882 -1211 -415 733
3534 733 416 -813 -570 960 321 -1470 245 1022 37 -1298 284 1229 -243 -1337 623 950 -487
$$ packed form
3418a477K497K78k385K89J938o76j311J81J835o26j933J199J618j387r92Q70J394
3435A312j631j496K716K70j981j05J408R34k715L03K501r29j733R43J337p87j409
3452a062N86K314j803j527J919N38j029j062J552J010k260k14J894l55j428k5
3468i52K291l42k573J328J622j216j127Q17J115q13j160J210J147k111k48J699
3484F87K41j439m03K087m82j917P45J395m64j442L09K178j254j583J552Q90j244
3501a44j087J705J057k097p01K186k06j157k03J463j29j815N86J913j278j190
3517a097R10Q48o5j682J220J115j655p38J541K60q81r22J892J36k093P96J148
3534G33l17j229K43J530o39j791J715P77r85j335J582R45j472j094J960L27j437
$$ plain form
3551 -487 -493 724 704 -973 -709 1016 559 -1477 -59 751 289 -1114 -51 1183 -332 -1221 459 992
3569 992 -403 -944 350 1036 -501 -534 1242 359 -739 -202 711 509 -959 -34 1219 -391 -713 -51
3587 -51 859 -99 -1098 642 1078 -598 -867 505 719 -616 -567 1012 465 -752 -317 835 317 -1241
3605 -1241 -278 1237 -24 -1118 367 952 -334 -655 198 859 -508 -733 894 252 -754 -528 497
3622 497 562 -1032 -267 908 128 -984 5 753 -135 -928 223 1303 -367 -616 600 474 -288 -768
3640 -768 597 749 -1126 -277 912 46 -726 -263 1016 114 -1265 132 928 -431 -565 201 761 -488
3658 -488 -799 750 642 -651 -259 502 539 -1044 -629 1091 190 -917 121 880 46 -702 40 1222
3676 1222 -650 -1001 292 732 6 -947 472 767 -722 -402 761 353 -582 -75 688 181 -1031 63
$$ packed form
3551d87oJ217k0j677K64J725m57k036J418Q10m62j403J063J234j515q89J680N33
3569I92j395n41J294O86j537l3J776q83j098N37R13k02j468R25J253j610l22O62
3587e1R10r58r99J740M36j676k69J372K14j335M9J579n47j217M35J152n18j558
3605a241R63J515j261j094J485N85j286l21Q53O61j367k25J627o42j006K26J025
3622D97O5j594P65J175p80j112R89P48q88p93J151J080j670k49J216j26p62m80
3640g68J365J52j875Q49J189q66p72M63J279r02j379J397P96j359j34P66N60j249
3658d88l11J549j08j293L92P61L7j583M15J720r01j107J038P59q34p48P42J182
3676A222j872l51J293M40p26r53J419K95j489L20J163m08r35N07P63n07j212J094
$$ plain form
3694 63 794 -463 -628 151 682 -179 -1288 390 683 -697 -412 737 232 -301 -454 1253 328 -885
3712 -885 -1 657 -79 -863 152 1117 -235 -825 240 1052 -307 -660 604 843 -507 -889 679 47
3730 47 -778 -437 740 895 -787 -123 1179 -101 -871 256 639 -130 -1013 504 987 -827 -359 980
3748 980 472 -402 -437 776 254 -1078 -386 847 58 -768 -361 796 108 -963 15 700 -435 -746
3766 -746 111 958 -186 -964 1141 199 -988 -150 380 462 -678 -500 1158 -24 -615 267 638 -70
3784 -70 -614 175 744 -362 -667 427 432 -487 -635 598 536 -822 -173 821 72 -454 -120 855 452 -955
3804 -955 371 650 -255 -637 -16 867 -134 -925 543 514 -963 -329 668 558 -610 -573 607 168 -670
3823 -670 -34 718 -14 -337 22 765 -388 -537 516 407 -423 -573 834 623 -640 -313 945 110
$$ packed form
3694F3P31j257j65P79N31q61j109J678K93j380K85J149n05n33j53J707r25j213
3712h85Q84O58p36p84J015R65j352n90J065Q12j359l53J264K39j350l82J568o32
3730D7q25L41J177J55j682O64J302j280p70J127L83p69q83J517M83j814M68J339
3748I80n08q74l5J213n22j332O92J233p89q26M07J157o88j071R78O85j135l11
3766g46Q57Q47j144p78K105r42j187Q38N30Q2j140J78J658j182n91Q82L71p08
3784g0n44P89N69j106l05J094Nr19j48J233o2j358O49R94p49n26L34R75m03j407
3804i55J326K79r05l82O21Q83j001p91J468k9j477O34R97j10j168L7J180m39q38
3823f70O36P52p32l23L59P43j153j49J053j09q30j50J407k11j263L27J258q35
$$ plain form
3841 110 -644 -483 656 220 -826 141 942 -260 -424 94 574 -286 -1012 203 632 -703 -263 404
3859 404 377 -622 -644 783 301 -1069 112 654 -254 -543 303 811 -159 -620 482 684 -287 -502 558
3878 558 378 -269 -619 750 415 -922 -48 633 -1 -700 -99 816 -123 -633 148 541 -107 -707 283
3897 283 977 -531 -120 463 391 -432 -344 464 518 -665 -308 703 -44 -425 -131 704 -107 -621 393 488
3917 488 -346 -83 269 713 -506 -994 755 302 -512 -173 707 569 -799 -394 819 2 -658 580
3935 580 344 -200 -513 159 704 -523 -534 509 38 -503 -271 501 395 -639 -503 603 -25 -687 -301
3954 -301 324 173 -559 424 761 -616 -294 386 473 -221 -477 707 419 -719 -154 669 194 -553 -385
3973 -385 766 -16 -637 194 387 -351 -134 -221 928 -188 -907 765 487 -475 -518 339 205 -592 -506 393
$$ packed form
3841A10p54J61J139m36j046R67Q01j202j64N18M80q60p26J215M29j335M40O67
3859D04k7r99k2J427m82j370J181N42r08k89Q46N08r70m61J102K02r71k15J060
3878E58j80o47l50J369l35j337Q74O81o34o99O01R15r39n10P81L93o48o00R90
3897B83O94j508M11N83p2q23Q8Q08N4j183L57J011p47l81K94Q35q11n14J014R5
3917D88q34K63L52M44j219m88J749m53q14L39Q80j38j368M05J213q17o60J238
3935E80k36n44l13O72N45j227j1J043m71n41K32P72j06j034J36J106o28o62L86
3954c01O25j51p32R83L37j377L22O80Q7o94k56J184k88j138N65Q23m75p47J68
3973c85J151p82o21Q31J93p38K17q7J149j116p19J672k78r62m3Q57j34p97Q6Q99
$$ plain form
3993 393 68 -493 -43 269 67 -494 162 462 -269 -674 142 413 -341 -348 347 656 -687 -71 572 -32
4013 -32 -497 -558 510 78 -638 183 701 -12 -199 160 592 80 -574 111 578 -561 -302 265 422 -802
4033 -802 -314 648 218 -448 77 282 -81 -446 -226 930 -277 -727 333 517 -11 -600 444 582 -392
4052 -392 -452 611 406 -317 -154 716 487 -340 -486 695 13 -842 -91 243 -77 -540 273 366 -505 -684
4072 -684 258 401 -245 -570 454 170 -916 31 182 130 -142 -29 392 95 -471 217 247 -271 -323 237
4092 237 579 -108 -570 478 313 -340 -193 173 218 -659 -198 764 -98 -479 299 552 70 -483 25 1003
4112 1003 -211 -404 278 397 -232 -437 436 561 -476 125 482 338 -578 120 630 237 -573 242 621
4131 621 -448 -179 -295 459 -53 -682 225 175 -530 -189 39 376 -470 -162 342 161 -413 -33 498 156
$$ packed form
3993C93l25n61M50L12k02n61O56L00p31m05Q16K71p54pO95L09j343O16O43o04
4013c2m65o1J068m32p16Q21N18p13j87L59M32n12o54O85M67j139K59N67J57j224
4033h02M88R62m30o66N25K05l63l65K20J156j207m50J060J84n28n89J044J38r74
4052c92o0J063k05p23J63Q70k29q27j46J181o82q55P51L34l20m63Q13R3q71j79
4072f84R42J43o46l25J024k84j086R47J51n2k72J13M21k97n66O88L0n18n2N60
4092B37L42o87m62J048j65o53J47L66M5q77M61R62q62l81P78K53m82n53N08R78
4112A003j214j93O82J19o29k05Q73J25j037O01L57j44r16O98N10l93q10Q15L79
4131F21j069K69j16P54n12o29R07n0p05L41K28L37q46L08N04j81n74L80N31l42
$$ plain form
4151 156 -476 317 473 -509 -514 70 420 -227 -321 577 472 -614 -86 239 53 -524 -148 190 375 -556 181
4172 181 539 140 -340 -10 325 43 -505 5 370 0 -282 -33 -74 33 -509 124 569 -341 -225 666
4192 666 -168 -268 -436 332 -283 -476 408 567 -278 -226 -44 260 -205 -255 59 253 -486 -365 78 166 -461
4213 -461 -284 344 -41 -702 369 436 -35 -243 106 150 -106 -243 402 133 -276 -236 507 636 -622 262
4233 262 536 179 -206 -12 334 -37 -496 256 141 -276 -280 -45 174 -89 -392 177 200 -351 -190 269 143
4254 143 -121 -81 477 88 -99 -71 394 47 -400 -27 679 -47 -507 11 391 -50 -214 301 324 -484 -402
4275 -402 369 -167 -309 81 454 -171 -467 403 370 -172 -421 35 230 35 -331 -159 199 -143 51 44 -151
4296 -151 -399 -201 246 -11 -437 -63 75 -154 -422 -52 122 77 -76 76 269 -337 148 51 193 -209 -392
$$ packed form
4151A56o32P93J56r82nN84L50o47r4Q98j05j086N28L25j86n77L76L38J85r31P37
4172A81L58l99m80L30L35k82n48N10L65l70k82K49m1J07n42O33M45r10J16Q91
4192F66q34j00j68P68o15j93Q84J59q45N2J82L04m65n0L14J94p39J21M43Q8o27
4213d61J77O28l85o61J071O7m71k08L49M4k56j37O45k69m09M0P43J29j258Q84
4233B62K74l57l85J94L46l71m59P52j15m17mK35K19k63l03N69K3n51J61M59j26
4254A43k64M0N58l89j87K8M65l47m47L73P06p26m60N18L80m41j64N15K3q08Q2
4275d02P71n36j42L90L73o25k96Q70l3n42k49M56J95j95l66J72L58l42J94pj95
4296a51k48J98M47k57m26L74J38k29k68L70J74m5j53J52J93o06M85r7J42m02j83
$$ plain form
4317 -392 504 260 -352 125 34 100 -255 -269 143 104 -148 185 15 -253 -325 248 124 -450 131 244 46 65
4339 65 -268 401 -213 -232 136 309 124 -432 24 227 185 -652 98 438 -227 -267 45 241 141 -282 267
4360 267 114 -87 260 78 -96 -478 -221 407 -165 -134 245 30 -304 -61 334 531 -116 -131 364 1 62
4381 62 -49 153 364 131 177 368 -166 -76 -44 46 10 -304 -208 465 -502 -344 -144 168 -98 -166 526 281 -13
4404 -13 -120 444 -32 -248 -306 381 -242 -98 149 -65 109 -285 9 282 -37 -156 286 -70 -347 -352 -28
4425 -28 130 -321 -157 469 -78 -177 -167 277 359 -121 -13 53 -100 -87 38 243 2 -205 10 228 -14 -135
4447 -135 134 154 -112 275 126 52 -147 155 72 48 -80 18 306 91 -412 123 130 -113 105 103 126 -368 -12
4470 -12 344 79 -43 222 137 3 -188 -110 336 -109 -221 172 132 -331 -37 -8 13 -112 -452 -3 445 -204
$$ packed form
4317c92Q96k44o12M77r1O6l55j4M12l9k52L33j70k68p2N73j24n74N81J13j98J9
4339F5l33O69o14j9L68J73j85n56M56K03m2q37P50L40o65m0L12J96j00m23N49
4360B67j53k01L47j82j74l82K57O28n72L1L79k15l34K43L95J97o47j5M95l63O1
4381F2j11K02K11k33M6J91n34R0L2R0l6l14R6O73r67J58K00L12k66o8O92k45k94
4404a3j07N64m76k16n8O87o23J44K47k14J74l94K94K73l19j19M42l56k77nL24
4425b8J58m51J64O26n47r9J0M44Q2m80J08O6j53J3J25K05k41k07K15K18k42j21
4447a35K69K0k66L87j49p4j99L02q3k4j28R8K88k15n03N35Pk43K18kK3m94L56
4470a2L56k65j22K65q5j34j91P8M46m45j12L93m0m63K94K9K1j25l40M49M48o49
$$ plain form
4492 -204 -290 -57 -256 -340 148 224 -78 130 -9 -60 -202 -75 -173 244 -250 -94 398 -119 12 -205 194 27
4514 27 -263 99 135 -267 -159 81 104 7 -146 -74 81 -208 -186 -255 164 -56 -202 16 173 -69 33 284
4536 284 117 -347 200 252 -98 -248 227 -68 146 114 -79 275 -251 -182 23 344 239 455 118 87 -145
4557 -145 11 14 39 -33 -6 -93 -26 -510 -179 7 -217 100 285 370 -226 -25 -154 259 -246 -330 37 242 -77
4580 -77 -333 124 -221 -135 93 275 -249 -333 74 98 -129 -91 -57 5 -200 -65 67 35 -91 28 178 -40 -349
4603 -349 53 128 174 -140 113 -208 -123 -214 5 146 -74 -285 307 60 31 121 -28 342 -4 83 169 130 -322
4626 -322 -97 50 212 -132 -121 376 85 196 -163 150 50 41 -64 -242 -2 294 349 -55 -34 10 166 39
4648 39 -47 177 122 149 33 226 -112 105 -119 -166 71 -117 -107 -193 390 -127 -165 448 5 -163 94 328 36
$$ packed form
4492b04q6K33j99q4M88P6l02K08j39n1j42J27r8M17m94J56M92n17J31k17L99j67
4514B7k90L62L6m02J08K40K3r7j53P2J55k89K2o9M19k20j46K18J57k42J02K51
4536B84j67m64N47N2l50j50M75k95K14l2j93L54n26O9K05L21j05K16l37l1k32
4557a45J56LK5p2K7q7O7m84L31J86k24L17J85Q5n96K01j29M13n05q4L67K05l19
4580g7k56M57l45Q6K28J82n24q4M07K4k27L8L4O2k05J35J32l2j26J19J50k18l09
4603c49M02P5M6l14K53l21Q5r1K19J41k20k11N92k47k9R0j49L70l46Q7Q6l9m52
4626c22K25J47J62l44J1M97k91J11l59L13j00rj05j78K40K96N5m04K1M4J56j27
4648C9q6K24n5K7j16J93l38K17k24m7K37j88J0q6N83n17l8O13m43j68K57K34k92
$$ plain form
4671 36 -332 -288 512 -22 -311 13 -48 -574 5 66 73 -39 -39 19 -233 -432 -125 332 89 -197 -133 -29 127
4694 127 -269 256 183 54 204 -121 -3 -10 40 -81 -3 333 175 -217 261 316 240 209 78 -84 -63 448 -183
4717 -183 -198 -145 -102 -195 215 -27 370 22 -403 -114 58 -9 -116 -231 -16 38 -29 187 147 -184 -7 212 -3
4740 -3 130 38 -26 32 41 5 52 162 -274 -322 115 -68 -60 10 362 50 -198 86 -47 43 -163 -68 74 -73 164
4765 164 49 -145 -245 336 -63 2 -118 27 283 185 -13 -107 273 -34 -189 -103 126 -68 -311 123 -27
4786 -27 279 -274 115 47 -124 -26 -64 370 -40 237 147 -53 51 -9 122 149 14 131 -225 -136 115 248 -40
4809 -40 -317 171 -277 -89 102 185 -58 600 -38 -205 133 207 97 -4 -187 160 -29 -57 -31 -316 -21 -92
4831 -92 82 -143 -278 -159 275 5 62 62 178 -42 120 341 -63 -356 31 100 -133 -96 85 85 128 -165 164
$$ packed form
4671C6l68M4Q00n34k89L24o1n26N79O1Pj12%N8k52j99L07M57k43k86O4J04J56
4694A27l96N25p3j29J50l25J18pN0j21P8L36j58l92M78N5p6l1j31j62K1N11o31
4717a83j5N3M3r3M10k42L97l48m25K89J72o7j07j15K15N4o7K16m0l31J77K19k15
4740cJ33r2o4N8Rl6M7J10m36m8M37j83QP0L52l12k48K84j33R0k06R5J42j47K37
4765A64j15j94j00N81l99O5j20J45K56r8j98r4L80l07j55Q6K29j94k43M34j50
4786b7L06n53L89o8j71R8l8M34m10K77r0k00J04o0J31K7j35J17l56Q9K51J33k88
4809d0k77M88m48J88J91Q3k43O58o38j67L38P4j10j01j83L47j89k8K6k85K95p1
4831i2J74k25j35J19M34k70N7%J16k20J62K21m04k93L87O9k33L7J81%M3k93L29
$$ plain form
4854 164 -206 -80 56 -433 83 11 10 75 195 -135 117 -27 155 -223 204 -27 -326 121 -132 125 -84
4875 -84 -121 -356 71 -254 113 61 61 -105 35 -24 -29 -205 -83 93 -1 16 -129 13 4 -66 -305 156 -408 85
4899 85 61 275 -63 68 -77 89 119 191 116 88 197 6 -38 9 52 -176 -58 -351 -50 -124 -16 -258 112
4922 112 -123 -22 96 -3 61 93 -35 -82 49 182 41 231 265 35 -241 256 314 322 -112 186 84 -144 -65
4945 -65 -34 441 93 105 -413 43 29 -231 -52 47 10 -73 194 52 -161 131 -209 293 -419 -80 76 373
4967 373 -194 -94 183 -19 -10 -263 46 -8 -22 -23 91 -93 37 -155 -76 38 -220 -54 126 -103 -116 66 -226
4990 -226 -170 348 -92 42 -241 39 1 -38 115 142 154 32 -156 265 -116 -259 91 85 106 -179 27 356 -529
5013 -529 -244 51 75 -85 -52 190 -54 -78 32 -102 122 -164 -146 164 -117 -322 74 182 -21 -193 -270 -49
$$ packed form
4854A64l70J26J36m89N16p2jO5J20l30K52j44J82l78M27k31k99M47k53K57k09
4875h4l7k35M27l25L67n2%j66J40n9nj76J22J76r4J7j45J42rp0k39M61n64M93
4899H5k4K14l38J31j45J66L0P2p5k8J09j91m4M7M3k28J18k93L01p4J08k42L70
4922A12k35J01J18r9O4L2j28m7J31J33j41J90L4k30k76M97N8Qm34K98j02k28P9
4945f5L1M75l48J2n18M56j4k60J79R9l7q3K67j42k13K92l40N02p12L39J56K97
4967C73n67J00K77k02Rk53L09n4j4jJ14j84J30j92P9J14k58J66J80k29j3J82k92
4990b26N6N18m40J34k83K80l8l9J53K7J2j22j88M21l81j43L50oK1k85K06L29q85
5013e29K85K95K4j60L3K42k44k4J10j34K24k86J8L10k81k05L96J08k03j72p7K21
$$ plain form
5035 -49 -30 21 108 -64 -22 -104 7 124 -116 11 234 196 -71 42 72 32 70 -75 224 -59 -166 -178 235 -244
5059 -244 -171 238 -152 -539 3 -46 -65 161 -139 -24 80 -178 -261 371 -101 -189 132 199 -62 7 195 -83
5081 -83 -105 -70 -141 -16 -254 191 145 152 -93 182 221 -187 -149 -198 194 88 185 125 281 -119 66 -286 -169 -116
5105 -116 21 -203 23 57 29 -161 15 -215 -86 135 304 -179 -29 -18 -57 103 17 -91 141 -71 176 -49
5127 -49 -252 14 -111 284 -18 -328 314 122 -30 -192 -114 -89 -34 160 82 -40 -131 -21 199 -103 -372 161
5149 161 97 193 260 162 423 -254 -62 207 -124 -148 257 137 -142 -47 -132 98 313 -178 152 277 -42 -160
5171 -160 -194 -122 -169 150 -203 -351 145 200 310 245 -55 -134 7 131 -185 -17 202 -136 -209 107 313 -88
5193 -88 -128 67 232 -263 222 -130 191 66 133 277 -394 -162 -41 -14 94 -63 35 66 -77 -27 -29 151 -167
$$ packed form
5035d9J9N1Q7j72M2q2J11J17k40J27K23l8k67J13L0m0L8j45K99k83j07j2M13m79
5059b44P3M09l90l87N42m9j9K26l00J15J04k58q3O32m72q8L21O7k61O9J88k78
5081h3k2L5p1J25k38M45m6Pk45K75L9m08L8m9L92j06R7o0J56m00J85l52J17N3
5105a16J37k24K26L4k8j90J76k30J29K21J69m83J50J1l9J60q6j08K32k12K47k25
5127d9k03K66j25L95l02l10O42j92j52j62P8K5N5J94p8j22r1J10K20l02k69N33
5149A61o4R6O7r8K61o77J92K69l31k4M05j20k79R5q5K30K15m91L30J25l19j18
5171a60l4P2m7L19l53j48M96N5J10o5l00p9J41J24l16J68K19l38p3L16K06m01
5193h8m0J95J65m95M85l52L21j25O7J44o71K32J21K7J08j57R8L1j43N0kJ80l18
$$ plain form
5216 -167 -60 -198 -169 15 -20 261 -77 132 -111 44 -250 -292 -60 210 19 -178 344 101 196 -127 1
5237 1 101 -483 -146 -170 -178 -99 10 18 124 -51 -253 133 -121 9 -138 229 232 24 133 -58 -74 282 206 34
5261 34 -191 241 36 -198 75 -5 134 -9 -150 -62 263 -285 168 34 208 -114 -201 27 223 -179 -167 -24
5283 -24 140 -2 -207 560 164 -82 -71 188 142 -99 -87 -1 -67 -5 270 66 133 -94 371 155 -23 -92 78
5306 78 -171 -129 14 209 -22 -153 14 -60 244 -344 21 -24 -280 52 -149 380 -210 -10 295 138 36
5327 36 -115 255 -57 -323 -34 512 -137 -41 22 -47 -91 -457 -22 437 -192 -127 -83 21 -189 -359 192 139 142
5350 142 -102 272 48 54 96 121 -18 -159 35 296 84 -91 190 -278 -33 -59 306 -176 41 504 302 158
5372 158 -240 58 142 -106 -10 -78 175 -83 -45 101 109 -249 88 -240 -55 -32 -23 113 201 -172 59 236 145 -49
$$ packed form
5216a67J07j38K9J84l5K81l38K09k43J55k94m2K32K70j91j97N22k43R5l23J28
5237AJ00n84L37k4qP9J09QJ06j75k02L86k54J30j47L67Lk08J09j91j6L56p6j72
5261C4k25M32k05k34K73q0J39j43j41Q8L25n48M53j34J74l22q7K28J96m02J2J43
5283b4J64j42k05P67l96k46J1K59m6k41J2Q6o6O2K75k04O7k27M65k16j78o9J70
5306G8k49M2J43J95k31j31J67p4L04n88L65m5k56L32k01N29n90K00L05j57j02
5327C6j51L70l12k66K89N46o49R6O3o9m4l66M35M59o29O5M4J04k10j70N51n3L
5350A42k44L74k24OM2K5j39j41J94K61k12j75K81m68K45k6L65m82K17M63k02j44
5372A58l98K98Q4k48R6o8K53k58L8J46Ql58L37l28J85K3RJ36Q8l73K31J77r1j94
$$ plain form
5396 -49 64 56 46 -90 -209 71 83 -479 129 313 -12 -105 431 73 -181 -60 34 496 -401 112 -44 247
5418 247 -200 -234 201 260 -215 55 171 65 -279 393 380 -310 -252 39 121 -249 -133 305 320 -155 250 -57
5440 -57 366 -56 -336 340 70 -36 161 -19 -128 -166 260 161 -31 -9 239 26 -218 -97 306 55 -189
5461 -189 2 -97 -32 -132 114 235 -237 78 62 -277 111 111 301 -4 -78 -93 169 94 -124 -347 21 161 -27
5484 -27 254 114 6 22 218 186 3 -172 53 29 -48 182 105 16 -76 -20 197 3 -53 53 -101 191 -79
5507 -79 248 419 -256 71 44 210 -180 -133 94 23 -140 -10 104 -52 -383 -31 27 -225 -102 -25 97 -312
5529 -312 -170 85 333 24 -192 60 550 -284 -297 35 242 -284 -256 245 -30 -144 28 -158 -195 -212 -174 165
5551 165 -98 -289 158 -135 44 -208 -57 216 -154 -212 164 147 29 -52 292 -29 -364 -288 232 -88 -52 -75
$$ packed form
5396d9J13qj0j36j19K80J2n62O08J84l25r3N36l58k54J21R4M62q97N13j56K91
5418B47m47l4M35N9m75K70J16j06l44O72j3o90N8K91Q2l70J16M38J5m75M05l07
5440e7M23m22k80O76k70j06J97j80j09l8M26r9j92K2K48k13k44J21M03k51k44
5461a89J91r9O5j00K46J21m72L15j6l39L88%J90l05p4j5K62p5k18k23L68J40j88
5484b7K81j40j08J6J96l2j83j75K25k4p7K30p7q9r2N6K17j94n6J06j54K92k70
5507g9L27J71o75L27k7J66l90M7K27p1j63J30J14j56l31L52N8k52J23P7J22m09
5529c12J42K55K48l09k16K52M90q34j3L32K07n26K8N01k75j14J72j86l7j7L8L39
5551A65k63j91M47k93J79k52J51K73l70n8L76j7j18q1L44l21l35P6N20l20L6k3
$$ plain form
5573 -75 231 34 -248 31 196 121 100 26 -31 91 -240 426 -139 -213 -180 79 -139 -148 -497 302 170 -145 -113
5596 -113 432 -83 64 -153 -131 -519 -246 214 98 -64 27 40 -301 -269 -276 401 48 -36 50 121 -27 -278 -3
5619 -3 -32 -12 -291 -143 -122 -231 -301 -80 122 -185 -98 212 112 21 11 20 165 -231 -57 73 -338 -148 42 145
5643 145 -95 -52 -90 -255 110 -167 2 -99 -23 3 213 104 -148 80 159 197 -415 -106 301 -156 -209 135
5665 135 235 56 -337 140 -187 -326 -135 -41 291 -379 -12 192 20 -266 -455 301 104 -161 47 285
5685 285 -47 125 -28 -73 155 -104 11 10 -5 -241 174 162 -70 109 329 329 -368 161 252 65 50 142 -235
5708 -235 -80 -112 -139 146 -6 -288 317 106 -318 50 -176 -126 -482 80 418 -3 -81 271 207 -330 -97 48
5730 48 -90 -177 -383 -1 250 -436 -23 110 162 -93 25 76 -104 -320 19 416 5 20 -155 250 98 60
$$ packed form
5573g5L06j97k82K79J65p5k1p4n7J22l31O66n65p4L3K59k18rl49P99j32l15L2
5596a13N45n15J47k17K2l88K73M60j16j62R1J3l41L2pO77l53q4Q6P1j48k51K75
5619ck9K0k79J48K1j09p0K21K02l07Q7L10j00r1j0RJ45l96J74J30m11J90J90J03
5643A45k40M3l8j65L65k77J69j01P6K6K10j09k52K28P9L8o12L09M07m57n3L44
5665A35J00j79l93M77l27j39J91R4L32o70L67K04j72k86j89P56j97k65K08K38
5685B85l32J72j53m5K28k59J15jj5k36M15j2k32J79K20%o97N29R1j87j5R2l77
5708b35J55l2k7K85j52k82O05k11m24L68k26N0l56N62L38m21p8L52o4n37K33J45
5730D8j38q7k06L82K51o86M13J33N2k55J18N1j80k16L39L97m11J5j75M05j52l8
$$ plain form
5752 60 84 160 235 -134 115 434 -220 -95 139 62 -313 -253 242 -119 7 -207 328 -34 -325 -112 159 -42
5774 -42 -233 3 163 68 68 250 203 -92 -30 14 148 -475 -261 95 210 -160 121 -25 143 -21 38 363 -90
5797 -90 246 316 271 -131 39 293 383 -35 25 273 108 -442 -178 44 -171 -326 169 394 -319 -139 58 104
5819 104 -316 337 -83 400 -105 1 181 206 126 250 -191 -64 -382 -59 219 165 -87 60 381 -218 -176
5840 -176 67 116 -331 -28 322 381 -152 -35 154 171 141 -15 167 150 -165 -111 -37 -320 -235 -4 53 -222 -22
5863 -22 233 258 -97 -41 -37 261 -288 -29 -75 -57 -321 -1 216 -105 -362 188 67 -56 24 -83 99 154 242
5886 242 255 44 82 -51 144 -22 -285 -81 7 209 167 -220 177 288 -150 270 181 -209 -409 167 190 -246
5908 -246 -309 342 232 -52 13 -55 -146 -114 -181 633 232 -133 -231 397 -58 -35 63 395 -74 164 56 327 95
$$ packed form
5752F0K4P6P5l69K49L19o54J25K34p7l75O0M95l61J26k14N35l62k91K13K71k01
5774d2j91K36J60r5%J82m7k95O2M4J34o23K14L56J15l70K81j46J68j64N9L25m53
5797i0L36P0m5m02J70K54R0m18O0K48j65n50K64K22k15j55M95K25p13J80J97M6
5819A04m20O53m20M83n05J06J80K5q0J24m41J27l18L23K78n4k52J47L21n99M2
5840a76K43M9m47L03L50N9n33J17J89J7l0j56J82j7l15N4P4k83Q5K31N7k75K00
5863b2K55K5l55N6MK98n49K59m6J8k64L20K17l21k57N50j21j23Q0j07J82N5Q8
5886B42J3k11L8j33J95j66k63K04Q8K02m2l87L97J11m38M20q9l90k00N76K3m36
5908b46o3O51j10k84O5o8r1L2o7Q14m01l65r8O28m55K3R8L32m69K38j08K71k32
$$ plain form
5931 95 -163 -41 239 -284 262 379 -48 0 187 95 -268 -64 -352 233 -88 -46 134 314 -611 -322 213
5952 213 388 -214 171 -48 -96 -100 -299 269 -249 -38 201 253 8 -191 287 -164 11 -157 -38 268 -176
5973 -176 -131 285 -97 -82 -51 542 -147 -510 -43 120 310 -315 -63 325 56 -25 156 517 214 -387 -208
5994 -208 -174 -16 -27 139 -94 -164 23 205 -71 -177 -208 -104 119 -90 30 36 92 -304 22 71 145 -170 -3
6017 -3 209 -216 -311 84 -34 41 27 23 -173 -162 -34 277 -184 -339 152 67 294 -15 132 387 -398 46 54 -79
6041 -79 -7 -311 -124 228 133 161 201 63 128 47 -20 -283 -168 70 73 -89 31 247 49 -162 52 70 77 -133
6065 -133 -66 94 -102 -172 -57 175 5 -270 54 133 -124 -46 -81 180 -175 -374 -229 237 134 5 341 -68
6087 -68 -387 19 131 -60 -52 217 297 51 -52 44 430 -229 -269 -107 89 -245 -309 253 -124 -144 -46 104 41
$$ packed form
5931I5k58J22K80n23N46J17m27M8J87r2l63K04k88N85l21M2J80J80r25K89N35
5952B13J75o02L85k19m8mj99N68n18K11K39N2k45j99M78m51J75j68J19L06m44
5973a76M5M16l82J5L1N93o89l63M67J63J90o25K52L88k69q1J81L61l03o01J79
5994b08L4J58j1J66k33p0J87J82k76j06l1J04K23k09J20ON6l96L26M9P4l15J67
6017cK12m25r5L95j18P5j4mj96J1J28L11m61j55M91q5K27l09J47K55p85M44Qj33
6041g9P2l04J87L52r5K8M0j38O5q1o7k63J15K38Lj62J20K16j98k11K14J8Pk10
6065a33O7J60j96p0J15K32j70k75L24P9k57P8l5K61l55j99J45M66j03j29L36m09
6087f8l19M06J12j91QK69Q0k46j03R6L86o59m0J62J96l34o4N62l77k0R8J50o3
$$ plain form
6110 41 130 -344 172 268 -252 -206 200 163 -409 104 160 125 -266 148 31 21 14 67 79 61 -262 536 203 -140
6134 -140 13 145 53 -232 -119 67 149 17 258 -184 113 -249 51 231 -231 -177 164 188 -361 143 202 -286
6156 -286 -561 95 256 65 -143 84 162 129 -221 12 401 43 156 264 226 -162 -174 262 243 -345 -79 440
6178 440 -68 -373 -1 95 -97 -258 149 79 18 -454 162 -59 -78 231 -183 252 132 -40 105 412 -142
6199 -142 121 158 -35 -266 161 501 -76 -371 -119 0 -271 8 -58 164 -61 190 189 49 -81 -298 -11
6220 -11 74 -242 -238 9 74 -155 131 15 305 58 170 -72 -73 -288 245 151 -235 -62 125 -85 -95 -120 400
6243 400 0 73 -141 321 127 -255 18 -36 38 -163 92 127 -289 24 314 99 -10 -285 571 -124 319
6264 319 -273 -74 200 -123 149 264 184 -117 -22 139 -170 -131 -270 81 -207 -136 273 139 82 -158 501 242
$$ packed form
6110D1Q9m74N16R6n20M6M06l7n72N13N6l5l91M14j17j0pN3J2j8l23P98l33l43
6134a40J53J32r2k85J13J86Q2j32K41m42K97l62L00J80m62N4L41K4n49N04N9m88
6156b86k75O56J61j91k08K27P8l3l50K33L89l58J13J08l8l88j2M36j9n88K66N19
6178D40n08l05L72R6j92j61M07p0o1m72O16k21j9L09m14M35j20j72J45L07n54
6199a42K63L7j93k31M27L40n77k95K52J19k71K79o6K22k25K51jj40j30k17K87
6220a1Q5l16MK47O5k29K86j16K90k47J12k42jk15N33r4l86J73J87k10j0k5N20
6243D00m00P3k14M62j94l82K73n4P4k01K55L5m16L13K90k15j09k75Q56o95M43
6264C19n92J99K74l23K72J15q0l01R5J61l09L9j39L51k88P1M09j34n7k40O59k59
$$ plain form
6286 242 -373 -89 331 -142 -113 99 180 61 -200 127 146 154 -230 -6 397 -326 66 190 -15 -98 -201 -25
6308 -25 -170 -631 145 54 -18 -220 297 303 51 -367 120 -77 -137 -143 92 174 -196 -203 240 97 -178 -147 98 -242
6332 -242 -210 153 476 30 -59 -148 96 -93 -30 129 399 -7 -255 44 86 -16 -65 164 -115 -49 -236 -143 93
6355 93 -95 -326 84 -233 -402 -70 330 179 -81 -21 -257 176 40 254 -39 -279 -196 99 81 -154 125
6376 125 345 -84 -118 184 332 168 -450 -151 153 126 55 81 168 -229 -96 320 116 111 100 346 179 37 -234
6399 -234 183 -318 -55 -213 316 122 -292 174 298 41 -301 162 -19 -66 -59 342 -156 30 -138 52 274
6420 274 -235 2 177 -412 -55 104 265 -284 -199 -201 101 -172 -261 -149 198 -331 -180 213 30 -122 -96 199
6442 199 212 -271 -127 410 401 -398 -13 339 95 -111 -128 160 -242 -324 210 -83 -207 -59 -128 180 -125 202
$$ packed form
6286B42o15K84M20m73K9K12Q1j19k61L27J9Ql84K24M03p23L92J24k05q3j03J76
6308b5j45m61P76r1p2k02N17Ok52m18M87j97o0oK35Q2l70pM43j43k75L1K45l40
6332b42L2L63L23m46q9q9K44j89O3J59K70m06k48K99M2j02m9K29k79O6j87R3K36
6355I3j88k31M10l17j69L32M00j51k60O0k36M33j36K14k93k40Q3K95j8k35K79
6376A25K20m29l4L02J48j64o18K99L04k7p1K6Q7l97J33M16k04nj1K46j67j42k71
6399b34M17n01K63j58N29j94m14M66J24k57l42M63j81m7PM01m98J86j68J90K22
6420B74n09K37J75n89L57J59J61n49Q5kL02k73q9J12L47n29J51L93j83j52K6K95
6442A99J3m83J44N37rp99L85L52k44k06j7K88m02q2N34k93j24J48o9L08l05L27
$$ plain form
6464 202 169 65 -6 -74 207 -185 -69 105 -187 -100 -246 191 68 -145 -259 110 -206 -141 -103 265 295 -225
6486 -225 326 -4 83 37 237 365 -46 -130 84 192 -180 -233 372 246 -51 170 -162 238 -489 -348 77
6507 77 -21 -46 -117 149 94 -302 177 226 -241 -269 201 155 -330 -273 -52 30 -192 -84 171 406 -156 21 -217
6530 -217 -3 -112 284 286 61 -15 -30 5 -295 -122 193 229 -240 -28 261 244 -477 -305 419 182 119 -49 -61
6553 -61 241 91 93 261 257 -422 59 51 157 64 25 88 139 -129 113 124 185 15 256 -2 -3 -174 196 -8 -208
6578 -208 213 87 155 -337 469 62 -21 -254 -117 287 -219 -150 -51 47 -153 -57 170 -233 -227 -203 181 9 -353
6601 -353 96 112 52 64 100 -40 -228 25 272 -19 -490 162 428 157 -115 -60 350 -279 -237 -57 138 25
6623 25 50 39 217 -351 -86 132 -44 -68 -505 322 -100 -174 66 347 -57 -306 -165 175 -225 -401 198 240
$$ packed form
6464B02l3j04p1o8K81l92J16J74k92Q7j46M37j23k13j14L69l16O5L8L68L0n20
6486b25N51l30Q7m6K00J28m11q4K14J08l72n3O05j26k97K21l32M00p27J41M25
6507G7r8k5p1K66n5l96M79M9m67k8M70m6m85N7K21Q2k22J08K55K35n62J77k38
6530b17K14j09L96Kk25p6j5L5l00J73L15L6m69K12K89j7p21J72P24k37o3j68j2
6553f1L02j50KJ68mo79M81qJ06r3l9O3N1k68K42J1O1j70K41k58jj71L70k04k00
6578b08M21j26O8m92Q06m07q3k33J37M04n06O9R9R8k00R6K27m03OK4L84j72l62
6601c53M49J6o0J2L6j40j88K53K47k91m71O52K66k71k72N5M10o29M2J80J95j13
6623B5K5j1J78n68K65K18j76k4m37Q27m22p4K40K81m04k49J41L40m00j76N99M2
$$ plain form
6645 240 -65 79 91 331 -153 -91 150 144 -161 -181 -74 251 -177 -105 160 -225 96 110 198 -83 -154 110 146
6668 146 -144 -85 226 217 -129 -406 -55 325 -222 -150 72 -20 15 116 227 105 -171 248 74 129 -233 -47
6690 -47 149 -11 -140 291 106 110 58 -130 -60 -80 27 299 223 -297 112 173 -125 64 89 160 -143 -65 166 137
6714 137 -296 -104 96 99 -307 -230 39 5 -48 -55 61 189 -258 147 140 -310 -57 87 -50 -45 7 441 -64 -337
6738 -337 180 266 213 -218 -42 213 115 69 66 117 -275 -28 -271 190 -42 -136 78 304 54 -47 122 321 -73
6761 -73 -53 373 -54 -85 -47 131 -24 -168 -91 160 190 -310 12 170 -219 34 -283 236 -266 -195 -123 64 -83
6784 -83 -219 289 42 -32 -333 132 -319 -217 -64 71 200 -399 -139 470 126 190 51 -156 80 15 -61 313
6806 313 -5 -87 185 129 -284 57 337 -94 -317 313 364 -332 -132 152 -84 392 -409 -1 166 -122 2
$$ packed form
6645B40l05J44J2K40m84O2K41ol05k0J07L25m28P2K65l85L21J4Q8k81p1K64L6
6668A46k90N9L11rl46k77L51L80n47P2K22r2L5J01J11j22k76M19j74N5l62J86
6690d7J96j60j29M31j85Mn2j88P0k0J07K72p6n20M09O1k98J89K5P1l03P8K31k9
6714A37m33J92K00Lm06P7K69l4n3pJ16J28m47M05pm50K53J44j37NN2M34n05k73
6738c37N17Q6n3m31J76K55r8m6lN1l92K47k43M61k32r4K14K26k50j01J69J99l94
6761g3K0M26m27l1L8J78j55j44P7K51L0n00L22J58l89K53l17N19n02P1P2J87j47
6784h3j36N08k47p4l01M65m51J02J53J35J29n99K60O09l44O4j39k07K36o5p6L74
6806C13l18q2K72n6m13L41K80m31k23O30N1o96K00K84k36M76q01M08J67k88J24
$$ plain form
6827 2 -101 -62 -211 -15 64 98 -101 -85 150 128 -162 -34 363 -67 -160 168 187 -307 3 287 30 -354 -163
6850 -163 49 -44 -281 106 154 -226 -73 14 -71 242 -218 -210 127 123 67 -146 62 -133 134 40 -22 -150 188 70
6874 70 6 -334 44 117 183 -184 -80 -38 90 155 515 14 -378 -55 41 495 -59 -184 461 214 -61 -215
6896 -215 50 343 -150 260 274 243 84 -238 109 5 -217 453 274 -291 -301 89 189 -355 5 138 40
6917 40 -193 -4 196 131 -303 39 298 118 -261 98 418 -97 -48 116 748 -193 -185 156 32 -73 -39 -56
6939 -56 90 -350 -205 275 293 -332 24 209 -278 -503 -124 56 -65 -260 272 169 -250 -415 72 81 -594
6960 -594 -64 38 396 -141 -235 126 -132 -353 222 259 2 -401 70 186 288 -139 143 126 19 -137 87
6981 87 -35 -49 -10 102 -54 -220 45 -140 -152 -97 -99 247 -332 218 331 51 -117 -107 452 -22 -187 -147 299
$$ packed form
6827Bj03L9j49J96P9L4j99J6K35k2k90J28L97m30r3L28J9m94L10K84k57l84J91
6850a63K12r3k37L87M8l80J53Q7q5L13m60QL37mn6k13K08j95K67r4o2j28L38j18
6874G0o4l40L78P3O6l67J04M2J28O5L60n01l92L23R6M54n54j25O45k47k75j54
6896b15K65K93m93M10J4l1j59l22L47j04k22O70j79n65j0L90J00n44L60J33r8
6917D0k33J89K00o5m34L42K59j80l79L59L20n15M9J64O32r41QL41j24j05L4j7
6939e6J46m40J45M80J8o25L56J85m87k25L79J80j21j95N32j03m19j65M87Ro75
6960e94N30J02L58n37r4L61k58k21N75L7k57m03M71J16J02m27K82j7j07j56K24
6981H7j22j4L9J12j56j66K65j85j2N5kL46n79N50J13k80j68J0N59m74j65M0M46
$$ plain form
7004 299 297 -154 -139 81 73 -166 -143 50 16 -182 -194 345 136 -375 321 259 -105 -235 177 80 -308 -359 -191 -84
7028 -84 -226 155 -20 -66 -289 -91 263 -54 90 -75 345 -118 40 226 201 -61 175 8 44 -128 -41 252
7050 252 -3 -219 36 339 -162 -101 56 14 -66 -339 -78 94 76 -182 69 52 -337 60 240 -198 -226 23
7072 23 232 186 108 66 273 -151 -106 -125 -87 29 -39 38 54 -166 13 -58 -107 -325 3 119 143 -16 83 92 22 -171
7098 -171 13 405 14 -250 43 315 -66 -138 218 -64 51 -260 -2 401 -185 -62 30 34 -212 -180 240 -143
7120 -143 -251 -143 25 57 -302 116 295 -200 -320 -28 459 -184 -145 259 300 -296 58 -32 -124 -20 -63 -230
7142 -230 444 -267 -129 444 -292 -251 132 32 -185 -116 307 -130 -18 44 190 -251 -328 32 161 204 -72 -176
7164 -176 324 51 230 141 60 -35 -309 -252 223 -91 101 368 209 -246 -137 -24 44 -216 -294 275 316 -402
$$ packed form
7004B99km51J5K20qk39K3J93l4j98j2N39k09n11O96o2l64j30M12r7l88n1J68J07
7028h4j42L81j75m6k23J98L54l17J44j65M20m63J58J86k5k62K36j67L6j72Q7K93
7050B52k55k16K55L03n01O1J57m2q0k73K61J72j8k58K51j7l89L97J80m38k8K49
7072B3K09m6p8m2K07m24M5j9L8J16o8P7J6k20J79p1m9k18L28J16K4j59R9Rp0j93
7098a71J84L92l91k64K93K72l81p2L56k82J15l11K58M03n86J23R2Mk46L2M20l83
7120a43j08J08J68L2l59M18J79m95j20K92M87o43L9M04M1n96L54r0r2J04m3j67
7142b30O74p11J38N73p36M1L83j00k17O9M23m37J12O2J46m41p7L60J29M3k76j04
7164a76N00k73J79q9q1r5k74N7M75l14J92K67j59m55J09J13O8k60p8N69M1p18
$$ plain form
7186 -402 -102 -25 17 -28 14 321 -57 -309 47 223 -429 -165 124 111 -361 -76 -44 -71 -295 -31 214 58
7208 58 -187 -52 262 -119 -132 -29 71 -124 -328 -216 134 -72 90 270 -79 -306 -14 431 -202 -265 82
7229 82 50 -156 -198 -102 9 -93 -233 67 -76 -449 -32 20 92 39 -72 -31 -20 -82 282 424 -222 -19 49 284
7253 284 37 -300 102 416 -189 -293 81 -13 -150 -430 452 205 2 -39 239 39 -344 -157 81 -43 -109
7274 -109 -34 208 -358 -32 122 54 -363 -264 246 282 159 -22 231 -16 37 34 87 -25 -228 183 163 -130 61
7297 61 174 211 228 -219 313 -18 -193 169 198 92 145 -193 113 -15 -275 -134 342 -73 -414 243 5 -112
7319 -112 -71 69 76 18 11 132 -90 -28 252 371 56 -70 -190 10 14 -520 -224 296 79 -519 241 282 -202
7342 -202 -219 96 95 -111 90 69 13 -201 188 304 165 -229 21 97 -45 -186 271 272 -288 -168 -59 114 295
$$ packed form
7186d02L00P7M2m5M2L07l78k52L56J76o52K64K89j3m72K85L2k7k24K64K45j56
7208E8k45J35L14l81j3J03J00j95k04J12L50k06J62J80l49k27K92M45o33o3L47
7229H2l2k06m2R6J11j02j40L00j43l73M17N2P2n3j11M1J1o2L64J42o46K03O8K35
7253B84k47l37M02L14o05j04L74r4j37k80Q82k47k03m1K78k00l83J87K38j24o6
7274a09P5K42n66L26J54o8m17R9N10L6j23j81K53k47N3lN3j12k03M11k0k93J91
7297F1J13L7J7m47N32l31j75L62K9j06N3l38L06j28k60J41M76m15l41O57k38j17
7319a12M1J40Pn8pJ21k22O2K80J19l15j26j20K00Mn34K96N20k17n98P60M1m84
7342b02j7L15jk06K01k1n6k14L89J16j39l94K50P6j42j41M57Jn60J20J09J73J81
$$ plain form
7365 295 -51 355 78 -496 234 130 667 -95 46 92 297 -225 -197 357 -154 -513 -32 89 29 -227 -32
7386 -32 152 -199 33 92 145 -16 -6 33 291 -253 -136 192 -46 -162 -17 -61 -140 -69 171 284 -76 -143 344
7409 344 100 85 -142 419 -117 127 287 138 -100 -356 -90 2 220 -108 34 192 68 -348 139 400 46
7430 46 -122 250 242 -147 48 76 -60 -287 168 84 67 -413 -173 169 -196 -115 -170 3 -23 -344 128 293 -364
7453 -364 -167 -113 -67 -65 -137 98 -54 14 -41 -91 -20 -128 -33 269 -138 -433 -304 296 29 -9 45 148 -257 30
7477 30 -161 -42 25 -140 89 -81 45 -130 81 -73 39 132 175 130 -503 153 90 305 -40 -90 205 251 -234
7500 -234 358 1 -87 -68 -213 66 51 67 63 105 -14 -61 197 -58 18 37 377 -37 -346 420 -148 -323 -56
7523 -56 33 -337 -349 97 30 101 -302 -32 385 71 -55 -125 319 15 -41 227 5 112 107 -165 52 -193 -234
$$ packed form
7365B95l46M06k77n74P30j04N37p62J41M6K05n22K8N54n11l59M81J21o0k56J95
7386c2J84l51K32N9N3j61J0L9K58n44J17L28k38j16J45m4p9P1K40J13l60o7M87
7409C44k44j5k27N61n36K44J60j49k38k56K66R2K18l28J42J58j24m16M87K61l54
7430D6j68L72ql89J95K8j36k27M55q4j7m80K40L42l65Q1n5J73k6l21M72J65o57
7453c64J97N4M6Kp2K35j52O8n5n0P1j08R5L02m07k95J29O00k67l8N4J03m05K87
7477C0j91J19O7j65K29j70J26j75K11j54J12R3M3m5o33O56o3K15l45n0K95M6m85
7500b34N92l57q8J9j45K79j5J6mM2j19m7K58k55P6J9L40m14l09P66n68j75K67
7523e6Q9l70j2M46o7P1m03K70M17l14j26p0M44l04n6K68k22J07nk72K17k45m1
$$ plain form
7546 -234 457 -128 -244 -9 177 220 -132 14 154 315 -40 393 270 9 172 189 187 -174 -36 38 162 -367
7568 -367 -276 116 61 323 -153 146 213 -140 -352 122 -352 -205 215 65 -130 -169 251 40 -57 -67 228 73
7590 73 -128 -124 248 132 -251 -46 350 222 -90 259 173 -266 -256 -102 -9 119 -101 -141 283 -147 142 63 -180
7613 -180 -256 -23 -46 123 -158 -260 112 68 -240 100 -17 -451 75 13 135 45 241 -68 -231 -25 -362 326
7635 326 221 -204 -102 185 -25 320 -18 -21 178 -177 -53 -31 -182 61 41 189 -111 -262 239 -192 -204 -139
7657 -139 112 71 -286 -336 -38 93 -637 15 396 3 -30 -59 119 137 -240 44 492 -28 130 206 153 -375
7679 -375 47 174 14 29 -88 296 -155 24 -71 212 132 309 212 255 -158 -263 382 -211 -130 179 -45 -179
7701 -179 62 0 424 -401 -261 -183 104 -157 -218 62 129 -477 -79 186 264 -128 184 444 271 -201 8 502
$$ packed form
7546b34O91n85j16K35J86M3l52J46J40J61l55M33j23k61J63J7kl61J38P4J24n29
7568c67R1L92n5K62m76K99O7l53k12M74m74J47M20j50j95l9M20k11r7j0K95j55
7590G3k01ML72j16l83K05L96j28l12L49q6m39J0J54R3J28k20m0M24m30K89p9k43
7613a80p6K33k3J69k81j02L72m4l08L40j17m34N26o2J22r0J96l09j63K06l37O88
7635C26j05m25J02K87k10L45l38lJ99l55J24K2j51K43k0J48l00j51N01m31j2O5
7657a39K51m1l57n0K98J31p30O52L81l93l3k9J78J8l77K84M48n20J58P6n3n28
7679c75M22J27j60J5j17L84m51J79r5K83q0J77r7M3m13j05O45n93Q1L09k24j34
7701a79K41o2M24q25J40P8K87k61o1K80O7o06L98K65P8l92L12K60j73m72K09M94
$$ plain form
7723 502 325 -2 -214 186 -219 -88 168 9 92 96 49 -37 -270 -443 116 333 59 -219 -27 414 -287 152
7745 152 20 -10 25 -61 258 -180 -68 -34 -61 85 106 -290 341 -359 -209 87 -79 -174 -490 242 139 -89
7767 -89 -134 202 76 -34 195 -198 93 -71 -140 -206 -172 -213 -88 127 125 -84 160 167 -136 -44 249 38 -317 -86
7791 -86 275 15 -2 -214 -60 -159 -142 -136 -20 -163 -97 229 356 -135 -346 -152 193 -238 -77 80 -51 -164
7813 -164 76 208 85 -314 -103 -73 -193 -216 135 -103 -134 -119 -6 103 -147 23 118 -81 -333 -90 -177 -214
7835 -214 42 101 55 -289 47 413 181 -176 -238 190 179 280 -127 143 130 -159 182 37 -210 -508 364 196
7857 196 -38 93 22 291 -104 -98 166 393 -150 -205 -45 -347 33 -12 -10 122 -76 105 -41 -85 -263 66 290
7880 290 -23 -162 -158 -65 129 -450 -247 130 1 -70 26 70 -109 -71 315 178 -207 359 122 312 -228 243
$$ packed form
7723E02j77l27k12M00m05J31K56j59Q3Mm7q6k33j73N59K17k74k78J92M41p01M39
7745A52j32l0L5q6L19m38J12L4k7J46K1l96O31p00J50K96j66r5l16P32j03k28
7767h9m5L36j26j10K29l93K91j64o9o6L4m1J25K15kk09K44Pl03R2K93k11l55K31
7791h6L61k60j7k12J54r9J7OJ16j43O6L26J27m91k11J94L45m31J61J57j31j13
7813a64K40J32j23l99K11L0j20k3L51k38l1J5J13J09k50J70R5j99k52K43q7l7
7835b14K56N9m6l44L36L66k32l57o2M28j1J01m07K70j3k89L41j45k47k98Q72j68
7857A96k34J31p1K69l95OK64K27n43n5J60l02L80m5KJ32j98J81j46m4j78L29K24
7880B90l13j39MR3J94n79K03L77j29p1R6M4j79L8L86j37l85N66k37J90n40M71
$$ plain form
7902 243 443 -41 -93 -164 -29 375 29 -248 11 -24 204 19 212 159 -81 273 -84 -84 -9 293 154 161 252
7925 252 -16 -107 -421 325 54 -34 -421 145 82 26 -107 131 -18 243 -67 -172 38 -203 -114 82 -20 203
7947 203 65 178 -87 31 214 46 -131 -33 128 4 81 -217 202 495 123 -56 154 391 45 -28 84
7968 84 184 -291 326 -117 -76 -4 57 52 -78 -296 -154 291 -39 -82 98 197 -42 68 40 -143 -40 -16 -65 26
7992 26 -201 300 54 -167 -31 215 40 -336 -150 484 -76 -269 154 5 135 -25 -20 224 -83 -194 -143
8013 -143 35 -297 260 9 -19 -92 -206 170 74 -210 -37 165 178 -520 201 66 -96 -79 7 117 220 227 184
8036 184 197 -177 -58 -265 -45 -117 -47 196 -274 266 -19 114 -264 -395 -52 175 -403 -73 159 41 -106
8057 -106 128 -134 -67 -35 -289 158 151 53 83 151 -200 29 -137 24 82 -315 -286 44 27 -255 -248 23 195 7
$$ packed form
7902B43K00m84n2p1J35M04l46k77K59l5K28j85J93n3k40L54l57%P5L02j39PR1
7925B52k68r1l14P46k71q8l87N66o3n6j33K38j49K61l10j05K10k41Q9J96j02K23
7947B03j38J13k65J18J83j68j77R8J61j24P7k98M19K93l72j79K10K37l46p3J12
7968H4J00m75O17m43M1P2O1nj30k18J42M45l30m3J80R9k39J10k8j83J03K4m9R1
7992B6k27N01k46k21J36K46j75l76J86O34n60j93M23j49J30j60NK44l07j11N1
8013a43J78l32N57k51k8p3j14L76r6k84J73K02J3o98P21j35j62J7Q6J10J03Pm3
8036A84J3l74J19k07K20p2P0K43m70N40k85J33l78j31L43K27n78L30K32j18j47
8057a06K34k62O7L2k54M47pr8L0O8l51K29j66J61N8l97K9L30j7k82PK71J72j88
$$ plain form
8081 7 -2 -20 -345 -6 129 -47 -190 67 377 -48 -47 -94 17 12 -169 167 -45 82 -163 70 -56 -376 -140
8104 -140 -100 73 -92 -58 -14 -50 -37 179 -66 317 241 -73 -34 -26 -54 -86 46 242 173 66 295 -89 -186 141
8128 141 28 53 150 -12 78 -312 -284 -69 -203 -249 161 120 109 43 -83 187 -37 -209 70 161 35 127 79 149
8152 149 284 240 255 101 40 -309 100 -262 -122 -71 214 -91 -225 4 -65 -74 17 -168 348 37 61 -43 180
8175 180 219 -249 342 277 10 -131 295 50 34 46 337 -158 -393 -5 222 -24
$$ packed form
8081Grj8l25L39J35j76j43K57L10m25Jm7J11nj81L36k12J27k45K33j26l20K36
8104a40M0J73j65L4M4l6J3K16k45L83p6l14L9Qk8l2J32J96o9j07K29l84r7L27
8128A41j13K5R7j62R0l90K8K15j34m6M10m1j1o6j26K70k24j72K79R1j26R2m8P0
8152A49J35m4J5j54o1l49M09l62J40N1K85l05j34K29o9rR1j85N16l11K4j04K23
8175A80L9m68N91o5k67j41M26k45j6J2K91m95k35L88K27k46
8191b4
$$ Imaginary data points
##PAGE= N=2
##DATA TABLE= (X++(I..I)), XYDATA
$$ plain form
0 0 0 0 0 0 8 -8 8 -16 16 -19 24 -32 40 -49 57 -72 88 -104 121 -143 169 -194 225 -257 297 -340 386 -437
28 -437 496 -563 631 -709 794 -888 988 -1099 1222 -1359 1508 -1668 1847 -2045 2264 -2505
44 -2505 2776 -3079 3425 -3813 4262 -4788 5409 -6154 7069 -8227 9745 -11818 14831 -19631
58 -19631 28434 -49699 197139 132397 -328964 57241 125303 82084 -204700 -88689 326422
69 326422 -73695 -260542 152611 122865 -54960 -162970 47070 234559 -158652 -179331
79 -179331 219278 58925 -133604 -81745 108063 156785 -222956 -75809 254987 -44928
89 -44928 -138697 -15606 146529 66390 -265738 60775 233816 -144483 -119443 73113 146603
100 146603 -66230 -210732 174485 149242 -220148 -51554 163349 48826 -137852 -91786
$$ packed form
0@%%%%Qj6J6k4L2l5M3n6P2q9J06j29J60j92K25k64L12l63M19m82N54o37P26q23
28d37R33j059J194j340J503j682J876k087K321k581K867l176L515l892M309m769
44b505N281n855O504p238Q075r050J0197j1563J3223j5296J7972k1563K6649l4462
58a9631M8065p8133K46838o4742m61361L86205O8062m3219k86784J16011M15111
69C26422m00117j86847M13153k9746j77825j08010K10040J87489l93211k0679
79a79331L98609j60353j92529N1859J89808M8722l79741J47147L30796k99915
89d4928r3769J23091J62135q0139l32128L26513J73041l78299K5040J92556P3490
100A46603k12833j44502L85217k5243l69390J68594K14903j14523j86678M6066
$$ plain form
110 -91786 204129 50840 -249966 53843 182498 -66042 -133506 12283 199215 -68235
120 -68235 -216364 167993 118536 -146301 -84774 106791 130816 -169268 -97611 211930 14682
131 14682 -169179 -2220 146106 21375 -180921 13690 196031 -79309 -149849 94500
141 94500 107091 -61019 -134958 82521 155240 -156726 -83925 150095 35834 -93568 -86701
152 -86701 135902 88139 -206067 2861 170395 -34254 -122990 -1999 162310 -25733
162 -25733 -190342 100760 142221 -119869 -95175 95083 104735 -107552 -115722 161921 64495
173 64495 -172135 -7409 126443 22177 -130405 -32963 182939 -37298 -160122 80753
183 80753 97253 -41901 -116938 46321 152377 -117534 -102433 132268 51152 -93357 -71517
$$ packed form
110i1786K95915j53289l00806L03809J28655k48540o7464J45789J86932k67450
120f8235j48129L84357m9457k64837O1527J91565K4025l00084P1657L09541j97248
131A4682j83861J66959J48326j24731k02296J94611J82341k75340p0540K44349
141I4500J2591j68110p3939K17479P2719l11966P2801K34020j14261j29402O867
152h6701K22603m7763k94206K08928J67534k04649q8736J20991J64309j88043
162b5733j64609K91102M1461k62090K4694J90258R652k12287q170K77643r7426
173F4495k36630J64726J33852j04266j52582R7442K15902k20237j22824K40875
183H0753J6500j39154p5037J63259J06056k69911J5101K34701q1116j44509K1840
$$ plain form
194 -71517 107443 83004 -159361 -30657 163287 -20618 -121818 13753 115635 -1514
204 -1514 -153852 50573 146847 -103051 -86254 80730 77636 -61601 -114623 116804 85999
215 85999 -149497 -21694 110472 25020 -101636 -45932 146296 1830 -151313 47792
225 47792 109457 -41961 -99350 30594 126177 -67376 -121038 111038 72925 -102566 -52215
236 -52215 82094 75082 -115979 -59272 151184 -2565 -120786 17553 92464 8681 -125173
247 -125173 17872 140277 -73058 -95398 72753 71919 -51802 -96077 80476 94026 -121261
258 -121261 -47434 114031 21281 -89935 -35727 108097 29324 -139003 21042 119357 -45372
269 -45372 -84265 24550 100730 -34845 -121457 86814 84591 -97751 -47362 71157 62831
$$ packed form
194g1517J78960k4439k42365J28704J93944j83905j01200J35571J01882j17149
204a514j52338K04425R6274k49898J6797J66984l094j39237n3022K31427l0805
215H5999k35496J27803J32166q5452j26656N5704J92228j44466j53143J99105
225D7792O1665j51418n7389J29944R5583j93553n3662K32076l8113j75491N0351
236e2215J34309p012j91061N6707K10456j53749j18221J38339P4911q3783j33854
247a25173J43045J22405k13335k2340J68151q34j23721m4275J76553J3550k15287
258a21261P3827J61465r2750j11216N4208J43824p8773j68327J60045R8315j64729
269d5372l8893J08815P6180j35575q6612K08271k223j82342N0389J18519q326
$$ plain form
280 62831 -85180 -67293 124614 22650 -118692 8160 88944 4978 -98345 -2945 124561
291 124561 -39314 -109289 66467 74502 -52127 -77087 53122 94232 -93764 -66771 111641
302 111641 25080 -86346 -28893 85381 38842 -118696 -2358 119003 -33647 -86283 25470
313 25470 85041 -21839 -107516 58554 93507 -85479 -56303 72282 52181 -67165 -65069
324 -65069 97863 43144 -114159 -3459 91071 918 -82734 -11513 108789 -17562 -111476
335 -111476 54884 78376 -50590 -67914 41261 86644 -71715 -75057 98535 35316 -83335
346 -83335 -26342 72126 40654 -98281 -20951 113791 -19212 -88967 24622 74604 -12186
357 -12186 -94965 35577 98132 -72630 -63282 68819 46474 -54041 -63566 77011 56245
$$ packed form
280F2831j48011J7887J91907j01964j41342J26852Q0784q3966j03323R5400J27506
291A24561j63875o9975J75756Q035j26629k4960J30209M1110j87996K6993J78412
302A11641q6561j11426N7453J14274m6539j57538J16338J21361j52650n2636J11753
313B5470N9571j06880q5677J66070L4953j78986K9176J28585k0101j19346K096
324f5069J62932n4719j57303J10700R4530r0153q3652P1221J20302j26351r3914
335a11476J66360K3492j28966j7324J09175M5383j58359l342J73592o3219j18651
346h3335N6993R8468l1472j38935P7330J34742j33003o9755J13589M9982q6790
357a2186q2779J30542O2555j70762R348J32101k2345j00515r525J40577k0766
$$ plain form
368 56245 -104977 -15774 90972 1458 -72440 -16187 92990 1648 -109839 39569 84051
379 84051 -49067 -61694 32733 76957 -48798 -82729 85104 48649 -84367 -24559 64010
390 64010 37481 -78695 -36016 106202 -2741 -94728 24362 68596 -10583 -78689 16049
401 16049 96749 -53787 -74585 67997 45054 -49804 -53341 55779 63072 -88819 -33208 92869
413 92869 3573 -69231 -11818 73235 15871 -99251 17985 91750 -44521 -62050 32165
424 32165 63727 -30446 -81609 63802 63774 -82008 -30114 63764 30885 -61483 -41980 89539
436 89539 16792 -96418 16000 71923 -13354 -66259 5719 86572 -31664 -83512 59911
447 59911 52649 -52464 -45166 43573 59758 -68164 -48454 87847 14127 -72632 -7792 62354
$$ packed form
368E6245j61222Q9203J06746q9514p3898N6253J09177r1342j11487J49408M4482
379H4051j33118j2627R4427M4224j25755l3931J67833l6455j33016N9808Q8569
390F4010k6529j16176M2679J42218j08943r1987J19090M4234p9179o8106R4738
401A6049Q0700j50536k0798J42582k2943r4858l537J09120P293j51891N5611J26077
413I2869q9296p2804N7413Q5053n7364j15122J17236P3765j36271j7529R4215
424C2165L1562r4173n1163J45411k8j45782N1894R3878l2879r2368J9503J31519
436H9539p2747j13210J12418N5923q5277n2905P1978Q0853j18236n1848J43423
447E9911p262j05113P298Q8739J6185j27922J9710J36301p3720q6759O4840P0146
$$ plain form
459 62354 18981 -82738 -1271 91810 -31303 -68262 33539 56425 -23920 -71079 42945
470 42945 69690 -69139 -41998 65512 27996 -54005 -37781 70044 30959 -88951 206
481 206 77039 -13216 -60231 2723 73044 -13267 -84843 45598 62345 -51879 -42676 38168
493 38168 54130 -50771 -55920 77520 27342 -74092 -8699 57954 17359 -67911 -13736 85934
505 85934 -15504 -75367 31768 54618 -23050 -59083 26104 71347 -53950 -53318 64766 28765
517 28765 -49596 -33772 53811 40169 -78370 -13965 78497 -8600 -58908 1485 63559 -2711
529 -2711 -79035 29699 68191 -45572 -46883 37768 47218 -38887 -55516 61216 40298 -72504
541 -72504 -14909 59111 13234 -54988 -20946 74641 1019 -78679 25688 56231 -22151 -51377
$$ packed form
459F2354m3373j01719Q1467R3081j23113l6959J01801K2886q0345m7159J14024
470D2945K6745j38829K7141J07510l7516q2001J6224J07825l9085j19910Q9157
481B06P6833r0255m7015O2954P0321q6311p1576J30441J6747j14224R203Q0844
493C8168J5962j04901n149J33440n0178j01434O5393O6653m0595q5270N4175R9670
505H5934j01438n9863J07135K2850p7668l6033Q5187M5243j25297O32J18084l6001
517B8765p8361J5824Q7583j3642j18539O4405R2462q7097n0308O0393O2074o6270
529b711p6324J08734L8492j13763j311Q4651R450q6105j6629J16732k0918j12802
541g2504N7595P4020m5877o8222L4042R5587p3622p9698J04367L0543p8382k9226
$$ plain form
553 -51377 14810 67293 -37959 -60618 57079 36467 -49614 -32529 46442 38862 -63755 -26602
565 -26602 74479 3125 -64559 3795 57190 -107 -67230 12442 72056 -37030 -53207 39318
577 39318 40431 -29566 -52188 45277 49729 -66706 -22122 58073 13414 -47566 -23782 63804
589 63804 12619 -74797 12784 61133 -18535 -50813 13503 58880 -23802 -63282 44195 48372
601 48372 -52148 -31220 43892 33814 -48661 -36150 68616 13244 -67347 4862 50422 2294
613 2294 -56932 964 69148 -25399 -55529 32614 41793 -25465 -48631 34562 49878 -51793
625 -51793 -34424 55158 20691 -49317 -20216 52169 20098 -65521 -4091 67917 -15930 -52195
637 -52195 14869 49644 -11965 -63298 34148 54364 -50142 -31065 39731 31453 -39564 -37490
$$ packed form
553e1377O6187N2483j05252k2659J17697k0612q6081J7085P8971p580j02617L7153
565b6602J01081p1354o7684O8354N3395n7297o7123P9672N9614j09086j6177R2525
577C9318J113o9997k2622R7465M452j16435M4584Q0195m4659o0980K3784Q7586
589F3804n1185q7416Q7581M8349p9668l2278O4316M5377q2682l9480J07477M177
601D8372j00520K0928P5112j0078q2475J2511J04766n5372q0591P2209M5560m8128
613B294n9226N7896O8184r4547l0130Q8143R179o7258k3166Q3193J5316j01671
625e1793J7369Q9582l4467p0008K9101P2385l2071q5619O1430P2008q3847l6265
637e2195O7064L4775o1609n1333R7446K0216j04506J9077P0796q278p1017K074
$$ plain form
649 -37490 57965 20853 -60947 -3836 50500 3963 -50263 -3868 58336 -8868 -59913 23842
661 23842 48935 -27997 -41510 24674 48657 -36898 -46552 55909 24159 -49722 -16333 41532
673 41532 26042 -58732 -12636 66921 -11909 -50144 11722 45227 -7205 -56360 22974 53625
685 53625 -38378 -37827 38013 30659 -33927 -33590 41117 33409 -56019 -15553 55001 2295 -42846
698 -42846 -9927 51524 6233 -66228 20304 51902 -27986 -37084 17248 47819 -30116 -48956
710 -48956 50385 27476 -46605 -17703 38850 23052 -48142 -17289 57231 356 -52939 10153
722 10153 42114 -6446 -44124 7205 54587 -26226 -46192 37848 27927 -27076 -33207 29463
734 29463 42068 -52659 -22062 53956 5042 -40281 -12753 48084 9501 -60673 11696 52096
$$ packed form
649c7490R5455l7112q1800N7111N4336m6537n4226M6395O2204o7204n1045Q3755
661B3842K5093p6932j3513O6184K3983q5555r654J02461l1750p3881L3389N7865
673D1532j5490q4774M6096P9557p8830l8235O1866L3505n2432m9155P9334L0651
685E3625r2003N51P5840p354o4586L37P4707p708q9428M0466P0554n2706m5141
698d2846L2919O1451m5291p2461Q6532L1598p9888r098N4332L0571p7935j8840
710d8956R9341k2909p4081K8902N6553j5798p1194L0853P4520n6875n3295O3092
722A0153L1961m8560l7678N1329M7382q0813j9966Q4040r921n5003o131O2670
734B9463J2605r4727L0597P6018m8914m5323K7528O0837l8583p0174P2369M0400
$$ plain form
746 52096 -22032 -39941 19093 40528 -21820 -44518 35290 36529 -44592 -20682 37966 18162
758 18162 -34393 -25007 49502 13284 -56150 7143 40992 -3806 -39536 -1469 54622 -18507
770 -18507 -49076 32510 31357 -25426 -32966 26809 38348 -42587 -27583 49617 11928 -43606
782 -43606 -7769 39967 10126 -48163 -1237 54384 -17607 -41100 19543 31784 -10885 -43271
794 -43271 23319 43672 -41253 -23371 34588 18973 -28123 -29146 44035 19644 -52935 -337
806 -337 42794 -2406 -38195 -840 46860 -8683 -49838 24735 38693 -29243 -28067 22904 32644
819 32644 -29019 -34749 45953 17056 -44118 -5161 31810 13258 -40376 -10839 52692 -10039
831 -10039 -41830 15601 31541 -8068 -40147 15678 43695 -31853 -31398 34754 21574 -29846
$$ packed form
746E2096p4128j7909N9034K1435o2348k2698P9808J239q1121K3910N8648j9804
758A8162n2555R386P4509l6218o9434O3293L3849m4798l5730L8067N6091p3129
770a8507l0569Q1586j153n6783p540N9775J1539q0935J5004P7200l7689n5534
782d3606L5837M7736k9841n8289M6926N5621p1991k3493O0643J2241m2669l2386
794d3271O6590K0353q4925J7882N7959j5615m7096j023P3181k4391p2579N2598
806c37M3131m5200l5789L7355M7700n5543m1155P4573J3958o7936J176N0971R740
819C2644o1663n730Q0702k8897o1174L8957L6971j8552n3634K9537O3531o2731
831a0039l1791N7431J5940l9609l2079N5825K8017p5548M55O6152j3180n1420
$$ plain form
843 -29846 -23544 33861 24123 -46155 -10408 47691 -3565 -36092 733 37089 438 -48498
855 -48498 16674 42178 -27692 -26313 19501 29790 -20804 -36431 37900 23097 -41130 -9647
867 -9647 31792 12897 -34299 -14426 45590 1471 -46096 11458 35453 -10512 -33158 8314
879 8314 41827 -21642 -39343 35280 22336 -30324 -18572 25137 26850 -39284 -17826 46916
891 46916 -506 -35624 336 32136 4863 -42794 7057 43627 -21413 -31320 20125 26918
903 26918 -16973 -33069 26404 30738 -38305 -16545 35545 8985 -28911 -15250 37103 11113
915 11113 -47034 6831 38101 -12283 -28822 5701 36854 -13196 -40243 29003 26606 -29728
927 -29728 -18227 22942 23255 -29714 -22090 40409 9120 -38485 -265 30969 3154 -34195 -1757
$$ packed form
843b9846O302N7405r738p0278L5747N8099n1256l2527L6825L6356l6651m8936
855d8498O5172K5504o9870J379M5814J0289n0594j5627P4331j4803o4227L1483
867i647M1439j8895m7196J9873O0016m4119m7567N7554K3995m5965k2646M1472
879H314L3513o3469j7701P4623j2944n2660J1752M3709J713o6134K1458O4742
891D6916m7422l5118L5960L1800k7273m7657M9851L6570o5040r907N1445O793
903B6918m3891j6096N9473M334o9043K1760N2090k6560l7896J3661N2353k5990
915A1113n8147N3865L1270n0384j6539L4523L1153n0050k7047O9246k397n6334
927b9728J1501M1169L13n2969P624O2499l1289m7605L8220L1234k7815l7349L2438
$$ plain form
940 -1757 42182 -12288 -37015 20526 26118 -15714 -28406 17752 33484 -31911 -22517 35479 11368
953 11368 -28202 -14015 31508 14441 -41582 -1177 40018 -8726 -31322 6600 31878 -7483
965 -7483 -37785 19303 32985 -28188 -21103 24024 19765 -23026 -24363 33978 15703 -39197 -2881
978 -2881 31296 1895 -29801 -4539 38318 -5978 -37641 16905 27218 -15183 -25851 13710
990 13710 30827 -23506 -26518 31551 15325 -27913 -12767 25673 15830 -34080 -9067 38954
1002 38954 -3588 -31776 5742 27795 -2140 -35051 11252 35778 -23890 -24526 22800 19773
1014 19773 -19368 -24950 28024 21355 -37282 -7879 32527 2781 -27416 -6433 33680 678
1026 678 -38620 12703 30379 -15734 -23313 11385 27889 -16632 -29438 28457 18551 -28606 -10702
$$ packed form
940a757M3939n4470k4727N7541N592m1832j2692M6158J5732o5395R394N7996k4111
953A1368l9570J4187M5523j7067n6023M0405M1195m8744k2596L7922K5278l9361
965g483l0302N7088J3682o1173P085M5127m259m2791j337N8341j8275n4900L6316
978b881L4177k9401l1696K5262M2857m4296l1663N4546J0313m2401j0668L9561
990A3710J7117n4333l012N8069j6226m3238J5146L8440r843m9910K5013M8021
1002C8954m2542k8188L7518K2053k9935l2911M6303K4526n9668o36M7326l027
1014A9773l9141n582N2974o669n8637K9403M0406k9746l0197K0983M0113l3002
1026F78l9298N1323J7676m6113p579L4698J6504m4521j2806N7895r906m7157J7904
$$ plain form
1039 -10702 22119 14866 -27239 -13819 36664 1303 -32836 5388 24961 -1136 -29547 4029
1051 4029 34951 -16536 -28079 21239 19414 -16611 -22289 19727 24746 -31176 -14417 33051 4887
1064 4887 -26183 -6831 28108 6739 -36703 4587 34019 -13508 -25087 10949 25478 -11427
1076 -11427 -30239 22806 23887 -28361 -13063 23236 13076 -23469 -15394 31694 6474 -33938
1088 -33938 3043 26217 -2739 -25402 1417 31617 -10137 -29602 18798 20688 -16433 -19423
1100 -19423 15368 23583 -24121 -18400 29730 7972 -25236 -6753 24046 9298 -31223 -1659
1112 -1659 33279 -8687 -25833 9049 23567 -7461 -28720 15394 26909 -24620 -17244 22716
1124 22716 13118 -20050 -16552 27240 12660 -32768 -661 27826 -2236 -23889 -593 28986
$$ packed form
1039a0702L2821p253m2105J3420N0483l5361l4139L8224J9573k6097k8411L3576
1051D029L0922n1487j1543M9318j825l6025n678M2016N019n5922J6759M7468k8164
1064D887l1070J9352L4939k1369m3442M1290K9432m7527j1579L6036J4529l6905
1076a1427j8812N3045J081n2248J5298L6299j0160l6545Q075M7088k5220m0412
1088c3938L6981K3174k8956k2663K6819L0200m1754j9465M8400J890l7121k990
1100a9423L4791Q215m7704N721M8130k1758l3208J8483L0799j4748m0521K9564
1112a659L4938m1966j7146L4882J4518l1028k1259M4114J1515n1529P376L9960
1124B2716r598l3168L498M3792j4580m5428L2107K8487l0062k1653K3296K9579
$$ plain form
1136 28986 -5424 -31250 15705 22919 -16437 -18154 13349 22082 -19419 -20350 27448 10709 -25592
1149 -25592 -6263 21836 9025 -26647 -5925 31640 -4854 -26762 8688 21120 -5433 -25592
1161 -25592 9450 27895 -20227 -19618 21829 13113 -16848 -16523 21967 16016 -30371 -5537 28232
1174 28232 -326 -22233 -2168 25817 -446 -30454 10285 25907 -15225 -18879 12597 20497
1186 20497 -14577 -22489 23387 15678 -25928 -6924 20410 8687 -22016 -9166 29983 -250
1198 -250 -28128 7389 20805 -4709 -22780 5594 27121 -15233 -22136 19701 14548 -16784 -15031
1211 -15031 17532 16698 -25322 -10538 28088 1379 -22934 -1225 21329 3041 -27669 4431
1223 4431 27789 -13759 -18656 11718 17476 -9762 -22943 18254 18641 -23619 -9539 19500 8596
$$ packed form
1136B8986l4410k5826M6955P214l9356j717L1503Q733m1501r31M7798j6739l6301
1149b5592J9329K8099j2811l5672K0722L7565l6494k1908L5450J2432k6553k0159
1161b5592L5042J8445m8122O09M1447q716k9961L25L8490n951m6387K4834L3769
1174B8232k8558k1907K0065K7985k6263l0008M0739J5622m1132l654L1476P900
1186B0497l5074p912M5876p709m1606J9004K7334j1723l0703J2850L9149l0233
1198b50k7878L5517J3416k5514j8071K8374K1527m2354o903M1837n153l1332J753
1211a5031L2563q34m2020J4784L8626k6709k4313K1709K2554j8288l0710L2100
1223D431K3358m1548m897L0374N758k7238j3181M1197L87m2260J4080K9039j0904
$$ plain form
1236 8596 -19005 -11044 25763 5292 -28061 3229 23344 -4886 -20552 2846 24753 -8764
1248 -8764 -26069 17406 17275 -17869 -12550 14125 16947 -20278 -15043 27997 3758 -23149 -1202
1261 -1202 18662 5021 -24802 87 27444 -9643 -20721 10727 17285 -8407 -20045 12182
1273 12182 20875 -20111 -14155 21491 8120 -17561 -10126 19841 10222 -27526 -631 25596 -5583
1286 -5583 -18401 1870 21838 -3972 -26245 14557 19096 -16383 -12906 12667 15611 -16213 -15696
1299 -15696 22416 8963 -22580 -3540 18916 3605 -20334 -3996 24938 -2772 -24798 10299
1311 10299 17803 -8137 -17858 7444 22595 -16843 -17349 21436 8493 -16333 -10112 17409 11817
1324 11817 -24955 -3475 24608 -3244 -18844 1978 19404 -2452 -22864 8267 21246 -13843
$$ packed form
1236H596k7601P961L6807k0471l3353L1290K0115k8230j5666K3398K1907l3517
1248h764j7305M3475j31l5144N319K6675K822l7225N235M3040k4239k6907K1947
1261a202J9864j3641k9823K4889K7357l7087j1078L1448O558k5692j1638L2227
1273A2182Q693m0986N956L5646j3371k5681P435K9967r619l7748K6895K6227l1179
1286e583j2818K0271J9968k5810k2273M0802M539l5479L477K5573K944l1824N17
1299a5696L8112j3453l1543J9040K2456j5311k3939J6338K8934k7710k2026L5097
1311A0299P504k5940r721K5302J5151l9438n06L8785j2943k4826O221K7521n592
1324A1817l6772K1480K8083k7852j5600K0822J7426k1856k0412L1131J2979l5089
$$ plain form
1336 -13843 -15137 13157 12850 -11793 -16434 16895 14438 -23494 -5011 19243 3345 -16604 -7528
1349 -7528 23947 1044 -25968 8844 18574 -7568 -16936 5706 21402 -13282 -18777 18418 11277
1362 11277 -16900 -8797 15397 10381 -18986 -8668 23602 919 -21053 2734 16252 666
1374 666 -19424 1818 24322 -11414 -17042 13080 12079 -8510 -17391 14253 17041 -21601 -8022
1387 -8022 19620 4339 -16562 -6521 20283 3693 -23792 3635 20955 -7778 -15946 6573
1399 6573 16367 -6831 -19889 14198 15536 -17954 -7863 12927 10035 -13320 -12718 21905 4582
1412 4582 -21549 1330 15716 1778 -18276 -772 22841 -7413 -19363 11461 14367 -9802
1424 -9802 -14653 10929 16079 -16884 -12572 19937 5241 -17251 -3719 15187 6370 -21020 -1470
$$ packed form
1336a3843j294K8294l07k4643m641L3329k457l7932J8483K4254j5898j9949R076
1349g528L1475k2903k7012L4812R730k6142r368K2642J5696l4684n495L7195p141
1362A1277k8177Q103K4194n016k9367J0318L2270k2683k1972K3787J3518j5586
1374F66k0090K1242K2504l5736n628L0122j001k0589q881L1644K788l8642J3579
1387h022K7642j5281k0901J0041K6804j6590k7485K7427J7320k8733q168K2519
1399F573R794k3198j3058L4087J338l3490J0091K0790k892k3355O02L4623j7323
1412D582k6131K2879J4386j3938k0054J7504K3613l0254j1950L0824K906k4169
1424i802m851K5582N150l2963M312L2509j4696k2492J3532J8906q817k7390J9550
$$ plain form
1437 -1470 22673 -7033 -15565 5169 15011 -2914 -19885 10649 17768 -15656 -10460 12298 10849
1450 10849 -12525 -12545 18179 8335 -20880 -2213 17948 213 -16474 -934 19490 -2427 -21059
1463 -21059 9678 16039 -10820 -11348 7663 15354 -12097 -14928 18864 6742 -15997 -4559 13095
1476 13095 8220 -18457 -3831 20886 -3110 -16633 3402 14964 -2754 -18127 6533 18224
1488 18224 -12235 -14132 13967 10146 -11476 -11338 13990 11403 -20238 -4804 18930 -578 -13930
1501 -13930 -2478 16900 1000 -21488 7202 16414 -9093 -12014 6061 14766 -9145 -15115 14989
1514 14989 10469 -15387 -6479 13420 7033 -14829 -6796 19236 1466 -19505 3542 14596 -2673
1527 -2673 -14988 2440 19335 -9321 -16148 13492 9482 -9918 -10744 10934 13020 -17516 -6859
$$ packed form
1437a470K4143k9706q532K0734R842j7925j6971L0534P119l3424N196K2758j449
1450A0849k3374k0L0724r844k9215J8667K0161j7735j6687J5540K0424k1917j8632
1463b1059L0737O361k6859n28J9011P691k7451k831L3792j2122k2739J1438J7654
1476A3095m875k6677J4626K4717k3996j3523K0035J1562j7718j5373K4660J1691
1488A8224l0459j897K8099l821k1622J38K5328k587l1641J5434K3734j9508j3352
1501a3930J1452J9378j5900k2488K8690R212k5507k921J8075Q705k3911n970L0104
1514A4989m520k5856Q908J9899o387k1862Q033K6032j7770k0971K3047J1054j7269
1527b673j2315J7428J6895k8656o827K9640m010j9400q26K1678K086l0536J0657
$$ plain form
1540 -6859 18016 1640 -13383 -2557 14654 2949 -18892 2760 18116 -7326 -13444 6629
1552 6629 12438 -6244 -15624 11280 13533 -15725 -7216 13246 5981 -11802 -9223 17385 4372
1565 4372 -19346 2592 14318 -1974 -13773 512 17662 -6563 -16701 11101 11062 -9969 -10213
1578 -10213 9006 12197 -13515 -10205 17008 4229 -15133 -2042 12423 4398 -16341 -1226
1590 -1226 19234 -5815 -14530 6765 11879 -4358 -15054 8314 14876 -13980 -9050 12942 6436
1603 6436 -10868 -8792 14650 6736 -17803 -722 15600 -1686 -13162 271 15177 -1991
1615 -1991 -17343 7831 13498 -10147 -9506 7745 11235 -9716 -12318 15237 6654 -15420 -2731
1628 -2731 11804 4520 -14174 -3706 17693 -2749 -16134 5668 12130 -3824 -13113 5220 14751
$$ packed form
1540f859K4875j6376j5023J0826J7211j1705k1841K1652J5356k5442o118K0073
1552F629N809j8682r380K6904K253k9258Q509K0462p265j7783K579K6608j3013
1565D372k3718K1938J1726j6292j1799J4285J7150k4225j0138K7802l9k1031k44
1578a0213J9219L191k5712L310K7213j2779j9362J3091J4465q025k0739J5115
1590a226K0460k5049q715K1295N114j6237j0696K3368O562k8856M930K1992o506
1603F436j7304K076K3442p914k4539J7081J6322j7286j1476J3433J4906j7168
1615a991j5352K5174N667k3645O41J7251L490k0951k602K7555q583k2074J2689
1628b731J4535p284j8694J0468K1399k0442j3385K1802O462j5954r289J8333R531
$$ plain form
1641 14751 -10661 -11582 12719 7175 -10297 -7428 11121 8525 -15863 -4188 16639 -835 -12570
1654 -12570 52 12677 357 -16540 4800 14846 -8735 -10485 7354 10095 -7370 -12226
1666 -12226 11863 9329 -14846 -4323 12436 3312 -11725 -4842 14953 1289 -16519 3768
1678 3768 12770 -4215 -11221 3049 14170 -7348 -13812 11541 8585 -10656 -6820 9072 9028 -12897
1692 -12897 -6713 16120 1014 -13686 568 11631 1326 -14257 1617 15572 -6938 -11895
1704 -11895 7618 9550 -6028 -11454 8657 11414 -13403 -6518 13190 3239 -10538 -5094 12972
1717 12972 3853 -15931 1728 13727 -4003 -10957 2184 12431 -4229 -14072 8996 10388 -10692
1730 -10692 -6760 8625 8008 -10145 -8097 14367 3677 -14320 -220 11204 728 -11961 -873
$$ packed form
1641A4751k5412r21K4301n544j7472K869J8549k596k4388J1675K0827j7474j1735
1654a2570J2622J2625j2320j6897K1340J0046k3581j750J7839K741j7465m856
1666a2226K4089k534k4175J0523J6759r124j5037O883J9795j3664j7808K0287
1678C768R002j6985p006J4270J1121k1518o464K5353k956j9241L836J5892m4k1925
1692a2897O184K2833j5106j4700J4254J1063j0305j5583J5874J3955k2510m957
1704a1895J9513J932j5578n426K0111K757k4817O885J9708r951j3777N444J8066
1717A2972r119j9784J7659J1999j7730o954J3141J0247j6660r843K3068J392k1080
1730a0692L932J5385o17j8153K048K2464j0690j7997J4100J1424j0476j2689J1088
$$ plain form
1743 -873 14875 -4433 -13622 7319 9525 -5840 -10059 6436 11839 -11216 -8860 12779 4261
1756 4261 -10396 -4474 10355 5435 -14242 -1302 14392 -2851 -11141 2787 11089 -1991 -13363
1769 -13363 6167 12272 -10056 -7638 8564 7347 -7906 -9102 11844 6134 -14039 -1561 11197
1782 11197 1011 -10555 -2541 13788 -1037 -14260 5602 10692 -5878 -8991 4722 11282 -7849
1795 -7849 -10467 11918 6054 -10584 -4032 9004 5489 -11940 -3922 14437 -1343 -11683 2590
1808 2590 9889 -1199 -12241 3681 12846 -8063 -9106 8613 6948 -6982 -8398 9183 8123
1821 8123 -12750 -3671 11716 1358 -9577 -2232 11404 1012 -13858 3538 11714 -5616 -8753
1834 -8753 4207 9889 -5316 -11313 10098 7302 -10728 -4190 8208 5482 -10148 -5129 13371
$$ packed form
1743h73J5748j9308r189K0941K206j5365m219J6495N403k3055K356K1639q518
1756D261j4657N922J4829m920j9677J2940J5694j7243q290J3928Q302j3080j1372
1769a3363J9530O105k2328K418J6202j217j5253j196K0946n710k0173J2478J2758
1782A1197j0186j1566Q014J6329j4825j3223J9862N090j6570l113J3713O560j9131
1795g849k618K2385n864j6638O552J3036l515j7429Q018J8359j5780j0340J4273
1808B590P299j1088j1042J5922R165k0909j043J7719j665j3930j416J7581j060
1821H123k0873R079J5387j0358j0935P345J3636j0392j4870J7396Q176j7330l137
1834h753J2960N682j5205n997K1411k796j8030O538J2398k726j5630N019J8500
$$ plain form
1847 13371 856 -12592 1903 9583 -976 -11022 1639 12778 -5789 -10886 8034 7232 -6864
1860 -6864 -7658 7377 9168 -11095 -5918 12203 1580 -9586 -1980 10061 2668 -13194 1508
1873 1508 12288 -4949 -8941 3810 9425 -3850 -10927 7427 9248 -9602 -5576 8567 5029
1886 5029 -8186 -6001 11143 3738 -12595 504 10701 -1454 -8873 -111 11812 -2834 -12140
1899 -12140 7437 8181 -6510 -6876 5542 9068 -9132 -7318 11369 3188 -9597 -2271 8622
1912 8622 3020 -11317 -1170 12646 -2404 -10517 3562 8580 -2945 -9842 4766 10621 -8313
1925 -8313 -7449 9107 5155 -7319 -6091 9228 5689 -12169 -797 10717 -849 -9018 133
1938 133 10459 -1559 -11576 5014 8868 -5830 -7362 5353 7872 -6858 -8078 9308 5411
$$ packed form
1847A3371j2515j3448J4495P680j0559j0046J2661J1139j8567n097J8920q02j4096
1860f864p94J5035J791k0263N177J8121j0623j1166P606J2041p393j5862J4702
1873A508J0780j7237l992J2751N615j3275p077J8354J821j8850M026J4143l538
1886E029j3215K185J7144p405j6333J3099J0197j2155p419Q762J1923j4646r306
1899a2140J9577P44j4691l66J2418L526j8200J814J8687q181j2785P326J0893
1912H622n602j4337J0147J3816j5050q113J4079N018j1525o897J4608N855j8934
1925h313Q64J6556l952j2474J228J5319l539j7858J1372J1514j1566q169R151
1938A33J0326j2018j0017J6590L854j4698j532J2715K519j4730j220J7386l897
$$ plain form
1951 5411 -9809 -2877 8562 3006 -9058 -3214 12059 -320 -10763 3282 8055 -2102 -9481
1964 -9481 2882 10936 -7375 -7894 8112 5564 -6794 -5912 8780 5457 -10610 -2369 10306 408
1978 408 -9085 -206 8856 -151 -10560 2687 10484 -5588 -7388 4587 7529 -4401 -9045 8132
1992 8132 6658 -9601 -2895 7666 3702 -7753 -4030 11075 419 -10930 1918 8503 -1753
2005 -1753 -8616 2415 9703 -4719 -9121 7411 6176 -7177 -4780 6137 6292 -8173 -5320 10775
2019 10775 1107 -9431 -247 7272 2119 -10617 546 11215 -4734 -7904 4040 7004 -3900
2032 -3900 -8745 6620 7307 -9102 -4418 8628 2820 -7738 -3410 8902 2435 -10699 870
2045 870 9540 -2604 -6801 1078 8331 -2215 -9789 6340 6595 -6477 -4589 4727 6337 -6667
$$ packed form
1951E411j5220O932J1439n556j2064N844J5273j2379j0443J4045M773j0157p379
1964i481J2363Q054j8311n19J6006k548j2358Q82J4692l323j6067Q241J2675r898
1978D08r493Q879R062r007j0409J3247P797j6072j800J1975K942j1930m644J7177
1992H132j474j6259O706J0561l964j1455L723J5105j0656j1349J2848O585j0256
2005a753o863J1031P288j4422m402J6532j235j3353K397J0917J55j4465K853J6095
2019A0775r668j0538R184P519n153j2736J1163J0669j5949l170J1944K964j0904
2032c900m845J5365O87j6409M684J3046n808j0558M328J2312o467j3134J1569
2045H70Q670j2144m197P879P253j0546p574J6129K55j3072J888R316J610j3004
$$ plain form
2059 -6667 -6321 9710 2905 -8771 -1240 7762 1813 -9005 -807 10201 -2206 -9602 4279 7198
2073 7198 -4277 -7095 4132 8128 -7302 -6130 8950 2607 -6842 -3226 6677 4120 -10165 -228
2087 -228 9768 -2140 -6877 675 7804 -1405 -9304 4259 7566 -5922 -5528 5487 5834 -5918
2101 -5918 -6032 7739 4758 -9313 -1461 8210 510 -7012 -1709 9388 -324 -10301 4381 6739
2115 6739 -3656 -6326 2605 8434 -5753 -6845 8027 3600 -6131 -3694 6226 4329 -8189 -2520
2129 -2520 9327 68 -8328 1030 6978 -826 -8300 2343 9193 -5193 -7053 5854 4425 -4652
2143 -4652 -6021 6302 5833 -9302 -2297 7683 982 -6241 -1699 8209 685 -9406 2304 7482
2157 7482 -3157 -6283 2772 7312 -3826 -7576 5684 5528 -6877 -3666 5856 4082 -6089 -4166
$$ packed form
2059f667L46J6031o805j1676P531R002n949j0818Q198J1008j2407p396J3881K919
2073G198j1475k818J1227L996j5430J172J5080o343r449L616R903k557j4285R937
2087b28R996j1908m737P552P129r209p899J3563L307j3488L94J1015L47j1752
2101e918j14J3771k981j4071P852R671p700p522N303J1097r712r977J4682K358
2115F739j0395k670Q931N829j4187j092J4872m427r731K437R920j897j2518N669
2129b520J1847r259q396R358N948p804p474J0643O850j4386j860J2907j429r077
2143d652j369J2323m69j5135P005R980o701p223M542R908p524j0091J1710N178
2157G482j0639l126R055M540j1138l750J3260j56j2405L211R522j774j0171J923
$$ plain form
2171 -4166 9034 1412 -8936 1379 6311 -76 -7739 763 9099 -4259 -6928 5247 4914 -3866
2185 -3866 -5655 5142 5928 -7439 -3365 7763 1701 -6766 -1818 6729 1877 -8264 348 8746
2199 8746 -3337 -6197 2334 6009 -1952 -7890 5094 6923 -6974 -3083 5468 3554 -5412 -4522
2213 -4522 8250 2393 -8285 468 6402 -78 -6531 -134 7469 -2371 -7909 4583 5560 -4427
2227 -4427 -4610 3630 6230 -5750 -5439 7839 2006 -6538 -1384 5690 2861 -7676 -868 9247
2241 9247 -2141 -6547 2251 5813 -1363 -7077 3518 7005 -5639 -4492 5739 3315 -4782 -4097
2255 -4097 6215 3533 -7939 -927 7476 -737 -5854 -190 6757 -365 -7940 3680 6255 -4513
2269 -4513 -4264 2701 5446 -4354 -5736 6898 2864 -6939 -1597 5215 2290 -6553 -2019 7711 -762
$$ packed form
2171d166J3200p622j0348J0315M932o387p663Q502Q336j3358k669J2175l33q780
2185c866j789J0797P86j3367M074J1128o062q467M948Q547m852j0141Q612Q398
2199H746j2083k860Q531L675p961n938J2984J829j3897L891Q551j914q966Q90
2213d522J2772n857j0678Q753N934o480o453O397P603r840n538J2492R77r987
2227d427j83Q240K600j1980L11J3278n833q544N154P074k829j0537O808J0115
2241I247j1388m406Q798L562p176n714J0595L487j2644J147J0231k424q097O85
2255d097J0312k682j1472P012Q403q213n117N664O947p122p575J1620K575j0768
2269d513K49O965K745r800j382J2634m034r803N342O812k925q843M534R730q473
$$ plain form
2284 -762 -7264 2180 5598 -1629 -5876 1707 7010 -4462 -5405 5756 3440 -4654 -3760 4934 4057
2299 4057 -7036 -1946 7009 -147 -5694 -588 6134 30 -7686 2118 6848 -3557 -4818 3061
2313 3061 5437 -3312 -5847 5398 4167 -6453 -2119 5528 2068 -5382 -2495 6841 590 -7488
2327 -7488 1465 5791 -1585 -5252 1503 6684 -3620 -6269 5311 4055 -4558 -3409 4053 4028 -5967
2342 -5967 -3141 7006 983 -5837 -334 5394 679 -6568 530 7057 -3190 -5169 3327 4361
2356 4361 -2713 -5533 4360 5366 -5831 -2484 5796 1822 -4590 -2574 5851 1667 -7273 841 6000
2371 6000 -1455 -4987 734 6012 -2041 -6458 4105 4879 -4519 -3391 3638 3837 -4513 -4083 6608
2386 6608 1804 -6197 -389 5026 919 -5817 -415 6846 -2315 -5870 2908 4205 -2519 -4674 2754
$$ packed form
2284g62o502R444L418p227m247P583N303j1472r43J1161k316q094Q94Q694q77
2299D057j1093N090Q955p156n547N106O722o104p716R804M730j0405j261P879
2313C061K376q749k535J1245j231j0620M334P647l460p450K887R336o251q078
2327g488Q953M326p376l667O755N181j0304k649J1580j256q613J149P462k5r995
2342e967K826J0147o023o820N503N728m715p247P098O527j0247j979Q496J034
2356D361p074k820R893J006j1197L347Q280l974o412K016Q425m184q940Q114N159
2371F000p455l532N721N278q053m417J0563P74r398J128P029J99q350M30J0691
2386F608m804q001N808N415m107o736N402P261r161l555Q778J297o724k155P428
$$ plain form
2401 2754 5167 -4922 -3902 5397 2316 -4368 -2276 4885 2368 -6686 -686 6406 -1146 -5123 1117
2416 1117 5090 -1032 -6228 2746 5021 -4406 -3752 3470 3495 -3685 -4116 5485 2843 -5871 -563 4859
2432 4859 722 -4846 -1137 6420 -513 -6347 2586 4609 -2250 -4335 2203 5303 -3781 -4483 5302
2447 5302 2805 -4697 -1869 3987 2574 -5648 -1556 6442 -215 -4960 857 4762 -725 -5762 1850
2462 1850 5552 -3917 -3780 3757 3563 -3475 -3921 4155 3434 -5732 -1366 5284 618 -4793 -1101 5401
2478 5401 963 -6276 1456 5558 -1998 -4047 1775 4809 -3132 -5095 4667 3496 -4385 -2165 3654
2493 3654 2938 -4741 -2505 6188 516 -5749 658 4539 -143 -5082 365 5678 -2721 -5060 3494
2508 3494 3394 -2656 -3426 2989 4191 -5148 -2268 5276 1006 -4055 -1096 4788 1170 -5745 716
$$ packed form
2401B754K413j0089J020R299l081o684K092P161k517r054O000P092p552l977O240
2416A117L973o122n196Q974K275r427O54P222K5p180m31R601k642q714N308N422
2432D859m137n568L709P557o933n834Q933K023o859k085O538L100r084p02R785
2447E302k497p502K828N856j413q222M092P998o657m745N817L905n487n037P612
2462A850L702r469J37P537j94p038m46Q076p21r166M366O650m666n411L692O502
2478E401m438p239P732M102p556k049N822L034p941j963R762j171p881K220N819
2493C654p16p679K236Q693n672o265O407L881m682m939N447N313q399k339Q554
2508C494j00o050p70O415J202r339K880P544m270n061K959N884l618o915O461
$$ plain form
2523 716 5685 -1972 -3752 1261 4634 -1802 -5159 3376 4043 -4131 -2588 3844 2264 -3643 -2977 5167
2539 5167 1234 -5513 306 4180 -275 -4395 -80 5825 -1729 -5138 3118 3682 -3063 -3433 2485
2554 2485 4040 -4184 -2777 5124 1325 -4035 -1154 3983 1646 -5089 -340 5684 -1481 -4087 1812
2569 1812 3971 -1451 -4762 2580 4421 -4038 -2701 3541 2041 -3293 -3161 4256 2083 -5418 -294
2584 -294 4340 -64 -3642 -44 5000 -812 -5195 2690 3850 -2672 -3102 2178 3559 -3079 -3718 4463
2600 4463 2208 -4167 -667 3486 1696 -4330 -877 5315 -894 -4713 1404 3502 -900 -4368 1489
2615 1489 4607 -3319 -3198 3595 2445 -3145 -2816 3492 2731 -4634 -1221 4707 -204 -3842 -93 3440
2631 3440 50 -5173 1330 4765 -2725 -3021 1851 3375 -2010 -3903 3969 2636 -4012 -1360 3252
$$ packed form
2523G16M969p657j780N013L373o436l357Q535O67q174J543O432j580n907O66Q144
2539E167l933o747N819L874m455m120M315N905p554l409Q256N64o745l70N918
2554B485J555q224J407P901l799n360K881N137k337o735M749O024p165k606N899
2569A812K159n422l311P342J841q459J337O242j500n334J32P417k173p501N124
2584b94M634m404l578L598N044n812m383P885J160o522m30N280J381o638o39Q181
2600D463k255o375L500M153j790o026L453O192o209l819O117K098m402l468N857
2615A489L118p926J21O793j150n590L29O308p61p365L413N928m911l638L749L533
2631C440l390n223O503L435p490k96M872J524n385j893P872j333o648K652M612
$$ plain form
2646 3252 1651 -3924 -1499 5114 -80 -4833 789 4118 -1408 -3439 1074 4105 -2100 -4113 3236
2661 3236 2810 -2989 -2045 2569 2808 -4147 -1841 4525 297 -3419 -457 3790 701 -4639 685 4349
2677 4349 -1815 -3364 1594 3102 -1846 -3636 2720 3413 -4077 -2381 3552 1328 -3312 -1606 4021
2692 4021 1266 -5022 707 4068 -1121 -2950 202 4119 -1260 -4143 2650 2646 -2638 -2345 2492 2803
2708 2803 -3469 -2569 4152 1162 -3920 -580 3693 277 -3871 -77 4289 -871 -4289 2149 2647
2723 2647 -1854 -2783 2113 3686 -3274 -2233 3468 1151 -2502 -1721 3436 1635 -4544 -70 3704
2738 3704 -486 -3019 479 3398 -711 -3710 1933 3434 -2486 -2582 2455 2151 -2652 -2774 3248 1936
2754 1936 -3933 -372 2991 635 -3472 -648 4404 -847 -3925 1904 2324 -1287 -2935 1659 3402
$$ packed form
2646C252j601n575K425O613n194m753N622L329n526k031M513L031o205k013P349
2661C236m26n799R44M614K39o955K306O366m228l716K962M247l089n340N324L664
2677D349o164j549M958J508m948j790O356O93p490J696N933k224m640J706N627
2692D021k755o288N729L361n189j829L152L917n379k883O793mn284K93M837L11
2708B803o272R00O721k990n082L340M273l416m148L794M366n160l418O438M98
2723B647m501r29M896J573o960J041N701k317l653P81N157j801o179M474L774
2738C704m190k533L498K919m109k999N643J501n920r6N037l04m803j22O022j312
2754A936n869L561L363k356m107K824N052n251l078N829M20l611j648M594J743
$$ plain form
2769 3402 -2383 -2664 3126 1797 -2495 -1685 2713 1794 -3574 -1291 3968 -258 -3687 666 2927 -398
2785 -398 -3772 1448 3610 -2353 -2556 2499 1731 -1982 -2961 3205 1975 -3893 -281 3053 593 -2805
2801 -2805 -772 3462 211 -4163 1078 3517 -1482 -2443 1506 2759 -1331 -2991 2714 2350 -3097
2816 -3097 -1687 2455 1807 -3037 -1550 4153 47 -3210 533 2966 -197 -3571 692 3458 -2102
2831 -2102 -2878 2119 2211 -1830 -2172 2119 2360 -2976 -1736 3301 252 -2455 -675 2961 816 -3688
2847 -3688 404 3437 -1405 -2456 910 3049 -1180 -3393 2587 2472 -2917 -1633 2337 1816 -2508
2862 -2508 -1518 3288 472 -3222 -67 2937 -100 -2927 -124 3268 -1346 -3529 1710 2487 -1373
2877 -1373 -2112 1499 2722 -2837 -2052 3359 1112 -2792 -834 2551 964 -3507 -220 3509 -676
$$ packed form
2769C402n785k81N790j329m292Q10M398r19n368K283N259m226l429M353K261l325
2785c98l374N220K162n963k03N055p68l713r79O166j230n868L612L334k460l398
2801b805K033M234l251m374N241K439m999r61L949J253m090j660N705l64n447
2816c097J410M142o48m844J487N703m106l257L743K433l163l374M263K766n560
2831b102p76M997R2m041l42M291K41n336J240N037l049k707J780L636k145m504
2847c688M092L033m842j051L366K139m229k213N980j15n389J284L970n21m324
2862b508R90M806k816l694L155L004l037k827K803L392m614k183N239P77l860
2877a373p39L611J223n559P85N411k247l904J958L385j587m471L287L729m185
$$ plain form
2892 -676 -2640 618 2667 -598 -3051 1636 2880 -2617 -2022 2442 1519 -2399 -1644 2789 1283 -3288
2908 -3288 -210 2974 -53 -2689 -519 3067 -611 -3135 1793 2791 -1179 -2124 1409 2356 -2021 -2274
2924 -2274 2820 1056 -2595 -1069 2195 1152 -2764 -549 3330 -524 -3360 760 2411 -584 -2713
2939 -2713 706 2846 -1924 -2046 2456 1609 -1699 -1683 1984 1276 -3133 -665 2747 83 -2314 -481
2955 -481 2724 -13 -2938 1049 2526 -1720 -2179 1491 2048 -1614 -2691 2365 1624 -2898 -919 2332
2971 2332 809 -2260 -1057 3263 206 -2968 782 2193 -418 -2447 584 2688 -1737 -2049 1944
2986 1944 1207 -1938 -1943 1632 1755 -2810 -1624 2861 -69 -2536 -304 2498 687 -2619 539 2912
3002 2912 -1192 -2151 1547 1668 -787 -2139 2016 1926 -2269 -1329 1873 925 -1862 -849 2352 397
$$ packed form
2892f76j964L258K049l265k453M687J244n497N95M464r23l918P55M433j506m571
2908c288L078L184l027k636K170L586l678k524M928R98l970r45L533R47m377k53
2924b274N094j764l651J526L264j043l916K215L879l854k836M120J651k995k129
2939b713L419K140m770j22M502q47l308J6L667p08m409K468L412k664k397J833
2955d81L205k737k925L987J477m246m59L670N57l662j077N056p41m522J979L251
2971B332j523l069J203M320l057l174L750J411k611k029L031K104m425l12L993
2986A944p37l145nL575J23m565J186M485k930k467K232K802j811l306L158K373
3002B912m104r59L698J21k455j352M155r0m195R40L202r48k787J013L201j955
$$ plain form
3018 397 -2849 319 2417 -605 -2122 359 2281 -841 -2808 1941 1937 -1922 -1675 1466 1415 -1698 -1804
3035 -1804 2702 612 -2235 -4 2032 536 -2634 162 2725 -643 -2074 1019 1814 -861 -1969
3050 -1969 1454 2483 -1996 -1562 2226 801 -1756 -881 2302 914 -2767 -144 2395 -668 -1965
3065 -1965 52 2096 -342 -2602 1388 2094 -1788 -1883 1402 1701 -1820 -1576 1924 902 -2329 -525
3081 -525 2079 402 -2125 -488 2813 -565 -2333 992 2102 -851 -1815 761 2078 -1584 -1835 1873
3097 1873 602 -1378 -1043 1886 1385 -2498 -719 2542 -71 -1913 403 2114 76 -2436 934
3112 934 2569 -1338 -1463 1227 1412 -1091 -1561 1879 1356 -2112 -625 1961 542 -1995 -389 2226
3128 2226 244 -2376 665 2078 -1028 -1627 565 2014 -1159 -1822 1681 1481 -1556 -952 1523 1133
$$ packed form
3018C97l246L168K098l022j517K481J922l122j967M749ml859K47L141n1l113j06
3035a804M506k090k847K231K036j496l170K796K563l368j431L093P95k675j108
3050a969L423J029m479M34L788j425k557Q75L183j388l681K623K539l063j297
3065a965K017K044k438k260L990P06l882r5L285K99l521K44L500j022l231J804
3081e25K604j677k527J637L301l378j768L325J110k953r64K576J317l662k51L708
3097A873j271j980L35K929n01l883J779L261k613j842K316J711k038k512L370
3112I34J635l907j25K690J85k503m70L440n23l468J487K586j419k537J606K615
3128B226j982k620L041J413l106n99K192J449l173o63L503k00l037O04K475l90
$$ plain form
3144 1133 -1959 -702 2286 269 -1907 135 1529 -128 -2335 546 2412 -1243 -1888 1572 1328
3159 1328 -1002 -1445 1419 1499 -2082 -702 2083 395 -2046 -655 2254 361 -2153 157 2207 -582
3175 -582 -1909 407 1729 -793 -2109 1388 1649 -1835 -1436 1331 1026 -1310 -1237 2212 395 -2146
3191 -2146 45 1632 490 -1659 -110 2414 -676 -1924 1575 1568 -1149 -1450 957 1427 -1411 -1183
3207 -1183 1798 583 -1783 -690 1580 655 -1939 97 2116 -572 -1470 416 1387 -570 -2272 935
3223 935 1772 -1537 -881 1423 1070 -1363 -1198 1902 808 -2273 -228 1827 125 -1389 -37 1446
3239 1446 53 -2030 639 1766 -1047 -1188 783 1288 -1364 -1324 1679 943 -1456 -722 1475 1163 -1896
3256 -1896 -470 2179 70 -1741 234 1689 -201 -1843 742 1992 -1399 -1420 1140 545 -1103 -1294
$$ packed form
3144A133l092J257K988k017k176K042J394j657k207K881J866l655o45L460k44
3159A328k330m43K864Q0l581J380K785j688k441J391K909j893k514K310K050k789
3175e82j327K316J322k522j316L497K61l484L99K767l05k336P3L449j817k541
3191b146K191J587j142k149J549K524l090j248L499pk717l01K407M70k838K28
3207a183K981j215k366J093K270r25k594K036K019k688q98J886R71j957j702L207
3223I35Q37l309O56K304l53k433J65L100j094l081K045K055j702j514J352J483
3239A446j393k083K669J127k813j41J971N05k652M0L003p36k399P34K197l12l059
3256a896J426K649k109j811J975J455j890j642K585J250l391k1K560n95j648j91
$$ plain form
3272 -1294 1471 1167 -1662 -479 1661 157 -1293 -4 1807 262 -1983 529 1530 -755 -1134
3287 -1134 181 1442 -946 -1652 1563 853 -1461 -744 1367 684 -1447 -658 1885 206 -1927 357
3303 357 1393 -125 -1392 195 2046 -745 -1411 1188 1188 -1134 -893 1000 1276 -1585 -984 1569 295
3320 295 -1369 11 1441 89 -2139 385 1847 -860 -1089 514 1697 -526 -1339 1087 1277 -1716
3336 -1716 -1102 1021 531 -871 -748 1616 206 -1972 442 1219 7 -1386 177 1985 -753 -1594
3352 -1594 1195 1055 -892 -1112 954 1351 -1749 -957 1657 516 -1703 -408 1359 375 -1723 -236
3368 -236 1733 -396 -1215 585 1034 -187 -1358 557 1429 -1332 -659 1080 374 -834 -673 1239 518
3385 518 -1714 177 1451 295 -1431 -87 1103 -245 -1870 972 1271 -1153 -952 671 983 -907
$$ packed form
3272a294K765l04k829J183K140j504j450J289J811j545k245K512J001k285l79
3287a134J315J261k388p06L215p10k314P17K111o83k131P89K543j679k133K284
3303C57J036j518j267J587J851k791o66K599%k322K41J893K76k861O01K553j274
3320B95j664J380J430j352k228K524J462k707k29J603J183k223q13K426J90k993
3336a716O14K123m90j402J23K364j410k178K414P77j212j393J563J808k738q41
3352a594K789j40j947k20K066L97l100P92K614j141k219J295J767r84k098J487
3368b36J969k129q19J800M49j221j171J915Q72k761O73J739p06j208J61J912p21
3385E18k232J891J274j156j726J344J190j348j625K842K99k424K01J623L12j890
$$ plain form
3401 -907 -933 1690 537 -1664 -191 1447 449 -1276 -430 1605 -378 -1530 441 1214 -771 -1221 522
3418 522 1264 -907 -988 952 821 -1096 -674 851 762 -1636 -486 1446 -130 -1210 36 959 143
3435 143 -1797 380 1513 -838 -820 777 709 -779 -1175 1000 752 -1239 -596 1202 322 -1034 -298
3452 -298 1089 212 -1549 220 1143 -480 -1028 77 1536 -794 -1634 1011 558 -915 -776 725 1016
3469 1016 -1230 -273 1497 0 -1090 325 1137 -14 -1295 328 1319 -477 -1239 618 861 -351
3485 -351 -933 800 1122 -1035 -406 1006 536 -818 -525 1052 59 -1453 -37 1013 -204 -1050 180
3502 180 1340 -237 -1025 1000 754 -955 -907 933 1150 -1135 -903 928 555 -1276 -73 890 -140
3519 -140 -875 -121 1350 -392 -1017 529 812 -343 -924 413 1097 -707 -538 902 542 -993 -296
$$ packed form
3401i07k6K623j153k201J473J638r98j725Q46K035j983j152J971P73j985m50J743
3418E22P42k171q1J940j31j917M22J525q9k398J150J932j576j080J246R23q16
3435A43j940K177J133k351J8J597o8j488l96K175k48j991O43J798q80j356P36
3452b98J387q77j761J769R23j623n48J105J459k330q40K645m53j473J39J501K91
3469A016k246R57J770j497j090J415Q12j151j281J623R91j796p62J857K43j212
3485c51n82J733L22k157O29J412m70j354K93J577r93j512J416J050j217q46J230
3502A80J160j577p88K025k46j709M8J840K17k285K32J831l73j831J203R63j030
3519a40p35P54J471j742o25J546K83j155n81J337O84j804J69J440l60j535O97
$$ plain form
3536 -296 887 649 -1315 -278 1181 -80 -1002 200 1201 36 -1073 449 1069 -1055 -806 804
3552 804 548 -823 -783 985 602 -981 59 728 108 -804 -326 1158 -185 -1204 742 1030 -345
3569 -345 -942 430 1049 -626 -1068 959 460 -975 -331 933 508 -1235 -486 1405 27 -913 174
3586 174 944 -109 -1221 289 931 -368 -749 696 459 -372 -824 576 695 -1063 -285 1185 146
3603 146 -679 -179 941 10 -1192 -166 830 -637 -800 475 756 -497 -1167 646 954 -925 -380
3620 -380 752 613 -950 -412 1099 216 -909 192 792 170 -1116 -73 1104 -386 -738 385 792
3637 792 -796 -555 829 858 -806 -699 1024 268 -705 27 641 333 -1338 246 1011 -351 -476 353
3655 353 762 -76 -982 836 441 -700 -508 688 499 -760 -798 690 492 -1056 165 900 -49 -870
$$ packed form
3536b96J183k38j964J037J459j261r22J202J001j165j109J522O20k124K49J610
3552H04k56j371M0J768l83j583J040O69o20r12M78J484j343j019J946K88j375
3569c45n97J372O19j675m42K027m99j435O44J264m25j743P49J891j378r40J087
3586A74P70j053j112J510O42j299l81J445k37q31m52J400J19j758P78J470j039
3603A46q25N00J120r31j202J026R96j467j63J275K81j253o70J813L08j879N45
3620c80J132j39j563N38J511q83j125J101O00o22j286J043J177j490l52J123M07
3637G92j588K41J384K9j664J07J723p56r73P32O14l08j671J584P65j362j25Q29
3655C53M09q38r06J818l95j141J92J196j89j259l8J488j98j548J221P35r49q21
$$ plain form
3673 -870 -28 880 2 -1016 440 699 -532 -427 292 877 -553 -759 1032 167 -710 -641 903 129
3691 129 -1079 -367 865 -68 -1197 161 987 42 -1300 500 1106 -734 -691 608 277 -290 -643 614
3709 614 704 -1129 -64 1038 -155 -599 121 1162 48 -653 665 720 -502 -808 262 720 -575
3726 -575 -1104 797 361 -836 -648 630 530 -569 -554 894 65 -1049 307 738 -238 -905 60 1039
3744 1039 -633 -852 670 551 -153 -550 787 758 -857 -165 1088 -66 -545 -220 667 83 -853 290
3762 290 892 -487 -761 286 574 -370 -833 862 493 -977 -290 760 231 -438 -720 998 175 -1080
3780 -1080 127 837 -76 -641 136 716 -165 -848 622 300 -818 -527 519 768 -480 -372 1107 -42
3798 -42 -782 43 678 195 -633 -264 714 -263 -570 563 605 86 -667 530 725 -827 -537 625 631 -794
$$ packed form
3673h70Q42R08q78j018J456K59j231J05P19N85j430k06J791q65q77O9J544p74
3691A29j208P12J232r33j129J358Q26r45j342J800O06j840M3J299l31n67l53J257
3709F14R0j833J065J102j193m44P20J041j114p01J318N5j222l06J070M58j295
3726e75n29J901m36j197J88J278j00j099J5J448q29j114J356M31r76o67R65R79
3744A039j672k19J522j19p04l97J337k9j615O92J253j154m79L25Q87n84r36J143
3762B90O02j379k74J047K88r44m63J695l69j470O87J050n29o69k82J718q23j255
3780a080J207P10r13n65P77N80q81o83J470l22j118K91J046K49j248J08J479j149
3798d2p40Q25O35m83q28L69R78r77l07J133M2n19p53J197J95j552K90J162Oj425
$$ plain form
3818 -794 -180 674 210 -887 -108 894 -18 -737 194 905 -338 -937 370 336 -322 -456 577 631 -482
3837 -482 -778 764 184 -860 -81 272 -12 -744 -103 1005 -441 -367 260 349 31 -285 650 904 -433
3856 -433 -599 883 202 -284 -375 610 497 -1248 64 867 -286 -128 73 624 60 -1009 487 679
3874 679 -673 -590 191 752 -372 -468 674 404 -824 -357 667 505 -451 -349 809 4 -755 144 423
3893 423 -282 -630 182 737 -492 -429 779 384 -272 -341 295 388 -595 -147 1102 -66 -981 67 265
3912 265 219 -1172 -7 521 -450 -460 605 548 -451 -807 648 716 -498 -270 504 -36 -477 -274 638 81
3932 81 -774 269 453 -59 -470 222 521 -146 -872 636 204 -396 -600 629 459 -368 -420 536 225 -635
3952 -635 75 679 302 -604 146 586 -573 -596 467 582 -163 -524 428 616 -594 -423 567 228 -354
$$ packed form
3818g94O14Q54m64j097P79J002r12p19R31P11j243n99J307l4o58j34J033N4j113
3837d82k96J542n80j044P79L53k84p32O41J108j446P4O27Q9l18l16R35K54j337
3856d33j66J482o81m86r1R85j13j745J312Q03j153J58K01N51n64j069J496J92
3874F79j352Q3P81N61j124r6J142k70j228M67J024j62r56J02J158q05p59Q99K79
3893D23p05l48Q12N55j229O3J208l95o56o9O36R3r83M48J249j168r15J048J98
3912B65m6j391J165N28r71j0J065n7r99l56J455O8j214K28P74n40m41K03R12n57
3932H1q55J043J84n12m11O92K99o67p26J508m32o00k04J229j70q27n2R56l11q60
3952f35P10O04l77r06P50M40j159k3J063J15p45l61R52J88j210J71R90l39n82
$$ plain form
3971 -354 -524 787 -67 -1051 26 666 127 -308 -117 195 -45 -839 456 299 -584 -382 219 172 -273
3990 -273 -480 654 158 -167 28 571 266 -472 -138 596 -431 -681 6 614 -163 -345 67 423 -327
4009 -327 -737 628 86 -455 -278 194 456 -450 -87 739 -170 -364 -183 399 -127 -670 23 586 -400 59
4029 59 352 476 -475 -744 511 543 -568 -451 463 169 -395 -370 773 361 -917 131 38 -250 -565 347
4049 347 643 -651 -356 458 3 -368 -167 450 104 -648 -69 487 286 -562 -107 273 -210 -568 -36 454
4069 454 -244 -361 559 282 -227 -444 323 453 -666 -78 546 305 -314 -488 390 278 -374 1 536 -21
4089 -21 -129 115 755 -271 -607 417 437 -434 -394 458 109 -499 -390 672 352 -866 295 229 -150 -247
4109 -247 -71 593 -21 -468 419 291 -179 -430 549 133 -438 -235 559 208 -289 -154 282 275 -606 217 228
$$ packed form
3971c54j70J311q54r84J077O40n39m35J91L12k40p94J295j57q83K02O01m7m45
3990b73k07J134m96l25J95N43l05p38L34P34j027k50O87O08p77j82M12L56p50
4009c27m10J365n42n41J77M72K62r06L63Q26r09j94J81N82n26n43O93N63r86M59
4029E9K93J24r51k69J255L2j111J17R14k94n64K5J143m12j278J048r3k88l15R12
4049C47K96j294K95Q14m55l71K01O17l46p52N79N56k01q48M55L80m83l58N32M90
4069D54o98j17R20k77n09k17P67J30j119N88O24k41o19j74Q78j12o52L75N35n57
4089b1j08K44O40j026l36J024K0q71M0Q52l49o08J09J062l20j218J161o6l79r7
4109b47J76O64o14m47Q87j28m70k51R79m16n71K03P94l51m97J35M36pq81Q23J1
$$ plain form
4130 228 -203 -421 223 285 -159 -610 217 181 -273 -291 289 307 -424 -307 379 411 -689 -178 743 -46 -350
4151 -350 -198 671 -20 -389 233 580 -796 -224 237 296 -120 -337 452 92 -441 -103 500 211 -485 -357
$$ packed form
4130B28m31k18O44O2m44m51Q27l6m54j8N80J8p31J17O86L2j100N11R21p89l04
4151c50J52Q69o91l69O22L47j376N72M61N9m16k17P89l60n33L38O03k89o96J28
$$ [...]
8191a51
##END NTUPLES=NMR FID
##END=
