##TITLE=1H_DE-73
 D2O
 8 sc, 
 6.11.2024
##JCAMPDX= 6.0         $$ Bruker NMR JCAMP-DX V2.0
##DATA TYPE= NMR FID
##DATA CLASS= NTUPLES
##ORIGIN= UXNMR, Bruker Analytische Messtechnik GmbH
##OWNER= root
$$ XWIN-NMR		Version 3.5
$$ Wed Nov  6 16:34:00 2024 Russian Standard Time (UT+4h)  she@DPX200
##.OBSERVE FREQUENCY= 200.1318
##.OBSERVE NUCLEUS= ^1H
##.DELAY= (6, 6)
##.ACQUISITION MODE= SIMULTANEOUS
##.ACQUISITION SCHEME= undefined
##.AVERAGES= 8
##.DIGITISER RES= 18
##SPECTROMETER/DATA SYSTEM= spect
##.PULSE SEQUENCE= zg30
##.SOLVENT NAME= D2O
##.SHIFT REFERENCE= (INTERNAL, D2O, 0, 15.7039)
##AUDIT TRAIL= $$ (NUMBER, WHEN, WHO, WHERE, WHAT)
$$ ##TITLE= Audit trail, XWIN-NMR		Version 3.5
$$ ##JCAMPDX= 5.01
$$ ##ORIGIN= Bruker BioSpin GmbH
$$ ##OWNER= she
$$ F:/spectra/data/she/nmr/H-F/1/audita.txt
$$ ##AUDIT TRAIL=  $$ (NUMBER, WHEN, WHO, WHERE, WHAT)
(   1,<2024-11-06 16:32:59.54 +0400>,<she>,<DPX200>,
      <created by zg, POWCHK disabled, PULCHK disabled
       configuration hash MD5:
       00 E9 B6 7A A2 85 ED C7 34 08 36 98 17 FE 4E 26
       data hash MD5: 16K
       F2 15 28 C9 F4 CB 34 8C B1 C4 E7 6B B3 44 76 D1>)
$$ ##END=
$$ 
$$ hash MD5
$$ 24 22 62 0C D9 B0 77 77 F6 DC FF 16 45 91 9B 62
##$RELAX= 
##$RELAX= 
##$RELAX= 
##$RELAX= 
##$RELAX= 
##$RELAX= 
$$ Bruker specific parameters
$$ --------------------------
##$DU= <F:/spectra>
##$EXPNO= 1
##$NAME= <H-F>
##$PROCNO= 1
##$TYPE= <nmr>
##$USER= <she>
##$AMP= (0..31)
100 100 100 100 100 100 100 100 100 100 100 100 100 100 100 100 100 100 
100 100 100 100 100 100 100 100 100 100 100 100 100 100 
##$AQSEQ= 0
##$AQ_mod= 1
##$AUNM= <au_zg>
##$AUTOPOS= <>
##$BF1= 200.13
##$BF2= 200.13
##$BF3= 200.13
##$BF4= 200.13
##$BF5= 200.13
##$BF6= 200.13
##$BF7= 200.13
##$BF8= 200.13
##$BYTORDA= 1
##$CFDGTYP= 0
##$CFRGTYP= 5
##$CHEMSTR= <none>
##$CNST= (0..31)
1 1 145 1 1 1 1 1 1 1 1 1 1 1 1 1 1 1 1 1 1 1 1 1 1 1 1 1 1 1 1 1 
##$CPDPRG= <>
##$CPDPRG1= <>
##$CPDPRG2= <>
##$CPDPRG3= <>
##$CPDPRG4= <mlev>
##$CPDPRG5= <mlev>
##$CPDPRG6= <mlev>
##$CPDPRG7= <mlev>
##$CPDPRG8= <mlev>
##$CPDPRGB= <>
##$CPDPRGT= <>
##$D= (0..31)
0 1.2 0 0 0 0 0 0 0 0.06 0 0.03 0 0 0 0 0.0002 0 0 0 0 0 0 0 0 0 0 0 0 
0 0 0 
##$DATE= 1730896378
##$DBL= (0..7)
120 120 120 120 120 120 120 120 
##$DBP= (0..7)
150 150 150 150 150 150 150 150 
##$DBP07= 0
##$DBPNAM0= <>
##$DBPNAM1= <>
##$DBPNAM2= <>
##$DBPNAM3= <>
##$DBPNAM4= <>
##$DBPNAM5= <>
##$DBPNAM6= <>
##$DBPNAM7= <>
##$DBPOAL= (0..7)
0.5 0.5 0.5 0.5 0.5 0.5 0.5 0.5 
##$DBPOFFS= (0..7)
0 0 0 0 0 0 0 0 
##$DE= 6
##$DECBNUC= <off>
##$DECIM= 24
##$DECNUC= <off>
##$DECSTAT= 4
##$DIGMOD= 1
##$DIGTYP= 9
##$DL= (0..7)
0 120 120 120 120 120 120 120 
##$DP= (0..7)
150 150 150 150 150 150 150 150 
##$DP07= 0
##$DPNAME0= <>
##$DPNAME1= <>
##$DPNAME2= <>
##$DPNAME3= <>
##$DPNAME4= <>
##$DPNAME5= <>
##$DPNAME6= <>
##$DPNAME7= <>
##$DPOAL= (0..7)
0.5 0.5 0.5 0.5 0.5 0.5 0.5 0.5 
##$DPOFFS= (0..7)
0 0 0 0 0 0 0 0 
##$DQDMODE= 0
##$DR= 18
##$DS= 0
##$DSLIST= <SSSSSSSSSSSSSSS>
##$DSPFIRM= 0
$$ [...]
##$SUBNAM2= <"">
##$SUBNAM3= <"">
##$SUBNAM4= <"">
##$SUBNAM5= <"">
##$SUBNAM6= <"">
##$SUBNAM7= <"">
##$SUBNAM8= <"">
##$SUBNAM9= <"">
##$SW= 24.0689170037331
##$SWIBOX= (0..15)
0 0 2 0 0 0 0 0 0 0 0 0 0 0 0 0 
##$SW_h= 4816.95568400771
##$TD= 16384
##$TD0= 1
##$TE= 0
##$TE2= 300
##$TE3= 300
##$TEG= 300
##$TL= (0..7)
0 120 120 120 120 120 120 120 
##$TP= (0..7)
150 150 150 150 150 150 150 150 
##$TP07= 0
##$TPNAME0= <>
##$TPNAME1= <>
##$TPNAME2= <>
##$TPNAME3= <>
##$TPNAME4= <>
##$TPNAME5= <>
##$TPNAME6= <>
##$TPNAME7= <>
##$TPOAL= (0..7)
0.5 0.5 0.5 0.5 0.5 0.5 0.5 0.5 
##$TPOFFS= (0..7)
0 0 0 0 0 0 0 0 
##$TUNHIN= 0
##$TUNHOUT= 0
##$TUNXOUT= 0
##$USERA1= <user>
##$USERA2= <user>
##$USERA3= <user>
##$USERA4= <user>
##$USERA5= <user>
##$V9= 5
##$VALIST= <valist>
##$VCLIST= <CCCCCCCCCCCCCCC>
##$VD= 0
##$VDLIST= <DDDDDDDDDDDDDDD>
##$VPLIST= <PPPPPPPPPPPPPPP>
##$VTLIST= <TTTTTTTTTTTTTTT>
##$WBST= 1024
##$WBSW= 4
##$XGAIN= (0..3)
0 0 0 0 
##$XL= 0
##$YL= 0
##$YMAX_a= 209625
##$YMIN_a= -202721
##$ZGOPTNS= <>
##$ZL1= 120
##$ZL2= 120
##$ZL3= 120
##$ZL4= 120
##$ABSF1= 10
##$ABSF2= 0
##$ABSG= 5
##$ABSL= 3
##$ALPHA= 0
##$AQORDER= 0
##$ASSFAC= 0
##$ASSFACI= 0
##$ASSFACX= 0
##$ASSWID= 0
##$AUNMP= <proc_1d>
##$AZFE= 0.1
##$AZFW= 0.1
##$BCFW= 1
##$BC_mod= 2
##$BYTORDP= 1
##$COROFFS= 0
##$CY= 11.3945322036743
##$DATMOD= 1
##$DC= 2
##$DFILT= <>
##$DTYPP= 0
##$F1P= 15.6554695791079
##$F2P= 12.8336369535428
##$FCOR= 0.5
##$FTSIZE= 0
##$FT_mod= 4
##$GAMMA= 1
##$GB= 0.15
##$INTBC= 1
##$INTSCL= 1
##$ISEN= 128
##$LB= 0.24
##$LEV0= 0
##$LPBIN= 0
##$MAXI= 10000
##$MC2= 0
##$MEAN= 0
##$ME_mod= 0
##$MI= 1.114404
##$NCOEF= 0
##$NC_proc= 0
##$NLEV= 6
##$NOISF1= 3.799351
##$NOISF2= 2.8
##$NSP= 1
##$NTH_PI= 0
##$NZP= 0
##$OFFSET= 15.70392
##$PC= 1
##$PHC0= -26714.37
##$PHC1= 16.78744
##$PH_mod= 1
##$PKNL= yes
##$PPARMOD= 0
##$PSCAL= 0
##$PSIGN= 0
##$REVERSE= no
##$SF= 200.130013532006
##$SI= 16384
##$SIGF1= 3
##$SIGF2= 2
##$SINO= 400
##$SIOLD= 16384
##$SREGLST= <1H.CDCl3>
##$SSB= 0
##$STSI= 0
##$STSR= 0
##$SW_p= 3612.71676300578
##$SYMM= 0
##$S_DEV= 0
##$TDeff= 0
##$TDoff= 0
##$TI= <>
##$TILT= no
##$TM1= 0
##$TM2= 0
##$TOPLEV= 0
##$USERP1= <user>
##$USERP2= <user>
##$USERP3= <user>
##$USERP4= <user>
##$USERP5= <user>
##$WDW= 1
##$XDIM= 8192
##$YMAX_p= 0
##$YMIN_p= 0
$$ End of Bruker specific parameters
$$ ---------------------------------
##NTUPLES= NMR FID
##VAR_NAME=  TIME,          FID/REAL,        FID/IMAG
##SYMBOL=    X,             R,               I
##VAR_TYPE=  INDEPENDENT,   DEPENDENT,       DEPENDENT
##VAR_FORM=  AFFN,          ASDF,            ASDF
##VAR_DIM=   8192,          8192,            8192
##UNITS=     SECONDS,       ARBITRARY UNITS, ARBITRARY UNITS
##FACTOR=    0.0002076,     1,               1
##FIRST=     0,             0,               0
##LAST=      1.7004516,     0,               0
##MIN=       0,             -202721,         0
##MAX=       1.7004516,     209625,          0
$$ Real data points
##PAGE= N=1
##DATA TABLE= (X++(R..R)), XYDATA
0@%%%%%%%%qJ6j6J6j6K4l2L8m6N6o6P4r0J06j23J47j70J93k22K54k88L29l72M16
32B20m69N28n89O59p37Q17r07J009j118J237j370J516j678J861k064K291k551
49a345K849l193L599m084M677n423O387p695R586j2584J8230m7547K03222K5965
63A92644k24779m5674m8414N7657K19084L6971k49696j13959J02641J36164O3278
74A25917m4830j45400q2269Q0620J70737M3939j37972j24483Q237Q3097J36617
85A14210L5654j84331j35139J03521J22129N4741k536j72306j38664J71243J90865
96A59387n6493j13266p8361m5905J32273J75268o9350j90304n1412R1349J24310
107G7496M4539q2357j21396m6457R4655J60052j79j64211q0052M7862Q1585J05174
$$ y = [0, 0, 0, 0, 0, 0, 0, 0, 0, -8, 8, -8, 8, -8, 16, -16, 22, -24, 32, -34, 40, -50, 56, -67, 80, -90, 103, -119, 135, -153, 176, -196, 220, -249, 279, -310, 349, -388, 429, -478, 531, -587, 650, -720, 796, -882, 979, -1085, 1206, -1345, 1504, -1689, 1910, -2174, 2503, -2920, 3467, -4228, 5358, -7226, 11004, -36543, 166679, 192644, -32135, -77809, -126223, -68566, 150518, 187489, -62207, -176166, -73525, 62639, 125917, 81087, -64313, -146582, -65962, 104775, 148714, 10742, -113741, -105504, -22407, 114210, 149864, -34467, -169606, -66085, 56044, 110785, 108249, -64057, -202721, -31478, 159387, 102894, -10372, -88733, -134638, -2365, 172903, 103553, -86751, -138163, -46814, 77496, 122035, 39678, -81718, -128175, -33520, 126532, 126353, -37858, -117910, -70048, 11537, 116711]
119A16711l341j81139r1850J23015J27947K5404p5563j49712l0742J56143J16723
130A33596m3956j21175r8563M2681J61165O3429r9398j23621l1627R7627J24893
141A05051p554j06777q2227n631J08970J19902n9863j40821k2163M7925P2268
152B9080R0164n1763j69976j9666J31246Q2215n983p9153j12717M592J40507R0427
164A28973o4549j32933n0619Q7021J13356K0209p9870j15834j5482J29025R5679
175A14976n3144r3768n7414J4480J21063P8075r3942j09533M83N2426Q6189N1663
187A11554j00359j24415L4869J11375N3763k1204r1727q2975M7932J27688M4552
198A11053q7103j09590l594R0017P7992L678q5173j03113K8110J33308M2608o9173
$$ y = [116711, 113370, -67769, -159619, -36604, 91343, 116747, 41184, -108528, -139270, 16873, 133596, 89640, -31535, -130098, -87417, 73748, 137177, 37779, -85842, -117469, -19842, 105051, 97497, -9280, -91507, -97138, 11832, 131734, 71871, -68950, -91113, -43188, 29080, 119244, 67481, -102495, -122161, 9085, 91300, 85317, 6164, -106553, -101961, 38546, 128973, 64424, -68509, -119128, -32107, 81249, 101458, 21588, -94246, -109728, 19297, 114976, 61832, -31936, -89350, -74870, 46193, 124268, 30326, -79207, -78724, -26298, 59891, 111554, 11195, -113220, -78351, 33024, 86787, 65583, -26144, -109119, -61187, 66501, 111053, 23950, -85640, -89234, 783, 78775, 82453, -2720, -105833, -77723, 55585, 98193, 29020]
210B9020p0562m2051L4559J18688L4211j06028p9919J7905O3825P6169N391j04759
222b3551p7757N0019R8636M0402m8996r3873l6263O7723R8073J5199r3623q7112
234i1123K6878Q9329N3315j7562r0626p3197O1577J12418P448o9315o2735k4235
246g7828O1409J00718p320j04221n3784L4854P0694N3516k7655r5736m4444O4254
258b5543R0258J1966p1099p1638k284O9587P7555j0473j00272n6749N3671P7461
270D2440K8979l4637q7104l9172P9876Q6998j6860p0393n2087J069P4001P1456
282H4566l5305r3978l1138N0887O9534K6379m8588q0443j6959P5758P3739j8217
294E6235p6130m6808J8630P0007N7349l7182r4648k3220O5449O2238R203m8681
$$ y = [29020, -41542, -83593, -49034, 69654, 103865, -2163, -82082, -64177, -352, 75817, 81208, -23551, -101308, -51289, 47347, 87749, 38753, -55120, -91383, -23660, 74413, 89612, -4011, -91123, -64245, 25084, 78399, 60837, -29789, -102986, -41409, 71009, 78457, 9142, -53593, -77828, -16419, 84299, 76979, -27242, -81026, -46172, 24522, 78038, 50383, -45353, -89797, -25543, 64715, 76681, 5582, -66056, -68340, 1247, 78802, 68329, -31943, -88692, -35021, 42440, 71419, 36782, -50322, -89494, -9618, 77380, 60520, -9873, -61960, -60891, 13110, 84566, 49261, -44717, -75855, -24968, 44566, 70945, 22357, -58086, -75045, 713, 74452, 56235, -19895, -66703, -48073, 21934, 79283, 42101, -52547, -75767, -10318, 51920, 61123, 12442]
306A2442p5353o793Q5620O0863l4755p0163l5735K4322P2829M3528n1341q3022
318e7558r077O5375N7302l55n6203o3540O055Q1022N2332m1869p1730k2920L3675
331b7491O6202L3141n5515q0462M352P0071M6942r935n6678n6918J7881Q3139
343C4729L7391n0274o5231j4497M0291O3209J9782o1561o9386J3921P0394L9701
355E8469j9892n7639m5654K6941P9013K7047n6552o0119l752M4571N7425Q536
367E8394o5172o0319K5285O9192L0192k7587n6735l6121L6334P3908J5078o0395
379B054n3953M841M9377N0431k707o6430m9772L3378O7231K1232l4861n4785k4664
392e8628M1902O8705M230o3414m7464J3956N1730M2547j2103o6202l9709M0909
$$ y = [12442, -62911, -69704, 15916, 76779, 42024, -28139, -63874, -39552, 33277, 76805, 25464, -57558, -66635, -1260, 56042, 55687, -516, -64056, -58001, 23021, 75353, 33484, -38246, -61166, -27491, 38711, 71852, 16337, -64125, -59773, 10298, 57240, 47305, -9373, -66291, -48410, 34729, 72120, 21846, -43385, -57882, -17591, 45618, 65400, 3839, -65547, -51626, 18768, 58469, 38577, -19062, -64716, -37775, 41238, 68285, 11733, -48386, -52138, -7567, 49858, 58394, -6778, -67097, -41812, 27380, 57572, 29985, -26750, -62871, -26537, 47371, 62449, 2054, -51899, -47058, 2319, 52750, 50043, -16387, -66159, -32781, 34450, 55682, 20821, -33964, -58628, -16726, 51979, 56209, -7205, -54669, -40713, 11017, 53564, 41461, -24741, -64450, -23541]
404b3541O3845J2000l9626n2112j4847M7446O1921o250o4471l8929K1856N1362
416A8654L5054k0815o5254k9096M7617N9422K395m4380m6120o318N1324N4611
428E7094j6357o4655k9796K8927M9869K7179k7669o3216j8161N2018N3255o193
440D2295m6919m0491L126N3131M5999k4086o3194k1905L4753M7296J9142l3191
452A5956n8062j0242N6249M6663j4754m7509l4578R928N4683L8852l3020o0138
464c5972j2359L8553M4352J1808l9272n3585J365N6337L9351k0408m8539k7702
476d6071J8203N2517K9365l7196n7521m322M3417L8871L244l9129m9650P727O0463
489A9918L0832k8877m5092k1360K2085N3666K0620m4628n0981M339M4159L6387
$$ y = [-23541, 40304, 52304, 12678, -39434, -54281, -6835, 55086, 48836, -15635, -54564, -32708, 18654, 53708, 32893, -32361, -61457, -13840, 45582, 47977, 3597, -42523, -48841, 2483, 57094, 40737, -23918, -53714, -24787, 25082, 52261, 24592, -38624, -56785, -4767, 48488, 42295, -4624, -45115, -41989, 11142, 57141, 33055, -30139, -52044, -17291, 30005, 49147, 15956, -42106, -52348, 3901, 50564, 35810, -11699, -46277, -36349, 18334, 57186, 24166, -35972, -48331, -9778, 34574, 46382, 7110, -46475, -45110, 11227, 50578, 30170, -18369, -46071, -27868, 24649, 54014, 16818, -40703, -45025, -1608, 37263, 40507, 1378, -48272, -40545, 19918, 50750, 21873, -23219, -44579, -22494, 31172, 51792, 7164, -43817, -39478, 4681, 41068]
501D1068n472m4673l8988J6118N6521K5549l4574m5692j0828K8340M5281J4619
513D7269m5953m9001J3951M6531K6123q636m2721l7883K4817N8163J2306l6479
525H487l9287j0366L3865M7867J263n0740l7235J7342M6629K4890k0105m4393
537b1783k3627K7843N2677Q933m4508l6100M649L1585L8178L30n2466l4311K9139
550a9461M2531J3764j7586m3285k2931L7699M8335k094l9945l4037L107M2246
562H343L4940j5246m7730k5494K7559M7089J0858l3092l7167q854L4966M5699
574D1871p629m8816k2534J5493L1609L0145j4414n2745j5872L7001L3800N150
586C3059k4357m1554o254M3859L6116j3078m1374k6599J7695M3123J9598k3806
$$ y = [41068, 35596, -9077, -48065, -31947, 24574, 50123, 15549, -30143, -40971, -12631, 32650, 47269, 1316, -47685, -33734, 12797, 38920, 30284, -12437, -50320, -25503, 32660, 44966, 8487, -30800, -41166, -7301, 40566, 41829, -8911, -46146, -28804, 17825, 42715, 22610, -21783, -45410, -17567, 35110, 44043, -465, -36565, -31916, -331, 37847, 38177, -14289, -48600, -19461, 23070, 36834, 19248, -24037, -46968, -9269, 39066, 36972, -2973, -37010, -33903, 8343, 43283, 28037, -19693, -45187, -17628, 29461, 40319, 7227, -29940, -38794, -3828, 41871, 34242, -14574, -37108, -21615, 9994, 40139, 25725, -27020, -42892, -5891, 27909, 33059, 8702, -32852, -39106, 4753, 40869, 27791, -13583, -40182, -22487, 20636, 40234, 16428]
598A6428m3697j6128L9396M3389q834l6300k6349M66M0320L7069k4685m7081o959
611c2965K1259L0480J9834k7580m6179J654L7671K6142j673l2431l3464J0044
623b7208M3027K3245j9875m2757j5674L0779L6327O824k8225m1607k167M9142
635A1831K8978k2352l2382j8784Q389M6689K1479l9028l6237M666K3481K9305
647B6035P819l7539l3186J4101L4927J9861j0966l7310j9071K1029L6019J4529
659C6248k6724m2102n85L7500K6128k663l1561l6889J3715N1996J1964k9072k7253
672a9298j4227K0779M6133J217m2873k3035J0055K6518K6927q685l9221j7624
684c3334J9263L2570J4570k3729l4495l559K3974K9482Q693l5230l6400J5448
$$ y = [16428, -27269, -43397, -4001, 39388, 30554, -5746, -32095, -31629, 8691, 45760, 21075, -26006, -32965, -11706, 18774, 38608, 11028, -35151, -33497, 4174, 30316, 28643, -3788, -37252, -27208, 15819, 39064, 19189, -23568, -39242, -8463, 27864, 34688, 6463, -35144, -37311, 11831, 40809, 18457, -13925, -32709, -24320, 22369, 43848, 4820, -31417, -26751, -3270, 26035, 33854, -3685, -36871, -22770, 12157, 32018, 21052, -16258, -35329, -14300, 21719, 36248, 9524, -32578, -33163, 4337, 30465, 27802, -3759, -40648, -26933, 25063, 37027, 7955, -19298, -33525, -12746, 33387, 34604, -8269, -31304, -21249, 5269, 32196, 23511, -15710, -33334, -14071, 18499, 33069, 9340, -25155, -28714, -4740, 24742, 33435, -1795, -38195, -22747]
696b2747L7630J4292q306l4161k8787K8859M5844k685l0296k4431n970L2228L6063
709C7533j4431l9255j4333J4890L1195J7222k2558l2322o081K1598L1546M732
721B9736l2721k5416P901K2983K5959p07m2385k3025K7499K9446Q035j3055l7489
734b3239j5514M0255L3409j3163k8902k1489M263L8047K2566k3906l3278q578
746b9529K1766L2516L219k8883k2768j35K4657L0060q660l6368j2007J2980K1540
759H388K2341j2758m2828o152L0411K2444L152j9915l5995K025M1509K0079j7370
772A5331k8907j7208J6992L6334P798k6539k8353k487K9506K7157j0396k7475
784h247j5845M355K9617K3168k1839l1871j717J4746K2777J5300k4545l5570O336
$$ y = [-22747, 14883, 29175, 20869, -13292, -42079, -13220, 32624, 29939, -357, -24788, -30758, 1470, 37533, 23102, -16153, -30486, -15596, 15599, 32821, 10263, -22059, -28140, -6542, 25004, 29736, -2985, -28401, -20500, 2483, 28442, 27735, -14650, -37675, -10176, 19270, 27305, 14250, -23239, -38753, 1502, 34911, 21748, -7154, -28643, -24380, 13667, 36233, 12327, -20951, -29529, -7763, 24753, 27972, -911, -23679, -23814, 843, 30903, 22243, -14125, -26132, -13152, 8388, 30729, 17971, -24857, -31009, -598, 21846, 24998, 5083, -30912, -28887, 12622, 32701, 15331, -13576, -30784, -13792, 22542, 30340, 3801, -24552, -27039, 2467, 29624, 19228, -8247, -24092, -19737, 9880, 33048, 11209, -20662, -22379, -7633, 15144, 30444, 5899, -29671, -23335]
797b3335L0345J6469k440k6938k6637J4739L6453J0785k0223l0096p877K6049
809b706K8240j766k6310k5228N244L5650J6064j9101k2613j1417R627L3217J1359
822C0260l0061k3297M521J6807K2390N057l1445k4374J5245K6747J3150j0289
834A4711l0038j4014K2132K9555L719k5024k7597M270K9808J7848p621k6404k1166
847b9821J5493L4756M608k1545j9528p554J7734L0866j503l0789j5626Q221J9611
860D923J9482o682l1693j3180J8718K5510P563j9164k6526k026K3355K3430j635
873B2075k9415k0845J4591K6925R869j1215k6887j4174K4294K9065m555k2110
885b382j6310j752K3453K4142j0986k9344r523J2893K1765J2099j5417k6907n333
$$ y = [-23335, 7010, 23479, 21039, -5899, -32536, -17797, 18656, 29441, 9218, -20878, -28755, -2706, 25534, 23768, -2542, -27770, -22526, 13124, 29188, 10087, -12526, -23943, -14316, 18901, 30260, 199, -23098, -18577, -1770, 20620, 25677, -5768, -30142, -14897, 11850, 25000, 14711, -15327, -29341, -7209, 22346, 26065, 1041, -26556, -22286, 7522, 25370, 17749, -8655, -29821, -14328, 20428, 25036, 3491, -16037, -23591, -5857, 25009, 23506, -7283, -22909, -14688, 4923, 24405, 17723, -13970, -27150, -8432, 17078, 24641, 5477, -21049, -23075, 280, 23710, 22075, -7340, -28185, -13594, 13331, 23200, 11985, -14902, -29076, -4782, 24283, 19728, -2382, -18692, -20444, 3009, 27151, 16165, -13179, -22702, -9809, 11956, 24055, 8638, -18269, -23602]
898b3602K1749K3538j632k3809j8826N864K2695J9197r460l1072j0750K1035K1645
911A6572M040j4751k5789m738K8830K0895j0929k1208j3753N541K5832J5255j7326
924H471k5668l919J7495K1051L018j9558k1623J308K4419J8954j0348k4121j0554
937b1075J0016K2238J3412j6717k8645k98K2992J6698r99j8376k2337N188K8905
950A1002J2772j4776k1072q230J1699K4335P378k1258k2291K276K1460J6675m669
963A5301k0640j6609P387K6427J1358j6797k1571l639J3791K0746N948k2304k2353
976b2955P189K3193J1829o327k0458j5454J2459K6230N494j8362j9323j739J7114
989a110J9428M91k2864j7980Q817K2926R954j0308j9589j0855J3361K4743L287
$$ y = [-23602, -1853, 21685, 20053, -3756, -22582, -16718, 5977, 25174, 15714, -15358, -26108, -5073, 16572, 20612, 5861, -19928, -24666, 4164, 25059, 14130, -7078, -20831, -15290, 10542, 25797, 8471, -17197, -21116, -3621, 17430, 20448, 890, -20733, -19425, 4994, 23948, 13600, -10521, -21075, -11059, 11179, 24591, 7874, -20771, -21069, 1923, 18621, 17622, -754, -23091, -17903, 11002, 23774, 8998, -12074, -20304, -8605, 15730, 23108, 1850, -20441, -18165, 3295, 19970, 15301, -5339, -21948, -14561, 11866, 23224, 6427, -15144, -18783, -4992, 15754, 21702, -602, -22955, -15766, 7427, 19256, 12929, -7529, -22983, -10524, 15706, 21200, 2838, -16485, -18224, -1110, 18318, 18809, -4055, -22035, -13218, 9708, 19662, 9354, -10235, -21090, -7729, 17014, 20301]
1002B0301k0878j7283K360J7085J7348k356k4082j4833J2609K1935O559j1598
1014G167j9800p749J6833K2519j159k1015j5036M285J8537J4788n981k3275j1553
1027b1439J4725K0801L447j3531j8001m705J7692K0509l985k1708j2198P650J7353
1040F610J2751q437k3502p962J7252J8560P33j5069j6711j129J9726J7382p265
1053A2939k1693r589R914J7492R508j1185k1876m818J8864J6997k080j6424j4476
1066a6427J838J9433J5647j0115k1769o282J1743J7018O545j2956k0966j314K0180
1079B575J4703m865j6796j2370M766J9890J1934j2724k0177l583J3632J5651L823
1092A6459j4399j8980J390K0644J2898q057j6687j0321P215J9697R173j4603j9138
$$ y = [20301, -577, -17860, -15500, 1585, 18933, 16577, -7505, -22338, -9729, 12206, 18765, 7167, -12633, -20382, -3549, 18970, 17811, -3204, -18240, -13955, 4582, 19370, 13389, -9886, -21439, -6714, 14087, 17534, 4003, -13998, -18703, -1011, 19498, 15513, -6195, -18393, -10743, 6610, 19361, 10924, -12578, -20540, -3288, 15272, 16005, 936, -15775, -16904, 2822, 20204, 12939, -8754, -18343, -8429, 9063, 18571, 7386, -14490, -19308, -444, 16553, 14473, -1951, -16427, -14589, 4844, 20491, 10376, -11393, -17675, -5932, 11086, 17631, 4675, -16291, -17605, 2575, 17278, 12413, -4383, -16753, -11987, 7903, 19837, 7113, -13064, -16647, -3015, 12636, 16459, 2060, -16920, -15530, 5114, 18012, 9955, -6732, -17053, -9838, 9859, 19032, 4429, -14709]
1105a4709o58J4203J5178J006j6166j6451M643K0616R675r533j6455p821R669
1118f803J8645O006j6230j7472K083J5590J2676k030j6071j4354P363K0545O918
1131A6866j1616j5387n747J1060J8740K243j7408j4987L976J6591J1346m933j7625
1144f881j0505R299J9511M860j3755j5076j569J2491J5912N58j8265j3328P094
1157i654J6285P959n627j6746r623J2070J8596J397j4048j3403o85J4135J5259
1170A5915l471j8395j0407Q490J6350O867r797j5360o147J2699J7685m16j6401
1183b388j1545L322J3304J2482m468j8875q541J2058J4257L676q727j5843m611
1196a5899J5950J4988l139j5500j0912M706J5696R941q212j7334o222J2260J5829
$$ y = [-14709, -15367, -1164, 14014, 15020, -1146, -17597, -12954, 7662, 17337, 7804, -8651, -16472, -6803, 11842, 17848, 1618, -15854, -13771, 1819, 14495, 12465, -3606, -17960, -10597, 9948, 16866, 5250, -10137, -15884, -4824, 13916, 16159, -1249, -16236, -12260, 4331, 15677, 10744, -6881, -17386, -8087, 11424, 16284, 2529, -12547, -14116, -1625, 14287, 14845, -3420, -16748, -9654, 6631, 14590, 8963, -7783, -17406, -5336, 13260, 14657, 609, -12794, -13479, 656, 15915, 12444, -5951, -16358, -7868, 8482, 15349, 5552, -9808, -15955, -3256, 14429, 14013, -2388, -13933, -10611, 2693, 15175, 10707, -8168, -16709, -4651, 9606, 13282, 4555, -11288, -15899, 51, 15039, 11900, -3600, -14512, -9806, 5890, 15831, 7619, -9715, -15937, -3677, 12152]
1209A2152O73j1921j3202p97J4764J4516o301j7307o093O903J2856Q968q952j8596
1223a2337k005J4569J1124K60j1186j4398K104J6659J0241o898j5112p563Q867
1236e675J5179M771j0862j5656k216J5845J2797m385j3396r329K716J6470J0102
1249A6361j1265j5632j385Q525J2787M670j3109j5038L733J3594Q469k146j3602
1262d038j0458P143J5187O023q912j5260l251J2843J2531j92j1712j3837K484
1275a1449J7884Q183r207j1848o384O119J7063M241j4848j1168J658R705J1482
1288A1431nj5306r920O684J3001O621o638j4215m580R672J2726L131j1300j4224
1302a2922K589J3896P939k319j2936j1716Q198J7793K087j0680j0185m084J0089
$$ y = [12152, 12825, 904, -12298, -13095, 1669, 16185, 9884, -7423, -13516, -6613, 6243, 15211, 6259, -12337, -14342, 227, 11351, 11611, 425, -13973, -11869, 4790, 15031, 8133, -6979, -14542, -5675, 9504, 14275, 3413, -12243, -14459, 1386, 14183, 9798, -3598, -12927, -10211, 6259, 16361, 5096, -10536, -11921, -3396, 9391, 14061, 952, -14086, -10353, 3241, 11710, 9564, -4038, -14496, -7353, 7834, 13857, 4945, -10315, -13566, -723, 11808, 11616, -96, -13933, -11449, 6435, 14618, 5411, -6437, -12821, -6702, 10361, 14602, -246, -11414, -9756, -51, 11431, 11426, -3880, -13800, -7116, 5885, 12506, 5868, -8347, -12927, -3255, 9471, 12602, 1302, -12922, -10333, 3563, 11502, 9183, -3753, -15469, -7271, 10522, 12609, 1929, -8256, -12340, -2251]
1315b251J5854k646j5237p788M656J1204R096n738j4830m482Q478J1841L848j0878
1329A127j1729R09R811J0334P96j4568j0887Q022J2691M501m354j3851q164J3564
1343a798J4604k855j0944r216q60J3960J1483p409j3586m529O163J2535M413j0011
1357A950j1203n58Q849J1533m68j3300p913M409R330Q929l022j6433n104J0759
1371b242J0384K252o646j4275j902J5148J0148o090j0395q242L973J5155N732
1384A3000j0163j1551j839Q977J2101r92j1771p136J085J0274J0700n973j3509
1397f797k700N416Q598P661p985j5421R00J1533P639L51r497j2170L562J5406
1411F496N098p142j0506n774Q789J3021k9r699j0152J13J2438Q920n992r760n069
$$ y = [-2251, 13603, 10957, -4280, -12068, -7412, 3792, 12888, 7150, -7680, -12162, -3684, 8157, 12005, 1127, -10602, -9693, 118, 10452, 11248, -3320, -14207, -6185, 6506, 11007, 6653, -7198, -15362, -1798, 12806, 9951, -993, -10209, -11069, 2891, 14374, 6965, -6621, -11150, -4987, 7548, 11961, 1950, -9253, -9811, -962, 10571, 10103, -3197, -11110, -6701, 2629, 11558, 8536, -7897, -13001, -2242, 8142, 10394, 3748, -10527, -12429, 2719, 12867, 6777, -3618, -11860, -7887, 7268, 13000, 2837, -8714, -10553, -1576, 10525, 9533, -2238, -9374, -8289, 1985, 12685, 6712, -6797, -9497, -4081, 4517, 12178, 4193, -11228, -10328, 1205, 8844, 9195, -302, -12472, -8910, 6496, 11594, 4452, -6054, -11828, -3039, 9982, 9953, 254, -9898, -9785, 2653, 11573, 5581, -4179, -9248]
1426i248K776J1963O736j0103j1086R43O031R157M427j2166j1531N307J0926N266
1440I398j836j1997q585Q706J2577J903q138j1202j038J1489R007k578j0242q754
1454a1290M093J4222L543q400q006l353N325J2966J459j2574o857K765O281R112
1468I286n21j3152o841P163R652M183n264j2241k882R798J0104l07r915r800L661
1483g076J1407N634m719j0279o741Q081J2894r90q234o810j841Q594J1166l913
1497G173j1702m099L803P982P006n209j2151k329P854Q863J149q053r217R48R845
1512A863Q111k480j2150o142P365R864K366n529j0467l538J1383R532l743q380
1526a945n994O71J0622P431p124j0025j969N758Q653L152p793r986O73Q449Q222
$$ y = [-9248, -6472, 5491, 12227, 2124, -8962, -8019, -1988, 7169, 11596, -570, -12101, -6794, 4132, 9398, 7562, -4435, -13020, -4314, 8263, 10166, 2028, -9174, -10212, 1277, 10284, 7706, -2536, -11290, -7197, 7025, 10568, 2168, -5838, -9191, -3866, 9100, 10559, -2015, -8872, -6107, 174, 9286, 8765, -4387, -11228, -4065, 5587, 9770, 4506, -7735, -10617, -819, 9285, 8978, -937, -10737, -7076, 4331, 9965, 5246, -5033, -11774, -3693, 9201, 8211, -23, -6833, -8674, -80, 11086, 7173, -4529, -8628, -4825, 3157, 10163, 4954, -7197, -9526, -1672, 7191, 8340, 287, -8930, -7982, 1863, 9974, 7494, -4656, -10798, -3433, 6431, 8797, 3268, -7199, -10737, 646, 10178, 6435, -1945, -7939, -7268, 3354, 10785, 3661, -6364, -8333, -2575, 6078, 9230, 1437, -8549, -7876, 573, 8795]
1541H795j555j0235o202L790R377N808n175j2053j824R166P201J013p274r925
1555i093N77J2619N569n782p685m587L594J0844L444q113q644m64P777P685l03
1570G438r194o944K253J0316N484n394r229k595N408Q152L951q413j0245K330
1584f682Q839N157j020q152q287N011J1349K354o459p462k481O397R187Q5q886
1599a050p253K313Q818N446l553q594m538M569R727K735p789p880N28N733Q018
1614G230L86r853o866M635Q435L470l371q738m746P281R728l05p579o257J82P243
1630H75P210k072r416n367N208Q191K896n014p996k528O370R350p82q871n622
1645g568K358O822O441k389j0284l898O558P399J560n444p682j617Q241P450k186
$$ y = [8795, 7240, -2995, -9197, -5407, 3970, 9778, 4603, -7450, -9274, -108, 7093, 8106, 832, -9093, -8516, 4103, 9672, 3890, -3795, -8382, -4788, 6056, 9500, 1387, -7257, -7721, 56, 7741, 7438, -1756, -8700, -6447, 3869, 9353, 3959, -5270, -7865, -2457, 5695, 9646, 1233, -9012, -6682, 2157, 7314, 6294, -1858, -10145, -5134, 6215, 8569, 2110, -5352, -7833, -1436, 7751, 7836, -1050, -8303, -5990, 2828, 8274, 4721, -3873, -8411, -3842, 5885, 8620, 831, -7049, -6521, -788, 7230, 7616, -2237, -9103, -4468, 3967, 7437, 4066, -4672, -9418, -2137, 7591, 7286, -293, -6550, -6368, 875, 8085, 6013, -3403, -8770, -3562, 4629, 7525, 2511, -5485, -8013, -1643, 7707, 6925, -1946, -7568, -5210, 1612, 8053, 5664, -4620, -8518, -1960, 5439, 6999, 1555, -6127, -7744, 497, 7947, 5761]
1660E761q277n212L031P951M692m312q868k963P046P690k39o117o602j09P707
1675A179O938l298q813l116L604P239M270n391r175o37P198O538m94p058o256
1690g272J308Q560N356m307q039k627M715O991K551n812p929m38Q345N324j943
1705D783o676m954J929Q629M450n674p769j440N455O617J420o286p418J019Q017
1720B102M738k836o623m298L047Q418L119o481p207j83O159N797qo752o003J967
1736e044Q130L700l710o931k795L881P823J956o833o515R80O013N380r10p055
1751a930n274L125P994K567m421o136k119M746P015R05p078n837K027O018M287
1766E889j325p471m156M039Q059J259n234n687j229N314O756o02p271m834K615
$$ y = [5761, -2516, -7728, -4697, 3254, 7946, 3634, -5234, -8197, -1151, 6539, 6300, 183, -6419, -6528, 1179, 8117, 4819, -3994, -7110, -3506, 3733, 8003, 2612, -6563, -7200, -2, 6536, 6042, -1016, -7272, -5964, 2596, 7952, 3645, -4394, -7021, -2306, 4685, 7236, 1424, -6505, -6943, 1402, 6726, 4783, -1893, -6847, -4918, 3711, 8161, 2487, -5282, -6722, -1267, 5350, 6770, 484, -6934, -5915, 2102, 6840, 4004, -2619, -6917, -3870, 4548, 7667, 1186, -6021, -6204, -45, 5752, 5744, -1008, -7011, -5044, 3086, 6786, 3076, -3855, -6650, -2769, 5054, 7010, 177, -6338, -5358, 655, 6035, 5125, -1930, -7204, -4079, 3915, 6482, 2061, -4075, -6194, -1448, 5567, 6472, -606, -6443, -4416, 1602, 5889, 4564, -2907, -7063, -3024, 5035, 6294, 1060, -4627, -5856, -542, 6214, 5612, -1659, -6493, -3878]
1781c878O305L796k882o969l136M836P306M95n805n168k53N824O085j757p558
1796b759l678L531O397K326l455o774k242O015O518j054n697m707R98N881N235
1811F535k726o798l375L964O569J505m445n968j243O047O035j555o620l766K201
1826c640N954M054l491o983j787N076N034R06m288n976m22O736M857k352n632
1841a954l756K427O656K810m543o076j169N389N050j10n184m647L22O778M542
1856F535l797o197j855L197N741K574n172o494N70N806L757l13n268n105K067
1871c954P018K655l579n673j965M247N427R94m842n864O38O197M381k644m802
1886a766l442J875O653K875n772m657R0L525M918Q46o340m774K702N239K868k037
$$ y = [-3878, 2427, 6223, 3341, -3628, -6764, -1928, 5378, 5873, 68, -5100, -5353, 471, 6556, 4799, -2759, -6437, -2906, 3491, 5817, 2362, -4412, -6654, -639, 5879, 4825, -872, -5579, -4581, 1300, 6535, 3809, -2989, -6364, -2400, 4169, 5674, 1229, -4739, -5982, 65, 6100, 4545, -2075, -5841, -3640, 2314, 6368, 2877, -4106, -5893, -817, 4217, 5123, 835, -5141, -5563, 1173, 6030, 3678, -1954, -5710, -3283, 3373, 6183, 1640, -4436, -5605, -216, 4834, 4724, -460, -5107, -4785, 1993, 6535, 2738, -3459, -5314, -2117, 3624, 6198, 1026, -5468, -4898, 908, 4665, 4352, -916, -6021, -3954, 3064, 5719, 2140, -3533, -5498, -1251, 4176, 5170, 328, -5536, -4898, 1299, 5680, 3036, -1766, -5208, -3333, 3320, 6195, 423, -4234, -4144, -619, 4299, 5145, -1195, -5969, -3267, 1972, 4840, 2803]
1902B803n301l106L552N807J396m586n282m2N512M052o68n218m778K540O508J830
1918E019l729m279k034L244O558J17o156l063J051M265L846j029o479k580L145
1933b104M893J933l322n250r42M347M752M8n159m236J744N476K430j538n530l341
1949e799M418N955m10m050l694j158N089N373k265n586j998J927M396L400l614
1964A984n647p63L831M701L0m514m363J375M308L675q37o150k933L924M275J399
1980D295k689n280j465N540M381j714l696l355K76N603L419l736m966r53L111
1995a229M432J438m462m026M58L567M274j071n176k328K051L829L397k847o088
2010c781q65M764K972R20l387n454P33N872K890k574l654k857K102N600J247m124
$$ y = [2803, -2498, -5604, -2052, 3755, 5151, 565, -4717, -4759, 753, 4805, 4137, -1081, -5859, -3319, 3189, 5019, 1290, -2989, -5023, -1779, 4779, 4896, -1260, -4323, -3272, 993, 4839, 3810, -2669, -5249, -2104, 2789, 4722, 1400, -3850, -4792, -445, 4307, 4355, -804, -5040, -3296, 2180, 4610, 3072, -2458, -5799, -1381, 4574, 4164, 114, -3580, -4738, 351, 5724, 3459, -2127, -4125, -2198, 2198, 5598, 1984, -3663, -4426, -595, 4106, 4136, -378, -4741, -3366, 942, 4617, 3780, -2370, -5303, -1379, 2896, 4295, 1606, -3674, -5139, 401, 4782, 3068, -628, -3983, -3707, 1896, 5315, 1579, -3387, -4340, -1229, 3203, 4641, 179, -3847, -3389, 178, 4452, 3381, -1795, -4123, -2072, 1757, 5154, 2307, -3781, -4646, 118, 3090, 4010, 623, -4831, -4098, 1774, 4664, 2090, -1564, -4421, -2319, 3281, 4528, 404]
2026D04l725n35M118M153j220m558k661P45N148K972l055m765m46J986L820K113
2042D494l735n182J179M414K006L80m512m225K642N464R85k432m226j655L946
2057d57M406m76m046l527R26N114K272k514l986j497K001M510J790m571l073l8
2073c166K878L484P11n041l577K906L730J680r53m921k118L478M435Kl338l904
2089c714K64M758K838j764l584l247K259N237R45l091l337j316L077M798p12m423
2105a012k045Q69K523L588j062n413j378L233L194R97k484m596k61M448K709l53
2121B957l589l308J572M475J639j975l993j856L498M010o97l002k741j41L293
2136A42L965k104l959j088J422L096K560l119l715k09K787L138L72l559l655J579
$$ y = [404, -3321, -3856, 262, 4415, 3195, -1363, -4024, -3279, 1869, 4841, 1786, -2979, -3425, -1439, 2381, 4494, 759, -4423, -3244, 1170, 3176, 3556, -956, -5181, -2539, 2925, 3910, 1478, -2748, -4403, -457, 3949, 3473, -573, -4100, -3174, 1940, 4212, 1698, -2288, -3785, -1784, 2726, 4516, -55, -3128, -3166, -288, 3196, 3907, -1134, -4711, -1805, 1925, 3605, 2652, -2269, -4387, -909, 3526, 3528, 190, -3714, -3450, 1308, 4146, 2382, -1202, -4449, -2190, 3047, 3992, 901, -2436, -3752, -675, 4123, 3411, -1012, -3057, -2188, 335, 3923, 2861, -2552, -3930, -697, 2497, 3494, 1010, -3586, -3847, 601, 3310, 2957, -632, -3940, -2368, 2107, 3746, 1771, -2222, -4078, -580, 3430, 2733, -269, -3010, -3151, 142, 4107, 2003, -1956, -3044, -1622, 1474, 4034, 915, -2800, -3009, -222, 2916, 3288, -271, -3926, -2347]
2152b347L720K001j062m570j914L525L416M86k534m125j60M223K944j808k521
2167g26k318P05M386J981l195l342m33K172L221J020l871k859Q70L164K804j339
2183B240l822j805J967L062J637k143m194J6L628K272K27k939l909J541M119J401
2199C298j877l161j415J757M031O29l599k401L52K609K695l48l307k278J163L401
2215A549J739k359l307m25K213K657J305l774l090J311L426J434j49l691k514
2230c675K274L941K40k189l019o82K834L260p63l086k055R09L636J079j178l477
2246a951j341K402L352P23l270k751L51K594K742m13l892j803J776L028J206j592
2262A161l210j246L169L058m78k685k458K55L310J851r49l212j569K278L006K57
$$ y = [-2347, 1373, 3374, 2312, -2258, -4172, -647, 2769, 3255, 721, -3404, -3564, 659, 3603, 1795, -726, -3044, -2339, 2047, 4028, 833, -2509, -2942, -770, 2451, 3471, -400, -3259, -2389, 775, 3579, 2240, -1582, -3387, -1420, 1642, 3279, 1136, -3058, -3042, 586, 2858, 3085, 146, -3763, -2222, 1897, 3298, 1421, -1740, -3155, -1398, 2633, 3262, -337, -2738, -2386, 223, 2918, 2570, -737, -3015, -1852, 1549, 3288, 929, -2378, -2803, -590, 2067, 3372, -402, -3492, -2181, 1245, 2679, 2530, -1161, -3675, -1401, 2540, 2780, 591, -2428, -3110, -276, 2984, 2221, -865, -2920, -2011, 1625, 2704, 1526, -1951, -3292, -890, 2462, 3185, -85, -2836, -2485, 109, 2851, 2438, -1454, -3257, -1481, 1547, 2753, 1161, -2049, -3295, -126, 2932, 2454, -231, -2689, -2434, 876, 2727, 1778, -1434, -3003, -725, 2281, 2538]
2278B538j938k919l85K595K829m91l324j892J285K676K193j614l748n28K069K756
2294B102M95k557k279m0L090J837p06l266j524J677K861J009j905k802n91K462
2310a37K741j44l037k012L40K841K511j498l214p51J489K885Q14k298l159M08
2326b221K501K170l56k782k181J124L205J513j915k752q64K222K363N72k415k818
2342b634O39K969J839j206k768j185R92K878J301k409k367k03J996K214J90k755
2358e09k277Q56K991J502j570k023j411J449K915Q14k317k846O07K019K117l09
2374B008k621j727P24K965J292j956k056r62J843K615M61k597k316P09J942J948
2390B272o79k740j660J622K933P48k015k163n41J984K444j21k657j778Q61K555
$$ y = [2538, 600, -2319, -2704, -109, 2720, 2229, -1095, -2987, -1702, 974, 3167, 1553, -2195, -2723, -654, 2102, 2597, 40, -2239, -2279, 811, 2648, 1942, -1324, -2848, -1171, 1690, 2699, 794, -2008, -2599, -137, 2604, 2460, -577, -2589, -2249, 592, 3103, 1605, -1609, -2360, -871, 2014, 2828, 530, -2629, -2221, 280, 2450, 2094, -688, -2869, -1745, 1460, 2973, 1058, -1694, -2558, -336, 2027, 2599, 184, -2634, -1995, 974, 2813, 1607, -1161, -2346, -1354, 1524, 2825, 416, -1951, -2154, -158, 2056, 2246, -509, -2786, -1930, 1061, 2563, 993, -1030, -2441, -992, 1923, 2737, 420, -2426, -1819, 200, 2317, 2008, -613, -2340, -1616, 1349, 2641, 685, -1371, -2333, -490, 2125, 2586, -11, -2327, -1618, 324, 2272, 1593, -1147, -2807, -1185, 1748, 2496, 481, -1682, -2223, -239, 2205, 2084, -573, -2351, -1490, 1065]
2406A065R34r97k494p65J783K410J46j799k094m61K409K107l06k587j850J560
2422i39K314N81j010k587o39J822K636k07k553j294M28J858J776o18k876j140
2438b448J752K096P05j540k100p69K392K202o58j818j967P59K037J928j524k477
2454a430q21J899J769L74j252k151l66K470J757n01k455j227R04K240R12r90k809
2471a677j77J721J548L47j588k118P9K653J084r15j854r08Q93K392P26j866k073
2488a733j41J784J776j63k033j489M36K503J268j546j813l97Q91K054O79j840
2504B36k130L07K342P13m0j814j672R43J961J358j749j627o90J816J861J2j473
2521C54k387M65K279J227j012k012o96P99K234P93j971j617J33J216J803j90j706
$$ y = [1065, 1999, 1002, -1492, -2257, -474, 1936, 2082, 283, -1811, -2272, 137, 2244, 1938, -649, -2499, -939, 1375, 1956, 946, -1641, -2280, -458, 2178, 1971, -582, -1876, -1448, 410, 2186, 1568, -1308, -2448, -696, 1400, 2105, 565, -1535, -2304, 88, 2290, 1632, -186, -2153, -1394, 643, 2571, 1047, -1430, -2251, -352, 1417, 1791, 539, -1612, -1978, 492, 2249, 1748, -707, -1934, -1030, 1210, 2122, 1132, -1677, -1854, -133, 1415, 1762, 174, -1944, -1865, 788, 1872, 957, -897, -1805, -912, 1480, 2206, 340, -1733, -1874, -90, 1686, 1523, -510, -1999, -1563, 940, 2208, 662, -1151, -1548, -657, 1397, 2076, 236, -1894, -1587, 755, 1468, 1428, -386, -2058, -1115, 846, 2204, 455, -1172, -1862, -46, 1815, 1827, 354, -2033, -1568, 711, 1938, 926, -1086, -1782, -983, 1251, 2044, 73, -1544, -1411, -195, 1608, 1418, -288]
2538b88j804Q45K072R39o03k333k54N46K366L66j861j954K21J790J371k19j522
2555c22j571Q20K246L23r67j586m95J302K042j80j991j291O44J228J307n03j951
2572i45o44J208J636M78j259j837o7J498J288K64k049j216P56J660J161j024j565
2589f57j522J858J966m88j267j224m62J990J674j005j410j256J176J537P32j263
2605C79j747k40J287J782o1j715j367M89J348J205j97k219o13J132J646K21p41
2622E89k044j58K075J386j118j110j140N05J838Q12j228j640m42J196J682J03
2638A306r66j804J19J214J854n38k252q02J432J281O90q96j960m6J350J399j58
2655A223j304j962M24K542O85r19j226r12R51J888K77j544j471k42J787J202l45
$$ y = [-288, -2092, -1247, 825, 1764, 1161, -1172, -1426, -880, 1486, 1852, -9, -1963, -1742, 48, 1419, 1200, -322, -1893, -1073, 1173, 1496, 529, -1057, -1552, -250, 1792, 1612, -379, -1670, -1026, 202, 1509, 1006, -945, -1589, -381, 1255, 1733, 474, -1363, -1430, 68, 1356, 1620, -429, -1645, -889, 771, 1932, 908, -657, -2179, -321, 1645, 1157, -110, -1334, -1796, 194, 1868, 863, -547, -1803, -627, 910, 1642, 379, -1368, -1608, -321, 1461, 1400, -315, -1682, -1193, 155, 1360, 1163, -1056, -1669, -537, 1109, 1330, 589, -1455, -1613, 462, 1848, 730, -380, -1520, -1015, 823, 1635, 407, -1233, -1675, -479, 1203, 1306, 340, -1464, -1345, -131, 1723, 1185, -1067, -1869, -437, 844, 1534, 638, -1322, -1368, -18, 1381, 1223, -81, -2043, -1619, 923, 1608, 689, -537, -1449, -498, 1390, 1667, 123, -1348, -1590, 197, 1399, 1054]
2672A054j752p38N35J627J099j678j180j62O55J631N83j554j658P16J077R21k41
2689I35j252j486J189J660J44q67j516k81J501J724p79j134j104M21J475Q74q89
2706F15j442n43O70J731M59j663j132K25Q85J547l16j304j279J074J136N02n22
2723F43j619m84J423Q03J21r85j314L32J765Q88q46j317q09N11J626N10j251r64
2741i67l14J313J617l97j841o90N89J086Q29n19j656m19J170J080N07r16j679
2758a207J11J330P23n9j394j050R04J408L31o31j045r92J262K036q72p17j353
2775a215r5J692J017p34j270k12l2J651M24q87j442O4Q96J354j48j319j010L26
2793i40J410M48j6j384j006J190Q83L42n79j255m98J968O49l04j117r96N47J607
$$ y = [1054, -698, -1436, -901, 726, 1825, 147, -1033, -1195, -540, 1091, 1674, 120, -1538, -822, 255, 1176, 935, -317, -1803, -614, 1046, 1190, 323, -1193, -1474, 27, 1751, 972, -162, -1266, -845, 630, 1504, 615, -827, -1370, -700, 1031, 1490, -173, -1305, -1080, -195, 1352, 1036, -268, -1547, -473, 663, 1165, 643, -976, -1460, -37, 766, 887, -98, -1412, -1080, 685, 1573, 727, -590, -1399, -888, 738, 1248, -3, -967, -1281, 32, 1649, 1252, -589, -1279, -690, 396, 1225, 706, -950, -1369, -199, 881, 1388, 472, -1207, -1096, 234, 957, 898, -496, -1546, -642, 766, 1097, 466, -579, -1571, -309, 1727, 855, 138, -1215, -1310, 382, 1399, 665, -605, -817, -849, 802, 1226, 339, -1103, -1039, -143, 1211, 1063, -256, -1266, -940, 470, 918, 902, -482, -1488, -298, 585, 927, 348, -907, -1405, 563, 1212, 908, -209, -1205, -658, 949]
2811I49N16j438r68k5M66J597N8j494j023K06J278Q80k22j518l06P63N41Q95q71
2830B84j420J4J073J148n27n90j392M97J597M06n42q71r37Q03J314M01j167p79
2848f88l1N52R06j96j029o15L23J475N98q48j225k42J002J233K98j563j321L56
2866a015J605M00j96j243q92J136Q75M72j017r31m15J313J125l59r92r86J46J253
2884B79P90n06j333J99J50J243J81r04p90R6O78R81n7j570r03Q68Q78R46o26j600
2904a000j63J191P94m1r40n73l10J253Q93k10j483q65R98J110M93j039p55k27
2922h74M50J417k76j064n07L01J042N13p98p18o22Q23J002J75n84j286K9J322
2940C45L97q3j125k36P4J234K33m41o58o70N02J263j69o75q13P2P63Q64k20j206
$$ y = [949, 1465, 27, -941, -966, -500, 1097, 1155, -339, -1362, -1156, 122, 1002, 780, -738, -1044, -281, 260, 1155, 284, -1136, -1122, -49, 1099, 572, -18, -1410, -913, 684, 1090, 548, -323, -1260, -457, 857, 1258, 91, -688, -719, -167, 739, 543, -486, -1101, -778, 697, 1295, 447, -778, -1020, -18, 1215, 1513, -50, -1371, -1015, 590, 990, 794, -449, -1341, -205, 670, 1142, 125, -806, -1221, 92, 1217, 858, -134, -1120, -974, 279, 1069, 563, -770, -571, -421, 822, 1003, 99, -691, -595, 83, 1064, 1007, -563, -1466, -598, 280, 1226, 600, -1000, -1163, 28, 822, 781, -159, -732, -1042, 211, 1104, 894, -589, -1454, -456, 654, 1147, 108, -647, -874, -424, 993, 717, -347, -854, -553, 489, 1002, 204, -514, -1136, -313, 689, 864, 280, -1006, -977, 345, 742, 659, -466, -702, -628, 606, 839, 398, -260, -930, -428, 835, 666, -9, -822, -750, 13, 877, 657, -549]
2960e49l95N14Q59O31q07p91n80Q80J100J25j136j113P15P52P86k74j323j86O30
2979a62Q63K80m45j481K50Q83K78O4m86j062K95J439L24j174k48m38N99P46M06
2998I31q16j104L05R35N47l84p95l96K8J163O01q52j115K52N96Q05j68p28o04
3017g99J98J037M54k40r25q14O68Q56M00n36r31r4P75P57l6o96j174O23Q52O80
3037A055m71j169k75M96P68L75o88q52j73J129O88j78q95r18P14R44N02r43o43
3056e34j1J38J029k29o16n40L77M64O07k88o55r59Q55R96K34q95p45R1P41P63
3076H23Nq85l57O7Q90L78n75p42k83N43O50J61m95q05j37P47J382q82q04m42L65
3097c96Q97J89m40j204L23N27O99K44r12o39M56M76N97k45j325J85O67K32K73
$$ y = [-549, -944, -430, 429, 1060, 253, -538, -1118, -238, 862, 987, -149, -1262, -547, 205, 991, 717, -606, -792, -162, 701, 981, 536, -945, -695, 188, 466, 530, 44, -1018, -723, 716, 1040, -134, -382, -820, -221, 525, 931, 115, -989, -684, 251, 798, 414, -381, -777, -749, 414, 1015, 163, -952, -700, -104, 701, 533, -195, -799, -601, 436, 890, 650, -275, -1089, -421, 435, 835, 299, -632, -726, 49, 806, 770, 74, -1100, -477, 375, 1055, 584, -585, -860, -364, 404, 779, 91, -761, -934, 195, 883, 705, -190, -1108, -394, 550, 1052, 109, -534, -545, -407, 622, 393, -223, -763, -386, 78, 685, 397, -258, -1217, -362, 634, 868, -27, -772, -681, 60, 823, 828, -57, -414, -347, 543, 921, 346, -396, -679, -136, 514, 675, 180, -625, -762, -15, 1367, 485, -319, -761, -396, 501, 690, 250, -954, -631, -104, 595, 839, -73, -712, -256, 220, 817, 572, -753, -568, 99, 331, 604]
3116F04m26q74j90R16J054n66q13k58N4Q01L68P2j473L45P3O67J67n14p25l19
3136a037J067O47l88m60l57k7Q75N48n17p05k55P38N26p5l14j048L9R29L70m17
3156A39n68k04L54Q41J78p02n96r4N55P66P5n57p10K5Q50P93r46q68oL60Q83J34
3178G02l62r73k13J093N74j88p66q60N34J420P0o80p60l70O51O07L89o81j079
3197h92M59P16N30n02m64q43P47Q03L91r70o65m5P23Q12j32j057l36J88P00O80
3217H43m60r03k45N21P78J96p19m30k60P09N35J75r40l99J89O41K80m16j35o70
3237g10N16J063j2q80m28k53R58M88k76m94o59M54Q75P7n57p09r5P49Q20k39j070
3258c82k68J23O92O65l89o90l07M18O35q0l96m26l47J107L11J77j261k02K72L70
$$ y = [604, 178, -696, -886, 30, 1084, 518, -295, -553, -499, 302, 670, 742, -731, -386, -313, 354, 521, 7, -718, -1037, 30, 677, 289, -171, -528, -555, 320, 868, 351, -354, -609, 129, 655, 580, 266, -782, -743, 186, 556, 139, -429, -633, -279, 562, 740, 38, -558, -652, -97, 669, 744, 187, -523, -498, 352, 1145, 199, -669, -675, -315, 568, 702, 340, -633, -846, 247, 821, 633, -133, -993, -459, 961, 1031, 351, -409, -779, -128, 479, 868, 187, -892, -433, 283, 813, 311, -153, -996, -249, 554, 945, -25, -690, -735, -12, 800, 668, -389, -725, -537, 163, 843, 383, -520, -765, -244, 534, 730, 11, -419, -679, 30, 565, 740, -200, -599, -410, 231, 511, 95, -40, -710, -194, 869, 857, -23, -451, -704, 254, 742, 466, -28, -687, -233, 642, 719, 162, -547, -642, 107, 927, 688, -382, -650, -527, 165, 830, 441, -249, -556, -138, 497, 417, 21, -405, -752, 355, 666, 843, -418, -620, -348, 22]
3278B2O51m81l57l46L84O75L0k51r30Q1O81O74k96j170pM61M58J16K5j016P9L52
3300a65Q63m56j90n97N50J24O51l05q13k72N70N53J22m52n52rO02P7j05l92n36
3321g32K50N75Q63o23j424N36M36Q64j04n41p34L46N66k5J45n20o30K53Q32M70
3341H03m92r13j88O46Q41p1n52o68Q0N51P66o75k47n43L19O94J90n08q93M43O31
3362B14N59j10o42j029R78J82M83o57l66l99R12M04R6q57m03M9O42Q93q71l33
3382b55p66N38R47L73p35l18j53M01M50L8p41m00N97M18Q5j24q04m79N11J025
3402F08J09p51m06j51M33Q07j76p29q23Q36Q50K29o10p39m38Q43Q67j48n24n02
3422d15k43Q83P01o94n56k97K49P45M25l57j047K92N75L40j13l83q80M69N74K84
$$ y = [22, 673, 192, -165, -511, -127, 548, 578, 327, -603, -522, 159, 833, 537, -633, -640, -179, 279, 395, 420, -596, -517, -165, 698, 242, 52, -545, 5, 129, 780, 475, -338, -610, -40, 513, 635, 183, -369, -378, 224, 301, 196, -196, -732, -482, 93, 956, 333, -1091, -555, -119, 745, 641, 100, -634, -288, 278, 253, 398, -122, -752, -499, 333, 803, 311, -602, -790, -144, 697, 626, 74, -594, -514, 37, 803, 128, -119, -662, -343, 351, 541, 33, -860, -417, 214, 773, 663, 21, -1008, -30, 152, 635, -22, -388, -787, 125, 529, 625, -232, -635, -586, 56, 949, 78, -255, -1021, -483, 464, 837, 102, -216, -369, 32, 482, 520, -221, -621, -24, 394, 479, 355, -449, -928, -417, 608, 717, -34, -440, -591, -158, 649, 473, -256, -1079, -243, 607, 836, 226, -513, -951, -108, 759, 611, 87, -415, -658, 225, 926, 232, -324, -621, -372, 373, 798, 441, -606, -314, 261, 601, 488, 105, -775, -306, 268, 552]
3442E52J77q86o46L89J262l82n18l58l67O55P44n97m07j88M0R07O26q33n16J68
3462a78o1O51q7l90m82J10O11L82q6p70m37K72R07K12l21r40J45N78L91j28j56
3483B23r26L12O07K28l27p02k33N46P88j18n2r21K0P21O03m60n48j17m3P44N21
3504H66q74l68m2K90J37K60m40n19M29N06J38J66o58q76O88O88J78n28p75L31
3524d03N56N22l78k04q36L48M43Q34o98o72K7K75O26K33o81n46K26M16N77l02
3544C63o98n59L10R25L28o08m99l51N90M51K52l48q59M57M18P0L54r12j91K52
3564b55P84pm77n82J93J93M57M09r00l27L35P34Q7l91m56k94L10P09j60j19q46
3585f03j49J051O4L31j107l38L92M35O48o33l40l12N78O27l2q67k96k07P31O08
$$ y = [552, 729, -157, -803, -414, 848, 466, -52, -410, -777, -122, 622, 25, -382, -570, -530, 377, 1003, 170, -346, -178, -239, 412, 325, -65, -547, -437, 174, 556, 470, -300, -737, -465, 442, 654, 333, -607, -462, 116, 507, 379, 223, -703, -391, 216, 444, 117, -585, -818, -272, 516, 398, 346, -575, -555, 166, 769, 309, -239, -356, -399, 345, 866, -8, -376, -418, -128, 9, 269, -171, -690, -261, 245, 383, 549, -109, -985, -297, 391, 569, 41, -734, -403, 153, 675, 297, 93, -743, -395, 48, 882, 184, -488, -461, -186, 440, 673, -8, -554, -328, 88, 665, 363, -335, -894, -584, 341, 669, 61, -438, -789, -199, 252, 504, 156, -703, -246, 172, 242, 596, -316, -507, -255, 529, 522, 45, -537, -344, -151, 306, 715, -185, -512, -177, 557, 644, 253, -203, -497, -187, 522, 362, 243, -603, -752, 299, 363, 694, -413, -751, -359, 76, 724, 91, -249, -561, 17, 644, 612, -255, -551, -758, -27, 581]
3605E81j69q35l00M21O26M55o66o12l9N57O70l18n17o40M82N77J05J67o97m34
3625e86P11M09m5l86o43j67J363l64k13j95n37K29O72P43r71o67L6L03P45J28
3645E65m19o13P0L96P94m06p97J04M1O26M5o35o42J66P35L26K0p28k97N17L24
3666A92N36m81n07l20L76L80N47o38n28LN44N28j14q51k68L61O96K49k20j104
3686f19l3Q12K54L56q87m47k7R05J44m35k18l30K55P65p8j15j000L13O53J67k5
3707D10p77r6J14N24J59j21l56p85P62P00k96m34k97l54J150M29n57n93l69P27
3727f0O58j45k86q79K76L55N19o2l09n64R7N44J69K14n55k83L08Q50m13k13o56
3748d35k29Q00M89j25o19q19M33P21L59l07n92p6L76M00P9n68l81l80R13O29n74
$$ y = [581, 412, -423, -723, -302, 324, 779, 113, -499, -538, 19, 689, 371, -146, -786, -304, 273, 378, 545, -152, -586, 125, 534, 489, 103, -540, -707, 656, 292, 79, -116, -653, -424, 248, 991, 20, -647, -611, -308, 437, 565, 146, -467, -397, -1, 793, 387, -410, -306, -265, 361, 406, -229, -871, -705, 30, 356, 376, -352, -649, -132, 192, 728, 247, -260, -580, -204, 176, 723, 85, -443, -440, 104, 632, 518, -333, -601, -240, 456, 705, 485, -619, -652, 160, 414, 770, -117, -564, -591, 314, 458, 23, -195, -525, -270, 495, 417, 302, -698, -385, 268, 435, 410, -367, -463, -349, 175, 334, 213, -143, -928, -166, 534, 238, -196, -493, -847, 303, 732, 175, -418, -787, -60, 598, 453, 167, -712, -436, -81, 438, 376, 67, -497, -400, 144, 313, 527, -28, -311, -3, 847, 434, 221, -435, -664, 136, 625, 500, -119, -938, -505, 216, 575, 268, -324, -400, -24, 376, 455, -113, -494, -874, 39, 668, 94]
3769I4m58Q2l8O74j53k52o49J35L13Q55m25m05l48K19O27N08m74p64j15M55N08
3790C89P4l05p56K40L12N29k64m39k65M5P40L76k21p67k5K11N51J13q16m37L89
3811c26N48M12k39p48j75L53N02N12p51l21l29J84Q97Q9q04k13O7N45K05o12j41
3832c45p1L15M09Q4k59n29q5M56N83l81r7p44L24N81J19M3j029J90J58M15L37
3853D74k78o56J08P36N53q16k07q54M74R85k10m28m19O4M44M88J68q46k84L93
3873a11L06M90n34j83n93N61K92J98j99r50O28M2Q22m91m83j23P2N69J03m72l36
3894c92J17m2N92K20l66o01K07K99O17n21n10l52O44K45J49l58j89j19O05J45
3914C90j63j8n72q3M33L62j09j41l21J63P20j36n36k85j57J63J104n32n98k53
$$ y = [94, -364, -282, -320, 354, 201, -51, -700, -565, -252, 603, 178, -227, -575, -356, 271, 779, 305, -459, -574, -119, 389, 463, 158, -598, -358, -46, 483, 219, -220, -485, -440, 300, 676, 455, -312, -337, -126, 425, 538, -278, -715, -326, 222, 634, 395, -353, -528, -175, 327, 839, 88, -233, -562, -378, 519, 608, -196, -409, -342, 203, 408, -204, -345, -416, -101, 308, 392, 133, -396, -481, -25, 558, 177, 80, -664, -340, 241, 360, 403, -626, -436, -278, 137, 474, 196, -460, -352, 384, 937, 121, -86, -940, -466, 519, 309, -119, -538, -474, -30, 458, 626, -220, -504, -111, 195, 685, 151, -32, -625, -64, 228, 426, 227, -723, -95, -53, 769, 278, -205, -328, -256, 313, 416, -56, -392, -275, -317, 275, 495, 129, -472, -265, 34, 651, 130, -380, -732, -88, 157, 306, -52, -241, -360, 245, 390, 227, 209, -363, -446, -13, 349, 240, 99, -222, -59, 661, 525, -11, -296, -453, -290, 814, 282, -316, -569]
3934e69J85P59J30j25n94m35P06R4j6r8o62K38O55J78j66n02k92L59l7N78l1q78
3956e23j90O02N91J20p98l04j03P12N71k76r10J17M34N3K99n07l36Q7N26L47q2
3977D30p78l60N13O55J32l72q61J51O35M55l10l12m95J78M80M03k44p15j85K38
3997c62Q04J74o24j18j21M29L11R2r15l38J40M54N52j18o42k94P21J79J57l56
4017A25m80k58P86M62m83l25l85J67Q48L06o47p3n32L66R27n86l67N1k36O24Q6
4038C76M2o20k89N77L78K92o91l06j68M02K15M89j349p2P11M91P8O2p66m97M72
4059a73Q10j13m91n71J85K35O92k29o39k58K44L48L66r5o74J34Q6N20K07p27l76
4080e19J76N30K99j93n67k51K04O57M55m07r41j2Q81N01l67o08k3r0P45q5m44
$$ y = [-569, -384, 375, 505, 380, -214, -649, 57, 151, 135, 37, -625, -387, 268, 446, 280, -222, -514, -155, -192, 386, 355, -523, -713, -111, 480, 600, -198, -502, -605, 107, 678, 402, -508, -391, 43, 96, 395, -112, -448, -361, 165, 512, 430, -348, -708, -195, 460, 592, 220, -641, -490, 145, 600, 290, -22, -517, -339, 141, 544, 300, -415, -600, -362, 442, 616, -8, -126, -247, 182, 493, 585, -330, -668, -528, -74, 478, 360, -282, -576, 145, 324, 481, 125, -355, -613, 173, 635, 152, -173, -558, -391, 457, 763, 116, 43, -489, -123, 804, 218, -149, -98, -334, 290, 376, 418, -202, -491, 86, 464, 756, 65, -241, -409, -7, 208, 697, -652, -724, -13, 478, 556, 618, -148, -645, -173, 637, 524, 33, -538, -353, -118, 574, 345, -294, -552, -308, 40, 406, 311, -363, -229, -143, 377, 584, -143, -519, -343, 187, 486, 293, -274, -525, -321, 336, 791, 384, -557, -569, 312, 813, 446, -162, -185, -275, 470, 385, -59]
4101e9k04j1J40K83K15l80n75L90J92L38k53m20m28O31M41L23m12q73L99K91K97
4122C25J98o03n10j87O45N30m68k68k39J86Q98j3n61j40l47N30N04j62m72j91
4142c45K94K95K64m49l68k37O05N48o3o85l44k0N56N89m57m75l73M09N17j72L36
4163D25q12J13M94J22J19o50J7J16L52J88m12m83M7K20O59j90q39J14J94L9R23
4184G56o35l50m21P03L19J13P6p60m22L46P29j92m39k68K32M75J99j75p17j3J69
4205b75O33j57k53j14l71O43J82N5o16j34P7L49Q08l50q34r0P06J92p9n15l41
4226d84K06O25O7l78m24O7K00N41p6l54p29J13L80N59J79p86j5l5M94J87q9m75
4248b27oL08L06J1j68p87J18N17O10n40l96p3j41R70j59J84q39j36O02J57J19
$$ y = [-59, -263, -274, -134, 149, 364, -16, -591, -201, -9, 329, 76, -344, -772, -141, 300, 623, 211, -662, -263, 28, 325, 523, -80, -590, -777, -132, 398, -70, -338, -577, -391, 507, 494, -67, -207, -554, -24, 480, 318, -154, -345, -51, 244, 508, 59, -309, -546, 59, 607, 544, -141, -485, -505, 51, 640, 183, -292, -665, -256, 261, 89, 425, -387, -274, 220, 342, 461, -189, -172, -56, 296, 484, 72, -411, -364, -144, 515, 325, -514, -400, -206, -167, 756, 121, -229, -650, 53, 372, 485, 561, -199, -621, -275, 454, 262, -177, -445, -213, 262, 461, 286, -431, -444, -275, 358, 201, -52, -166, -537, 106, 288, 343, -273, -407, -330, 19, 827, 477, -357, -447, 259, 451, 372, -143, -484, -278, 347, 414, 36, -388, -321, -121, 420, 344, -10, -739, -626, -246, 313, 492, -294, -309, -344, 150, 337, 248, -227, -233, 75, 381, 392, 224, -563, -445, 72, 682, 142, -254, -327, -468, 502, 343, 527, -312, -448, 154, 311, 430]
4269D30l78n30P6N00O30o67k44n18N40J58L16K3q79J81J92N57J90p38j74J78L16
4290A59K66n4n68m58L90K54M83l53m60J21N6M04n6l27k90J73L63K84l15l44m0
4311c12K53M76K4k84o05J21M81N72m23k44m42J05O62K47o19o53K11K23O43P6o87
4332a75k58K9O79q0P9l02m54L67M04K60p6p39K16K15p7J73m91J5j95N97K69n4
4354D02n95o34P13Q80k21p58k01m5P09K56R8q61l17M29J02M23m53k71k06N68M54
4375D72p7o30k22L1O94N71m45n28k0M9N43J51m86l68j24N25P5K26p12L4J68N52
4397D79M2m46q08K40O43J25J03l79j94l66P49J95j95o22K0j27R19J47m39l07k89
4418e10N67O29l74l00n27J98O69L68l82o03l08O49L75l2l23m22J31O52J26l94
$$ y = [430, 52, -478, -402, 98, 728, 61, -183, -701, -161, -3, 313, 336, -543, -362, -170, 387, 577, -161, -335, -157, 159, 425, 371, -197, -655, -265, -11, 472, 119, -341, -220, -164, 240, 184, -143, -433, -260, 103, 387, 72, -272, -312, -59, 417, 441, 157, -448, -327, 154, 726, 303, 59, -383, -278, 384, 631, 12, -641, -430, -207, 436, 512, -175, -433, -404, 275, 195, 274, -28, -482, -115, 289, 549, 473, -266, -50, 165, 88, 261, -230, -215, -410, 187, 456, 402, -193, -827, -114, 766, 545, -213, -414, -459, 250, 506, 604, -257, -574, -145, -43, 380, -73, -344, -550, 18, 472, 395, -235, -457, -426, 268, 839, 394, -134, -154, -105, 438, 589, 103, -265, -389, 136, 211, 437, -275, -241, -73, 479, 521, 75, -733, -493, 150, 275, 378, -1, -195, -561, 188, 383, 188, -434, -414, -541, 378, 525, 86, -221, -510, 57, 686, 312, 12, -515, -317, 352, 720, 338, -265, -573, 76, 451, 419, 96, -326, -195, 457, 583, 189]
4438A89m30j16M5K83O29o30r8k44L38M77r1n10m0l08Q40lj09o91L5K31M15K62
4460D74l17l97K2K94N89K1p96m06J61K13P13l68o44k03M53O95j36j07q10K07K60
4481h2M96l73k05n38M02N88pj62l64m9J47N18l58k26j85L38J06L36j13o81R5J01
4503b16K89M05l31m04j94L94O59n22K7n19L2P81J15m72k99k81J14Q16m20q6k38
4524c50k50O53Q82m29q87k93P19P79o19l18l22J62K00K11K62n11l65M28l3N17
4544D36k78o45K33j77P24K36m69m13k49O47K82ol25l04NR93n9o72k02j74J95N50
4566C28k88k77R0o71R75K78l91l60k15L64M84nl66n03J77N49K44m9k24m54L16
4587BJ92K80o16k9kL2N48K49m57o79M2N45N56k61n24m96L66M68K36p0l97l77J98
$$ y = [189, -241, -357, -312, -29, 600, -30, -128, -372, -34, 443, 352, -158, -198, -506, 334, 331, 222, -469, -434, -203, 212, 474, 157, -240, -218, 76, 665, 686, -110, -516, -355, -142, 571, 203, -441, -644, -191, 504, 368, 261, -549, -342, -82, 414, 41, -164, -702, -300, 288, 281, 119, -245, -294, -147, 371, 13, -213, -398, -60, 46, 382, 269, -412, -317, -216, 73, 478, 147, -257, -451, -57, 602, 80, 107, -412, -380, 401, 516, 44, -255, -536, -422, 394, -26, -112, -350, -600, 53, 935, 506, -381, -674, 45, 824, 205, -113, -435, -273, -73, 138, 400, -111, -476, -48, -81, 436, 158, -487, -254, -431, 293, 529, 60, -353, -602, 45, 327, 321, -4, -308, -303, 690, 631, -41, -243, -417, -222, 328, 40, -237, -147, -818, 157, 435, 44, -316, -531, -167, 317, 312, -54, -557, -380, 169, 413, 364, 140, -314, 2, 194, 474, -142, -171, -173, -141, 407, 656, 199, -480, -438, 107, 663, 402, -122, -618, -252, 216, 452, 382, -15, -392, -194]
4610a94M23L26n40o77M81K17M40k14m11l03J18L42N94l55p40K88J47M72j80l03
4630f9n97J86P84K33l64m63k32N10R2L36l06m93L9J86L36j3l21k80L32K89K75
4651D60j58p39k0O51K26N5n92l78L35O53qOq64j00J74N55K35j43n85j28L24O41
4673F00l59o54J15L77n6N49m26m91R1K87K87l5j18o76J2p1R21L47q77l30M38M12
4695C43J26q32l49L83K07K75M83o96k30j6K96P1j71K4l12N41K66k28j87k76J03
4716a79K36N62qp93j32j7O60m1j62p15K39M68N2R6l88l64J19O18P7j90l74k20
4738d56J96P86n0k60j53k90J97K86m1m99OJ6J46O08m3n64m93O40K90P4k18r42
4760g64M60M71M13m40l24l01K02N14J89m81j27n93N11O77q3j68m11q0L47J62L62
$$ y = [-194, 229, 555, 15, -662, -181, 36, 476, 262, -149, -452, -334, 8, 602, 247, -493, -205, -58, 414, 234, -69, -666, -480, 304, 537, 173, -290, -522, -12, 80, 416, 110, -383, -344, -158, 178, 165, -156, -436, -104, 185, 460, 302, -437, -457, 194, 420, 475, -117, -495, -160, 493, 485, 491, -373, -473, -299, 256, 491, 348, -237, -365, -41, 600, 241, -413, -298, 79, 23, 572, 146, -345, -254, 33, 320, 285, 167, -509, -497, -568, 353, 700, -177, -507, -69, 343, 469, -363, -712, -329, -122, 153, 636, -60, -290, -306, -10, 61, -110, -86, -398, 143, 409, 181, -6, -282, -179, 57, 619, 611, -182, -314, -331, 329, 288, 126, -589, -350, 118, 170, 266, -122, -486, -367, 251, 328, 138, -236, -456, -260, 526, 476, 216, 63, -227, -30, 256, 215, -284, -278, -262, -116, 492, 449, -115, -608, 32, 322, 396, 178, -764, -304, 167, 580, 140, -184, -485, -283, 231, 420, -61, -188, -781, -270, 407, 324, 156, -255, -335, 12, 174, 536]
4781E36o72l10J98O03K28l60p29M42p2L23J75k16m57J48O8N46m12k63m28O15N03
4802D66j16m83k20j2O73K35p19J04j40j14K00P03k94o63O0M44K69k8n24o1R9L17
4824A96P6j00l54j65J88N32k56j77k66m37M98P38k5n60m65K87K88J94J39o58k40
4845e67N56M33k05n19k04K24J94O59n56k31n1jK41J89j37l76k06P26J30n5n06
4866b62L0l11R49o3j92m20k88M41L59r6K53n13j02P0M14j29k16k69J14J73N50
4887D92p26k65N15p0M63j10q4n86K38J63K05p6l30k35Q09l92K41j50j49j93N92
4908C52K98n19K0o96L06N53K81j00p34m95P16M95k71j12j55l96N47m6K42n66l14
4929e94J58O09K99m65l65K9R5K91K36l20r8k18M74J31q7m62r1pO13N1m11L0l34
$$ y = [536, -136, -446, -248, 355, 583, 223, -506, -64, -136, 187, 362, 146, -311, -163, -95, 451, 39, -224, -652, -37, 466, 350, -133, -353, -365, 308, 543, -176, -72, -212, -326, -126, 577, 283, -380, -320, 124, 393, 365, -159, -220, -121, 196, 272, 172, -182, -347, -159, 373, 117, -60, -326, -763, -265, 473, 448, -112, -577, -290, -2, 192, 331, -327, -567, -11, 422, 217, -302, -506, -282, -88, 571, 15, -216, -267, -268, -27, 162, 25, -351, -557, 169, 299, 244, -262, -232, -543, 406, 343, 151, -269, -557, -116, 243, 147, 400, -113, -215, -145, 269, 140, -76, -345, -231, -58, 492, -234, -499, 16, -54, 409, 299, 215, -371, -133, 30, 235, 159, -171, -406, 403, 11, 252, 102, -47, -240, 352, 650, 131, 151, -545, -239, 314, 595, 495, -239, -734, -18, 477, 206, 94, -61, -457, 90, 44, 286, -280, -594, -436, 173, 472, 7, -358, -329, -234, 57, 293, -27, -125, -343, 131, 262, 175, -287, -378, -385, 228, 279, -132, -102, -436]
4952d36M96K92j63k01l96N55J08K31n05k27m20M98O00j31k30n05J42J87M28K09
4972E32m23o00L91K12K91m38o3K1Q5K61J10m36m47K11O39K06m75k40k5P4K25k29
4994a18O9l46K51L26J01k96J37j65j96J76N10k47m39j35K15L16j30r4l17j49K92
5015b39K89J26l79j49K78K62L37j85n49m8K92M11k60l96p5R3N17J38q3k94m86
5036d00M0O75R5k61m15l0J75L95M4o2m70k09O18m9j59k31j77N16RQ8j07l55k75
5059e45R54l13P6j82m48J29N93N9l73p0j89K03M84l11l13j3l2K83M15j98k30o25
5081f46N20K55J05K33j140N51J57K78jk06m33K21P59R1o59j33j87J30L81R3l25
5102D4k43J71R4Q1p8l71j97J24O82J90l81p29L04L17O4L42n10l95L51L83p7l3
$$ y = [-436, 60, 352, 189, -12, -408, 147, 255, 486, -19, -246, -666, -168, 432, 301, 71, -434, -292, -105, 323, 532, 109, -491, -100, 112, 403, -35, -98, -77, 8, 269, 379, -57, -504, -293, 346, 552, 77, -163, -188, -114, 111, -118, -49, -395, -144, 182, 283, -13, 124, -41, -237, -61, 449, 202, -237, -372, -157, 159, 29, -65, -382, -531, -239, 50, 176, -203, -352, -74, 188, 525, 340, -209, -257, 35, 446, 186, -210, -285, -192, 325, 463, 380, 86, -400, -360, 315, 410, 149, -266, -296, -121, 274, 318, 256, -214, -423, 195, 146, -13, -244, -421, 95, 104, 192, 85, -270, -545, 409, 96, 172, -10, -458, -329, 264, 323, -50, -120, -309, -106, 378, 67, -246, -259, -291, -8, 407, 209, -21, -646, -126, 129, 234, 467, -673, -122, 35, 313, 312, 106, -327, -106, 653, 744, 85, -48, -235, -105, 276, 369, 44, -199, -28, 66, 147, 69, -302, -499, -375, 307, 497, 116, -613, -309, 8, 72, 414, -96, -491, -140, 243, 166, 133]
5124A33k46k68K11N79k47q5m37J68p2M71L9m35J36J42j3J02L13p21k99P63L47
5145E81m16j91k89J51K08N34o00l59J26jL41J77j74m76K75j56K49K51j08m60r0
5166d27N70J12k86j76j43L71J27o4j1o20M38P8N74n56k39J92LM51k70J4m12P9
5188a95M81j6N9l21k72k00P88m61J34k62J27K23j1K73m02j61n6J43K64M31q07
5209b41J68k58P13K49m80j57l77M70n8J76k09l26O0JM36R8k56m41N90O8j1n6l44
5232a85J84R2L90l61j01r1j0kL04L1l85k27M64K43J17k90l47r6q7P59m9n32j39
5255c18P9N75N0m35k7k16J85N61k62j58k96O9L16K12l14n3n48K78N31J4l73q8
5277b18j04K24O99l33o11K7M81k65L27K16m50j17J11L24k23L6l50P8J1M52m23
$$ y = [133, -113, -381, -170, 409, 162, 77, -360, -192, -264, 207, 246, -189, -53, 89, 76, 178, 491, -230, -529, 234, 581, 165, -26, -315, -164, 44, 578, -22, -381, -255, -256, 85, 262, 88, -388, -113, -269, -20, 231, 123, -337, -427, 143, 255, -31, -207, -350, 21, 148, 84, 73, -547, -109, -31, 543, -13, -252, -60, -57, 394, 124, 138, -274, -195, 286, 270, 329, 8, -264, -464, 324, -137, -3, -265, -138, 85, 74, 347, -55, -216, -272, -129, 135, 566, -241, -73, -331, 382, 631, 151, -6, -383, 87, 29, 205, -4, -330, -270, -269, 167, 265, 9, -432, 158, 226, 215, 159, -185, -1, 91, 481, 120, 19, -72, -82, -84, 220, 251, -134, -361, 103, 346, 463, 173, -174, -270, -357, 402, 353, -179, -318, -239, 336, 386, -49, -76, -292, -107, 454, 192, 34, -262, -193, 123, 335, 21, -32, -580, -302, 229, 243, -130, -218, -322, -98, 601, 268, -343, -316, 165, -100, 227, 443, -7, -124, -13, 311, 88, 124, -226, -148, -137, 315, -108]
5298a08J00j70K7J47K0K25o52M0K03M44k27N0J8l25J60J01k37N7J74j71L23k78
5320g9Q7l05o2K21M38p2l63k14L68O3K73J54n78k32J62J31L76l12k72J17J33L08
5342C42O6n26m62N39J84J20k78m53L71J27J93K6k50l66J17M03l1k67j06j09K38
5363a22L3J45K48p35j6N75J08k22m44j6K60L26o4J55l23n66O69J45k98M4k03K02
5385i9k27K75J77k76P4j35q9L28m5m76M58J30K46j78k97K70k05J6N14l68k50l2
5407a89K51L94k12j04n38J51K36K90j91L4k53P3L83L26n11k23n4L53J82k01j78
5428A9j90n1J67M01k86m13O9J2M46K11m81j5k56O03K57j06n89j63L55K44j52l7
5450D5K3n21M54L82o73L47N9p11N95K61K59m18j63J43J51K43j81n37K30P6J48
$$ y = [-108, -8, -178, -151, -4, 16, 241, -411, -371, -168, 276, 49, 99, 117, -208, -48, 53, -184, -127, 47, -124, 199, -79, 8, -297, -359, -138, 300, 228, -135, -349, 19, 82, 355, 509, -69, -301, -139, -8, 368, 56, -216, -99, 34, 342, 408, -118, -580, -41, 143, 263, -15, -468, -97, 30, 223, 249, -1, -367, -250, 153, 122, -145, -251, -360, -122, -89, 56, 304, -431, -447, 128, 236, 14, -430, -446, -186, 140, 76, 231, -92, -658, 11, 156, -142, -98, -301, -99, -326, -51, 126, -150, -76, -211, -300, 28, -17, -493, -35, 95, 341, 163, -134, 136, -69, -53, 461, 93, -157, -189, 62, 456, 244, 140, -398, -247, -11, 279, 88, 122, -131, -58, 325, 651, 140, -83, -137, 216, 398, 197, 19, -171, -222, -55, 346, 60, -353, -284, -272, 174, 385, -96, -111, -367, 236, 493, 387, -202, -365, -10, 234, 82, 45, 68, -453, 1, 383, -290, 57, 116, -595, 0, 261, 520, 102, -61, 82, 233, 476, 295, -242, -12, 64, 212]
5471B12M9l17n43L46M77L1L01p10J96P5K68k15J26k86j22m8M82k21j57L3k25O40
5493C92j40l17j22q2K28K64j22K46n90N7K46K62l08k63K84j25M20j51m21k15L53
5514a04K52K68k44Pm62R5M17k20L60m48p3J11p7J21p8m55M80M39j84J11m25N3
5536e6J28k7J44j77j96j5j7M49k00l25L09l13O25k93K23Q5m55K0L40R8m18J94
5558A23l32J03K41K18k3p43L07N9p4J73l12J49j97N02k63jl20J45L58L54j70o01
5580c04J09j7K35J09r6l76J2K83N18n47k48K5J25R3J11J16k67m0OM17J8o3m90
5603b71M7jM82p7J17n62K46J46K36l88k46J15L62J31k47k54j15K12J90J11l7j21
5625G6r8l87M51P9l75M23j18q3J00L4jk58j17P46k68l83o4lJ62N18l46m5R3k07
$$ y = [212, 261, -56, -599, -253, 224, 255, 556, -154, 42, 117, 385, 170, 296, 10, -112, -160, 322, 101, -56, -23, -248, 392, 252, -65, -187, -269, -41, 223, 101, 347, -243, -186, 60, 322, 14, -249, 35, -90, 330, 179, -242, -457, -104, 148, 416, 172, 179, -283, -188, 229, 9, 369, -79, -152, -41, -118, 3, -75, -530, -50, 389, 205, 316, -109, -56, 72, 45, 189, 12, -184, -199, -216, 233, 33, -292, 17, -296, 329, 36, 259, 344, -111, -91, 249, 347, -71, 123, -209, -106, 135, 353, 330, -413, -106, -47, -121, 52, -260, -111, -308, 194, -69, -70, -390, -245, 113, 467, 297, -304, -195, -212, 23, 132, 36, -340, -328, -45, 473, -74, -322, -297, -172, -79, 32, 148, -119, -159, -153, 264, 282, 219, -271, -224, -225, 257, 180, 297, -265, -19, 127, 363, -25, -271, -156, 206, 337, 90, -164, -279, -67, 123, 234, 197, 76, -22, -409, 42, 121, -254, 169, 51, -32, 68, 102, 101, -157, -274, 472, 204, -179, -243, -246, -84, 434, 88, 43, 136, -71]
5649g1K00O1J40m14m18M47q7M6L94l93j46J61K11K8P5j86k76J72J71K62m04j76
5671b03J2M77l5k66k1j95K55j57N86n01l67K96N54j64n2n30K02K43NJ0k10r1r
5694a61J53K3O2l3k61j1L49r4j84J43o6r6M23Q8k82k62J90j9M0j0J28Q3l99K29
5718C3M75o20K30k90J60K68j75k76j12J95K84k35M3k95N4L70o1K42k07m83L86
5739a4l6J25n0l14K87m4K76j14l92jJ34K43J24k93K9q0R0j16K67K33m36j56L57
5762A19j61j1J49j74l67N05q4l1j1O3j67j44O39m74k7K06j96J18K56k96l13J48
5784b53K54n5m3j40m8K37K70j95K49m94q9M17K29K0m63m3P6L90j74o6l40j9J13
5807a67L74r1M5m51J24K70J38o6j86k17K56j26L17P7m39K35J4L4j03j31N5L9k32
$$ y = [-71, 129, 190, 330, -84, -502, -55, -142, -96, 298, -95, -241, -80, 131, 159, 234, 48, -228, -56, 115, 377, -27, -203, -191, 286, 251, -15, -36, -231, 24, -133, 453, -48, -415, -119, 435, 271, 219, -311, -109, 134, 139, 149, -61, -152, -161, -8, 15, 77, 44, -217, -228, 121, 27, -157, -14, -80, -176, 247, 335, 53, -209, -19, -38, 2, -8, 120, 203, -196, 33, 508, -112, 118, -172, -12, 256, 81, -195, -307, -112, 172, -63, -20, -315, -261, 109, 48, 290, 83, -400, -14, -50, 75, 25, -289, -2, -46, 230, 116, -276, -277, -143, 100, 224, -69, -40, -120, -30, -146, 121, 354, -82, -238, 119, -42, -53, 96, -78, -445, 60, -24, -55, -66, -3, -170, -314, 325, -149, -176, 30, -166, -48, 208, -88, -401, -253, 1, -54, -97, -237, -285, -48, 222, 27, 276, -218, -307, 110, 339, 359, -104, -147, -71, 319, 145, 79, -261, -280, -167, 207, 116, 161, -290, -166, 104, 242, 176, -10, -227, 29, -97, 220, 297, -142, 93, 107, 141, 38, -93, -38, 1, -231]
5830b31M41k72K52l88J22J23K66j0m94o0L31Pl54M61l38qL05J22k28k55J20j69
5852b57N19L42l51m39l65P41K56j23l13k75M4Q8L78m37q9k6L61J14K1j26m06L10
5874c3j75K8K22N0m08J58M20j79j77j44J72M26j92j28j72j02Q7L18N5J11m14j81
5896b58O0O81l16k9l52K33Q5L34k46k66J26N2j84L87j39n68L50j56L32l18J4j54
5918c32L68k15K69L18m62j44r5L35j6j93j38J4K46P0Q0j78M8J36j32J79k38K0
5940f0k82K42J96l05J80%O7L17j33J9p40O33K9K2J31j34l96P0J94J16Qm17O8K50
5964G5k19K96Q4j26K4l92M17j57J71l2m64M71r7j8j21J28N3l6l1K7m50K25K34
5987F2J98k43N3j57k46N25k27J96j48k96K76P6J1k65P4j74L06J1R9k06J62k93
$$ y = [-231, 210, -62, 190, -198, -76, 47, 313, 303, -191, -251, 80, 87, -267, 194, -144, -152, 153, 275, 47, -208, -88, -257, 262, 604, 253, -186, -551, 190, 446, 323, 10, -265, -221, -133, 245, -192, -281, -307, 54, 168, 189, 63, -343, -33, -208, -180, 42, 92, -316, -158, 262, 83, -94, -238, -66, 360, 168, 40, -132, -234, -147, 171, 226, 337, -77, -258, -198, 483, 167, 138, -214, 19, 104, 438, 192, -74, 52, 104, -80, 307, 168, -400, -50, -206, 126, -192, -178, -332, 36, -179, 90, 408, -54, -198, -293, 42, 26, -167, -305, -291, -45, 25, 105, -73, -25, 111, -21, 158, -80, -60, -342, -100, 96, -209, -29, -29, 38, 355, 222, 241, -499, 134, 163, 185, 316, 182, -214, -144, 50, 166, 174, -243, -175, 75, -144, 152, 236, 110, 134, -258, 159, 2, 173, 141, -323, 148, 51, 33, -88, 40, 93, 57, 26, 53, -397, -172, 62, 260, 17, 70, -87, -333, 192, -35, 161, 13, -283, -7, 69, 80, -185, -111, -285, 21, 32, 131, -75, 87, -206]
6009b06K76J37m50J39K74l94L88K01j74k32q5jK53j20j71L15p4O1j16L31l45l92
6031c85J01L54j4k73k7K67nj19J06j22k7r7L68K5m04J38k34N01l10J70N8k30J44
6054a5J55r5K65k90k68M87K69k05l79k00J48K22J24J5o92M2N30K35m46R7j93n3
6076b47M34k7J16k48k9o0J11j07J38J27n37L7K76J43k52K74j7K3K79k29j58j99
6098a52O8L26k1lj26l34K3J55j95L72k85J55K96j42J22j31l13K10K55j41m97L34
6120b4r8j38M76k50k70M0K65J11j49K13k56n2J46j8L4n9k17K1J26M31k15m19J19
6143a83r5O02k01n93K69J34K08Q5J56n48l09K14J43Q9j10m8NJ69J91k40K01n07
6165c68L62L7k47J17J09j02J56k44M79l72j35k24N12P3J19n22k4J08K95j5J32
$$ y = [-206, 70, 207, -243, -104, 170, -224, 164, 365, 191, -41, -126, -127, 126, 6, -165, 150, 76, 137, 21, 352, 7, -385, -284, 70, 56, -217, -244, 23, 18, -101, 5, -117, -144, -241, 127, 152, -252, -114, -348, 153, -157, 13, 71, -159, -15, 140, 45, 310, 20, -248, 239, 508, 303, -76, -276, -128, 94, 218, 233, -459, -417, 113, 348, -98, -1, -194, -247, 187, 160, 276, 28, -1, -61, 50, -57, 81, 208, -329, -292, -16, 127, -125, 149, 132, 155, 434, 205, 47, -152, -84, 242, 221, 218, 92, -242, -219, -64, -259, 113, -172, -17, 279, 137, 259, 128, -185, 25, 280, 139, -358, -24, -122, -260, 216, -34, -304, -264, 1, 112, -37, 176, -80, -132, 14, -4, 30, -29, -246, -225, -99, 332, 117, -302, -183, -278, 324, 123, -470, -201, -67, 141, 226, 382, -166, -475, -261, -118, -29, -139, -187, -182, -13, 178, -62, 139, -368, -6, 31, -216, -99, 10, -92, 64, -180, 299, -73, -208, -432, 80, 153, 272, -250, -274, -166, 129, 114, 246]
6186B46k60r9L36m33J05K46p02L59N2K19J53l70O02k54j65L4k55k66L72L0J2p4
6208a12l1N7j44L61J30J2k8m48j55K78N0N9k49K37k5Q7r9J67n65R8L43J95p5k94
6232a51R5l28N15j38j99RJ26K70n0J53k77R8q9k29K69K42m92pK27pn6p7K35k41
6256a02O5L12m0q49O71j70J66M08o42M23k28l3L24m35p7K80k40K98J02j43l07
6277b17m0J85L07k38P7k31R8q4L19K3k64J60j99J62j95K11j61q3J6k55N06q4l20
6300c07L00J11K22p01K86q6K06K97m87K47m39L73J80j51K39l32k02P1K78k07J10
6321HK08m46N06o9j41L49n78N2K46R9K35l69k31k02L34j19J98K9m56L86P4J22
6343B35j30l55J57L54k37L3k2n1j2N9K8j06j07n5J83K4M4m6k86J51k2L61O9k36
$$ y = [246, -14, -113, 223, -210, -105, 141, -561, -202, -150, 69, 222, -148, 454, 200, 35, 69, -186, -452, -80, -50, -38, -112, -143, -86, -230, 131, 261, 273, 245, -203, -358, -80, -30, 29, -220, 17, -8, 79, -20, 147, -418, -320, 23, 218, 143, -151, -56, -384, 131, -7, -206, -197, -71, 199, 149, 302, 25, 123, 34, -195, 74, 316, -176, -183, 44, 37, -19, -96, 139, -102, -37, 275, 235, -614, 57, -113, 53, 461, -181, 242, 14, -19, 305, -130, -207, 73, -167, 131, 233, 90, -217, -257, -72, 235, -3, 74, -157, -59, -143, 176, 199, -65, 95, -104, 58, -137, 74, -87, -170, -154, -409, 97, 13, -307, -7, 104, 326, -375, -89, -175, 31, 328, -159, 88, -351, 22, 202, 51, 290, -42, -244, -173, 105, -102, 8, 216, -230, 276, 207, 66, 415, -163, -111, 135, 234, 469, 100, -131, -333, 1, -118, 80, 109, -347, 39, 113, 235, 105, -250, -93, 261, 24, 57, 35, -16, -28, 31, 59, -47, -154, -209, -26, -2, 42, -4, -290, -139, -161, 200, 269, 33]
6367C3j83M1K77oJ20l67N8j0j3kK6J0L44m02J42k88j1O7J05K04K1l56K01k7R2
6392G6r7m1n6J21J8J00Q5nj83j67L14j03J58m23L38k98J36j93J41J54j39k60L36
6415A2N5k81J78j4K91j34N3l4j31j82J54K22j75j17N43k35j33j20R0k23J1L32
6437A62q6J77n08J42J71J34r4p9n5K19n52K55J06j48J26Q6K00j37R2l43j48K20
6459f0J60L3K4m3l06M19p3m4l00P4K08j33l21L75j74J84J73J00n23J34K70n47
6481c70L02J4j7R4j81K91l13L51K1n47L95j42K43m76M37j04qL3J00o2J11j44j75
6504a47J91J81k6m49J64K25k28J01j20q7J15K01p7o4l55K98j22r6N30j09K3k43
6526i4J15M1L35o59J74L02k22n8L9Q3l38L12O6J67j45Q1k90J30k8K8m5K5K43O8
$$ y = [33, -150, -109, 168, 162, 282, -85, -27, -37, -50, -52, -26, -16, 328, -74, 68, -220, -231, -164, -59, 145, 166, -190, 11, -16, 76, -21, -62, -118, 3, 21, 121, 206, 201, 18, -149, 165, 62, 220, -203, 135, -163, -27, -220, -79, 75, -64, -324, 12, 67, -214, -36, -50, 241, 107, 160, 126, -5, -187, -33, 189, 14, -103, 440, 205, 72, -48, 42, -181, -170, 162, 76, 253, -255, -113, 58, 192, 98, 19, -36, 183, -369, -114, -8, -156, -30, 56, 256, 119, 211, -132, -280, -60, 100, 133, 157, 114, -192, 227, 154, 110, -190, -116, 92, -41, -362, 13, -161, 23, 196, 296, -227, -93, 177, -370, -68, -54, -71, 23, -158, 133, -180, 171, 192, -355, 40, -102, 141, -335, 102, -2, -10, 23, 123, 61, 172, 28, -147, 44, 225, 199, -250, -86, 139, -89, 12, -108, -195, -80, 121, 44, -20, -375, -77, -199, -295, 235, 126, 149, -94, 21, 62, 397, -262, -88, 214, -8, -66, -27, 56, -282, 30, 96, 263, 118, 199, -91, 39, 11, 39, -6, 19, 262, 330]
6550C30N0n42J62r7Q9j81K09l36N9M82j66r8j96j80M0L09K37o3j41j92K74N05
6572E54m52rK1l30K57%k07K26j67J00K0J34l93L06j38O5J6j02j52K23J69Qq3J58
6596B24L7p64M43j6L33m97K29J47K73n13O7M21l41L38m82L09j13l27J60K93j99
6617B2j27m5N0J27K36l16L6q3J29k44L5K37O0j32j05K56P3l07J15m88L31j9K20
6640F1K96l62R3J2k47K34l88N82k76n9K50l10L71k72k83L01K34k14p8j72K68l6
6662EK24k46r5j65P8L52o8K03l23R1J23j87k45M12o57N45k00M37j86k74j6P0K98
6685A76k49Q7j22j44j34O08l45L85j06k60K98l87K3J74k23J34j15L83k95J01j03
6706a14K50nl8k41R9J19k06K13o2J02k93R9P7N7m64K87K34k02J92k48PJ59j60
$$ y = [330, 380, -162, 0, -97, -8, -189, 20, -316, -257, 225, 59, -39, -235, -415, -375, -66, 171, 108, -33, -225, 49, 554, 102, 93, 114, -216, 41, 41, -166, 60, -107, -7, 13, 147, -246, 60, -78, -13, 3, -99, -251, -28, 141, 149, 66, 224, 261, -503, -60, -76, 257, -240, -11, 136, 409, -104, -37, 384, 43, 381, -101, 208, 95, -232, -72, 221, 22, -105, -150, -100, 27, 263, -53, -17, -100, 29, -215, -180, 57, 117, -15, -120, 136, 209, -98, 17, -471, -140, -159, 61, 357, -5, 88, 100, -147, 87, -301, 281, 5, -54, 196, -114, 257, -15, -298, 3, 237, 23, -55, -227, 41, 5, 229, -17, -112, -277, -199, 153, 85, 288, -35, 56, 179, -8, -253, 159, -498, 47, -153, 284, 98, -176, -192, -122, 176, -73, 14, -108, -252, -386, 222, -123, 262, 156, -104, 194, -193, -170, 4, -219, -85, -200, 183, -112, -11, -114, 136, 131, 93, -148, -49, 70, -136, 77, 15, 117, -176, -77, 0, 57, -407, -120, 114, -88, 104, -144, -137, 22, -138]
6729a38K24K45n00l9K07KRj38J06k48R4K05j09p4O20n32J77L9O1j43l70K49PL64
6753C18j73K45l39J67nk22j37k80J07O07j22j47k09l1k5L50n1J87m05J58J60j52
6775AL10k99j75K86J29l02K82l27J88j59k02M82j37j06J23J20k76J29J57m40L51
6796A35J09j76k96J41k53M99K5j00P3Q5l99J98j0J37j08j12k4J70J04k73l2j92
6818b99J20K34J78Rm21K14j98J21j62J59PjN9P1r5k41J00N46k71m64L61k51K88
6841F4k59P7l56L99M9j03M61l64l32N68k22M01o29L24qK03n54L15k51n6K92j04
6863h5K60K88m90l1J18p5K82m56N51m15J03m5K5q9j27L69j93k61L25q4m4K22j45
6886CJ02R4k73o4M01l99O4k9J02J0K08l74L03N1l18K68k6j68J08j71J56q2J41
$$ y = [-138, 86, 331, -169, -208, -1, 1, 10, -128, -22, -270, -176, 29, -80, -154, 466, -66, 111, 150, 211, 68, -302, -53, -46, 318, 145, 390, 51, 218, 213, -9, -146, -426, -319, 288, 166, 19, -190, -221, -246, 104, 53, 240, -165, -7, 153, 1, 311, 12, -163, 123, 252, -50, 232, -95, 93, -66, -268, 214, 77, -29, 94, 214, -62, 67, 224, -216, 135, 244, 68, -228, -87, -340, 159, 184, 84, 157, 242, -157, 41, 31, 168, 60, -52, -76, 94, 198, -75, -107, -299, -179, 55, 233, 242, -179, 35, -163, -42, -204, -45, -38, -39, 20, 91, -4, -245, -145, 401, 130, -334, 27, -224, 64, -195, -118, -474, -75, -26, -129, 332, -32, -364, 204, -18, 383, -246, 78, 70, 273, -281, 34, -217, -273, 19, -85, 175, 463, -27, -58, 60, -15, 267, -189, 362, -53, 50, 5, 30, -59, -186, 183, -10, -271, 54, -30, -74, 148, 3, 105, 199, -74, -138, 263, -136, -72, -101, 1, 11, 219, -155, 148, 199, -119, 149, 123, -45, 63, -108, 48, -34, 107]
6909A07r2l4J0k60L29oRk24K70J47l19J42M5j6rk48r8L85r5q0J33n4l6j43j34
6934b71J76N1j37K31l4K26l53J55k78M61l76j85M80J0J02k33j30K23j58K78k04
6955C4k63J96J11j52l4j70J94J32j69J09j65K17k71K50K72k07J68r4J31q7l68
6976a66K6N3o8J4J91J25n9R1l64J37o2k45N19l19j53K12J52l8r9L70k68N4J57
6999B60j26k67n7J26K77k10O8M8k22J97q5K7j8Lj39J78j70J16l6R8q8P4l5K67
7023B86l23p0J60q5L6N9k83J73k9q2J04J90j00l4j43J85j9j09k81N79l32J89k50
7046a79K49j55O0k9j09R5n1K24l19l1K42m2J13j18k28L12m03L08K33p4j9l75L10
7069A4m51L56J53K0Q9m69N5J19J26J79QK98p31L00K8M2l5O1j50j5mk60J83K19
$$ y = [107, 15, -19, -9, -269, 60, 54, 63, -161, 109, 256, -63, 79, 124, 108, 99, -149, -247, 138, 43, -37, 96, 42, 6, -137, -271, -95, -44, -181, 50, 16, 242, -111, 44, -234, 227, -149, -334, 146, 156, 258, 25, -105, 118, -40, 238, 34, -229, -33, 78, -74, -108, -278, -84, 48, -121, -12, -177, 40, -231, 19, 291, 84, 252, 158, 289, 202, -166, -140, -87, -155, -141, 50, 175, 116, 207, -157, -20, -82, -327, 192, -127, -280, -68, 84, 46, -53, 317, 49, 103, 260, 134, -133, -190, -64, 213, 3, 71, 119, -103, 94, 9, 36, 18, 21, -118, 60, -110, 6, -30, 68, -20, 54, 19, 286, -37, -107, 53, -32, 4, 63, -220, -47, -76, -158, -54, 136, 36, 2, -141, 44, 25, -84, -365, 214, -118, 71, -179, 70, -85, -25, -54, -163, -68, -119, 105, -214, -245, -3, -45, 68, -50, -278, 34, -369, -61, 172, 98, 79, -296, 14, -437, -81, 72, 92, 181, -288, -233, -114, 12, 191, 199, 497, -234, 66, 94, 136, 101, 162, 12, -3, -7, -267, -84, 135]
7093A35j22M4j40l25J6M39l66O82m07j9J15Kk69L96P4L0k11l33L67l69N66m01
7115i6n3J07K12m85J37J17m5J97j61k64L74K8j4J13K1l73L12K04m71j65N28j35
7137H8o2R3j18m7j2J85l20K22j73j7K08q7L1l74K60k08K85k45N5k8K67j05O3j06
7161a45K39L3k21j61lM75J70k04k16L36k08k33J0M0L72l36k28K17k8J5J12J08
7183A44%o4j33j8J81l76L80l93J84K02m30K29r0K38j54j73n4K18J66j71K27j58
7205d5L7K04L81m96j38J99m8k20j84J89J81k79K27j23J48K16o2m32K42J8K83m54
7227a56N4K55k00k5j06K51j45J80j25N6L97l07j33J27j73J50q0J9J23k33j31K82
7249H0n1j23J93l78J46L56l10K88j1n7j90lM8m6J51j1j94J19o9K66j59j39K34
$$ y = [135, 13, 57, -83, -408, -392, 47, -319, 363, -44, -63, 52, 54, -215, 181, 255, 285, 74, -259, 108, -261, 305, -96, -149, -42, 170, -315, -178, -61, -106, 91, -70, -334, 40, 68, 54, 167, 188, -185, 127, 331, -140, -305, 223, 88, 26, 119, 1, -46, -58, 127, -193, 29, -144, -161, 47, -40, -9, -383, -123, -331, -46, -291, -236, -264, 3, -102, -39, -145, 94, 127, -94, -255, -258, 217, 387, 183, -33, 303, 95, -138, -128, -88, 284, -52, -280, -63, -91, -76, 36, 144, 144, 80, -53, -71, 110, -266, 114, -279, -95, 107, -323, -94, -184, 54, -100, -273, -327, -109, 57, -114, 113, -45, -8, 196, 577, 81, -57, 142, 94, -126, -310, -121, 60, -219, 8, -115, 33, 249, 187, -245, -3, 15, 298, -156, -102, 153, -47, -72, -178, 73, -72, 108, -17, 39, 436, 129, -4, 123, -50, 100, 20, 39, 162, -71, -202, 80, 29, -94, 99, -279, -133, 223, -87, 201, 190, 133, -57, -60, -12, -58, 93, 82, -112, 7, -62, 204, 45, -94, 140]
7272A40m1j8J30k36k35N71k65n5m6L5j28J52Lj26K43k54J36L24m62K28j35m6k8
7295a13j6K05N6j44J81j65K41j29m95M21j96O4o6K79l33Q8J62J19k53l1K70j02
7317D3N4k66K12k0p5K99k14j50L07k10l0Q3J13L6l55L05Qj62l2J7K24j34J64k36
7341a9K41m23j71L82K3k27J72P6J83j77qr0J04k10oL96j92j34N9J72J02l33Q4
7364DN3k53j2K49O7o2l26K50q7p3J98K38k1j69J39j64j9P4k13O7J55o8K34k33
7388B8K9j44K39l06R1J72j15j55L40O9n13K13j29J28J23K35k89j52j10L49j86
7409h3k09J29J31mPL00k01j28j61K85o4o4l3P4r8L47j01k62M32k21N7r6k79L23
7433H1l86L95J74k57Q7K36m21J90l9K5L4j59K30R6j75Q9j81j77K41J57l48J10
$$ y = [140, 99, 81, 211, -25, -260, 311, 46, -9, -55, -20, -148, 4, 7, -119, 124, -130, 6, 330, -132, 96, -39, -85, -113, -129, 76, 132, -12, 169, 4, 245, 116, -379, 42, -154, -90, -156, 123, -210, -122, 40, 159, -94, -125, 145, 43, 97, -169, 43, 23, -52, 247, 33, -117, 190, -20, -50, 33, 146, 182, -173, 132, 140, -22, -54, -37, 187, 53, 217, -19, 222, -201, -372, 10, 33, -194, -22, 54, 237, 60, 52, -38, 66, -144, -150, 246, 54, -80, -21, 151, 253, -80, 4, 57, -196, -208, 41, 108, 46, -280, -30, -117, -190, 8, 246, 225, 56, 195, 31, 12, 86, -127, -60, 95, 27, 261, 28, 57, -87, 152, -154, -63, 109, -6, -161, 179, 248, -265, -52, -181, -53, 70, 305, 16, -136, -246, 103, -83, -292, -163, -32, -36, -29, 271, 70, -58, -219, 66, 2, -62, -95, -21, -119, 228, 127, -135, 297, 76, 133, 37, -242, 81, -305, 90, 264, 7, 94, 330, -91, 99, 60, 85, 119, -40, 190, 286, 111, 200, 19, -158, 83, 240, -108, 2]
7455Bj36M3K77l2l89L81NJ59j81K7m7O4j2M4k53L24l59o4K96l17K94P0J17m72
7479a59LJ0J47J02l15J92j42K23j27p9j14M34l59L94K7mj73j86J04O3J0j59lk54
7503c65M80j01Q0k21J64j5n9nj45L46k64L68n15K05J55K45k82J4j45J18J73Q4
7525C15l50J36o7j82J11L01j22j33j33j11K07L6J82k51p5J43o4j3j0j46j5M7p
7548b01O0j46K60o1R9J10k04J01k62M85l47j22nK23Q1k10J23k3l02M87o3k68K58
7571G3Om25L43n6PK76K09n24M7j02J20J29k49J21k48M55n00K55Q2j61M3J42K35
7594B78R1n65k31N62r0J46qp7l6j53Pj3j2K23m01M93J59m56L3J40j66L31N2n58
7618b51M34k01K27j74k95L29k40L72n01K56j19Q0j60L65l11J92j60K6K40j15J41
$$ y = [2, -134, -91, 186, 154, -235, 146, 151, 310, 129, 156, 109, 173, 161, 205, -48, 276, -83, -147, 149, -168, 126, 196, 313, -159, -156, -146, 1, 103, -212, -20, -162, 61, -66, -145, -259, 175, -184, 210, 237, 233, 60, -126, -22, 41, 51, -108, -111, -365, 115, 14, 94, -127, 37, 22, -37, -42, -187, 159, -105, 263, -252, -47, 108, 353, 71, 85, -60, 58, 231, 315, -35, 101, 34, -148, -37, 264, 142, 9, -124, -235, -28, 8, 190, -61, -136, 7, -57, -70, -80, -226, -241, -194, -201, -141, -287, -27, -88, 11, 121, -83, 18, -244, 241, -106, -228, -233, -10, 71, -139, -16, -39, -341, 146, 83, -185, 73, 79, -346, -3, -59, -52, 224, 433, -91, -44, -146, -26, 103, -146, -25, -273, 182, -318, -63, 19, -142, -99, 43, 278, 369, -196, -427, 135, 45, 191, 183, 106, 70, -83, -76, -89, -101, 122, -279, 214, 373, -83, -50, 90, -76, 255, 307, -251, 183, -18, 209, 35, -260, 69, -171, 201, -300, -44, -163, -83, -243, 122, -189, 3, -157, -131, 109, -6, 135]
7639A35j16Q2nk97K25Oj00j86J93J70k25L45j17L2q2n6kJ01j71J3M3K9J50m81
7663c14R1N77k63J56p5j02J89m50L20j72NN4j23J4L13N9J69o33L65j14j89j9P1
7686g1j05R9j86M10j72J35J8L6j76p0K19k03R8J7J07k47L00j30j47J98j46lK48
7709B29m47k8L7K06J93n72N12k21q5M3ON5J25k2L7k6k29l1K62K60k49J08p4j34
7733d5L0K54l73M22m36L23l41K75P8m6q2J37k51P4K5P4j93J7K91k27n5LL93m59
7757a12k42N15m4n2p5J65m36L02M9QM4n2J96m38K97j02K15k62k8m2L06j63j92
7780a43Lj50L26J58q9j53o5J67J1k16m1Q3n2P2o7L53j16k95R0q6J72K97k31j47
7804a19O9J13L2q2j02j98M45m16K06P5J7j87J56K16m22L19k38J95K3l51j69L56
$$ y = [135, 19, 101, 96, -201, 24, 30, -70, -256, -63, 107, -118, 227, 110, 142, 60, 4, 2, 103, -68, -55, -12, 17, 167, -314, -223, 354, 91, 247, 172, 70, 259, -191, 129, -43, -38, 16, -107, -93, 220, 279, 448, -185, 180, 66, -123, -142, -71, -176, -77, -263, 147, -25, 110, 128, 164, -12, -82, 137, -66, 32, 49, 156, -91, 209, 79, -68, 130, -16, -19, 229, -218, -246, -209, -3, 190, -382, 130, -91, -176, -133, -127, -72, 53, 31, 68, 42, -187, -218, 44, 304, 55, 163, 89, -45, -15, 239, -134, 288, -148, 175, -166, 109, 187, 141, 59, 196, -55, 19, 44, 118, -75, -58, 233, 6, -49, -46, 347, -112, -354, 161, 117, 65, -10, 155, -281, 21, 70, 78, 122, 70, 266, -172, 125, 23, 238, -24, -52, -94, 212, 49, -143, -140, -290, 36, 194, 105, -48, -113, 54, 65, -151, -192, -109, -161, -89, -156, 197, 81, -214, -124, -210, -38, 259, 28, -119, -50, 63, 95, 13, -89, -287, 158, -258, -52, 23, 40, -147, 9, 225, -197, 122, -116, 79, 102, -249, -418, -62]
7826f2J58l18J85L9R0l04k2Q6R9N0j96R6J38J8K5q0K10m17K41J20m95J90N6J22
7850B9M7q2j96K81k44K66n7j68J00J47k33M6K90l54J09K33k36P1nN6k66M40m18
7873a44R1L53o37N06n14L20m7K25J27j95pjj25j9j3J01j59L99j46k81N74m16N7
7896D9J50k82j20K64l02N9j45J03M48m03L74k48K45o8j63O8j41L97k48j0l64L55
7918A8l3k14M6J16j94K75j48J4j63L93k34o5M1J6J98k20L4Q2J46J74K7k99L41
7941C51o23N29k07l0m5J33L54o10J50j3r3M00o41R4M00m84O59j66l7j87j92L38
7963H0M13n22J45k76j01L81p7j88p9J18J70q9J22O2R2l14m70P07l3J70j50j09
7985E2J6j11j04N7nK28j17kj8K59j71l47M59m02J18l36M67J71j34J07n09M54l35
$$ y = [-62, 96, -222, -37, 2, 92, -212, -234, -148, -49, 1, -195, -99, 39, 57, 82, 2, 212, -205, 36, 156, -339, -149, -93, 29, 76, -6, -202, 79, -165, 101, 44, -124, -24, 123, -110, -64, 226, -128, -19, 214, -22, 49, 44, 100, -166, 274, -144, -53, 300, -337, 169, -345, -25, -72, 153, 280, 85, 78, 77, -48, -67, -80, 21, -138, 261, 115, -166, 408, -8, 49, 199, -83, -203, 61, -241, -182, -327, -224, 224, -179, 195, -53, 192, 124, -39, 29, -112, 285, 37, 27, -337, 18, -15, -229, -183, -67, -261, 14, -134, -120, -283, 110, -124, -189, -148, -132, 66, -154, -120, -38, 108, 282, 309, 10, 351, -272, 257, 50, 20, -25, 108, 462, -148, 2, -11, -104, 296, -345, -251, 149, -335, 324, 158, 121, -66, -258, 80, 493, -29, 116, -160, -261, 120, 43, -145, -224, -106, 64, -25, 97, 159, 251, -63, -533, 174, 141, 311, 161, 52, 68, -43, -147, -90, -95, 133, 16, 14, -4, 255, 84, -263, 196, -206, -88, -424, 43, 214, 80, 187, -322, 132, -203]
8008b03L65j76J3P9J3q2k4oj29P5l7J06O7l16K99M8j60J97p8J5j44K8K89j90J93
8033B42j33j26k29M79J0J5j96r7K06m5n6l35L36M8q4o0n4K88j69J32l9n35L73
8056b9r5L50j41J31m02L76k11K1K29k30J5j95K65q0j44R9K93m41L1P5n2J39j67
8079a63O6n4L8K56Ll62K54j28K23j6j36J43m76M75p3k80K5J55q8j75M00k20j9
8102a52K63k2kj65j30Q6L19J3j97k84L13j57L2K88n08K59Q3k7k16l3L01k20r3
8125b49K79J2k55M17k29N0k95K72o7M68Ok11j68j11N1j01J83P9l7K5k63J88j08
8148f4J18j32k28L98r2J1j33J99k7j28j26J93J94l08j33R3O6k1J26J38n17J9K51
8171a03RK36k32K46k86O15k39k59p8k23K64J0L62n03K97j40j4J13j24K60
$$ y = [-203, 162, -14, -1, 78, 91, 9, -15, -21, -150, -75, -112, -6, 61, -255, 44, 92, -68, 129, 51, 66, -78, -50, 239, 49, 242, 109, -17, -246, 233, 243, 258, 62, -35, 171, 126, 70, -265, 71, 119, 35, -25, -79, 209, 40, 172, 133, -402, -29, -124, 226, 85, 216, -186, 190, -21, 0, 229, -1, 14, -181, 84, 4, -140, -41, 252, -189, -158, -83, -135, 4, -163, -97, -151, -113, 143, 146, -216, 38, -90, 133, 117, -19, 124, -352, 123, 50, -230, -205, -50, -138, -313, 87, -133, -152, 111, 89, 87, -78, -208, -122, 197, 210, 13, -271, 42, -115, -83, 205, -303, -44, 39, 12, -204, -237, 64, -156, -249, 30, 42, -213, 204, -25, 25, -270, 2, -65, 403, 409, 198, 30, -81, -30, -131, 52, 131, 94, 119, -144, 44, -64, 54, -78, -306, 92, 0, 11, -122, 77, 50, -78, -204, -11, 183, -125, -258, -165, -99, -120, 6, 144, -373, -354, -103, -94, 142, -90, 156, -130, 485, 246, -13, -91, -314, -50, -40, 322, -181, 116, -24, -38, 75, -49, 211]
8191B11
$$ Imaginary data points
##PAGE= N=2
##DATA TABLE= (X++(I..I)), XYDATA
0@%%%%%%Qj6J6j6K4l2M0m8N6p2Q8j04J20j41J65j92K25k58K94l38L87m41N02n68
30c01O40p20Q07r02J008j125J250j386J542j713J897k100K323k571K849l159L506
47A845l903M359m885N504o242P142q269R725j1689J4500j8885K6721m4914J58020
61A29029Q0596l35111j0279P0275P8118J37845o398k66187p3160J83138J44444
72A32310k0217r7486j25390j4629J24451J41150k1597j67963r9050Q2962J17117
83E1658P1678k9402j75494r6636J60321J44058k6766p2287j23878p3909J88913
94A8256J80064j22690j67995j5517L7198J20300J20949j13125j99695R884J51334
105A8963R9698k1410j17787r5245K3785J19817J12146n0871j78498m7423J17742
$$ y = [0, 0, 0, 0, 0, 0, 0, 8, -8, 8, -8, 16, -16, 24, -24, 32, -40, 48, -56, 64, -77, 88, -104, 121, -137, 157, -181, 206, -235, 267, -301, 339, -381, 426, -476, 532, -593, 657, -729, 813, -900, 997, -1103, 1220, -1351, 1498, -1661, 1845, -2058, 2301, -2584, 2920, -3322, 3820, -4449, 5276, -6413, 8087, -10798, 15923, -28991, 129029, 209625, -125486, -135765, -65490, 12628, 150473, 144075, -122112, -195272, -12134, 132310, 112093, 14607, -110783, -125412, -961, 140189, 118592, -49371, -148421, -65459, 51658, 123336, 93934, -81560, -178196, -17875, 126183, 99417, 27130, -96748, -170657, 18256, 198320, 75630, -92365, -107882, -70684, 49616, 170565, 57440, -142255, -132371, 18963, 118661, 97251, -20536, -115781, -91996, 27821, 139967, 89096, -89402, -136825, -19083]
116a9083R2450L1814m9950j58527m7259J68483J20454n3566j11949r8084K4978
127a00239J70046Q1232j11112j30635l1212R0366J44537J2104j44363j03706L5972
138h7010J21876Q8872n6563j31229m1671N7115J05858O9654r2390j45482J8242
149i2728J06762N4504K1608p0835j42778J9664J65377N6408p4679r0620o0800
160a08117M8952J41019M5050j13129j21616N768J20891R2438l6472j08590p4454
171a08260L5218J35140O3061j00451j06165l360O0928R8843L5715j18934j04932
182a13197N1210R1300M8698j559j04367r6407P5020J29985J1307p2423q2733l4408
194i7574P9224J15728k510j17729q5463M4389J11234M7537m9125r1866n7499O2346
$$ y = [-19083, 73367, 105181, 55231, -103296, -150555, 17928, 138382, 84816, -27133, -125217, -100239, 69807, 151039, 39927, -90708, -121920, -31554, 112983, 125087, -19276, -122982, -87010, 34866, 123738, 67175, -64054, -105725, -48610, 57248, 126902, 34512, -110970, -92728, 14034, 68538, 90146, 19311, -123467, -103803, 61574, 117982, 43303, -47317, -108117, -59165, 81854, 126904, 13775, -107841, -102073, 18818, 111256, 74784, -33806, -108260, -73042, 62098, 125159, 24708, -81457, -84817, -23889, 74954, 110669, -8265, -113197, -61987, 29313, 78011, 76452, -27915, -124322, -49302, 80683, 91990, 19567, -63166, -97574, -18350, 97378, 94868, -22861, -108324, -63935, 47299, 94836, 45711, -46155, -103654, -41308]
206d1308J29848R457j11479o4594J4245O0263Q9353j192j24516o3147O8074Q0137
218D5141L3702l3406j01458m4815Q5729R6612m247q1041p6231P330R0960P3614
230I1890k9605j05201n7033O5855R8559J5798o0447q0284k9925Q3787J02264k8552
242F7106j00900m0232K5201O9812O9303l8721j12767k6172P5816P0005J1233n5924
254A3760q3050p838Q8263P3760k7870q9177m7452L8393P9105M3491m4504r7919
266f1038k6145Q4763P4888j2659o2923o4788k038R2564O9180n2310q7237k0915
278f8658M0109P0680L8832o0761r1963K167P9850N6793j2894o6688n9522J8141
290e3914Q6806M9693n1248q3420j7107N3520O5683K0443n9716q3483P337Q8099
$$ y = [-41308, 88540, 97997, -13482, -78076, -63831, -3568, 85785, 84593, -39923, -103070, -34996, 45141, 78843, 45437, -56021, -100836, -15107, 81505, 77258, -3783, -80014, -72684, 18276, 91890, 62285, -42916, -99949, -34094, 64465, 80263, 19816, -60468, -90393, -6606, 95658, 67106, -33794, -74026, -48825, 20987, 90290, 51569, -61198, -87370, -11554, 58451, 69684, 13760, -69290, -77128, 11135, 84895, 57025, -32152, -79604, -41211, 37894, 81385, 36881, -61038, -87183, -2420, 72468, 59809, -3114, -67902, -69940, 22624, 91804, 39494, -47743, -68658, -28549, 42131, 80963, 20202, -71761, -69594, 10256, 67049, 54155, -12533, -72055, -53914, 32892, 82585, 31337, -52083, -69190, -15670, 50013, 70456, 10740, -72743, -65406, 22693]
302B2693M8367l0794o2239m7245K3674Q9135L7632o6072p3024j953N3502O1141
314E4817R650o9248o9662K3668Q1586L7421l6166o3708l5080L5062Q0337K5132
326G3809o7936o8341R202N9241N0269j297o7850o2343L3204Q2418K4890m4337
338B0929n8217k5629M1703P6636J1092p2999n7462J9108N8938M3949j2122o9474
350b3548m9135M2113P6647J5095m9908n4778j4182M7973O8432K33p4683m8902
362f4643K8577N8333L4734k0517o8468l7688N0456P1332L585n3503m9638m691
374e2131N2348O1270j2175p4406l8310L5999N7675K5695k9933o4518k5668N5023
386i131O4448n753n6592m3124N506N4983N1260k1348p2381k9412M2736N5008J6867
$$ y = [22693, 71060, 40266, -21973, -69218, -45544, 43591, 81223, 15151, -57873, -59826, -6324, 54817, 64467, -4781, -74443, -50775, 30811, 68232, 32066, -31642, -66722, -31660, 48677, 73809, 5873, -62468, -53266, 5975, 56244, 54947, -12903, -75246, -42042, 40376, 65266, 20929, -37288, -62917, -21214, 55422, 66514, -6485, -63947, -44839, 14099, 58048, 45926, -23548, -72683, -30570, 46077, 61172, 11264, -43514, -57696, -9723, 58709, 58942, -15741, -64643, -36066, 22267, 57001, 36484, -31984, -69672, -19216, 52116, 55701, 2198, -47440, -52131, 217, 61487, 49312, -25094, -63404, -27405, 30270, 55965, 26032, -38486, -64154, -9131, 55317, 49564, -7028, -50152, -44646, 10337, 61597, 40249, -32132, -61544, -18808, 36200, 53067]
399E3067l6347o0776j4280N9074N7341j5481n8046l5968J4039N5867M2228l0259
411C0459o8930j9182M7686N1113P218m0502n5930l775O1781M9021k4163n7467
423b2671k7638K1424N4164L3022l7313o5438q065N1944M5115j378m3869m9852
435e0555N255O3850L9611l1889n5456j9769K8262N2398K3593m3303n9910N49N4598
448G234L8828r336m5030m2405J2802O3276L1734l8705n2619j1669L1811N0134
460C6055J5476m8436n4132J0908N4276L2124j4749m7281l5629K2435O0268K1608
472E2923m2178m8805m630L7439M4788N571m9434m8034J7727N6265K4448k2736
484B3344m3958k8844K6717O0197J3109m9176m2397M058L7040M2271j203n4802
$$ y = [53067, 16720, -44056, -58336, 738, 58079, 42598, -15448, -51416, -37377, 18490, 60718, 30459, -38471, -57653, -9967, 41146, 48364, 7862, -48068, -51843, 9938, 58959, 34796, -22671, -50309, -28885, 25279, 58301, 20988, -44450, -52515, -571, 44544, 43166, -703, -50555, -45300, 18550, 58161, 26272, -29184, -48953, -20691, 31707, 55300, 11997, -47913, -47364, 7234, 46062, 36726, -8304, -50709, -37907, 25369, 57103, 18398, -34221, -45890, -14079, 36055, 51531, 3095, -51037, -40129, 14147, 46271, 31522, -15759, -51388, -28953, 31315, 52923, 10745, -38060, -42690, -5251, 39537, 45108, -4326, -52360, -34633, 21632, 46080, 23344, -20614, -49458, -22741, 37456, 50565, 1389, -41008, -36950, 90, 42361, 41158, -13644]
496a3644l9292K6722N2895J8262k7490m5586j8268L4308N2562M704m9878l9548
508d4253J2256M1879L1062p551n0874l4652L2177N3235P501l1318l8520j5682
520d4740L7336N3089o334n2688k9090J4585M0979L2339j8248n4990k0724L7191
532a1295M6513N175l7414l8899j844M0465M1705j0386n3385k5693K7417L8309
544B0668J7993j7638m9829j9239M4601M2797p714l3429l2379k646M5356L9130
556D7671k2127m8701j7859K3447M2887J7475l2422m5493n033M0973M0879r307
568C2390m4961k6627J3340M0149L0283k3078n2435q985L6219L0286P613k5490
580H704m5874j080M9774K7796j7156l3198k5992J0784M7341K2802l1360m2582
$$ y = [-13644, -52936, -26214, 26681, 44943, 17453, -28133, -46401, -12093, 40469, 45173, -4705, -44253, -31997, 9882, 40944, 33393, -17481, -52133, -19956, 33279, 40780, 9462, -29058, -44740, -7404, 45685, 39351, -13337, -42427, -27842, 13137, 45476, 27228, -27762, -48486, -11295, 35218, 40393, 2979, -35920, -37764, 2701, 44406, 34020, -19365, -45058, -17641, 20668, 38661, 21023, -28806, -48045, -3444, 39353, 31639, -1790, -34169, -36815, 8541, 47671, 25544, -23157, -41016, -17569, 25318, 42793, 10371, -35122, -40155, 818, 41697, 32390, -12571, -39198, -25858, 14291, 44574, 21496, -30939, -39924, -3705, 26581, 34194, 8704, -37170, -38250, 11524, 39320, 22164, -11034, -37026, -26242, 21099, 43901, 12541, -30041]
592c0041q213L3198L9162N34l7257l4746M059M6168L2840k6430m4021j0220K0793
605a4174L7061K0057l6087m6522R473L7989K1001r01l2027l6951J6099M6814J3719
618C5551k2017l2608j8046K4094M2652O734l4594l6451K264M0638K9326j3782
630B3761l6428k6016J4657N0194J7218l9294l4485J988K2682L6341P054m7278
642i606l1722K3625L2910J4200q419l7621k2862K9077L7274L928k6124l1980m473
655c1793L2957L0567l835l4300l1606J4311M4438J5244k3520l1433j8693K4703
667a2960M9240j170m4438k2002Q266K7014L2894j0560m9061j3831K9188K7371
679A9951R936j9751l6834n158L2958K7582k225l1295k7726J0965L3768J7777r091
$$ y = [-30041, -38254, -5056, 34106, 34640, -2617, -37363, -33304, 12864, 45704, 19274, -24747, -34967, -14174, 22887, 42944, 6857, -39665, -30192, 7797, 28798, 27897, -4130, -41081, -24982, 21832, 35551, 13534, -19074, -37120, -13026, 29626, 36360, 1766, -34685, -32421, 8217, 37543, 23761, -12667, -38683, -24026, 26168, 43386, 4092, -30393, -28405, -5723, 30618, 37672, -9606, -41328, -17703, 15207, 29407, 20988, -16633, -39495, -10418, 26856, 30784, 4660, -27320, -31793, 1164, 31731, 27896, -6404, -38010, -23699, 20739, 35983, 12463, -18970, -37663, -12960, 36280, 35110, -9328, -31330, -23064, 3950, 36844, 26284, -22777, -36608, -7420, 19951, 29887, 10136, -26698, -31856, 1102, 28684, 26459, -4836, -32562, -21597, 12171, 29948, 20857]
692B0857l5638k4967K8076M1047j096k4667k6984j1516L4868M1304j7067m2077
704a7860j2537J3186L1283K4027k5611m2103n2K9598K5606K075l0454k8201R503
717b1540L0018K0883q790l6051j7330K3372K6548J0241j3305l8050j2288L9183
729B891K8795j0827k3384k5448j436M3268K6538k9448l3746n111J8151L3619R806
742C3668l4895l0426Q628K9777K3069r741l4457j4446J6082K6422J6486j8342
754A1825l6924j925K7217J9744M466j9731l5597L895M0881J5798j5331k3748k1911
767c1341J2562M3116R709l2490k7095k55K5242L0477n356l4966j9653J2569L1877
780A4396J7268k2130l0683k964J7818K5332J0442k8669l0587J0846K5824J3849
$$ y = [20857, -14781, -39748, -11672, 29375, 28279, 3612, -23372, -34888, -20, 41284, 24217, -17860, -30397, -17211, 14072, 38099, 12488, -29615, -29667, -69, 25537, 27612, -2842, -31043, -21540, 8478, 29361, 20571, -15480, -32810, -9438, 17110, 27351, 14046, -24004, -36292, 2891, 31686, 20859, -2525, -27973, -29409, 13859, 40397, 10949, -22797, -27908, -9757, 23862, 33668, -1227, -31653, -23025, 6752, 29821, 20080, -14377, -28823, -12741, 13681, 30167, 11825, -25099, -27024, 193, 19937, 24403, 4672, -30925, -27030, 13851, 29649, 14318, -9430, -31341, -18779, 24337, 34046, 1556, -25539, -25794, -552, 29925, 24569, -10397, -30050, -17481, 14396, 31664, 9534, -21149, -24113, -6295, 19037, 29479, 810, -29777, -18931, 6893, 20742]
792B0742M90k6491k8597J7883L6616M948j7349k4559j3613K3522L4917k703l0963
805e157k2891O630L1542K0280j5975l0318j2858J7230L3995O210k9949k2163M274
818a9150J8252K4681R97l5017j9596J9265K2077J0600o701l0552j6142K6107K8423
831B3244q13k1134k3859k126K9351K3986j0183k9958j7624J6002L1926P731k0575
844E968k4499p615K2909L0915n639l1510j3392P878K0597K1245j0413l4546p795
857b5897K1663K0024N945j4493k8945l011K7976K0925n796k4985j8996R451K8182
870A2043J4228j4275k9178j0586K4100K6805k363k1500k0457j639K8232K3942
882B9352j5748k8083o924J1161K2023J5115j9670k9675Q00K3359J7873k49k1573
$$ y = [20742, 21232, -5259, -33856, -15973, 20643, 25591, 8242, -16317, -29930, -6408, 28509, 25806, -5157, -28048, -21418, 10124, 30404, 14429, -15889, -28747, -11517, 22478, 28688, -1261, -23424, -19150, -898, 23783, 24780, -10237, -29833, -10568, 11509, 22109, 15408, -15144, -31286, -5179, 23244, 22431, 1297, -22562, -24688, 4663, 28649, 18466, -11492, -29116, -13114, 18812, 26543, 5968, -18531, -26146, -3237, 27678, 22039, -9471, -22863, -14985, 5612, 26857, 16444, -18102, -25897, -4234, 15790, 21735, 7242, -21703, -24714, 3262, 24187, 18391, -6594, -25590, -16139, 12043, 26271, 11996, -17182, -27768, -3668, 23137, 20774, -726, -21183, -22822, 5410, 29352, 13604, -14479, -21403, -10242, 11781, 26896, 7226, -22449, -21649, 1710, 19583, 19334, -2239]
895b239k1666N891K7085J6038j2764k6441j0155J7184K3122P240j8113k7548q00
908b3166K8842J8048r263k0301j6745N700L0156J4152k2032k3419j590J4902K2301
921A7585N343k3975k2484P060K3937J4088p882k2849j4071J1670K6173R554j9393
934D756k3977k91J9427J8258J330k1846k2916R269K8653R410j2951j9959j1976
947b2813J3557K8220L934k3902j9008L482J8374J8378k622k5100j6797J3196K4148
960A3047Q007j4315k1175o211J5969K3072K557k3721j8498P161J9796J3989n092
973A4586k3858j5205J6240K4792L107j6477j7836n382J8437K2731l479k4368j4021
986b0733R141J9815J2176r780k3229r923J7499K2407J289j8373j7247L3J8753
$$ y = [-2239, -23905, -18014, 9071, 25109, 12345, -14096, -24251, -7067, 16055, 23295, 5182, -22366, -23166, 5676, 23724, 14461, -5840, -22585, -16885, 13271, 27423, 5391, -18028, -19618, -4716, 17585, 22928, -1047, -23531, -16471, 7466, 21554, 13672, -9177, -23248, -11578, 14595, 24149, 4756, -19221, -19512, -85, 18173, 19503, -2343, -25259, -15990, 12663, 22073, 9122, -10837, -22813, -9256, 18964, 22898, -1004, -20012, -16530, 1844, 20222, 17600, -7500, -24297, -11101, 13047, 21054, 6739, -14436, -20647, -4678, 18394, 20951, -2770, -21268, -14107, 5689, 19678, 14586, -9272, -24477, -8237, 16555, 19662, 3185, -14651, -20033, -1596, 21135, 17656, -6712, -20733, -11592, 8223, 20399, 10619, -12610, -22533, -5034, 17373, 18662, 289, -16958, -16925, 1828]
999A828J9142n810k4776j1775J2847J9035Q876j1353k2517p017K0305K0238k975
1012A6048j8411j5051J998K0441J6669r810k3974q150J4499J8694N357j3625k0756
1025a6071l106K0757J8516o288j9480j2061N077K0047J4004j2451k3636m106J6271
1038b527J6709K856j5255j9156Q3K2450J4829r311j8692r661Q019K0022J0025
1051B0391j4511k2169j261J7679J5435l66j6482j7014L431K2608J2020j1221j8975
1064a0435o745J0155J9294P115j6499k0467J776J8558J3321k877j6981j5119P113
1077a1791K2074R281j3706j7770m817J2442J7885L869j7770j7564M385J8936J0927
1090A6381n217j7178j2792R357K1891N801j5328j6512j185J3214J6403J415j9089
$$ y = [1828, 20970, 15160, -9616, -21391, -8544, 10491, 19367, 8014, -14503, -21520, -1215, 19023, 16048, -2363, -17414, -15416, 5025, 21694, 11884, -12090, -20240, -5741, 12953, 18310, 4685, -16071, -19177, 1580, 20096, 13808, -5672, -17733, -12656, 7391, 21395, 8944, -14692, -18798, -2527, 14182, 17038, 1783, -17373, -17290, 5160, 19989, 10678, -8014, -17675, -9656, 10366, 20391, 5880, -16289, -17550, 129, 15564, 15198, -1284, -18298, -14867, 7741, 19761, 8540, -10435, -17180, -7025, 12269, 19384, 2885, -17582, -15806, 2752, 16073, 13196, -3785, -18904, -11791, 10283, 19564, 5858, -11912, -16729, -4287, 13598, 17467, -303, -17867, -13482, 5454, 16381, 11164, -6014, -18806, -9449, 12442, 18243, 2915, -13597, -14782, -1568, 14835, 16250, -2839]
1103b839j5531P394J8721Q646p900j7164r496J1847K0099K983j6257j4986J016
1116a3467J4552J4951k422j9025j3290R939J8630O098j0069j6206o830J2746J9681
1129A5288J08j7698j3006L937J4493J3317m823j9903r712J1797J7690L942j1906
1142C524j5822l319J4809J6658k112j8519j1331O772J5303R583o506j8775p722
1155a7457J3815J6647O82j2408j4047j600J6020J5718o088j8448q512P731J5527
1168G580Q573r676j8370m286J5050J5324j129j4717j2536K259J6076J2564p096
1181I616j9115o066J0946J3804N294r983j7610j933J6869J2846m190j3025j0982
1194a3529K557J7255J0739j0442j7058l771J0153J5073L381j3252j5174J028J6173
$$ y = [-2839, -18370, -10976, 7745, 16391, 8491, -8673, -18169, -6322, 13777, 16760, 503, -14483, -13467, 1085, 16036, 13614, -5411, -18701, -8762, 9868, 15966, 5897, -10309, -17139, -4393, 15288, 15396, -2302, -15308, -11371, 3122, 16439, 11616, -8287, -17999, -6202, 11488, 15430, 3524, -12298, -15617, -808, 15850, 13738, -4781, -16112, -9340, 5963, 15546, 9040, -9735, -17457, -3642, 13005, 13687, 1279, -12768, -14368, 1652, 17370, 11282, -7166, -15678, -7947, 7580, 16153, 6477, -11893, -16179, -1129, 14195, 13066, -1651, -14187, -11928, 4148, 16712, 9616, -9499, -15565, -4619, 9185, 14479, 4496, -13114, -15047, 1822, 14668, 10478, -2547, -13529, -10972, 6283, 17022, 6580, -10478, -14249, -4096, 10977, 14358, 1106, -14068, -13040, 3133]
1207C133J2511o689j5264p726O404J5325Q569j1953j7408J01J3186J0380J513
1220A2082j2206j4995L935J7674P858p767j2997q136P813J7078M668j3111j4101
1233a2205o01J3516J2907k580j4559j1007M920J7076Q333j1256j4244k666Q501
1246c865J4217M261j5357j4001N781J2823P806k034j4301j1196R714J5818L021
1259A2687r212j2874m163J1979J4287o43j3470j1905L166J5467R030p409j3354
1272f414p482P655J7561L263j4977j1604J914R986J2839q94j7645q684R378J1574
1286F470N358n696j5157n116J2310J2557J40j0924j1848J530J3119R513l310j3729
1300d783r774P940J5746L240r532j1608m584J1393J6245l299j5766p005M112J0858
$$ y = [3133, 15644, 8955, -6309, -14035, -7631, 7694, 16263, 4310, -13098, -12997, 189, 10569, 12082, -124, -15119, -11184, 6490, 14348, 6581, -6416, -14552, -6739, 10339, 15007, 1896, -12205, -12806, 710, 13617, 11037, -3522, -14529, -9609, 7467, 15800, 4544, -9700, -12366, -3865, 10352, 14613, -744, -14745, -8964, 3859, 11665, 9631, -4670, -15866, -6152, 9666, 12687, 3475, -9399, -13562, -1583, 12704, 12061, -1409, -13314, -10148, 5319, 14349, 6940, -6414, -13896, -6241, 11320, 14583, -394, -11998, -10084, -98, 12741, 11847, -5798, -14482, -5104, 6470, 11828, 6132, -9025, -14141, -1831, 10726, 10866, -58, -11906, -10376, 2743, 12256, 8946, -4783, -14557, -6617, 9129, 12369, 2837, -8771, -13355, -1962, 14283, 10984, -4782, -11787, -7675, 3183]
1314C183J1019o640j7706k410J0932R973K737r259j3196P15J2949Q872k045j3029
1328c905q550O310J2221N339n533j3633o552J2715J2983j527r779j0313j954J5307
1342C129J2408r037j3873l542N422J2979O476j1847j3976J841J1027R164o33j2542
1356c004r043N226J1226P114n116j3918m412J0580Q992K323o612j3855j296J4918
1370C123Q768n120r130r427K612J6730O533j1954j1055j792Q416J2734R47j3926
1384b541r280M343J1345P878n632j3170l540P049J0327M612r059j3066J951J0237
1398A454O550J291r395j3019M881J5425L172o291r001p185P091J5617M27j1662
1412f45r050M19J0701J0549m110j3830n210N914J2111M999r992j0927P59P171
$$ y = [3183, 14202, 7562, -10144, -12554, -1622, 8351, 11088, 1829, -11367, -10652, 2297, 11169, 9124, -3905, -12455, -6145, 6076, 11415, 5882, -7751, -14303, -1588, 11395, 9868, 89, -10224, -12178, 3129, 15537, 6500, -7373, -10915, -5493, 7486, 13962, 2115, -11861, -10020, 1007, 10171, 9538, -3004, -12047, -6821, 4405, 11519, 6403, -7515, -11927, -1347, 7645, 9968, 3356, -10499, -11795, 3123, 11891, 6771, -2359, -11786, -9174, 7556, 14089, 2135, -8920, -10712, -2296, 10438, 11385, -2541, -11821, -7478, 3867, 11745, 6113, -7057, -10597, -3548, 6779, 11391, 2332, -10734, -8783, 1454, 8004, 9295, -100, -13119, -8238, 7187, 10359, 4068, -4933, -12118, -5027, 10590, 11017, -645, -9695, -9276, 1425, 11974, 7864, -5966, -11176, -5262, 6849, 11848, 1856, -9071, -8312, -1141]
1426a141R498K085j2580r403O247Q868M763q90j1934q288R473J2100Q5o520r921
1441g558l684J1381J1692m154j1252p297L904J3007N518p825j1377k746P511J2729
1455I849O7j2113o952K944P373Q881j908j4112n109Q639P490L551l992j2157l276
1470a0825J1485Q732j861q307r084J573J1904P134n588j0339n939P709J2106O36
1484I336q635q871j317R874J1076n233j1291l812L855Q723P327o548j3038k01
1498h755Q728O454K004p392j0625J873J0855O193l859r316o405N615J0966L810
1512A0146p225j1180j773J0581R052k890q360p296J234J2262P190q683r733j326
1526h001N193Q916M211r806j0069K713Q886O240j344r816p168M825R869M657n680
$$ y = [-1141, 8357, 10442, -2138, -11541, -5294, 3574, 8337, 7447, -4487, -12775, -3302, 8798, 8883, 2363, -7558, -11242, 139, 11831, 7677, -3575, -10872, -6968, 6039, 11557, 3732, -7645, -10391, -2880, 9849, 9916, -2197, -9149, -6205, 1168, 10049, 8141, -5971, -11080, -2441, 5049, 8600, 4608, -7549, -10825, 660, 9392, 7531, -776, -9860, -8287, 3617, 10751, 5163, -5176, -11115, -3406, 8700, 9336, 701, -8170, -9487, 387, 11463, 6230, -5061, -8873, -5018, 3705, 11032, 4484, -8554, -8755, -27, 6427, 8431, 1039, -9586, -7713, 3142, 9335, 5476, -3840, -10245, -4630, 6336, 10146, 2921, -8259, -10032, 549, 9601, 6711, -1649, -8945, -7711, 4551, 11741, 3058, -6675, -8001, -2808, 6108, 10319, 513, -9556, -6843, 2043, 8283, 6939, -2877, -10045, -5220, 4649, 9306, 3626]
1541C626j0111k501Q193P937J093q016r636J898J1622M808m564p809n878M299
1555e039J2526K215r517p570M46O482Q660n3j0777o728M537Q826M332m200r404
1570e264l619O243R239K143q331q773J502Q347O255j050r242p689O061J0580J299
1585G701n779p109l927P483J0452j003j0257n505K154P831O422l264j0221m037
1599i059O202Q773J961o560p876r45P507Q190q88j0056n915M362P501M721l111
1614D807j0501l752P993Q941o97o696o946m76Q743P640l830r205l708M325P739
1629D377L668n261r011j963P820P697p45q098n609J730P420O832m016r626l349
1644h134N980P222K175n331r089n72R242O240k921o785n327K051Q879N017o027
$$ y = [3626, -6485, -8986, -793, 7144, 8237, 221, -9415, -7517, 4105, 8913, 4349, -3460, -9338, -5039, 7487, 9702, 185, -7385, -6939, -457, 8203, 8150, -2627, -9355, -4818, 4008, 8340, 4140, -5264, -8883, -2640, 6599, 8742, 411, -8362, -6860, 1487, 7742, 6692, -2550, -10239, -4178, 6402, 7701, 1922, -5187, -9114, -1631, 8821, 7818, -2439, -7944, -5790, 2041, 8463, 5199, -5022, -9059, -2857, 5916, 7877, 1317, -6559, -7504, 3, 8193, 7305, -2751, -8666, -4304, 3197, 7918, 4807, -5694, -9446, -1453, 7488, 6791, 95, -6851, -7327, 1416, 9056, 5226, -3979, -7687, -3362, 4377, 8045, 2784, -6227, -8190, -370, 7327, 6582, -1516, -7125, -5395, 2025, 8857, 4841, -4785, -8134, -2154, 5068, 7243, 1912, -7177, -7749, 1493, 7733, 4812, -1973, -7300, -5249, 3630, 8647, 2620]
$$ [...]
8191B0
##END NTUPLES=NMR FID
##END=
