##TITLE=1H_DE-73-9
 D2O
 8 sc, 
 7.11.2024
##JCAMPDX= 6.0         $$ Bruker NMR JCAMP-DX V2.0
##DATA TYPE= NMR FID
##DATA CLASS= NTUPLES
##ORIGIN= UXNMR, Bruker Analytische Messtechnik GmbH
##OWNER= root
$$ XWIN-NMR		Version 3.5
$$ Thu Nov  7 13:58:16 2024 Russian Standard Time (UT+4h)  she@DPX200
##.OBSERVE FREQUENCY= 200.1318
##.OBSERVE NUCLEUS= ^1H
##.DELAY= (6, 6)
##.ACQUISITION MODE= SIMULTANEOUS
##.ACQUISITION SCHEME= undefined
##.AVERAGES= 8
##.DIGITISER RES= 18
##SPECTROMETER/DATA SYSTEM= spect
##.PULSE SEQUENCE= zg30
##.SOLVENT NAME= D2O
##.SHIFT REFERENCE= (INTERNAL, D2O, 0, 15.7039)
##AUDIT TRAIL= $$ (NUMBER, WHEN, WHO, WHERE, WHAT)
$$ ##TITLE= Audit trail, XWIN-NMR		Version 3.5
$$ ##JCAMPDX= 5.01
$$ ##ORIGIN= Bruker BioSpin GmbH
$$ ##OWNER= she
$$ F:/spectra/data/she/nmr/H-F/1/audita.txt
$$ ##AUDIT TRAIL=  $$ (NUMBER, WHEN, WHO, WHERE, WHAT)
(   1,<2024-11-07 13:56:56.29 +0400>,<she>,<DPX200>,
      <created by zg, POWCHK disabled, PULCHK disabled
       configuration hash MD5:
       00 E9 B6 7A A2 85 ED C7 34 08 36 98 17 FE 4E 26
       data hash MD5: 16K
       77 68 81 2B AF C8 E8 F9 CE 17 39 D8 A8 5F 62 D7>)
$$ ##END=
$$ 
$$ hash MD5
$$ 0A E9 32 1D 95 2D A3 49 14 D6 B6 60 E6 3D 92 2C
##$RELAX= 
##$RELAX= 
##$RELAX= 
##$RELAX= 
##$RELAX= 
##$RELAX= 
$$ Bruker specific parameters
$$ --------------------------
##$DU= <F:/spectra>
##$EXPNO= 1
##$NAME= <H-F>
##$PROCNO= 1
##$TYPE= <nmr>
##$USER= <she>
##$AMP= (0..31)
100 100 100 100 100 100 100 100 100 100 100 100 100 100 100 100 100 100 
100 100 100 100 100 100 100 100 100 100 100 100 100 100 
##$AQSEQ= 0
##$AQ_mod= 1
##$AUNM= <au_zg>
##$AUTOPOS= <>
##$BF1= 200.13
##$BF2= 200.13
##$BF3= 200.13
##$BF4= 200.13
##$BF5= 200.13
##$BF6= 200.13
##$BF7= 200.13
##$BF8= 200.13
##$BYTORDA= 1
##$CFDGTYP= 0
##$CFRGTYP= 5
##$CHEMSTR= <none>
##$CNST= (0..31)
1 1 145 1 1 1 1 1 1 1 1 1 1 1 1 1 1 1 1 1 1 1 1 1 1 1 1 1 1 1 1 1 
##$CPDPRG= <>
##$CPDPRG1= <>
##$CPDPRG2= <>
##$CPDPRG3= <>
##$CPDPRG4= <mlev>
##$CPDPRG5= <mlev>
##$CPDPRG6= <mlev>
##$CPDPRG7= <mlev>
##$CPDPRG8= <mlev>
##$CPDPRGB= <>
##$CPDPRGT= <>
##$D= (0..31)
0 1.2 0 0 0 0 0 0 0 0.06 0 0.03 0 0 0 0 0.0002 0 0 0 0 0 0 0 0 0 0 0 0 
0 0 0 
##$DATE= 1730973415
##$DBL= (0..7)
120 120 120 120 120 120 120 120 
##$DBP= (0..7)
150 150 150 150 150 150 150 150 
##$DBP07= 0
##$DBPNAM0= <>
##$DBPNAM1= <>
##$DBPNAM2= <>
##$DBPNAM3= <>
##$DBPNAM4= <>
##$DBPNAM5= <>
##$DBPNAM6= <>
##$DBPNAM7= <>
##$DBPOAL= (0..7)
0.5 0.5 0.5 0.5 0.5 0.5 0.5 0.5 
##$DBPOFFS= (0..7)
0 0 0 0 0 0 0 0 
##$DE= 6
##$DECBNUC= <off>
##$DECIM= 24
##$DECNUC= <off>
##$DECSTAT= 4
##$DIGMOD= 1
##$DIGTYP= 9
##$DL= (0..7)
0 120 120 120 120 120 120 120 
##$DP= (0..7)
150 150 150 150 150 150 150 150 
##$DP07= 0
##$DPNAME0= <>
##$DPNAME1= <>
##$DPNAME2= <>
##$DPNAME3= <>
##$DPNAME4= <>
##$DPNAME5= <>
##$DPNAME6= <>
##$DPNAME7= <>
##$DPOAL= (0..7)
0.5 0.5 0.5 0.5 0.5 0.5 0.5 0.5 
##$DPOFFS= (0..7)
0 0 0 0 0 0 0 0 
##$DQDMODE= 0
##$DR= 18
##$DS= 0
##$DSLIST= <SSSSSSSSSSSSSSS>
##$DSPFIRM= 0
$$ [...]
##$SUBNAM2= <"">
##$SUBNAM3= <"">
##$SUBNAM4= <"">
##$SUBNAM5= <"">
##$SUBNAM6= <"">
##$SUBNAM7= <"">
##$SUBNAM8= <"">
##$SUBNAM9= <"">
##$SW= 24.0689170037331
##$SWIBOX= (0..15)
0 0 2 0 0 0 0 0 0 0 0 0 0 0 0 0 
##$SW_h= 4816.95568400771
##$TD= 16384
##$TD0= 1
##$TE= 0
##$TE2= 300
##$TE3= 300
##$TEG= 300
##$TL= (0..7)
0 120 120 120 120 120 120 120 
##$TP= (0..7)
150 150 150 150 150 150 150 150 
##$TP07= 0
##$TPNAME0= <>
##$TPNAME1= <>
##$TPNAME2= <>
##$TPNAME3= <>
##$TPNAME4= <>
##$TPNAME5= <>
##$TPNAME6= <>
##$TPNAME7= <>
##$TPOAL= (0..7)
0.5 0.5 0.5 0.5 0.5 0.5 0.5 0.5 
##$TPOFFS= (0..7)
0 0 0 0 0 0 0 0 
##$TUNHIN= 0
##$TUNHOUT= 0
##$TUNXOUT= 0
##$USERA1= <user>
##$USERA2= <user>
##$USERA3= <user>
##$USERA4= <user>
##$USERA5= <user>
##$V9= 5
##$VALIST= <valist>
##$VCLIST= <CCCCCCCCCCCCCCC>
##$VD= 0
##$VDLIST= <DDDDDDDDDDDDDDD>
##$VPLIST= <PPPPPPPPPPPPPPP>
##$VTLIST= <TTTTTTTTTTTTTTT>
##$WBST= 1024
##$WBSW= 4
##$XGAIN= (0..3)
0 0 0 0 
##$XL= 0
##$YL= 0
##$YMAX_a= 123053
##$YMIN_a= -117137
##$ZGOPTNS= <>
##$ZL1= 120
##$ZL2= 120
##$ZL3= 120
##$ZL4= 120
##$ABSF1= 10
##$ABSF2= 0
##$ABSG= 5
##$ABSL= 3
##$ALPHA= 0
##$AQORDER= 0
##$ASSFAC= 0
##$ASSFACI= 0
##$ASSFACX= 0
##$ASSWID= 0
##$AUNMP= <proc_1d>
##$AZFE= 0.1
##$AZFW= 0.1
##$BCFW= 1
##$BC_mod= 2
##$BYTORDP= 1
##$COROFFS= 0
##$CY= 11.3945322036743
##$DATMOD= 1
##$DC= 2
##$DFILT= <>
##$DTYPP= 0
##$F1P= 15.6554695791079
##$F2P= 12.8336369535428
##$FCOR= 0.5
##$FTSIZE= 0
##$FT_mod= 4
##$GAMMA= 1
##$GB= 0.15
##$INTBC= 1
##$INTSCL= 1
##$ISEN= 128
##$LB= 0.24
##$LEV0= 0
##$LPBIN= 0
##$MAXI= 10000
##$MC2= 0
##$MEAN= 0
##$ME_mod= 0
##$MI= 1.114404
##$NCOEF= 0
##$NC_proc= 0
##$NLEV= 6
##$NOISF1= 3.799351
##$NOISF2= 2.8
##$NSP= 1
##$NTH_PI= 0
##$NZP= 0
##$OFFSET= 15.70392
##$PC= 1
##$PHC0= -26714.91
##$PHC1= 16.78744
##$PH_mod= 1
##$PKNL= yes
##$PPARMOD= 0
##$PSCAL= 0
##$PSIGN= 0
##$REVERSE= no
##$SF= 200.130013532006
##$SI= 16384
##$SIGF1= 3
##$SIGF2= 2
##$SINO= 400
##$SIOLD= 16384
##$SREGLST= <1H.CDCl3>
##$SSB= 0
##$STSI= 0
##$STSR= 0
##$SW_p= 3612.71676300578
##$SYMM= 0
##$S_DEV= 0
##$TDeff= 0
##$TDoff= 0
##$TI= <>
##$TILT= no
##$TM1= 0
##$TM2= 0
##$TOPLEV= 0
##$USERP1= <user>
##$USERP2= <user>
##$USERP3= <user>
##$USERP4= <user>
##$USERP5= <user>
##$WDW= 1
##$XDIM= 8192
##$YMAX_p= 0
##$YMIN_p= 0
$$ End of Bruker specific parameters
$$ ---------------------------------
##NTUPLES= NMR FID
##VAR_NAME=  TIME,          FID/REAL,        FID/IMAG
##SYMBOL=    X,             R,               I
##VAR_TYPE=  INDEPENDENT,   DEPENDENT,       DEPENDENT
##VAR_FORM=  AFFN,          ASDF,            ASDF
##VAR_DIM=   8192,          8192,            8192
##UNITS=     SECONDS,       ARBITRARY UNITS, ARBITRARY UNITS
##FACTOR=    0.0002076,     1,               1
##FIRST=     0,             0,               0
##LAST=      1.7004516,     0,               0
##MIN=       0,             -117137,         0
##MAX=       1.7004516,     123053,          0
$$ Real data points
##PAGE= N=1
##DATA TABLE= (X++(R..R)), XYDATA
$$ [...]
2595a758L507R02j024l330j608K343L841o1l046k145j77K842L269r42l825k159
$$ -1758 1749 2651 1627 -1703 -3311 -968 2873 2812 -234 -2379 -2556 286 3555 2613 -1212 -3371
2611c371J730L548R91j727l395j397L098L628k53l490k458J150K768K280j022
$$ -3371 -1641 1907 2898 1171 -2224 -3621 -523 3105 2852 -638 -3096 -1946 822 3102 2080
2626B080m116j329K661K983J46j726l024o29L376L075j517l081j576O83L250K178
$$ 2080 -2036 -3365 -704 2279 2425 699 -2325 -2954 422 3497 1980 -1101 -2677 -1994 1256 3434
2642C434k172l597o59K605L174P6k924k814K38L415K710j809l552j012J982K304
$$ 3434 1262 -2335 -2994 -389 2785 2861 -63 -2877 -2639 776 3486 1677 -1875 -2887 -905 1399
2658A399J698k117l700k35L701J914r67j934k425J38L809J834k045k519j469J660
$$ 1399 3097 980 -2720 -2955 746 2660 1693 -241 -2666 -2528 1281 3115 1070 -1449 -2918 -1258
2674a258L290J193k677l413J11L277K341o37l332k136J606L363J756k306l794
$$ -1258 2032 3225 548 -2865 -2754 523 2864 2227 -1105 -3241 -1635 1728 3484 1178 -2616
2689b616j24K835K139Q04l051l211J398L411Q99p41k737j966J672L533Q83k651
$$ -2616 -2740 95 2234 3038 -13 -3224 -1826 1585 2484 1743 -994 -2960 -1288 2245 3128 477
2705D77k710j95K453K965m29l105k341R47L256J726k185k751q94J754L659L60
$$ 477 -2233 -2428 25 2990 2561 -544 -2885 -1938 1318 3044 859 -1892 -2786 -1032 2627 2987
2721B987l588k667J382K455J599k27l167k585K909K741O70j589k915q62K741K821
$$ 2987 -601 -3268 -1886 569 2168 1941 -1226 -3811 -902 1839 2509 920 -1995 -2857 -116 2705
2737B705m53k746k497R41L343J754j479l055j608K231L090M58k493k379l72K326
$$ 2705 2252 -494 -2991 -2050 1293 3047 1568 -1487 -3095 -864 2226 2684 191 -2188 -2560 -234
2753b34L322n96m134j409J842K639J380j276l753q04K980K504L9k536k312R6L114
$$ -234 3088 2492 -1642 -3051 -1209 1430 2810 1534 -2219 -3023 -43 2461 2500 -36 -2348 -2252 862
2770H62J932j092l024j912K033L322K91j663l142o56K891L259j000l071j479N10
$$ 862 2794 1702 -1322 -3234 -1201 2121 2412 749 -2393 -3049 -158 3101 2101 -970 -2449 -1939
2786a939K885K488k092l551j03J671K372J162k648l297J057K656J946p01k877
$$ -1939 946 3434 1342 -2209 -2312 -641 1731 2893 245 -3052 -1995 661 2607 1906 -971
2801i71j835J298K917J375j671l191m68K444K526k24k103k674j62M023J800k163
$$ -971 -2806 -1508 1409 2784 1113 -2078 -2546 -102 2424 2200 97 -2577 -2739 1284 3084 921
2817I21k293j177J161L353J018k808k599M70K012K297J87l531j740J388K797J554
$$ 921 -1372 -2549 -1388 1965 2983 175 -2424 -1954 58 2355 2542 -989 -2729 -1341 1456 3010
2833C010k178k845o30J989K631P57k805k550Q18K449J788q98k147k424J762L216
$$ 3010 832 -2013 -2643 -654 1977 2734 -71 -2621 -1803 646 2434 1536 -611 -3035 -1273 1943
2849A943L83j979k329l90J893L175l51l494j227P40K533J653j170l089r59J884
$$ 1943 2326 347 -1982 -2372 -479 2696 2345 -1149 -2376 -1636 897 2550 1380 -1709 -2668 -784
2865g84K811O44k652k599N67K202K232j36l302j913J723K562P51j024k414j675
$$ -784 2027 2671 19 -2580 -2013 189 2421 2285 -1017 -2930 -1207 1355 2106 1082 -1332 -3007
2881c007K659K626l48k256j944K23K578K127r67l082j300J616K832Q43k208k472
$$ -3007 -348 2278 1930 -326 -2270 -2047 531 2658 1691 -1391 -2691 -1075 1757 2600 392 -2080
2897b080k27J940K734l06l168j181Q77K485J593j092l437j183K927J893J65j300
$$ -2080 -2307 -367 2367 2061 -1107 -2288 -1411 1074 2667 1575 -1862 -3045 -118 1775 1940 640
2913F40k995Q0K903K273j376k643j461J559K599J277j871k866n64K307K186q9
$$ 640 -2355 -2275 628 2901 1525 -1118 -2579 -1020 1579 2856 985 -1881 -2445 -138 2048 1959
2929A959k270j976K07L105J879j863k544j121J976J878J259j751k986L61K249
$$ 1959 -311 -2287 -2080 1025 2904 1041 -1503 -2624 -648 1230 2489 738 -2248 -1887 362
2944C62J382P1k223k181Q57K433J921j849k338q05J625K727M16k346k386M21K869
$$ 362 1744 1815 -408 -2589 -1732 701 2622 773 -1565 -2370 -745 1982 2398 52 -2334 -1913 956
2961I56J576j266k217j129O32L009J033k317k080o19K277K226L57k671k266J044
$$ 956 2532 1266 -951 -2080 -1448 1561 2594 277 -1803 -2422 -145 2081 2438 -233 -2499 -1455
2977a455K348J442j161k317j430J867K501P87k196k555K17K385J615k72k190k215
$$ -1455 893 2335 1174 -1143 -2573 -706 1795 2582 386 -2169 -1952 433 2048 1776 -414 -2629
2993b629J341K756J047j740k369j030K383K349O43l295j477L80K148K080j012
$$ -2629 -1288 1468 2515 775 -1594 -2624 -241 2108 2751 -544 -2021 -1641 507 2587 1575
3008A575k546j539J590K608N92k115k197o8J938K180J13k561k010J203K402P85
$$ 1575 -971 -2510 -920 1688 2280 165 -2032 -2100 -162 2018 2131 -430 -2440 -1237 1165 1950
3024A950n73k730j146K188J946L87k121j918o6K273K033r07k270j661J722K311
$$ 1950 1377 -1353 -2499 -311 1635 2022 -99 -2017 -2083 190 2223 1316 -954 -2615 -893 1418
3040A418P81j332k531n21K097K320n84j823j802J16K696J806j415k812p27J386
$$ 1418 2199 867 -1664 -2185 -88 2232 1648 -175 -1977 -1861 835 2641 1226 -1586 -2313 -927
3056i27K395O48j649k583jK299J889n99j991j246J99K794J111j402k464q07K232
$$ -927 1468 2116 467 -2116 -2117 182 2071 1472 -519 -1765 -1566 1228 2339 937 -1527 -2334 -102
3073a02J992j75j726k293N61K275J947j401k354j138J187K705P82j854k498l0
$$ -102 1890 1715 -11 -2304 -1743 532 2479 1078 -1276 -2414 -1227 1478 2260 406 -2092 -2122
3089b122K702J338l13k113j766N58K503J484j002k442r83J632K125Q45k289k170
$$ -2122 580 1918 1605 -508 -2274 -1716 787 2271 1269 -1173 -2156 -524 1601 2446 157 -2013
3105b013M44J955J280j41k112j720J327K123R81j291k301m22J616K054J5k092
$$ -2013 -1569 386 1666 1525 -587 -2307 -980 1143 2124 833 -1468 -1890 -274 1780 1795 -297
3121b97j892M21K306J084l15k181j365J260K670K52j671k363M04J518K187l77
$$ -297 -2189 -1768 538 1622 1307 -874 -2239 -979 1691 1943 272 -2091 -1687 -169 2018 1641
3137A641k065j849J078K160Q94p67k422j068J522K796q5k047j830M83J846J840
$$ 1641 -424 -2273 -1195 965 1859 1092 -1330 -2398 -876 1920 1835 -212 -2042 -1559 287 2127
3153B127m82l063n65J183J653J198j595j995m98K002J825m4k345j309M79K115
$$ 2127 1645 -1418 -1983 -800 853 2051 456 -1539 -2037 -35 1790 1746 -599 -1908 -1429 686
3169F86J465r19k978j95J194K186R1j279j849K9J602J907o24k171j006R00J695
$$ 686 2151 1232 -1746 -1941 -747 1439 1530 251 -1598 -1569 33 1940 1316 -855 -1861 -961 734
3186G34J584j379k398p50K088J796Lj453k173N15K043J577r40k169r87Q15K556
$$ 734 2318 939 -1459 -2209 -121 1675 1678 225 -1948 -1433 610 2187 1247 -922 -1909 -1094 1462
3203A462N24j044k696j68K176J422n02j455j629L99K460J118j329k310k86J079
$$ 1462 1986 942 -1754 -1922 254 1676 1174 -281 -1910 -1511 949 2067 738 -1572 -1858 -779
3219g79K604j7j520k339M76K103J233l26k045j277Q48K231J003j570j886n54J607
$$ -779 1825 1808 288 -2051 -1575 528 1761 1435 -610 -1887 -1039 1192 2195 625 -1261 -1815 -208
3236b08J593n9j603j755N00K226R32m82k005j316J147K758M56j895k203J83J788
$$ -208 1385 1326 -277 -2032 -1532 694 1626 1144 -861 -2177 -1030 1728 2184 289 -1914 -1731 57
3253E7J676l65k040j085O13K160R29r56k183o63J302K226O06k256j752N25J592
$$ 57 1733 1368 -672 -1757 -1144 1016 1945 989 -1194 -1857 -555 1671 2277 21 -1731 -1206 386
3270C86J350o92j555j413Q56K427L23j094j753q01J660K196q1k628r21L78K193
$$ 386 1736 1044 -511 -1924 -1068 1359 1682 588 -1165 -1966 -306 1890 1809 -819 -1740 -1362 831
3287H31J432j141k206r32J274K060O21j663k331N05J961J288k52k337j024J347
$$ 831 2263 1122 -1084 -2016 -742 1318 1939 276 -2055 -1550 411 1699 1447 -890 -1914 -567
3303e67J702N56p12k338o23J742J991k60j551j640O3K085J507o07j998j234J068
$$ -567 1135 1691 979 -1359 -1982 -240 1751 1491 -60 -1700 -1637 448 1955 1348 -650 -1884 -816
3320h16J837Q54j181k317j55J873J760n12j828j581O51K255R56p62k295n80J519
$$ -816 1021 1875 694 -1623 -1778 95 1855 1343 -485 -2066 -1415 840 1796 1034 -1261 -1841 -322
3337c22J512K16j006k018m68K611J023m91j495j383M31K752M73j292k008k71J673
$$ -322 1190 1406 400 -1618 -2086 525 1548 1057 -438 -1821 -1390 1362 1835 543 -1465 -1736 -63
3354f3J863j20j800j893N43K094J459j069k151o45Q90J759J383j939k630R85J587
$$ -63 1800 1680 -120 -2013 -1470 624 2083 1014 -1137 -1782 -892 867 2250 311 -2319 -1334 253
3371B53J171k60j416j903J230K086L38j073j466p30Q94K565q6j724j720K59K166
$$ 253 1424 1164 -252 -2155 -925 1161 1499 426 -1040 -1770 -876 1689 1603 -121 -1841 -1582 584
3388E84J479j255j885p05J008K030O25j657j916J81J569J599J33k402j231J032
$$ 584 2063 808 -1077 -1782 -774 1256 1881 224 -1692 -1511 58 1657 1790 -612 -1843 -811
3404h11J552Q95p25j637r00J248J662K56j128j769j29J814J139k63j782j323Q20
$$ -811 741 1636 911 -726 -1626 -378 1284 1540 412 -1357 -1486 328 1467 1204 -578 -1901 -1081
3421a081K341R44j873j341n04R45K147j16j787j188O47J334J313p32j906q21J167
$$ -1081 1260 2204 331 -1010 -1514 -569 1578 1462 -325 -1513 -866 468 1781 1049 -857 -1678 -511
3438e11J869L40j113k094l45J826J312K52k006j381P12K150N74o44j963j130J738
$$ -511 1358 1698 585 -1509 -1854 -28 1284 1536 -470 -1851 -1139 1011 1585 941 -1022 -2152 -414
3455d14K095k35j415j276m71K049J814j163j857p59N97K056J070k047j479N8J229
$$ -414 1681 1446 31 -1245 -1716 333 2147 984 -873 -1632 -1035 1021 2091 44 -1435 -1377 -148
3472a48J748n12j454j251M36J623Q88k61k236q42J672J653N96j555j826n60K345
$$ -148 1600 1088 -366 -1617 -1181 442 1330 1069 -1167 -2009 -337 1316 1912 357 -1469 -2029 316
3489C16J468p88j379j290M62K431N32j369j786o1J101J595K53j593j702M29J982
$$ 316 1784 996 -383 -1673 -1211 1220 1752 383 -1403 -1464 -363 1232 1485 -108 -1810 -1381 601
3506F01J105n32k085p69J188J524R28j568j999J44J418J152J38j551j544N79K146
$$ 601 1706 1174 -911 -1680 -492 1032 1960 392 -1607 -1463 -45 1107 1245 -306 -1850 -1271 875
3523H75P72o43j888p79J065K089M29k008j556J17J861J464o14j798r15Q40J920
$$ 875 1647 1004 -884 -1663 -598 1491 1920 -88 -1644 -1527 334 1798 1184 -614 -1529 -689 1231
3540A231J61r74j677P0J048J552J86j890j431N63J605J226o10j714j036J175J920
$$ 1231 1392 418 -1259 -1189 -141 1411 1597 -293 -1724 -1161 444 1670 1060 -654 -1690 -515 1405
3557A405J31j276j229o23J529J665k76k017r77R97J516P14r36j619l94Q85J753
$$ 1405 1536 260 -969 -1592 -63 1602 1326 -691 -1668 -671 845 1559 623 -996 -1390 -505 1248
3574A248r6j240j266K89J158J746m48k201p56R99J146J040r58j891k06J545J700
$$ 1248 1152 -88 -1354 -1065 93 1839 1391 -810 -1566 -567 579 1619 661 -1230 -1436 109 1809
3591A809o16j432j464M42J699J195p57j719r82J161J785L86j369j626J82J308
$$ 1809 1193 -239 -1703 -1261 438 1633 876 -843 -1825 -664 1121 1507 138 -1488 -1306 2
3607BJ781n69j820j124O99J856Q97p94k339p9J234J497K07j505j093l65J781J466
$$ 2 1783 1214 -606 -1730 -1031 825 1722 928 -1411 -1490 -256 1241 1448 -57 -1150 -1515 266 1732
3625A732p61j621r90J031J560Q69j595j442n59J973J158m89j096j367L33J929
$$ 1732 971 -650 -1640 -609 951 1820 225 -1217 -1776 197 1355 866 -230 -1597 -1264 665
3641F65J105r95j866l4O34J504M09j212j980O34J351J093l66j440j134O61J841
$$ 665 1770 775 -1091 -1125 -491 1013 1422 210 -1770 -1136 215 1308 942 -498 -1632 -971 870
3658H70Q15j144j791k12J343J576j86j436j511N88J822Q31q56j298j018Q85J871
$$ 870 1685 541 -1250 -1462 -119 1457 1271 -165 -1676 -1088 734 1565 709 -589 -1607 -722 1149
3675A149K90j450j145k94J661J350o88j352j094N89J980N84j053j807l44J531
$$ 1149 1439 -11 -1156 -1450 211 1561 873 -479 -1573 -984 996 1580 527 -1280 -1624 -93
3691i3J750j78j495j556L79J578J128m16j860p88R18J459O28o94j655n45J482
$$ -93 1657 1479 -16 -1572 -1193 385 1513 1097 -763 -1551 -633 826 1454 760 -895 -1440 42
3708D2J274J14j802j063N35J236J346j133j336j053J383J505L73j227j619N81
$$ 42 1316 1430 -372 -1435 -900 336 1682 549 -787 -1840 -457 1048 1421 194 -1425 -844
3724h44R87J081l10j496j198J063J688O30o48k205j55J233J551j19r29j444l4
$$ -844 143 1224 914 -582 -1780 -717 971 1601 953 -1252 -1407 -174 1377 1258 329 -1115 -1149
3741a149J607J027o75j942k12O25J774K23q86j371l01J481J211l25j351j319P45
$$ -1149 458 1485 810 -1132 -1344 -719 1055 1278 392 -979 -1280 201 1412 1087 -264 -1583 -838
3758h38J534R58j087j514l19J008J063M07j142j680K82J612J043n26j334p84M41
$$ -838 696 1654 567 -947 -1266 -258 805 1212 70 -1610 -1328 284 1327 801 -533 -1317 -876
3775h76J766N43j132j374m32J579J066J16j424j387Q4K179Q03p91j346o42P79
$$ -876 890 1433 301 -1073 -1505 74 1140 1256 -168 -1555 -1471 708 1511 720 -626 -1268 -489
3792d89J843M55j705j496J34J130J592k31j855p16P16J497N18p44j950j70J252
$$ -489 1354 1809 104 -1392 -1258 -128 1464 1233 -622 -1338 -622 875 1393 649 -1301 -1471 -219
3809b19J324M26j802q64K72J184J149n85j667m81O11J627N03j303j376J12J044
$$ -219 1105 1531 -271 -1135 -863 321 1470 885 -782 -1263 -652 975 1478 175 -1201 -1089 -45
3826d5J446l98j121j330O47J641M05m99j349n40Q56J465J09j324j323J27J722
$$ -45 1401 1003 -118 -1448 -801 840 1245 746 -603 -1143 -287 1178 1287 -37 -1360 -1233 489
3843D89J212m86j720r07Q22J232O99n22j552p77J355J415J75j696r96M48J044
$$ 489 1701 1215 -505 -1412 -590 642 1341 819 -733 -1510 -155 1260 1435 -261 -1257 -809 235
3860B35Q19N1k128l18J043R14O81j135j448J19J219J296k09j440q29L92J288P93
$$ 235 1054 1105 -1023 -1341 -298 616 1297 162 -1286 -1167 52 1348 1139 -301 -1130 -738 550 1343
3878A343q47j506j71R93J171J42j390r75L76J309Q84m56j390q40R82J037O84j068
$$ 1343 496 -1010 -1181 -188 983 1125 -265 -1240 -864 445 1329 873 -517 -1357 -375 662 1346 278
3896B78j333q5J281P63K78j306r31J33J401Q24o37j549o73J201J167M14j047j349
$$ 278 -1055 -1140 141 904 1182 -124 -1055 -922 479 1303 666 -883 -1556 -355 812 1226 179 -1170
3914a170P5J448P44m87r83j139N64J661R10j427j009l76Q70J321J21j232r18J00
$$ -1170 -1095 353 1097 610 -373 -1512 -948 713 1623 196 -813 -1189 -319 1002 1123 -109 -1027 -927
3932i27J138R28l74j309p06R47J010N68j311p46j16R61R20K37j548p18K76J417
$$ -927 211 1139 765 -544 -1250 -303 707 1275 -36 -782 -898 63 983 1220 -328 -1046 -770 647
3950F47O05o97j056j080J256J504j31j353n00j53J083J331o45j226q74Q91J095
$$ 647 1252 555 -501 -1581 -325 1179 1048 -305 -805 -958 125 1456 811 -415 -1289 -398 697
3967F97L22l92j453O2N14J327p3j212j112L95J132O51l02j091n95P74J097L78
$$ 697 1019 627 -826 -764 -250 1077 1004 -208 -1320 -925 207 858 556 -535 -1130 -356 741 1119
3985A119r74q60o24J404J126n18r64j020N92J257M63k59j524n15J270Q62o5j160
$$ 1119 145 -715 -1339 65 1191 673 -291 -1311 -719 538 1001 742 -782 -1297 -27 835 770 -390
4003c90n64K01J135M81j13j298m37Q00N95O33p16j377k2J109J047k75j005r49
$$ -390 -954 -753 382 863 750 -548 -985 -185 410 1043 327 -1050 -1072 37 1084 809 -196 -1145
4021a145L4J733L96o27j205m74J050R48L73j059q46l5Q67J215q43j104l74L83
$$ -1145 -1111 622 1018 391 -814 -1288 -238 710 1083 24 -822 -857 10 1225 382 -722 -1096 -713
4039g13J323Q94j306j134P8O04R71J06o06j373M54J347L02j05j321q11R97Q87
$$ -713 610 1504 198 -936 -858 -254 717 823 217 -1156 -702 645 947 842 -479 -1290 -293 594
4057E94M11p84j179J34J120L52M64j293p29K29J457P83j559p16m22Q47J343j6
$$ 594 1005 221 -958 -824 296 648 1112 -181 -910 -681 776 1559 0 -716 -1138 -291 1052 1036
4075A036j038j297O22P24O50J37j504m77Q03J032J96o22j260J22P13J015K70j390
$$ 1036 -2 -1299 -677 47 697 834 -670 -1147 -344 688 884 262 -998 -876 -163 852 1122 -268
4093b68j023P42J078N19p74n37p81O62J348J33j473n10j98Q87J340m00j030r43
$$ -268 -1291 -549 529 1048 274 -263 -1044 -382 966 1099 -374 -884 -1082 -195 1145 745 -285 -1228
4111a228O45R39Q05o96j268l99Q41J274K1j009o07j39R32N44J56j159q45Q72J138
$$ -1228 -583 356 1161 465 -803 -1202 -361 913 934 -75 -682 -821 111 655 811 -348 -1193 -321 817
4130H17K45o71j197n22J581P42kj182p72L70J190O58j026r21j61P17J090J49j426
$$ 817 1062 391 -806 -1328 253 995 993 -189 -961 -591 599 1257 231 -690 -851 -134 956 1105 -321
4149c21o89L60J005R24n56r61r71O20R93O41l54j673Q8Q81J117k88q43p66M3R05
$$ -321 -1010 -650 355 1279 723 -238 -1209 -589 404 1045 691 -982 -894 -13 1104 816 -27 -793 -750 155
4169A55R32m26r33n28P43O96O44j489p07n2R30O91L96j140r95N62R74O51o60j177
$$ 155 1087 661 -272 -800 -57 639 1283 -206 -913 -965 -35 656 1052 -88 -1083 -521 453 1104 444 -733
4189g33K1O58O09N30j340o34j63J265R23m30q41j293Q69J065K84o44r24j50P62
$$ -733 -712 -54 555 1085 -255 -889 -1052 213 1136 706 -135 -1428 -559 506 790 146 -778 -928 -166
4208a66J003O2j150q14K53J250M75n66q88n23Q35Q32O17r19j241M7R86M81J29
$$ -166 837 899 -251 -1065 -812 438 913 347 -541 -1064 -229 603 1220 301 -940 -893 93 574 703
4227G03q30j080Q14Q88M60r37p66k21N87J202q5r22o14N6Q97O39j80j144l46R9
$$ 703 -127 -1207 -393 495 955 18 -748 -969 -382 820 735 -187 -801 -745 152 791 611 -533 -879 -780
4247g80J651J57p66q24m26Q49R22m6j000p10M77R54N45k73j141o42Q13R42O8o28
$$ -780 871 1028 262 -562 -988 -139 783 737 -263 -973 -496 458 1003 730 -411 -1053 -240 702 770 142
4267A42q25L3Q75Q45m62j089p41J010P44O84r87j280J79O37Q47j25l06p95qN80
$$ 142 -683 -650 225 1070 608 -481 -1222 -212 532 1216 229 -1051 -872 -235 612 487 181 -614 -622 -42
4287d2R35j99j120m20P58N46M62q66r29J29R44Q03m07p11p06K58O66Q71q86p72
$$ -42 893 694 -426 -846 -88 458 920 54 -875 -746 198 1001 594 -117 -823 -565 101 972 86 -686
4307f86k05O98R89J03j167o73o3J354M55o23o02m26M20P17O29n96j149l59J047
$$ -686 -891 -193 796 899 -268 -941 -1004 350 805 182 -420 -846 -426 291 920 324 -825 -1184 -137
4326a37P58J08r90q23K71J225M48o14o61k42M64M68O99q39j028M85P66K98K7q55
$$ -137 621 729 -261 -1084 -813 412 860 246 -415 -657 -193 275 974 135 -893 -408 358 656 683 -172
4346a72o40L79O53O88p72o46k04L37J121o7o74r12J05P72Q04o4j237n75N41J048
$$ -172 -812 -433 220 908 136 -510 -714 -377 744 677 3 -909 -804 -32 772 708 -529 -1104 -563 485
4366D85L16l74j138K22L42O64L85r75q02N32O73L63l31r35k93O21J199l6p39p41
$$ 485 801 427 -711 -489 -147 517 902 -73 -875 -343 330 693 362 -573 -866 -245 954 918 179 -562
4386e62j03R83O80n07r37n19P47N52M83n00j053j44O93J021J37r91m71l7P41P76
$$ -562 -665 318 998 491 -446 -965 -218 334 817 317 -736 -880 -187 834 971 -20 -491 -528 213 989
4406I89p96p37l14M25J052L08p69o58l06R66O77k19q91q04P48M64O55k45j001
$$ 989 193 -544 -858 -433 619 927 158 -500 -806 160 837 618 -273 -1077 -329 135 790 545 -456
4425d56l45P33O16j1m74o14k17J126O03n45o29k06q8J096J86r72n73L54N49O79
$$ -456 -801 -68 548 537 63 -551 -768 358 961 416 -213 -419 -507 589 775 -197 -770 -416 133 812
4445H12k09o46o30k0J335N3m27o28l08K51J025J13m99q68m2P31N69k97m23n94
$$ 812 603 -43 -673 -693 642 695 268 -360 -668 -417 608 721 222 -646 -688 43 612 315 -108 -702
4465g02K02Q96M69n70q46k88L72J029J99o79q90J79R63K71J8q41l50K99N48L87
$$ -702 -500 396 865 295 -551 -839 -467 562 761 82 -808 -629 334 605 623 -218 -568 -269 279 666
4485F66n39p76K01M65N35O8p18p51K05R94L70l20r80l94Q75O49M83r41q16J46
$$ 666 127 -649 -448 17 552 620 -98 -849 -644 350 720 400 -580 -974 -99 550 1033 92 -724 -578
4505e78M56O59P5p36n96M13R99p8o2j047o2N13N16R2p74o43K91R02M49k82q90
$$ -578 -122 537 612 -124 -720 -307 692 614 552 -495 -557 -44 472 564 -210 -853 -562 340 789 507 -383
4526c83o38L51J519j82o32n85L29J20Q61j92q30m27K18R71K11m86p09j59K38J094
$$ -383 -1021 -670 849 667 35 -550 -221 -101 760 568 -262 -689 -471 500 711 225 -484 -643 -405 689
4546F89j06l34r91j03R65M40j2p19q33O76R17J84l84r19k76J021O30k1o42q56
$$ 689 583 249 -742 -845 120 560 548 -171 -1004 -328 589 773 389 -530 -806 215 845 824 182 -674
4566f74J43P15J166p62j220j5M35P01J64o82p32J80P96K83m2o91l97J95Q09M56
$$ -674 -531 184 1350 588 -632 -647 -212 489 653 -29 -761 -581 215 498 456 -235 -632 -437 372 828
4586H28n41r31J44K30R18j60m63n35j01R66O47n16n95l43Q9P44K94k40j353K79
$$ 828 287 -644 -500 -270 648 488 25 -510 -611 355 1002 486 -109 -452 -363 381 675 435 -918 -639
4606f39O21O91L6p35p29j2J113N30o09p09N9K40N29K98o13p26J06P82O60j89q52
$$ -639 -18 673 709 -26 -755 -767 346 876 267 -442 -383 -143 386 684 71 -655 -549 233 893 704 -148
4627a48n18J30P29N53m38r27j29O62J151k57r80l11j45J014L12k71o88n61N07
$$ -148 -666 -536 193 746 308 -619 -748 -86 1065 808 -172 -483 -628 386 698 427 -261 -822 -315
4646c15P01L84n71r54J86N27O55j40p43m74J69Q63M76q00k45n18O01Q64k66m97
$$ -315 386 770 199 -755 -569 -42 613 473 -270 -744 -575 288 764 -36 -281 -799 -198 666 400 -97
4666i7n47J06O92L97q9o15o79O05L52L23k94o07o7P24L58P4m84r68L25N17P13
$$ -97 -644 -538 154 551 462 -153 -832 -227 125 448 154 -453 -520 204 562 636 152 -816 -491 26 739
4687G39m97o23m50Q27O27L78q74q01K7P93M50l4p71m91K18R67K30m00q14l52Q50
$$ 739 242 -381 -831 -4 623 1001 127 -674 -647 146 596 562 -209 -700 -482 485 715 315 -499 -851 -1
4708aN78J62q10k37j50P08M69n44m36j48J07L77L25m04o00K63M72L78K14j049
$$ -1 577 739 -71 -308 -458 250 719 175 -261 -409 -302 75 400 -4 -604 -341 131 509 723 -326
4728c26o67M59M79Q63m87n92o67J115P3P18n69j099J69O16M50k67m31n93M33P34
$$ -326 -993 -534 -55 808 321 -271 -938 177 250 968 399 -700 -531 85 535 268 -163 -756 -323 411
4748D11J34l42n79j82L37N42M85r44m36r1O57Q85r01k59l35K42R20O8k53r01L17
$$ 411 545 203 -376 -558 -221 321 806 -138 -574 -665 -8 877 -24 -283 -618 -376 544 612 359 -542 -225
4769b25K47O01l24n73m54K61R50P5l38m43l56N06M97K63o06p14K06M10N49m53
$$ -225 22 623 299 -274 -728 -467 483 558 220 -223 -579 -73 424 687 81 -633 -427 -17 532 79
4789G9k35p09N65Q71N0j33j070Q6L47P50o9m01p87L92M73L59l75n68o95P69R08
$$ 79 -156 -865 -300 571 621 488 -582 -496 -149 601 532 131 -656 -264 209 568 193 -375 -1070 -301 607
4810F07k02l26o53R9M26P30k09n07n45L33L07N15l70l12o98P22L30M61o95o59
$$ 607 405 79 -574 -475 -49 681 472 -35 -580 -247 60 575 205 -107 -805 -83 247 708 13 -646
4830f46K04N64K09J9j066j30O42P61L99o70o87l63J080N11k14o01q79N01M71L71
$$ -646 -442 122 331 350 -716 -846 -204 557 956 286 -401 -764 316 827 613 12 -867 -366 105 476
4850D76j2q59R8J44N48M54q79l10k9M56O07l9p35o48M16N01N62o95m20m45Q82
$$ 476 464 -395 -297 -153 395 849 -30 -340 -369 87 694 655 -80 -728 -312 189 751 56 -364 -809 73
4871G3M60j31m20n74K51P97K56p89l7o39N23N17N07n84o65k39O32Q69j53o49m62
$$ 73 533 402 -18 -592 -341 456 712 -77 -114 -753 -230 287 794 210 -455 -694 -62 807 654 5 -457
4892d57rP00N02l43p55n8P10q2O89o11j064N35K63N59k43m33o29K71R27j18k38
$$ -457 -466 234 736 393 -362 -420 290 208 897 286 -778 -243 20 579 336 -97 -726 -455 472 354 116
4913A16m27m82R25L82j5n21n42J08P10M51m98n16j30J60P25j49k47m88k30P41
$$ 116 -311 -793 132 514 499 -22 -564 -456 254 705 207 -309 -439 -279 446 297 50 -438 -668 73
4933G3N43j29o99n20M52L54O17n06n63l97N54Q52q3n76n85J21R67J27k81n57k21
$$ 73 616 487 -212 -732 -280 74 691 185 -378 -775 -221 631 548 -28 -613 -492 475 602 321 -236 -457
4954d57M6P04O0m95k84k58N56O51m64k36J55m71P95M76n74o91K2L88O70l17l97
$$ -457 -411 293 353 -142 -426 -684 -128 523 59 -177 -22 -493 302 778 204 -487 -465 -77 593 276 -121
4975a21m64J59O77N24l08o63j65P4O47K57k88o39k24N59P81j45p36k51l04N01
$$ -121 -585 -426 251 775 467 -196 -361 -287 360 617 329 -310 -534 25 806 661 -75 -326 -630 -129
4995a29N56j9q13jK44N17R4k54r10L44O71L40j03m93r67Q26N66J52k45n90j98
$$ -129 427 408 -405 -406 -162 355 449 195 -715 -371 300 640 537 44 -923 -97 469 621 376 -214 -412
5016d12M19O04o6n99m99J46Q43Q2p1p03q6Q2P19K43q16k40k51R18r0J13n25j68
$$ -412 7 611 545 -54 -553 -407 436 518 447 -256 -342 -260 459 702 -114 -354 -605 313 223 336 -189 -357
5038c57J10M90L50l32l64n71N11M53J34n73k81j10O66K45N6m19n09K90L69N77
$$ -357 -247 243 593 261 -103 -674 -163 290 424 -149 -430 -540 126 371 427 8 -501 -211 158 735
5058G35n34n97k78O51L57M67q85l09j67N57N60m46k8r52L99N98M80m52l60l21
$$ 735 201 -396 -674 -23 334 801 -84 -393 -560 -3 557 111 83 -869 -470 128 608 156 -204 -525
5078e25N14P04m9p43p32K65N80M91j64o17kn5O82L79m16o18k01Q79J69k67l61
$$ -525 -11 693 644 -99 -831 -566 14 505 341 -276 -278 -333 349 728 312 -306 -507 372 541 274 -87
5099h7q8l42Q25P0p7q48J57L91O87m32n79k99K7Q45L50k99l50o11N29L14r7j68
$$ -87 -175 -517 308 378 301 -547 -390 1 688 256 -323 -622 -595 250 600 301 -49 -660 -131 183 86 -82
5121h2j69l08N90P03l98m13l16R1P57K57m91p49j88O56M66J40n78l78k31P22J67
$$ -82 -251 -559 31 734 336 -77 -393 -302 455 712 221 -528 -716 -60 406 546 -32 -410 -641 81 248
5142B48J8o05k2j64R86J78m98o41r0O74J48M8k63l44j67P47Q7M36q98p82O22P63
$$ 248 266 -339 -361 -525 461 639 141 -500 -590 84 232 280 17 -327 -494 253 340 776 -122 -904 -282 481
5164D81kn01n91J64N39P19l79q56j22K22P02J75j31o76j0OR57m5j028P6l13R28
$$ 481 479 -22 -613 -449 90 809 430 -426 -548 -326 376 551 420 -256 -266 -260 697 652 -376 -300 -613 315
5186C15J82k71n99p1P8N94M86o37l48KM15K16P5n26m49L47M82j5l95k69O2L22
$$ 315 497 226 -373 -444 -366 228 714 77 -271 -269 146 362 437 -89 -538 -191 291 276 -119 -388 -326 -4
5208dL12Q9n60l2j59L85L85K86j025k47K04O08K81j80q08N4L19L40J16q76j15
$$ -4 308 397 -163 -195 -354 31 416 702 -323 -570 -366 242 523 343 -465 -411 -92 248 364 -512 -627
5229f27L23N41J44J33p93j59L60L42J24k73n46j7O12j0J56l74k71J6L43L76j50
$$ -627 -304 237 381 514 -279 -438 -78 264 388 115 -431 -448 164 154 310 -64 -335 -319 24 400 250
5250B50o97j98M31N55q2k9o40J60K17M12k16n02L5M2M38Pl6m53l4J46N57p6m02
$$ 250 -447 -645 -214 341 259 230 -410 -250 -33 379 163 -339 -304 -262 176 183 147 -306 -340 -194 363 287 -115
5273a15l95J56O72J92n72k20j65K54N69J18q09k4k17L77Q74q48J25k68M8O19q9
$$ -115 -510 -354 318 510 -62 -282 -447 -193 376 494 -315 -339 -556 -179 695 -153 -28 -296 -248 371 282
5294B82k75l20l71L89P84k46j83m46L30K54M26m53m35j26O4Q51k15l08j84k94
$$ 282 7 -313 -684 -295 489 243 60 -386 -56 198 624 171 -264 -390 -326 525 310 2 -182 -476
5314d76P22M93l14o14k37K55M57K57l67n02j99N39P6L66m34m11L01K0M56R5q36
$$ -476 246 739 425 -189 -426 -171 286 543 176 -326 -525 14 90 456 22 -389 -88 -68 388 483 -353
5335c53l5K06N19j3n02k42N7M05N03k16k31n86M55M51o2p2l86o96N45N33J2m07
$$ -353 -388 -182 337 324 -178 -420 -363 42 545 329 98 -488 -33 418 356 284 -102 -798 -253 280 292 -115
5357a15l52N7M22P01p21Jl25K2O04J05j4p23J74J14N45o7m75n97L41N42j07k64
$$ -115 -467 -410 12 713 -8 -7 -332 -310 294 399 385 -338 -164 -50 495 428 -47 -644 -303 239 132 -132
5379a32p8j88M43M25l46ro09M12r4P24j36n63j69L34J34K70l69j96O1j2N09P0
$$ -132 -210 -398 45 470 124 115 -494 -82 -176 548 412 -151 -320 14 148 418 49 -147 -86 -98 411 481
5401D81k94m39j57P27j7J63o36j9j36N67P3k20j27m45K60M12Om24j68j33M27O56
$$ 481 187 -252 -409 318 301 464 -172 -191 -327 240 313 93 -34 -479 -219 193 199 -225 -393 -526 -99 557
5423E57m50k57j22J2O55l81pm24j50O93M27k29l79m35J52N32k7K0l39l75M08K21
$$ 557 107 -150 -272 -260 395 14 7 -417 -567 126 553 324 -55 -490 -338 194 167 187 -152 -527 -119 102
5445A02M79m29n61r6N23L71k60j45m76M41J74J53j74k23j66J94L80J88m77o13
$$ 102 581 152 -409 -505 18 389 129 -16 -492 -51 123 276 102 -121 -287 -93 287 475 -2 -615
5465f15L92L54L98m02j60j33J10K19M84p24l99j23O02R7L65k62p63L30L65nJ9
$$ -615 -223 131 529 127 -33 -166 -56 163 647 -77 -476 -599 3 100 465 203 -560 -230 135 130 149
5486A49m24k28L60P34j71k22k96j96N88J37l03ln79P22k1K24k96o26K38N50j4
$$ 149 -275 -503 -143 591 420 198 -98 -294 294 431 128 125 -454 268 247 471 175 -451 -213 337 323
5507C23l4l84O0M2J84Q3j63l61j45M88J87K13o43m34K62L81J75P8l38m81K55M91
$$ 323 289 -95 -35 7 191 274 111 -250 -395 93 280 493 -150 -584 -322 59 234 312 -26 -507 -252 239
5529B39n4J4k74l23M91M23k55o37K49k09N39L80l25m17l9p3N76k18j73k49j28
$$ 239 185 199 -75 -398 93 516 261 -376 -127 -336 203 583 258 -159 -198 -271 305 87 -86 -335 -463
5550d63P44L36n11J25m90J40N21l61O0n4m07L97K57M0l05k51p8J83M60l13j40
$$ -463 281 617 106 231 -259 -119 402 41 101 47 -360 37 294 334 29 -222 -300 -117 343 30 -110
5571a10j68K35M88j54j73j29l95M35J29j46l03k39O07K63j42K56n47j83L88j8
$$ -110 -278 -43 445 291 118 -11 -406 29 158 12 -291 -530 77 340 198 454 -93 -276 112 94
5591I4ol98L58l98M44J64J2m69PJ15N06J37l17n42j98J78M83K08m16l27L73r3
$$ 94 88 -310 48 -350 94 258 270 -199 -192 -77 429 566 249 -293 -491 -313 170 378 -38 -365 8 -85
5613h5P7J60l30k86K02N75r2k22q3K8L50n2J62m08j88j90N60K29k9n51j63rQ00
$$ -85 -8 152 -178 -464 -262 313 221 -1 -84 -56 294 242 404 -4 -192 -382 178 407 378 -173 -336 -345 455
5636D55q1l31k40L3K00M33l11o32J14J93N91O5m14m32J00K16J57J96m20l14n8
$$ 455 374 43 -197 -164 36 469 158 -474 -360 -167 424 489 75 -357 -257 -41 116 312 -108 -422 -480
5657d80L89O90m16l24k45K47J99M7j79l51N7N74K13l07l34j41L06N22K7l47l13
$$ -480 -91 599 183 -141 -386 -139 60 107 -72 -423 -366 208 421 114 -220 -361 -55 467 494 147 -166
5678a66j71J87r9N09Rm19K84j4L06N1m97l17K24Q9R1o1j27K02J47O9j66j50l63
$$ -166 -337 -150 -249 260 269 -150 134 120 426 477 -20 -337 -113 -24 67 6 -121 81 228 297 131 -19 -382
5701c82OL76M66k46o11K69j26M04N5l43j45J4K59N20j82o01j58M99L76m2m58p3
$$ -382 -376 0 466 220 -391 -122 -248 156 211 -132 -277 -263 -4 516 334 -267 -425 74 450 408 -50 -123
5723a23j98J41L50J09l49j07K5L99J10j87l87j08J65K72N7K6m92k67O15r6K29
$$ -123 -321 -180 170 279 -70 -177 -152 247 357 170 -217 -325 -160 112 169 195 -297 -564 51 -45 184
5744A84j44l84J27P2O04k54m54k2K98R8R6l58j76K25L48R6j88m18N6J97J33K7
$$ 184 40 -344 -217 -145 459 205 -249 -271 27 125 221 -137 -313 -88 260 356 168 -250 -194 3 136 163
5766A63K44p91r1M95L53m51Lj84K06p5L25j81k97k83N44K32J35O5q98L59K51K44
$$ 163 407 -384 -475 20 373 -78 -75 -259 -53 -128 197 16 -281 -564 -20 212 347 412 -486 -127 124 368
5788C68o2k44m47L32J31K62l31N8m11M20K74j85l62k56J60K91K75k64j61K5q9
$$ 368 306 62 -385 -53 78 340 9 67 -344 76 350 165 -197 -453 -293 -2 273 9 -152 -127 -216
5809b16L63r8j21k72l6L74P5J33m48m6p6M29O7k19Ql9K68N9L65k95n98oM70Q7
$$ -216 147 49 -72 -344 -380 -6 69 202 -246 -292 -368 61 128 -91 -83 -122 146 205 570 275 -323 -329 141 228
5833B28k3l89j32L42J59q7l44J26k04L83M92k09m41r0J88J82pj0p73M00K69J07
$$ 228 205 -184 -316 26 185 98 -246 -120 -324 59 551 342 -99 -189 -1 181 174 164 -609 -209 60 167
5855A67K84l88m48J22L56j81K54n04k34K98K64J07L7k53P3J48k24M67n39J17O6
$$ 167 451 63 -385 -263 93 -88 166 -338 -572 -274 -10 97 134 -119 -46 102 -122 345 -194 -77 -11
5876a1jL52m4m89m6p0N62n4J5l29j24M78J09j12k04k71q1R33l53j92l89J34J99
$$ -11 -12 340 296 -193 -239 -309 253 199 214 -115 -239 239 348 236 32 -239 -320 613 260 68 -321 -187 12
5899A2K88k45J89q49O18M8J26j10m90Q4M80J46M0l65l08K28M5L82j94j58l17r
$$ 12 300 55 244 -605 13 61 187 77 -413 -329 151 297 337 -28 -336 -108 -63 319 125 -33 -350 -359
5921c59M47l6n6k78N2N5L26P3j42m77J16M70J81j74k24k38Q6K46j81M02l04l26
$$ -359 88 52 -4 -282 -230 -175 151 224 82 -395 -279 191 372 198 -26 -264 -178 68 -113 289 -15 -341
5943c41M34J16K15p87M34k91M65Q0l15j56J5o4K92K19n45j41o4L93J61J98j76
$$ -341 93 209 424 -363 71 -220 245 325 10 -146 -131 -195 97 316 -229 -370 -434 -41 120 318 142
5964A42j48o01R67r1m08K33k51K10K40k03o81M12Q4J58L59m35k23l3K11L66k1
$$ 142 -6 -607 360 269 -139 94 -157 53 293 90 -591 -179 -95 63 422 -13 -236 -269 -58 308 287
5985B87l39k51O9K82K97j98k8P7j21M4J91k48rn48M42O49m58J13p59J87Q60m98
$$ 287 -52 -303 -234 48 345 147 119 196 75 119 310 62 53 -495 -53 596 138 251 -508 -321 539 41
6007D1K50p92N56j47O33l07j4o11J40K45j05J95j33J07k09K01Q8O5k93j74R7M96
$$ 41 291 -501 55 -92 541 234 220 -391 -251 -6 -111 84 -49 58 -151 50 138 203 -90 -264 -167 329
6029C29j60L9n26M15j06K52k00Lk73R0L98Q4j73n68L81L8J35N1l52j03J41K80
$$ 329 169 208 -318 97 -9 243 43 46 -227 -137 261 345 172 -396 -15 23 158 209 -143 -246 -105 175
6051A75jL20m83j16J06M1J86j03n11K85K77J58j47p74L13N7J90j5K58k87j18P9
$$ 175 174 494 11 -105 1 42 228 125 -386 -101 176 334 187 -587 -274 -217 -27 -42 216 -71 -189 -110
6073a10K99Mp2n71M16N9N81n56K0j92lL49k73J73n24J46L59J20Pl93j98J92K60
$$ -110 189 193 121 -450 -34 25 606 50 70 -122 -125 224 -49 124 -400 -254 105 225 232 -161 -359 -167 93
6096I3j3rj22k45K62J21J00j29m08L13p2K17J93j38l48m2M33M0m5j17O3j02K4
$$ 93 80 71 -51 -296 -34 87 187 58 -350 -37 -109 108 301 163 -185 -227 206 246 201 84 147 45 69
6119F9j77K30p64N96J63Q0Q3m38j92M32m8J65Q6l46k30L30M07l34m96K04Q4M94
$$ 69 -108 122 -642 -46 117 197 280 -158 -350 82 34 199 285 -61 -291 39 446 112 -384 -180 -96 398
6141C98P3l04m44K53J99N5l46N0k31M02O0k16K94k11l04L82j39o9L90k47k45K61
$$ 398 471 167 -277 -24 175 230 -116 -66 -297 105 165 -51 243 32 -272 110 -29 -98 292 45 -200 61
6163F1J86P0k26l86K69K5jJ94m59K61J1l9M49m04o6k80K84J63K79l32m68M09N
$$ 61 247 317 91 -295 -26 -1 -2 192 -267 -6 5 -34 415 11 -55 -335 -51 112 391 59 -409 0 5
6186Eq7K83m05j2L42n7k2K2k48K03R9j28L14k99k66N4M41j59q3l34p1O55L8k59
$$ 5 -82 201 -204 -216 126 69 47 69 -179 24 123 -5 309 10 -256 -202 239 80 -3 -337 -408 247 285 26
6210B6j24J37k14L47j90J26k11j61J72L01j90J49l61K55m1Q0K7k79j94J16M07
$$ 26 -98 39 -175 172 -18 108 -103 -264 -92 209 19 168 -193 62 21 101 128 -151 -345 -229 178
6231A78J4k51j03J10O2J58J17l68K7j99L34Q3q2k37m4M32m39L38Q0l54J7O3M6
$$ 178 192 -59 -162 -52 10 168 285 -83 -56 -255 79 162 80 -157 -201 231 -208 130 210 -144 -127 -64 -18
6254a8J58m88M8j43M98J45j66l08M2M69k7m75L71l17K98K1J39l84J55m0n2J48
$$ -18 140 -348 -300 -443 55 200 34 -274 -232 237 210 -265 106 -211 87 108 247 -137 18 -22 -74 74
6276G4J89m87J17j99J56L07J36n60N52k73L9M45m07j6k71N19j21L4R4n26L19J67
$$ 74 263 -224 -107 -306 -150 157 293 -267 285 12 51 496 89 73 -198 321 200 234 328 -198 121 288
6298B88Ol15m5J07j56l4J62O5j88pJ95p1k81L12j11K69l49K36J50j83l35J73K70
$$ 288 294 -21 -66 41 -115 -149 13 78 -110 -117 78 7 -274 38 -73 196 -153 83 233 50 -285 -112 158
6321A58J35l35Mk33J63M62m17l24M50K3j15K37o8j91j73L05ONj53q4l76O07K10
$$ 158 293 -42 -38 -271 -108 354 -63 -387 63 86 -29 208 140 -51 -224 81 87 92 -61 -145 -521 86 296
6344B96p9j70K17j97j44L66j06k97l55P26j0p5l33L21l31M11j59qk67r3K0M74
$$ 296 217 47 264 67 -77 289 183 -114 -469 257 247 172 -161 160 -171 240 81 73 -194 -287 -267 207
6366B07k38J2k90L16K35j10Q2k98j0q4K92K64m24k2o2J8L11J11m99PK00Q8J16
$$ 207 -31 -19 -309 7 242 132 214 -84 -94 -178 114 378 -46 -68 -130 -112 199 310 -189 -182 18 106 222
6389B22l70o2q8K88J68r8k30LL16j41K37j90k07l2J46L59k14j69r8L4M20k47J19
$$ 222 -148 -210 -298 -10 158 60 -170 -167 149 8 245 55 -152 -184 -38 321 107 -62 -160 -126 294 47 166
6412A66k95j90L42J71r5k80J99k28O4M60j1m24j23j56K85L04Ol11J18R4P5L0k71
$$ 166 -129 -319 23 194 99 -181 18 -210 -146 314 303 -121 -244 -400 -115 189 195 -116 2 96 171 201 -70
6435g0l2k2pL53J01l90k3j09L40O8k16m37N8lP12k64k46r4K03l3L3J66k53k61
$$ -70 -102 -124 -131 222 323 -67 -90 -199 141 209 -7 -444 -386 -389 323 59 -187 -281 -78 -111 -78 88 -165 -426
6459d26M12L77j53j59K49m13R5j58K61q7n20N06K78k27J65l18N0j45K27j33J6
$$ -426 -14 363 210 51 300 -113 -18 -176 85 -2 -522 -16 262 35 200 -118 -68 -213 14 -119 -103
6480a03k65%L67M16J72l35l38rK30o2J09l22J59L5J10L5k94j7j62K82M9L8j44
$$ -103 -368 -368 -1 415 587 252 -86 -95 135 73 182 -140 19 54 164 199 -95 -112 -274 8 57 95 -49
6503d9J33l15M58J26j22l51k2L75J1k51r5L38n42K82K5P3p3j8l9J4K37k67J55
$$ -49 84 -231 227 353 231 -120 -142 233 244 -7 -102 236 -306 -24 1 74 1 -17 -56 -42 195 -72 83
6526H3k68K00J21j13Qj53j27M01L5j02m1j97K35J45k48j19J20L5O8L49j28m57
$$ 83 -185 15 136 23 31 -122 -249 152 187 85 44 -153 82 227 -21 -140 -20 15 83 432 304 -153
6548a53J36J60L4M5p6l22m3R4J10J55k04k76K70K9k62K21p4m78M30N25j78j36
$$ -153 -17 143 177 222 146 -176 -219 -125 -15 140 -64 -340 -70 -41 -303 -82 -156 -634 -204 321 143 7
6570Gk50j03M59N9Q7l75k9M21m01N60q26L07k24M17K02k67k56M5p9M88j63k13
$$ 7 -243 -346 113 172 259 -116 -145 276 -125 435 -391 -84 -308 109 311 44 -212 -167 -246 242 79 -134
6592a34J42m11L86N6J50k06j72K07NJ52j92L22o63J20L29j32p8K79l29K49M3o9
$$ -134 8 -403 -17 39 189 -17 -189 18 23 175 -17 305 -358 -238 91 -41 -119 160 -169 80 123 54
6614E4j58k1m0M83j55J49m86j94J20M42J06m45K42k96M34l05L69m49MoJ94M2l72
$$ 54 -104 -125 -165 318 163 312 -174 -368 -248 194 300 -145 97 -199 235 -70 299 -150 -146 -152 42 84 -288
6637b88L17j33K88J06l69k37K45j23L62o2K86l89k17K76J67k45j5k71Q4L05R4
$$ -288 29 -104 184 290 -79 -316 -71 -194 168 106 392 3 -214 62 229 -16 -31 -302 -218 87 181
6658A81Pm92J66q4M79K35o09k7j33J70K83l9m40K57N5r7P6J48m41J39O3K90j55
$$ 181 188 -304 -138 -222 257 492 -117 -144 -277 -107 176 137 -303 -46 9 -88 -12 136 -305 -166 -103 187 32
6681C2j07k62m0L19j00K75k28j7j18J66L85M0m93o5J39K58rk45j39j15L78Mk4
$$ 32 -75 -337 -377 -58 -158 117 -111 -128 -246 -80 305 345 -148 -213 -74 184 175 -70 -209 -324 54 58 34
6704C4J99l62n8L44K11k08m85N9N8K81K91l17j30J23J33j35Jj0l31J14J79Q7O9
$$ 34 233 -129 -187 157 368 160 -325 -266 -208 73 364 47 -83 40 173 38 39 29 -302 -188 -9 78 147
6727A47l59k49L37m6o1M27k10k10K76J49l90K92k77P8K93K08l88J61m64N36j42
$$ 147 -212 -461 -124 -170 -231 196 -14 -224 52 201 -189 103 -174 -96 197 405 17 178 -286 250 108
6748A08M4m12o4L6M37K11j69j90j11L68j56J29k59Q3j58O7L56j11k29j98J25M15
$$ 108 152 -260 -324 -288 149 360 191 1 -110 258 102 231 -28 55 -103 -36 320 209 -20 -218 -93 322
6770C22m25J06J42j64mK88j04l08m13P89l2l68P9J99n34N00J96N4p2l35l1M77
$$ 322 -103 3 145 -19 -23 265 161 -147 -560 229 197 -171 -92 107 -427 73 269 323 251 -84 -115 362
6792C62k86J23k15Rj2K21j18L6m65K99P6o7J92k14j40j71Q07m84N3L8o9QM70J8
$$ 362 76 199 -16 -7 -19 202 84 120 -345 -46 30 -37 155 -59 -199 -370 437 -47 6 44 -25 -17 453 471
6816D71l44j22l57N12l6n8k0l71K05M87j54l1m97M29j25j32K54l32Q8j90K77K09
$$ 471 127 5 -352 160 124 66 46 -325 -120 367 213 182 -315 114 -11 -143 111 -221 -133 -323 -46 163
6838A63K0n01K33K15j16j9k5j93J73J68L91n37J29j06k08L9L05J27m44k29L83
$$ 163 183 -318 -85 130 14 -5 -30 -223 -50 118 509 -28 101 -5 -213 -174 131 258 -186 -415 -32
6859c2O06k52k41m22j37N06L97l50m6k63J93K93k81j05p0J70R0j03K34m12K11
$$ -32 574 322 81 -341 -478 28 425 75 29 -234 -41 252 -29 -134 -204 -34 56 -47 187 -225 -14
6880a4k4M42o13L97n15K35J19j61L5K79q06M91Q9j2K99j14n4M9J27j9j80j39j89
$$ -14 -38 404 -209 188 -327 -92 27 -134 -99 180 -626 -135 -46 -58 241 127 73 122 249 230 50 -89 -278
6903b78N73k6n98J85N6R3J56j61k49J10j27M33K04j91k36p8k60J50M23J45j11
$$ -278 295 269 -329 -144 -88 5 161 0 -249 -139 -266 167 371 180 -56 -134 -394 -244 179 324 213
6924B13l73J37j6J89j61n59L57O8M06m19k05R0M53j10K44m35J22j01J98k1L82
$$ 213 -160 -23 -39 150 -11 -570 -213 -145 261 -158 -363 -273 180 70 314 -121 1 -100 98 77 459
6945D59n18k14L11l00N70p9Q9q42L16N73j81k13j19K03j49L38k74K18l14m08N71
$$ 459 -59 -273 38 -262 308 229 318 -524 -208 365 184 -29 -148 55 -94 244 -30 188 -126 -534 37
6966C7M15j49m20j31J83L72k12k89KK23n1J57k21j14R2J02n1L49k67J6j43K50
$$ 37 452 303 -117 -248 -65 307 95 -194 -192 31 -20 137 -84 -198 -106 -4 -55 294 27 43 -100 150
6988A50J46k61j30k41K55O6J86l7j72K4j41M85l01m7P6m6J11L64k45l49J12j16
$$ 150 296 35 -95 -336 -81 -15 171 134 -38 -14 -155 330 29 -18 58 12 123 487 242 -107 5 -111
7010a11J69J79o5l28L46n20Q93k46j21m57J29j73N79l61Nj97R8K30j3r7O1L5m20
$$ -111 58 237 172 -156 190 -330 563 317 196 -261 -132 -305 274 -87 -82 -279 -181 49 36 -61 0 35 -385
7033c85P50l91J83k71J12R2P7q9M8l94J91M51k83L75n87k24L77k2O0j90j82N7
$$ -385 365 -26 157 -114 -2 90 167 78 126 -268 -77 374 91 466 -121 -345 32 10 70 -120 -302 -245
7055b45K55K83l3k62r3J81J23K0k82j99Q1R7o4L09J77m86k05L51l6J92k63J44
$$ -245 10 293 260 -2 -95 86 209 229 -53 -252 -171 -74 -138 171 348 -138 -343 8 -28 164 -99 45
7077D5J83L2j87k84Q1k03M09K2j30L1l30P9M84K18l84j43o6O7K61k5n17L25N0
$$ 45 228 260 73 -211 -130 -333 76 98 -32 -1 -331 -252 232 450 66 -77 -143 -76 185 160 -357 -32 18
7100A8NK2k55p1KJ84L95k53K04l75o2J19J66l63M3N3K9O45j98j99k22K91k65N
$$ 18 23 45 -210 -281 -279 -95 300 47 251 -124 -186 -67 99 -264 -221 -168 -139 506 308 109 -113 178 -87 -82
7124h2K60l60R3k50O59k62K40k01m15J71K26M98m86j59NJ60J13R7l41k02M31K2
$$ -82 178 -182 -89 -339 320 58 298 97 -318 -147 79 577 91 -68 -63 97 210 307 -34 -236 195 217
7146B17K79l72n3m35K86L54J73l06l66M3L71m7l01q3J98j4K2k5l6J08k57L63J4
$$ 217 496 124 71 -364 -78 276 449 143 -223 -180 191 144 -157 -240 -42 -56 -34 -59 -95 13 -244 119 133
7169A33k46m5j00L10K22j16J63p74J51J02R43l20n30L34n72M04L62k82J3k44R9
$$ 133 -113 -158 -258 52 274 158 321 -453 -302 -200 743 423 -107 227 -345 59 421 139 152 -92 7
7190Gl5M98k36l34r1N15k73j21k37l6M32K58l63L3k78l15N01J27K98m0j88k58
$$ 7 -28 470 234 -100 -191 324 51 -70 -307 -343 89 347 -16 17 -261 -576 -75 52 350 310 122 -136
7212a36o9M72j91k11k08J23K58N1r6m3L44k70K71j05l61j13J39J76K6j6n39K83
$$ -136 -205 267 76 -135 -343 -220 38 89 -7 -50 294 24 295 190 -171 -284 -145 31 57 41 -498 -215
7234b15J49j0J92j92J55l93L59J19k06j88L3K74j24K74L5n01K88m9K92k33J99
$$ -215 -66 -76 116 -76 79 -314 45 164 -42 -230 -197 77 -47 227 262 -239 49 0 292 59 258
7255B58k49l09K78K07P8k43n7K21jR4j3m42j23J06L09j07j92q5J55L36km33j62
$$ 258 9 -300 -22 185 263 20 -37 184 183 277 264 -178 -301 -195 114 7 -185 -270 -115 221 219 -214 -376
7278c76M3L82K56m05j9m8r0L80J65k02l39K77k33N12k18l5k03L5K37J31j2j60
$$ -376 -333 49 305 -100 -119 -167 -257 123 288 86 -253 24 -209 303 85 50 -153 -118 119 250 238 78
7300G8j87k6K01Q2l32J38r8k31J19L00k58J74M9q9K37j44P7m12K02l2P31n25j57
$$ 78 -109 -135 66 148 -184 -46 -144 -375 -256 44 -214 -40 9 -80 157 13 90 -322 -120 -152 579 54 -103
7323a03k27N00K47l26l65l51L81N48q3j77o6k75M4M41j08l1j56Q2j07k5L20j56
$$ -103 -330 170 417 91 -274 -625 -244 304 221 44 -22 -297 -253 188 80 49 -107 -25 -132 -157 163 7
7345Gk71R4L79Jj83k98K08k87O76m92J57J19n33Q49k34j21q4n01K64J59K68R0
$$ 7 -264 -170 209 210 27 -271 -63 -350 326 -166 -9 110 -423 426 192 71 -13 -514 -250 -91 177 267
7367B67m14j67JN99l43j49J26o1M98m33J37l0j32L0L44k20k13J31k06J44O20K9
$$ 267 -147 -314 -313 286 -57 -206 -80 -141 357 -76 61 31 -101 -71 273 53 -160 -29 -235 -91 529 558
7389E58n21M9l79N16J16k77L1k95L99L2j13j71o7r9N48l88J54j23k24N8K85K79
$$ 558 37 86 -293 223 339 62 93 -202 197 229 116 -55 -122 -221 327 -61 93 -30 -254 -196 89 368
7411C68k28k94Q1N9J89j94J9k06k05L54L59k66k11K3j63L65k32K74j79j53K77
$$ 368 140 -154 -73 -14 175 -19 0 -206 -411 -57 302 36 -175 -152 -315 50 -182 92 -87 -240 37
7432C7n3L18k92k30K82K45j6l13j36N4Q3L78q1k25j40k30N45Q5k72j1J74l95K99
$$ 37 -16 302 10 -220 62 307 291 -22 -158 -104 -21 357 276 51 -89 -319 226 311 39 28 202 -193 106
7455A06K7m6m04l2N48j72M14l81qm08N82n5M1l83k0K58L61m52M8q1m82O74K21
$$ 106 133 87 -317 -349 199 27 441 60 52 -356 226 171 212 -171 -191 67 428 -24 24 -57 -539 135 356
7478C56j40m63k5k1O40k66j85k37K62m6L84J22l96j63l48O92R9k01k38Q0K28j74
$$ 356 216 -247 -272 -293 347 81 -104 -341 -79 -125 259 381 -15 -178 -526 166 265 64 -174 -94 134 -40
7500d0L1M0k59J68M7K42p4Mj48j03J60K7ml6k44J09L32J62m33r0k24L52j8L2o5
$$ -40 -9 31 -228 -60 -13 229 155 159 11 -92 68 95 91 55 -189 -80 252 414 -19 -109 -333 19 1 33 -32
7525c2n3j75N86K7n57j64N55k70J96J36m66j4j92M52L80j51m79J2L92O1j05J17
$$ -32 -85 -260 326 353 -204 -368 187 -83 113 249 -217 -231 -423 29 409 258 -221 -209 183 244 139 256
7547B56l42r0J10J65Q1k72j08K03q7J99K04n06K50j00J42k7k1k31K20N7L52n8
$$ 256 -86 -176 -66 99 180 -92 -200 3 -84 115 319 -187 63 -37 105 78 57 -174 46 103 455 397
7569C97l65m07K69K15k08M94o46J17J51L01P5p9o76L19O1K85j43k07l24J76M89
$$ 397 32 -375 -106 109 -99 395 -251 -134 17 318 393 314 -362 -43 18 303 160 -47 -371 -195 294
7590B94N3o20J33J13m2M34m64j5k31K15K90p8k51J53j07L18J53k00m27J32n0R1
$$ 294 347 -273 -140 -27 -69 365 -99 -114 -345 -130 160 82 -169 -16 -123 195 348 148 -279 -147 -197 -106
7612a06k96K79P6l95M32M50j95m15J83n1oK7RK84o49L81L4J34l03m7MR0L71j68
$$ -106 -402 -123 -47 -442 -10 440 245 -170 13 -38 -44 -17 -8 276 -373 8 42 176 -127 -174 -170 -80 291 123
7636A23k50k64K72O5N59k55K6o40L2L42K27J0m08J09K6nK88k38m01J67O15n8j45
$$ 123 -127 -391 -119 -54 505 250 276 -364 -332 10 237 247 -161 -52 -26 -31 257 19 -382 -215 400 342 197
7659A97l49j3j24M98L36p97J90k1K0K54j59k37k19J41qM96j55j67R7j34M81J49
$$ 197 -152 -165 -289 209 545 -252 -62 -83 -63 191 32 -205 -424 -283 -291 205 50 -117 -20 -154 327 476
7681D76l11o85L26K82K1J50k86K18j03J90J18n39q8r3M90L33k67j57l64K10K39
$$ 476 165 -520 -194 88 109 259 -27 191 88 278 396 -143 -231 -324 166 499 232 75 -289 -79 160
7702A60J2j60r0k47L63L57j65k57k99M1K99J61j0k33k43M2M42j50O3j48k86K07
$$ 160 172 12 -78 -325 38 395 230 -27 -326 -285 14 175 165 -68 -311 -269 173 23 86 -62 -348 -141
7724a41L11m8o4k93k86M48L19k81j45l7P3K70O6k22q0l79N46M6J23J09n33k8L76
$$ -141 170 122 58 -235 -521 -73 246 -35 -180 -217 -144 126 192 -30 -110 -489 57 103 226 335 -198 -226 150
7747A50q6j16P5q9q8O13l95j76j29NL77J23m12J44k82J84K92L66n32p6k19P6L31
$$ 150 64 -52 23 -66 -154 459 64 -112 -241 -236 141 264 -148 -4 -286 -102 190 556 24 -52 -271 -195 136
7770A36R3k85j05l3M47K1l6k07m17N28j39j02RJ3J78j52J15l5k62l5L53K31k21
$$ 136 229 -56 -161 -194 253 274 238 31 -386 142 3 -99 -90 -77 101 -51 64 29 -233 -268 85 316 95
7793I5l09M7L08k95K88Q0j34k60j37L78K69k92j42j89P8N54N8k83n81M7K69L85
$$ 95 -214 -167 141 -154 134 214 80 -180 -317 61 330 38 -104 -293 -215 339 397 114 -467 -420 -151 234
7815B34k00k20j09J59M84J2m19Lj37P2L60k58k61K15n30P65J88l87k04j14L19
$$ 234 34 -186 -295 -136 348 360 -59 -56 -193 -121 239 -19 -280 -65 -595 170 358 -29 -233 -347 -28
7836b8M7K30L7n27J12J20M13k46k73j25J43J49M3R1k76J53J28K01r8k48l01J15
$$ -28 19 249 286 -241 -129 -9 404 158 -115 -240 -97 52 95 186 -90 63 191 392 294 46 -255 -140
7858a40P4L34j00k01k57J94N01k28j94k93K63J36M07l14j44k67j83J32L08J77
$$ -140 -66 268 168 -33 -290 -96 405 177 -17 -310 -47 89 496 182 38 -229 -412 -280 28 205
7878B05n53q7Q25k75J75r7l71k53L38L46p8l87k3L7O40k92j70J06m70O37O2j3
$$ 205 -348 -435 390 115 290 193 -178 -431 -93 253 175 -212 -235 -198 442 150 -20 86 -384 253 315 302
7900C02j50k39k31L51K02n54M21l39K78q3M21o00J04p9K95J59k17j29Pk54O33
$$ 302 152 -87 -318 33 235 -319 102 -237 41 -42 379 -221 -117 -196 99 258 41 -88 -81 -335 298
7921B98k14j90k42k2J55L36j32j1N2l68M92K4K4k23k24M09j62N6L53n68K2J17
$$ 298 84 -106 -348 -370 -215 121 -11 -22 30 -338 154 178 202 -21 -245 164 2 58 411 -157 -135 -18
7943a8K59J8l31q3J18k25K01K95j20l42K30J00J50m77J41L1J11Q9L2l63R9l09
$$ -18 241 259 -72 -155 -37 -262 -61 234 114 -228 2 102 252 -225 -84 -53 58 147 179 -184 -85 -394
7965c94M07M7oj03K1N2N0k3kk07P1L38j21r2m6k16r6O42j28k26n2J5L42J10k88
$$ -394 13 60 54 -49 -28 24 74 51 49 -158 -87 251 130 38 -8 -224 -320 322 194 -32 -84 -69 273 383 95
7990I5j44q5J8k20J96J61q1l04K61J73k4J34k91K87l19L93k96Oj20J28k43M10
$$ 95 -49 -134 -116 -336 -140 21 -60 -364 -103 70 46 180 -111 176 -143 250 -46 -40 -160 -32 -275 135
8012A35K0k50k78L03K20P2j52l64K17K95O4p0p9k69P51m03J72po72P2J45K71j19
$$ 135 155 -95 -373 -70 150 222 70 -294 -77 218 282 212 133 -136 615 212 384 377 -295 -223 -78 193 74
8035G4j44l45K15K77M8N3m41kK98J99Q3k70n5j09O6K12p8j95l2J39p8N89k57p22
$$ 74 -70 -415 -200 77 125 178 -263 -265 33 232 315 45 -10 -119 -53 159 81 -114 -146 -7 -85 504 247 -475
8059d75J85P79k90J55k79j12n6K11K12m52P9N3l9J35J31k89l46K96K00J8Pk62
$$ -475 -290 489 199 354 75 -37 -93 118 330 -122 -43 10 -29 106 237 -52 -398 -102 98 116 123 -139
8081a39j5k80M30K98k31K00m43L2M98r0l55j78k32J37L08J92k61N9K26J6L0k64
$$ -139 -154 -434 -4 294 63 263 -180 -148 350 260 -95 -273 -505 -368 -60 132 -129 -70 156 172 202 -62
8103f2j06P7K7P1K20Lo71J81K50R9J71q07M00K6M2m0L43j57k20J70J48j42l1L0
$$ -62 -168 -91 -64 7 227 230 -441 -260 -10 89 260 -547 -147 -121 -79 -119 224 67 -153 17 165 23 -8 22
8127B2k14K30J86k50k34l8L75J35J17m05J11n8K11j86k6K91m92K02J57K88l43
$$ 22 -192 38 224 -26 -260 -298 77 212 329 -76 35 -23 188 2 -24 267 -225 -23 134 422 79
8148G9k78j69L76j15L01k31m73K75L94l5l89N8m3l8J28R2mj78L7L52j47J91m47
$$ 79 -199 -368 8 -107 194 -37 -510 -235 159 124 -265 -207 -250 -288 -160 -68 -72 -250 -213 139 -8 183 -264
8171b64pk99M95J56qj29k63N47k1O3l66R7lM6J16j52n7j79m1M19
$$ -264 -271 -570 -75 81 73 -56 -319 228 207 270 -96 1 -2 44 160 8 -49 -228 -269 150
8191A50
$$ Imaginary data points
##PAGE= N=2
##DATA TABLE= (X++(I..I)), XYDATA
0@%%%%%%%qJ6j6J6j6K4l2L3m1N5o4P3q9J06j22J38j61J85k10K43k76L14l57M00
$$ 0 0 0 0 0 0 0 0 -8 8 -8 8 -8 16 -16 17 -24 31 -33 40 -49 57 -65 73 -88 97 -113 130 -146 168 -189 211
31B11m50N06n65O31p03P82q71R68j072J188j316J456j612J787j981K199k449K732
$$ 211 -239 267 -298 333 -370 412 -459 509 -563 625 -691 765 -847 940 -1041 1158 -1291 1441
49A441l061L451l913M475n181O093p321R077j1814J6697k8011R7976M3144k07156
$$ 1441 -1620 1831 -2082 2393 -2788 3305 -4016 5061 -6753 9944 -18067 79909 123053 -84103
63h4103R467M7582K9236P7849Q645j60503m4425J18059P7282k7936m4691n8339
$$ -84103 -74636 -27054 2182 80031 88676 -71827 -116252 1807 79089 51153 6462 -51877
75e1877k0175O5268R1532j8171j03456m0783N1224M7178M1353k469j04547n7939
$$ -51877 -72052 -6784 84748 66577 -36879 -77662 -26438 20740 62093 59624 -44923 -102862
87a02862R9759P2373k6088k3874o1515n7727J02825J10721p1580r4787m02J5100
$$ -102862 -3103 69270 43182 19308 -42207 -99934 2891 113612 42032 -52755 -53157 -38057
99c8057N6490P5034n3714j18341J96R1051N3845j8174n6810m7478k40O4846P4642
$$ -38057 18433 93467 39753 -78588 -78392 12659 66504 48330 -8480 -55958 -56198 8648 83290
112H3290l1575j06454j7641O4655M0739K5131j9387r9153k7716J03426O2125l6658
$$ 83290 51715 -54739 -72380 -7725 33014 58145 38758 -60395 -88111 15315 77440 40782
124D0782n4750m9988P134R3238M7917o3495p2447j0861M8184P0166Q881p0104
$$ 40782 -13968 -63956 -56822 36416 84333 20838 -51609 -62470 -14286 55880 64761 -5343
136e343o0237J5097P1712M5753l6243o2028j9262J9106N7693M6600n4914p9616
$$ -5343 -65580 -50483 21229 66982 30739 -31289 -50551 -31445 26248 72848 17934 -61682
148f1682J8085N0100K1616K3816l3320q8035Q757R6047K7540m1255m2541l5629
$$ -61682 -43597 6503 28119 51935 18615 -69420 -60663 35384 62924 21669 -20872 -56501
160e6501J8430Q1072L1512o7052o9568R968O3926M3127j3445n3698m9541J9175
$$ -56501 -38071 43001 74513 7461 -62107 -52139 11787 54914 41469 -12229 -61770 -42595
172d2595Q0460K8593n7555m8529l918K4994N9557K3036p1914n4518L3710M3177
$$ -42595 37865 66458 8903 -39626 -43544 -18550 41007 64043 -7871 -62389 -28679 14498
184A4498K3359N815n6304n6743M3526P1641N73l7977l8012k1913L6998O7717R63
$$ 14498 37857 43672 -12632 -69375 -25849 45792 46365 8388 -29624 -51537 -14539 53178 54141
197E4141o9554m4086K9890N4070K1090j8271m9509l7371L8302P3009l592n8105
$$ 54141 -15413 -59499 -29609 24461 45551 27280 -22229 -59600 -21298 51711 48119 -9986
209i986k6338K614K6895N4742O29p3578l0719M0597L8137J6839j2923n6394k8361
$$ -9986 -36324 -33710 -6815 47927 48556 -25022 -55741 -15144 22993 39832 26909 -29485 -57846
222e7846N1197N4609r456m3564l4678J568M4995M5127j6302o3044k6964M0940
$$ -57846 -6649 47960 38504 -5060 -39738 -38170 6825 51952 35650 -27394 -54358 -13418
234a3418M7109O057k6155m6806j9320N2473N5860k4418n2216j5361R752L6143
$$ -13418 33691 39748 13593 -33213 -52533 -60 55800 31382 -20834 -36195 -26443 9700
246I700M1609k3586o5630q215M4644L1648N562k5863m7942p152N4785M0650k3546
$$ 9700 51309 27723 -37907 -46122 -1478 30170 35732 9869 -38073 -45225 9560 50210 26664
259B6664m7297j9178J7931M1019K8758k8338n8875o204N0128L2961q053k8694
$$ 26664 -20633 -39811 -21880 19139 47897 19559 -39316 -45520 4608 37569 29516 822
271H22l8757k465N7334L6038l7170m3816n767J7414L8606K5396l8650n2872Q584
$$ 822 -37935 -40400 16934 52972 15802 -28014 -33781 -16367 22239 47635 8985 -43887 -35303
284c5303M6287K3526p496l1865l6295J0066N3941K4794l6127m2211l443K5225
$$ -35303 10984 34510 27014 -4851 -41146 -31080 22861 47655 11528 -30683 -34126 -8901
296h901L5687J5349l8647m9324J3379N0626J8138j6565l0553k9897J4530N5988
$$ -8901 26786 42135 3488 -45836 -32457 18169 36307 19742 -10811 -40708 -26178 29810
308B9810J5880m3878l4809M406K4359L4514Q550m4949l9940K2150M5974J2529
$$ 29810 45690 1812 -32997 -28591 -4232 30282 38832 -6117 -46057 -23907 22067 34596
320C4596j9028l2006k2920K1720N0706Q067m4848l1465R950K7582K9081K520m5749
$$ 34596 15568 -16438 -39358 -17638 33068 41135 -3713 -35178 -25228 2354 31435 33955 -11794
333a1794l5097K9274M5162M632k2332k9275j9027K7146M9406k367m6929k3659
$$ -11794 -46891 -17617 27545 32177 9845 -19430 -38457 -11311 38095 35728 -11201 -34860
345c4860J4267K7586K6275n366m6251k6324L4060M0990m80k5256k8120j1374L0869
$$ -34860 -20593 6993 33268 27902 -18349 -44673 -10613 30377 29897 4641 -23479 -34853 -3984
358c984M3483q589m7127j8630J9508K7439K1028j1292m5603j7893L7778L6277
$$ -3984 39499 30910 -16217 -34847 -15339 12100 33128 21836 -23767 -41660 -3882 32395
370C2395n616k6993k5607o052L4291L8101j5872m5854j2475K2395K7186J6834
$$ 32395 26779 -214 -25821 -31873 2418 40519 24647 -21207 -33682 -11287 15899 32733
382C2733j6769m3432j1029M0266L2636j1019k8540k2584O08L5171L2383k1108
$$ 32733 15964 -27468 -38497 1769 34405 23386 -5154 -27738 -27130 8041 40424 19316
394A9316m4267p417K5917K6332J1186k1197m0837l178M1566K7456j6232k8705
$$ 19316 -24951 -32368 -6451 19881 31067 9870 -30967 -34145 7421 34877 18645 -10060
406a0060j8712O688L6046K5102k6233m0856j392K7892K3873N766k4622l6420L965
$$ -10060 -28772 -22084 13962 39064 12831 -28025 -29417 -1525 22348 28114 3492 -32928 -28963
419b8963M2107K1451k0541k8286j3457J0249L5565J8972l0302l7454M605K8975
$$ -28963 13144 34595 14054 -14232 -27689 -17440 18125 37097 6795 -30659 -26054 2921
431B921K1186J258k6852l2561R371M2482J5193k2783k7447j0691J5392L4585J2266
$$ 2921 24107 25365 -1487 -34048 -24677 17805 32998 10215 -17232 -27923 -12531 22054 34320
444C4320l3375l3126Q973L0277J8970m356k8472k7322J4709M1132J0219k6923
$$ 34320 945 -32181 -23208 7069 26039 21683 -6789 -34111 -19402 21730 31949 5026
456E026k5359n636J8548L3113N386l6182k7758J4173L0071J4676q454k9458k1579
$$ 5026 -20333 -25969 -7421 25692 31078 -5104 -32862 -18689 11382 26058 17604 -11854 -33433
469c3433K0559L7795L899k8116k3047j337K2073K8496m21l6018k3099J8498K9285
$$ -33433 -12874 24921 28820 704 -22343 -23680 -1607 26889 26468 -9550 -32649 -14151 15134
482A5134J0155j1546k8251j8294K4256L7139l017l0027j8314J628K1764K9104
$$ 15134 25289 13743 -14508 -32802 -8546 28593 25576 -4451 -22765 -21137 627 29731
494B9731o138l9195j6218K3037K6346O282j3763k8854j1574K7680L2362o811l1171
$$ 29731 23593 -15602 -31820 -8783 17563 23845 10082 -18772 -30346 -2666 29696 22885 -8286
507h286j6479P866K3206K1533q909l6701j3620K6545K5812Q53j6000k6191q613
$$ -8286 -24765 -16899 6307 27840 18931 -17770 -31390 -4845 20967 21820 5820 -20371 -28984
520b8984L1505K8740j3484k9293j2350P953K6712K0332j9129l5481l072K6418
$$ -28984 2521 31261 17777 -11516 -23866 -15913 10799 31131 12002 -23479 -26551 -133
532a33K1052K61k0416k5171O48L1771K2231j6251k9408p753J3278K2473J4468
$$ -133 20919 21180 764 -24407 -23759 8012 30243 13992 -15416 -23169 -9891 12582 27050
545B7050j7052l5295r29L1794J7228o171j7578k2923P85L5147J9032k1505k6840
$$ 27050 9998 -25297 -26226 5568 22796 16625 -953 -23876 -23091 12056 31088 9583 -17257
558a7257n943J5137K6240R132k5347k8003M228K8211J9043r523k5677j5332J0930
$$ -17257 -23200 -8063 18177 27309 1962 -26041 -21813 6398 25441 15918 -9759 -25091 -14161
571a4161K8611J3606k2420k6542R50J7822J9280O655k3571k9015J0827L0457Q213
$$ -14161 14450 28056 5636 -20906 -19956 -2134 17146 23801 230 -28785 -17958 12499 20712
584B0712q619j8574k0146J1820L5875O245k7069k0870O93J9570K2705p51k7657
$$ 20712 12093 -6481 -26627 -14807 21068 27313 244 -20626 -19933 -363 22342 21591 -6066
597f066k1889J2055L1449J0113j9182k1539o482J3383K8173O415l0335k0980J1508
$$ -6066 -27955 -15900 15549 25662 6480 -15059 -21541 -8158 20015 26430 -3905 -24885 -13377
610a3377J8419J3425K16k6771k0102J9456K4750L196j1486k1702j2040K2627K7775
$$ -13377 5042 18467 18683 -8088 -28190 -8734 16016 19212 7726 -13976 -26016 -3389 24386
623B4386m649k4672j7514N538K4824J6832j0782k7140j3976J9418K9362k46k3581
$$ 24386 19737 -4935 -22449 -16911 7913 24745 13963 -13177 -27153 -7735 21627 21381 -2200
636b200j4854j260J6803K6990n829l3621q839J6499J4732J1180o583k9342q762
$$ -2200 -17054 -18314 -1511 25479 19650 -13971 -22810 -6311 8421 19601 13018 -16324 -25086
649b5086K4439J9273j712j6222k0174K47K4093J7915p506k5136j5481J5513K6132
$$ -25086 -647 18626 16914 692 -19482 -19235 4858 22773 15267 -9869 -25350 -9837 16295
662A6295M951j5681k2567p993K5953K5634j2188k2889q874K219K1576K0872j8043
$$ 16295 21246 5565 -17002 -24995 958 26592 14404 -8485 -17359 -15140 6436 27308 9265
675I265k8797J892J5853J3008Q533j4573k6567K909K4351J3889o728j9203j4099
$$ 9265 -19532 -17640 -1787 11221 19754 5181 -21386 -18477 5874 19763 13035 -6168 -20267
688b0267Q098K1687J3228j1967k8735n461K4525J7091k389j3479k3077j639L3378
$$ -20267 -12169 9518 22746 10779 -17956 -23417 1108 18199 15810 2331 -20746 -22385 10993
701A0993J6206k1371j8057m876O224K5574J0780k6212k0622Q540J5175J2688J527
$$ 10993 27199 5828 -12229 -17105 -10881 14693 25473 -739 -21361 -12821 2354 15042 16569
714A6569k1088j7037R947K1777R686j1601k0387o234J2267J9699Q615j9551k5644
$$ 16569 -4519 -21556 -11609 10168 19854 8253 -12134 -18368 -6101 13598 22213 2662 -22982
727b2982O302K4858Q787l890j6112k2262J1351L3309K277k2143j2715l389J2060
$$ -22982 -16680 8178 16965 13075 -3037 -25299 -13948 19361 21638 -505 -13220 -16609 -4549
740d549K5348j021k7877j2730J1506J6727J0927q507k0783q090J3001K0235M573
$$ -4549 20799 19778 -8099 -20829 -9323 7404 18331 9824 -10959 -19049 -6048 14187 18760
753A8760j7850j7338K629J3117J6673L018k4186j9562J5584K1490L762o735j9565
$$ 18760 910 -16428 -13799 -682 15991 19009 -5177 -24739 -9155 12335 16097 9362 -10203
766a0203j4483K0376K6711o774k0463j0633J100J7983J7991r822k3760p156J3865
$$ -10203 -24686 -4310 22401 15627 -4836 -15469 -14369 3614 21605 11783 -11977 -19133 -5268
779e268J8115L735j3507j6719k842J4852J9947k827k2758r309P715J2146J4172
$$ -5268 12847 16582 3075 -13644 -16486 -1634 18313 15486 -7272 -16581 -8866 3280 17452
792A7452l405k7248r244K1086J5737k40r562k0041n467K5115J8592j2175j9947
$$ 17452 14047 -13201 -22445 -1359 14378 14138 4576 -15465 -20932 4183 22775 10600 -9347
805i347p838P534J9626J0021j4468k0985k087J8202J5706l821j5090j1912N26
$$ -9347 -17185 -9651 9975 19996 5528 -15457 -17544 658 16364 12543 -2547 -14459 -13933
818a3933J8100J6711j1241k1786k647R889J2537J0989j1734k4965Q83K1983J0414
$$ -13933 4167 20878 9637 -12149 -14796 -4907 7630 18619 6885 -18080 -17197 4786 15200
831A5200l547j2832j7251M281K4723J0051j5063j8533l630J3648J7189K085j6380
$$ 15200 11653 -1179 -18430 -14149 10574 20625 5562 -12971 -16601 -2953 14236 16321 -59
844e9j7375K711K1135J1161r940j4892p555M446K0217J0189j7500j7603K773J1318
$$ -59 -17434 -14723 6412 17573 7633 -7259 -14814 -10368 9849 20038 2538 -15065 -12292 -974
858i74J2306M977j6925j9249Q194K0704O670p940j5189j0984J1214K1266L910
$$ -974 11332 16309 -616 -19865 -11671 9033 15703 7763 -7426 -18410 -7196 14070 17980
871A7980j7509j7134L505J6225J2329l430j6113j5049R004K2610L969j4077j2208
$$ 17980 471 -16663 -13158 3067 15396 11966 -4147 -19196 -10192 12418 16387 2310 -9898
884i898m312Q728K0319K236k1484j1884P969J1916J0172j414j9675j2091J3818
$$ -9898 -14210 -5482 14837 17073 -4411 -16295 -8326 3590 13762 12348 -7327 -19418 -5600
897e600J7944K352j2042j4293l690J4342J6918j546j9924j1686R032J5522O946
$$ -5600 12344 14696 2654 -11639 -15329 -987 15931 14385 -5539 -17225 -8193 7329 14275
910A4275n755j7215j0485J5613J9574l331j4683r304j646J2927J7655n335k1625
$$ 14275 8520 -8695 -19180 -3567 16007 12676 -2007 -11311 -12957 -30 17625 12290 -9335
923i335o711J1094J2570O993p479j8814n634J6095J6549l085j5154j1432L477
$$ -9335 -16046 -4952 7618 14611 7132 -11682 -17316 -1221 15328 12243 -2911 -14343 -10866
936a0866J4582J3001o652k0266o876J3635J4354K421r866j6457l232J8926J4188
$$ -10866 3716 16717 10065 -10201 -17077 -3442 10912 13333 3467 -12990 -16222 2704 16892
949A6892p946j4401p816L021J6296J2143j1926j8985j650J3019J2224K000j1220
$$ 16892 8946 -5455 -13271 -10250 6046 18189 6263 -12722 -14372 -1353 10871 12871 1651
962A651j5986L32J8979J2094r101j5403n822N943J5074R062j1769j9374M07J5923
$$ 1651 -14335 -14003 4976 17070 7969 -7434 -13256 -7313 7761 16823 5054 -14320 -13913 2010
976B010J0036j177j1100j4511K696J9739Q680j1541j3543m058O923J5832N881
$$ 2010 12046 10869 -231 -14742 -12046 7693 16373 4832 -8711 -12769 -5846 9986 15867
989A5867j4790j5962L721J4458R246k232j3658j2108N909J9280N915j2789j3002
$$ 15867 1077 -14885 -11164 3294 12540 10308 -3350 -15458 -9549 9731 15646 2857 -10145
1002a0145j995Q195J4997M317j6536j5519O785J5907O448l950j3296j1705Q739
$$ -10145 -12140 -3945 11052 15369 -1167 -16686 -9901 6006 12454 8504 -4792 -16497 -7758
1015g758J9947K936j5126j1269L0J0411J3581N80j7348j2661R129J5460M587o543
$$ -7758 12189 15125 -1 -11270 -11240 -829 12752 13332 -4016 -16677 -7548 7912 12499 5956
1029E956j3159q101J0734J7750L30j5535j0265K672J0787J1777j550j7430r794
$$ 5956 -7203 -15304 -4570 13180 13510 -2025 -12290 -9618 1169 12946 11396 -6034 -15828
1042a5828J0581J4518K413p712j2688n733J2135J6127k104j5393r192M644J1126
$$ -15828 -5247 9271 11684 3972 -8716 -14449 -2314 13813 11709 -3684 -12876 -8232 2894
1055B894J0583l792j7940p543J2594J3697R69q914j2426l784J3464J5375n039
$$ 2894 13477 9685 -8255 -15798 -3204 10493 11462 2548 -9878 -13662 -198 15177 10138
1068A0138j6061p018O114J2056Q396o105j7795m952J4653J2813j965j0514j1104
$$ 10138 -5923 -12941 -6827 5229 13625 7520 -10275 -15227 -574 12239 10274 -240 -11344
1081a1344o15J4716J2813p381j6380m219P965J1283N967q178j5779k148J4582
$$ -11344 -11959 2757 15570 8189 -8191 -12410 -4445 6838 12805 4627 -11152 -13300 1282
1094A282J0872l170j1180r168J278J4590J0195q799j4934k798Q550J0972M769
$$ 1282 12154 8984 -2196 -11364 -10086 4504 14699 5900 -9034 -11832 -3282 7690 12459
1107A2459r739j5083M80J5464Q942m967j1131q685L363J5353Q647j1166j4682
$$ 12459 2720 -12363 -11883 3581 12523 7556 -3575 -12260 -8897 6456 15103 3937 -10745
1120a0745o25J0277J0221K457j0953j4154K571J7102O886p514j1435n973N368
$$ -10745 -11370 -1093 9128 11585 632 -13522 -10951 6151 13037 5523 -5912 -11885 -6517
1133f517J5202N814j3519j3017K132J1111R058J1j2377j1676N659J5382N209q579
$$ -6517 8685 14499 980 -12037 -9905 1206 10264 10275 -2102 -13778 -8119 7263 12472 3893
1147C893j0940m247P027J4254K740j3464j1607L936J1105P596j211j2866j0807
$$ 3893 -7047 -11294 -4267 9987 12727 -737 -12344 -8408 2697 10293 9082 -3784 -14591
1160a4591Q199J5670K084r052r295m555Q567J4580M96j5498r100N662J0586P339
$$ -14591 -6392 9278 11362 2310 -6985 -11540 -2973 11607 12103 -3395 -12495 -6833 3753 11092
1174A1092l426j3748q133J0467J4272O95j0528r685j165R673J2143j225j5314
$$ 11092 7666 -6082 -14215 -3748 10524 11219 691 -8994 -10159 -486 11657 10432 -4882
1187d882q010P398J1246M975m578j3845n839J1951J2973k036j0549q488k98J2067
$$ -4882 -12892 -5494 5752 10727 6149 -7696 -13535 -1584 11389 9353 -1196 -9684 -9982 2085
1201B085J1200o054j4685m237P882J0571M278p812j2525k264J2008J1237l210
$$ 2085 13285 7231 -7454 -11691 -3809 6762 11040 3228 -9297 -11561 447 11684 8474
1214H474j1545p076K636J0703R333n516j5047l844J0294R340K019o679j2809k395
$$ 8474 -3071 -10147 -7511 3192 12525 7009 -8038 -11882 -1588 7752 9771 3092 -9717 -12112
1228a2112J4765R833n959j0904o048L256J3049P246r294j3260j535J0402J0766
$$ -12112 2653 12486 6527 -4377 -10425 -7169 5880 13126 3832 -9428 -10963 -561 10205
1241A0205q59j0243r452J248J2920R039p569j1966k778N254R969O773r398j4296
$$ 10205 9346 -897 -10349 -9101 3819 12858 5289 -6677 -9455 -4201 5768 12541 3143 -11153
1255a1153J714J1537O488l43q614j2012L092J5890N522q670j0387l884P312J2029
$$ -11153 -9439 2098 8586 8243 -371 -12383 -9291 6599 12121 3451 -6936 -10820 -3508 8521
1269H521K583j0800j1456K282J2416P356m867j0022o607L687J3989N476j1569
$$ 8521 11104 304 -11152 -8870 3546 10902 6035 -3987 -10594 -6907 7082 12558 989
1282I89r649Q43N903R986L330j2714j1005N867J1043M355k195j1091q467Q450
$$ 989 -8660 -7817 -1914 8072 11402 -1312 -12317 -6450 4593 8948 6753 -4338 -12805 -4355
1296d355J3482J471r829r758o51J0404R827j772j1936r475O088J4204K560p812
$$ -4355 9127 10598 769 -8989 -9640 764 10591 8819 -3117 -12592 -6504 7700 10260 2448
1310B448q326m704P145J4046m75j3538n183K653O366R548j453j4252n667Q388
$$ 2448 -5878 -10582 -3437 10609 10134 -3404 -8587 -5934 432 9980 8527 -5725 -11392 -3004
1324c004R177K883m836j1744l240J0038J0736q28j1588q520M315J0806N772l472
$$ -3004 6173 9056 4220 -7524 -10764 -726 10010 9182 -2406 -10926 -6611 4195 9967 6495
1338F495j2651o659J0738J2213k197p884p044k912J0027J2327n556j2811k343
$$ 6495 -6156 -12815 -2077 10136 7939 55 -6989 -9901 126 12453 6897 -5914 -8257
1351h257M157P403P459o085j2909j672R351Q323J106q988r228J305J0014R092
$$ -8257 -4100 3303 10762 4677 -8232 -9904 -553 7770 8876 -112 -9340 -8035 1979 11071
1365A1071l950j3130m908P781R443L366n904j2709k547J3876Q408n567p274o856
$$ 11071 7121 -6009 -10917 -3136 6307 9673 3769 -8940 -11487 2389 10797 5230 -2044 -8900
1379h900Q75J2875P617j0123j0048j00N773Q462L078q868j0238J894R981O952
$$ -8900 -8025 4850 12467 2344 -7704 -7804 -2031 6431 9509 641 -9597 -7703 2278 9230
1393I230l059r608o022L861J0205O910p444j3172n37R735P227J473p919j2433
$$ 9230 6171 -3437 -9459 -5598 4607 11517 4073 -9099 -9636 99 7326 8799 880 -11553
1407a1553L008J4655M164p074p468m859M421J3087J935j1219p660J613P542P853
$$ -11553 -8545 6110 10274 3200 -4268 -9127 -4706 8381 10316 -903 -8563 -6950 592 8445
1421H445j041j0176o610L632J0443N408o788r285j933N058R346M269j1190j0415
$$ 8445 7404 -2772 -9382 -5750 4693 10101 3313 -5972 -7905 -2847 6499 10768 -422 -10837
1435a0837M404R402M756n19j0072r128P273J3278J82p473p758k641Q288J0615
$$ -10837 -6433 2969 7725 7206 -2866 -11994 -4721 8557 8739 1266 -6492 -9133 -845 9770
1449I770j839j1280n629L741Q971M798m353q952m224N306J1293J597r076p240
$$ 9770 7931 -3349 -8978 -5237 3734 8532 4179 -4773 -8997 -3691 7602 9199 123 -7117
1463g117L29N920R828J72j3044o814P153Q266L315k912j1401n002J0791J0060
$$ -7117 -6788 -868 8960 9132 -3912 -10726 -3573 4693 8008 5096 -6305 -11307 -516 9544
1477I544k578p786p202L81J0297P287m921j0344l809O342R157J313o287p959j912
$$ 9544 6966 -820 -8022 -7641 2656 9943 5022 -5322 -9131 -2789 6368 7681 1394 -6565 -8477
1492h477Q392R524k863r987l973J995P036Q142l933j3040k277Q596O971J880o338
$$ -8477 -85 9439 6576 -3411 -7384 -5389 1647 9789 5856 -7184 -9461 -865 6106 7986 1648
1507A648j0285L51J1041O758m324q965n185M742R457M055o904r284j749Q786P968
$$ 1648 -8637 -8286 2755 9513 5189 -3776 -8961 -4219 5238 9293 2389 -6895 -8644 142 8110
1522H110k125p041o472L30J0398O912o300r812j029L664P840N509q248j0835K144
$$ 8110 5985 -1056 -7528 -7198 3200 10112 3812 -6000 -7029 -3365 4475 9984 1736 -9099 -6955
1537f955Q750N240o73p837p883L669J1176L524o293q710k034O806P850J489p885
$$ -6955 1795 7035 6362 -1475 -9358 -5689 5487 9011 2718 -5992 -8026 -1220 6630 8119 234
1552B34r269K271J0434M372l997o468n472K626J1478L463r417p167P04N091P917
$$ 234 -9035 -6764 3670 8042 4045 -2423 -7895 -5269 6209 9672 255 -6912 -6208 -1117 6800
1567F800J568j0165p869M773Q738M136l638q780m383N829J0079J298q568p439
$$ 6800 8368 -1797 -9666 -4893 3845 7981 4343 -4437 -8820 -2991 7088 8386 -182 -7621
1581g621J320P369O465j081r046p217N908R845R66m904o386l989O126J0587o43
$$ -7621 -6301 1068 7533 6452 -2594 -9811 -3903 5942 6908 2004 -4382 -8371 -2245 8342 7699
1596G699r970n024K588O308O169j954j0229m697O501Q656J496o047p734j269O945
$$ 7699 -2271 -7295 -4707 1601 7770 5816 -4413 -9110 -2609 6047 7543 1496 -6238 -7507 -562
1611e62Q624j217r823m893M044P103M308k755j0285l956Q563Q044j389n469o409
$$ -562 8062 6845 -2978 -7871 -3827 3276 7584 4829 -5456 -9412 -849 7195 5806 337 -6072
1626f072j435Q491Q087l882r263l241M187P229L626m564r413k058Q454P450j945
$$ -6072 -7507 984 9071 5189 -4074 -7315 -3128 4101 7727 3163 -6250 -8308 146 7596 5651
1641E651p004n533P76Q538O652m767j0283j616N765O390K790m999r863P5R561
$$ 5651 -1353 -6886 -6110 2428 9080 4313 -5970 -7586 -1821 4569 7359 2360 -7503 -7428 2133
1656B133N707l083o877m827J628Q930N378o173r285n67O170O200J323o535q222
$$ 2133 7840 4757 -2120 -6947 -5319 3611 8989 2816 -6469 -7036 -866 5334 6657 122 -8100
1671h100J467R403N365m281p365l676L180Q615L836o817q399M15O955N012P97
$$ -8100 -6633 2770 8135 3854 -3511 -7187 -4007 4608 8444 1627 -6772 -6357 598 5610 6407
1686F407p003p658K970R517L445m937o844k967M193Q485K389p835p761K096P088
$$ 6407 -596 -8254 -5284 4233 7678 2741 -4103 -7070 -2877 5608 7997 162 -7599 -5503 1585
1701A585M771r42p294o307L782R724K082o010o372j412M645Q093Q96q150o877
$$ 1585 6356 5414 -1880 -8187 -4405 5319 7401 1391 -4981 -6393 -1748 6345 7241 -909 -7786
1716g786K988P374L914k070p438n301N388Q753J149o541o010m84N460P574m53
$$ -7786 -4798 2576 6490 4420 -3018 -8319 -2931 5822 6971 430 -5580 -6064 -604 6970 6517
1731F517q853n368L925P123L544l145q080l489O109Q231N2p176n315J33O587O493
$$ 6517 -2336 -7704 -3779 3344 6888 3743 -4337 -7826 -1717 6514 6566 -610 -5925 -5792 795 7288
1747G288k210q860m232N614O651K169l913p467k392O831P980j544p751m224J377
$$ 7288 5078 -3782 -8014 -2400 4251 6420 2507 -4960 -7352 -521 7459 5915 -1836 -6060 -4683
1762d683O576N501l329q700l086O396O424P81m677o851j205P282O817k469p615
$$ -4683 1893 7394 4065 -4635 -7721 -1325 5099 5880 1203 -5648 -6853 429 7246 4777 -2838
1777b838l589K729O618M532m248q622j550O663O007n72m968o250j63Q082N898
$$ -2838 -6427 -3698 2920 7452 3204 -5418 -6968 -305 5702 5130 162 -6088 -6251 1831 7729
1792G729m127p514k523L566O488L436m934q101n09P551M979j474n500n341J025
$$ 7729 3602 -3912 -6435 -2869 3619 7055 2121 -5980 -6489 1062 6041 4567 -933 -6274 -5249
1807e249Q078N102n498o901j631M258O333K423n988p716J425P063M452j925o227
$$ -5249 2829 7931 2433 -4468 -6099 -1841 4492 6915 927 -6789 -5364 1699 6151 4226 -2001
1822b001m592K115Q424L338n447o905o36M653O394Q44o348p308K629P544L339
$$ -2001 -6593 -4478 3946 7284 1837 -5068 -5704 -1051 5343 6187 -161 -7469 -4840 2704 6043
1837F043k856n487m296L323Q593J661o725n716N44M842N825j0p691n167L940O537
$$ 6043 3187 -2300 -6596 -3273 5320 6981 256 -5460 -4916 -74 5751 5741 -1950 -7117 -3177 3360
1853C360K528l384o288k688M349P848P61p214n424J906N279M270n18p001m967
$$ 3360 5888 2504 -3784 -6472 -2123 5725 6486 -728 -6152 -4246 1033 5303 4785 -2216 -7183
1868g183M302P793P31m154n384k512N417P269j338o741m433K416N795M143k359
$$ -7183 -2881 4912 5643 1489 -3895 -6407 -990 6279 4941 -1800 -6233 -3817 1978 6121 3762
1883C762p106l386N160O837M45n335m981q03N282O597j536p814l391L913M913
$$ 3762 -3344 -6730 -1570 5267 5712 377 -4604 -5407 -125 6472 4936 -2878 -6269 -2356 2557
1898B557L053k190p919k775P048N832j230m431n290L98O365N252l241o954k537
$$ 2557 5610 3420 -4499 -7274 -226 5606 4376 -55 -5345 -4947 1418 6670 3429 -3525 -6062
1913f062L994N813J678l879o202j319O231N901k176n602l545J161N429N423l686
$$ -6062 -2068 3745 5423 1544 -4658 -5977 254 6155 3979 -1623 -5168 -4007 1422 6845 3159
1928C159p872r04M350M803K207m490p262L94P163M536k407n575l954K209P095
$$ 3159 -4713 -5617 -1267 3536 5743 1253 -6009 -5615 1548 6084 3677 -1898 -5852 -3643 3452
1943C452K862m581o572p82N334N197m29m721n552P22P636L643l952n490j542J756
$$ 3452 6314 1733 -4839 -5621 -287 4910 4481 -240 -5792 -5070 2566 6209 2257 -3233 -4775 -3019
1959c019O800K917n739o377J153M759M205N2n854n353K790P069K152l100o427
$$ -3019 3781 6698 959 -5418 -4265 494 4699 4751 -1103 -6456 -3666 3403 5555 2455 -3972
1974c972j879M467O246Q03n780n642J274O199L366j600n560l943K636P674J101
$$ -3972 -5851 -1384 4862 5665 -115 -5757 -4483 1716 5082 3482 -2078 -6021 -3385 4289 5390
1989E390n156l856r35L273O155L87p018l913K418N096L007j270o430l035L939
$$ 5390 234 -3622 -4557 -1284 4871 5258 -1760 -5673 -3255 1841 4848 3578 -2852 -5887 -1948
2004a948O269Q36m480n264l3M999M528m13o680m293L715O643N65k689n006k745
$$ -1948 4321 5157 677 -4587 -4620 379 4907 4494 -2186 -6479 -2764 3879 4444 1755 -3251 -5996
2020e996N090O705j706n093l000J63M400N120k067p018j798L385M931J915l217
$$ -5996 -906 5799 4093 -1000 -4000 -3837 563 5683 3616 -3402 -5200 -1815 3116 5031 1814
2035A814n944j010N194N091m77o361l763K174N142L575k261o860k510N756M967
$$ 1814 -4130 -5140 54 5145 4668 -1693 -5456 -3282 1860 5435 3174 -3686 -6196 -440 4527
2050D527p43l354m675q35O570M353l235n048j763J581N203L219m311n337n28L837
$$ 4527 3784 430 -4245 -5080 1490 5843 2608 -2440 -4203 -2622 2581 5800 1489 -3848 -4376 -539
2066e39M587M67n089m267P32N425M672k969o588j747L779M357K742m156o833K40
$$ -539 4048 4515 -574 -4841 -4109 1316 5988 3019 -3569 -5316 -1537 2820 5562 1406 -5427 -5187
2082e187O887L029j602m116m517J689P043K359m681m583o57L037N111J017n230
$$ -5187 1700 4729 3127 -989 -5506 -3817 3226 5585 904 -3679 -4336 -1299 3812 4829 -401
2097d01l840L23M952M210k245m934k651J677N761K956m821n988Q77M113L517J046
$$ -401 -4241 -3918 1034 5244 2999 -1935 -4586 -2909 2852 5808 987 -5001 -4124 -11 3506 4552
2113D552m900n961K941O221J520k431m269k813L705N571K86m843l808M26M407
$$ 4552 -348 -6309 -3368 2853 4373 1942 -2327 -5140 -1435 4136 4422 -421 -4229 -3803 604
2128F04M067j432m644l239K072N577K029l982m162j304K798N852J207o167m534
$$ 604 4671 3239 -1405 -4644 -2572 3005 5034 1052 -3110 -4414 -1616 4236 5443 -724 -5258
2143e258K370M016L365p90o330l389M648N140L01l210m711r70N126M432j575m755
$$ -5258 -2888 1128 4493 3703 -2627 -6016 -1368 3772 4073 863 -3848 -4818 308 4740 3165 -1590
2159a590l108K247M495K579k575m741k185L606N571k17m739l142k26L683N654
$$ -1590 -4698 -2451 2044 4623 2048 -2693 -4878 -1272 4299 4082 -657 -3799 -4025 -342 5312
2174E312j833o149j795K952L538K827k562o304j243N494L869l21m171m346J388
$$ 5312 3479 -2670 -4465 -1513 2025 4852 2290 -4014 -5257 237 4106 3785 -386 -4732 -3344
2189c344N111L147k393n199k281L777M375O08k823m406j157N178M353k271l738
$$ -3344 1767 4914 2521 -2678 -4959 -1182 3193 3801 978 -3428 -4585 593 4946 2675 -1063
2204a063k542O31M702L654l739n435j23L612L565J011m254m697R69N179L076j927
$$ -1063 -3605 -2974 1728 5382 1643 -3792 -3915 -303 3262 4273 19 -4678 -3709 1470 4546 2619
2220B619m780k596K882M728J463l047n351j06M886L002l29l771m167J182N765
$$ 2619 -2161 -4757 -1875 2853 4316 1269 -4082 -4188 698 3700 3371 -400 -4567 -3385 2380
2235B380K357l126l740j864J862N124J776m588m527J057L868L763j256m546l331
$$ 2380 4737 1611 -2129 -3993 -2131 2993 4769 181 -4346 -3289 579 4342 3086 -1460 -4791
2250d791K075N555K021l593m844j38L183M053P91m674m553J734N091J737j203
$$ -4791 -2716 2839 4860 1267 -3577 -3715 -532 3521 4312 -362 -4915 -3181 1910 3647 2444
2265B444m223l339L286N363R66m314l356l79L159M236j34m899l553K457M304K164
$$ 2444 -1779 -5118 -1832 3531 4497 183 -3173 -3552 -393 3843 3709 -1190 -4743 -2286 2018 4182
2281D182k411m334k020L341N013M04m747l413R23L651L337l65n734k937L700M154
$$ 4182 1771 -2563 -4583 -1242 3771 4175 -572 -3985 -3062 589 3926 3561 -2173 -5110 -1410 2744
2297B744J062k431m048j818L982M605o59m638k659J104L827L262j543n305j864
$$ 2744 3806 1375 -2673 -4491 -509 4096 3437 -1201 -3860 -2756 1071 4333 2790 -2515 -4379
2312d379L388M192M99l058m046n16L983M557j203n197k206J911L718K644k274
$$ -4379 -991 3201 3700 642 -3404 -3920 63 4620 3417 -1780 -3986 -2075 1643 4287 2013
2327B013n190p73L715L669l06l125l449j10M746L428k417m482j725K369M028J895
$$ 2013 -3177 -3950 -235 3434 3128 3 -3446 -3556 1190 4618 2201 -2281 -4006 -1637 2391 4286
2343D286l145m697o12M790L254r76l542l000O18M655K909k869m418j052K812L849
$$ 4286 1141 -3556 -4168 622 3876 2900 -642 -3642 -3024 1631 4540 1671 -2747 -3799 -987 2862
2359B862J369l594m683P08M646K514j369m015j774J036N010J770l327m158m34
$$ 2862 4231 637 -4046 -3338 1308 3822 2453 -1562 -3336 -2300 2710 4480 1153 -3005 -3439
2374c439L174L139N72l827l383O68M883J924k176l566k199K516M414J786m040
$$ -3439 -265 2874 3446 -381 -3764 -3096 1787 3711 1535 -2031 -4230 -1714 2700 4486 446
2389D46m046L25L691K867k38l958l375J904M698J458k438l819j495K897M525N5
$$ 446 -3600 -3275 416 3283 3045 -913 -4288 -2384 2314 3772 1334 -2485 -3980 -1083 3442 3497
2405C497l875l271O98L939K240m91m213k607K158M746J095l113l579n85L173L691
$$ 3497 -378 -3649 -2951 988 3228 2737 -1476 -4083 -1925 2821 3916 803 -2776 -3361 -188 3503
2421C503J6m435l035J809L699K117j629m044j995K986L949Q61l997k802k99L503
$$ 3503 3519 -916 -3951 -2142 1557 3674 2045 -1999 -3994 -1008 2941 3802 -195 -2997 -3296 207
2437B07L586p65m510k456K501L571J428k055m141j623L430M231r6l934k677N25
$$ 207 3793 3028 -1482 -3938 -1437 2134 3562 1507 -2634 -4257 -827 3404 3308 -626 -3303 -2778
2453b778L414L223j449m719j764L164L077J207k596l791k44L229L677j089l566
$$ -2778 636 3859 2410 -2309 -4073 -909 2168 3375 779 -3012 -3256 -27 3650 2561 -1005
2468a005k443J331L399K612k210m195j390L844K902K34k698l738O1L979L324k125
$$ -1005 -3448 -2117 1282 3894 1684 -2511 -3901 -57 2845 3079 381 -3357 -3296 683 4007 1882
2484A882l279k040J354L812K236k685m602lL180L175j77l040l160K64M550K317
$$ 1882 -1397 -3437 -2083 1729 3965 1280 -3322 -3325 -145 3030 2853 -187 -3347 -3083 1467 3784
2500C784k187l582j752K391L915J347l128m083J44L906K422p29l295k912J555
$$ 3784 1597 -1985 -3737 -1346 2569 3916 788 -3295 -3151 755 3177 2448 -847 -3759 -2204
2515b204M263J636k534l650n78K338L614M19l648l064P96L566K514j723l251j833
$$ -2204 2059 3695 1161 -2489 -3067 -729 2885 3304 -344 -3408 -2612 954 3468 1745 -1506 -3339
2531c339J800M067J225l458l089j46K681L104M80m044l027K039L141J613j394
$$ -3339 -1539 2528 3753 295 -2794 -2940 -259 2845 3325 -719 -3746 -1707 1434 3047 1653
2546A653l155k080K411M037K24l216l027M48L011K808m62l966k201J990L504J234
$$ 1653 -1502 -3582 -1171 2866 3090 -126 -3153 -2705 306 3114 2652 -1314 -3515 -1525 1979 3213
2562C213k288l085j237K420M160p6m221j978R24L144K141q09m032j904K635L355
$$ 3213 925 -2160 -3397 -977 3183 3107 -1114 -3092 -2168 976 3117 2308 -1724 -3628 -993 2362
2578B362M03k244l011o26L201L296o51l623k414J339L424J803j603l397j792K933
$$ 2362 2765 521 -2490 -3116 85 3381 2730 -893 -3307 -1968 1456 3259 1656 -1741 -3533 -600
2594f00L589j47l039k363l27L290L306j390l847j500J698K690J901k100l888n64
$$ -600 2989 2842 -197 -2560 -2887 403 3709 2319 -1528 -3028 -1330 1360 3261 1161 -2727 -3291
2610c291L546K557K3l089k767O56L602K294j831l545j460K489K898O29k272l032
$$ -3291 255 2812 2835 -254 -3021 -2365 1237 3531 1700 -1845 -3305 -816 2082 2711 439 -2593
2626b593l84L575K453j264k573k046P98L591K435l002l418k62K171L054O78l309
$$ -2593 -2977 598 3051 1787 -786 -2832 -2034 1557 3992 990 -2428 -2690 -519 2535 3213 -96
2642i6l291Q27L540J947j123l031j973J732L417J428k499l795K44L093K207l26
$$ -96 -3387 -2560 980 2927 1804 -1227 -3200 -1468 1949 3377 878 -2917 -2673 420 2627 2301
2658B301k523k959R12L906J422j917k725j092J397L678O11l315k357L14K680K561
$$ 2301 -222 -3181 -2269 1637 3059 1142 -1583 -2675 -1278 2400 3011 -304 -2661 -2347 333 2894
2674B894n38l615k135J637L671J070k167l060l10K433K838L41l453k498Q74L412
$$ 2894 2356 -1259 -3394 -1757 1914 2984 817 -2243 -2553 -120 2718 3059 -394 -2892 -2018 1394
2690A394J409j360k785j727J843M217m81k642k056k50K151L295o16l501j598J184
$$ 1394 2803 1443 -1342 -3069 -1226 2991 2510 -132 -2188 -2438 -287 3008 2392 -1109 -2707 -1523
2706a523K561J765j429l099j347K227L582K54l133k685L17K913K804r73l773j780
$$ -1523 1038 2803 1374 -1725 -3072 -845 2737 2991 -142 -2827 -2510 403 3207 2234 -1539 -3319
2722c319K448K637R41j667l262j054L522K597r78k124k172M44K939J913j308l248
$$ -3319 -871 1766 2707 1040 -2222 -3276 246 2843 1865 -259 -2431 -1987 952 2865 1557 -1691
2738a691p92J462K871J080k578k802M2K573K545k01l609j640J327K328K539k195
$$ -1691 -2483 -1021 1850 2930 352 -2450 -2408 165 2710 2509 -1100 -2740 -1413 915 3454 1259
2754A259l970j45L058J912m2j986k848N07L444J671j702k369j623J462L055J021
$$ 1259 -2711 -2856 202 2114 2072 86 -2762 -2255 1189 2860 1158 -1211 -2834 -1372 1683 2704
2770B704k167k619m07K631K632p49k760j522N4L147K322k329k922k82J417K585
$$ 2704 537 -2082 -2489 142 2774 2025 -735 -2257 -2203 944 3266 937 -1985 -2267 -850 1735
2786A735J430k969l391J164L186J068l06k733k387J817K965Q58k045k272o21K016
$$ 1735 3165 196 -3195 -2031 1155 2223 1917 -816 -3203 -1386 1579 2437 392 -1880 -2501 -485
2802d85K880j4k677k462M64L773J214j584k211j347Q62L770O23k900k238k6K351
$$ -485 2395 2381 -296 -2758 -2294 1479 2693 1109 -1102 -2449 -1587 2183 2806 -94 -2332 -2358 -7
2819gK438J66l784k152J846K896J225j544k805p84K160K509J20k528k479P69K690
$$ -7 2431 2597 -1187 -3339 -1493 1403 2628 1084 -1721 -2505 -345 2164 2284 -244 -2723 -1954 736
2836G36J601q45k518k078J846L078O88k126j987j072K224L354r11l034j148P59
$$ 736 2337 1492 -1026 -3104 -1258 1820 2508 382 -1605 -2677 -453 2901 1990 -1044 -2192 -1433
2852a433K422J845j142l342q72J844K509L43j952k895L33K765K459j087k855j773
$$ -1433 989 2834 1692 -1650 -2522 -678 1831 2174 222 -2673 -2340 425 2884 1797 -1058 -2831
2868b831J816K544R12j305k649j311K646K430O4k378k228j6K837K656j721k818
$$ -2831 -1015 1529 2441 1136 -1513 -2824 -178 2252 2316 -62 -2290 -2306 531 3187 1466 -1352
2884a352j080J367K646J050k032l010J53K333K483p17k784j588O68L052J400j438
$$ -1352 -2432 -1065 1581 2631 599 -2411 -2258 75 2558 1841 -943 -2531 -1863 1189 2589 1151
2900A151k964l03J602K359J96j822k862M82L052J711j077k166j866R82L376J084
$$ 1151 -1813 -2116 -514 1845 2041 219 -2643 -2161 891 2602 1525 -641 -2507 -1525 1851 2935
2916B935k499k362l62K123K185R6k231k397P75K815J589j390k510j113J351K832
$$ 2935 436 -1926 -2288 -165 2020 2116 -115 -2512 -1737 1078 2667 1277 -1233 -2346 -995 1837
2932A837Q27k383k688N34K383J555q6k590k310J573L211P34j985j986r06J546
$$ 1837 2664 281 -2407 -1873 510 2065 1979 -611 -2921 -1348 1863 2597 612 -1374 -2280 -734
2948g34K865K45k640k281P04K780J377q33k324j856J573K683N54j946k057n28
$$ -734 2131 2376 -264 -2545 -1841 939 2316 1483 -841 -2697 -1124 1559 2113 167 -1890 -2418
2964b418K194K310j40k501k098R31K479J346j018k637q20J664K997N4k213j849
$$ -2418 -224 2086 1946 -555 -2653 -1722 757 2103 1085 -1552 -2372 -708 2289 2343 130 -1719
2980a719m68K344K266o37l063r49J424K299M72j244k496o18J935K663J4k359j987
$$ -1719 -2187 157 2423 1786 -1277 -2226 -802 1497 1969 725 -1771 -2389 -454 2209 2223 -136 -2123
2997b123K72K171J813m06l462o46J811K412J59j373k202q36K609J840n14j959
$$ -2123 -1851 320 2133 1727 -1735 -2381 -570 1842 2001 628 -1574 -2410 199 2039 1525 -434
3013d34j982J106K262J472j211k645j060K433K139q0j709k276m76L312J674j271
$$ -434 -2416 -1310 952 2424 1213 -1432 -2492 -59 2080 2000 291 -1985 -2461 851 2525 1254
3029A254k573q20Q28K302J410j721l024J57K623J567L0k474j666K81K732J870
$$ 1254 -1319 -2139 -1311 991 2401 680 -2344 -2187 436 2003 2033 -441 -2107 -1826 906 2776
3045B776j737k466r06J628K330O60j818k483L11K253J299j25k235j819O54K864
$$ 2776 1039 -1427 -2333 -705 1625 2285 467 -2016 -1705 548 1847 1722 -513 -2332 -1678 1186
3061A186J348j753k569J06J611J925N8j816k439P39K467J435j042k143j174Q40
$$ 1186 2534 781 -1788 -1682 -71 1854 1912 96 -2343 -1604 863 2298 1256 -887 -2061 -1221
3077a221K880M98j690k350L7J769J867L34k605j729N99L022O86j179k080r82J768
$$ -1221 1659 2157 467 -1883 -1846 -77 1790 2124 -481 -2210 -1611 1411 2097 918 -1162 -2144 -376
3094c76K176L82j987k444M15K007J777j94k687j652J356K513O32j342k112p19
$$ -376 1800 2182 195 -2249 -1834 173 1950 1756 -931 -2583 -1227 1286 1918 576 -1536 -2255
3110b255K033K112j97k074j566P89J948J432q48k441j473K262K132J98j653k027
$$ -2255 -222 1890 1693 -381 -1947 -1158 790 2222 1374 -1067 -2540 -278 1854 2052 399 -1628
3126a628l88K199J884m21k188j369R39J577J402r41k625n13J896J854K59k355
$$ -1628 -2016 183 2067 1646 -542 -1911 -972 605 2007 1066 -1559 -2072 -176 1678 1937 -418
3142d18j340P5J857K114p98k503j076J416J609J285j837k150J3J857J846k47k103
$$ -418 -1758 -1683 174 2288 1490 -1013 -2089 -673 936 2221 384 -1766 -1753 104 1950 1703 -400
3159d00j712N78K520J541j442k473p73J694J980L77j877j876J61K077J875p98
$$ -400 -2112 -1534 986 2527 1085 -1388 -2161 -467 1513 1890 13 -1863 -1702 375 2250 1452
3175A452k295r90M93K348J279j549k684j01J832K022J51j922j868K96K431J393
$$ 1452 -843 -1833 -1340 1008 2287 738 -1946 -2047 -215 1807 1958 36 -1832 -1536 895 2288
3191B288j424k046q41J454J705P49j500k178n7J811J739j62j811j694L93K289
$$ 2288 864 -1182 -2023 -569 1136 1885 385 -1793 -1850 -39 1700 1538 -273 -1967 -1574 715
3207G15J673j601j952j068J622K096O55j915k109N39J725J514l42k173j610J016
$$ 715 2388 787 -1165 -2233 -611 1485 2140 225 -1884 -1345 380 1894 1552 -621 -2231 -1215
3223a215K782K91j385j666n66J731K021k75j989j628N77J898J241m85k108q63
$$ -1215 1567 1858 473 -1193 -1759 -28 1993 1718 -271 -1899 -1322 576 1817 1332 -776 -1639
3239a639R66K226K86j922j355j44J232K491m38k432j703J333K093Q60p98k519
$$ -1639 -673 1553 1839 -83 -1438 -1582 -350 2141 1703 -729 -2432 -1099 994 1854 1056 -1463
3255a463l79J515J967O20k640j389J29J742J725l71k300j370J570J952M10j633
$$ -1463 -1842 -327 1640 2260 -380 -1769 -1640 102 1827 1456 -844 -2214 -644 1308 1718 85
3271H5j445m20J674J858k15j970j287N09J663J538q69k619m56J537K038J90j486
$$ 85 -1360 -1780 -106 1752 1537 -433 -1720 -1211 452 1990 1121 -1498 -1954 -417 1621 1811 325
3288C25j790q21K372J921r20j890j466J522J894O08r53k113n55J860J711k26j582
$$ 325 -1465 -2286 86 2007 1087 -803 -2269 -747 1147 1755 802 -1311 -1866 -6 1705 1479 -103
3305a03j434p1K089J592j215j794q69R12K529O68k050j888k18K078J411l43j932
$$ -103 -1537 -1608 481 2073 858 -936 -1805 -893 1636 2304 254 -1634 -1852 226 1637 1294 -638
3322f38j301Q13K208P66j063k056m08J600J555N05j808k092K16K298J111r25j512
$$ -638 -1939 -1126 1082 1848 785 -1271 -1679 -79 1476 1981 173 -1919 -1703 595 1706 781 -731
3339g31j164O36K538Q29j817j516k18J278J705M03k088j791R61J622J417j155
$$ -731 -1895 -1259 1279 2108 291 -1225 -1443 -165 1540 1943 -145 -1936 -975 647 2064 909
3355I09j980q68J085K176Q12j814k152M23J484J280j64j715j766J076K207P58
$$ 909 -1071 -1939 -854 1322 2134 320 -1832 -1409 75 1355 1191 -524 -2290 -1214 993 1751
3371A751r32j922q28J416K358k77j755j453M07J510J707q26j922j039J153J737
$$ 1751 819 -1103 -1931 -515 1843 1566 -189 -1642 -1235 275 1982 1156 -766 -1805 -652 1085
3387A085Q19j369k016q2J472J928m52j797j551J159J754N55m69k440q50J700K101
$$ 1085 1904 535 -1481 -1563 -91 1837 1385 -412 -1963 -804 950 1505 1036 -1404 -2254 -554 1547
3404A547k80j078j717l12K240J124k21j990j218P44K211O71j102j719n34J224
$$ 1547 1267 189 -1528 -1840 400 1524 1303 -687 -1905 -1161 1050 1721 619 -1100 -1634 -410
3420d10K267j75j775j780Q21J478J579r96k000p61J500J377P51j428k053K07J791
$$ -410 1857 1682 -93 -1873 -1052 426 2005 1009 -991 -1752 -252 1125 1876 448 -1605 -1398 393
3437C93J151o17j398j350P62J735J052j134j653r76J819J612n5j247j755m48K752
$$ 393 1544 927 -471 -1821 -1059 676 1728 594 -1059 -2035 -216 1396 1341 94 -1661 -2109 643
3454F43R74o95j956l62P59J559Q49j317k198N0J644J618N2j712j669P07J916Q00
$$ 643 1617 922 -1034 -1396 -637 922 1771 454 -1744 -1694 -50 1568 1620 -92 -1761 -1054 862 1662
3472A662j001j566q90J191J878M38j346k055K20J428J814o54j490j327M94K275
$$ 1662 661 -905 -1795 -604 1274 1712 366 -1689 -1469 -41 1773 1119 -371 -1698 -1204 1071
3488A071O79j480j400l91O91K374L20k216j180M08J905R39o94j802r38J271J703
$$ 1071 1750 270 -1130 -1521 -830 1544 1864 -352 -1532 -1124 781 1720 1026 -776 -1714 -443 1260
3505A260M00j641j650n6J664J687m42j699j421Q80K110P96j062j644r20J114J960
$$ 1260 1660 19 -1631 -1687 -23 1664 1222 -477 -1898 -1018 1092 1888 826 -818 -1738 -624 1336
3522A336Oj209j842K98J302K049r68j770r87J210J618O26j320j998j7J457J769
$$ 1336 1342 133 -1709 -1411 -109 1940 972 -798 -1785 -575 1043 1669 349 -1649 -1666 -209 1560
3539A560p0k040r18L88J700J005n98k142q46J710J531L25j336j541k87J594J700
$$ 1560 1490 -550 -1468 -1080 620 1625 1027 -1115 -1961 -251 1280 1605 269 -1272 -1559 35 1735
3556A735p86j181j685J016J514J418j086k331n45J589J812J6j722j422N41J620
$$ 1735 949 -232 -1917 -901 613 2031 945 -1386 -1931 -342 1470 1486 -236 -1658 -1117 503
3572E03J162n69j919j072J386J491O12j084j619l19J501J148K99j518j447L53
$$ 503 1665 1096 -823 -1895 -509 982 1594 510 -1109 -1428 73 1221 1520 2 -1445 -1092
3588a092J900R56j125j509p06J012J822L05j196j860J1K046R59l05j897q25O70
$$ -1092 808 1764 639 -870 -1576 -564 1258 1563 367 -1493 -1482 564 1523 1218 -679 -1504 -834
3605h34J797Q81j364j456m83J573J141N03j937j520N00K107L19m80j385q62Q06
$$ -834 963 1844 480 -976 -1459 114 1255 1758 -179 -1699 -1199 908 1227 747 -638 -1500 -694
3622f94K088K50j294j444k52J456J343r0k046j096O54J914O21p29j810m99J400
$$ -694 1394 1644 350 -1094 -1346 110 1453 1363 -683 -1779 -1125 789 1410 681 -1129 -1628 -228
3639b28J588j90j012j776L03J704J172l37j742j128Q80J877M48j171j152p99J289
$$ -228 1360 1170 158 -1618 -1315 389 1561 1224 -518 -1646 -766 1111 1559 388 -764 -1563 -274
3656b74J454M1j719r08K57J694R33p86j424n72J005J516N2j064j347j36J256J592
$$ -274 1180 1221 -498 -1406 -1149 545 1478 692 -732 -1304 -299 1217 1269 205 -1142 -1278 -22 1570
3674A570j93j932j070R52J574L76n79j606q63J602J540R4j291j593J80J707Q66
$$ 1570 1377 -555 -1625 -673 901 1277 698 -908 -1771 -169 1371 1465 174 -1419 -1239 468 1334
3691A334m35j941m45J064J694L77j443j390l42J384J759n57j084j322L04J563
$$ 1334 899 -1042 -1487 -423 1271 1648 205 -1185 -1527 -143 1616 1059 -25 -1347 -1043 520
3707E20J071j072j323o72J478Q79N08p51j769j03J653J148o40j262j243L44J990
$$ 520 1591 519 -804 -1476 2 881 1389 638 -1131 -1234 419 1567 927 -335 -1578 -1234 756
3724G56Q55j277j364m76J502J558k03j572r55j29J943R56n48k051l41Q36R77J118
$$ 756 1611 334 -1030 -1506 -4 1554 1351 -221 -1176 -1305 638 1594 1046 -1005 -1346 -510 467 1585
3742A585j214j787K79J415R41j69j662q94N12J698Q53j019j256n37R97J550J2
$$ 1585 371 -1416 -1137 278 1219 1050 -612 -1506 -994 704 1557 538 -718 -1255 -258 1292 1304
3759A304j645j012J13J830Q86n49j526j015Q36J737P13j456j340j30J045J362
$$ 1304 -341 -1353 -1240 590 1476 927 -599 -1614 -778 959 1672 216 -1124 -1254 -209 1153
3775A153j0j271j607N78J850O26q14j418o21R75J645M08j638j323N09J037J520
$$ 1153 1143 -128 -1735 -1157 693 1319 505 -913 -1534 -559 1086 1494 -144 -1467 -958 79 1599
3792A599o19j096j203P29J294M91o46j283r96J563J464p4j615q03N03R71J135
$$ 1599 980 -116 -1319 -590 704 1195 549 -734 -1730 -167 1297 1223 -392 -1195 -692 279 1414
3809A414l79j882q04J258J087O29j117j241k16J316J093j3j380q03K38J149J453
$$ 1414 1035 -847 -1651 -393 694 1323 206 -1035 -1251 65 1158 1145 -235 -1038 -800 349 1802
3826A802j024j750l41J190J332m4j244r48k93J476J167n85j435n43Q29J083P37
$$ 1802 778 -972 -1313 -123 1209 1165 -79 -1027 -1320 156 1323 738 -697 -1240 -411 672 1409
3843A409r99j404l28J335J242p3j240j058K69J528Q26q78j237p02J221P56M36
$$ 1409 410 -994 -1322 13 1255 1182 -58 -1116 -847 681 1507 629 -608 -1310 -89 667 1103
3860A103q22j236l10J253J347l61j379j058O89J612N35j016j265j64P45J266L92
$$ 1103 281 -955 -1265 -12 1335 974 -405 -1463 -774 838 1373 357 -908 -1072 -327 939 1331
3877A331j202j384K55J461J032p38j381m60M74J684K65j205j191M8J199R10J0
$$ 1331 129 -1255 -1000 461 1493 755 -626 -1086 -612 1072 1337 132 -1059 -1011 188 1098 1108
3894A108j147j411N96J767M62q70r39p99Q46J426Q3q28j462O7J231R46J68j540
$$ 1108 -39 -1450 -854 913 1375 505 -434 -1233 -387 1039 1122 294 -1168 -1101 130 1076 1244 -296
3912b96j238P31J464R57j385j347OQ09J773l02j511j007L58J568O56l79j394r25
$$ -296 -1534 -803 661 1618 233 -1114 -1108 -299 1474 1172 -339 -1346 -988 580 1236 857 -537 -1462
3930a462J022J223K57q87q95q0R28J004Oj290p86L69J327K34n70j116m08P98J375
$$ -1462 -440 783 1040 153 -742 -822 106 1110 1116 -174 -960 -591 736 970 400 -716 -1124 -326 1049
3949A049J30j508o83j90J536P37k18j878l01O20J412M48p67j287m85J553R09O0
$$ 1049 1179 -329 -1012 -1202 334 1071 853 -1025 -1326 -706 706 1154 387 -900 -1385 168 1077 1137
3967A137j494j149P06J221J113q62j452m96Q13J285K01r00j026m12J454J131m94
$$ 1137 -357 -1506 -800 421 1534 672 -780 -1276 -463 822 1023 123 -903 -1315 139 1270 776
3984G76r79j106K94J799N34r71j350j39J020J165J72j362p95R5J423N21l15j528
$$ 776 -203 -1309 -1015 784 1318 347 -1003 -1142 -122 1043 1215 -147 -942 -847 576 1097 782 -746
4002g46n15O48J371M36j051j109r8J202Q20j16r68j215L57J565O09o46j377m50
$$ -746 -1261 -613 758 1194 143 -966 -1064 138 958 842 -126 -1341 -984 581 1190 544 -833 -1283
4020a283O32J512J43q84j249J7J373J048n39r84r86M71J504J0n85q97j39P71J065
$$ -1283 -651 861 1004 120 -1129 -1112 261 1309 770 -214 -1200 -729 775 785 200 -697 -836 -65 1000
4039A000P2j264j292O62J265M46k36j348n51P41J541P0p60j128r5Q46J198m01
$$ 1000 1072 -192 -1484 -822 443 889 653 -695 -1246 -505 1036 1106 346 -782 -877 -31 1167 766
4057G66r03r34M44J566R5n81j180j00O09R04K12r92r04K8J240P60k17j393q97
$$ 766 -137 -1071 -627 939 1034 453 -727 -827 -218 686 898 -94 -998 -970 270 1030 813 -580 -1477
4076a477J268Q80J87m53j404j26R83J118o4r32r52j25J596M41l40j286l73Q50
$$ -1477 -209 671 858 405 -999 -1125 -142 976 912 -20 -972 -1097 499 940 600 -686 -1059 -209
4094b09R64L65q42r60l76J042J194l51j533l97P46Q36Q63q53j188o07J211Q89
$$ -209 755 1120 278 -682 -1058 -16 1178 827 -706 -1103 -357 479 1342 489 -699 -1306 -95 794
4112G94mp00j164N53P21R13l98j521j93Q53Q63J93q12j096n6J060J027k5j190
$$ 794 790 90 -1074 -521 200 1113 715 -806 -999 -146 717 910 98 -998 -1054 6 1033 1008 -182
4131a82j116N70J262O48n91j628j05O92R05Q22j489p96N5J140P49p86l77p31N89
$$ -182 -1298 -728 534 1182 591 -1037 -1142 -450 455 1277 -212 -1008 -953 187 936 150 -227 -958 -369
4150c69R34K63l91r16m15R51P85K38j266q85J28R84J164j127l84p25O41J241L11
$$ -369 565 828 437 -479 -894 57 842 1080 -186 -1071 -943 41 1205 78 -306 -1031 -390 851 1162
4169A162j092j039J03J278M30l0j151r13P86R09N43q18j187nR01R25Q4j086q67
$$ 1162 70 -969 -866 412 842 812 -339 -1252 -466 443 986 168 -1019 -1024 -123 802 886 -200 -1067
4188a067N77R40L68l52r79p27R03Q99L64o68j126r5Q27J064p4j066o69M91P64
$$ -1067 -490 450 818 466 -513 -1240 -337 562 926 258 -868 -963 -136 928 854 -212 -881 -390 374
4207C74O95m04j079m19O11J046J14o17j389K10R58J033m05j197n00K22J003N50
$$ 374 1069 665 -414 -833 -222 824 938 321 -1068 -858 100 1133 728 -469 -969 -747 256 806
4225H06m57p93o37Q98J145j57q92r32M21O58J020p36p76l17L99Q97M06p16r65
$$ 806 349 -444 -1081 -183 962 805 -87 -1019 -598 60 1080 344 -432 -749 -350 547 953 237 -728
4244g28j63R46Q71m53n45l99k84J430L86n49j231m48J090N88K78o32j002mR62
$$ -728 -891 55 926 473 -72 -471 -755 675 1061 512 -719 -1167 -77 511 789 157 -845 -849 113
4263A13R05n68r43k25j36J460L55p33q80j91R25R38r8j141n53K9J195M87o79n53
$$ 113 1018 450 -493 -718 -854 606 961 228 -652 -843 82 1020 922 -219 -772 -743 452 939 260 -293
4283b93l77M80R37M80m86j296k08Q89P38q7r69j009O99J074M05p68p73l62P05
$$ -293 -670 -190 747 1227 741 -555 -763 126 864 777 -192 -1201 -502 572 977 209 -564 -926 -221
4302b21Q91j35l58r29J33Q89N89j43r86n66M01J293q1o44r02o1O59R48j01j023
$$ -221 670 535 177 -752 -619 270 859 716 -270 -836 -435 858 777 133 -769 -830 -171 777 676 -347
4322c47n89L52R59L66j30j201m20O19J161J23o00j476K74R33J100n25p89m83L15
$$ -347 -936 -584 375 741 611 -590 -1010 -391 770 893 293 -1183 -909 24 1124 599 -190 -673 -358
4341c58O66Q21p62j150j87P16J005k10n16p32j67Q94N80r5q30m66M86J008K40
$$ -358 308 1129 367 -783 -970 -254 751 541 25 -707 -874 20 600 505 -325 -791 -305 703 943
4360I43j000p19J20O29Q36k0j081m29K08O12P38l27j038n18P84J039l54o81n88
$$ 943 -57 -776 -656 -27 809 789 -292 -721 -513 99 837 510 -528 -1046 -262 777 423 -258 -846
4379h46K13P86P86m27q45m99J81J173M94q11r96R5R27L04p7r47l21K25N56P13
$$ -846 -633 153 939 512 -333 -832 -651 522 1016 205 -791 -696 231 535 458 -489 -810 -585 -29 684
4399F84k20q88o79Q30J077j64k58j273L00Q80M07m26m96p10M04R52M60o78p66
$$ 684 464 -424 -1103 -273 804 640 382 -891 -591 289 696 270 -226 -936 -532 420 880 202 -564
4418e64p6K80J100K2q43n79K03O09O99k82j051l60K97R80N33n11j256p6Q48P24
$$ -564 -640 -360 740 762 -81 -660 -457 152 851 569 -482 -842 -545 435 968 457 -799 -875 -27 697
4438F97j18o58p71K41J128K64k11j025k20L71Q41K04n58j029N72O4R28l21m10
$$ 697 579 -79 -850 -609 519 783 572 -453 -673 -302 539 743 185 -844 -272 -208 720 399 -11
4457a1q96M13J315J85p60p02l24O31P83j10l84q59n6P77J038p51o33n04N53R52
$$ -11 -907 -494 821 1006 246 -456 -780 -149 634 524 140 -719 -775 2 1040 289 -344 -848 -295 657
$$ [...]
8191C60
##END NTUPLES=NMR FID
##END=
