##TITLE=1H_DE-73-1
 D2O
 8 sc, 
 7.11.2024
##JCAMPDX= 6.0         $$ Bruker NMR JCAMP-DX V2.0
##DATA TYPE= NMR FID
##DATA CLASS= NTUPLES
##ORIGIN= UXNMR, Bruker Analytische Messtechnik GmbH
##OWNER= root
$$ XWIN-NMR		Version 3.5
$$ Thu Nov  7 13:48:53 2024 Russian Standard Time (UT+4h)  she@DPX200
##.OBSERVE FREQUENCY= 200.1318
##.OBSERVE NUCLEUS= ^1H
##.DELAY= (6, 6)
##.ACQUISITION MODE= SIMULTANEOUS
##.ACQUISITION SCHEME= undefined
##.AVERAGES= 8
##.DIGITISER RES= 18
##SPECTROMETER/DATA SYSTEM= spect
##.PULSE SEQUENCE= zg30
##.SOLVENT NAME= D2O
##.SHIFT REFERENCE= (INTERNAL, D2O, 0, 15.7039)
##AUDIT TRAIL= $$ (NUMBER, WHEN, WHO, WHERE, WHAT)
$$ ##TITLE= Audit trail, XWIN-NMR		Version 3.5
$$ ##JCAMPDX= 5.01
$$ ##ORIGIN= Bruker BioSpin GmbH
$$ ##OWNER= she
$$ F:/spectra/data/she/nmr/H-F/1/audita.txt
$$ ##AUDIT TRAIL=  $$ (NUMBER, WHEN, WHO, WHERE, WHAT)
(   1,<2024-11-07 13:48:04.60 +0400>,<she>,<DPX200>,
      <created by zg, POWCHK disabled, PULCHK disabled
       configuration hash MD5:
       00 E9 B6 7A A2 85 ED C7 34 08 36 98 17 FE 4E 26
       data hash MD5: 16K
       38 86 00 04 B0 01 92 08 D4 94 58 9A 77 59 48 91>)
$$ ##END=
$$ 
$$ hash MD5
$$ 25 DA 94 5E CA 81 0E 64 57 6A 24 B5 4C 26 2A 87
##$RELAX= 
##$RELAX= 
##$RELAX= 
##$RELAX= 
##$RELAX= 
##$RELAX= 
$$ Bruker specific parameters
$$ --------------------------
##$DU= <F:/spectra>
##$EXPNO= 1
##$NAME= <H-F>
##$PROCNO= 1
##$TYPE= <nmr>
##$USER= <she>
##$AMP= (0..31)
100 100 100 100 100 100 100 100 100 100 100 100 100 100 100 100 100 100 
100 100 100 100 100 100 100 100 100 100 100 100 100 100 
##$AQSEQ= 0
##$AQ_mod= 1
##$AUNM= <au_zg>
##$AUTOPOS= <>
##$BF1= 200.13
##$BF2= 200.13
##$BF3= 200.13
##$BF4= 200.13
##$BF5= 200.13
##$BF6= 200.13
##$BF7= 200.13
##$BF8= 200.13
##$BYTORDA= 1
##$CFDGTYP= 0
##$CFRGTYP= 5
##$CHEMSTR= <none>
##$CNST= (0..31)
1 1 145 1 1 1 1 1 1 1 1 1 1 1 1 1 1 1 1 1 1 1 1 1 1 1 1 1 1 1 1 1 
##$CPDPRG= <>
##$CPDPRG1= <>
##$CPDPRG2= <>
##$CPDPRG3= <>
##$CPDPRG4= <mlev>
##$CPDPRG5= <mlev>
##$CPDPRG6= <mlev>
##$CPDPRG7= <mlev>
##$CPDPRG8= <mlev>
##$CPDPRGB= <>
##$CPDPRGT= <>
##$D= (0..31)
0 1.2 0 0 0 0 0 0 0 0.06 0 0.03 0 0 0 0 0.0002 0 0 0 0 0 0 0 0 0 0 0 0 
0 0 0 
##$DATE= 1730972884
##$DBL= (0..7)
120 120 120 120 120 120 120 120 
##$DBP= (0..7)
150 150 150 150 150 150 150 150 
##$DBP07= 0
##$DBPNAM0= <>
##$DBPNAM1= <>
##$DBPNAM2= <>
##$DBPNAM3= <>
##$DBPNAM4= <>
##$DBPNAM5= <>
##$DBPNAM6= <>
##$DBPNAM7= <>
##$DBPOAL= (0..7)
0.5 0.5 0.5 0.5 0.5 0.5 0.5 0.5 
##$DBPOFFS= (0..7)
0 0 0 0 0 0 0 0 
##$DE= 6
##$DECBNUC= <off>
##$DECIM= 24
##$DECNUC= <off>
##$DECSTAT= 4
##$DIGMOD= 1
##$DIGTYP= 9
##$DL= (0..7)
0 120 120 120 120 120 120 120 
##$DP= (0..7)
150 150 150 150 150 150 150 150 
##$DP07= 0
##$DPNAME0= <>
##$DPNAME1= <>
##$DPNAME2= <>
##$DPNAME3= <>
##$DPNAME4= <>
##$DPNAME5= <>
##$DPNAME6= <>
##$DPNAME7= <>
##$DPOAL= (0..7)
0.5 0.5 0.5 0.5 0.5 0.5 0.5 0.5 
##$DPOFFS= (0..7)
0 0 0 0 0 0 0 0 
##$DQDMODE= 0
##$DR= 18
##$DS= 0
##$DSLIST= <SSSSSSSSSSSSSSS>
##$DSPFIRM= 0
$$ [...]
##$SUBNAM2= <"">
##$SUBNAM3= <"">
##$SUBNAM4= <"">
##$SUBNAM5= <"">
##$SUBNAM6= <"">
##$SUBNAM7= <"">
##$SUBNAM8= <"">
##$SUBNAM9= <"">
##$SW= 24.0689170037331
##$SWIBOX= (0..15)
0 0 2 0 0 0 0 0 0 0 0 0 0 0 0 0 
##$SW_h= 4816.95568400771
##$TD= 16384
##$TD0= 1
##$TE= 0
##$TE2= 300
##$TE3= 300
##$TEG= 300
##$TL= (0..7)
0 120 120 120 120 120 120 120 
##$TP= (0..7)
150 150 150 150 150 150 150 150 
##$TP07= 0
##$TPNAME0= <>
##$TPNAME1= <>
##$TPNAME2= <>
##$TPNAME3= <>
##$TPNAME4= <>
##$TPNAME5= <>
##$TPNAME6= <>
##$TPNAME7= <>
##$TPOAL= (0..7)
0.5 0.5 0.5 0.5 0.5 0.5 0.5 0.5 
##$TPOFFS= (0..7)
0 0 0 0 0 0 0 0 
##$TUNHIN= 0
##$TUNHOUT= 0
##$TUNXOUT= 0
##$USERA1= <user>
##$USERA2= <user>
##$USERA3= <user>
##$USERA4= <user>
##$USERA5= <user>
##$V9= 5
##$VALIST= <valist>
##$VCLIST= <CCCCCCCCCCCCCCC>
##$VD= 0
##$VDLIST= <DDDDDDDDDDDDDDD>
##$VPLIST= <PPPPPPPPPPPPPPP>
##$VTLIST= <TTTTTTTTTTTTTTT>
##$WBST= 1024
##$WBSW= 4
##$XGAIN= (0..3)
0 0 0 0 
##$XL= 0
##$YL= 0
##$YMAX_a= 396136
##$YMIN_a= -383601
##$ZGOPTNS= <>
##$ZL1= 120
##$ZL2= 120
##$ZL3= 120
##$ZL4= 120
##$ABSF1= 10
##$ABSF2= 0
##$ABSG= 5
##$ABSL= 3
##$ALPHA= 0
##$AQORDER= 0
##$ASSFAC= 0
##$ASSFACI= 0
##$ASSFACX= 0
##$ASSWID= 0
##$AUNMP= <proc_1d>
##$AZFE= 0.1
##$AZFW= 0.1
##$BCFW= 1
##$BC_mod= 2
##$BYTORDP= 1
##$COROFFS= 0
##$CY= 11.3945322036743
##$DATMOD= 1
##$DC= 2
##$DFILT= <>
##$DTYPP= 0
##$F1P= 15.6554695791079
##$F2P= 12.8336369535428
##$FCOR= 0.5
##$FTSIZE= 0
##$FT_mod= 4
##$GAMMA= 1
##$GB= 0.15
##$INTBC= 1
##$INTSCL= 1
##$ISEN= 128
##$LB= 0.24
##$LEV0= 0
##$LPBIN= 0
##$MAXI= 10000
##$MC2= 0
##$MEAN= 0
##$ME_mod= 0
##$MI= 1.114404
##$NCOEF= 0
##$NC_proc= 0
##$NLEV= 6
##$NOISF1= 3.799351
##$NOISF2= 2.8
##$NSP= 1
##$NTH_PI= 0
##$NZP= 0
##$OFFSET= 15.70392
##$PC= 1
##$PHC0= -26715.57
##$PHC1= 16.78744
##$PH_mod= 1
##$PKNL= yes
##$PPARMOD= 0
##$PSCAL= 0
##$PSIGN= 0
##$REVERSE= no
##$SF= 200.130013532006
##$SI= 16384
##$SIGF1= 3
##$SIGF2= 2
##$SINO= 400
##$SIOLD= 16384
##$SREGLST= <1H.CDCl3>
##$SSB= 0
##$STSI= 0
##$STSR= 0
##$SW_p= 3612.71676300578
##$SYMM= 0
##$S_DEV= 0
##$TDeff= 0
##$TDoff= 0
##$TI= <>
##$TILT= no
##$TM1= 0
##$TM2= 0
##$TOPLEV= 0
##$USERP1= <user>
##$USERP2= <user>
##$USERP3= <user>
##$USERP4= <user>
##$USERP5= <user>
##$WDW= 1
##$XDIM= 8192
##$YMAX_p= 0
##$YMIN_p= 0
$$ End of Bruker specific parameters
$$ ---------------------------------
##NTUPLES= NMR FID
##VAR_NAME=  TIME,          FID/REAL,        FID/IMAG
##SYMBOL=    X,             R,               I
##VAR_TYPE=  INDEPENDENT,   DEPENDENT,       DEPENDENT
##VAR_FORM=  AFFN,          ASDF,            ASDF
##VAR_DIM=   8192,          8192,            8192
##UNITS=     SECONDS,       ARBITRARY UNITS, ARBITRARY UNITS
##FACTOR=    0.0002076,     1,               1
##FIRST=     0,             0,               0
##LAST=      1.7004516,     0,               0
##MIN=       0,             -383601,         0
##MAX=       1.7004516,     396136,          0
$$ Real data points
##PAGE= N=1
##DATA TABLE= (X++(R..R)), XYDATA
0 0 0 0 0 0 0 8 0 8 -8 8 -16 18 -24 26 -35 40 -50 63 -72 86 -102 118 -137 161 -184 209 -241 272 -311 355
30 355 -401 449 -505 567 -632 708 -787 872 -972 1080 -1195 1323 -1466 1620 -1795 1990
46 1990 -2205 2451 -2731 3052 -3427 3870 -4398 5051 -5876 6948 -8414 10546 -13928 20172
60 20172 -52200 396136 317668 -181310 -68788 -140651 -175477 258324 353765 -175716 -313994
71 -313994 -31312 126773 135123 99653 -71910 -207721 -106017 171453 216227 -26440 -146878
82 -146878 -102236 -79187 136037 275682 -64198 -283587 -41911 66968 99513 223959 -64826
93 -64826 -383601 -21746 300478 87501 -35372 -64686 -220734 -39687 296591 151808
103 151808 -171182 -183284 -29275 98890 136882 61624 -73069 -190921 -87922 201007
113 201007 191483 -86637 -135166 -72569 -53106 159048 233737 -110533 -267341 -33020 124009
124 124009 160313 95659 -166923 -235520 43625 205579 118977 -40946 -198265 -132832 130421
135 130421 197281 32476 -122149 -160128 -14789 154012 106053 -15635 -92698 -149055 514
146 514 207459 77209 -112429 -68489 -64568 -25403 192267 136235 -175152 -172847 34608 97299
158 97299 111933 46945 -150940 -169140 55750 193093 90973 -104392 -161556 -32683 96729
169 96729 128091 52828 -129464 -169437 45931 154216 52328 -15804 -93682 -139016 56948
180 56948 190226 20075 -96471 -71381 -73890 51296 193973 25202 -177826 -94197 42854
191 42854 93584 107223 -10393 -165494 -102210 101120 163603 22419 -122945 -104169 295
202 295 81595 123292 15792 -165781 -101978 102486 101977 18718 -11483 -108399 -100520 105722
214 105722 145479 -23083 -86078 -66606 -36052 89926 135003 -28443 -140943 -63836 53250
225 53250 107328 63823 -59025 -128157 -48014 101442 130136 -13201 -120511 -68024 18676
236 18676 84505 104150 -31287 -156624 -41146 102183 71129 18187 -33780 -116964 -42622
247 -42622 125671 98165 -43855 -82081 -56511 2744 98745 87706 -54703 -125882 -34611
258 -34611 82126 91499 14640 -66502 -97957 -20664 112613 100289 -53815 -106522 -32340 28786
270 28786 82914 76264 -65864 -131861 969 95595 55906 6126 -57516 -99123 3534 119639
282 119639 61125 -58352 -81117 -35350 33331 91109 50632 -72110 -107384 1729 92909
293 92909 61129 -12630 -65632 -78504 10468 116340 57740 -75461 -81393 -11575 38290 80987
305 80987 41165 -85687 -97997 27503 87526 42270 -14496 -68252 -70538 31762 107121 33927
317 33927 -71961 -72331 -8353 48550 74977 21777 -83375 -84783 32494 89179 33537 -27846
329 -27846 -64501 -57495 38406 105390 20043 -82280 -60692 5189 49092 70344 8829 -90733
341 -90733 -67451 47337 79735 22428 -32140 -64945 -43532 50939 93599 4355 -80156 -52526
353 -52526 12981 53413 59768 -4700 -88591 -54245 55487 75272 11715 -38050 -61727 -32412
365 -32412 59109 84815 -11240 -79717 -40417 19481 54315 53774 -18018 -88101 -37769 61144
377 61144 66001 3411 -42325 -57863 -19298 64191 73021 -22223 -77733 -31633 26928 53683
389 53683 42890 -27116 -82725 -24733 65207 58290 -5780 -45426 -52086 -8166 66673 61469 -31645
402 -31645 -73080 -22115 32055 51979 33281 -35314 -76827 -12154 67494 49767 -12529 -46376
414 -46376 -46591 974 68088 50841 -41020 -68909 -12013 36098 48425 26170 -41367 -72931
426 -72931 27 69831 40119 -20787 -44675 -39881 9130 69209 40406 -48844 -63033 -2721
438 -2721 39034 44488 16292 -45855 -64356 10226 69733 32046 -27866 -44514 -31520 16428
450 16428 66528 30100 -54464 -57025 7476 40575 38524 9349 -50391 -56954 21761 66911 20705
463 20705 -30443 -41981 -26377 24769 62650 16825 -55155 -48398 11364 42237 35022 6
475 6 -49738 -47631 25869 64998 14415 -36748 -38148 -17920 26249 61449 10049 -62593 -41010
488 -41010 21872 38927 29353 -3505 -54781 -39468 38396 57822 3837 -36336 -36617 -11104 34231
501 34231 51468 110 -56865 -35743 25409 42300 19903 -11707 -46408 -34312 37774 59694
513 59694 -3471 -42182 -28483 -7098 33466 53375 -10039 -63073 -21828 29786 35740 21262
525 21262 -18551 -53186 -16682 46108 42832 -7784 -37791 -29349 3300 37961 38170 -13471 -54985
538 -54985 -20032 34758 33770 8994 -14898 -45449 -21527 49513 46359 -20114 -37493 -20345 -887
551 -887 41270 41597 -27616 -56170 -7146 33241 34286 9596 -31749 -42357 940 44565 32781
564 32781 -16655 -42216 -17038 16765 32755 24767 -21445 -49815 -5136 38541 23976 3052
576 3052 -19790 -44424 -3307 54760 26574 -26653 -30257 -18742 9013 48107 22555 -40059
588 -40059 -42676 4214 35735 30004 -5998 -36415 -27935 10323 44075 24263 -32064 -38328 1853
601 1853 19103 24500 19197 -30025 -45000 12767 37648 12096 -648 -23806 -38038 13492 50075
614 50075 10984 -26537 -28923 -14413 24111 43451 2273 -40588 -31322 10968 40217 21378
626 21378 -20084 -32311 -16661 17210 43955 8732 -42055 -22843 11508 13448 25670 11050
638 11050 -42081 -29841 27226 25701 5533 -367 -30460 -28605 27133 40720 349 -26582 -28734
651 -28734 -3933 33642 30621 -8639 -36346 -26466 20533 43938 5235 -28314 -23199 -9524 23289
664 23289 41265 -8540 -42257 -7475 11917 12931 26696 -5042 -43634 -9331 27312 15695
676 15695 8341 -8274 -35458 -10946 32308 27491 -3982 -28851 -26586 10684 33984 16676 -12975
689 -12975 -35826 -19719 34094 37224 -11520 -25658 -16488 -6014 31852 32738 -24767 -34571 2691
702 2691 10981 16687 19823 -18690 -33961 3296 21782 15432 6194 -19813 -27876 3813 27217
715 27217 21396 -6761 -34718 -17125 22684 26835 9055 -14965 -38085 -6885 43363 21278
727 21278 -19901 -18381 -16168 872 39374 17210 -33756 -21689 6046 9733 21208 9736 -26152
740 -26152 -22899 8062 19750 16359 -3697 -24638 -15335 8620 23842 19683 -16312 -36189 -1133
753 -1133 24936 17424 6531 -20989 -36542 11165 42020 5500 -18597 -16341 -16029 14080 37309
766 37309 -776 -31037 -12540 4630 15193 20422 -4046 -25182 -12991 8729 21688 13122
778 13122 -13898 -21057 -6274 8461 24803 13896 -27679 -27694 11467 20061 13244 4157 -28666
791 -28666 -26969 24260 32317 -3554 -15888 -17679 -10372 23583 27162 -10354 -25268 -10297 7103
804 7103 20296 12025 -10961 -19030 -9574 11065 25132 3958 -20749 -12892 -2504 9295 26662
817 26662 3384 -33529 -14092 16475 14788 11886 -2780 -31838 -12560 28630 21116 -6378 -15928
830 -15928 -17766 24 25529 16278 -12900 -21833 -8284 13761 19730 2937 -11992 -16128 -8001
843 -8001 17479 23164 -7196 -19084 -7326 -1688 14624 23748 -9894 -30168 -2968 15804 13007
856 13007 9808 -12637 -28205 321 26578 13669 -7790 -18445 -13523 8557 21979 9216
868 9216 -13750 -21393 -3639 19027 14439 -2685 -11109 -16251 -2926 23137 15545 -13892 -15230
881 -15230 -4815 1382 19100 15549 -18011 -22738 3140 14964 12933 3554 -17781 -19713 6830
894 6830 22724 9862 -11470 -18913 -5668 12591 17102 5074 -15454 -20109 3833 20240 8054
907 8054 -4253 -11349 -15051 4482 24390 6470 -15734 -11863 -3536 6368 19396 6007 -20472
920 -20472 -16197 6767 15685 10359 -3350 -17509 -12101 10005 20909 4825 -15738 -15169 841
933 841 11641 13912 2300 -18650 -15712 10559 17391 3258 -5233 -12836 -11731 11304 21484 -797
947 -797 -15731 -9356 -781 10708 16075 -1896 -20068 -10397 10460 14927 5548 -7889 -15267 -7088
961 -7088 12834 18573 -1630 -17377 -9363 3905 11134 12275 -2592 -20488 -8628 14329 13370
974 13370 749 -6891 -13369 -5929 15424 16358 -5326 -15740 -7005 3788 12465 11131 -6206 -18496
988 -18496 -5244 13139 13055 10 -9958 -12295 -2277 15024 14278 -7217 -16454 -4728 6447 11146
1002 11146 9467 -7730 -18508 -2038 15452 9749 -1848 -9073 -11943 -583 16652 11207 -9190
1015 -9190 -14070 -3130 6678 11192 6809 -9492 -16678 -233 15365 8841 -4108 -9981 -9539 1522
1029 1522 16199 9567 -11107 -14250 -722 7712 10313 5178 -11076 -15262 2732 15164 6846
1042 6846 -4698 -10074 -8797 3860 16152 6161 -12125 -12145 406 8205 9938 3073 -12102 -13344
1056 -13344 5267 14933 5274 -6411 -9615 -7583 5025 15635 4141 -13488 -10598 2740 8498
1069 8498 9154 1206 -13063 -11564 7158 14558 3074 -7007 -9630 -5581 6857 14763 1525 -13614
1083 -13614 -9059 3610 8883 7742 -912 -13064 -9255 8845 13862 1355 -7765 -8626 -3928 8023
1097 8023 13803 -599 -13947 -7097 4606 8626 7028 -2266 -13391 -7223 10097 11791 -173
1110 -173 -8254 -8401 -2551 9146 12205 -2610 -14069 -5790 6303 8530 5332 -3655 -13058 -5516
1124 -5516 11732 10956 -2325 -8501 -6926 -1317 9985 11175 -4954 -13397 -3631 6555 8393 4504
1138 4504 -5817 -12174 -2448 11135 9490 -2799 -9233 -6411 925 10042 9174 -5983 -13632 -2388
1152 -2388 8438 7515 2734 -6081 -12023 -1077 12810 7306 -4911 -8124 -5389 1630 10749 6787
1166 6787 -8105 -11356 -471 7785 7760 1721 -7569 -10041 356 11536 7484 -5422 -9215 -3520
1180 -3520 3284 9675 6544 -8790 -12067 1605 9248 5336 874 -7587 -10226 3221 12693 3585
1194 3585 -6670 -7617 -3526 4635 10388 2521 -9041 -9435 1215 9214 5983 -1464 -7482 -7873 2560
1209 2560 12548 4407 -8754 -7625 -1114 3764 10178 3479 -11856 -8933 5572 8080 3945 -1032
1223 -1032 -9590 -7156 7329 10638 432 -7387 -7022 -733 7179 7875 -296 -9062 -7226 3853 9081
1238 9081 3183 -3124 -6966 -6525 5464 12305 -317 -9615 -4818 -102 5068 10077 -670 -13034
1252 -13034 -4525 6793 6501 3184 -3766 -10383 -2555 9073 7488 -1391 -7790 -5733 2294 7104
1266 7104 4709 -1552 -8609 -5410 6885 8099 -102 -3210 -6423 -5373 8144 10803 -3938 -8533
1280 -8533 -2689 191 7351 8416 -5761 -11461 -679 6990 6483 1657 -7094 -8104 1766 7941 5800
1295 5800 -3057 -8890 -3068 5379 5329 2957 -2088 -9610 -2341 9058 4863 -1594 -2266 -7374 -2902
1310 -2902 10754 6867 -6399 -6693 -2519 1451 8884 4955 -8333 -8642 1356 7634 6828 -1228 -8447
1325 -8447 -4443 3228 7078 4775 -5148 -8760 911 5547 3235 2805 -4103 -9442 2313 8778 1487
1340 1487 -1100 -2883 -7379 1079 10932 2478 -6370 -5115 -2481 4353 8937 442 -8535 -6027 2041
1355 2041 8598 4926 -5383 -7169 -1099 3114 7286 2946 -8643 -6051 4309 3802 2741 2375 -6996
1370 -6996 -6860 5415 6414 141 -403 -5173 -5795 5379 8531 -390 -5438 -5328 -1046 7339 6230 -2652
1386 -2652 -7273 -5057 3440 9623 1284 -7556 -4160 -59 3611 8204 -394 -9784 -2057 5055 2088
1401 2088 3812 18 -8697 -2676 6543 3555 160 -1546 -6374 -2145 6563 5598 -1334 -5879 -5364
1416 -5364 2279 8031 2381 -3332 -6804 -4120 6899 8663 -3075 -6564 -1947 -733 5512 7177
1430 7177 -4922 -8575 1285 3408 2308 3692 -3368 -7517 527 5687 2772 435 -3908 -5491 1079
1445 1079 6013 3776 -1704 -7132 -3525 5539 5697 355 -2805 -6544 -1952 9168 5655 -5333 -4563
1460 -4563 -2132 364 7043 4321 -6920 -5425 2058 3182 3736 1598 -5112 -4961 2191 4582 3104
1475 3104 -1133 -5513 -2926 2738 4643 3090 -3158 -7405 -87 6386 3120 0 -3507 -6782 1498
1490 1498 9348 1101 -5223 -2971 -2099 2211 7482 436 -7076 -3159 2166 3297 3534 -929 -5510
1505 -5510 -2745 2264 4641 2338 -3910 -4629 -48 2406 4321 2289 -5573 -6130 3310 5460 1412
1520 1412 -134 -4697 -5315 4698 7412 -1115 -4167 -2833 -1121 4375 5650 -1797 -5900 -1641 2333
1535 2333 4166 2168 -2707 -4135 -1995 3099 5423 423 -5029 -2647 774 2582 4709 366 -6670
1550 -6670 -3331 4170 3552 1365 -1373 -5477 -2616 5970 5023 -1858 -3943 -2744 493 4872 3523
1565 3523 -2878 -5025 -1715 3429 4440 -54 -3027 -3412 -877 4176 4916 -1770 -4855 -880 1035
1580 1035 2985 4260 -1851 -6418 -475 4572 3050 781 -2613 -5177 -205 6091 3232 -2335 -3908
1595 -3908 -2183 1946 4564 1728 -3230 -5002 -275 4599 3146 -903 -3061 -3133 -280 4858 3448
1610 3448 -3449 -3955 -456 1408 3444 2853 -3991 -5107 1191 4488 2300 -387 -3493 -4157 1746 5094
1626 5094 1884 -3290 -3916 -668 2821 3459 925 -3644 -4372 1391 4760 1616 -1741 -3117 -2674 1524
1642 1524 5061 1210 -4533 -3141 292 2313 3960 1105 -4871 -3623 2232 4199 1439 -1484 -3466
1657 -3466 -2495 2600 4482 796 -3888 -3170 892 2884 3058 177 -3933 -2960 3061 4480 323 -2109
1673 -2109 -2661 -1861 2754 4551 -884 -4412 -1958 1343 2484 3264 -677 -4574 -2447 3095 3705 213
1689 213 -2315 -2803 -826 3061 4063 -868 -4384 -1737 1696 2800 2312 -901 -4184 -1669 3774 2943
1705 2943 -300 -2394 -2480 -544 3524 3553 -2096 -3949 -1401 1682 3022 1935 -1695 -4137 -952 3619
1721 3619 2947 -726 -2605 -2074 -251 3399 3083 -2110 -3813 -1071 2191 2555 1312 -2004 -3803 -51
1737 -51 4010 2224 -1374 -2118 -2322 712 3707 2152 -2542 -3728 -324 2154 2324 936 -2192 -3417
1753 -3417 -195 3842 1964 -1543 -2413 -1752 975 3144 1782 -2894 -3355 323 2583 2304 1110 -2971
1769 -2971 -3734 1089 3923 1271 -1597 -2571 -1340 1208 3874 1258 -3110 -3152 659 2716 1752 171
1785 171 -2514 -3162 1319 3760 753 -2158 -2387 -746 1415 3159 962 -3155 -2753 1204 2120 1654
1801 1654 -25 -2994 -2338 2207 3661 302 -2000 -2231 -690 2003 2961 -106 -3411 -2208 1250 2499
1817 2499 1248 -375 -2533 -2279 2331 3627 95 -2685 -1526 -488 1943 2965 -98 -3875 -1322
1832 -1322 1469 2151 1408 -766 -3075 -1286 2419 2748 -283 -2478 -1705 87 2197 1873 -490 -3449
1848 -3449 -1304 2191 1986 470 -1029 -2758 -1601 2685 2613 -1475 -2208 -1118 -64 2233 2385 -1349
1864 -1349 -3066 -414 1822 1903 817 -1466 -2302 75 2750 2290 -1253 -2769 -947 409 1942 1375
1880 1375 -1603 -3455 -686 2491 1636 219 -1388 -2371 -29 3745 1359 -1656 -1595 -777 366 2401
1896 2401 1240 -2275 -2316 184 1769 1619 -249 -1899 -1720 -26 2704 1851 -1736 -2592 -354 1095
1912 1095 1777 1405 -1957 -3231 918 2826 677 -175 -1525 -2182 1287 3391 562 -1889 -1350 -663
1928 -663 1671 2312 -171 -2405 -1443 636 2256 1476 -945 -1771 -1218 474 2806 1118 -2493 -2259 193
1945 193 1393 2012 901 -3004 -2111 1918 2321 243 -470 -1919 -1494 2192 2521 -238 -1774 -1353 -84
1962 -84 1776 1404 -682 -1812 -1478 799 2470 422 -1491 -1292 -775 1106 2893 329 -2993 -989
1978 -989 332 892 2236 -440 -3653 -811 2445 1109 265 -737 -2489 -369 2511 1161 -970 -1899
1994 -1899 -1302 957 2201 475 -635 -1815 -1180 1673 1802 -617 -903 -905 -1110 1723 2440 -1063 -2437
2011 -2437 -295 409 1300 2144 -1468 -2817 403 1582 1129 -109 -1391 -1743 670 2153 607 -802
2027 -802 -1735 -1060 1715 1371 82 -502 -1753 -226 2293 1296 -797 -664 -1210 -349 2625 1432 -2002
2044 -2002 -1230 -86 166 1705 1056 -2291 -1722 330 1483 1298 -539 -2204 -881 1117 1443 619 -1144
2061 -1144 -1920 549 1534 286 154 -995 -2386 480 2399 276 -513 -366 -1547 674 2695 323
2077 323 -1878 -1097 -253 1273 2151 5 -2269 -927 747 1595 979 -1121 -1763 330 1061 948 358
2094 358 -1772 -1419 1253 1263 370 294 -1335 -1465 1311 1702 -385 -460 -811 -865 1217 2297 -338 -1411
2112 -1411 -790 93 1620 1319 -889 -1837 -541 937 1936 218 -2022 -840 402 859 1419 -202 -2433
2129 -2433 -446 1442 610 409 246 -1730 -649 1751 1018 -268 -847 -902 -642 1602 1319 -427 -1267
2146 -1267 -953 458 1767 349 -1117 -1433 -653 1333 1979 -759 -1648 -349 164 1053 1438 -1148 -1743
2163 -1743 449 1251 661 622 -985 -1734 209 1286 449 -304 -640 -870 558 1685 861 -578 -1629
2180 -1629 -613 1467 1239 -199 -724 -935 -512 1772 1353 -1284 -1193 57 -18 1348 866 -1178 -1225 758
2198 758 655 657 118 -1182 -1252 738 1068 475 -552 -958 -571 769 942 457 -755 -1468 363 1142 868
2217 868 -172 -854 -1252 290 2067 -31 -1244 -913 -123 289 1607 95 -1606 -1011 221 822 638
2234 638 -235 -1121 -515 817 1294 334 -900 -1280 286 738 831 253 -1129 -1451 877 1165 215 -227 -957
2253 -957 -1013 951 1562 -68 -792 -414 -59 1016 1160 -342 -1197 -249 502 870 407 -745 -1006 -286 820
2272 820 1359 27 -1179 -857 338 621 758 459 -1409 -788 1200 820 17 -254 -941 -1030 1152 841
2290 841 -394 -1089 -550 160 505 903 -705 -1059 -270 755 897 3 -703 -890 -5 803 888 -534 -1163
2309 -1163 -242 416 713 744 -513 -1393 -462 997 687 -9 -726 -986 -76 1234 820 -734 -829 -534 540
2328 540 902 291 -508 -987 166 775 894 -342 -805 -396 20 1307 800 -859 -939 -22 403 779 175
2347 175 -802 -963 240 1211 521 -158 -936 -580 394 1110 502 -700 -1001 365 675 940 357 -670 -892
2366 -892 508 1386 477 -638 -601 -340 158 1215 405 -977 -487 308 608 752 105 -843 -592 522 894
2385 894 131 -349 -511 -373 599 1223 93 -1186 -746 358 783 363 95 -751 -523 379 1079 266 -787
2404 -787 -454 -87 207 906 -75 -826 -488 -6 739 442 -64 -1001 -559 577 997 -99 -679 -526 -260
2423 -260 856 1021 -234 -1051 -715 506 470 339 -412 -857 -280 898 601 -133 -534 -357 21 549 834
2442 834 -590 -1078 -298 177 676 487 -668 -879 -93 680 826 -387 -626 -72 187 575 575 -751 -1385
2461 -1385 247 608 625 281 -401 -864 4 936 798 -483 -635 -809 311 806 532 -549 -887 56 377
2480 377 436 -177 -383 -854 164 1022 731 -448 -566 -268 18 582 768 -691 -816 132 381 548 -108
2499 -108 -628 -962 -55 1038 51 -755 -605 -432 110 647 191 -626 -639 -1 491 452 -541 -328 -697 138
2519 138 811 -104 -536 -326 -38 363 937 82 -964 -945 56 611 83 107 -679 -499 539 614 133 -604
2539 -604 -744 -39 515 838 -220 -973 -688 227 923 257 -142 -992 -456 369 857 45 -851 -281 115 316
2559 316 713 252 -726 -292 363 619 251 56 -581 -596 620 637 180 -480 -483 91 443 230 -288 -704 -430
2580 -430 787 946 277 -176 -484 -453 749 957 -415 -404 -11 -21 524 829 -240 -908 -38 668 327 237
2600 237 -436 -606 4 463 86 -177 -722 -333 451 403 318 -117 -786 85 918 540 -25 -177 -533 45 954
2621 954 657 -235 -343 -209 -55 665 245 -522 -659 135 461 423 -13 -270 -459 -45 455 473 -407 -720 -1
2642 -1 413 373 11 -77 -1106 278 948 227 74 -280 -435 265 938 69 -669 -209 77 275 688 -250 -434
2663 -434 -466 -166 566 390 -309 -527 -124 54 857 457 -629 -533 363 352 552 48 -893 -620 841 663
2683 663 18 109 -270 -637 697 993 -332 -715 -90 228 432 392 -289 -467 5 82 571 166 -245 -325 -322
2704 -322 -182 539 215 -905 -431 239 19 424 -86 -836 -230 731 315 61 -248 -732 -120 613 420 25
2724 25 -394 -442 330 458 20 -390 -213 -414 398 492 -134 -421 65 -607 -27 780 -360 -612 283 219 333
2745 333 606 -315 -942 -143 565 462 141 -353 -679 360 439 188 -484 -604 -203 417 405 -135 -126 -299 -229
2766 -229 554 435 -389 -183 -177 -280 495 601 -519 -498 -66 119 226 275 -538 -401 346 311 183 23 -618
2787 -618 -129 105 332 360 -63 -633 -334 454 106 -236 -168 -577 -158 491 167 -270 -148 -368 62 939 122
2808 122 -516 -591 400 25 628 54 -571 -390 247 140 230 -582 -408 99 137 447 400 -627 -410 306 392
2829 392 401 110 -162 -813 203 435 -382 -176 -225 -75 441 713 -64 -100 -506 -148 228 384 -224 -386 -60
2850 -60 368 472 311 -686 -565 -124 237 495 56 -434 -400 418 333 302 198 -497 -203 584 133 -59 -62 -381
2872 -381 -23 546 512 -178 -242 -296 -70 413 -3 -380 -193 133 421 210 -291 -447 -151 -282 100 527 -86
2893 -86 -247 6 452 174 128 -169 -595 -129 185 549 -155 -270 -359 756 349 75 -172 -548 23 489 289
2914 289 -292 -176 -90 -162 533 356 -178 -350 294 420 552 108 -207 -638 -160 476 194 -254 -326 -473 -184
2935 -184 635 33 -266 -425 35 133 123 27 -373 -654 211 360 229 -100 -199 -342 -92 510 -48 -421 -395 -264
2957 -264 77 248 -36 -407 -235 251 191 -102 122 -221 -417 204 616 160 -384 -342 86 211 425 -83 -452
2978 -452 -241 338 486 -164 -303 -163 -220 69 354 -65 -272 285 -49 144 482 -42 -596 -151 200 84
2998 84 -174 -387 -329 -132 509 298 -245 -653 109 364 251 293 -167 -24 -292 165 443 159 -127 -262 9
3019 9 36 456 12 -431 -98 -155 5 221 -100 -359 -168 23 364 -148 -276 -249 -59 271 313 -123 -333 -63
3041 -63 187 35 214 36 -117 187 199 158 -251 -183 -356 -235 562 315 -475 -381 -118 225 418 148 134 -447
3063 -447 297 233 455 -184 -236 -249 35 497 315 -451 -334 -27 -9 366 164 -180 -387 407 313 131 -64 -320
3085 -320 -182 -97 361 76 -254 -194 -91 -29 220 126 -240 -51 -20 333 -194 -145 -35 -200 315 71 327 -112
3107 -112 -131 -154 145 45 -88 -327 -427 -71 -53 -203 -261 35 -105 345 44 -44 -406 81 83 288 113 8
3129 8 -130 -135 209 175 54 -173 -341 -206 82 411 -74 7 43 50 135 220 -84 -338 -415 458 56 -191 21 -203
3153 -203 -86 345 69 -157 -249 -27 212 326 -90 48 -218 -84 484 261 -96 -276 -112 93 -96 49
3173 49 -192 -471 166 198 77 -78 27 -312 -184 178 385 -312 -347 -150 26 191 -43 -193 -248 14 316
3194 316 326 -177 -282 159 7 344 -115 -103 -307 -162 -194 114 147 -422 -202 -114 280 138 237 -129 -539 -160
3216 -160 216 160 -311 80 -194 352 -180 56 -239 -151 109 21 493 65 -233 -58 201 329 -105 -72 70
3237 70 73 -18 176 124 -137 -163 68 130 84 23 -263 -382 256 237 -107 -259 -23 155 -83 215 78 -358 -292 -84
3261 -84 -34 358 -105 -235 -219 148 260 -151 -182 -274 -220 -34 461 270 -170 -188 -48 235 32 -346 -106 -229
3283 -229 214 57 -166 -239 -94 91 -98 70 113 -291 -385 136 271 294 -23 -462 140 147 163 115 -165 -260 318
3306 318 330 20 -64 221 -330 427 426 -88 -317 -223 175 45 512 -150 -366 -9 -119 -42 -51 -536 -176 -12 239
3329 239 148 123 -52 -344 -101 -131 349 -252 3 -44 134 226 -89 216 -150 -164 -41 119 -181 -192 -91 -461
3351 -461 93 44 -200 -362 -155 323 302 22 -30 -211 -268 92 183 -159 118 -113 182 309 122 -459 -207 79
3373 79 24 92 243 3 -163 -19 117 -207 -99 -71 -300 81 418 -258 -119 -262 308 81 102 -153 -137 -93
3395 -93 -158 174 -80 -160 -129 34 -9 154 134 -263 -346 321 107 -228 -70 63 132 -5 148 97 -164 -49 94
3418 94 -17 120 -58 -223 -345 -279 26 359 132 -54 183 -61 -13 -29 -381 145 -180 84 -45 198 -459
3439 -459 -133 124 126 -6 132 -283 -420 345 259 233 -2 -98 -83 255 -62 164 -78 26 123 166 -41 154 -240
3462 -240 -275 309 411 19 -49 63 216 -1 375 -338 -423 90 -73 55 -47 -119 -21 182 87 178 -244 -110
3484 -110 -339 159 308 92 17 -161 -149 -228 -129 -11 -170 -15 -23 185 157 -86 -348 -144 28 246 493 182
3506 182 -23 -318 332 -103 268 -181 -62 -194 -111 46 97 -162 -23 91 267 41 -356 -339 -209 13 -46
3527 -46 103 -337 -49 -51 377 25 -94 -66 122 -64 -71 -13 -76 -47 -42 132 152 -19 -299 138 -118 -177 100 7 -160
3552 -160 -4 94 71 43 -157 -212 83 98 14 -77 -88 -163 244 121 41 -343 -254 -1 132 341 151 -31 -155 105
3576 105 -212 394 191 -210 -210 -169 -139 13 17 0 -59 -99 206 -10 -249 146 230 109 49 -10 -86 37 10 91 77
3601 77 -187 -117 141 86 29 99 60 -178 -194 -104 -117 -260 -204 -190 7 93 -86 -97 -234 82 22 -107 -115 -368 -218
3626 -218 82 19 -205 -80 -200 57 105 290 -554 -373 -25 -16 281 287 -288 -87 101 209 78 -57 -134 -108 -69
3649 -69 -23 503 -289 31 -138 177 292 -91 -317 -106 262 186 -75 -113 -104 -182 -44 314 -77 -10 -42 205 181
3672 181 419 120 -134 -10 103 15 384 104 54 -259 -51 -25 127 -262 -56 15 228 105 -118 20 -188
3693 -188 125 -13 72 -191 27 -90 72 203 -31 -91 -130 172 48 53 10 -500 53 -154 55 206 -348 -13
3715 -13 62 75 189 -12 297 61 35 136 219 -108 -207 -64 160 58 -346 -139 -208 -104 163 -11 -60 -31 118
3738 118 108 18 21 -219 -243 101 312 182 -312 -194 348 -88 159 189 108 2 -205 -228 71 54 140 -252 -231 217
3762 217 -124 178 -190 -151 149 190 109 201 -207 -149 -67 86 -243 -215 95 62 53 175 19 51 34 282 181 203
3786 203 -118 -30 73 -236 111 -337 91 -123 164 345 116 1 -163 76 250 38 86 -197 230 78 337
3807 337 -40 79 -40 -250 131 -16 194 135 -153 -232 354 157 -106 -181 110 118 176 154 -60 -293 133 165 134
3830 134 166 231 66 -111 161 93 -19 -77 -91 19 332 152 208 -62 -69 -211 -61 127 3 -51 116 212 -108
3853 -108 -127 11 -228 140 278 -33 37 0 -73 -175 70 -57 -76 -204 92 10 107 64 -111 -322 97 116 226
3876 226 -91 -303 -93 104 329 290 -235 -87 55 260 64 -99 -90 284 158 -38 298 18 -49 -113 59 559
3898 559 -207 -333 66 154 -187 147 22 -257 -176 180 116 -15 -39 -94 163 116 148 185 -109 327 -24 -161 198
3921 198 -133 -86 -138 193 184 -167 -126 -39 187 327 115 159 106 -7 226 389 -289 -116 -181 -12 55 -58 26 110
3945 110 112 76 210 -343 298 -80 -237 -6 227 107 68 -113 -98 97 48 -132 8 -59 -129 -60 -3 3 67 51 -349
3970 -349 68 -105 -88 -211 116 530 33 -200 -239 -256 -103 238 21 -46 -28 90 68 142 157 120 -134 -137 17 144
3994 144 39 -141 132 -197 111 205 -203 -230 312 245 -103 205 88 -274 80 88 218 -39 32 81 382 185
4016 185 261 -331 -119 259 387 -278 -66 -152 -78 -237 -108 -106 107 178 27 -90 -126 -48 351 -217 -91 202 -55
4039 -55 39 -437 20 255 129 -244 -71 -6 21 -40 333 -145 -236 -61 -149 198 204 -89 17 162 -11 9 31 -333
4063 -333 -155 89 -278 -243 28 40 -24 8 84 -188 -188 45 246 157 174 -345 198 44 -117 182 47 204 -34
4086 -34 50 179 -1 -13 5 140 -36 12 129 174 164 -42 -94 -201 292 -226 -106 -61 -20 -81 -9 -110 -5 37
4110 37 -254 -231 -153 -34 -71 -10 40 43 -4 -242 123 95 43 80 -404 -61 133 -73 117 -217 56 69 286 -161
4134 -161 312 59 -127 72 -83 -81 74 -80 -241 195 128 -73 -95 -213 -17 57 116 -229 80 -55 159 -8
4156 -8 154 -192 -100 204 -188 70 -113 -162 107 313 37 76 106 -47 -229 71 -44 -158 -184 -87 -243 53 -71
4179 -71 -230 -3 -83 -67 -26 182 -19 -55 -28 223 162 -289 -267 430 -75 17 74 -48 -160 411 -246 14 97 -72
4203 -72 168 -127 -19 -52 -52 11 -57 -85 -23 52 145 350 -191 76 -64 180 243 -4 -229 190 65 11 -56 -78 -64
4228 -64 -129 18 106 36 22 264 -133 200 -79 160 180 315 121 96 -117 191 61 37 324 -249 120 -198 84
4251 84 -327 106 -2 -100 -142 258 3 -118 -13 216 -95 -54 -75 -105 -80 -143 311 -7 9 -348 -107 -82 137
4274 137 125 -319 -150 79 -41 66 -176 -48 -181 -3 61 29 344 39 71 -111 269 125 96 -135 -24 45
4296 45 -7 95 -76 -110 111 122 139 126 317 233 -451 -5 18 150 -70 11 196 -152 -67 114 -65 -158 -275 331
4320 331 -29 175 -165 149 -124 -76 241 -188 -57 31 191 42 -163 200 -60 208 -11 -238 111 47 -289
4341 -289 203 284 -189 -115 64 135 110 -38 282 51 -165 234 -177 -45 -273 -106 325 95 -258 230 110
4362 110 -40 -80 41 -18 -27 43 43 100 -107 81 -53 -187 37 79 20 145 79 -92 -37 130 -213 15 95 253
4386 253 -90 -165 -174 -337 41 219 -191 -49 105 112 -55 101 419 393 7 50 -47 87 154 -128 -324 -87 -43
4409 -43 22 253 239 -404 42 254 226 -290 35 106 -38 57 192 -71 -124 -26 361 14 -42 209 132 220 101 406
4433 406 58 -140 386 148 -86 79 71 129 99 148 -125 -1 228 -241 -40 87 -251 -56 -309 26 -81 159
4455 159 189 -245 131 308 -39 79 25 -48 65 50 81 151 -298 -31 64 -69 -171 -47 -144 3 126 136 -130
4478 -130 -208 -517 -262 148 121 -35 105 287 272 -163 -9 391 237 -135 -5 60 -90 145 73 95 116 -23
4500 -23 20 -582 -461 291 11 -27 -71 -351 -271 50 49 -90 4 -61 293 -265 199 348 -66 -103 217 -67 -155 185
4524 185 132 70 -329 94 -126 -166 -193 48 -23 237 -65 -250 -17 109 16 -54 -125 -66 334 -121 -102 225 -114
4547 -114 68 134 -105 150 -219 92 199 101 -25 -88 26 -119 98 -89 87 -43 -57 -46 27 352 -76 -147
4569 -147 257 -128 119 -219 -168 -15 49 59 -217 133 -165 -60 308 -73 59 110 -368 -81 46 -46 -18 16
4591 16 50 -153 75 299 -151 78 206 185 -197 119 -53 246 15 52 3 30 -52 -38 -148 218 179 3 43
4614 43 225 -28 -25 -104 51 75 -288 89 -123 -121 643 -61 236 -130 -4 340 -223 46 264 -123 -77 -134 -147
4637 -147 40 70 166 -59 272 -176 114 148 -2 84 172 -322 -29 326 -74 -35 -144 107 -98 162 10 -277
4659 -277 -195 37 114 -99 90 -6 -40 193 323 161 124 -100 -66 137 110 74 61 -214 -220 155 128 -133 241 -142
4683 -142 -315 208 -103 154 329 -64 122 74 -134 -230 -220 92 -28 99 91 40 -73 46 -50 -63 275 -57 -339
4706 -339 -45 -127 97 23 -226 -39 244 -272 -166 -48 83 220 65 158 -82 -55 261 82 22 37 -211 84
4728 84 -184 -59 7 -46 180 -70 -19 -216 -52 -67 68 111 161 -38 -73 -158 188 -119 264 112 -53 -161 27
4751 27 62 166 127 -71 -213 65 -321 -244 198 44 21 184 16 -153 156 -87 70 -178 205 190 -123 162
4773 162 358 287 -29 -238 101 137 9 192 -2 72 63 347 -348 -304 -213 246 62 84 30 -277 -178 -393 55
4796 55 8 -96 178 7 49 51 47 -302 60 -123 176 -239 -277 -128 -112 -127 -16 -101 187 -111 58 -68 -277 -49
4820 -49 90 -32 31 21 -6 -295 -6 -276 -201 -31 -93 -131 34 -129 -131 -245 -9 76 -70 -38 -226 21 110 18
4844 18 -402 2 -60 296 97 15 -429 -67 -137 4 24 -234 213 182 102 -28 277 -9 198 15 -22 -88 -34
4867 -34 -306 -65 230 -385 194 -133 -206 86 -16 -263 150 68 -82 -201 230 89 -352 363 -78 -99 -13 -27
4889 -27 -103 -165 201 -183 94 -170 -198 -136 97 8 301 -137 137 77 454 17 264 -350 -68 -237 52 273
4911 273 -30 245 -67 56 -3 -76 -226 -178 -42 233 297 220 -184 -251 13 0 53 -61 26 112 152 182 -148 -220
4935 -220 122 141 33 207 -7 -136 382 -24 -256 105 -62 338 43 155 85 328 -259 -343 124 319 210
4956 210 209 247 87 -85 91 16 96 50 -25 124 -46 67 -192 -31 -148 206 -135 -295 -43 -61 98 -257 157
4979 157 -247 190 -72 214 308 -91 119 -58 174 -262 92 9 -172 222 -206 64 -109 -169 -54 -123 97
5000 97 17 239 -66 -30 -196 -186 -43 -51 -21 261 -54 1 -49 -19 23 -19 -5 -306 -125 -52 181 80 96 -100 135
5025 135 -359 -122 -28 27 122 -106 -78 11 109 37 173 -73 140 10 195 -199 257 -44 94 -13 99 184 -86
5048 -86 189 204 271 16 100 143 -246 -139 -20 -15 166 25 -14 21 12 -99 70 347 100 -61 -186 -130 -123 -223 310
5073 310 -121 115 17 200 -64 -93 136 -13 210 8 274 107 -272 -66 226 134 -29 23 152 -112 -322
5094 -322 -11 30 7 246 4 -205 410 -133 -55 47 154 -22 -3 -263 57 333 -138 -203 -125 -39 -249 123
5116 123 -188 -175 -342 -160 -85 182 -252 116 -71 121 -43 261 76 44 -13 -218 262 44 261 -2 -177
5137 -177 -129 -82 -27 77 -7 -347 156 -241 -124 -209 -40 70 273 63 50 212 -189 -322 -267 -102 70 -98
5159 -98 -42 -97 192 80 131 -156 139 -180 263 -85 -16 7 -62 20 15 -19 -59 -41 -310 6 -79 38 134 -20 -56
5184 -56 114 172 -447 105 51 117 161 54 -254 -171 -10 109 292 -239 -99 -54 -21 -66 59 -236 -527 -2 -79
5207 -79 53 208 79 82 -152 299 -258 -40 49 -251 -36 218 -2 -185 194 -13 185 -79 136 -104 -265
5228 -265 247 314 -121 2 -119 213 -53 -150 -151 -31 -224 49 93 46 -16 195 126 -26 262 -354 176 50 85
5251 85 109 -134 -320 553 -78 -5 14 -299 -107 7 181 19 -173 -98 87 52 -25 195 48 132 -149 -173 -30
5274 -30 210 238 -296 185 96 157 131 -42 -261 4 -90 230 -26 -138 293 -71 -73 241 116 102 -13 -156 18
5297 18 -201 142 -98 150 111 93 7 -166 -20 247 170 145 96 4 81 -244 -305 -62 98 -227 78 261 -54
5320 -54 285 -272 150 113 -182 334 64 -119 -30 -37 -5 81 -160 43 -105 115 71 -116 -37 407 110 -135 327
5343 327 1 220 -127 -122 -269 2 286 -52 80 147 57 -167 -48 3 251 -22 427 49 167 107 -238 -40
5365 -40 -116 -193 29 -131 126 88 225 27 53 73 -189 237 -169 53 -99 -139 -41 114 111 25 75 -96 18 76
5389 76 34 -40 -72 263 -134 117 -99 -231 -192 83 -340 -289 -168 173 193 20 185 -86 18 39 -8 72 -42
5412 -42 -79 -24 91 -260 214 82 -265 44 144 -131 -112 -28 -5 270 115 42 30 98 161 -59 -135 117 -50 359
5436 359 202 -311 -103 -139 -20 -115 -496 -47 96 -29 -151 252 -141 187 310 237 -77 -224 -91 -501 -18
5457 -18 252 -143 187 180 -61 386 123 -120 -153 123 -37 -1 71 157 114 274 -78 213 -253 61 188 -21 -88
5480 -88 -108 121 -74 -133 81 3 34 91 -23 -71 -76 -285 151 -30 -234 115 22 -130 -3 -300 -209 -153 -150 117 14
5505 14 -315 -153 24 -73 -325 -308 -91 70 -250 192 -296 294 -92 -22 109 519 17 122 92 236 458 249
5527 249 240 -40 151 -162 26 -245 67 28 299 10 -143 48 157 24 -287 -101 143 218 241 -154 142 123
5549 123 -165 -120 -77 113 78 20 -65 -203 251 -165 92 370 147 128 -238 -232 -74 -396 442 -26 277 90 141
5572 141 185 168 -241 -101 -66 74 -31 57 -38 22 -180 278 -117 162 24 57 42 -287 301 32 -161 -69 -101
5595 -101 -432 133 -390 -199 251 -119 -71 -174 -161 49 200 -407 -52 -94 44 29 263 207 58 97 -88 -3
5617 -3 -24 -264 153 -10 205 -182 -293 -30 -14 241 -221 -72 42 -74 -190 -114 -42 144 -168 152 61 44 -16
5640 -16 116 -252 -223 209 -185 -138 50 -32 246 -119 169 -315 -257 271 -334 -162 236 209 -249 46 -67 -89
5662 -89 -76 -83 123 -8 94 -75 -156 65 310 -245 -158 -26 72 -185 -169 -50 96 151 14 -155 93 -23 -51
5685 -51 286 -231 -159 -15 259 269 -281 9 -17 -203 -56 33 20 58 -21 -78 79 128 2 86 88 -41 189 48
5709 48 91 -77 -212 -94 -345 -190 189 118 -167 -436 -152 -184 -157 -201 -88 -180 214 132 48 -194 -73 335 241
5732 241 -257 -122 109 136 84 32 -23 -302 -273 -67 123 -84 -196 104 -70 223 250 -61 -502 -134 201 -5
5754 -5 -20 134 45 101 -51 307 -74 -34 25 158 231 -162 18 154 478 -394 65 62 317 -55 480 -138 -260
5777 -260 291 -235 137 64 -189 -264 -28 148 67 44 57 36 5 -170 -154 78 247 -183 -144 -137 -72 209 -102 -51
5801 -51 -65 81 268 -93 -68 127 95 179 -133 -99 -4 -237 250 -226 8 148 -5 -23 87 -224 122 86 -290
5824 -290 -50 -103 117 36 -120 -170 -155 -160 -107 -395 -53 -127 238 118 -171 -132 -118 135 148 107 151 -272 -64 -19 250
5849 250 -124 -86 -177 -55 232 -42 -121 -127 103 63 6 206 -35 -138 -189 -69 198 -94 -116 -52 58 96 93 -290
5873 -290 46 179 10 -81 28 7 259 -137 170 -8 -204 13 57 46 -131 94 -135 115 83 -246 -134 -181
5895 -181 118 6 -90 358 61 -90 222 -63 152 -22 109 177 52 -123 -84 5 -80 85 72 331 281 -362
5917 -362 160 -215 -273 -101 39 99 185 -308 190 -70 239 141 -155 101 156 -120 -167 294 -235 -19 78 150 168
5940 168 -104 17 187 39 -3 -98 196 25 -212 409 258 -42 49 -43 228 -137 -248 -224 -72 -168 115 -4
5962 -4 -12 94 -185 38 -95 193 145 -217 -273 -48 16 35 79 29 166 -103 -203 75 171 95 59 95 125 -255 -181
5987 -181 74 -182 257 -1 191 107 210 17 70 -26 -56 -144 17 -374 43 -160 34 45 -134 -231 108 146 201
6010 201 -13 -240 333 216 -22 -124 -105 101 183 -53 22 -144 212 69 96 -70 241 -54 -317 -226 29 178
6032 178 -338 69 -23 -174 -53 143 -37 148 91 -52 -137 -31 -18 370 114 86 97 -114 279 -159 -392 -4
6054 -4 -60 3 275 70 66 62 236 115 38 1 394 -4 -343 -175 34 282 96 -67 100 204 98 127 -233 -18
6078 -18 73 -103 -190 -120 181 363 -187 -108 -23 121 216 265 7 256 25 58 13 180 37 -3 -121 -305 165 152
6102 152 -23 -236 -35 314 -33 -125 -401 -226 166 263 -52 -26 148 196 -281 239 -83 -119 -205 215 7 480
6124 480 17 16 -5 -94 89 -115 -114 118 236 111 96 -100 120 -50 168 225 -139 15 -262 8 41 268 5
6147 5 -97 -67 -50 -256 -126 371 -24 -179 136 200 -76 -62 -176 -38 169 179 292 -241 -175 22 -345 368 91
6170 91 -404 357 190 -81 -226 155 -248 118 -53 -149 22 21 10 -305 -72 -74 363 -59 30 -75 -111 -35 -26 -34 -35
6195 -35 -105 103 356 38 -22 54 -154 99 -104 -196 102 -248 -107 -150 9 154 -121 -223 238 25 129 159
6217 159 124 83 6 -193 281 -103 -11 -77 61 -85 39 -104 -24 -23 -42 135 172 190 47 290 389 60 206 105
6241 105 132 113 158 -403 -4 28 53 -96 -259 463 117 109 -79 149 32 -29 -254 -136 -74 -118 -289 -298 -217 56
6265 56 -98 -76 -303 -103 15 119 -406 45 240 134 -92 134 -161 16 207 -228 -71 76 -12 217 148
6286 148 4 -66 63 325 -95 -35 -146 240 71 299 -127 -239 201 -144 -551 169 145 -3 258 128 -103
6307 -103 109 -204 98 54 10 -5 -8 -29 -36 250 3 -42 83 -335 -137 45 48 56 101 -46 213 -152 -133 -33 100
6332 100 -127 -90 -14 12 70 305 -131 -115 9 46 98 84 -224 -79 140 -89 -30 -43 134 -290 -256 -90 105 2
6356 2 98 139 -10 -171 -27 170 117 -62 -112 26 28 0 -1 -319 -70 32 71 -171 175 -186 -215 151 -196 -28
6380 -28 -186 -207 -219 353 -48 -368 18 -54 -26 95 270 -120 229 -45 -312 -210 -186 217 -150 314 -132 -335
6402 -335 -150 -1 249 118 153 -19 16 287 80 -8 -178 186 135 -169 118 236 -403 -97 117 -49 -243
6423 -243 34 248 89 -104 -77 -258 -99 185 -265 8 -331 99 130 -88 223 311 -26 -161 6 17 -39 -38
6445 -38 -114 -61 89 -47 235 -32 -242 -123 49 -197 127 52 -166 -43 171 -163 -2 150 337 273 73 194
6467 194 -300 56 254 93 -69 -164 -30 90 223 -141 -67 -100 46 -245 -27 32 90 -116 -74 -137 -86 -23 -168
6490 -168 257 141 -58 -40 109 -142 124 261 -42 -455 17 100 -326 96 -193 397 98 -119 168 310 232
6511 232 76 -87 -358 149 -316 -227 69 -32 109 -25 73 35 28 -144 101 -157 -114 399 124 -134 -327 228
6533 228 250 60 -513 8 416 -125 -75 189 -121 115 -168 88 68 9 177 -45 -133 -75 -148 109 -17 86
6555 86 57 -105 506 349 -121 -332 -284 273 5 -23 10 -188 42 -115 28 -21 -81 228 -50 104 -88 11 18
6578 18 55 -182 -87 30 170 -36 -210 -185 29 247 7 -63 141 150 -51 -44 317 86 -221 389 41 -93 27
6601 27 23 -24 -32 -158 -205 17 -164 -355 -93 -73 93 -54 121 -99 -12 62 -41 217 -57 -236 -4 -187 395
6624 395 -496 -93 185 -13 395 -142 190 123 248 37 296 36 5 394 104 -111 33 -109 40 -41 -141
6645 -141 -125 48 66 -55 146 31 159 -229 387 -51 106 99 -85 -340 -210 -262 40 -47 -309 -133 -180 198
6667 198 332 142 277 -204 112 141 84 91 89 20 170 164 -213 -217 111 260 147 -71 133 5 240 -45 -116 -41
6691 -41 99 24 172 193 108 302 26 -41 -176 -19 -255 122 116 -134 -262 39 -228 -3 33 -257 -21 -21 73 194
6715 194 -109 -232 42 -133 53 -266 55 -27 73 30 -54 135 137 290 -30 -81 108 141 18 -76 -145 18 12 66
6739 66 -28 237 140 -319 182 158 -183 -113 -241 69 -366 60 -103 -283 17 159 117 56 27 -2 -388 68 56
6762 56 310 47 -55 103 34 163 -23 -288 86 -238 -129 168 75 184 59 -81 73 -109 108 -300 -71
6783 -71 33 -310 -40 12 -8 -47 -40 76 187 -77 127 54 -67 136 69 -252 -139 -148 -97 -220 138 -158 186 -70
6807 -70 204 295 -14 -180 -134 -161 3 273 17 70 13 -45 115 -119 130 289 376 -80 -68 -26 97 66 122 -29
6831 -29 107 -117 210 -80 -83 227 -172 -90 26 58 182 164 -190 -206 483 224 -60 76 -79 89 -43 -171
6853 -171 -180 -39 -93 114 -119 248 432 -60 276 245 145 263 14 -60 119 64 -185 -101 195 216 -209 -46 22
6876 22 -25 267 -14 -100 -19 -325 196 -104 -68 230 -66 -370 -84 83 24 50 -66 -99 -223 -166 188 178 -218
6899 -218 225 48 225 -42 254 64 -66 -221 -19 -164 51 -186 -111 -32 -79 197 -141 69 251 134 -37
6920 -37 43 49 45 -217 -72 -27 -83 -146 -123 162 -33 -40 115 -71 30 -125 151 -181 217 108 268 95 155 133 -73
6945 -73 -96 -70 140 132 -202 -164 103 33 155 257 219 -51 14 41 -120 5 -70 -362 6 -346 -185 352 587 -213
6969 -213 279 -66 48 322 29 59 -150 -151 81 211 214 -47 -214 97 -366 146 -123 10 -40 9 269 -159
6991 -159 118 -154 115 58 48 -75 -144 -59 -165 -128 -116 178 111 -26 282 102 -50 213 148 40 -74 50 -192
7014 -192 211 331 274 87 -151 -61 -101 265 292 116 189 -9 279 47 -63 -152 48 229 -87 13 -131 103
7036 103 -9 172 -247 20 186 70 -167 -164 239 101 -89 86 -415 -135 48 -22 56 -258 178 -253 96
7057 96 147 -51 -143 1 281 145 9 187 -111 -196 14 46 2 -175 -138 -57 -311 41 147 -252 -111 -18 -96
7080 -96 143 -238 346 173 187 106 315 -228 6 -14 -114 -41 -98 -244 102 -170 276 252 14 182 108 66 -71
7103 -71 -71 12 11 -332 169 47 -28 -220 -59 104 -23 -161 -147 206 -140 -158 -50 -387 -47 133 -161 -177 -175 326
7127 326 -209 40 -17 156 -67 -203 24 -330 273 -85 -114 18 -127 273 -193 -32 107 86 -213 292 141
7148 141 19 -102 103 167 -330 172 -9 -42 261 -246 31 139 292 -117 25 -52 131 82 101 129 206 -156
7170 -156 1 93 -196 165 29 -248 12 0 207 -6 -336 -14 303 -19 119 414 -76 206 -10 36 -338
7191 -338 199 30 253 7 272 16 -31 4 -284 450 165 102 258 195 -59 48 -166 158 -39 33 52 -208
7213 -208 86 31 -242 69 11 -172 28 202 168 -214 109 174 150 180 -59 -341 130 -267 -85 -293 -164 169
7235 169 -213 -6 154 82 -140 -60 228 197 47 -259 149 418 187 299 -191 -106 -57 152 120 285 78 -51
7257 -51 -255 -86 -16 82 134 -369 7 71 130 179 -206 11 -101 -157 69 11 -171 -220 -144 -315 -191 290 245 -358
7281 -358 -298 193 -239 112 168 -164 173 -16 268 121 171 118 68 115 210 -152 334 29 103 -226 95 -64 177
7304 177 36 -342 -264 -157 -190 -252 135 165 -428 -70 -65 144 18 -241 -84 -54 60 -162 -101 -75 279 37 290
7327 290 -182 -58 -28 188 172 -90 64 -83 -243 -172 -66 416 260 -254 -189 -28 -278 -182 283 154 178 -28
7349 -28 169 -123 -117 59 100 -213 47 45 130 149 411 -292 -37 -146 -172 -124 138 -45 19 -412 107 -78 164 -41
7373 -41 219 124 -48 80 104 22 181 102 -233 509 -144 324 68 64 -7 78 -33 -276 -9 207 -63 -212 -54
7396 -54 207 -66 -29 -8 -194 84 -124 45 -82 -342 -320 -58 -71 65 -112 21 336 78 39 92 164 -436 156
7419 156 56 300 18 -152 -95 -206 151 -23 212 -209 -40 -72 48 163 -40 58 -281 -87 135 -80 -215
7440 -215 -7 115 59 -11 -3 -630 -36 48 64 157 -156 -93 84 371 -24 -1 -201 -18 -140 24 -82 149 -10
7463 -10 -44 23 -108 135 64 310 -36 -38 153 -86 463 38 355 -195 -145 -32 -179 -168 -34 324 72 14 221
7486 221 143 -103 261 156 350 141 -145 76 32 -61 -127 126 -63 124 -11 -58 80 -106 77 -72 -103 -60
7508 -60 83 151 -279 77 -221 -251 73 244 -67 80 -363 67 -156 -146 27 26 102 -97 -75 177 -338 -298 84
7531 84 -109 118 191 -237 107 -251 -94 259 6 -214 218 190 -141 -287 121 -84 -287 191 -127 -57 -45 50
7553 50 -76 -32 178 87 106 -151 346 -92 -5 161 -33 246 -61 160 -296 -205 99 -75 -132 112 -181 -177 40
7576 40 -64 -70 -181 -52 -81 -257 266 -141 87 390 106 114 -137 -182 134 45 -60 -116 326 113 417 -56 23
7599 23 39 -18 15 -101 -153 120 187 87 -117 -79 -203 311 95 -53 -24 -94 201 85 105 -85 31 36 -111 -216
7623 -216 -85 -219 32 -63 -224 238 46 109 145 -222 -4 82 59 82 100 -12 50 11 146 -49 256 78 -95
7646 -95 13 74 236 -64 16 35 -60 -122 -264 -68 378 -170 -219 -61 -51 -103 -41 273 -467 -263 93 -55 382
7669 382 171 190 318 104 -191 -2 327 -13 84 46 -262 -184 196 -109 -154 210 -96 -263 -58 188 100 -30
7691 -30 -274 223 113 324 124 48 -96 -176 176 67 -198 -163 73 -396 41 10 -19 -64 -166 90 -257 202
7713 202 66 4 -216 -26 -92 43 -218 282 -267 -228 36 78 238 -16 125 80 217 -118 219 -223 -95 -157
7735 -157 47 -8 169 -122 -16 -70 250 11 -57 200 89 -48 -103 94 231 54 -139 45 -88 233 56
7756 56 -27 -175 -122 -115 -468 -122 -163 -179 56 306 -164 -121 125 169 56 -146 19 -172 108 -288 48 219 -195
7779 -195 -255 201 -82 -102 41 107 -247 -189 127 -159 204 -148 76 408 -75 -143 -62 -96 -271 -206 -67 -280 33
7802 33 58 328 -267 -15 -172 108 -289 -143 -292 12 85 -212 -13 -18 46 182 212 -227 108 -402 59 -217
7824 -217 185 205 -60 100 -48 -251 289 -351 151 -16 -116 -143 43 -19 -36 -113 88 -27 -70 -155 2 88 110
7847 110 72 -106 -146 -89 215 -175 111 -26 -75 -123 82 -363 -32 -162 83 -147 205 134 -16 22 66 -66 -154
7870 -154 -148 -480 0 52 -163 40 -44 -211 30 -15 97 -215 4 13 -12 -122 -7 -85 187 94 96 257 -220 -131
7894 -131 67 -172 -122 -10 153 -75 -85 48 -68 10 -73 -102 -167 -109 21 -103 -96 -76 50 -11 -203 219 -53 103
7918 103 -220 220 -348 -164 319 -96 90 70 -70 95 116 219 287 -172 -114 -228 -49 -298 28 -83 -167 -231
7940 -231 -14 -24 -69 95 -148 179 5 -64 -86 -281 -83 -47 -69 104 180 145 22 138 70 -97 -89 -168 116 97
7964 97 244 -385 -3 40 3 232 150 -1 109 -86 -59 -65 83 18 13 55 255 -337 -500 179 210 -217 -149 31
7988 31 238 -21 131 135 -80 -55 -95 203 -144 -63 97 197 144 284 -153 144 -10 -78 -135 -66 113 219 -255
8011 -255 -157 69 120 -168 90 -108 -200 -126 -68 188 -185 64 15 68 -131 400 403 -366 -155 11 70 -7 -76 34
8035 34 -7 351 147 -5 -225 -99 -65 324 -99 -208 122 19 38 -236 149 -134 336 -40 -102 -120 99 174
8057 174 285 -578 146 164 141 65 -203 -8 -67 -195 -11 0 29 85 -168 -177 -265 429 8 138 -64 -31 145 -646
8081 -646 2 -111 103 5 -79 -278 143 -143 1 24 116 -103 259 -196 -79 -3 -100 224 63 -250 -68 -235
8103 -235 65 276 -196 75 -104 22 -74 241 -75 -61 -113 -307 89 317 268 -31 231 14 -20 39 140 -207
8125 -207 226 -81 -230 -75 -172 77 -71 -11 -226 -211 -52 -86 226 -195 11 -78 -46 68 -210 -146 -291 -18
8147 -18 58 9 -136 174 114 -31 -83 -54 84 -106 -65 -43 162 265 -226 69 234 -61 -124 -166 120 -87 -245
8170 -245 -105 -104 42 495 128 66 -347 0 -163 87 -93 -135 249 -59 488 333 46 38 96 108 -128
8191a28
$$ Imaginary data points
##PAGE= N=2
##DATA TABLE= (X++(I..I)), XYDATA
0 0 0 0 0 -8 8 -8 8 -16 16 -24 32 -32 47 -56 70 -80 98 -119 137 -166 192 -222 258 -297 339 -390 443
27 443 -503 571 -645 723 -817 914 -1019 1139 -1269 1408 -1564 1739 -1924 2131 -2358 2609
43 2609 -2891 3207 -3555 3951 -4404 4924 -5529 6248 -7113 8177 -9527 11298 -13737 17329
57 17329 -23132 34056 -61673 268335 381383 -347527 -183301 -8568 -42067 216543 294781
68 294781 -250106 -352657 66081 239650 98787 -2239 -128446 -168862 -16879 210432
78 210432 176389 -102861 -209220 -44407 41107 134955 191654 -108325 -310941 11347 196745
89 196745 82070 81720 -91763 -330927 24639 372163 63113 -180502 -88610 -107269 19301
100 19301 286579 101074 -253707 -181447 69121 154793 102889 -21871 -125087 -137337 -5163
111 -5163 213283 155894 -155837 -184848 4990 50588 131054 155031 -151764 -274082 44696
122 44696 213884 106586 -13794 -182039 -183902 117717 242548 40944 -133258 -175427 -53727
133 -53727 181789 183532 -53643 -174423 -108787 54170 176235 71406 -96728 -112762 -72683
144 -72683 51455 197468 45935 -177124 -85356 26434 28955 142642 84811 -203833 -168252
155 -168252 114070 147984 46109 -28193 -148804 -116259 116946 196413 19217 -160181 -142239
166 -142239 35995 145064 90197 -26404 -141627 -123142 94719 180784 6670 -94987
176 -94987 -83163 -68039 84275 182197 -19342 -159071 -53139 13156 70923 147568 -17022
187 -17022 -204433 -64854 119670 104917 38323 -60259 -152121 -47086 146536 143396 -40737
198 -40737 -156902 -74245 67614 106345 67387 -37592 -157831 -65758 146112 115186 -43572
209 -43572 -64860 -72452 -47878 119496 135490 -70517 -127983 -26037 27859 89382 94232 -68091
221 -68091 -151716 -18803 105912 95891 7146 -94027 -106356 8019 125765 97506 -60856
232 -60856 -138529 -32535 78483 86568 46330 -64304 -143050 -6985 142251 64050 -45196
243 -45196 -60313 -75691 -3132 134719 77516 -92633 -100043 -9403 47961 88336 45715 -86197
255 -86197 -116607 10960 113676 71497 -36266 -89571 -62190 26989 115535 66120 -90644
266 -90644 -114867 10189 76048 65343 25477 -82924 -113886 36405 125100 32264 -48970
277 -48970 -64887 -58860 35540 120732 31284 -97410 -79508 10782 64792 71483 7845 -90578
289 -90578 -86381 40037 110460 34828 -58337 -72110 -36010 43413 107288 25651 -105221 -77561
301 -77561 33787 67602 52511 362 -92365 -76418 61862 102432 9557 -56473 -63353 -30715
313 -30715 56765 97428 1060 -97908 -59704 34235 68480 46645 -16323 -87804 -58031 63085
325 63085 96346 2175 -65283 -56076 -15622 58316 89313 -10445 -102906 -45407 47526 61923
337 61923 36455 -23772 -89267 -41264 75639 81431 -12203 -62334 -50209 -5513 65546 75032
349 75032 -25569 -95634 -32879 51286 60298 25941 -32896 -81716 -26756 78973 71752 -22933
361 -22933 -63199 -42178 3619 67450 64449 -38311 -90332 -17220 54528 53610 18850 -41151
373 -41151 -78327 -10072 81985 57455 -30994 -60789 -35232 13648 68384 50291 -47756 -82923
385 -82923 -6216 57870 48409 8718 -45793 -69264 1700 81576 46466 -38881 -58607 -26069
397 -26069 21564 66345 37696 -54318 -73977 4690 58185 42141 693 -49203 -60729 13139
409 13139 79216 34592 -43472 -54014 -19349 27113 63767 26727 -59867 -66008 14891 58468
421 58468 34633 -6362 -50429 -54049 22771 78106 23357 -49513 -48089 -10708 30923 60263
433 60263 16598 -64687 -57021 24415 56834 27314 -12860 -50967 -43965 31096 73520 12717
445 12717 -53564 -43561 -2020 34789 54069 6837 -66510 -48193 33355 54612 18092 -17976
457 -17976 -49719 -36072 39554 68197 -246 -53428 -35869 1834 37750 48987 -4895 -64871
469 -64871 -36164 35912 50715 13896 -24344 -47564 -25651 41799 62152 -5507 -56103 -30519
481 -30519 10506 36910 43837 -9462 -68217 -28415 46050 44726 5168 -24426 -47329 -19338
493 -19338 51509 53639 -18579 -52126 -23356 13759 40023 34426 -19291 -59278 -19912 44593
505 44593 43936 -2423 -30619 -37163 -12103 46488 51786 -21877 -56202 -15050 19860 35506 32982
518 32982 -24713 -63536 -6564 50837 32551 -4313 -30593 -41642 1512 54942 33008 -28922
530 -28922 -45335 -12906 23393 37712 18557 -28476 -50987 -4112 49447 30486 -14277 -27905
542 -27905 -29881 -2941 52390 37195 -38406 -46632 -720 20834 34828 23105 -38774 -53499
554 -53499 11323 48705 23047 -12687 -37419 -28978 18970 47704 17459 -33246 -42245 -1014
566 -1014 33194 28630 3821 -30247 -40956 8732 49303 16781 -20235 -25241 -25613 9567 54459
579 54459 16195 -44634 -31475 3959 22244 37534 6908 -49005 -35694 24410 42882 15132
591 15132 -23009 -37636 -12344 26142 39199 7696 -40988 -35983 17764 32656 13585 -490
603 -490 -30584 -35446 23679 46051 -3 -21719 -20816 -20195 21169 48743 -1699 -42359 -22142
616 -22142 6398 29452 32273 -12564 -46760 -18093 27806 39346 6445 -33599 -30285 2134
628 2134 27228 33311 -4069 -47055 -18506 29311 21112 7759 -1842 -37651 -22583 38511 31093
641 31093 -11560 -15135 -20756 -15038 32704 37829 -15555 -36305 -16203 12159 34793 19121 -24047
654 -24047 -36539 -9050 30998 39180 -7501 -40307 -16260 10581 25773 28120 -16956 -46251
666 -46251 -283 30010 12337 8226 -10666 -38808 -2014 39526 14282 -9884 -14109 -24789
678 -24789 -789 38210 20461 -19939 -30287 -13222 21614 34443 2988 -26291 -28871 -4112
690 -4112 38251 31859 -24912 -35165 -3092 11188 26186 21711 -30632 -37861 14777 25246 8611
703 8611 5371 -20242 -29927 12564 30887 7137 -8132 -20394 -18937 13934 30722 8998 -18406
716 -18406 -31093 -6314 32052 24283 -8329 -23138 -25530 4552 44868 15713 -34732 -22033
728 -22033 1647 10740 30901 8678 -40315 -21642 21035 17690 9486 -284 -27162 -17770 19337
741 19337 23145 4772 -12667 -23413 -6270 19447 21495 5554 -21833 -30631 8329 33998 10185
754 10185 -10270 -20939 -23277 17738 43140 -2599 -33424 -12460 1229 16672 29733 -8233
766 -8233 -37482 -6739 19142 15538 9282 -10898 -25696 -4728 18796 19142 3071 -20060 -19490
779 -19490 4713 17080 16665 2652 -28828 -23007 21088 26529 1121 -9156 -23098 -16899 29111
792 29111 32372 -15114 -26372 -8541 2762 23398 20638 -18850 -28683 -152 17186 17266 3307
805 3307 -18074 -17321 1658 16652 19267 -3529 -25412 -9936 10703 12967 15384 -3786 -32946
818 -32946 -9782 27725 16001 -2393 -10200 -24582 -4581 33524 18138 -19257 -20249 -6728 8497
831 8497 24532 8539 -21458 -20544 2102 19078 16181 -5746 -18357 -10414 2682 18375 16945
844 16945 -13748 -23402 -158 10368 12502 13612 -13680 -29767 3781 25282 8866 -3232 -14274
857 -14274 -21011 7181 29867 6748 -18543 -17635 -3609 15160 19872 -29 -19708 -16693 5200
870 5200 22317 10652 -12318 -14738 -7587 4893 21695 10441 -20447 -17046 4849 9444 13094
883 13094 7484 -20456 -20686 11597 20946 5911 -6266 -17216 -12900 13962 23170 1473 -18307
896 -18307 -16111 2940 17673 12793 -4145 -17847 -13911 10321 22514 2794 -13790 -10970 -5825
909 -5825 8874 22028 985 -22249 -10233 6516 10082 12820 -878 -22304 -11862 15049 17689
922 17689 2361 -10652 -15862 -4608 15387 18149 -2743 -20043 -11639 9131 15385 7372 -5807
935 -5807 -18408 -9903 16096 18488 -3582 -12694 -9276 -3479 13572 18213 -6751 -20276 -4922
948 -4922 8259 11447 9241 -7351 -20066 -4563 16736 14078 -2437 -12993 -11590 643 15539
961 15539 13796 -7795 -19920 -4629 12069 11398 4665 -7708 -17994 -3444 18917 12643 -6960
974 -6960 -11576 -7983 907 15840 12213 -11593 -17453 -1240 10425 11134 4183 -10978 -16078 324
988 324 17282 10251 -7275 -12898 -7138 4333 14735 9044 -12109 -17182 713 12472 8999 1644
1002 1644 -10907 -15021 3056 18707 6749 -9454 -10500 -5654 5315 15716 6390 -14268 -14616
1015 -14616 3184 11599 8491 145 -11998 -12875 5338 17348 5570 -10713 -10982 -3168 6293 14321
1029 14321 4287 -15069 -13097 5647 11776 6480 -1174 -12176 -11499 7752 16893 2014 -11040
1042 -11040 -9594 -2190 7891 13602 1478 -15714 -10290 6683 11591 5363 -3150 -11950 -8758 9227
1056 9227 15725 -50 -11916 -8421 -589 8558 12512 -826 -15911 -8252 8274 10576 4176 -4342
1070 -4342 -12320 -6834 11164 14243 -2058 -11688 -7267 339 9499 10997 -3021 -15404 -5861 9529
1084 9529 10375 2213 -5339 -11592 -5088 12031 12929 -3839 -11936 -5653 2078 9114 9817 -4888 -15244
1099 -15244 -3843 10306 8874 1228 -6121 -11436 -2453 12568 10659 -5376 -11697 -4542 3058 9994
1113 9994 7667 -6691 -14441 -1806 11053 8469 -144 -7048 -10181 -692 13762 8951 -7509 -10736
1127 -10736 -2826 4071 9526 6576 -8275 -13414 606 11021 6963 -1336 -8042 -9443 1718 12937
1141 12937 6843 -7484 -10645 -2326 5784 9073 4078 -8898 -12141 1948 11840 6027 -3151 -7767
1155 -7767 -7926 2732 13555 4691 -9776 -8670 -656 5672 9618 2672 -10596 -9933 3583 10106
1169 10106 4856 -3238 -8859 -6374 4429 11885 4221 -9692 -9486 1124 6820 7222 1484 -10289
1183 -10289 -10115 5921 11939 2273 -4613 -7604 -5753 6254 12285 283 -10348 -6248 1514 6854
1197 6854 7815 -1557 -10783 -6338 5550 9771 2733 -5537 -7772 -3360 5700 10945 1130 -11551 -6810
1212 -6810 4363 6648 6091 -463 -11876 -7045 9521 9629 -792 -4970 -7408 -3294 9241 9755
1226 9755 -3796 -9588 -4029 3144 7482 4960 -3950 -9203 -3904 7180 9118 -555 -7308 -5303
1240 -5303 -1603 6627 10461 -2819 -11969 -3067 5048 5684 5765 -3247 -12912 -1574 10976 6212 -1941
1255 -1941 -5713 -7566 625 10972 5434 -5566 -8371 -2997 5591 7213 1349 -4743 -7573 -2498
1269 -2498 8983 7560 -3923 -6766 -3483 -758 7990 8569 -6215 -10571 429 4831 5812 4680
1283 4680 -7423 -10782 2840 10173 3826 -2843 -7585 -5581 4891 8936 2079 -5895 -8140 -382
1297 -382 8180 4772 -1242 -4288 -6923 -128 10379 4095 -6165 -4053 -3001 -47 9546 5184 -9486
1312 -9486 -7665 2117 4611 6474 1556 -9782 -7329 5109 8679 3219 -4768 -8296 -1684 6590
1326 6590 6015 724 -6635 -7564 3555 8010 1583 -1534 -4178 -6619 3480 10547 5 -5558 -2697
1341 -2697 -3581 2721 10459 310 -9473 -4383 2280 5375 6495 -2299 -9549 -3237 5753 7642 1402
1356 1402 -7876 -6827 2393 5792 4652 -385 -9044 -5208 6958 5465 -787 -901 -5355 -5098 7223
1371 7223 7361 -3187 -3589 -2980 -2971 6104 7951 -3297 -7481 -2863 2696 7049 3823 -5755 -7126 -1294
1387 -1294 5787 7803 -1055 -9618 -3155 3908 4619 4767 -1986 -10264 -897 8348 2349 -466 -1206 -6587
1403 -6587 -1828 8417 3566 -3535 -2989 -4124 -92 7592 4104 -4587 -6220 -2540 4599 7430 -92
1418 -92 -6263 -4967 -392 6763 6929 -5220 -8515 474 3408 4345 4235 -5324 -8714 3195 6499 1227
1434 1227 355 -3652 -6383 2231 7148 1208 -2837 -4000 -3004 2884 6359 1288 -3980 -5743 -1306
1449 -1306 6854 5366 -2769 -4579 -3852 487 8547 4121 -7714 -5456 2022 2680 4970 1985 -8071
1464 -8071 -5595 5162 4452 1143 -738 -5153 -3758 4576 5236 636 -3064 -4617 -1056 4799 4133
1479 4133 184 -4106 -6130 1760 7597 1805 -3640 -3667 -3790 2893 8895 -225 -8087 -2699 1867 2947
1495 2947 5118 -861 -8035 -1928 4934 3256 1133 -2281 -5185 -773 4206 4129 130 -4977 -4049 2084
1511 2084 4566 2427 -186 -5416 -4517 4569 6033 -680 -3226 -3347 -2415 5212 7037 -3201 -6334
1526 -6334 -1375 1420 3713 3978 -3350 -6640 -1 4571 3732 -138 -4004 -3572 539 4088 3703 -1293
1542 -1293 -5918 -2010 3403 3135 1992 -1112 -6614 -1877 6151 4008 -1914 -2638 -3586 -510 6500 3706
1558 3706 -4502 -4830 -541 2312 4608 1693 -4504 -4571 365 4444 3147 -1682 -4201 -1959 1476 4338
1574 4338 3591 -3230 -5631 86 3220 2574 1273 -3011 -5478 803 6364 1709 -2051 -3050 -2971 1442
1590 1442 6177 1417 -4743 -3751 538 3447 3524 -77 -3757 -3595 1890 5211 2219 -3272 -3262 -997
1606 -997 1527 4330 1806 -4825 -3869 1769 3242 2156 852 -4292 -4123 3138 5213 517 -2682 -2857
1622 -2857 -2132 3019 4753 145 -4740 -3095 1336 3607 2110 -1172 -4153 -2569 2946 4818 147
1637 147 -3863 -2552 -580 2293 4500 -189 -5218 -2224 2481 2695 1912 -836 -4703 -1944 4050 4112
1653 4112 -354 -2792 -2647 -593 3367 3447 -1049 -4749 -2152 2586 3296 1128 -1568 -3871 -1808 3825
1669 3825 3736 -1161 -3684 -2031 99 3216 3774 -1864 -4958 -823 2609 2675 1263 -1916 -4062 -731
1685 -731 4206 2992 -1214 -3200 -1898 461 3608 2905 -2110 -4595 -681 2958 2748 233 -2016 -3593
1701 -3593 -353 4507 2684 -2183 -3226 -1104 947 3598 2510 -2747 -4371 272 3252 2277 144
1716 144 -2684 -3718 830 4030 2243 -2264 -3339 -1028 1285 3358 1960 -3183 -4019 582 3464
1731 3464 1485 -229 -2345 -3248 916 4385 1419 -2921 -2758 -392 1320 3260 1024 -3500 -3200 1376
1747 1376 3440 1839 -544 -2686 -2407 1767 3997 1165 -3009 -2483 -31 2036 2884 680 -3131 -3040
1763 -3040 1607 3301 1074 -1196 -2771 -1956 2321 4052 44 -3229 -1870 218 2197 2949 -186
1778 -186 -3467 -2270 2190 3214 916 -1379 -2282 -1631 2336 3488 -311 -3257 -1614 523 1842 2483
1794 2483 -445 -4039 -1653 2292 2721 443 -1498 -2676 -1448 2862 3344 -798 -3201 -1448 873
1809 873 2319 2104 -1210 -3607 -1194 2942 2526 -11 -1867 -2303 -846 2881 2874 -1417 -3443 -648 1152
1826 1152 2138 1916 -1161 -3576 -604 2792 1916 -86 -1667 -2439 -12 3018 2154 -1576 -2872 -886
1842 -886 1475 2599 1489 -1638 -3143 -598 3234 1993 -891 -1652 -1692 -177 3281 2187 -2820 -2975
1858 -2975 195 1258 1843 1397 -2052 -3154 784 2611 1014 -804 -1862 -1945 978 2893 1533 -1753
1874 -1753 -2765 -347 1778 1831 455 -2126 -3041 376 3509 1199 -1761 -1461 -1337 507 3435 776
1890 776 -2974 -1711 583 1307 2164 477 -2338 -1858 1204 2147 1144 -847 -2099 -992 1243 2518
1906 2518 946 -2247 -2478 964 2192 1315 383 -2256 -2498 1703 3351 -108 -1775 -1211 -1044 1452
1922 1452 3376 -390 -2805 -981 605 1585 1425 -611 -2317 -858 1529 2063 588 -1604 -2052 -301
1938 -301 1194 2235 307 -3116 -1758 1681 1605 1159 -293 -2869 -1544 2536 2282 -603 -1480 -1188 -717
1955 -717 2367 1888 -1602 -2435 -522 1088 1648 1089 -1317 -1664 -544 1455 2073 -288 -2067 -671 163
1972 163 1068 2393 -551 -2682 -825 1909 1032 569 -575 -3088 -264 2787 1041 -743 -1263 -1407
1988 -1407 417 2956 579 -1516 -1730 -350 1579 1838 -243 -1291 -1186 -330 1825 1744 -1049 -1750 -300
2005 -300 88 1652 2009 -1723 -2704 640 1308 872 931 -1409 -2748 1083 2384 335 -764 -1209 -1013
2022 -1013 1502 2056 -29 -1117 -1549 -144 1915 1264 -741 -720 -1230 270 2589 954 -1729 -1080 -105
2039 -105 -118 2156 1241 -2341 -1493 1100 757 1015 424 -2091 -1571 1640 1619 432 -1135 -1825 -127 1896
2057 1896 1280 -414 -1360 -1478 826 1959 17 -606 -570 -1222 610 2294 -215 -1549 -736 -499 742
2074 742 2306 261 -2372 -529 883 1184 1390 -555 -2361 -375 1576 1455 -76 -1526 -1468 889
2090 889 1458 728 -189 -1850 -1223 1738 1393 -494 -206 -789 -1219 1568 1791 -1180 -1113 -611 -436 1347
2108 1347 1735 -884 -1744 -664 812 1352 807 -1453 -1477 -6 1360 1397 -204 -2426 -456 1414 1099
2125 1099 859 -449 -2063 -343 2143 494 -760 -261 -1238 -446 2305 833 -1214 -806 -499 -223 1727
2142 1727 766 -1467 -1113 -267 662 1513 -38 -1335 -887 80 1342 1481 -1167 -1999 118 862 777 492
2160 492 -844 -1764 983 1748 -13 -191 -850 -1345 309 1776 -32 -1074 -981 -774 841 1267 188
2177 188 -1216 -1163 -115 1459 1224 -768 -1323 -315 464 1357 723 -1660 -1216 699 803 638 268 -1667
2195 -1667 -1412 1222 1207 42 -250 -1008 -943 1185 1269 -252 -706 -1104 -161 1097 749 -66 -1097 -1156 357
2214 357 1759 114 -990 -781 -517 528 1527 -323 -1734 -833 582 807 728 254 -1626 -669 1249
2231 1249 848 43 -613 -995 -280 917 773 -209 -1151 -796 792 1032 531 -210 -1057 -850 1002 1292 -300
2250 -300 -804 -632 -407 560 1153 -1001 -1497 -112 705 577 741 -715 -1255 -69 1102 729 -244 -927
2268 -927 -1002 37 836 885 -274 -1446 -292 731 759 347 -459 -1105 -429 1083 877 -679 -228 -525 1
2287 1 1033 1053 -984 -1277 196 349 487 324 -947 -1135 106 1163 604 -685 -717 -365 638 820 889
2306 889 -690 -1056 246 902 491 34 -708 -1065 361 1361 479 -701 -835 -545 719 1162 341 -1347
2324 -1347 -937 269 639 413 -200 -1081 -648 689 1189 207 -596 -910 -250 670 1020 472 -1182 -907 729
2343 729 1026 273 -262 -752 -1043 731 1358 -5 -680 -716 -261 541 963 -271 -815 -932 392 888 534
2362 534 -565 -951 -245 693 1367 120 -836 -599 209 732 759 -29 -1139 -645 557 912 229 -182 -808
2381 -808 -429 944 918 -370 -630 -582 15 752 703 98 -945 -636 587 1022 141 -536 -797 -523 631
2400 631 678 -674 -857 -295 238 765 769 -241 -1010 -358 602 1017 -134 -399 -895 -260 865 838 -543 -898
2420 -898 -384 405 757 557 -88 -1244 -235 1057 659 -205 -397 -780 -241 1412 627 -550 -865 -275
2438 -275 322 612 473 -836 -1155 -86 1105 195 -28 -647 -674 159 843 496 -347 -845 -243 319 950
2457 950 628 -664 -906 355 1015 425 -116 -852 -646 40 1257 513 -770 -659 44 596 596 -78 -868
2476 -868 -847 85 754 305 -261 -688 -341 219 880 485 -797 -721 264 122 347 21 -765 -779 271 754
2496 754 71 -113 -626 -597 307 958 -182 -672 -330 -1 459 877 -154 -979 -400 435 525 507 -472 -588
2516 -588 -12 529 973 -69 -1234 -473 364 338 512 71 -1025 -714 630 664 -201 -201 -583 -244 957 987
2536 987 -534 -480 -418 329 603 303 106 -744 -563 622 1062 -181 -783 -419 11 647 666 -489 -607 -164
2556 -164 463 170 616 -419 -1107 -294 769 263 42 -389 -647 -32 873 628 -369 -666 -172 205 950
2575 950 458 -406 -626 -117 797 684 -155 -441 -246 -53 507 437 -891 -886 5 329 222 410 -392 -846 218
2596 218 730 329 -97 -502 -325 85 711 423 -340 -976 -338 610 285 -104 -129 -697 -217 1130 467 -750
2616 -750 -271 -455 133 621 451 -730 -516 -46 230 485 -27 -450 -484 696 724 418 -304 -586 -244 339
2636 339 641 156 -88 -781 47 732 207 4 -365 -797 303 1192 40 -625 -228 -491 -54 971 -48
2655 -48 -839 -187 379 248 531 -303 -630 -140 519 408 133 -483 -759 6 103 686 351 -479 -329 706
2675 706 778 4 22 -909 -642 698 645 -398 -493 -217 -201 641 759 -278 -526 30 94 526 -3 -441 -372
2696 -372 -59 120 425 164 -524 -84 125 196 507 -80 -863 -217 530 38 -158 -61 -768 -241 1007 520
2716 520 34 -316 -202 192 502 307 -530 -412 -46 188 789 -261 -434 -335 -69 541 575 -286 -571 -247
2736 -247 16 153 694 -475 -923 186 427 316 -111 -540 -611 261 910 -8 -570 -629 -265 506 669 -79
2756 -79 -185 -307 -220 677 139 -237 -261 17 -51 725 656 -734 -425 82 82 194 143 -500 -471 314 424 200 282
2779 282 -517 -407 421 329 101 -396 -372 -28 630 234 -194 -484 -568 210 697 -75 -523 -39 -363 284 1043
2800 1043 -174 -708 -316 46 249 313 230 -416 -103 454 172 271 -135 -552 -54 379 149 38 -668 -443
2820 -443 -35 382 82 514 -487 -288 188 444 -201 -389 126 -165 461 539 -247 -329 254 193 -199 403 -428
2841 -428 -381 -57 159 159 -268 -260 -648 117 250 328 41 -865 -374 94 329 -56 38 -424 47 567 261 -241
2863 -241 -57 -259 -321 647 152 -401 -664 158 58 422 327 -333 -346 32 463 506 -142 -698 20 -240 259
2884 259 293 -155 -548 -121 383 183 187 -322 -673 243 585 677 -483 -132 -528 117 413 482 -374 -577 -114
2905 -114 130 325 -41 -336 -525 247 209 187 261 -546 -37 -98 170 110 -447 -285 137 432 73 136 -381 -313
2927 -313 255 118 -85 122 -244 -298 168 511 54 -385 -155 -128 329 348 352 -146 -266 432 516 160 -311 -150
2949 -150 -143 8 350 5 -406 -265 103 216 170 120 -155 -64 293 410 66 -75 -231 151 317 254 -365 -429
2971 -429 -257 157 297 276 -432 -363 -403 587 480 -159 -76 128 31 309 381 -164 -436 -334 488 250 -182 -319
2993 -319 -328 131 266 243 3 -238 -255 -79 510 385 -47 -354 -243 65 470 12 -478 -213 -131 241 556 -111
3015 -111 -139 21 78 481 306 -112 -374 -25 273 267 300 -130 -276 245 423 -15 -287 -654 -54 333 292 217
3037 217 -110 -504 28 366 349 -153 -198 -293 91 206 8 -190 -458 -268 248 553 119 -140 -502 141 348
3058 348 -57 -146 -380 -55 18 378 378 -163 -357 -417 131 482 146 -249 -488 15 476 442 -15 -154 -159 15 307
3081 307 100 -551 -76 54 450 332 -184 -436 -37 58 303 -14 65 -369 -362 -32 302 160 -461 -33 -158
3102 -158 266 405 12 -694 -264 99 76 92 -25 -86 -199 450 159 158 -180 169 48 191 481 20 -451 -9
3124 -9 136 489 71 -340 -94 -412 306 240 -202 -441 -162 76 358 311 -140 -305 -107 499 196 153 -167 -216
3146 -216 132 513 282 -79 -216 -93 221 258 205 -55 -310 -452 301 391 -24 -60 -205 -153 424 149 -81 -238
3168 -238 18 -95 579 351 -248 -413 107 332 20 62 -42 -240 70 411 200 -64 -345 197 -107 107
3188 107 11 371 -56 258 254 324 -405 -277 -117 -356 499 199 -228 -443 -223 314 147 -140 -73 -493 -112 235
3210 235 -131 177 -356 -362 125 150 134 -128 -230 -15 148 36 -67 -80 -34 205 178 132 -246 -281 -354 378 446 -34
3234 -34 -196 -170 -66 126 201 165 -200 -27 340 38 -189 -541 -403 -132 -153 352 165 35 -91 236 303 19
3256 19 197 -260 -211 331 521 -45 105 -394 -29 84 138 -230 -384 -210 114 271 -62 134 88 15 117 215
3278 215 184 -456 -46 -73 151 176 -190 -205 78 -5 52 -70 -128 -366 25 258 163 -295 -220 -310 -175 292 209 -84
3302 -84 -321 -228 271 277 369 1 -199 36 297 137 70 -232 -107 200 222 302 -449 -184 171 336 -222 636 -107
3325 -107 -241 -155 230 139 143 -171 -367 91 210 339 -312 -164 -251 374 364 -57 110 -177 -106 -7 46 -205 -212 75
3349 75 -19 61 252 -162 118 98 192 -135 186 -66 -44 50 360 -78 -2 -357 -187 -20 -17 -3 -203 -212 349 768
3373 768 -104 -144 -202 -153 118 305 -126 -337 -16 -49 -47 307 -43 -240 -208 -113 123 278 203 -156 -63 416 12
3396 12 94 -281 -198 164 296 370 -287 -91 -126 -28 121 89 69 86 -194 269 229 -15 -368 -89 111 184 334 -55
3420 -55 -76 -143 -201 242 83 -91 -160 -171 -5 30 268 -324 18 -104 44 211 70 -186 80 501 253 -220
3442 -220 -121 17 -35 238 128 71 -246 11 7 257 402 -145 194 46 190 328 73 -314 -23 -258 194 402
3464 402 -225 -306 109 361 -105 215 -17 -18 95 294 -8 -273 -316 -126 -306 408 104 -175 259 -82 72
3485 72 -177 -187 93 6 -272 -64 166 -336 -148 -37 162 254 135 -313 -183 85 66 136 166 -436 -4 -92 -145
3508 -145 -66 28 26 -263 203 216 104 -57 -80 -37 296 188 -10 79 -92 60 152 -274 143 -77 -218 30 542
3531 542 -55 -40 131 354 219 382 343 -133 -115 90 341 53 -108 -400 31 61 313 305 -54 47 101 -23
3553 -23 304 -181 0 242 96 72 79 10 -128 52 228 302 -1 -434 1 201 86 -17 -171 -256 185 267 10
3576 10 -99 -21 180 15 -168 280 149 128 -159 -46 120 54 14 122 -97 360 280 -140 91 -70 -61 68 -4
3599 -4 -25 -29 -33 34 25 -75 -189 -248 -180 479 75 -72 -52 -105 159 -126 125 239 127 66 128 166 -11 -16 -79 -9 -5 -29
3627 -29 -94 -400 -123 82 129 116 -227 -22 -284 299 279 40 -37 -36 247 267 143 -68 -246 -209 39 -107 340
3650 340 74 -30 -55 161 102 179 -206 138 153 112 -192 -28 -107 -181 153 156 142 -159 135 -13 147 8 -213
3673 -213 -90 -122 42 166 -78 -145 -7 -97 -156 -4 116 346 -168 189 446 188 -187 -126 -171 40 194 21
3695 21 -21 -378 -193 -133 38 449 -271 131 193 75 -202 -63 -82 -79 140 44 -108 -67 -94 69 95 -24 -213 -311
3719 -311 -277 -52 260 220 34 133 -181 212 -117 57 -302 -239 12 12 338 -110 -484 36 206 87 -137 -302
3741 -302 323 -190 118 90 -92 -438 -7 122 241 -159 198 -252 -116 322 33 -178 11 3 -161 108 -35
3762 -35 246 -135 -496 236 17 -7 53 -138 270 109 -423 73 -101 -237 -141 -74 28 71 17 -105 -65 75 -220
3785 -220 91 -99 -189 -149 40 -98 4 81 64 130 -122 -44 -153 -101 62 -166 399 -323 -357 45 -30 239 66
3808 66 -87 56 -40 141 -108 -208 57 -168 12 321 -131 -288 -51 49 31 -88 -87 -105 -271 -1 -23 -91 -383
3831 -383 89 111 93 74 -134 181 -67 -50 -62 -83 19 -418 -1 -3 190 -183 -233 -54 106 61 -58 187 -118
3854 -118 15 -87 -32 -93 238 -48 50 -170 176 141 -228 -147 -28 137 -65 69 116 -171 265 61 -165 -101
3876 -101 -465 -59 252 121 -129 -78 192 284 398 -140 274 48 -161 84 162 62 -162 91 104 222 376
3897 376 98 234 -53 -201 139 348 -50 94 336 -73 262 174 -84 225 251 262 48 -311 -126 -43 204
3918 204 267 -45 -184 52 -68 -126 226 -341 -37 57 -81 283 -283 -96 -139 163 -242 -485 158 60 -137 286
3940 286 -152 -208 -384 -134 -30 94 38 -84 -160 93 -23 383 152 -56 -137 108 -274 187 107 -64 -15 101
3962 101 -11 267 108 -30 383 -258 154 40 -2 52 -276 -112 146 357 -60 -129 -100 34 235 -7 -155
3983 -155 62 -420 -106 142 190 251 195 184 -246 55 -54 15 80 490 231 22 -265 76 -202 241 137 -104
4005 -104 -114 88 -71 356 -39 -127 -142 40 -141 304 139 -241 41 -3 335 32 -64 -153 -66 -24 253 -34 -159
4028 -159 259 -48 142 4 81 46 -218 17 245 110 57 5 -65 -59 17 -34 47 147 131 -58 -148 -160 -155 -197 120
4053 120 26 -253 -47 -231 -137 -255 13 -103 -200 -186 113 234 -53 64 -38 -63 102 -183 -48 -150 -75 -239
4075 -239 -15 67 -147 152 -53 60 -122 -10 -96 -138 2 172 -274 -56 107 -67 32 -58 79 282 -40 164
4097 164 243 198 -35 -74 114 -13 334 140 -370 -147 -48 -194 220 -191 -199 -55 111 89 -122 -27 -47 242 -50
4120 -50 -171 -42 86 -227 -63 172 -202 34 -156 -532 150 208 -76 274 162 4 176 499 165 -280 -297
4141 -297 11 54 -96 7 -355 -152 -161 -58 -50 -69 -220 -60 232 138 -249 -1 7 -178 -144 73 -110 -185 -12 -58
4165 -58 -188 -65 42 -256 367 77 198 282 -128 39 58 17 137 -189 -132 101 304 167 -191 -165 74 -27
4187 -27 40 -103 137 -24 139 -44 -171 377 242 -346 63 349 -37 -12 96 183 -33 -153 -221 -74 -30 54
4209 54 139 139 36 -26 112 58 233 90 -341 -174 356 31 -20 317 -333 -198 24 283 381 199 -97 -19 166
4232 166 83 308 58 159 -40 82 50 -7 51 -5 210 131 178 -81 145 -39 -251 212 310 75 -316 -83 79
4255 79 222 114 -310 115 178 -114 119 78 -77 -496 -196 369 -67 -252 -127 158 -227 77 142 -44 -186
4276 -186 -185 50 75 157 -305 81 177 129 -116 -155 22 -194 -266 107 -59 -66 81 171 -150 58 -9 -366 -134 363
4300 363 -213 -117 -136 63 -313 99 66 -301 -58 -58 162 246 134 162 -88 -86 -330 -175 183 83 88 -178 155 1
4324 1 -63 -223 -2 -68 115 -167 -355 -164 57 142 -270 98 47 -155 226 -131 -49 58 -262 116 -17 37 146
4347 146 289 -143 92 161 305 -115 120 -30 -114 -352 -268 264 78 -204 -253 131 147 -350 -38 168 73 144
4369 144 262 76 -7 -29 -22 -72 -93 93 -147 -38 -402 78 -46 -47 139 145 377 -92 -94 15 -198 91 132 -64
4393 -64 91 83 -38 243 249 -28 -29 337 -7 -58 -138 410 158 291 98 136 83 221 264 -261 -102 166 -74 -345
4417 -345 187 207 155 -484 -36 -94 -92 -42 -39 -33 -225 81 193 -18 167 163 16 494 -146 -285 -201 68 -178 -49
4441 -49 85 -25 51 -82 94 -173 114 6 102 331 77 249 -11 -101 -256 206 -23 7 115 -156 -59 -36
4463 -36 164 108 44 53 151 -160 111 -72 -50 -38 -177 -12 131 -84 -276 93 147 216 -41 362 21 -134 160
4486 160 297 -126 156 -95 -280 -131 -52 -97 -220 175 241 -28 139 -176 -25 354 -93 55 -70 314 -93
4507 -93 10 -96 19 170 37 -263 193 -99 24 -167 164 237 388 -121 94 -312 40 -122 174 346 -158
4528 -158 35 -117 -52 -48 -39 -88 -498 196 -1 -163 -59 -164 -311 123 -146 134 327 -272 -141 -88 40 -135
4550 -135 102 -80 61 92 55 -78 49 204 -128 0 -97 94 3 102 -513 214 450 343 -30 201 93 30
4572 30 69 255 -265 73 47 -80 393 -89 -48 -16 1 114 -76 -36 82 101 601 93 -76 58 53 23 9 198
4596 198 -229 -407 44 320 -340 -273 127 292 -162 33 -161 -55 164 53 -136 114 210 -19 21 -180 298
4617 298 69 17 -636 -144 134 -24 29 221 -177 103 5 -132 234 -64 29 -15 296 -28 -78 111 -23 132
4639 132 -61 -180 -7 -148 144 -27 39 7 -155 7 60 146 -89 -8 -33 47 43 71 114 -28 116 13 52 35
4663 35 240 -335 157 303 -347 262 133 -79 -59 -72 310 -231 75 415 -258 191 327 -163 230 -2 1 339
4685 339 -86 -35 -191 81 105 93 -170 -89 131 368 -251 -142 179 29 -100 105 119 83 113 65 387 -314 -62
4708 -62 -153 -198 291 -270 -251 -85 -46 -51 394 26 165 204 83 292 171 -112 99 136 -150 90 115 -67 -156 -264
4732 -264 212 -95 -62 -170 -127 -149 -167 43 12 -21 -190 146 160 -61 265 3 -9 -36 177 39 153 -146 -489
4755 -489 66 162 102 129 -188 215 -80 6 120 338 -184 166 295 193 7 -55 -335 -295 115 83 -10 -163 -11
4778 -11 -71 -41 117 -124 -106 315 -14 92 -256 239 63 19 -26 52 302 -110 -117 -125 155 230 -65 -34 -59 148 -75
4803 -75 40 -432 46 -105 -34 459 356 -127 110 48 209 196 62 -151 -4 29 56 132 -333 149 -134 -164 -71
4826 -71 -20 -269 -191 278 -10 -37 91 -13 -23 56 -105 -87 16 -178 10 445 -326 -45 96 223 -136 42
4848 42 86 -24 221 -186 160 44 86 -215 -134 -147 100 -172 -68 127 -104 -299 221 -94 98 88 9 -5 130
4871 130 226 190 84 188 -155 -41 -171 73 110 -173 -138 -160 124 -355 -53 201 -5 -64 196 -96 -155 -36
4893 -36 -30 -110 25 112 232 3 306 -173 -333 20 -52 -41 183 -86 138 -197 156 -86 -77 -23 -53 -23 12 -114
4917 -114 185 118 35 -71 71 125 148 -252 272 13 -36 -180 104 -37 5 271 -105 126 84 145 249 96 78
4940 78 -19 93 -180 96 13 -114 -98 92 173 -213 -131 64 18 -193 93 -292 -8 -101 50 221 -208 80 -209
4963 -209 58 -223 134 -216 -5 -37 100 -58 210 124 -131 -38 -295 -227 -136 -18 46 62 -102 15 134 -69
4985 -69 55 68 330 205 89 -121 -27 -74 -93 -246 253 -11 -99 129 -107 -204 127 54 -205 13 173 -25 44
5008 44 112 183 -154 -165 190 163 139 89 58 219 194 -190 -195 -115 92 -149 -114 -175 -291 -96 214 -63 1 -220 -60
5033 -60 45 -144 68 1 484 66 -56 100 -92 -58 164 142 -85 233 -106 -17 -35 -123 -64 -16 147 -295 -121
5056 -121 115 120 -249 239 -203 123 -7 164 116 -140 -135 227 -18 -94 -234 67 -122 -3 -45 86 -354 -314 197
5079 197 82 74 144 213 142 142 21 -103 -132 143 -253 49 -378 -195 171 -281 229 -52 153 19 90 22 -212
5102 -212 -111 -59 -20 4 -196 -21 3 -276 95 -121 -9 -83 158 -241 -60 -39 -228 88 82 -128 0 -229 47
5125 47 -30 -65 -202 -249 339 364 274 180 -549 152 -211 220 167 -146 -64 -282 -64 -57 -8 241 197 -2 -28 162 141
5150 141 87 21 -110 -168 205 15 -241 81 -27 161 -15 -74 104 -89 -155 2 -46 141 79 269 -188 43
5172 43 291 231 -85 5 61 171 207 -190 86 -143 21 -235 46 48 82 -66 75 -88 -112 180 -139 -351 305
5195 305 75 -119 31 -43 166 22 145 175 126 192 219 -88 -236 226 -114 -2 163 -135 172 -22 267 -6
5217 -6 -198 -13 -106 2 -111 105 -135 209 -174 -37 -5 -10 -163 -238 -173 -119 99 117 -36 315 -237 -194 127 136
5241 136 301 379 -63 -102 297 -71 110 -3 54 -20 -70 -304 154 188 104 132 117 -105 -71 -231 -75 162 1
5264 1 -283 112 -189 127 219 -122 -123 -175 339 173 -58 24 136 203 -74 35 -214 -81 89 45 -67 324 -124
5287 -124 -94 -66 238 205 145 165 -82 -130 78 -210 -180 -19 -23 -65 155 -135 1 -39 35 25 170 141 -61 126 42
5312 42 -66 102 -95 289 -11 196 -126 -63 -7 -93 232 -95 190 97 139 -84 -147 179 -59 184 -333 -330 29
5335 29 -11 21 -186 73 213 -35 -100 -118 -201 72 2 -11 17 27 -195 -38 60 -33 -172 14 44 91 459 -168 26
5360 26 26 -91 150 82 195 -121 -49 49 -215 96 83 141 -3 -272 80 -203 134 -96 -134 -309 45 -192 286
5383 286 287 82 -198 -3 -86 100 145 137 146 -262 -5 -41 74 -227 164 292 -57 -283 50 1 139 -95 54
5406 54 -61 50 19 0 125 -117 49 -6 281 124 -49 -21 -38 -241 112 123 77 30 49 49 78 -50 284 200 129
5431 129 167 240 144 -92 -165 -89 -149 58 11 328 -88 -279 -13 -150 -54 12 56 -174 241 9 -307 188 308
5454 308 194 107 -399 -130 -167 -44 165 185 -51 75 -146 295 123 54 -130 52 117 -64 8 -187 251 -166
5476 -166 228 -10 234 197 175 101 -300 85 15 75 -25 -9 12 387 197 21 -43 65 21 104 -105 -107 -396 198
5500 198 -81 153 136 -177 49 -106 -281 -29 26 157 -130 58 62 38 -26 -12 159 -18 7 136 17 -194 66
5523 66 -168 -11 -144 330 56 112 320 155 385 -206 197 29 85 197 -204 30 -60 -317 -77 -71 34 -406
5545 -406 124 227 -34 153 120 303 93 -156 -241 162 214 -27 -374 -105 -327 -85 -11 37 -202 -83 -69 126
5567 126 -364 -136 -427 -63 136 94 219 135 -199 81 76 32 100 -175 51 -145 81 25 -228 -151 1 61 5
5590 5 63 -183 341 287 206 30 67 160 -325 -3 31 -166 18 75 98 -343 -76 -146 199 -7 -210 50 -58 -105
5614 -105 -48 -142 -302 -124 -111 10 -264 -81 -53 136 107 13 -235 -57 -99 179 198 -170 -372 77 116 -68 58
5637 58 74 225 182 180 -215 -35 80 101 149 284 -286 -83 -150 -229 206 154 22 105 315 312 -43 -74 131 -133 -251
5662 -251 -134 201 228 -299 25 144 -34 179 86 -368 92 97 -4 118 70 -201 -90 -78 123 194 -25 83
5684 83 59 188 -6 0 172 -108 148 192 -19 147 371 292 81 205 118 172 -103 70 -87 -268 -56 185 101
5707 101 37 24 73 -70 293 -186 110 425 -133 87 126 10 -117 -150 97 80 -193 71 -42 6 -62 244 482
5730 482 239 224 -67 125 151 -36 -11 -86 -261 143 66 278 -215 -27 -118 141 -60 35 126 -99 -165 -19 100
5753 100 -168 -131 -21 212 56 255 153 30 -211 -15 -41 -219 -81 69 -108 -9 18 86 194 -112 -179 247
5775 247 63 -2 -252 154 -196 324 -178 -101 368 156 -22 -446 98 345 114 -171 221 367 -1 13 60
5796 60 -248 -39 -73 -137 146 -227 11 349 -35 -149 14 -182 -148 22 -50 -146 73 25 38 455 -41 -18 126
5819 126 11 -78 -82 138 130 170 261 17 -193 534 -206 62 81 -342 -131 -46 -186 -172 -104 -151 1 -106 202 137
5843 137 -157 -28 -286 90 198 -91 294 -5 91 -58 354 32 -179 -22 -28 41 79 32 -110 188 97 319
5865 319 -131 -199 -127 111 -73 -94 -60 188 444 -204 82 164 32 -15 54 331 48 -258 63 212 -74 274
5887 274 -81 -249 -19 58 -155 -125 -170 -114 -86 360 205 -98 2 -121 309 136 -8 -89 93 -29 263 146
5909 146 -169 -171 54 -160 -96 203 -90 150 -53 -9 -26 -149 142 225 136 255 114 260 7 39 35 105 -47 -57
5933 -57 -153 -27 107 -159 94 -92 -29 61 -149 -65 -315 -74 -114 138 127 -272 96 29 163 56 -32 120 -94
5956 -94 -63 95 50 -322 -371 20 63 -165 255 74 82 47 129 273 -162 72 17 -162 -55 164 58 -276 -48
5979 -48 51 368 -133 219 93 -408 -400 -12 69 220 42 -95 -134 120 117 -107 219 8 85 217 -316 -86 -271
6002 -271 140 -135 -264 -127 -40 314 191 105 -29 -202 -168 297 -88 150 -361 294 376 118 -106 -76 166 203
6024 203 -431 69 -256 -31 -12 -149 93 115 122 132 -144 -192 -31 260 -161 28 60 146 197 205 82 -43 -22 221
6048 221 117 -261 225 -129 69 89 113 0 -33 -221 158 99 -126 59 171 -122 -314 -69 -184 147 -3
6069 -3 -92 -95 -98 396 269 182 264 -170 -49 -143 -126 8 -82 -149 -157 4 -13 76 428 57 -147 52 105 127 67 -186 -24
6096 -24 -95 55 41 -220 35 329 54 -147 -166 32 -189 49 201 -63 -70 -117 -288 -63 136 297 332 -163 137
6119 137 129 156 -62 138 -23 -62 259 -106 143 34 -172 -132 -206 -602 156 -40 -127 -22 30 -109 104 -44 103
6142 103 -262 -153 -21 -136 -155 0 71 -368 215 -206 -38 -46 -33 55 -142 -35 -53 -63 52 116 116 146 68 -350
6166 -350 -111 46 -130 -57 61 -104 -132 -193 98 234 -376 40 -489 23 -137 20 -131 -30 220 88 -86
6187 -86 105 -160 40 223 -63 -113 39 285 -216 -128 -78 -147 144 -88 144 417 146 167 -164 332 -61 -233
6209 -233 204 -22 -197 -45 -127 -18 94 -16 114 -248 -73 110 18 -310 28 -277 19 13 -149 22 153
6230 153 -75 143 -22 -347 83 121 46 72 61 -141 -24 -285 109 -204 -423 -195 4 88 -170 -272 22 35
6252 35 281 84 -8 -223 342 103 -152 -140 -41 171 93 212 212 52 -87 -155 49 113 199 -48 98 78 86 346
6276 346 -37 181 358 227 29 107 -97 26 254 -160 197 30 -339 -207 58 45 2 -5 -21 -20 186 -166 41
6299 41 25 337 -79 -200 50 -274 46 -44 -233 138 133 216 64 151 -20 -50 96 -312 83 -199 327 100 21
6322 21 248 -152 176 -143 -130 249 -25 -96 41 -34 49 183 200 -183 -84 -90 -291 75 -131 -215 55 136 36 -297
6346 -297 -189 -106 138 -2 243 -158 -133 6 -169 174 -119 91 -58 -68 -92 121 -249 -161 -208 -173 -10 -234
6368 -234 246 46 164 -104 -71 -34 231 71 21 132 -80 -66 -156 -148 -143 321 80 -181 -4 49 83 235 -16 132
6392 132 16 -24 4 -190 -170 27 61 249 -138 -151 19 -121 -106 -168 -112 28 -247 171 -194 -426 48 27 118
6415 118 -22 124 -52 -80 261 -89 -147 -42 193 -181 261 -42 -100 -20 -157 -102 107 -376 -72 -213 63 -193
6437 -193 -114 -43 -18 -83 -209 62 99 52 -82 125 173 40 -94 -138 35 -94 -20 10 -101 319 -158 -7 118
6460 118 52 -101 -84 8 134 -234 -87 -199 -76 66 -160 173 179 297 388 104 -292 9 -133 -164 -259 -81 -14
6483 -14 -79 162 222 271 -8 320 -140 320 -119 95 135 20 80 -32 211 172 108 217 130 73 90 213 -99 -312
6507 -312 222 -95 152 126 303 -264 13 65 -193 -43 -263 -57 33 67 -69 -40 169 66 -225 -115 143 -109
6529 -109 -85 -147 188 24 8 -142 -13 141 -226 166 287 74 94 -61 -130 -251 -148 -100 -49 -29 398 53 414
6552 414 281 72 -3 22 91 -120 75 40 338 177 -154 -152 14 122 50 -257 -11 34 14 13 -8 -267 84 28
6576 28 286 219 -10 -268 59 -85 50 -92 14 46 87 -152 -292 301 -203 -202 51 109 56 -233 -77 -60 -144
6599 -144 -108 68 -65 258 92 6 -259 -138 -157 70 -145 -109 246 281 137 55 257 437 146 -44 -192 211
6621 211 296 147 313 -16 -106 87 252 32 -22 -332 -300 249 -156 -345 163 160 -39 65 70 -141 -301 14 -141
6644 -141 271 1 127 -97 -181 121 -90 107 -60 -55 48 -262 129 -300 55 -67 -161 375 -337 -63 -227
6665 -227 187 -109 81 80 232 -165 -78 34 -256 69 -73 -161 -21 -190 3 -115 -146 -149 38 389 -75 1 -25
6688 -25 135 -198 145 126 -7 -128 -230 9 19 -316 -46 206 -61 -369 324 146 1 -177 -210 -17 -481
6709 -481 -104 114 -238 -204 176 -26 -80 64 176 24 -51 191 -99 87 94 -318 -183 93 -259 109 -290 -69
6731 -69 9 -238 -125 -75 -123 -3 -371 -160 58 -153 -171 -181 -24 -233 185 -49 -129 192 -18 219 -257 95
6753 95 -334 -116 79 -73 178 139 282 154 -116 -98 78 -175 -260 422 169 54 -110 -24 -256 23 -54 -160
6775 -160 -50 269 29 -360 202 -28 202 -20 -7 -94 35 -158 29 106 21 -14 -77 266 -90 -114 -123 -144 -338
6798 -338 -184 349 20 -115 412 -167 116 171 -210 -69 339 204 220 110 -282 340 -5 -133 -96 225 6
6819 6 27 25 -115 70 -122 -62 91 207 142 18 -190 -126 16 -10 90 -45 149 -20 152 292 322 74 12 -41
6843 -41 73 -299 -16 13 -153 -114 -2 173 101 -308 -162 248 241 -12 -18 225 -6 -29 -394 -65 174 -70 -61 40
6867 40 95 -227 221 73 -316 284 491 -243 109 -70 119 -150 -64 272 -326 -193 -40 -240 -132 -50 211
6888 211 102 2 -82 -73 -199 -10 -4 94 -16 -294 279 351 62 185 -91 24 -178 35 315 -124 161 -320
6910 -320 10 132 104 70 145 -119 141 198 132 -204 -61 126 -171 -155 174 146 -309 -78 -150 100 -53 -24 -119
6933 -119 -146 -186 28 -179 -11 -57 -208 221 -144 53 -122 -306 145 118 191 -41 308 246 131 -244 -197 -47
6955 -47 -98 -22 -126 -217 -39 194 -49 75 223 -90 -215 80 73 292 157 -205 65 77 176 125 47 347 141
6978 141 190 -192 3 290 -87 -234 10 -7 57 -155 345 -82 159 -118 -159 -82 -4 -160 -121 326 36 56 -9
7001 -9 63 -36 1 140 195 136 97 -140 -23 358 -10 292 -26 -262 -8 131 26 200 62 5 179 -41 -253
7024 -253 144 148 -90 46 113 180 -103 118 -235 327 4 146 301 -220 -50 3 167 -55 -68 262 116 -47
7046 -47 8 -119 -103 -140 173 188 67 -281 -220 -175 209 -160 238 28 64 -42 183 174 40 -56 356 -88 -364 193
7070 193 -61 -253 -121 -13 172 240 -23 292 13 51 -98 233 -224 -71 96 53 -191 24 42 214 -295
7091 -295 -86 8 63 42 13 298 -5 -78 95 274 125 -75 -185 104 -32 194 114 331 -67 12 -196 38
7113 38 81 80 159 -351 -189 148 17 -28 50 -54 327 112 80 -92 -13 -55 -33 75 -111 -135 -215 -106 131 7
7137 7 166 -78 -192 -136 81 -101 251 509 59 154 133 -94 -249 23 219 -63 -125 212 -71 -137 41 -106
7159 -106 -134 149 74 75 -46 -46 -15 7 234 -102 -107 257 -92 451 117 80 -81 -320 46 -146 53 -150 -29 -138
7183 -138 -66 428 12 -19 -314 -84 197 429 -39 69 3 207 -148 -251 118 -34 31 -167 149 -71 -49 -135
7205 -135 -44 76 -75 94 58 -98 -45 194 16 -105 -86 303 271 -70 -36 9 -74 -280 -61 12 248 -119 -46
7228 -46 -91 -79 -71 235 -46 34 -76 -9 28 123 -140 -100 -126 -120 -19 1 -410 -289 -17 160 -24 149 310 -393 330
7253 330 211 221 106 -29 -52 63 -81 25 55 -131 -200 -43 194 -341 230 -8 -29 89 90 -64 74 -72
7275 -72 11 531 -197 -225 -409 42 43 -50 135 333 65 380 8 11 -208 -15 20 -125 -9 336 -7 353 52
7298 52 129 51 227 -229 67 104 -189 113 128 45 21 -12 143 -288 -138 61 103 -61 278 53 87 -4 -84 97
7322 97 133 -226 -107 -226 353 -165 -54 -50 -55 -113 -85 -38 -214 206 -62 -171 116 126 -87 -104 -4 90 -394 -248
7346 -248 86 -100 -10 -238 163 6 -279 139 29 -73 -329 -45 -216 -248 -62 17 150 148 110 22 152 134 -141
7369 -141 -39 70 -85 -18 144 11 -82 62 -41 111 -71 -140 -185 252 56 99 78 240 -46 17 -126 -119 -66
7392 -66 54 37 -94 -168 -25 -189 -68 47 6 -121 -444 30 256 -153 -120 89 38 -280 -149 338 59 330
7414 330 -192 49 137 -282 -122 -103 34 -143 108 42 319 -87 -153 -26 -65 78 142 -126 -90 -90 -1 266 185 -324
7438 -324 -202 -263 -205 -94 141 95 102 155 -456 295 -63 207 -220 7 448 -7 93 35 60 -142 239 168 -169
7461 -169 -98 -108 16 65 -99 214 -203 114 264 -257 -26 -67 165 -159 6 -112 -9 -52 118 95 -135 171
7483 171 135 35 39 -131 -16 415 112 -34 -88 94 -5 143 111 54 58 -238 101 -81 -125 -220 67 176 176 -171
7507 -171 14 228 64 185 169 -187 -85 -26 -70 62 -144 160 -190 -463 79 0 -49 -31 -5 -243 62 -387
7529 -387 46 93 100 -230 286 -16 -97 -93 17 7 -42 181 26 117 164 -21 73 177 -56 77 -113 -289 -72 -263
7553 -263 -78 46 62 -5 349 180 -151 421 -25 116 553 121 -168 66 -95 -227 -31 48 17 160 42
7574 42 -69 -151 -76 -99 284 101 -107 -131 -132 -152 -206 80 -116 12 56 -126 -113 -280 -69 -88 170 22 -244 265
7598 265 180 17 54 -288 -502 -86 23 1 251 -82 64 36 -112 -223 104 -108 222 -186 248 174 6 -81
7620 -81 -34 -136 466 99 54 -165 -122 214 -166 -109 -132 59 -193 195 -88 -354 188 -101 -185 -53 149 143 -232
7643 -232 -10 183 -65 125 -265 23 -34 -28 187 7 21 -1 -193 58 -22 126 -188 189 68 -13 -31 -142 -28
7666 -28 78 -3 -17 20 35 98 -118 37 -183 26 -215 64 -242 -41 -93 -282 -210 151 -58 -72 162 30 161
7689 161 -134 166 248 70 322 -19 -338 -44 -74 -94 289 -161 36 -190 -303 135 -68 -176 -44 251 -104
7710 -104 -74 -42 -155 -53 -19 168 402 94 97 -119 157 -10 105 -110 -226 -69 -134 -19 -365 -178 39 -117
7732 -117 456 84 120 34 -162 -84 281 31 -106 -71 179 -22 -122 350 -82 20 190 -131 -55 -100 65 157
7754 157 -239 -71 187 73 -157 -58 -220 139 1 -188 -138 163 -151 -104 18 194 -201 97 57 95 -183 204
7776 204 -235 -319 201 -452 137 -183 -131 -86 22 7 -126 97 118 51 102 69 -120 170 327 -135 -114 -121 154 -148
7800 -148 117 37 126 -6 -198 -158 -376 -44 -84 -74 -226 -121 180 121 -24 -134 -447 -240 309 156 483 220
7822 220 318 78 21 506 -19 143 79 -52 -137 -179 370 103 -73 -115 114 169 59 -279 -414 86 -330 -179
7844 -179 -105 -101 -147 63 -86 -15 349 251 -148 153 46 324 91 -57 134 229 86 -39 30 -139 39 177 66
7867 66 194 227 342 287 -56 -277 -11 295 193 15 94 276 12 35 -157 -13 -4 8 -205 103 186 -192 -70
7890 -70 -110 301 119 62 137 -26 41 -29 15 -57 13 51 247 -197 -36 88 31 24 130 -95 8 2 -35 -201 164
7915 164 -91 116 -306 -43 75 3 -107 -314 309 180 174 106 -90 -119 -191 22 227 -104 173 68 -115 289
7937 289 138 12 179 255 159 -169 -120 -51 -99 -142 -128 -48 -36 0 103 -122 135 -193 -23 -292 59 -142 10
7960 10 9 43 137 93 -83 192 166 -341 -47 -120 7 167 -301 96 14 -147 94 -133 132 127 87 90 -127 -137 -38
7985 -38 296 -226 -226 89 -69 133 44 -209 -10 244 204 -130 -82 -57 9 -294 256 -388 -74 94 -52 -75 176
8008 176 -190 -360 -234 -113 -16 147 67 -74 -193 -165 -94 -231 92 131 195 146 60 -271 333 -2 -81 -149 -296
8031 -296 -89 360 102 73 -101 -7 247 170 -57 106 -85 -139 50 194 -101 -157 -177 95 -81 264 20 228
8053 228 95 -79 110 -175 -192 101 216 209 -34 -99 0 -260 18 -28 203 126 -30 180 142 -11 -11 -105 206 205
8077 205 69 280 -160 -6 422 89 -197 -102 260 10 -67 -129 -22 129 -85 -85 -57 67 295 -162 -40 197
8099 197 160 -109 202 197 -24 220 -38 332 94 30 -40 -227 81 -82 111 12 60 -365 -310 45 97 52 -75
8122 -75 -111 -81 -90 -226 261 68 447 -304 97 451 -83 -101 119 48 116 88 -42 -381 25 -11 -92 36 -214 158
8146 158 -131 132 283 -121 -5 91 -320 64 -61 117 -307 24 -508 -163 -76 -309 140 -77 143 -13 140
8167 140 -435 255 -86 100 -24 176 255 211 94 188 -15 -81 226 -43 -180 156 -125 81 -251 -163 47 54
8189 54 168 -107
8191a07
##END NTUPLES=NMR FID
##END=
