##TITLE=1H_DE-72HCl
 D2O
 8 sc, 
 2.11.2024
##JCAMPDX= 6.0         $$ Bruker NMR JCAMP-DX V2.0
##DATA TYPE= NMR FID
##DATA CLASS= NTUPLES
##ORIGIN= UXNMR, Bruker Analytische Messtechnik GmbH
##OWNER= root
$$ XWIN-NMR		Version 3.5
$$ Sat Nov  2 15:10:24 2024 Russian Standard Time (UT+4h)  she@DPX200
##.OBSERVE FREQUENCY= 200.1318
##.OBSERVE NUCLEUS= ^1H
##.DELAY= (6, 6)
##.ACQUISITION MODE= SIMULTANEOUS
##.ACQUISITION SCHEME= undefined
##.AVERAGES= 8
##.DIGITISER RES= 18
##SPECTROMETER/DATA SYSTEM= spect
##.PULSE SEQUENCE= zg30
##.SOLVENT NAME= D2O
##.SHIFT REFERENCE= (INTERNAL, D2O, 0, 15.7039)
##AUDIT TRAIL= $$ (NUMBER, WHEN, WHO, WHERE, WHAT)
$$ ##TITLE= Audit trail, XWIN-NMR		Version 3.5
$$ ##JCAMPDX= 5.01
$$ ##ORIGIN= Bruker BioSpin GmbH
$$ ##OWNER= she
$$ F:/spectra/data/she/nmr/H-F/1/audita.txt
$$ ##AUDIT TRAIL=  $$ (NUMBER, WHEN, WHO, WHERE, WHAT)
(   1,<2024-11-02 15:09:20.85 +0400>,<she>,<DPX200>,
      <created by zg, POWCHK disabled, PULCHK disabled
       configuration hash MD5:
       00 E9 B6 7A A2 85 ED C7 34 08 36 98 17 FE 4E 26
       data hash MD5: 16K
       71 F9 E2 6D 8F 91 40 A4 59 C9 29 7E 1F C0 AE 6C>)
$$ ##END=
$$ 
$$ hash MD5
$$ 6E 90 11 B6 D1 DE 6A FF 2D 71 E9 F9 F3 28 47 C4
##$RELAX= 
##$RELAX= 
##$RELAX= 
##$RELAX= 
##$RELAX= 
##$RELAX= 
$$ Bruker specific parameters
$$ --------------------------
##$DU= <F:/spectra>
##$EXPNO= 1
##$NAME= <H-F>
##$PROCNO= 1
##$TYPE= <nmr>
##$USER= <she>
##$AMP= (0..31)
100 100 100 100 100 100 100 100 100 100 100 100 100 100 100 100 100 100 
100 100 100 100 100 100 100 100 100 100 100 100 100 100 
##$AQSEQ= 0
##$AQ_mod= 1
##$AUNM= <au_zg>
##$AUTOPOS= <>
##$BF1= 200.13
##$BF2= 200.13
##$BF3= 200.13
##$BF4= 200.13
##$BF5= 200.13
##$BF6= 200.13
##$BF7= 200.13
##$BF8= 200.13
##$BYTORDA= 1
##$CFDGTYP= 0
##$CFRGTYP= 5
##$CHEMSTR= <none>
##$CNST= (0..31)
1 1 145 1 1 1 1 1 1 1 1 1 1 1 1 1 1 1 1 1 1 1 1 1 1 1 1 1 1 1 1 1 
##$CPDPRG= <>
##$CPDPRG1= <>
##$CPDPRG2= <>
##$CPDPRG3= <>
##$CPDPRG4= <mlev>
##$CPDPRG5= <mlev>
##$CPDPRG6= <mlev>
##$CPDPRG7= <mlev>
##$CPDPRG8= <mlev>
##$CPDPRGB= <>
##$CPDPRGT= <>
##$D= (0..31)
0 1.2 0 0 0 0 0 0 0 0.06 0 0.03 0 0 0 0 0.0002 0 0 0 0 0 0 0 0 0 0 0 0 
0 0 0 
##$DATE= 1730545760
##$DBL= (0..7)
120 120 120 120 120 120 120 120 
##$DBP= (0..7)
150 150 150 150 150 150 150 150 
##$DBP07= 0
##$DBPNAM0= <>
##$DBPNAM1= <>
##$DBPNAM2= <>
##$DBPNAM3= <>
##$DBPNAM4= <>
##$DBPNAM5= <>
##$DBPNAM6= <>
##$DBPNAM7= <>
##$DBPOAL= (0..7)
0.5 0.5 0.5 0.5 0.5 0.5 0.5 0.5 
##$DBPOFFS= (0..7)
0 0 0 0 0 0 0 0 
##$DE= 6
##$DECBNUC= <off>
##$DECIM= 24
##$DECNUC= <off>
##$DECSTAT= 4
##$DIGMOD= 1
##$DIGTYP= 9
##$DL= (0..7)
0 120 120 120 120 120 120 120 
##$DP= (0..7)
150 150 150 150 150 150 150 150 
##$DP07= 0
##$DPNAME0= <>
##$DPNAME1= <>
##$DPNAME2= <>
##$DPNAME3= <>
##$DPNAME4= <>
##$DPNAME5= <>
##$DPNAME6= <>
##$DPNAME7= <>
##$DPOAL= (0..7)
0.5 0.5 0.5 0.5 0.5 0.5 0.5 0.5 
##$DPOFFS= (0..7)
0 0 0 0 0 0 0 0 
##$DQDMODE= 0
##$DR= 18
##$DS= 0
##$DSLIST= <SSSSSSSSSSSSSSS>
##$DSPFIRM= 0
$$ [...]
##$SUBNAM2= <"">
##$SUBNAM3= <"">
##$SUBNAM4= <"">
##$SUBNAM5= <"">
##$SUBNAM6= <"">
##$SUBNAM7= <"">
##$SUBNAM8= <"">
##$SUBNAM9= <"">
##$SW= 24.0689170037331
##$SWIBOX= (0..15)
0 0 2 0 0 0 0 0 0 0 0 0 0 0 0 0 
##$SW_h= 4816.95568400771
##$TD= 16384
##$TD0= 1
##$TE= 0
##$TE2= 300
##$TE3= 300
##$TEG= 300
##$TL= (0..7)
0 120 120 120 120 120 120 120 
##$TP= (0..7)
150 150 150 150 150 150 150 150 
##$TP07= 0
##$TPNAME0= <>
##$TPNAME1= <>
##$TPNAME2= <>
##$TPNAME3= <>
##$TPNAME4= <>
##$TPNAME5= <>
##$TPNAME6= <>
##$TPNAME7= <>
##$TPOAL= (0..7)
0.5 0.5 0.5 0.5 0.5 0.5 0.5 0.5 
##$TPOFFS= (0..7)
0 0 0 0 0 0 0 0 
##$TUNHIN= 0
##$TUNHOUT= 0
##$TUNXOUT= 0
##$USERA1= <user>
##$USERA2= <user>
##$USERA3= <user>
##$USERA4= <user>
##$USERA5= <user>
##$V9= 5
##$VALIST= <valist>
##$VCLIST= <CCCCCCCCCCCCCCC>
##$VD= 0
##$VDLIST= <DDDDDDDDDDDDDDD>
##$VPLIST= <PPPPPPPPPPPPPPP>
##$VTLIST= <TTTTTTTTTTTTTTT>
##$WBST= 1024
##$WBSW= 4
##$XGAIN= (0..3)
0 0 0 0 
##$XL= 0
##$YL= 0
##$YMAX_a= 263148
##$YMIN_a= -291958
##$ZGOPTNS= <>
##$ZL1= 120
##$ZL2= 120
##$ZL3= 120
##$ZL4= 120
##$ABSF1= 10
##$ABSF2= 0
##$ABSG= 5
##$ABSL= 3
##$ALPHA= 0
##$AQORDER= 0
##$ASSFAC= 0
##$ASSFACI= 0
##$ASSFACX= 0
##$ASSWID= 0
##$AUNMP= <proc_1d>
##$AZFE= 0.1
##$AZFW= 0.1
##$BCFW= 1
##$BC_mod= 2
##$BYTORDP= 1
##$COROFFS= 0
##$CY= 11.3945322036743
##$DATMOD= 1
##$DC= 2
##$DFILT= <>
##$DTYPP= 0
##$F1P= 15.6554695791079
##$F2P= 12.8336369535428
##$FCOR= 0.5
##$FTSIZE= 0
##$FT_mod= 4
##$GAMMA= 1
##$GB= 0.15
##$INTBC= 1
##$INTSCL= 1
##$ISEN= 128
##$LB= 0.24
##$LEV0= 0
##$LPBIN= 0
##$MAXI= 10000
##$MC2= 0
##$MEAN= 0
##$ME_mod= 0
##$MI= 1.114404
##$NCOEF= 0
##$NC_proc= 0
##$NLEV= 6
##$NOISF1= 3.799351
##$NOISF2= 2.8
##$NSP= 1
##$NTH_PI= 0
##$NZP= 0
##$OFFSET= 15.70392
##$PC= 1
##$PHC0= -26519.77
##$PHC1= 18.18743
##$PH_mod= 1
##$PKNL= yes
##$PPARMOD= 0
##$PSCAL= 0
##$PSIGN= 0
##$REVERSE= no
##$SF= 200.130013532006
##$SI= 16384
##$SIGF1= 3
##$SIGF2= 2
##$SINO= 400
##$SIOLD= 16384
##$SREGLST= <1H.CDCl3>
##$SSB= 0
##$STSI= 0
##$STSR= 0
##$SW_p= 3612.71676300578
##$SYMM= 0
##$S_DEV= 0
##$TDeff= 0
##$TDoff= 0
##$TI= <>
##$TILT= no
##$TM1= 0
##$TM2= 0
##$TOPLEV= 0
##$USERP1= <user>
##$USERP2= <user>
##$USERP3= <user>
##$USERP4= <user>
##$USERP5= <user>
##$WDW= 1
##$XDIM= 8192
##$YMAX_p= 0
##$YMIN_p= 0
$$ End of Bruker specific parameters
$$ ---------------------------------
##NTUPLES= NMR FID
##VAR_NAME=  TIME,          FID/REAL,        FID/IMAG
##SYMBOL=    X,             R,               I
##VAR_TYPE=  INDEPENDENT,   DEPENDENT,       DEPENDENT
##VAR_FORM=  AFFN,          ASDF,            ASDF
##VAR_DIM=   8192,          8192,            8192
##UNITS=     SECONDS,       ARBITRARY UNITS, ARBITRARY UNITS
##FACTOR=    0.0002076,     1,               1
##FIRST=     0,             0,               0
##LAST=      1.7004516,     0,               0
##MIN=       0,             -291958,         0
##MAX=       1.7004516,     263148,          0
$$ Real data points
##PAGE= N=1
##DATA TABLE= (X++(R..R)), XYDATA
$$ [...]
$$ plain form
388 3826 -9153 -12876 -3015 10141 12614 2115 -10164 -11521 -1111 9890 10344 32 -10135
401 -10135 -9282 1680 10835 8405 -3062 -11256 -7815 3572 11255 7444 -3898 -10874 -6524 4460
415 4460 10210 4901 -5362 -9720 -3598 6413 9625 2725 -7203 -9829 -2238 7597 9487 1647 -7458
430 -7458 -8569 -933 7284 7455 -179 -7533 -6622 1446 8250 6242 -2492 -8704 -5988 2820 8486 5590
446 5590 -2744 -8009 -4860 3204 7387 3434 -4138 -7051 -2407 5063 7159 1908 -5617 -7612 -1804
461 -1804 5802 7284 1358 -5486 -6203 -713 5149 5321 -257 -5658 -4816 1471 6518 4617 -2039 -6655
477 -6655 -4631 1895 6394 4617 -1780 -5937 -3521 2465 5230 2237 -3223 -5095 -1517 3917 5665
492 5665 1492 -4507 -6030 -1458 4274 5346 1174 -3640 -4412 -539 3801 3811 -649 -4641 -3495 1534
$$ packed form
388C826j2979l723R861J3156K473j0499j2279j357J0410J1001M54j0312j0167
401a0135Q53J0962R155k430j1467q194L441J1387P683l811j1342o976M350J0984
415D460N750n309j0263m358O122J0011L212o900r928k626P591R835J890p840r105
430g458j111P636Q217J71p634p354R11Q068O804k008q734o212K716Q808N666k896
446E590q334n265L149Q064M183l953p572k913M644P470K096n251p525j995N808
461a804P606J482n926o844p17N490N862J72n578n401Q42O287N047j901o656m616
477f655K024O526M499j777o397m157K416N986K765k993n460j872L578N434J748
492E665m173n999j523M572N732J072m172m814p72L873M340J0m460l992J146N029
$$ plain form
508 1534 5053 3612 -1414 -5081 -3924 1070 4762 3392 -1280 -4100 -2186 1979 3777 1363 -2715
523 -2715 -4165 -1207 3398 4657 1251 -3311 -4374 -1327 2793 3706 991 -2593 -3157 -48 3271 2849
539 2849 -929 -3766 -2825 1036 3967 3079 -648 -3687 -2896 750 3279 1976 -1300 -2872 -1320 1795
555 1795 3106 1230 -2219 -3721 -1310 2315 3627 1170 -2116 -2894 -815 1940 2489 260 -2455 -2352
571 -2352 445 2946 2354 -515 -2796 -2476 60 2506 2364 -211 -2448 -1716 928 2380 1183 -1339
587 -1339 -2641 -1194 1581 3032 1450 -1546 -2807 -1119 1278 1951 643 -1207 -1689 -208 1753 2005
603 2005 -192 -2405 -2234 103 2309 2280 216 -1792 -1979 -111 1641 1222 -788 -1687 -595 1287 1968
620 1968 925 -1227 -2429 -1513 939 2405 1376 -623 -1566 -789 612 1229 128 -1439 -1512 432 2164
$$ packed form
508A534L519j441n026l667J157M994L692j370m672k820J914M165J798k414m078
523b715j450K958M605J259l406m562j063L047M120R13k715l584n64L109L319m22
539B849l778k837R41L861K931q88l727l039P91L646K529j303l276j572J552L115
555A795J311j876l449j502K411L625J312k457l286p78K079K755N49k229k715J03
571b352K797K501n92k869k281L20K536K446j42k575k237P32K644J452j197k522
587a339j302J447K775J451j582k996j261J688K397O73j308j850m82J481J961K52
603B005k197k213J71K337K206k9k064k008j87J868J752m19k010q99J092J882O81
620A968j043k152j202R16K452J466j029j999r43P77J401O17j101j567p3J944J732
$$ plain form
637 2164 1843 -233 -1992 -1943 -423 1293 1773 592 -850 -959 190 917 345 -830 -1505 -725 1139
654 1139 2271 1295 -987 -2176 -1300 433 1374 835 -160 -755 -189 829 849 -411 -1464 -1186 132 1529
672 1529 1774 585 -1178 -1822 -633 843 1020 44 -610 -275 602 924 396 -842 -1686 -749 984 1655
690 1655 874 -228 -999 -1074 -218 780 616 -472 -780 270 1090 792 -250 -1170 -1166 -313 1132 1502 292
709 292 -883 -845 -39 341 224 47 -350 -510 250 1236 816 -665 -1335 -645 415 892 776 -6 -838 -655
729 -655 464 899 -23 -833 -421 165 464 575 431 -486 -1164 -339 849 921 -118 -490 -354 -86 360 702
749 702 -1 -923 -661 540 925 200 -382 -328 -243 -24 477 643 -258 -894 -271 571 588 121 -268 -466 -457 280
771 280 809 251 -738 -605 393 641 158 -161 -239 -410 -235 540 703 -113 -604 -297 169 227 227 47 -340 -498
$$ packed form
637B164l21k076j759M9J520J716M80j181j442j09J149P27n72j175o75P80J864
654A139J132r76k282j189Q76J733R41n39r95n95N66J018K0j260j053K78J318J397
672A529K45j189j763o44J189J476J77r76o54L35Q77L22n28j238q44R37J733O71
690A655p81j102p71p5Q56R98j64j088l08J050Q20k98j042r20MQ53J445L70j210
709B92j175L8Q06L80j17j77l97j60P60R86m20j481o70O90J060M77j16p82q32J83
729f55J119M35r22q10M12N86K99J11j44r17o78Q25J188P2j039l72J36K68M46L42
749G02p03r22K62J201L85p25n82N4Q5K19N01J66r01o36O23Q42J7m67l89j98RP37
771B80N29n58r89J33R98K48m83l19p8j71J75P75J63q16m91L07M66N8%j80l87j58
$$ plain form
793 -498 225 873 302 -654 -655 -61 320 292 276 48 -405 -256 329 464 -119 -471 -259 88 284 458 224 -418
815 -418 -686 -139 556 395 -212 -280 64 109 72 155 -150 -439 -343 314 560 198 -161 -301 -300 -82 372 420 -164
838 -164 -415 29 481 297 -254 -394 -256 -26 247 391 128 -327 -203 -28 149 73 10 -79 -184 37 387
859 387 310 -163 -513 -230 241 338 152 -30 -130 -154 98 279 18 -274 -220 -1 188 173 126 -77 -400 -237
881 -237 152 323 -7 -303 -60 115 142 47 -126 -277 -292 64 311 137 -90 -138 -92 -47 84 141 29 -160 -170
904 -170 241 334 -19 -260 -228 -60 52 242 122 -111 -189 36 131 42 -112 -106 0 34 84 263 -32 -310 -256 64
928 64 272 121 -95 -60 -37 -94 128 16 -223 -245 59 199 129 -41 -42 -75 -202 -72 257 161 -100 -140 33 182
952 182 -15 -51 -108 -123 22 173 287 -6 -196 -146 104 24 -35 44 -18 -72 -49 158 92 -200 -204 48 146 100 104 7
$$ packed form
793d98P23O48n71r56jN94L81k8j6k28m53J49N85J35n83l52K12L47J96J74k34o42
815d18k68N47O95j61o07o8L44M5l7Q3l05k89R6O57K46l62l59j40JK18M54M8n84
838a64k51M44M52j84n51j40J38K30K73J44k63m55J24J75J77p6o3q9j05K21L50
859C87p7m73l50K83M71R7j86j82j00k4K52J81k61k92N4K19J89j5m7k03l23J63
881b37L89J71l30k96K43J75K7r5j73j51j5L56K47j74k27m8M6M5J31N7j12j89j0
904a70M11R3l53k41L2J68J12J90j20k33p8K25R5q9j54OJ06L4N0J79k95k78N4L20
928F4K08j51k16L5K3n7K22j12k39k2L04J40p0j70jl3j27J30L29r6k61m0J73J49
952A82j97l6n7j5J45J51J14k93j90N0K50q0n9P9o2n4K3K07o6k92mK52R8m6Mr7
$$ plain form
978 7 -115 -151 15 174 -32 -116 -17 91 23 -32 -30 -64 -191 -16 173 181 -19 -101 -25 59 20 11 114 -29 -81 83 193
1005 193 -9 -189 -166 -69 14 17 158 51 -97 -42 45 108 -137 -56 71 124 56 57 25 -102 -237 12 210 118 -44
1030 -44 25 33 -79 -74 53 60 -58 -63 213 218 -55 -130 -48 -106 -102 58 202 52 -27 18 103 -19 -158 26 11 33 107 248
1058 248 133 -147 -193 -90 -15 -39 95 145 118 -6 4 35 -226 -136 37 244 122 90 107 -69 -217 -96 47
1081 47 55 -13 11 186 124 -26 -147 -132 -155 -125 123 283 132 -2 -106 -103 -63 -71 14 116 66 139 134 40 -168 -166 -77 9
1109 9 81 129 108 16 -20 -94 -99 -61 -80 88 165 157 149 46 -39 -196 -101 -34 125 128 84 115 -18 -69 -117 -119 -110 37 82 164 211
1140 211 -7 -80 -145 -155 -86 92 45 95 46 68 -64 -119 -134 -93 -15 105 62 156 81 -58 -125 -133 -46 -56 58 90 130
1167 130 -10 -65 -114 -127 -141 -43 128 158 35 58 -8 -72 -119 -50 -30 47 90 156 81 -26 -53 -99 -112 -80 21 118 118 37
$$ packed form
978Gj22l6J66J59k06q4R9J08o8n5Kl4j27J75J89Qk00q2P6Q4l9rJ03j43n2J64J10
1005A93k02j80K3R7Q3LJ41j07j48N5Q7O3k45Q1J27N3o8Jl2j27j35K49J98r2j62
1030d4O9Qj12NJ27Pj18nK76Nk73p5Q2n8MJ60J44j50p9M5Q5j22j39J84j5K2P4J41
1058B48j15k80m6J03P5k4J34N0k7j24J0L1k61R0J73K07j22l2J7j76j48J21J43
1081D7Qo8K4J75o2j50j21J5k3L0K48J60j51j34j04LM0qQ5J02n0P3nr4k08KQ9Q6
1109IP2M8k1r2l6p4nL8j9J68P7qqj03q5j57R5O7J59Lm4L1j33n1m8kRJ47M5Q2M7
1140B11k18p3o5j0O9J78m7N0m9K2j32n5j5M1P8J20m3R4p5j39o7qQ7j0J14L2M0
1167A30j40n5m9j3j4R8J71L0j23K3o6o4m7O9K0P7M3O6p5j07k7m6j3L2J01R7%q1
$$ plain form
1195 37 59 49 -71 -100 -98 0 33 33 64 63 -30 -100 -96 -53 -38 26 122 72 54 -41 -1 -107 -161 -124 105 118 102 58 24 -51 -84
1226 -84 -59 42 -73 -10 111 73 5 -11 -47 -104 -37 38 90 39 -5 17 4 -41 -110 -88 28 46 140 58 43 17 -41 -41 -94
1255 -94 -22 -39 110 140 64 47 6 -85 -198 -90 40 60 76 86 16 -67 -97 -96 -2 -71 35 104 69 -11 -3 -89 -158 -82 15
1284 15 33 50 -33 61 59 -45 -75 -31 -8 9 80 129 77 -14 -22 -13 -61 -68 56 52 48 65 41 9 -110 -100 -82 55 48 94 177 7
1316 7 -84 34 -63 -133 -36 93 132 34 67 -16 -43 -172 -144 -26 72 75 127 109 -89 -122 -50 -13 -17 -32 111 130 63 -26 -48
1345 -48 -102 -136 41 70 53 65 43 47 -77 -107 -10 19 -50 28 197 39 -49 -49 -76 -119 -55 3 141 40 29 80 7 -155
1373 -155 -121 -29 23 44 91 137 20 6 -106 10 -92 -34 22 42 34 63 8 -40 -122 -58 32 39 24 84 62 6 -37 -18 -36
1402 -36 -21 4 92 75 -3 50 -8 -23 -134 -42 102 25 20 77 11 -5 -103 41 16 24 33 132 113 -48 -70 -68 -31 -52 0 74
$$ packed form
1195C7K2j0j20k9KR8L3%L1jr3p0MM3J5O4R6n0j8r5M0j06n4L7K29J3j6m4l4p5l3
1226h4K5J01j15O3J21l8o8j6l6n7O7P5N2n1m4K2j3m5o9K2J16J8R4q2j5k6n8%n3
1255i4P2j7J49L0p6j7m1r1j13J08J30K0J6J0p0q3l0JR4o9J06O9l5q0Qq6o9P6R7
1284A5J8J7q3R4kj04l0M4K3J7P1M9n2r1qRm8pJ24mmJ7k4l2j19J0J8J37pM6Q3j70
1316Gr1J18r7p0R7J29L9r8L3q3k7j29K8J18R8LN2j8j98l3P2L7mj5J43J9o7q9k2
1345d8n4l4J77K9j7J2k2Mj24l0R7K9o9P8J69j58q8%k7m3O4N8J38j01j1N1p3j62
1373a55L4R2N2K1M7M6j17j4j12J16j02N8N6K0qK9n5m8q2O4R0Pj5O0k2n6m3J9j8
1402c6J5K5Q8j7p8N3n8j5j11R2J44p7nN7o6j6r8J44k5QRR9j9j61k2KL7k1N2P4
$$ plain form
1432 74 -22 18 36 -21 -99 -60 6 -32 -33 16 82 -18 -107 36 26 -122 -14 13 46 -11 -5 77 -56 -77 -67 -14 20 -3 40
1461 40 24 -17 -70 -57 16 -51 5 15 89 -26 -6 -29 -9 -43 22 45 10 -9 24 7 -12 -33 6 -55 15 -18 14 44 -12 -49
1491 -49 -23 -72 -78 15 30 21 -12 33 -21 -6 -73 -104 26 46 0 67 9 -106 -12 9 -3 17 32 59 32 42 -37 -61 -37 -37 44
1522 44 39 4 36 42 -49 -76 -36 89 49 30 -4 9 7 -39 -63 -29 -41 -20 74 132 -76 17 15 -8 -27 44 92 -13 51 45 34
1553 34 -105 -31 -74 74 7 14 68 -8 -25 -8 -1 -43 -33 -40 13 84 21 -4 20 -85 -88 -56 22 -10 47 41 38 -59 -90 20 -29
1584 -29 32 44 81 -9 -35 -3 -38 -62 -7 7 77 -5 28 13 -12 -13 -109 -21 11 12 -24 -33 3 -69 -68 11 4 16 56 90 28 -52 -52
1617 -52 5 -31 -34 44 44 76 0 24 -11 -47 -3 -15 -8 75 44 73 -6 -75 -3 -57 -34 -43 48 58 -33 -1 -40 -46 -59 -113 -4 40
1649 40 46 39 11 -29 -105 -66 -14 21 11 53 5 -38 -68 -63 -43 -18 2 86 23 81 -29 4 -16 -54 -63 27 18 -49 20 -11 -16 -58 -35
$$ packed form
1432G4r6M0J8n7p8L9O6l8jM9O6j00q9J43j0j48J08K7L3n7OQ2j33k1J0N3L4k3M3
1461D0j6m1n3J3P3o7N6J0P4j15K0k3K0l4O5K3l5j9L3j7j9k1L9o1P0l3L2L0n6l7
1491d9K6m9oR3J5rl3M5n4J5o7l1J30K0m6O7n8j15R4K1j2K0J5K7k7J0p9k4K4%Q1
1522D4nl5L2Or1k7M0J25m0j9l4J3km6k4L4j2K1R4N8k08R3kk3j9P1M8j05O4oj1
1553C4j39P4m3J48o7PN4p6j7J7Pm2J0pN3P1o3k5K4j05lL2P8l2N7olr7l1J10m9
1584b9O1J2L7r0k6L2l5k4N5J4P0q2L3j5k5jr6Q8L2Jl6rL6p2JP9pJ2M0L4o2q0%
1617e2N7l6lP8%L2p6K4l5l6M4j2PQ3l1K9p9o9P2n4K3rR1J0r1L2l9oj3n4J09M4
1649D0Opk8m0p6L9N2L5j0M2m8m3l0NK0K5K0Q4o3N8j10L3k0l8rR0ro7O9l1nm2K3
$$ plain form
1682 -35 56 2 16 -5 81 8 76 2 -27 -15 -44 65 20 -42 4 -3 39 -19 -58 24 46 60 -29 -9 -10 -2 35 77 -50 -65 -3
1713 -3 38 -22 -13 27 11 -71 16 -8 22 -83 34 6 58 15 37 32 -1 -41 44 19 -53 -23 115 115 -64 3 27 -57 -59 38 53
1744 53 85 25 52 -29 -27 -77 -80 27 5 33 28 17 -72 -67 -42 -15 47 50 73 84 16 -6 -61 -52 -69 50 27 73 -42 28 -10 -30
1776 -30 -44 -17 63 5 111 54 76 -54 -77 -28 -11 -19 23 5 45 79 -69 -29 -87 -48 27 63 25 -25 -8 -28 -67 10 -33
1805 -33 -11 33 100 45 26 -53 -64 -59 -12 12 6 50 11 -28 -27 -94 -2 -46 -11 -53 -5 -24 59 0 -1 -57 38 -69 -7 65 -12 37
1837 37 -7 13 -28 -66 -22 22 46 13 44 -18 53 -8 -6 -16 104 -5 29 7 27 -6 -24 15 59 -36 7 17 8 76 49 -7
1867 -7 -67 -63 -63 26 -29 67 5 -27 -40 -39 -122 -73 30 7 -24 37 53 1 -49 -42 1 -39 -3 39 97 66 -59 -24 -53 -38 12 -4
1899 -4 98 44 62 21 -73 -25 -134 25 -19 58 22 6 35 -25 -59 -85 -81 13 46 85 27 8 -9 -89 -96 -59 6 101 14 37
$$ packed form
1682c5R1n4J4k1Q6p3O8p4k9J2k9J09m5o2M6pM2n8l9Q2K2J4q9K0jQL7M2j27j5O2
1713cM1o0RM0j6q2Q7k4L0j05J17k8N2m3K2nl3m0Q5k5p2L0J38%j79O7K4q4kR7J5
1744E3L2o0K7q1Kn0lJ07k2K8nj1q9NK5K7O2LK3J1o8k2n5Rj7J19k3M6j15P0l8k0
1776c0j4K7Q0n8J06n7K2j30k3M9J7qM2j8M0L4j48M0n8L9P5L6l8n0J7k0l9P7m3
1805c3K2M4O7n5j9p9j1NM7K4oM4l9l9Jo7R2m4L5m2M8j9Q3n9jn6R5j07O2P2p7M9
1837C7m4K0m1l8M4M4K4l3L1o2P1o1Kj0J20j09L4k2K0l3j8L9M4r5M3J0rO8k7n6
1867go0M%Q9n5R6o2l2j3Jq3M9J03k3l1O1J6n2n0PM3m0L6M2N8l1j25L5k9J5N0j6
1899dJ02n4J8m1r4M8j09J59m4P7l6j6K9o0l4k6MR4L3L9n8j9j7q0pL7O5R5q7K3
$$ plain form
1929 37 19 -32 -72 -95 -26 -62 -32 86 44 -9 -102 -107 -20 -36 17 2 85 83 61 9 -105 -61 -54 1 69 -26 61 -14 -30 -16 -47
1960 -47 36 38 47 52 128 10 -32 -38 -32 -32 6 16 15 61 50 36 -82 -77 -12 -22 27 25 -16 -23 -38 17 -31 -1 15 59 46 17 22 -58 -76
1995 -76 -20 -30 -63 27 18 62 26 -16 -26 -68 20 -45 46 12 35 72 25 -6 -35 -29 24 -45 3 87 36 -2 -29 -18 17 -27 14
2026 14 23 -2 -1 6 16 -33 -14 30 20 4 -13 -28 -16 -63 -84 -11 -67 -27 -23 14 -45 -59 -40 -17 26 12 26 3 -11 -29 19 6
2058 6 -16 34 36 -34 6 46 24 8 -5 -19 -20 -17 -20 20 24 -27 22 29 21 -28 23 -10 33 -8 30 106 -20 -47 39 28 -14 -36 17 -3
2092 -3 37 -20 3 66 43 -85 24 12 -48 -20 -28 60 -59 -21 31 -33 9 67 6 -17 -27 -21 82 19 4 59 102 -9 26
2121 26 44 -2 20 -11 44 64 -13 -52 84 -33 12 9 -22 39 -13 -19 51 -34 -21 -6 54 14 93 -46 33 -64 34 48 -50 26
2151 26 60 8 -14 -31 3 8 -38 -23 -34 13 -1 -12 43 -57 -80 42 -19 -19 -55 -48 26 24 0 -18 5 -23 -15 51 -36 41 -1 -1
$$ packed form
1929C7j8n1m0k3O9l6L0J18m2n3r3nQ7j6N3j5Q3kk2n2j14M4PN5O8r5Q7p5j6J4l1
1960d7Q3KRNP6j18m2oO%L8J0jM6j1j4j18NO5j0M9km1pj5N5m8L0J6M4j3k9Nq0j8
1995g6N6j0l3R0rM4l6m2j0m2Q8o5R1l4K3L7m7l1k9ON3o9M8Q4n1l8k7J1L5m4M1
2026A4Rk5JPJ0m9J9M4j0j6j7j5J2m7k1P3n6M0ML7n9j4J9K3M3j4J4k3j4j8M8j3
2058Fk2N0Kp0M0M0k2j6j3j4jLlM0Mn1M9Pqm9N1l3M3m1L8P6j26k7Q6j1m2k2N3k0
2092cM0n7K3O3k3j28J09j2o0K8qQ8j19L8N2o4M2N8o1k3j0OJ03o3j5N5M3j11L5
2121B6J8m6K2l1N5K0p7l9J36j17M5ll1O1n2oP0q5J3J5O0m0P9j39P9r7R8J4r8P6
2151B6L4n2k2j7L4Nm6J5j1M7j4j1N5j00k3J22o1%l6PP4kk4j8K3k8QO6q7P7m2%
$$ plain form
2183 -1 -19 -16 16 75 60 -38 -1 -67 28 -15 -28 -2 56 -9 47 -3 9 -10 -48 6 64 -47 13 -38 -19 -5 -12 3 -18 -46 -24
2214 -24 58 -43 6 -21 50 11 -26 13 13 -68 -13 4 -5 13 26 11 -5 4 55 44 32 -42 2 -8 -12 -35 -27 -43 63 -9 24 50
2246 50 4 -14 -54 -6 -1 -4 64 60 29 0 -9 17 0 -38 16 25 -3 9 -54 0 -11 -3 31 -35 33 10 2 6 -44 -43 -1 -23 28 55 -84
2281 -84 20 -56 -12 18 -37 56 45 -47 -33 7 -10 34 7 4 32 37 15 28 33 -19 -1 -27 16 13 -6 -36 -75 37 -11 26 10
2312 10 32 66 -22 10 -46 -58 -35 -17 -73 -7 -14 -21 -26 -3 -64 -19 -39 32 -8 17 2 42 -9 -14 -29 -111 -51 59 55 1 -42 22
2344 22 -70 -17 12 13 47 39 47 -42 -41 -50 -12 -9 -10 -8 41 -2 -1 14 -81 -76 -11 24 -5 -10 39 -43 26 -19 -76 -76 27 -39 13 4 -50 -9
2380 -9 17 -49 -47 47 18 1 -6 42 -31 -60 -27 5 59 18 45 26 15 -8 -18 24 0 2 45 45 9 -1 -22 -15 -26 19 3 46 40 68
2414 68 81 -51 -31 30 7 23 -5 90 -21 54 -34 -19 -44 -47 4 2 9 17 23 -43 -59 -20 7 19 -30 -4 70 -4 43 -89 -14
$$ packed form
2183aj8LL2N9j5r8L7o6R5m3j3K6N8o5N6n0J2j9l8N4N8j11O0n1J9J4pJ5k1k8K2
2214b4Q2j01M9k7P1l9l7L9%q1N5J7rJ8J3j5j6RN1j1j2p4M4j0mk3Qj6J06p2L3K6
2246E0m6j8m0M8NlO8ml1k9rK6j7l8N4Rk8J2o3N4j1QL4o6O8k3qMn0JM2k2N1K7j39
2281h4J04p6M4L0n5R3j1r2J4M0j7M4k7lK8Nk2J3Nn2J8k6M3lj9l0l9J12m8L7j6
2312A0K2L4q8L2n6j2K3J8n6O6ppnK3o1M5k0P1m0K5j5M0n1nj5q2O0J10mn4m3O4
2344B2r2N3K9JL4qQq9JrL8LjKM9m3JJ5r5NO5L5k9nM9q2O9m5n7%J03o6N2rn4M1
2380iK6o6KR4k9j7pM8p3k9L3L2N4m1K7j9j1k3j0M2k4KM3%l6j0k1Pj1M5j6M3oK8
2414F8J3j32K0O1k3J6k8R5j11P5q8J5k5lN1kPQOo6j6L9K7J2m9K6P4p4M7j32P5
$$ plain form
2445 -14 7 13 27 47 3 2 45 52 23 -68 42 8 -31 -15 56 -30 -65 -2 -47 7 -44 23 40 116 61 7 8 -26 -9 -32 -7 -41
2477 -41 54 -2 -32 -32 17 -85 -8 -4 26 -60 58 2 -40 -38 -74 0 -44 36 68 47 24 -24 -11 -34 -24 -96 30 108 35 55
2507 55 18 -26 -48 -34 -6 74 13 36 34 4 17 9 -41 9 1 29 39 -37 43 10 -33 -4 -23 49 69 -34 -6 -16 -15 -31 -57 -16
2539 -16 30 58 -7 12 -82 -40 -36 -17 -61 33 -35 9 -50 -27 47 -74 -51 -43 -5 24 10 58 44 -17 -22 -8 37 2 56 23 -3
2570 -3 35 -18 -1 6 -39 38 11 49 11 -4 -29 3 -4 4 9 66 22 15 -6 -69 -42 4 12 -27 5 -5 -18 -70 -83 -20 -77 3 10 24
2604 24 24 16 34 -60 -10 -29 -47 -8 38 -24 26 -43 -41 -7 5 -44 26 38 57 8 -73 -55 14 -19 50 28 41 72 -11 42 -4 -3
2636 -3 25 25 16 -15 -75 -5 -46 58 -67 0 -13 18 -49 19 28 -22 -1 38 -43 20 3 -52 -38 -11 36 4 18 -15 -4 13 -38
2667 -38 25 -26 5 -6 -24 5 37 20 -30 21 -33 35 -48 32 -4 29 2 -17 45 -5 -2 -39 6 62 17 50 12 4 -49 -27 84
$$ packed form
2445a4K1OJ4K0m4jM3Pk9r1J10l4l9J6P1q6l5O3m5N4n1O7J7P6n5n4Jl4J7k3K5l4
2477d1R5n6l0%M9j02P7ML0q6J18n6m2Kl6P4m4Q0L2k1k3m8J3k3J0p2J26P8p3K0
2507E5l7m4k2J4K8Q0o1K3kl0J3qn0N0qK8J0p6Q0l3m3K9j9P2K0j03K8j0Jj6k6M1
2539a6M6K8o5J9r4M2MJ9m4R4o8M4n9K3P4j21K3QL8K9j4M8j4o1nJ4M5l5N4l3k6
2570cL8n3J7Pm5P7k7L8l8j5k5L2pQNN7m4pk1o3K7M6Ql9L2j0j3n2j3O3n7Q0PJ4
2604B4%qJ8r4N0j9j8L9M6o2N0o9KL4J2m9P0J2J9m9q1J8O9l3O9k2J3L1q3N3m6J
2636cK8%rl1o0P0m1J04j25O7j3L1o7O8Rn0K1L9q1O3j7n5J4K7M7l2J4l3J1J7n1
2667c8O3n1L1j1j8K9L2j7n0N1n4O8q3Q0l6L3k7j9O2n0Ll7M5N6m5L3l8qn3K2J11
$$ plain form
2698 84 14 16 -32 15 -36 11 16 -3 -45 -60 -10 -26 -41 -10 -37 -42 0 38 -22 24 -34 33 35 -2 -32 2 26 53 42 45 40 -17 6
2731 6 -4 -12 -56 -29 52 -36 2 30 23 34 -4 -45 -11 -9 18 37 -75 40 37 -7 38 49 -49 10 35 -24 1 -22 38 -55 -74 -14
2763 -14 -10 -66 -43 -21 2 -6 9 32 0 -17 -20 65 -1 -67 -68 30 -38 20 -9 -8 -6 37 10 -57 85 -11 -18 -47 4 -19 28 -23 -14 -46
2797 -46 -8 -74 -1 77 -48 -27 37 -12 -33 -41 -61 34 -46 -26 40 18 -47 -37 12 -57 -1 8 -23 -80 -37 -25 -41 19 -17 -15 -55
2828 -55 -53 -11 -63 7 6 -14 7 -43 2 47 4 18 -3 15 53 32 35 51 -45 3 -15 26 46 14 -21 -40 20 4 -30 -47 -41 -32 -25
2861 -25 -29 1 20 30 -7 -12 29 -8 -3 28 47 -24 37 -6 -2 -13 -10 48 -52 -23 16 -26 15 56 14 9 61 -30 84 1 -30 31
2893 31 110 17 8 -20 -49 23 3 12 -17 39 7 -41 55 8 -63 29 -16 -43 45 -68 -104 -8 11 29 48 14 9 -13 -11 -69 -48 -7
2925 -7 69 35 0 53 -66 -40 -63 -68 36 44 3 10 46 -18 -36 -65 39 -22 -5 -10 -86 -31 22 17 -13 -3 69 83 60 21 -51 10
$$ packed form
2698H4p0Km8M7n1M7Nj9m2j5N0j6j5L1k7nM2L8o0M6n8O7Kl7l0L4K4K7j1Lnn7K3
2731Fj0qm4K7Q1q8L8K8pJ1l8m1L4KK7J9j12J15lm4M5J1r8N9K5n9K5k3O0r3j9O0
2763a4Mn6K3K2K3qJ5K3l2j7lQ5o6o6jR8o8N8k9JKM3k7o7J42r6pk9N1k3M7n1Rl2
2797d6L8o6P3P8j25K1O4m9k1qk0R5q0K0O6k2o5J0M9o9N6Rl1n7M3J2j6O0l6Km0
2828e5KM2n2P0jk0K1n0M5M5m3J4k1J8L8k1LJ6r6M8j8M1K0l2l5j9O0j6l4j7ORP
2861b5mL0J9J0l7nM1l7NL1J9p1O1m3Mj1LN8j00K9L9m2M1M1m2nN2r1J14q3l1O1
2893C1P9r3rk8k9P2k0Rk9N6l2m8R6m7p1R2m5k7Q8j13l6R6J9J8J9l4nk2Kn8K1M1
2925gP6l4l5N3j19K6k3nJ04Qm1PL6o4j8k9J04o1J7np6N5N3nl0J0P2J4k3l9p2O1
$$ plain form
2957 10 -60 44 4 74 62 51 51 -16 -43 -46 -10 -93 13 -34 -12 28 13 15 -11 -37 -2 -24 22 25 26 -8 -32 -17 -64 -27 30 16
2989 16 27 -8 -11 0 -33 -19 -49 0 2 94 45 -38 -29 -50 -45 -77 -9 -30 69 -14 92 -14 -34 9 -30 3 2 11 17 -13 -57 -16 13
3022 13 26 16 46 17 7 25 -54 -20 -13 -76 78 0 36 -1 -88 -46 -3 -14 24 -28 -24 58 62 -5 -16 -12 -30 -24 2 68 54 45 22
3055 22 -12 -54 14 -5 3 -53 51 78 38 37 17 36 -9 19 -1 22 -12 -51 12 -9 32 25 -24 -24 31 35 13 15 -37 -7 2 -7 48 -7
3089 -7 -16 7 -8 28 10 -11 20 -4 8 57 24 55 24 -28 -98 -26 -15 -12 23 -50 -16 -23 -32 12 -12 -62 12 47 46 35 10 14 -45 -7
3123 -7 -5 6 62 -6 8 32 14 -4 22 -19 16 -30 6 -2 5 28 24 -62 -32 -19 -54 15 -24 5 -49 28 -67 -28 -5 -40 -21 -7 20
3156 20 -12 -28 19 -39 -34 29 -16 8 15 -58 48 -5 33 18 -27 -2 -6 77 48 27 -65 6 -46 -17 38 35 -14 52 38 4 22 37
3188 37 12 -4 -21 -2 -7 -15 2 -28 51 20 100 -24 -51 -14 53 -24 6 -28 -15 -50 -6 -50 -56 -15 -18 48 32 -21 15 24 -7 -15 29
$$ packed form
2957A0p0J04m0P0j2j1%o7k7lL6q3J06m7K2M0j5Kk6k6L5k2M6LJl4k4J5m7L7N7j4
2989A6J1l5lJ1l3J4l0M9KR2m9q3Rk1Nl2O8k1R9q3J06j06k0M3l9L3jROl0m4M1K9
3022A3J3j0L0k9j0J8p9L4Po3J54p8L6l7q7M2M3j1L8n2MQ2Mo7j1Mj8OK6O6j4rk3
3055B2l4m2O8j9Qn6J04K7m0jk0J9m5K8k0K3l4l9O3k1M1pm9%N5Mk2Kn2L0RrN5n5
3089grK3j5L6j8k1L1k4J2M9l3L1l1n2p0P2J1LL5p3L4prM4k4n0P4L5jj1k5Mn9L8
3123gKJ1N6o8J4K4j8j8K6m1L5m6L6qPK3mq6L0J3l5O9l9K9n4P7r5L9K3l5J9J4K7
3156B0l2j6M7n8NO3m5K4Pp3J06n3L8j5m5K5mQ3k9k1r2P1n2K9N5lm9O6j4l4J8J5
3188C7k5j6j7J9nqJ7l0P9l1Q0j24k7L7O7p7L0l4J3l5M4m4oM1lO6j6n3L6Rl1qM4
$$ plain form
3221 29 25 43 -10 -30 16 16 5 -21 -1 33 18 27 -52 62 26 -77 45 64 32 -27 -41 8 26 -21 -51 28 77 2 -14 25
3251 25 5 -36 27 17 -21 -21 -8 -17 -5 -4 -23 -35 34 27 -52 61 53 -53 -16 -13 -59 59 55 72 -17 3 18 3 -49 43 -4 8
3283 8 35 3 -6 39 11 -2 -16 -28 52 65 -9 -17 -49 -21 63 -49 27 28 31 -35 52 -18 -22 26 6 58 3 -11 67 33 44 -66
3315 -66 -62 -46 17 -4 -62 -39 37 -3 29 -29 -20 46 -81 3 94 6 30 -62 -33 -6 -25 -26 -2 19 22 -21 -4 -21 -11 7 39 26
3347 26 16 -7 -9 -32 -25 92 7 1 1 -48 64 -51 -3 -9 -9 -13 -28 28 -7 -25 67 87 34 3 -30 -43 4 33 -28 8 37 5
3379 5 -16 -3 57 65 13 -39 -30 42 15 -23 -9 10 -11 6 -22 11 -14 -1 -12 -12 -3 -10 41 39 -34 -7 31 22 15 9 -5 4 -6 66 21 -20
3415 -20 -10 -12 0 -66 -9 -16 -98 14 -4 -47 6 26 7 -18 25 -9 58 -14 51 46 26 16 59 81 24 -77 2 -20 -47 38 -28
3446 -28 81 -12 14 -21 -59 30 32 63 85 45 0 43 -29 10 -40 42 1 -79 35 20 38 -59 50 4 -12 -30 17 66 -42
$$ packed form
3221B9mJ8n3k0M6%j1k6K0L4j5Rp9J14l6j03J22J9l2n9j4M9J8m7l0P9M9p5j6L9
3251B5k0m1O3j0l8%J3rJ2Jj9j2O9pp9J13qj06L7Lm6J18mJ7q9K0J5j5n2R2m7J2
3283HK7l2rM5k8j3j4j2Q0J3p4ql2K8Q4j12P6JLo6Q7p0mM8k0N2n5j4P8l4J1j10
3315f6MJ6O3k1n8K3P6m0L2n8RO6j27Q4R1q8K4r2K9K7j9jK4K1Lm3J7j7J0J8L2j3
3347B6j0k3kk3PJ17q5o%m9J12j15M8o%mj5N6l5j8R2K0n3l1l3j3M7K9o1L6K9l2
3379Ek1J3O0Qn2n2RP2k7l8J4J9k1J7k8L3k5J3j1%RpN1kp3K7L8rpoj4Rj0P2m5m1
3415b0J0kJ2o6N7pq2J12j8m3N3K0j9k5M3l4O7p2O5nk0j0M3K2n7j01P9k2k7Q5o6
3446b8J09r3K6l5l8Q9KL1K2m0m5M3p2L9n0Q2m1q0J14j5J8r7J09m6j6j8M7M9j08
$$ plain form
3475 -42 -41 0 -3 6 19 13 1 -25 57 -49 96 26 -53 -34 -17 -50 36 23 19 58 -50 15 -33 -32 27 -24 -5 4 -12 -15 -11 -11 47 -3
3509 -3 56 -7 17 64 23 -63 -63 40 13 -8 -19 23 55 -8 -4 40 45 -40 10 50 15 -21 -8 -2 14 -1 -30 2 -15 41 -23 -6
3541 -6 -21 64 -29 15 -32 -13 35 64 -24 62 46 -7 4 -2 -9 -9 3 -14 23 -32 47 37 10 -27 -19 107 -47 32 -32 25 9 23
3573 23 -24 13 49 61 -3 15 -57 -59 -35 37 42 24 -31 -35 -8 22 -10 -8 -3 -52 47 -5 12 -52 -33 21 -29 22 6 -28 -4 2 -27
3606 -27 -27 28 20 -7 3 -2 -43 -23 0 -25 -18 26 -6 20 -74 54 -4 -22 52 36 5 -21 48 14 -29 2 -8 31 -29 -24 14 3
3638 3 39 -5 77 1 3 -7 -2 -14 -28 -43 1 -25 -40 -41 -72 4 -78 3 -29 9 -29 -2 -12 -47 -10 37 28 0 -25 3 -6 31 31 27
3672 27 0 -46 -23 49 32 10 21 28 -6 -70 46 11 1 -13 38 59 0 -71 11 -40 -63 27 44 -24 -53 -34 59 -14 -28 4
3702 4 -32 34 -35 -8 -9 7 -11 7 15 -39 -46 27 11 -90 70 -45 -2 15 19 -2 -14 17 33 15 -4 -11 9 92 -15 -19 -11 26
$$ packed form
3475d2JM1lRJ3oj2k6Q2j06J45p0p9J9J7l3Q6j3mL9j08O5m8JN9n1J9Rj6lM%N8n0
3509cN9o3K4M7m1q6%J03k7k1j1M2L2o3MM4Nq5N0M0l5l6J3OJ6j5k9L2j7N6o4J7
3541fj5Q5r3M4m7J9M8K9q8Q6j6n3J1op%J2j7L7n5P9j0k7l7QJ26j54P9o4N7j6J4
3573B3m7L7L6J2o4J8p2kK4P2Nj8n5mK7L0l2KNm9R9n2J7o4J9N4n0N1j6l4K4Ok9
3606b7%N5qk7J0nm1K0K3k5PM4l2K6r4J28n8j8P4j6l1k6O9l4m3L1j0L9o0NL8j1
3638CL6m4Q2p6Kj0Nj2j4j5M4k6j5jl1P6q2Q1l2L8l8K7j0l5L7M7rk8k5K8rL7%m
3672B7k7m6K3P2j7k2J1Pl4o4J16l5j0j4N1K1n9p1Q2n1k3R0J7o8k9J9R3p3j4L2
3702Dl6O6o9K7jJ6j8J8Qn4pP3j6j01J60j15M3J7Mk1j2L1J6j8j9pK0Q3j07mQL7
$$ plain form
3734 26 43 -18 2 -4 17 11 0 25 27 -38 46 21 14 11 3 -36 -30 55 53 -17 -29 2 10 -16 46 -36 33 29 -43 -23 28 -14 -42 -23 27
3769 27 -58 4 2 -71 40 -22 47 -31 -24 29 26 26 39 -17 -3 -6 -2 42 5 -86 90 -14 -10 -58 -58 13 52 -4 60 22 -59 -42 -8
3802 -8 -18 16 46 9 -12 21 -10 -38 -4 -4 15 -44 8 -6 51 -39 9 -50 -30 -22 49 -14 -42 6 -5 -49 -1 25 19 -85 22
3833 22 -11 11 -34 37 5 -7 -17 114 -5 -13 32 -51 -18 -13 0 10 -5 32 -40 28 11 41 -61 -26 -31 66 6 -32 -5 -4 -13
3864 -13 13 -20 9 -31 -31 -1 -33 -15 -17 -10 28 2 -27 -33 2 32 17 34 8 -20 46 -31 16 -36 17 -38 -7 -47 68 53 -54
3895 -54 36 8 41 8 27 -21 15 -1 -5 17 -39 -15 43 -5 -17 -21 -36 -69 -2 -21 26 20 48 -18 5 -27 -28 -10 14 62 -46 3
3927 3 59 -4 17 5 -18 -48 -13 -25 31 52 1 -6 16 -23 -21 -55 10 -7 29 -12 40 12 -7 16 17 74 18 50 -31 10 80 -15
3959 -15 -34 5 70 -18 -38 13 -2 81 11 -21 -26 40 3 -30 67 20 6 11 31 -36 -53 -8 -30 17 -19 -11 17 -9 -1 27 0 -22
$$ packed form
3734B6J7o1K0oK1oj1K5Ko5Q4k5plql9OQ5kp0j2L1Qk6O2q2O9mp2K0N1m2k8J9N0
3769B7q5O2kp3J11o2O9p8PN3l%J3n6J4lMM4l7r1J76j04Mm8%P1L9n6O4l8q1J7L4
3802hj0L4L0l7k1L3l1k8L4%J9n9N2j4N7r0M8n9K0QP1o3k8M8j1m4M8K6oj04J07
3833B2l3K2m5P1l2j2j0J31j19qM5q3L3NJ3J0j5L7p2O8j7L0j02L5nR7o0l8K7Jr
3864a3K6l3K9m0%L0l2J8kPL8k6k9oL5L0j5J7k6k8O6p7M7n2N3n5L1m0J15j5j07
3895e4R0k8L3l3J9m8L6j6mK2n6K4N8m8j2mj5l3O7j9M7oK8o6K3l2jJ8K4M8j08M9
3927CN6o3K1j2k3l0L5j2N6K1n1pK2l9Kl4O5j7L6m1N2k8j9K3JN7n6L2q1M1P0r5
3959a5j9L9O5q8k0N1j5Q3p0l2nO6l7l3R7m7j4NK0o7j7M5k2M7l6QK8k6QK8k7k2
$$ plain form
3991 -22 43 38 -11 -6 -28 -14 -3 -16 -4 14 -24 -2 54 -22 30 -6 18 13 -11 11 23 12 51 -2 29 7 0 26 5 -27 -12 39
4023 39 -10 8 -29 23 0 1 40 -19 43 25 -6 37 -16 -35 6 -20 0 -9 -57 -6 16 -14 23 71 50 20 -15 41 -21 21 -56
4054 -56 -62 17 11 -23 38 -49 -14 23 -28 46 -24 43 -38 15 81 -57 -7 -32 -23 -18 8 -12 -23 -60 19 -55 -42 -8 20 -3 -32 -54
4086 -54 6 -96 30 60 -21 -48 1 -30 42 12 46 -17 14 -72 -1 -21 -15 20 -34 6 -2 -53 -38 3 11 -3 5 25 -19 65 0
4117 0 1 0 68 6 -15 38 -10 -20 10 11 25 -14 -39 -26 16 6 -30 -48 37 -17 -22 -8 11 19 -36 -86 -42 -22 12 -3 70 25 14
4150 14 14 -1 -2 10 6 -2 11 -12 10 -9 74 -12 39 27 31 29 -21 -21 -18 69 1 11 17 42 36 6 44 -40 -33 -24 38 -12 -15 20 -5 100
4186 100 20 -31 -11 2 35 -92 24 -34 40 9 9 35 27 4 -28 -7 44 25 -54 6 -72 -60 6 -18 4 50 46 1 48 -34
4216 -34 19 -8 -22 22 10 17 -18 10 -74 -3 -40 -56 4 29 13 2 19 37 -17 21 3 23 -13 8 46 -9 15 36 -50 -23 77
$$ packed form
3991b2O5nm9Nk2J4J1j3J2J8l8K2N6p6N2l6K4nk4K2J2j1L9n3L1k2pK6k1l2J5N1
4023C9m9J8l7N2k3JL9n9O2j8l1M3n3j9M1k6K0rm8N1K2l0L7M8k1l0l5N6o2M2p7
4054e6oP9ol4O1q7L5L7n1P4p0O7q1N3O6j38N0k5RNK6k0j1l7P9p4J3L4K8k3k9k2
4086e4O0j02J26L0q1k7M9l1P2l0L4o3L1q6P1k0OL5n4M0qn1J5M1Qj4QK0m4Q4o5
4117@JjO8o2k1N3m8j0L0JJ4l9k5J3M2j0l6j8Q5n4nJ4J9Qn5n0M4K0L4j5P3m5j1
4150A4%j5jJ2mqJ3k3K2j9Q3q6N1j2Mkn0%LQ7o8J0OK5ol0L8q4PRO2n0lL5k5J05
4186A00q0n1K0J3L3j27J16n8P4l1%K6qk3l2K1N1j9p9O0p8J2O6k4K2M6mm5M7q2
4216c4N3k7j4M4j2Pl5K8q4P1l7j6O0K5j6j1J7J8n4L8j8K0l6K1L8n5K4K1q6K7J00
$$ plain form
4247 77 -3 4 8 48 4 42 4 -45 36 7 3 -4 9 -31 -24 -72 -58 -59 -35 0 17 -43 -42 -15 28 29 -16 -13 -44 7 -48 30 -29 19 54
4282 54 70 -6 -16 13 38 2 0 31 -23 30 9 37 14 10 -69 -5 2 -28 -18 2 -20 7 8 14 18 18 23 35 -91 46 -23 19 45
4315 45 -2 32 -48 2 -6 -7 3 -11 30 -3 -27 -43 6 33 38 13 -3 31 -7 -3 76 63 9 -15 15 -2 -40 -5 19 -19 26 62
4347 62 23 48 -32 -44 -21 42 39 25 34 26 -50 34 -2 -44 -22 -33 -27 42 -13 -20 -13 -30 -44 28 -92 15 21 -2 -21 19 -16 20 42
4380 42 8 -29 -22 -13 -41 12 -3 -7 -15 71 57 0 -34 27 7 11 -53 76 1 8 4 25 -9 -16 63 14 46 41 -14 -3 10 35 -51 -12
4414 -12 -2 24 -6 -13 9 -10 9 -43 -35 4 18 5 48 -6 6 47 -31 -26 36 -23 49 -52 64 -21 -26 -21 4 -14 35 100 -46
4445 -46 8 13 2 -16 -8 16 -28 16 34 -40 -6 80 30 19 36 53 -56 9 1 -10 0 41 -30 -13 -56 13 -15 -28 51 -8 33
4476 33 -20 -37 -37 -19 31 0 72 -3 -18 -43 12 -9 40 -26 -5 25 -9 -34 -15 56 -22 4 20 80 24 53 39 -3 15 18 -28
$$ packed form
4247G7q0PMM0m4L8l8m9Q1k9mpJ3m0Pm8J4jK4L5J7o0JK7M3Jm5Ll1N1n5P8n9M8L5
4282E4J6p6j0K9K5l6kL1n4N3k1K8k3mp9O4Pl0J0K0k2K7JOM%NJ2j26J37o9M2K6
4315D5m7L4q0N0qjJ0j4M1l3k4j6M9K7Nk5j6L4l8MP9j3n4k4L0j7l8L5K4l8M5L6
4347F2l9K5q0j2K3O3lj4Rqp6Q4l6m2K2j1OO9n5pPj7j4P2j20J07Ok3j9M0l5L6K2
4380D2l4l7PRk8N3j5mqQ6j4n7l4O1k0Mo4J29p5PmK1l4pP9m9L2nn5J1J3K5q6L9
4414a2J0K6l0pK2j9J9n2QL9J4j3M3n4J2M1p8NO2n9P2j01J16q5nNK5j8M9O5j46
4445d6N4Nj1j8QK4m4M4J8p4L4Q6n0j1J7J7j09O5qj1J0M1p1J7m3O9k8j3P9n9M1
4476C3n3j7%J8N0l1P2p5j5k5N5k1M9o6K1L0l4k5J9P1p8K6J6O0n6K9j4m2J8Lm6
$$ plain form
4507 -28 -1 -41 13 -6 -19 23 -15 26 -38 15 -19 -37 11 -27 -20 -45 -10 -19 -10 -24 -71 -4 7 -1 43 1 20 3 -6 -66 78 -16
4539 -16 -21 85 -17 -46 61 86 35 -9 20 -6 45 35 38 -14 -36 -21 8 2 3 33 58 -1 43 33 33 42 13 42 18 -10 -6 -10 6
4572 6 56 57 -67 4 34 0 -19 -29 0 55 17 -34 -24 39 -8 89 18 -10 18 11 27 29 42 -18 -22 -19 -8 61 26 -60 -12 12 9
4605 9 30 -20 28 -35 -37 74 -12 20 8 5 -30 3 57 44 -17 11 -39 -25 -40 -27 1 -3 -4 4 13 12 36 13 -12 37 -2 2 -38 -47 32
4640 32 -35 -48 4 27 -3 6 -5 39 17 55 -13 49 -74 -2 3 7 0 67 -8 -40 12 -4 0 -21 30 13 -10 -5 6 31 24 -19 -37
4673 -37 12 2 -11 63 -36 -4 -35 31 -5 -10 18 -17 -48 16 49 -5 0 -39 -11 34 28 16 -27 -1 -1 -17 -8 26 -27 -30 -48 -19 14
4706 14 -65 -25 44 -20 11 30 -40 -6 19 -4 -2 -39 23 8 47 -2 -27 34 -11 21 40 52 -49 6 39 -92 -10 -34 5 -25
4736 -25 35 54 -61 4 -2 -7 -1 -46 -92 44 -17 34 47 -40 -43 58 7 -3 -7 1 64 -36 -22 -15 -18 -20 -5 -37 -7 -18 -15 5 23
$$ packed form
4507b8K7m0N4j9j3M2l8M1o4N3l4j8M8l8Pk5L5rRj4m7O7J1qM4m2J9j7ro0J44r4
4539a6nJ06j02k9J07K5n1m4K9k6N1j0Ln2k2J5K9oJL0K5n9M4j0%Rk9K9k4k8MmJ6
4572FN0Jj24P1L0l4j9j0K9N5l8n1J0O3m7R7p1k8K8pJ6KJ3o0mLJ1O9l5q6M8K4l
4605IK1n0M8o3kJ11q6L2j2ll5L3N4j3o1K8n0J4j5J3K8mjQRjK4k3k5M9l9Mm0rP9
4640C2o7j3N2K3l0Rj1M4k2L8o8O2j23P2NMpO7p5l2N2j6Mk1N1j7k3NJ1K5pm3j8
4673c7M9j0j3P4r9L2l1O6l6nK8l5l1O4L3n4Nl9K8M5oj2m3K6%j6RL4n3lj8K9L3
4706A4p9M0O9o4L1J9p0L4K5k3Kl7O2j5L9m9k5O1m5L2J9J2j01N5L3j31Q2k4L9l0
4736b5O0J9j15O5onOm5m6J36o1N1J3q7lJ01n1j0mQO3j00J4PlkJ5l2L0j1LK0J8
$$ plain form
4769 23 16 -46 12 -11 -58 7 44 41 21 -9 6 17 -6 3 28 11 -20 19 4 29 10 -38 46 20 -36 14 33 -9 -81 -16 12 46
4801 46 33 81 -1 -30 -45 72 -35 -80 24 -76 -20 -14 34 -19 -40 -4 11 -27 -21 43 -40 7 -3 31 -6 19 33 -3 -52
4830 -52 49 1 -35 -16 28 38 18 15 -40 -25 -62 28 -48 -20 51 -29 -43 -10 -23 11 -1 6 46 1 -4 27 -10 -16 -56 -52 -41 -28
4862 -28 34 -6 -7 5 -12 -17 -54 -43 -48 -1 39 28 -27 -61 -15 42 86 -49 -27 25 33 21 79 60 61 23 24 -49 51 -3 13 -50
4894 -50 45 0 30 -4 -7 -13 -4 32 -16 26 -61 67 15 51 -49 -25 -47 8 -17 -13 41 37 -34 2 -1 19 -21 -34 -9 7 -93 -57
4926 -57 5 -16 -1 -67 -5 45 12 -2 33 -2 -14 26 -52 -34 44 71 -15 26 14 -34 -27 17 -22 10 26 -22 11 -12 -101 8
4956 8 2 35 -1 3 -36 -23 -11 -17 -15 -51 2 15 -41 12 56 2 27 -9 -48 -38 39 40 -47 2 41 8 34 -46 11 -7 -8 -1 -9 4 6
4991 6 45 5 47 4 1 13 -12 -14 -52 2 -22 33 53 6 -5 7 10 -17 28 96 -23 -35 -29 20 -2 60 7 -22 40 1 -11 -17 12
$$ packed form
4769B3po2N8k3m7O5L7lk0l0J5J1k3RK5j7l1L9j5K5j9m8Q4k6n6N0J9m2p2O5K8L4
4801D6j3M8q2k9j5J17j07m5J04j00N6OM8n3k1L6J5l8OO4q3M7j0L4l7K5J4l6m9
4830e2J01m8l6J9M4J0k0ln5J5l7R0p6K8P1q0j4L3j3L4j2PM0m5nL1l7om0MJ1J3
4862b8O2m0jJ2j7nl7J1nM7M0j1n5l4M6N7M4j35K2N2Qj2N8j9Jl8Jp3J00n4J6o3
4894e0R5m5L0l4loRL6m8M2q7J28n2L6j00K4k2N5k5MN4mp1L6lK0m0j3K5J6j00L6
4926e7O2k1J5o6O2N0l3j4L5l5j2M0p8J8P8K7q6M1j2m8PM4l9L2J6m8L3k3q9J09
4956HoL3l6Ml9J3J2oKl6N3J3n6N3M4n4K5l6l9J0P7Jq7M9L9l3K6q0N7j8jPqJ3K
4991FL9m0M2m3lJ2k5kl8N4k4N5K0m7j1J2Lk7M5O8j19j2OM9k2O2n3k9O2l9j2oK9
$$ plain form
5024 12 23 2 6 -10 1 52 -70 -78 -33 43 -13 6 7 -36 -24 7 29 -69 18 -26 -40 29 67 -19 -27 -23 11 20 39 15 7 -24 57
5057 57 43 -20 8 29 22 65 -37 -1 11 -37 16 1 13 -40 5 21 -12 -1 0 46 40 20 -3 20 37 -19 21 -35 14 -21 -96
5088 -96 6 -1 49 -12 -25 -5 52 72 -61 -105 -38 50 23 -8 29 19 -44 -26 -43 2 -35 -33 -5 9 32 -1 -15 -21 16 -17 2
5119 2 10 1 -52 -2 -9 64 -7 3 19 -47 41 -21 -19 -24 -126 -26 -20 38 12 -51 -39 -29 -30 -45 61 -44 -39 -28 -42 1 15 2 -48
5152 -48 75 40 10 -27 -4 -13 -18 3 1 43 17 -1 24 -42 49 11 -23 -15 -8 -16 -28 -11 -32 -7 -3 2 -64 -3 -15 10 -53 -8 -11 56
5186 56 -17 92 -28 -26 -94 13 -12 -12 -43 -55 27 -43 -18 -30 -6 -13 -19 -19 -4 -13 -2 -31 -51 58 -50 6 27 3 118 -2
5216 -2 -46 24 60 -19 41 21 2 8 33 7 40 0 9 -22 8 -7 -65 -26 6 -35 -16 -30 76 -35 -14 62 3 3 1 -34 13 27
5248 27 1 43 -61 11 -36 6 -54 -17 -41 29 -14 -27 33 29 -24 -35 48 -3 3 -10 7 74 -4 -14 38 -26 -44 -39 -4 -6 -59 57
$$ packed form
5024A2J1k1Mj6J1N1j22qM5P6n6J9Jm3J2L1K2r8Q7m4j4O9L8q6qML4RJ9k4ql1Q1
5057E7j4o3K8K1pM3j02L6J2m8N3j5J2n3M5J6l3J1JM6ok0k3K3J7n6M0n6M9l5p5
5088i6J02pN0o1j3K0N7K0j33m4O7Q8k7l1L7j0o3J8j7M5l7KK8J4K3l3j4oL7l3J9
5119BQrn3N0pP3p1J0J6o6Q8o2Knj02J00ON8k6o3J2J0jj5J06j05NJ1j4M3J4j3n0
5152d8J23l5l0l7K3rnK1kM2k6j8K5o6R1l8l4QPqj2J7k1K5MNo6O1j2K5o3M5lO7
5186E6p3J09j20Ko8J07k5%l1j2Q2p0K5j2K4po%J5rJ1k9k0J09j08N6K1k4J15j20
5216bm4P0L6p9O0k0j9OK5k6L3m0Rl1L0j5n8L9L2m1J9j4J06j11K1P6n9%kl5M7J4
5248B7k6M2j04P2m7M2o0L7k4P0m3j3O0mn3j1Q3n1Oj3J7O7p8j0N2o4j8NL5kn3J16
$$ plain form
5280 57 41 -25 31 -8 38 -14 18 23 -44 4 -40 -13 -39 26 15 -82 -38 -76 9 -1 -31 10 2 26 -8 28 -24 -6 -59 -54 0 -19
5312 -19 3 -41 4 -16 62 -4 -15 45 -35 -13 -46 -14 5 -24 3 1 -19 17 64 52 18 -11 20 27 -37 -8 -6 -19 -3 -2 14 54
5344 54 -12 -2 34 -10 -58 6 -30 -51 7 41 -27 42 -2 -23 -16 97 -76 -46 -63 31 16 -9 -25 45 15 -22 20 6 -10 -1
5374 -1 -33 -22 -37 -58 -4 34 -37 -30 -13 41 -39 -31 27 -11 53 103 31 52 59 25 -27 48 -73 1 27 51 -1 0 74 -79 -30 16
5406 16 -23 -59 10 2 1 -6 20 48 -8 1 -49 -19 14 24 24 7 -83 -8 12 29 -3 -21 19 56 31 7 2 -42 19 18 -41 -31 -32 -1
5440 -1 14 7 27 6 63 33 7 57 18 9 30 18 -12 46 10 6 31 13 19 -57 67 -1 -14 -36 -53 -34 4 24 -84 -37 42 10
5472 10 -3 51 1 -31 -4 -24 53 -47 9 -24 14 8 65 1 -44 13 -4 -7 -12 -57 -7 2 20 30 -32 -54 -14 -48 7 41 37 15
5504 15 -14 26 29 0 9 63 -32 40 52 -35 -13 30 18 5 -40 30 -20 -27 72 -68 -35 -49 -107 -21 11 -7 1 21 -27 31 -18 -13
$$ packed form
5280E7j6o6N6l9M6n2L2No7M8m4K7k6O5j1r7M4l8Q5j0l0M1qK4l4L6n2J8n3NN4j9
5312a9K2m4M5k0P8o6j1O0q0K2l3L2J9k9K7kk0L6M7j2l4k9L1Po4K9Kj3J6JJ6M0
5344E4o6J0L6m4m8O4l6k1N8L4o8O9m4k1PJ13j73L0j7R4j5k5j6P0l0l7M2j4j6R
5374al2J1j5k1N4L8p1PJ7N4q0QN8l8O4N0p2K1Pl4n2P5j21P4K6K4n2JP4j53M9M6
5406A6l9l6O9qjpK6K8n6Rn0L0L3J0%j7r0P5K0J7l2j8M0L7k5k4nm4O1jn9J0jL1
5440aJ5pK0k1N7l0k6N0l9rK1j2l0N8l6mK5j8Op6J24o8j3k2j7J9L8K0j08M7P9l2
5472A0j3N4n0l2K7k0P7j00N6l3L8oN7o4m5N7j7lnm5N0RJ8J0o2k2M0l4N5L4mk2
5504A5k9M0Lk9RN4r5P2J2q7K2M3j2j3m5P0n0pR9j40L3j4n8Q6L2j8QK0m8N8m9N
$$ plain form
5536 -13 11 22 -31 -53 62 -16 9 4 3 -17 80 -37 34 19 18 44 -3 37 39 12 0 0 -20 13 16 6 -25 -35 6 -17 -5 -18
5568 -18 -19 4 -34 -45 -54 -30 -31 46 23 26 9 4 10 -9 42 -4 32 12 25 -35 29 -14 -69 -1 8 -14 17 -10 -4 13 8 18 26 41 24
5603 24 -41 -15 -5 -33 13 -4 71 3 -37 -23 49 5 -31 30 -24 12 -10 -68 17 -29 0 4 -57 -5 38 -54 12 3 32 -54 -19
5634 -19 -16 -5 10 -28 -1 -5 -43 -16 -21 -30 -55 -15 -39 9 3 10 -8 47 -20 -12 -32 43 -8 36 -1 -18 -54 19 20 43 41 0 -50 -38 -19
5669 -19 -1 -16 -5 60 -46 5 -9 -22 -12 -46 -36 -37 48 82 58 -35 5 71 -27 -12 44 -42 -22 66 -29 -40 32 24 -7 -17 30
5700 30 30 13 -33 10 -56 -131 28 20 7 -1 35 -4 -23 -24 21 -2 -4 -10 -38 33 -27 71 9 -12 -25 -4 28 -22 -3 -30 -26 5 -14
5733 -14 27 33 69 -8 38 -19 -5 -20 -38 -16 -12 -6 -20 42 -47 39 -15 -1 12 -18 -3 -26 15 56 -4 -34 8 -19 -5 32 -33 -15
5765 -15 -14 23 -39 21 -30 4 15 40 -12 -1 -44 11 14 -16 53 -28 43 -39 -38 21 40 -6 -45 20 0 -30 -44 -17 -46 -22 13 25
$$ packed form
5536a3K4J1n3k2J15p8K5njk0R7j17P1j5jK6m7M0Kk7j2%k0L3Lj0l1j0M1k3J2j3
5568a8jK3l8j1rK4jP7k3Lj7nOj9N1m6L6k0J3o0O4m3n5O8Rk2L1k7OJ7nJ0QJ5j7
5603B4o5K6J0k8M6j7P5o8m0J4P2m4l6O1n4L6k2n8Q5m6K9Mo1N2M3r2O6rK9q6L5
5634a9LJ1J5l8K7ml8K7nrk5M0k4M8oPj8N5o7Qk0P5n1M4l7j7l6P3JK3km1n0J2J9
5669a9J8j5J1O5j06N1j4j3J0l4J0jQ5L4k4r3M0O6r8J5N6q6K0Q8r5j1P2ql1j0M7
5700C0%j7m6M3o6p5J59qj3qL6l9j9jM5k3kok8P1o0R8o2k1j3K1L2n0J9k7ML1j9
5733a4M1OL6p7M6n7J4j5j8K2MOj4O2q9Q6n4J4J3l0J5k3M1M1o0l0M2k7J4L7o5J8
5765a5JL7o2O0n1L4J1K5n2J1m3N5Ll0O9q1P1q2JN9J9m6l9O5k0l0j4K7k9K4L5J2
$$ plain form
5797 25 12 -27 -16 11 1 -6 -1 -20 -24 -40 46 -46 -70 12 -20 8 -18 -85 -8 18 -23 17 37 26 19 -21 12 -10 25 -5 1 -7 16
5830 16 12 -38 35 -21 -73 54 -17 32 -23 24 -3 -26 20 -8 -55 34 -17 11 39 17 -87 56 -5 -19 -34 5 -43 14 -3
5859 -3 -13 10 -23 -37 10 122 22 -29 10 -14 -63 17 31 44 -4 17 6 10 5 -16 -27 32 -7 3 -18 35 4 -80 6 26 -19
5890 -19 15 -25 16 33 14 -19 -27 70 -17 29 62 -2 -10 6 26 32 -35 3 33 0 -20 17 55 13 32 43 -62 -31 -17 -6 -5 2
5922 2 16 28 -18 -31 -46 29 -67 26 53 8 -6 4 33 -27 -57 78 -6 22 45 7 29 54 -7 -32 5 46 -7 -16 -17 26 14
5953 14 -26 -4 30 0 -11 35 14 -5 -3 5 2 56 3 -3 -49 -55 4 -32 6 15 57 -59 82 -42 43 -38 7 9 25 57 42 -28
5985 -28 -57 15 15 -13 4 69 -78 4 -11 50 14 -10 7 1 9 -1 -14 -4 16 -8 -42 48 20 -9 -22 20 16 35 80 27 -35 -9
6017 -9 -41 2 11 -17 -66 9 -11 -35 -2 -32 -22 41 35 20 -33 27 32 35 -34 -56 -29 -14 29 69 7 45 59 49 34 -11 -21 -6 15
$$ packed form
5797B5j3l9J1K7j0pNj9mj6Q6r2k4Q2l2K8k6o7P7K6m1M0K0j1pm0L3k2L5l0OqK3
5830A6mn0P3n6n2J27p1M9n5M7k7k3M6k8m7Q9n1K8K8k2j04J43o1j4j5L9m8N7j7
5859cj0K3l3j4M7J12j00n1L9k4m9Q0J4J3m8K1j1Mnk1j1N9l9J0k1N3l1q4Q6K0m5
5890a9L4m0M1J7j9l3qR7q7M6L3o4qJ6K0Oo7L8L0l3k0L7L8m2J9J1j05L1J4J1JP
5922BJ4J2m6j3j5P5r6R3K7m5j4J0K9o0l0J35q4K8K3l8K2K5o1k5L7M1n3rjM3j2
5953A4m0K2L4l0j1M6k1j9KQlN4n3om6oN9l6L8RM2j16J41j24Q5q1M5KJ6L2j5p0
5985b8k9P2%k8J7O5j47Q2j5O1l6k4J7oQj0j3J0K0k4l4R0k8k9j3M2mJ9M5n3o2K6
6017il2M3Rk8m9P5k0k4L3l0J0O3oj5n3O0NLo9k2K7J5M3M0o2L8J4j0j5m5j0J5K1
$$ plain form
6050 15 14 -2 50 -3 -25 -17 -18 -51 51 -24 15 20 -3 26 -21 26 -15 39 -5 -28 4 -14 -64 54 -8 -37 -39 58 14 -47 -6 -64
6082 -64 0 53 18 -61 -52 -25 30 61 -44 -8 -6 -30 -22 0 25 -30 12 43 -8 17 -7 26 -16 -26 -28 9 -21 -51 -2 -9 -12 -11 60
6115 60 33 -10 -8 12 31 -18 13 21 3 -1 -70 -33 7 -39 -39 12 -10 -26 -22 -58 35 -32 -35 -26 -67 -34 -51 40 -18 -4 -8 -10 -31 25 21
6150 21 2 19 -26 -61 35 11 -3 -7 16 17 -46 -13 12 6 9 -33 34 46 -62 9 33 10 32 -5 -25 17 -16 -16 49 -11 -2 -63 -7
6183 -7 0 -31 -10 -8 -19 10 18 21 -12 -57 2 5 -3 -25 94 9 6 -8 -88 32 -60 1 37 -51 -17 2 53 27 -21 -8 -57 -18 -63
6216 -63 48 47 -34 -41 -27 4 -29 35 18 -19 -50 64 11 -38 23 -11 42 8 5 37 -9 -18 7 -39 -26 -7 -58 15 -21 31 -31
6247 -31 -10 -34 -5 12 27 29 25 -8 -42 18 -11 -28 -37 -86 -36 22 33 63 16 -12 -32 11 79 23 12 12 52 -15 4 16 44 30
6279 30 -18 -25 -26 7 -11 18 -40 45 -20 -29 -23 -24 -20 -53 -26 -24 -8 10 -13 -24 -82 -52 48 -46 -64 57 21 -46 -34 14 23 -53 15
$$ packed form
6050A5jj6N2n3k2Qjl3J02p5L9Nk3K9m7M7m1N4m4k3L2j8n0J18o2k9kR7m4o1M1n8
6082f4O4N3l5p9RK7N5L1j05L6Kk4QK2K5n5M2L1n1K5k4L3m2j0kL7l0l0M9plJP1
6115F0k7m3KK0J9m9L1Qj8mo9L7M0m6%N1k2j6Ml6R3o7lRm1L3j7R1n8J4mkk1N6m
6150B1j9J7m5l5R6k4j4mK3Jo3L3K5oLm2O7J2j08P1K4k3K2l7k0M2l3%O5o0Ro1N6
6183gPl1K1Kj1K9QLl3m5N9Lqk2J19q5lj4q0J20r2O1L6q8L4J9N1k6m8J3m9L9m5
6216f3J11jq1pJ4L1l3O4j7l7l1J14n3m9O1l4N3l4lL2m6rK5m6J3J9n1P3l6N2o2
6247c1K1k4K9J7J5Kml3l4O0k9j7rm9N0N8J1L0m7k8k0M3O8n6j1%M0o7J9J2K8j4
6279C0m8pjL3j8K9n8Q5o5rOjMl3K7KJ6J8k3j1n8L0J00r4j8J21l6o7J2M8Rp6O8
$$ plain form
6312 15 -28 -17 25 20 41 -1 0 -7 -30 -5 -28 21 34 -25 3 29 45 -27 33 -50 -64 -17 68 -45 -14 24 31 -12 -38 3 0 -39
6344 -39 -24 -40 -7 11 -4 13 -10 -16 -41 -39 8 -27 -32 -4 -3 -24 -17 -17 -16 -75 -6 54 7 41 -2 50 35 -4 -7 11 -33 -26 45 28 0
6379 0 -18 -47 -17 11 53 61 2 14 -15 -13 -29 18 16 64 4 7 -14 -13 -5 -57 24 44 -16 -29 -10 -23 61 11 -53 49 5 -40 2
6412 2 8 -56 7 6 27 -5 29 41 -11 57 9 35 79 39 44 -33 58 -43 16 -16 68 0 10 26 37 34 -10 1 78 8 -23 -14 46
6445 46 -18 -47 5 -36 40 75 -32 28 10 0 8 21 -25 -37 -54 3 39 -40 -59 14 -48 1 30 47 -27 -34 43 -29 -14 -13 -1
6476 -1 80 7 60 -52 -38 -36 -29 -38 -36 37 -21 12 5 13 14 -27 6 16 1 1 -4 87 22 -20 -33 39 -8 58 -48 1 -52 49 -7 -32
6510 -32 41 -52 -45 -50 45 11 15 -37 29 -6 -4 -75 -27 48 -2 22 -2 -32 18 -2 66 -24 -3 1 -5 34 -5 -15 -51 19 -42 -17 21
6543 21 35 70 -3 -20 -18 41 -45 -27 -13 -14 -28 -26 39 56 -3 2 7 -59 3 -90 -25 3 14 18 6 2 16 35 16 24 8 -45 -4 -24
$$ packed form
6312A5m3J1M2nK1m2Jpk3K5k3M9J3n9K8K6J6p2O0q3j4M7Q5j13L1L8Pm3k6M1ll9
6344c9J5j6L3J8j5J7k3ok5KM7l5nK8Jk1P%Jn9O9O0m7L4m3N2j5l9lJ8m4PP1j7k8
6379@j8k9L0K8M2Qn9J2k9Kj6M7kM8o0Lk1JQn2Q1K0o0j3J9j3Q4n0o4J02m4m5M2
6412BOo4O3jK1l2L4J2n2O8m8K6M4m0Np7R1j01N9l2Q4o8J0J6J1lm4J1P7p0l1RO0
6445D6o4k9N2m1P6L5j07O0j8j0QJ3m6j2j7N7L6p9j9P3o2M9K9J7p4pP7p2J5JJ2
6476aQ1p3N3j12J4KPrKP3n8L3pQJm1L3J0j5%nR1o5m2j3P2m7O6j06M9n3J01n6k5
6510c2P3r3PnR5l4Mn2O6l5Kp1M8P5n0K4k4l0N0k0O8r0K1MoL9l9j0l6P0o1K5L8
6543B1J4L5p3j7KN9q6J8J4jj4KO5J7n9NNo6O2r3O5K8J1Mj2mJ4J9j9Qj6n3M1k0
$$ plain form
6577 -24 21 1 -62 -26 -22 -55 -39 20 10 -82 28 31 -6 -27 59 -4 88 -19 -17 13 41 21 7 11 -20 3 24 2 -81 -2 -13
6608 -13 -8 23 5 47 16 2 33 -85 5 -44 16 18 11 33 -10 17 -65 -3 30 20 -9 -5 9 68 -10 -6 1 -1 -21 45 47 -25 -53 27
6642 27 68 5 86 24 -4 -6 43 -28 -31 11 12 36 5 -57 22 10 53 50 -14 30 25 5 -35 16 0 -49 28 42 -3 19 -35 19 13
6675 13 49 7 5 27 35 -28 20 36 -30 -12 4 -24 -47 -21 -4 -73 -18 0 -16 -55 -53 80 -25 -35 6 33 -29 20 22 -34 -30 -35
6707 -35 11 -50 -26 42 -18 18 -48 10 -14 17 31 -18 -57 11 24 13 34 0 25 -21 2 26 -25 -64 -30 -44 -14 38 25 10
6737 10 14 -18 -42 -32 -2 46 -21 28 -11 -10 10 -4 -64 -76 -5 15 -22 -71 -11 7 -16 27 24 -30 35 -35 -33 -60 -15 -36 13 45
6769 45 51 -40 -58 -7 -11 6 -67 4 -41 32 -36 9 -6 -9 -14 15 -25 -41 -19 -71 -54 41 -8 -77 -33 -80 10 -39 -55 19 -22 -45
6801 -45 9 44 15 -17 -34 -17 17 -3 4 -36 -21 27 -62 -24 27 -12 -53 15 25 -11 29 -2 37 12 -4 35 -4 -29 -40 -67 13
$$ packed form
6577b4M5k0o3L6Ml3J6N9j0r2J10Ll7k1Q6o3R2j07KL0K8k0j4Ml1K3K1k2q3P9j1
6608a3NL1j8M2l1j4L1j18R0m9O0KpK2m3K7q2O2L3j0k9MJ4N9p8MPkk0O6Kp2k8Q0
6642B7M1o3Q1o2k8kM9p1lM2JK4l1o2P9j2M3lo4M4nk0m0N1j6m9P7J4m5K2n4N4o
6675A3L6m2kK2Qo3M8J6o6J8J6k8k3K6J7o9N5J8j6l9KJ33j05j0M1K7o2M9Kn6Mn
6707c5M6o1K4O8o0L6o6N8k4L1J4m9l9O8J3j1K1l4K5m6K3K4n1l9L4j4L0N2j3j5
6737A0Ml2k4J0L0M8o7M9l9JK0j4o0j2P1K0l7m9O0J8k3M3ln4O5p0Kk7M5k1M9L2
6769D5Or1j8N1mJ7p3P1m5P3o8M5j5lnK9m0j6K2n2J7R5m9o9M4m7R0m9j6P4m1k3
6801d5N4L5k9l2j7J7L4k0Pm0J5M8q9L8N1l9m1O8J0l6M0l1L9k5j6L9l9k5j1k7Q0
$$ plain form
6832 13 -20 -14 -4 21 -21 -67 34 39 -62 75 -10 -49 -25 25 -34 42 1 -34 -12 21 5 21 -29 25 10 -35 17 -85 -67
6861 -67 -9 -16 -38 23 -46 27 -31 16 26 -9 3 20 -5 -30 22 -17 5 14 -28 17 4 -26 -12 -13 46 -25 -2 8 -16 -37 6 -31
6893 -31 -52 -25 29 -11 23 39 -64 -21 -75 -58 30 -53 -22 -16 48 4 -21 -9 2 4 -21 -15 25 20 -10 -32 -4 11 1 37 1 52
6925 52 19 -11 17 41 -15 -47 28 -6 36 -5 -9 21 29 17 -21 34 -21 17 -6 -29 30 -22 49 18 -12 48 -6 -54 0 3 -11 -10
6957 -10 -75 -31 -12 -1 34 -23 -38 35 -13 -85 11 -42 -33 -47 -15 33 54 -7 -28 20 30 -11 36 -26 -35 -28 24 52 11 2 -7 -18 -15
6990 -15 21 3 61 24 -32 18 50 -38 -26 -13 -63 -5 -23 -3 -12 13 -7 -6 -1 -48 -26 -7 1 -14 3 -52 41 -15 -33 -18 27 -5
7022 -5 -16 -23 -49 1 22 -30 -32 -39 -10 9 24 34 42 49 -42 12 66 3 6 20 -2 9 12 -1 46 -6 -50 23 -2 39 82 22 -41 -13
7056 -13 -30 29 3 -2 -76 -37 57 17 3 0 -10 16 9 -27 8 -57 -41 -35 -3 -31 -61 44 3 0 41 -43 -32 -58 -7 19 24 -40 4
$$ packed form
6832A3l3OJ0K5m2m6J01Nj01J37q5l9K4N0n9P6m1l5K2L3j6J6n0N4j5m5N2j02J8
6861f7N8pk2O1o9P3n8M7J0l5J2J7k5k5N2l9K2Rm2M5j3l0J4jN9p1K3J0k4k1M3l7
6893c1k1K7N4m0L4J6j03M3n4J7Q8q3L1OO4m4k5J2J1Kk5OM0nl0k2K8J5j0L6l6N1
6925E2l3l0K8K4n6l2P5l4M2m1mL0Qj2l8N5n5L8k3k3N9n2P1l1l0O0n4m8N4Lj4J
6957a0o5M4J9J1L5n7j5P3m8p2R6n3Rj4L2M8K1o1k1M8J0m1M7o2rPN2K8m1rrj1L
6990a5L6j8N8l7n6N0L2q8J2J3n0N8j8K0rK5k0JNm7K2J9Qj5J7n5R3n6j8J5M5l2
7022ej1pk6N0K1n2kpK9J9J5J0QPr1N4N4o3LJ4k2J1Lj3M7n2m4P3k5M1M3o0o3K8
7056a3j7N9k6np4L9R4m0j4lj0K6pl6L5o5J6OL2k8l0J05m1lM1q4J1k6N1K6No4M4
$$ plain form
7089 4 14 -9 -24 -19 23 18 1 18 24 -10 -12 -15 29 -1 24 67 35 18 -43 25 -1 12 -48 -27 -24 47 -8 72 25 26 -52 -4 6 -11
7123 -11 -25 -4 -15 -8 30 -31 16 -16 20 3 32 8 11 25 -16 -13 -30 -21 27 7 -18 -2 21 -25 -46 -25 13 13 -8 21 -10 -77 -17
7156 -17 -30 18 12 -3 20 -21 59 -24 -25 5 -2 -26 -6 2 -22 -11 15 -3 24 -49 -32 5 -14 13 25 15 -21 0 23 -48 -4 16
7188 16 48 -51 35 38 -7 -19 -13 58 65 -6 -9 12 -24 8 33 32 -32 12 32 36 -14 58 -25 27 60 -7 -67 14 11 -7 -33 38 -56 10
7222 10 5 63 75 1 21 20 19 -10 3 3 -13 19 23 3 10 47 -20 -54 53 50 1 -23 -42 -50 -12 -7 17 -25 -39 -5 -8 -20 -63 -54 -6
7257 -6 11 24 -49 26 -16 8 -6 -15 -26 43 -11 11 17 1 -28 26 -27 -61 -35 -34 -48 33 -30 -41 -5 -8 47 -47 68 -14 22 12
7289 12 -30 14 31 -2 -71 -53 -4 13 -17 -5 -23 45 43 -26 -18 6 14 -45 55 -40 -12 26 -77 21 -45 -32 26 -8 -42 7 13
7320 13 -7 -5 13 -11 -52 19 -16 -19 -37 -18 -35 -8 40 -38 -10 43 31 66 27 11 44 9 -30 11 -60 -2 40 0 -46 -83 -44
$$ packed form
7089DJ0k3j5NM2nj7J7Ol4klM4l0K5M3l2j7o1O8k6J3o0K1LP1n5Q0m7Jp8M8J0j7
7123a1j4K1j1PL8o1M7l2L6j7K9k4LJ4m1Lj7RM8k0k5J6K3m6k1K1L8%k1K9l1o7O0
7156a7j3M8oj5K3m1Q0q3jL0pk4K0Qk4J1K6j8K7p3J7L7j9K7J2j0l6K1K3p1M4K0
7188A6L2r9Q6Lm5j2OP1Pp1lK1l6L2K5jo4M4K0Mn0P2q3N2L3o7o0Q1lj8k6P1r4O6
7222A0nN8J2p4K0jjk9J3%j6L2Mk0PL7o7l4J07lm9k4j9qL8NK4m2j4L4lj2m3RM8
7257fJ7J3p3P5m2K4j4rj1O9n4K2Oj6k9N4n3l4K6Jj4Q1o3j1L6lN5r4J15q2L6j0
7289A2m2M4J7l3o9J8M9J7l0J2j8O8ko9QK4Qn9J00r5K8L8j03R8o6J3N8l4l4M9O
7320A3k0KJ8k4m1P1l5lj8J9j7K7M8p8K8N3j2L5l9j6L3l5l9M1p1N8M2m0m6l7L9
$$ plain form
7351 -44 -40 2 -17 -48 56 -45 -29 30 8 -17 25 -2 -90 15 -58 0 -9 34 18 34 -1 -19 41 -13 51 50 -29 -24 -26 -14 0
7382 0 -19 -7 -14 -16 -10 -11 -51 8 -6 -2 14 48 -94 45 -13 -33 28 -30 10 7 40 41 -4 -1 -45 -61 0 -10 25 17 -15 13 -24 -44
7416 -44 5 -2 -33 -31 7 31 -35 24 42 14 8 -58 48 18 -8 0 -52 -13 -29 2 27 -48 0 33 57 4 40 0 -9 -2 -22 4 -13
7449 -13 1 -10 1 -44 15 -2 -3 22 38 -69 15 -41 31 26 -14 -55 8 -61 6 58 -55 -7 -61 39 -63 -25 -68 -61 76
7478 76 80 32 -42 4 56 -34 39 -2 9 -16 76 38 -29 4 62 3 2 20 30 20 2 -9 -57 37 -23 -53 -30 -45 34 -24 60
7509 60 39 -1 -71 -15 33 9 -38 -3 13 -16 34 -32 64 40 -21 -32 95 -22 9 -34 25 -6 -82 -42 -38 5 29 -28 1 17
7539 17 -26 -24 39 -35 37 12 16 1 76 51 -27 -2 10 20 -30 -4 0 -25 34 22 12 -19 -60 -23 6 -8 -54 -23 15 -3 -32 -34
7571 -34 5 -91 1 21 -30 16 -46 -18 -22 -15 9 17 50 -1 21 -21 17 51 43 -67 1 -2 -16 18 -34 -49 22 26 14 41 -25 -3 2
$$ packed form
7351d4MM2j9l1J04j01J6N9k2k5M2k7q8J05p3N8rM3j6J6l5j8O0n4O4jp9NkJ2J4
7382@j9J2pkOjm0N9j4MJ6L4j42J39n8k0O1n8M0lL3Jm5Lm4j6O1j0L5ql2K8l7k0
7416d4M9pl1KL8K4o6N9J8k8oo6J06l0k6Qn2L9j6L1K5p5M8L3K4n3L6m0rPk0K6j7
7449a3J4j1J1m5N9j7jK5J6j07Q4n6P2nm0m1O3o9O7N2j13M8n4J00j02L8m3PJ37
7478G6Mm8p4M6N2r0P3m1J1k5R2l8o7L3N8n9jJ8J0j0j8j1m8R4o0l0K3j5P9n8Q4
7509F0k1m0p0N6M8k4m7L5J6k9N0o6R6k4o1j1J27j17L1m3N9l1p6M0MM3K4n7K9J6
7539A7m3KO3p4P2k5Mj5P5k5p8K5J2J0n0K6Mk5N9j2j0l1m1L7K9j4m6L1L8j8k9k
7571c4L9r6R2K0n1M6o2K8mPK4QL3n1K2m2L8L4qj10O8lj4L4n2j5P1Mj2K7o6K2N
$$ plain form
7604 2 22 -55 20 -52 -2 28 15 13 -9 59 -30 -68 -12 53 6 60 19 -35 -38 -53 -24 -48 -2 -43 -14 -17 -2 -24 -22 -12 -9 37 -56
7637 -56 7 -2 56 -73 -27 23 -28 16 32 49 22 -1 -1 4 -46 14 -16 -69 -10 1 -23 38 2 35 24 75 2 28 29 -23 -49 26
7669 26 -15 -17 105 -60 -41 0 4 17 -16 -23 13 21 -12 -48 -56 22 -17 0 -1 -14 67 10 -6 20 -27 6 -43 29 -22 -3 -38 28
7701 28 34 -33 51 2 15 -3 60 19 -2 57 -8 38 -52 19 -5 21 98 44 45 -17 -5 42 -12 -10 -15 -25 -20 -23 49 25 72 59 -29
7734 -29 -44 -23 6 18 19 -44 -32 -65 -57 -28 -46 0 -24 -31 -3 38 -74 18 -20 16 26 25 6 -18 21 -16 8 -46 -23 -12 -40 -85
7766 -85 -102 3 -3 63 30 -15 -103 41 -36 -16 30 -27 -22 -84 6 41 49 34 21 39 25 -20 6 -22 10 -30 26 -64 14 38 -61
7797 -61 46 -40 39 90 -4 8 -33 -19 -61 45 1 -36 21 -16 -32 36 -42 -10 -35 31 2 24 86 15 -31 -31 -29 13 23 16 59
7828 59 27 -11 14 -53 -12 -22 -25 -1 23 1 13 -26 76 -35 11 -14 -53 -17 -58 27 -19 -5 -36 10 -56 -38 -14 32 -21 -45
$$ packed form
7604BK0p7P5p2N0L0j3kk2O8q9l8N6O5m7N4m1n4lj5K9k4M6m1K9lJ5k2KJ0LM6r3
7637e6O3rN8j29M6N0n1M4J6J7k7k3%Nn0O0l0n3N9J1k4O1l6L3j1N1p3K6Jn2k6P5
7669B6m1kJ22j65J9M1MJ3l3pL6Ql3l6qP8l9J7jj3Q1n7j6K6m7L3m9P2n1J9l5O6
7701B8Oo7Q4m9J3j8O3m1k1N9o5M6r0P1k4K6P7n4Jo2J2M7n4Knj0NlP2k4M7j3q8
7734b9j5K1K9J2Jo3J2l3QK9j8M6k4pK8M1j12R2l8L6J0jj9k4L9l7K4n4K3J1k8m5
7766h5j7J05oO6l3m5q8J44p7K0M6n7No2R0L5Qj5j3J8j4m5K6k8L2m0N6r0P8K4r9
7797f1J07q6P9N1r4J2m1J4m2J06m4l7N7l7j6O8p8L2k5O6k9K2O2p1m6%KM2J0pM3
7828E9l2l8K5o7M1j0lK4K4k2J2l9J02j11M6k5l9L6m1Q5m6J4l1M6o6J8K4M6n3k4
$$ plain form
7858 -45 -18 98 34 14 16 75 -29 -29 47 8 -3 -34 72 5 10 48 -2 1 63 -10 -15 -33 -19 -8 -24 16 -6 -13 19 17 -19 -3
7890 -3 18 21 23 24 -76 10 -61 -67 -9 -46 -14 58 -4 -43 41 7 -67 -16 -66 65 -13 18 -55 -18 42 28 -4 -15 4 -40 -7 -47
7922 -47 -39 -63 -38 -6 4 7 16 0 -9 60 27 -12 -17 -68 -51 -35 19 -44 35 5 1 -20 -39 -8 8 -49 -28 12 -25 -44 -48 -36 -32 -34 -56
7957 -56 -34 -12 14 43 -7 -25 -88 -26 -20 -66 5 -19 12 -14 41 -10 -3 39 -17 40 28 4 20 -31 9 3 -3 26 -30 84 -42
7988 -42 45 47 12 5 31 -68 0 17 -12 32 21 -1 3 39 -17 -5 -14 -20 -63 11 16 -14 2 10 5 7 -4 -2 -14 -52 -51 -26 22 1 -14 10
8024 10 52 -10 24 -38 9 0 3 15 0 -7 -20 -10 -17 -17 -10 7 5 -54 19 8 46 25 2 36 39 -54 -45 -24 0 2 -20 18 -20 -22 5 -8
8060 -8 -11 32 -27 49 -39 -27 27 15 21 -36 16 27 -49 21 -75 33 -49 19 52 38 68 19 -57 24 0 -36 27 -17 -23 -85 -23 29
8092 29 -17 3 42 -31 37 43 45 19 23 16 59 15 6 -4 -8 5 -22 10 15 42 -32 -34 -9 -30 -5 -14 16 -19 -23 -7 -19 6 -24 20 30
$$ packed form
7858d5K7J16o4k0KN9j04%P6l9j1l1J06o7NL8n0LO2p3nj8J4J1j6M0k2pL2kl6J6
7890cK1LKJj00Q6p1oN8l7L2P2o2l9Q4l4p4N1n0J31p8L1p3L7O0j4l2j1J9m4L3m0
7922d7Qk4K5L2J0LRj6rO9l3l9nn1J7J6N4o3P9l0mk1j9L1J6n7K1M0l7j9mJ2Mkk2
7957e6K2K2K6K9n0j8o3O2Om6P1k4L1k6N5n1PM2n6N7j2k4J6n1M0ooK9n6J14j26
7988d2Q7Kl5pK6r9O8J7k9M4j1k2ML6n6J2rom3P4Nl0J6QnKj1Kj2l8JK5M8k1j5K4
8024A0M2o2L4o2M7rLJ2j5pj3J0p%PJ7kn9P3j1L8k1k3L4Lr3RK1K4Kk2L8l8kK7j3
8060hlM3n9P6q8J2N4j2On7N2J1p6P0r6J08q2O8L3j4L0m9p6Q1k4l6O3m4oo2O2N2
8092B9m6K0L9p3O8OKk6MpM3m4rj0mJ3k7L2NK7p4kK5k1K5rL0l5mJ6j2K5l0M4J0
$$ plain form
8127 30 -22 5 2 48 -53 52 26 11 -24 -5 9 40 -49 -70 -29 49 -30 -51 38 -4 14 18 26 -3 40 46 55 -22 11 17 53 25
8159 25 13 44 35 -22 -29 -10 -17 -21 -8 49 -24 4 -46 -17 17 -21 -21 -65 -77 -52 0 40 36 -9 45 26 0 -28 27 -59 39 -1
$$ packed form
8127C0n2K7lM6j01J05k6j5l5J9J4L1q9k1M1P8p9k1Q9m2J8MQk9M3ORp7L3OL6k8
8159B5j2L1rn7pJ9pmJ3N7p3K8n0K9L4l8%m4j2K5N2M0mm5N4j9k6k8N5q6R8m0
8191a
$$ Imaginary data points
##PAGE= N=2
##DATA TABLE= (X++(I..I)), XYDATA
$$ plain form
0 0 0 0 0 0 0 0 -8 8 -8 8 -8 8 -16 16 -24 24 -32 40 -48 56 -63 72 -84 96 -112 128 -144 162 -184 208
30 208 -234 264 -295 330 -370 410 -456 508 -561 621 -691 763 -844 937 -1037 1150 -1280 1425
48 1425 -1594 1794 -2026 2309 -2657 3099 -3682 4495 -5698 7678 -11521 21761 -106442 -291958
62 -291958 -57327 196414 256955 36693 -201417 -235251 -13938 213657 219189 -15213 -226165
73 -226165 -198863 39724 228789 183372 -51141 -228436 -171300 65625 227700 146701 -88778
84 -88778 -220099 -116117 106420 210717 95345 -119249 -208409 -79170 133966 203990 60505
95 60505 -141017 -189741 -43901 140843 175632 27837 -148084 -165718 -5431 159798 152012
106 152012 -16372 -163601 -137585 29133 162890 127407 -38989 -162140 -113258 52447
$$ packed form
0@%%%%%%qJ6j6J6j6J6k4L2m0M8n6P2q8J04j19J35j56J80k08K40k72L06l46L92
30B08m42M98n59O25p00P80q66R64j069J182j312J454j607J781j974K187k430K705
48A425l019L388l820M335m966N756o781Q177j0193J3376j9199L3282j28203j85516
62b91958K34631K53741O0541k20262k38110l3834K21313K27595N532k34402k10952
73b26165K7302K38587J89065m5417k34513j77295N7136K36925J62075q0999k35479
84h8778j31321J03982K22537J04297j15372k14594q9160J29239K13136P0024j43485
95F0505k01522m8724J45840J84744L4789j47795j75921j7634J60287J65229p786
106A52012j68384j47229K6016J66718J33757l5483j66396j23151M8882J65705
$$ plain form
116 52447 156984 93525 -64763 -150826 -78779 74565 150145 68336 -86320 -149723 -54432
127 -54432 96211 142441 39956 -99841 -132202 -27375 103442 123383 12767 -109569 -113948
138 -113948 1614 112710 104567 -10827 -112858 -97507 18497 114376 89700 -28867 -114750
149 -114750 -77919 39592 112375 66056 -48322 -110529 -56386 56173 108376 46397 -62351
160 -62351 -103200 -36073 66092 97294 27465 -69505 -92911 -18992 74381 88564 9354 -78671
172 -78671 -82831 -740 80479 76352 -6937 -81104 -68868 15216 81483 60727 -22882 -80540
184 -80540 -53304 28619 79460 47477 -33247 -78612 -41729 38109 76672 34437 -42803 -73410
196 -73410 -26434 47509 70349 18841 -51850 -67066 -11794 54670 63009 5994 -55692 -58266
$$ packed form
116E2447J04537o3459j58288q6063P2047J53344P5580q1809j54656o3403R5291
127e4432J50643M6230j02485j39797l2361J04827J30817J9941j10616j22336m379
138a13948J15562J11096q143j15394j02031J5351J16004R5879k4676j18567q5883
149a14750L6831J17511P2783m6319j14378o2207N4143J12559N2203o1979j08748
160f2351m0849O7127J02165L1202o9829r6970k3406P3919R3373J4183p9210q8025
172g8671m160Q2091Q1219m127q3289p4167J2236Q4084O6267k0756q3609n7658
184h0540K7236Q1923N0841l1983q0724m5365L6883P9838L8563m2235p7240l0607
196g3410M6976P3943K2840n1508p0691j5216N5272O6464Q339n7015o1686k574
$$ plain form
208 -58266 -983 55870 53618 -4323 -56641 -48718 10483 57980 43868 -16284 -58762 -39389
220 -39389 20863 58634 34697 -24824 -57148 -29130 28112 54215 23201 -30879 -51515 -17957
232 -17957 33962 49804 13411 -36971 -48263 -9054 39085 45961 5029 -40292 -42837 -697
244 -697 41193 38872 -4271 -41833 -34356 8919 41948 30623 -12411 -42008 -27624 15210 41808
257 41808 24653 -17820 -40994 -21087 20247 39408 17072 -22729 -37964 -12840 25651 36427
269 36427 8673 -27792 -34619 -5303 28954 32549 2560 -29375 -30395 40 29671 27718 -3208
282 -3208 -30078 -24805 6597 30646 22195 -9626 -31103 -20003 12126 31222 17469 -14121 -30081
295 -30081 -14585 15388 28378 11609 -16721 -27042 -8630 18795 26224 5877 -20602 -25357
$$ packed form
208e8266N7283N6853k252n7941n2318P923N9201M7497j4112o0152m2478J9373
220c9389O0252L7771k3937n9521l2324K8018N7242K6103l1014n4080k0636L3558
232a7957N1919J5842l6393n0382j1292L9209M8139O876m0932m5321k545M2140
244f97M1890k321m3143l7562P477M3275L3029j1325m3034k9597J4384M2834K6598
257D1808j7155m2473k3174J9907M1334J9161k2336l9801j5235K5124L8491J0776
269C6427k7754l6465o827K9316L4257L595k9989l1935j020L0435K9631j953l0926
282c208k6870N273L1402K4049q451l1821k1477J1100L2129J9096j3753l1590j5960
295c0081J5496K9973J2990j6769k8330j0321J8412K7425P429k0347k6479m755
$$ plain form
307 -25357 -3533 21558 24071 1860 -21887 -22528 298 22144 20053 -3089 -22286 -17281 5659
320 5659 22364 15639 -7405 -22915 -14615 9017 22980 12865 -10234 -21910 -10707 10971 20557
333 20557 8474 -12591 -20102 -5883 14577 19484 3625 -15647 -18546 -2521 15657 17715 1579
346 1579 -15922 -16386 482 16233 14137 -2819 -16256 -12611 4325 17025 11972 -5709 -17680
359 -17680 -10915 6999 16906 9149 -7481 -15618 -7487 8265 15144 5705 -9995 -14959 -3835 11268
373 11268 14441 2805 -11506 -13976 -2235 11679 13174 899 -11914 -11526 982 12034 9995
386 9995 -2526 -12332 -9476 3577 13126 8955 -4464 -13029 -7933 4919 12171 6679 -5509 -11550
400 -11550 -5191 6670 11342 3803 -7859 -11135 -2725 8512 10894 2242 -8611 -10475 -1659 8621
$$ packed form
307b5357K1824K5091K513k2211k3747o41K2826K1846k091k3142j9197N005K2940
320E659J6705o725k3044j5510Q300K3632J3963j0115k3099j1676J1203K1678R586
333B0557j2083k1065p511J4219K0460M907j5859j9272k899J6025J8178K058j6136
346A579j7501m64J6868J5751k096j6956j3437L645J6936J2700n053j7681j1971
359a7680O765J7914R907p757j6630q137Q131J5752O879r439j5700m964J1124J5103
373A1268L173j1636j4311k470J1741J3914J495j2275j2813L88J2508J1052k039
386I995j2521r806K856J3053R549m171j3419q565N096J2852P252n492j2188o041
400a1550O359J1861M672p539j1662l276Q410J1237K382q652j0853j864Q816J0280
$$ plain form
414 8621 9539 445 -8686 -8247 1031 9090 7443 -2195 -9663 -7015 2880 9998 6817 -3239 -9714
429 -9714 -5989 3590 9038 4759 -4116 -8378 -3594 5114 8354 2543 -6187 -8545 -1945 6587 8386
444 8386 1789 -6348 -7856 -1324 6242 6984 336 -6417 -5925 1018 6838 5377 -1786 -7325 -5435 2188
460 2188 7770 5305 -2410 -7284 -4515 2544 6363 3481 -2902 -6048 -2475 4066 6381 1621 -5015
475 -5015 -6570 -1441 4959 6372 1682 -4661 -5993 -1221 4548 4916 -41 -4721 -4036 1058 5202 4067
491 4067 -1510 -5986 -4327 1769 6006 4084 -1569 -5141 -3372 1590 4535 2406 -2469 -4555 -1548
506 -1548 3573 4915 1113 -3875 -5099 -1411 3611 4987 1510 -3332 -4253 -614 3294 3275 -408 -3603
522 -3603 -3035 966 4331 3380 -1186 -4685 -3399 1117 4143 2951 -812 -3477 -2319 1378 3407 1464
$$ packed form
414H621R18r094r131M39R278Q059j647r638p468K648R895P118l181j0056o475
429i714L725R579N448m279q875m262M784Q708L240n811q730k358O600Q532J799
444H386o597q137j508O532P566P42o648o753M92O943N820j461p163n539J890P623
460B188N582k465p715m874K769P059L819k882o383l146L573O541K315m760o636
475e015j555N129O400J413m690o343j332M772N769L68m957m680O85N094M144j135
491D067n577m476J659O096M237j922n653l572J769M962K945k129m875k086L007
506a548N121J342l802m988j224L688N022J376l477m842r21L639L908j9l683l195
522c603N68M001L365r51m566l499J286M516L026j192l763k665J158L697K029j943
$$ plain form
538 1464 -2387 -3737 -1019 2869 3963 1214 -2649 -3977 -1423 2507 3513 856 -2453 -2666 -15
553 -15 2637 2431 -560 -3159 -2831 565 3540 2947 -585 -3237 -2493 604 2658 1889 -950 -2718 -1413
570 -1413 1705 3040 1089 -2065 -3066 -1174 1671 2950 1366 -1474 -2681 -856 1804 2235 96
585 96 -2133 -2082 180 2424 2421 -63 -2667 -2525 172 2267 1889 -258 -1784 -1259 475 1866 1097 -1234
603 -1234 -2511 -1184 1543 2785 1337 -1132 -2457 -1488 813 2040 817 -1232 -1495 155 1735 1464
619 1464 -363 -2012 -2041 -97 2071 2317 423 -1627 -1721 -277 1106 1040 -261 -1337 -711 1136 2113
636 2113 729 -1481 -2355 -1070 944 2026 1450 -304 -1484 -943 433 890 56 -997 -960 316 1627
653 1627 1767 14 -1974 -2102 -322 1529 1620 465 -722 -858 -73 748 356 -767 -1282 -341 1144 1630
$$ packed form
538A464l851j350K718L888J094k749l863j328K554L930J006k657l309k13K651
553a5K652k06k991k599L28L396K975n93l532k652P44L097K054p69k839j768J305
570a413L118J335j951l154j001J892K845J279j584k840j207J825K660M31k139
585I6k229N1K262K244lk484k604J42K697K095l78k147j526N25J734J391p69k331
603a234j277J327K727J242j448k469j325R69K301J227j223k049k63J650J580k71
619A464j827j649k9J944K168K46j894k050r4J444J383o6j301j076O26J847R77
636B113j384k210q74J285K014J082n76j754j180N41J376M57q34j053L7J276J311
653A627J40j753j988j28J780J851R1j155j187j36P85Q21l92j123n15R41J485M86
$$ plain form
671 1630 912 -565 -1858 -1485 177 1569 1017 -307 -782 -177 597 584 -164 -1150 -1106 234 1649 1512
689 1512 74 -1134 -1240 -641 423 1052 545 -579 -710 395 1065 249 -865 -1174 -537 573 1411 1152
707 1152 -385 -1345 -766 361 535 132 -116 -298 -242 352 904 165 -1134 -1275 62 1010 922 251 -418
726 -418 -911 -476 613 815 -275 -908 -120 593 519 183 -44 -731 -949 132 1128 733 -499 -791 -190
745 -190 242 418 338 -202 -887 -398 837 913 -214 -769 -317 77 227 421 361 -397 -838 27 778 554 -216
766 -216 -440 -330 -45 434 671 -27 -895 -444 586 629 -88 -442 -272 -171 38 569 556 -220 -712 -142 365
787 365 346 -5 -85 -281 -295 368 744 -27 -842 -618 357 601 227 35 -147 -352 -194 386 383 -202 -484 -56
809 -56 333 361 215 -92 -536 -611 204 764 278 -413 -329 120 205 23 20 -166 -292 -17 466 443 -58 -417 -310
$$ packed form
671A630p18j477j293L73J662J392n52j324m75O05P74j3p48r86M4J340J415j37
689A512j438j208j06N99J064O29n07j124j31J105O70q16j114l09O37J110Q38k59
707A152j537r60N79J127J74m03k48j82N6N94N52p39j299j41J337R48q8o71o69
726d18m93M35J089K02j090o33P88P13p4l36k27o87k18J081R96l95j232k92O01
745a90M32J76q0n40o85M89J235P6j127n55M52L94J50J94o0p58m41Q65P51k24p70
766b16k24J10K85M79K37o98q68M51J030M3p17l54J70J01K09N31j3p76m92N70N07
787C65j9l51q0j96j4O63L76p71q15K24R75K44l74j92j82k05J58N80ln85k82M28
809e6L89K8j46l07m44p5Q15N60m86o91Q4M49Q5j82lj86j26K75M83k3n01l59J07
$$ plain form
832 -310 -60 160 368 190 -224 -421 87 501 102 -401 -352 -51 177 327 298 -80 -406 -195 145 276 106
853 106 -113 -113 -61 61 349 94 -381 -492 -24 450 339 -1 -132 -137 25 157 163 2 -188 -106 221 228 60 -62
877 -62 -216 -268 -151 317 282 -95 -341 -94 265 155 -2 -189 -180 -103 202 322 90 -166 -210 -30 74 46 106
900 106 -4 -180 -61 216 297 -87 -290 -115 170 202 219 76 -209 -151 -9 223 -38 -149 -57 96 77 69 120
923 120 -81 -287 -171 237 292 92 -146 -157 41 58 64 8 -153 -205 91 251 69 -149 -177 -121 -22 123 233 164
947 164 -196 -123 83 157 -39 -129 -32 16 94 206 128 -155 -212 -81 190 97 5 30 -16 -37 -37 112 7 -212 -144 124
973 124 187 122 -68 -87 -108 -119 94 128 -14 -100 30 116 14 -89 -102 -11 -112 61 182 65 -172 -151 -41 12
997 12 7 22 47 -43 -16 73 162 6 -187 -29 85 63 30 110 16 -100 -171 118 72 -25 -40 44 136 49 -35 -68 -89 -165
$$ packed form
832c10K50K20K08j78m14j97N08M14l99n03M9L01K28J50k9l78l26K11L40J31j70
853A06k19%N2J22K88k55m75j11M68M74j11l40j31nJ62J32Oj61j90Q2L27Pj68j22
877f2j54n2J17M68l5l77k46K47L59j10j57j87RP7L05J20k32k56m4J80J04k8O0
900A06j10j76J19K77Q1l84k03J75K85L2J7j43k85N8J42K32k61j11R2J53j9qN1
923A20k01k06J16M08N5k00k38j1J98J7On6j61n2K96J60j82k18k8N6R9J45J10o9
947A64l60P3K06P4j96r0R7M8P8J12p8k83n7J31K71r3r2K5m6k1%J49j05k19O8K68
973A24O3o5j90j9k1j1K13L4j42q6J30Q6j02j03j3R1j01J73J21j17k37K1J10N3
997A2nJ5K5r0K7Q9Q9j56j93J58J14k2l3Q0r4j16p1K89m6r7j5Q4R2q7q4l3k1p6
$$ plain form
1025 -165 110 228 81 -60 -39 17 -66 -56 28 52 -43 2 130 84 -149 -185 -69 72 30 95 161 23 -187 -82
1049 -82 99 -57 -130 -1 123 108 136 174 -35 -207 -196 59 169 50 56 98 21 -9 -74 -34 -131 -127 79 263 117
1074 117 -1 -82 -149 -155 -31 172 133 -7 -17 115 -40 -153 -199 -41 -54 92 245 204 4 -216 -168 -98 -85 10
1098 10 29 106 35 32 30 -111 -214 -165 49 126 136 127 33 -58 -145 -134 -41 -75 -22 145 132 120 29 -109 -163 -180 49 51 148
1127 148 121 28 24 -54 -68 -45 -66 68 84 144 112 29 -139 -193 -51 -34 71 68 145 77 -58 -20 -62 -127 -137 78 152 116
1155 116 125 37 -122 -143 -139 -12 34 58 67 84 37 -70 -66 -177 -85 -43 68 178 64 34 -56 -67 -104 -78 -38 100 48 78
1183 78 94 -3 -111 -143 -80 0 18 66 136 67 45 -132 -55 -86 -108 7 129 140 59 44 -66 -129 -109 -87 34 -7 105
1210 105 77 69 -1 -57 -74 -95 -26 45 123 74 6 -2 -57 -84 -37 -44 48 44 55 76 -1 -22 -175 -50 -94 26 134 114 65 -27
$$ packed form
1025a65K75J18j47j41K1N6q3J0Q4K4r5M5J28m6k33l6J16J41m2O5O6j38k10J05
1049h2J81j56p3J29J24j5K8L8k09j72J1K55J10j19OM2p7l0o5M0r7MK06J84j46
1074A17j18q1o7oJ24K03l9j40j0J32j55j13m6J58j3J46J53m1k00k20M8P0J3R5
1098A0J9P7p1lkj41j03M9K14P7J0rr4r1q7J1R3l4N3J67j3j2r1j38n4j7K29KR7
1127A48k7r3mp8j4K3k1J34J6O0l2q3j68n4J42J7J05lP7o8j35L8m2o5j0K15P4l6
1155A16Rq8j59k1MJ27M6K4RJ7m7j07Mj11R2M2J11J10j14l0r0j1l7K6M0J38n2L0
1183G8J6r7j08l2O3Q0J8M8P0o9k2j77P7l1k2J15J22J1q1j5j10o3K0K2J21m1J12
1210A05k8qp0n6j7k1O9P1P8m9o8qn5k7M7pR2mJ1K1p7k1j53J25m4J20J08k0m9r2
$$ plain form
1240 -27 -37 -54 -51 -44 -15 16 93 84 73 -98 -73 -81 -10 -42 8 62 48 38 -4 5 -80 -73 -152 -10 98 109 43 19 -3 -59 -85 -32
1272 -32 18 86 115 122 -7 -74 -69 2 -136 0 102 165 111 -8 -5 -55 -84 -78 73 10 86 67 130 -35 -111 -105 -76 -50 72
1301 72 155 139 17 24 -7 -51 -136 -69 88 137 8 43 94 -54 -183 -110 -34 -47 77 178 102 -42 -29 -64 -120 -77 -16
1328 -16 99 125 70 26 -13 -102 -122 -4 56 -24 60 96 101 -66 -75 -7 -78 -28 119 224 87 -48 -37 -50 -120 -92 31
1355 31 59 36 41 109 25 -83 -97 -33 -23 29 71 161 74 -28 -85 -72 -61 -18 28 25 21 57 125 -46 -129 -28 34 -36 12 143
1385 143 94 -67 -60 -75 -69 -56 -67 82 96 40 44 27 -55 -95 17 31 8 -21 143 52 -101 -44 -28 -45 -62 -11 110 14
1413 14 18 -51 -10 -55 18 18 18 46 24 79 31 -58 -92 -3 1 -34 72 83 42 6 41 -24 -82 -23 -29 102 45 26 88 72 -92
1444 -92 22 9 41 -27 91 110 -6 63 -52 -14 -90 -80 -7 16 23 72 -13 13 -56 13 -73 49 -5 94 48 -48 7 -3
$$ packed form
1240b7j0j7LPK9L1P7rj1j71K5qP1l2N0N4j4j0m2Rq5Pp9J42J08J1o6k4k2n6k6N3
1272c2N0O8K9Pj29o7NP1j38J36J02O3n4j19Ln0k9OJ51o3P6j9O3j65p6OK9K6J22
1301G2Q3j6j22Pl1m4q5O7J57M9j29L5N1j48j29P3P6j3J24J01p6j44J3l5n6M3O1
1328a6J15K6n5m4l9q9k0J18O0q0Q4L6Nj67rO8p1N0J47J05j37j35J1j3p0K8J23
1355C1K8k3NO8q4j08j4O4J0N2M2R0q7j02n7J3J1M3M6lmL6O8j71q3J01O2p0M8J31
1385A43m9j61Pj5OJ3j1J49J4n6Mj7q2m0J12J4k3k9J64r1j53N7J6j7j7N1J21r6
1413A4Mo9M1m5P3%%K8k2N5m8q9l4Q9Ml5J06J1m1l6L5o5n8N9oJ31n7j9O2j6j64
1444i2J14j3L2o8J18J9j16O9j15L8p6J0P3K3PM9q5K6o9O9q6J22n4R9m6r6N5j0
$$ plain form
1472 -3 -7 -13 -12 48 103 -20 -22 5 -28 -89 -33 11 18 -7 9 21 -34 -89 47 -7 -39 41 31 7 -55 31 24 -15 -4 -29 14 13 38
1505 38 1 -19 -36 -49 15 15 -8 53 30 -39 -13 57 29 -45 -13 53 25 76 -15 -5 -29 -77 7 24 15 15 -9 28 -7 -51 -23 -66
1537 -66 13 -3 -23 -8 -12 -6 17 28 25 14 35 6 -9 26 3 -27 -48 -32 11 25 38 -6 -37 -30 6 -19 15 -14 25 118 -27 -3
1569 -3 -22 59 -26 -5 -8 129 45 -68 -10 -14 -85 -34 -32 6 32 21 -51 -25 -44 -13 28 -26 -1 69 -17 1 -51 8 -37 -27 -9
1600 -9 42 102 38 49 -8 18 -98 -14 -9 50 94 43 82 2 -52 -74 -60 -45 43 18 24 33 -57 -8 13 1 90 61 55 39 10 55
1632 55 -42 -66 -19 20 16 -26 46 45 -39 -40 -29 24 -36 42 46 0 -74 -23 13 -36 -53 84 59 48 24 -49 -5 -78 -40 -18 -34 9
1664 9 41 32 1 -64 -58 -10 -50 12 40 -12 50 -20 34 15 -17 -33 34 88 -5 8 42 -30 12 24 -36 -6 -24 -17 15 113 -77 -41
1696 -41 24 79 29 6 14 30 -21 -8 46 -60 7 -66 41 31 -32 5 9 35 20 5 16 -45 19 -39 -8 -53 -9 48 -21 30
$$ packed form
1472cmoJO0N5j23kK7l3o1N6M4Pk5J6J2n5n5J36n4l2Q0j0k4o2Q6pl9J1k5M3jK5
1505C8l7k0j7j3O4%k3O1k3o9K6P0k8p4L2O6k8N1r1J0k4m8Q4J7r%k4L7l5m4K8m3
1537f6P9j6k0J5mOK3J1lj1K1k9j5L5k3l0k1J6M3J4J3m4l1PL6k5L4k9L9R3j45K4
1569cj9Q1q5K1lJ37q4j13N8mp1N1KL8K6j1p2K6j9L1M1n4K5P0q6J8n2N9m5J0J8
1600iN1O0o4J1n7K6j16Q4NN9M4n1L9q0n4k2J4J5Q8k5ORr0M9K1j2Q9k9oj6k9M5
1632E5r7k4M7L9mm2P2jq4jJ1N3o0P8Mm6p4N1L6m9j7J37k5j1k4p3M4p3L8K2j6M3
1664IL2rl1o5OM8m0O2K8n2O2p0N4j9l2j6O7N4r3J3L4p2M2J2o0L0j8PL2R8j90L6
1696d1O5N5n0k3QJ6n1J3N4j06O7p3J07j0o3L7MK6j5j5J1o1O4n8L1m5M4N7o9N1
$$ plain form
1726 30 -12 -43 -8 -49 -3 47 52 -11 12 5 -3 -11 46 -1 49 33 43 28 -22 46 -9 44 9 72 65 1 -24 105 -92 -47 -77 -3
1758 -3 5 49 47 61 -21 -100 -94 -61 -70 34 60 60 4 -13 -10 -54 -47 19 30 47 62 22 14 -29 -29 7 -41 -34 22 57 88 -68 -39 47 -8
1793 -8 -65 -21 42 5 38 31 -74 -60 19 -7 23 43 64 65 33 4 21 -67 -26 -17 35 -8 36 11 -85 22 -57 -58 14 35 80 8
1825 8 2 -44 -24 -83 -15 -19 9 -20 35 -50 39 -17 -48 0 -32 34 45 10 7 56 -8 -64 -94 -57 -5 -19 36 89 60 -15 3 -45
1857 -45 -33 -11 18 61 49 7 21 21 -51 -83 -48 2 27 64 66 18 -39 -34 -31 -26 14 38 88 -7 0 -4 -2 -31 -24 13 35 1 38 51 -81
1892 -81 -32 -85 -50 6 19 56 51 77 -12 -11 1 -95 -77 -8 37 71 61 -54 1 -95 -6 17 8 -16 94 84 1 -74 -54 -46 -35
1923 -35 -38 28 86 82 37 -47 -71 -63 -16 -16 78 34 31 -26 -58 -77 -85 -80 19 -12 93 124 -4 14 -90 -49 14 32 63 24 66 17
1955 17 -6 -56 -30 -22 33 28 124 13 -11 -48 -27 -55 -49 80 41 64 63 2 -88 -39 -43 -7 -16 24 9 40 48 -11 -16 -50 -114 -38 58
$$ packed form
1726C0m2l1L5m1M6N0No3K3pqqN7m7N0j6J0j5n0O8n5N3l5O3po4k5J29j97M5l0P4
1758cQM4kJ4q2p9OL3rJ04K6%n6j7Lm4PO6J1J7J5m0qm3%L6m8PN6L5L1j56K9Q6n5
1793hn7M4O3l7L3pj05J4P9k6L0K0K1Jl2k9J7q8M1RN2m3M4k5r6J07p9jP2K1M5p2
1825Hom6K0n9O8mK8k9N5q5Q9n6l1M8l2O6J1l5lM9o4n6l0L7N2j4N5N3k9p5J8m8
1857d5J2K2K9M3j2m2J4%p2l2L5N0K5L7Km8n7NLNM0K4N0r5PmKk9PL7K2l4L7J3j32
1892h1M9n3L5N6J3L7nK6q9JJ2r6J8O9M5L4j0j15N5r6Q9K3rk4J10j0q3p5K0QJ1
1923c5lO6N8mm5q4k4QM7%R4m4ln7l2j9qNR9l1J05L1j28J8j04M1O3J8L1l9M2m9
1955A7k3n0K6QN5nR6j11k4l7K1k8OJ29l9K3jo1r0M9mL6rM0j5L1Qn9nl4o4P6R6
$$ plain form
1988 58 47 -55 29 22 -37 -41 0 -46 13 15 41 86 -10 -21 36 -29 -18 45 5 14 -53 26 33 -4 -15 -12 70 -29 16 41 47 -2 -82
2021 -82 48 55 24 8 6 4 -17 33 6 -69 13 5 18 -75 -2 66 -15 -12 -60 44 39 59 23 -37 -55 25 13 44 -15 10 -36 50
2053 50 -37 31 -30 -2 14 -6 -37 47 25 -4 119 -4 7 12 -26 18 10 9 32 -19 -29 11 23 -11 -35 -31 -60 0 49 -19 -18 -67
2085 -67 8 13 19 39 -15 3 -33 -64 -3 -24 19 -22 18 2 -68 61 37 -16 13 32 35 30 -4 1 19 -14 20 10 10 37 21 39 -37
2118 -37 28 -41 23 62 -33 8 43 -2 -60 -34 -21 -9 24 0 16 14 -6 -79 47 -59 -62 40 43 -32 2 8 -1 -73 -14 -8 38 -9
2150 -9 57 -18 3 -47 -34 -26 -92 -2 -11 10 -8 -27 4 -14 12 -25 17 65 -21 13 -13 37 15 -29 -25 -30 20 -58 33 40 -59 24 31 -9
2184 -9 -14 44 -1 2 -51 34 -15 49 -14 17 42 -11 -54 68 -54 28 -2 -16 24 46 -11 15 28 -43 -22 -2 14 -52 -13 -16 4
2215 4 -17 -12 33 -5 -7 -18 -33 91 16 -24 10 23 20 -47 -53 53 -40 5 15 -20 -32 37 -32 29 2 -22 45 12 37 -32 50 17
$$ packed form
1988E8j1j02Q4pn9mM1m6N9KK6M5r6j1N7o5J1O3m0Ro7P9Pl7j1LQ2r9M5K5Om9q0
2021h2J30Pl1j6kkk1N0k7p5Q2qJ3r3P3O8q1Lm8J04nK0l6o0j8Q0j2L1n9K5m6Q6
2053E0q7O8o1K8J6k0l1Q4k2k9J23j23J1Nl8M4qjK3n1j0M0J2l4k4Mk9O0M9o8Jm9
2085f7P5NOK0n4J8l6l1O1k1M3m1M0j6p0J29k4n3K9J9Lnl4NJ8l3L4j0%K7j6J8p6
2118c7O5o9O4L9r5M1L5m5n8K6J3J2L3k4J6kk0p3J26j06lJ02Lp5L4Orp2N9OM6m7
2150iO6p5K1n0J3Qo6R0rK1j8j9L1j8K6l7M2M8q6L4k6N0k2m4MnN0p8R1Pr9Q3Pm0
2184inN8m5Ln3Q5m9O4o3L1K5n3m3J22j22Q2l0j4M0K2n7K6J3p1K1K0J6o6L9lK0
2215Dk1NM5l8kj1j5J24p5m0L4J3lo7oJ06r3M5J0l5j2O9o9O1k7k4O7l3K5o9Q2l3
$$ plain form
2247 17 6 -48 0 60 5 23 -34 -34 6 -15 -43 -14 -70 74 58 9 -24 -21 -5 60 62 8 3 34 19 -81 17 7 38 -29 16
2278 16 48 -9 -51 8 -10 26 -39 52 18 16 -7 20 -8 -17 47 32 -21 4 33 -17 -3 -45 62 -43 -85 6 16 31 -52 -56 -18
2309 -18 39 10 26 3 42 -24 -49 -43 40 -25 35 103 -24 5 -83 -103 14 4 84 23 28 35 30 -30 8 2 1 81 -8 3 49 0
2341 0 36 -37 19 51 -28 54 0 -16 -9 12 -1 -17 95 96 85 64 13 15 -29 -37 -122 -25 63 79 102 61 33 -29 -6 -40 24 -34
2373 -34 -9 41 91 -39 -91 -13 -58 -35 54 67 32 23 6 -83 -55 -42 -46 46 1 36 9 82 -23 -43 21 -25 -25 45 17 52 -2
2404 -2 50 7 2 58 62 12 44 41 14 14 -78 -22 -9 17 84 16 35 -34 -60 -42 -39 16 25 64 70 -2 -3 -8 -40 23 4 68 -75 6 -12
2439 -12 61 -85 -40 17 -27 -21 -29 29 47 5 33 5 -67 -19 19 52 47 68 -15 -6 1 -95 11 -63 55 50 76 19 0 5 -46 8
2471 8 -54 5 85 27 25 28 -5 14 -30 -20 -11 14 53 66 79 21 -54 -119 -25 -41 62 70 62 -9 2 -4 -14 -11 13 -16 31 55 39 32
$$ packed form
2247A7j1n4M8O0n5J8n7%M0k1k8K9n6J44j6m9l3LJ6O5Kn4nL1j5j00R8j0L1o7M5
2278A6L2n7m2N9j8L6o5R1l4kk3K7k8rO4j5n3K5K9n0J4m2J07j05m2R1J0J5q3mL8
2309a8N7k9J6k3L9o6k5OQ3o5O0O8j27K9q8k0J17j0Q0o1NPno0L8ojQ0q9J1M6m9
2341@L6p3N6L2p9Q2n4j6PK1j3j6J12Jj1k1n1Km4qq5R7Q8J6K3m1k8o2K3l4O4n8
2373c4K5N0N0j30n2P8m5K3Q9J3l5rj7q9K8J3mR2m5L5k7P3j05k0O4m6%P0k8L5n4
2404bN2m3nN6Mn0L2lk7%r2N6J3K6O7o8J9o9k6J8LN5RL9Op2jnl2O3j9O4j43Q1j8
2439a2P3j46M5N7m4OqN8J8m2K8k8p2M8L8L3nK1q3RPr6J06p4J18nK6n7j9Nn1N4
2471Ho2N9Q0n8kLl3J9m4J0RK5L9J3J3n8p5o5R4j6J03Qqp1J1oj0LK4k9M7K4j6p
$$ plain form
2505 32 -28 -33 -41 30 14 79 24 31 26 -57 -60 -17 -25 3 17 62 60 -19 -28 -39 -89 -38 37 -13 13 39 12 -27 -43 9 -66 -23 -1 56
2539 56 37 -26 -52 -12 -60 0 11 -50 2 22 84 -20 1 27 -38 61 28 49 -6 43 -13 -18 -54 -24 -46 140 76 -18 -12 55
2569 55 19 -32 -20 -15 20 62 -19 63 -33 -27 29 -33 -37 -3 6 15 86 -16 -5 -44 -16 11 49 20 21 17 -13 -62 -41 27 9 -46 -19
2602 -19 37 -5 61 14 44 24 -7 -46 1 -41 -6 -18 -39 41 -8 17 12 18 11 8 24 44 2 -13 44 -9 -12 56 43 43 -3 -31 -24 -58
2636 -58 33 -12 -11 -57 -43 -42 -50 46 -63 49 8 -35 -35 23 -44 25 46 5 -13 10 50 21 -23 11 49 56 0 7 26 -4 -55 -77
2668 -77 18 25 56 23 2 18 -41 40 29 -26 59 50 -30 -30 -5 107 9 76 5 -44 19 1 8 53 45 -3 -42 1 13 36 37 12 -3
2701 -3 -23 -20 -5 37 4 71 -6 11 -28 32 -52 -67 16 30 27 15 20 13 22 -42 -32 -17 31 -7 11 58 35 -28 -36 12 40 -76 8
2734 8 10 12 -37 3 2 -1 37 -26 40 51 -16 34 -9 -31 64 -18 12 -28 27 28 -42 21 -26 33 -36 -10 5 -11 -3 54 9 -64 -42 -50
$$ packed form
2505C2o0nqP1j6O5n5Pnq3lM3qK8J4M5kp9rj1n0N1P5n0K6K6k7l9j6N2p5M3K2N7
2539E6j9o3k6M0m8O0J1o1N2K0O2j04K1K6o5R9l3K1n5M9n6nl6L0k2J86o4r4OO7
2569E5l6n1J2NL5M2q1Q2r6ON6o2mL4RRP1j02J1l9K8K7L8k9Jml0m9K1O8j8n5K7
2602a9N6m2O6m7L0k0l1l9M7m2L5j2k1Q0m9K5nOplJ6K0m2j5N7n3lO8j3%m6k8Pl4
2636e8R1m5Jm6J4JqR6j09J12m1m3%N8o7O9K1m1j8K3M0k9m4L4L8Pn6PJ9l0n1k2
2668g7R5PL1l3k1J6n9Q1j1n5Q5rq0%K5J12r8O7p1m9O3j8PM5qm8l9M3J2K3Jk5j5
2701ck0LJ5M2l3O7p7J7l9O0q4j5Q3J4lj2NpRo4J0J5M8l8J8M7k3o3qM8K8j16Q4
2734HKKm9M0jlL8o3O6J1o7N0m3k2R5q2L0m0N5Jp0O3m7N9o9K6J5j6QN7m5p3K2q
$$ plain form
2768 -50 14 13 30 65 60 43 71 15 48 6 -15 29 -29 -20 -5 11 33 -30 -15 -6 44 40 41 -22 5 11 8 -4 7 0 -36 -6 41 0 -74
2803 -74 -39 66 -1 37 37 -45 63 76 36 6 -47 -3 29 6 -23 -80 4 -16 -45 -6 -9 -11 42 3 15 -35 -19 -16 11 -48 -39 66
2835 66 40 25 -54 42 -29 43 -2 9 56 -2 -33 -69 6 9 -49 -9 9 -23 22 -16 -4 -21 -9 46 2 -28 24 -64 -20 -53 -35
2866 -35 -11 6 40 0 -27 -9 0 -1 17 -18 -25 -5 48 -19 -81 -33 -3 -30 -28 -49 -2 54 -32 17 13 42 25 8 -22 -3 53 -7 51
2899 51 -20 -31 -22 25 -7 14 -1 32 19 15 -19 -36 -35 26 92 22 -11 5 -33 19 -52 -7 -21 0 -18 39 -19 18 -5 -22 -24 9
2931 9 46 18 19 60 -22 -35 -16 -8 15 21 22 6 18 10 7 -33 48 53 66 -57 16 7 -14 -47 -36 9 -24 50 -7 33 19 -42 -53 24
2965 24 -35 -43 -20 -4 35 17 -43 -111 8 -44 40 8 33 16 -20 -7 -60 20 23 -51 -36 76 66 27 32 -56 5 -53 -47 26 90
2996 90 18 34 23 -22 -70 -49 -13 -8 8 -6 4 -44 9 -45 7 -7 0 56 -60 44 12 -49 3 -22 -22 -50 41 -14 6 -2 7 -31
$$ packed form
2768e0O4jJ7L5nj7K8n6L3m2k1M4n8RJ5J6K2o3J5RN0mJo3K7Olj2J1pl6L0M7m1p4
2803g4L5J05o7L8%q2J08J3m0l0n3M4L2k3k9n7Q4k0k9L9lkN3l9J2n0J6LK7n9RJ05
2835F6k6j5p9R6p1P2m5J1M7n8l1l6P5Ln8M0J8l2M5l8J2j7J2N5m4l0N2q8M4l3J8
2866c5K4J7L4m0k7J8RjJ8l5pK0N3o7o2M8L0k7Kk1M7N6q6M9mK9j7j7l0J9N6o0N8
2899E1p1j1RM7l2K1j5L3j3ml4j7JO1O6p0l3J6l8N2p1M5j4K1j8N7n8L7k3j7kL3
2931IL7k8JM1q2j3J9QK3OJj6J2qlm0Q1NJ3j23P3rk1l3J1M5l3P4n7M0j4o1j1P7
2965B4n9qK3J6L9j8o0o8J19n2Q4l2K5j7l6J3n3Q0Lp4J5J12j0l9Nq8O1n8OP3O4
2996I0p2J6j1m5m8K1L6NJ6j4J0m8N3n4N2j4PN6j16J04l2o1N2k5%k8R1n5K0qRl8
$$ plain form
3028 -31 -32 -2 -1 11 47 4 -52 -5 4 -47 -51 -8 15 -12 61 40 -23 -21 -12 -4 -67 33 -8 -57 -53 -21 -10 -38 -36 -50 -23 14 11 22 17
3063 17 28 -3 47 -18 29 4 23 11 4 10 5 -59 -4 -16 19 13 46 -29 -17 14 -15 0 59 -6 -34 36 -4 55 5 -20 21 -39
3095 -39 -12 -11 31 12 -57 -71 10 13 46 45 53 28 37 22 29 -31 -4 -39 41 37 -29 0 -7 46 -57 -30 -53 59 -19 1 18 -3 -32
3128 -32 30 27 -18 -92 -30 11 12 10 10 3 15 -25 -13 29 20 95 19 41 32 -6 6 -19 4 62 17 15 -36 -3 -61 45 -22 -40 -41 35
3162 35 -41 -11 23 -1 0 -20 -1 42 -50 -11 31 -34 17 -47 -28 28 17 -3 20 3 0 -25 -66 -39 -2 12 -10 12 80 -51 -16
3193 -16 8 -11 -4 -42 12 -4 16 58 -2 -52 -10 -45 -16 43 14 -19 -30 -28 -72 14 1 -20 30 35 23 -69 34 17 27 -11 2
3224 2 12 -8 -6 -43 91 -9 39 14 -24 38 -13 -19 -1 -37 -51 -37 3 -13 -15 -23 -34 61 13 -9 -58 -28 -24 -38 -5 31 -32 -27 46
3257 46 -66 31 -12 -68 6 52 0 -23 -8 -15 24 -21 8 18 27 -15 -19 -2 16 -40 -4 0 13 -1 9 -35 29 8 -6 -20 23 -5
$$ packed form
3028c1jL0JJ2L6m3n6M7Rn1mM3K3k7P3k1o3KRQo3J00m1m9ML2J1k8Kj4K7L7lJ1n
3063A7J1l1N0o5M7k5J9j2pOno4N5j2L5oL3p5J2L1k9J5N9o5k8P0m0N9n0k5M1o0
3095c9K7JM2j9o9j4Q1LL3jQk5Rj5Po0K7l5Q0mo6K9pN3j03K7k3J12p8K0J7k1k9
3128c2O2lm5p4O2M1Jk%pJ2m0J2M2rP5p6K2rl8J2k5K3N8m5kn1L3n8J06o7j8jP6
3162C5p6L0L4k4Jk0J9M3r2L9M2o5N1o4J9N6j1k0K3j7lk5m1K7L7J4k2K2O8j31L5
3193a6K4j9Pl8N4j6K0M2o0n0M2l5K9N9k9l3j1Km4Q6j3k1N0Nj2r2J03j7J0l8J3
3224BJ0k0Kl7J34j00M8k5l8O2n1oJ8l6j4J4M0j6kqj1R5m8k2m9L0Mj4L3L6o3NP3
3257D6j12R7m3n6P4M6n2k3J5pL9m5K9J0Rm2mJ7J8n6L6MJ3j4J0m4O4k1j4j4M3k8
$$ plain form
3289 -5 48 33 39 77 -5 -50 42 -55 -27 44 -17 33 -19 -30 -27 0 -29 22 -27 86 -16 21 -2 46 27 20 2 -40 -25 -55 16
3320 16 -48 5 -6 -39 31 -29 45 12 -23 33 46 39 -53 36 7 15 10 5 53 -33 -6 -32 -19 29 9 27 5 -26 22 -9 -47 -40 10
3353 10 11 -12 1 -12 26 14 63 3 -23 6 6 -14 -58 31 1 -44 47 25 36 16 52 -32 -26 -33 18 37 -16 -11 -29 0 18 -18 -9
3386 -9 -34 13 10 14 15 86 0 29 76 37 -40 29 39 4 -4 -55 -27 -37 -7 37 -22 7 -6 16 0 -9 -37 65 107 27 -13 -30 -17
3419 -17 -23 -41 30 -38 -32 17 38 10 -65 36 15 -17 -12 -5 35 6 -19 26 25 -14 10 42 32 24 10 13 49 -1 -3 -18 -49 -26 -9 -9
3453 -9 -15 -2 68 -3 41 -40 -11 -16 -32 66 35 22 14 -52 -74 0 5 -34 59 -24 -67 97 6 29 -18 -1 -8 86 8 25 -30 -11 12
3486 12 -21 16 -31 36 52 -63 -2 -18 -31 10 0 -20 1 -22 -6 6 -23 12 56 -19 32 14 -31 38 14 12 -12 9 30 17
3516 17 -29 1 41 14 -7 5 -21 14 -28 -86 30 47 50 0 -36 50 49 6 37 43 2 -6 -29 6 -18 -68 -25 38 -40 -28 -44 34
$$ packed form
3289eN3j5OL8q2m5R2r7K8P1o1N0n2j1LK7k9N1m9J13j02L7k3M8j9pj8m2J5l0P1
3320A6o4N3j1l3P0o0P4l3l5N6J3pr2Q9k9QnnM8q6K7k6J3M8k0J8k2l1M8l1l8PN0
3353A0Jk3J3j3L8j2M9o0k6K9%k0m4Q9l0m5R1k2J1k0L6q4OpN1J9n3Nj8K9J8l6R
3386ik5M7lMJP1q6K9M7l9p7O9J0l5qn1K8j0L0M4n9K9j3K2j6rk8J02M2q0m0j7J3
3419a7oj8P1o8OM9K1k8p5J01k1l2NPM0k9k5M5jl9K4L2j0qj4LL6n0kj5l1K3J7%
3453ioJ3P0p1M4q1K9nj6R8l1j3qo6k2P4Nl9R3q3m3J64r1K3m7J7pR4p8J7n5J9K3
3486A2l3L7m7O7J6j15O1j6j3M1j0k0K1k3J6J2k9L5M4p5N1j8m5O9k4kk4K1K1j3
3516A7m6L0M0k7k1J2k6L5m2n8J16J7Ln0l6Q6jm3L1Om1qk3L5k4n0M3O3p8J2j6P8
$$ plain form
3548 34 -40 -7 -18 30 26 -24 -7 49 -18 2 -12 21 24 -48 46 34 -18 10 -34 36 5 -18 -7 23 21 14 19 -27 -9 48 23 -70 45
3581 45 4 2 42 14 -26 -32 60 7 8 -24 -2 31 -55 35 -11 -24 -32 -64 -39 -20 26 20 61 -48 20 -1 -25 40 10 18 -52 55
3613 55 -13 1 13 -20 1 61 30 18 43 28 -27 43 32 -18 -4 -50 -14 47 -5 -41 60 -18 41 22 14 -44 44 31 3 -26
3643 -26 46 -2 -19 21 -3 36 -49 20 13 25 -5 -17 -26 -15 -2 36 -15 43 30 66 -23 34 18 45 40 -13 -10 49 -18 -26 -40 29 11
3676 11 19 -60 -42 5 -21 13 -32 -104 5 37 -12 -1 -38 -66 -7 34 -2 30 -17 -11 -34 24 16 11 -3 9 16 -6 11 -12 -9 2 6
3709 6 1 -64 27 5 6 26 -50 11 16 4 49 -21 68 18 -22 1 10 -85 40 18 19 -32 12 9 -7 -4 13 7 -22 -4 4 4 -25 20 -27
3744 -27 37 44 -1 -1 19 17 14 62 -54 -12 -16 11 5 35 52 -60 7 26 -73 -23 -2 16 -29 39 -28 44 -11 30 26 -4 18 26 24 38
3778 38 44 40 5 -23 -5 -18 53 11 -27 84 -16 -35 5 42 48 -32 49 -37 11 -15 3 -38 -9 2 53 26 -3 26 11 -23 -10
$$ packed form
3548C4p4L3j1M8mn0J7N6o7K0j4L3Lp2R4j2n2K8m4P0l1k3J1L0kpNm6J8N7k5r3J15
3581D5m1kM0k8m0oR2n3Jl2K2L3q6R0m6j3ql2K5J9M6oM1j09O8k1k4O5l0Qp0J07
3613E5o8J4J2l3K1O0l1j2K5j5n5P0j1n0J4m6L6O1n2l6J01p8N9j9qn8Q8j3k8k9
3643b6P2m8j7M0k4L9q5O9pJ2l0j2rJ1J3L8n1N8j3L6q9N7j6K7nn3LN9o7qj4O9j8
3676A1Qp9J8M7k6L4m5p2J09L2m9J1l7k8N9M1l6L2m7Ok3N8qnj4J2Pk2J7k3LJ1M
3709Fno5R1k2JK0p6O1Nj2M5p0Q9n0m0K3Rr5J25k2Jn1M4lj6LJ7ok9J8Q%k9M5m7
3744b7O4Pm5%K0klM8j16M2mK7oL0J7j12O7J9r9N0K1J8m5O8o7P2n5M1ml0K2QkJ4
3778C8Oml5k8J8j3P1m2l8J11j00j9M0L7Oq0Q1q6M8k6J8m1K9J1N1k7k9K9j5l4J3
$$ plain form
3809 -10 13 47 34 -18 -17 -22 -81 -5 -14 34 3 38 26 -20 70 3 7 69 31 77 3 -26 19 9 18 3 62 5 26 -9 56 -14 -27
3842 -27 13 -1 -47 47 21 39 -6 25 57 -20 -13 38 32 6 4 -10 14 6 49 26 13 -16 1 -24 14 -11 -19 31 -1 -32 -17 3 21
3875 21 -5 68 -8 38 12 -31 113 -18 3 -39 -54 9 7 -12 62 15 35 28 88 4 -59 -13 -47 22 20 -10 -15 35 -34 19 21 4
3907 4 -16 -25 -32 -11 -78 18 -40 -7 70 30 -27 34 -20 86 9 59 -33 -1 59 -1 -28 30 -16 38 -51 -40 82 2 -72 -7 63
3938 63 25 -74 45 8 -45 8 13 57 -14 26 -46 -4 -20 28 -7 44 -14 46 39 -10 48 16 45 -42 24 33 18 -46 8 24 3
3969 3 -1 40 18 -5 10 21 -33 1 10 -37 4 31 8 -3 12 63 -20 15 -28 -2 -2 17 5 36 31 19 2 -46 25 -35 43 31 51
4002 51 15 65 16 19 3 -14 -1 -39 -15 17 -72 -20 39 -58 0 -27 66 44 -7 -12 8 -15 -31 -11 -22 -44 3 31 19 10 2 -26
4034 -26 11 30 -18 -37 61 80 47 36 -5 7 -33 -17 -19 30 -8 14 -26 16 57 48 31 31 13 57 -28 -4 4 13 23 -7 23 26 -35
$$ packed form
3809a0K3L4j3n2Jnn9P6rM8l1L5j2m6R0o7MO2l8M6p4k9M5j0Rj5N9n7K1l5O5p0j3
3842b7M0j4m6R4k6J8m5L1L2p7PN1ok6kj4K4qM3k3j3k9J7k5L8k5qN0l2l1J5K0J8
3875B1k6P3p6M6k6m3J44j31K1m2j5O3kj9P4m7K0pO0q4o3M6l4O9kl0nN0o9N3Kj7
3907Dk0rpK1o7R6n8L3P7m0n7O1n4J06p7N0r2L2O0o0k7N8m6N4q9J1J22q0p4O5P0
3938F3l8r9J19l7n3N3NM4p1M0p2M2j6M8l5N1n8O0pm9N8l2K9q7O6Rj5o4N4J6k1
3969CmM1k2k3J5J1n4L4Rm7M1K7k3j1J5N1q3L5m3K6%J9j2L1nj2j7m8P1o0P8j2K0
4002E1l6N0m9Lj6j7J3l8K4L2q9N2N9r7N8k7R3k2n1nK0k3j6K0j1k2M7K8j2rqk8
4034b6L7J9m8j9R8J9l3j1m1J2m0J6kM9l8K2m0M2M1rj7%j8M4q5K4QRJ0l0L0Lo1
$$ plain form
4067 -35 4 -15 17 43 -6 -40 18 21 4 2 -7 22 18 -61 30 65 -51 -53 39 -28 22 33 -47 6 -10 26 3 18 4 -5 2 52 -47
4100 -47 36 6 18 14 43 -13 -64 11 -10 -15 -40 -45 -15 -19 11 96 40 -1 0 -18 -39 -19 -15 1 23 35 50 54 -35 -36 -8 -25 -50 -1
4134 -1 -13 -6 10 3 87 49 7 4 -34 11 12 29 -11 -60 5 14 -41 -27 0 -8 9 37 24 23 5 67 9 71 47 -34 -46 15 46 -58
4168 -58 21 42 9 36 19 3 32 19 -29 22 21 -57 8 -18 -28 47 -13 0 -15 0 -30 14 -2 5 -12 -62 -15 -28 -112 23 -44
4199 -44 17 47 7 28 -43 11 -21 23 24 -26 62 16 54 -25 -5 -16 -65 -25 -16 -7 -42 13 -7 40 40 31 -15 -34 -6 -25 52 46 36
4232 36 -25 -22 -29 11 6 -71 10 -8 18 -1 19 4 -58 -57 -3 29 -31 -41 1 29 -14 -1 -16 12 -5 -2 -6 -33 -15 16 -20 -65 -59 -2
4266 -2 3 38 -1 -30 31 19 -14 -36 35 8 -1 32 49 32 10 -7 6 -32 0 -14 1 -23 3 -13 -58 -78 52 -24 -5 11 -33
4297 -33 -54 -10 12 -40 45 -26 17 66 2 61 -64 -2 19 -20 -58 9 -7 6 -31 -8 80 72 -12 60 29 -6 -71 -45 -10 -48
$$ packed form
4067c5L9j9L2K6m9l4N8Lj7krK9mp9R1L5j16kR2o7N0J1q0N3j6L6k3J5j4rPN0r9
4100d7Q3l0J2mK9n6n1P5k1nk5nL0mL0Q5n6m1Jj8k1K0MJ6K2J2J5Mq9jK8j7k5M9
4134aj2PJ6pQ4l8m2ll8M5JJ7m0m9O5Rn5J4K7qJ7K8j3jj8O2n8O2k4q1j2O1L1j04
4168e8P9K1l3K7j7j6K9j3m8N1jp8O5k6j0P5o0J3j5J5l0M4j6Pj7n0M7j3q4J35o7
4199d4O1L0m0K1p1N4l2M4Jn0Q8m6L8p9K0j1m9M0RRl5N5k0M7%rm6j9K8j9P7oj0
4232C6o1LpM0np7Q1j8K6j9K0j5o2JN4L2o0j0M2K8m3J3j5K8j7Lmk7J8L1l6m5ON7
4266bNL5l9k9O1j2l3k2P1k7rL3J7j7k2j7J3l8L2j4J5k4K6j6m5k0J30p6J9J6m4
4297c3k1M4K2n2Q5p1M3M9o4N9j25O2K1l9l8O7j6J3l7K3Q8qq4P2l1l5o5K6L5l8
$$ plain form
4327 -48 50 4 19 -40 35 41 -34 18 -12 4 18 29 -20 25 11 5 112 23 -10 -21 -22 -10 -24 22 27 -66 -8 -36 -55 -18 11 0
4359 0 -39 -2 -68 58 -25 -49 -51 -22 -30 3 -22 1 -15 14 -14 -22 -4 -18 14 12 -19 -21 -14 -49 -20 19 39 5 27 -33 34 -52 10
4392 10 -13 -5 3 -51 43 4 12 45 5 10 -27 43 38 -48 -26 31 28 33 -17 -41 12 28 29 10 21 -46 -7 -6 -1 -27 45 29 -60 -4 26
4427 26 -41 -33 21 34 -33 23 -17 16 -15 15 15 -6 68 30 9 6 -41 32 9 -8 -13 23 -11 2 -19 -25 12 44 -36 -47 -58 7 74
4460 74 -3 -6 -47 11 -4 33 22 55 -3 -26 -12 -58 36 22 -24 12 -65 15 -1 -59 -21 17 -5 43 8 -15 29 69 -26 20 37
4491 37 0 25 -17 6 -39 -18 49 1 -11 12 1 -11 15 31 -17 -7 -50 -35 22 4 33 -30 23 21 -34 -15 -8 33 79 3 18
4522 18 -8 107 67 -65 7 51 60 60 -46 24 20 54 -19 -29 9 33 25 -4 12 17 -14 -9 9 28 65 48 -5 18 13 -36 2 7 -41
4555 -41 7 -31 20 53 36 44 -32 53 -39 17 52 1 38 64 3 -51 13 -54 2 14 -23 -14 21 -67 -48 1 30 1 -3 44 49 34
$$ packed form
4327d8R8m6J5n9P5Op5N2l0J6J4J1m9M5j4oJ07q9l3j1jJ2j4M6Nr3N8k8j9L7K9j1
4359@l9L7o6J26q3k4kK9qL3k5K3j6K9k8qJ8j4L2kl1kPl5K9L9K0l4K2o0O7q6O2
4392A0k3QQn4R4l9QL3m0Nl7P0nq6K2N7lNn0k4N3J6Jj9J1o7L9JNk6P2j6q9N6L0
4427B6o7QN4J3o7N6m0L3l1L0%k1P4l8k1lm7P3k3j7nL6l4J3k1oL7L2q0j1j1O5O7
4460G4p7lm1N8j5L7j1L3n8k3J4m6R4j4m6L6p7Q0j6n8L8L8k2M8l5k3M4M0r5M6J7
4491C7l7K5m2K3m5K1O7m8j2K3j1j2K6J6m8J0m3J5N7j8K9o3N3kn5J9PM1M6p6J5
4522A8k6J15m0j32P2M4R%j06P0mL4p3j0L8K4qk9J6Nl1NJ8J9L7j7n3K3nm9L8Nm8
4555d1M8l8N1L3j7Qp6Q5r2N6L5n1L7K6o1n4O4o7N6J2l7RL5q8J9M9K9k9mM7Nj5
$$ plain form
4587 34 -25 -30 -49 -52 -49 -62 13 11 -18 50 34 -59 58 17 10 0 -16 16 14 11 -16 0 -15 -13 -20 27 13 9 54 -9 19 12 40 -67 -32
4622 -32 -11 -6 46 -1 33 -82 35 29 -9 -2 17 -12 -15 44 61 -31 69 -1 16 40 24 57 36 15 -11 -24 36 -25 -58 -5 0
4653 0 20 30 30 -25 39 -38 -11 22 21 -46 -57 -15 -48 23 -36 -22 25 -51 -32 -43 2 60 47 66 -15 65 -30 50 -60 -12 38
4684 38 25 19 1 -16 -74 -14 -25 2 8 7 36 58 19 12 -48 59 18 22 -8 -6 9 -25 16 -24 13 -9 11 37 -45 -29 44 13 -22
4717 -22 57 34 21 -28 12 -3 67 -20 78 -12 -76 -20 -18 -17 20 5 0 40 -1 -43 24 53 15 -48 -13 23 22 1 -33 24 66 12
4749 12 -55 -64 38 15 -46 29 2 -72 5 43 -10 -27 38 -44 34 -14 15 -18 -2 46 23 26 0 6 -45 -26 20 42 31 19 32
4780 32 15 -8 26 -26 62 -19 20 50 45 34 -38 -11 38 -7 -27 -8 -24 59 7 21 -12 0 -18 33 -25 -15 3 7 8 -13 40 -9
4812 -9 -3 19 43 6 11 -39 40 23 -53 -31 15 9 -2 -24 -28 37 30 1 2 -57 14 27 -26 47 25 77 23 7 3 -36 61 28 -23 -19 -25
$$ packed form
4587C4n9nj9lLj3P5kk9O8j6r3J17m1pj0j6L2klk7J6j5KpM7j4mM5o3K8pK8j07L5
4622c2K1NN2m7L4j15J17ol8PJ9k9lN9J7r2J00p0J7K4j6L3k1k1k6j3O0o1l3N3N
4653@K0J0%n5O4p7K7L3jo7j1M2l3P1n9J4M7p6J9j1M5N8j3J9q1Q0r5Q0j10M8N0
4684C8j3oj8j7n8O0j1K7OjK9K2l9po0J07m1Ml0KJ5l4M1m0L7k2K0K6q2J6P3l1l5
4717b2P9k3j3m9M0j5P0q7R8r0o4N6KJL7j5nM0m1m2O7K9l8o3L5L6jk1l4N7M2n4
4749A2o7rJ02k3o1P5k7p4P7L8n3j7O5q2P8m8K9l3J6M8k3Lk6On1J9M6K2j1j2J3
4780C2j7k3L4n2Q8q1L9L0nj1p2K7M9m5k0J9j6Q3n2J4l3J2j8N1n8J0J8MJk1N3m9
4812iOK2K4l7Nn0P9j7p6K2M6oj1k2mO5pk9Jn9P1J3n3P3k2N2n4j6ml9R7l3n1Mo
$$ plain form
4847 -25 -28 25 -30 -30 12 -6 -22 49 -13 -34 13 -30 -7 -10 -33 -11 45 55 -16 -26 -11 49 74 61 -58 -24 -9 22 -2 20 38
4878 38 35 -33 17 -42 26 -19 18 25 5 -38 31 19 -7 20 -7 16 34 -9 41 -23 5 -17 -13 3 -50 54 18 36 -11 14 -6
4909 -6 -25 -46 -7 11 46 16 3 -34 20 -23 23 13 -40 -44 26 -19 -22 -90 16 -4 -27 -11 -18 -3 1 57 -5 -21 58 41 -2 -50
4941 -50 -5 9 2 -15 -12 -24 34 -6 -51 31 36 -51 -33 7 -13 -11 -25 -18 1 9 -37 -18 -62 3 -3 -13 -95 -2 28 3 -8 15 17 29
4975 29 -30 2 -8 13 -22 -50 -23 -3 -26 20 -32 65 -2 -13 12 -2 58 0 8 -49 9 -15 2 -17 0 11 -8 16 8 -16 8
5006 8 68 23 -35 -9 -16 50 -39 -34 -36 16 -66 -1 28 -60 9 3 18 9 19 -2 -8 -48 -87 59 38 5 -1 15 -9 -22 -6 6 29 -39
5040 -39 30 1 4 -20 12 38 30 36 36 3 -30 32 2 -58 -15 0 20 38 -37 -27 49 -57 -1 -14 11 -13 17 53 60 -30 -44 -4
5072 -4 20 1 -69 -4 -10 14 -36 -4 -9 21 -32 -51 -45 6 -18 -65 5 -55 18 -12 -18 -9 68 -6 -39 41 14 46 45 40 -68 42 -31
$$ packed form
4847b5lN3n5%M2j8j6P1o2k1M7m3K3lk3K2N6J0p1j0J5O0K5j3j19L4J5L1k4K2J8
4878C8lo8N0n9O8m5L7Pk0m3O9j2k6K7k7K3J8m3N0o4K8k2MJ6n3J04l6J8m7K5k0
4909fj9k1L9J8L5l0j3l7N4m3M6j0n3mP0m5lo8J06k0k3J6pJ5MN6o2j6P9j7m3m8
4941e0M5J4pj7Lj2N8m0m5Q2Nq7J8M0k0Kj4PJ9Qm6J9m4O5oj0q2R3L0k5j1K3KJ2
4975B9n9L2j0K1l5k8K7K0k3M6n2R7o7j1K5j4O0n8Qn7N8k4J7j9J7J1j9K4qk4K4
5006HO0m5n8K6pO6q9NkN2q2O5K9q8O9oJ5rJ0k1om0l9J46k1l3oJ6k4j3J6J2K3o8
5040c9O9k9Lk4L2K6qO%l3l3O2l0o0M3J5K0J8p5J0P6j06N6j3K5k4L0L6Pr0j4M0
5072dK4j9p0O5oK4n0L2nL0n3j9ON1k4m7P0o0P3l0oRP7p4l3Q0k7L2jnj08J10p3
$$ plain form
5105 -31 4 15 -8 -3 2 28 -8 51 45 -21 -1 23 51 -38 -20 -20 16 -3 -24 22 21 -53 -6 -19 16 -36 16 4 -50 64 65 55 6
5138 6 17 61 -35 13 -33 -45 -13 6 -3 33 -22 -9 58 -26 -12 18 -34 -30 32 30 48 15 -19 19 30 10 -22 -17 36 14 -33 3 -15
5171 -15 10 2 3 15 11 -38 48 -10 -1 -9 34 31 2 14 -28 -5 10 -28 -88 12 22 -7 40 26 26 22 9 -45 40 46 25 15 -15 81
5205 81 3 -2 38 25 29 27 42 -11 25 15 45 -2 9 -43 41 53 59 -13 -51 0 -45 -31 8 -11 -10 -13 -63 48 8 -16 23 -22 22
5238 22 -52 -27 -19 21 -22 -11 -33 5 -4 -59 -17 -89 29 10 8 45 13 8 94 -37 -36 39 6 -2 -8 -27 0 45 -14 35 -8 19 -47
5271 -47 39 -41 76 0 6 -55 -13 -52 -35 13 3 -16 56 -18 -51 11 -15 52 -12 29 -44 -19 15 39 58 1 -15 28 6 -49
5301 -49 -26 24 -24 41 33 11 44 -13 14 -41 -8 61 44 26 21 12 -13 2 -24 42 -4 31 -12 -30 -16 10 -15 50 -9 -40 65
5332 65 -24 -69 34 -23 -51 1 -39 -25 6 0 -31 31 -7 -1 29 -75 46 22 -9 -24 -47 3 -24 -11 22 0 9 -72 -64 -15 22
$$ packed form
5105c1L5J1k3NNK6l6N9oo6K0K4K8q9J8%L6j9k1M6jp4M7j3L5n2N2j2n4J14Jj0m9
5138FJ1M4r6M8m6j2L2J9rL6n5J3O7q4J4L0n2MO2kJ8l3l4L8J1k0l2NN3k2m7L6j8
5171a5K5qJJ2mm9Q6n8RqM3lk9J2m2K3J5l8o0J00J0k9M7j4%mj3n4Q5Ok1j0l0R6
5205H1p8nM0j3MkJ5n3L6j0L0m7J1n2Q4J2Op2l8N1m5J4L9j9Jln0J11m0k4L9m5M4
5238B2p4K5QM0m3J1k2L8rn5M2p2J18j9kL7l2nQ6j31JP5l3qoj9K7M5n9M9m3K7o6
5271d7Q6q0J17p6Oo1M2l9J7M8j0j9P2p4l3O2k6O7o4M1p3K5L4K4J9n7j6M3k2n5
5301d9K3N0m8O5qk2L3n7K7n5L3O9j7j8nrk5J5k6O6m6L5m3j8J4K6k5O5n9l1J05
5332F5q9m5J03n7k8N2m0J4L1ol1O2l8OL0j04J21k4l1j5k3N0k7J3L3k2Rq1QM9L7
$$ plain form
5363 22 -80 -14 -30 -12 0 20 5 -39 -51 1 -55 44 24 56 11 -32 23 34 20 -31 -27 -9 22 -10 -11 -2 -72 -26 -5 -21 -82
5394 -82 52 30 -19 -38 2 42 -1 -10 1 26 -10 -24 -17 -34 -8 -51 -17 0 -27 31 6 52 44 -15 46 -34 59 -4 37 21 13 22
5426 22 -76 -22 -15 23 -60 -43 2 27 -37 -19 28 -35 -5 26 80 -21 9 5 20 0 60 -35 -27 -8 -56 24 -23 -6 12 -41 30
5457 30 -4 -6 45 -19 -26 -21 -43 74 -16 40 -25 -69 1 -43 43 57 10 -16 -47 -27 -14 -34 -14 31 -13 12 86 7 24 15 9 33
5489 33 14 29 56 32 -1 13 10 52 43 39 -38 -19 -14 1 14 -49 75 -48 13 -9 -10 19 -37 21 7 -3 52 -6 17 -52 -21 -4
5521 -4 22 -2 11 51 4 -21 61 -37 -14 28 7 39 -18 9 -1 11 44 9 -23 0 73 19 -20 -31 2 -50 9 27 -22 48 -28
5552 -28 26 -5 12 4 18 48 46 44 28 14 -34 27 26 -9 -74 23 -13 5 -17 -5 12 15 23 8 20 -2 9 -43 11 -20 -17 23 -37 16
5586 16 31 -11 -9 -22 30 49 15 43 2 38 -31 -6 29 111 28 49 0 -1 35 10 -10 13 -9 -11 30 -28 -37 -27 61 -33 9 9 -41
$$ packed form
5363B2j02O6j6J8J2K0j5m4j2N2n6R9k0L2m5m3N5J1j4n1MJ8L1l2jRp0M6K1j6o1
5394h2J34k2m9j9M0M0m3rJ1K5l6j4Pj7K6m3L4J7k7N8k5M6qn9O1q0R3o3M1j6qR
5426B2r8N4PL8q3J7M5K5o4J8M7o3L0L1N4j01L0mJ5k0O0r5QJ9m8Q0m7J7J8n3P1
5457C0l4kN1o4pNk2J17r0N6o5m4P0m4Q6J4m7k6l1K0J3k0K0M5m4K5P4p9J7roK4
5489C3j9J5K7k4l3J4lM2rmp7J9NJ5J3o3J24j23O1k2jK9n6N8j4j0N5n8K3o9L1J7
5521dK6k4J3M0m7k5Q2r8K3M2k1L2n7K7j0J2L3l5l2K3P3n4l9j1L3n2N9J8m9P0p6
5552b8N4l1J7qJ4L0kkj6j4m8O1jl5o5R7l6J8k2J2J7LQj5J2k2J1n2N4l1LM0o0N3
5586A6J5m2Kj3N2J9l4K8m1L6o9K5L5Q2q3K1m9jL6k5k0K3k2kM1n8rJ0Q8r4M2%n0
$$ plain form
5619 -41 22 -16 -25 -17 -44 -33 18 -55 27 14 -19 19 -24 69 64 33 -21 -22 27 16 -27 -6 47 2 24 -8 -56 37 -12 -20 -41 -25 13
5652 13 -18 4 -8 8 56 27 16 -9 -1 -45 59 37 -19 42 -9 46 -3 4 -1 33 -12 -62 -7 -18 39 -14 41 22 -76 -10 -35
5683 -35 -63 -11 5 9 13 10 -50 -50 4 15 -17 -21 57 11 -57 20 16 13 -24 -28 -16 18 36 21 35 24 41 -15 21 12 24 -13 -57 45
5717 45 53 -38 15 -9 22 -60 -49 38 -57 45 26 -8 -39 18 3 -29 -4 20 -20 -67 -3 33 -110 27 40 -40 42 -43 31
5746 31 25 -24 -9 -38 -24 23 -8 26 -21 -28 -12 -34 4 -22 29 8 40 3 25 -21 22 7 3 -2 22 73 3 -24 77 23 66 -15
5778 -15 36 72 -17 -26 75 6 -21 7 -39 28 23 -3 59 -28 54 -51 0 -5 52 13 -14 -41 2 13 -38 44 8 31 25 -1 25
5809 25 -10 -55 -10 -20 23 -18 62 -34 -42 -44 37 -16 -86 -17 1 -66 22 4 -43 -7 48 -11 32 48 42 -49 -30 7 -4 -39 -22 72
5841 72 -27 -35 -11 5 8 16 -49 14 -27 0 35 27 27 16 -50 -26 8 18 -57 -6 19 -26 -14 -3 7 -23 27 67 31 -6 -32 -11 1
$$ packed form
5619d1O3l8rQk7J1N1p3Q2j3l3L8m3R3nl1n4jM9j1m3K1N3m5K2l2m8R3m9qk1J6L8
5652A3l1K2j2J6M8k9j1k5Qm4J04k2n6O1n1N5m9PnL4m5n0N5j1N7n3N5j9r8O6k5
5683c5k8N2J6MMlo0%N4J1l2mP8m6o8P7mll7mJ2L4J8j5J4j1J7n6L6rJ2l7m4J02
5717D5Qr1N3k4L1q2J1Q7r5J02j9l4l1N7j5l2K5K4m0m7O4L6j43J37J3q0Q2q5P4
5746C1om9J5k9J4M7l1L4m7pJ6k2L8k6N1k1L2l7K2m6M3j5mnK4N1p0k7J01n4M3q1
5778a5N1L6q9rJ01o9k7K8m6O7nk6O2q7Q2j05N1nN7l9k7k7M3J1n1Q2l6K3ok6K6
5809B5l5m5M5j0M3m1Q0r6qkQ1n3p0O9J8o7Q8j8m7L6N5n9M3J6or1J9L7j1l5J7R4
5841G2r9qK4J6LQo5O3m1K7L5q%j1o6K4L4J0p5N1K5m5J2J1J0l0N0M0l6l7k6K1J2
$$ plain form
5874 1 40 -73 -2 -30 17 37 14 26 -30 51 15 42 27 39 -16 -50 -3 5 -4 33 62 -3 -10 13 3 42 -35 11 -11 -16 17 64
5906 64 28 -27 4 38 -47 -26 -72 -18 27 -36 -45 -18 30 98 -17 -22 126 53 18 -8 48 9 42 35 20 11 -100 48 -21 45
5936 45 15 35 29 42 51 12 -30 4 -32 25 40 15 -26 -35 31 1 6 70 -17 -19 -18 39 21 -4 -6 -22 -67 -12 1 -46 57 -4 -48
5969 -48 6 -26 -11 -1 -4 80 -3 -20 8 19 -6 -37 -3 19 -70 44 -21 -43 25 -13 -25 -15 -29 11 49 -13 -24 -18 29 -2 32
6000 32 26 -28 2 44 -17 -6 9 25 11 -33 26 4 23 59 0 6 -5 36 28 1 7 -24 -58 -24 -14 -64 -82 14 -9 3 22 25 -18
6033 -18 0 -7 70 -48 14 -64 -13 19 -12 17 0 -24 -16 -6 42 31 -21 18 35 41 -5 -22 50 43 -22 -2 44 0 28 9 -40 -38
6065 -38 7 16 2 1 -9 -92 -14 3 -5 5 -21 3 12 -34 21 -25 25 59 -54 48 -39 28 -43 5 -36 52 25 25 1 -14 -38 26
6097 26 -21 55 49 -17 47 -12 18 6 -11 -39 -9 -8 7 11 -51 28 -47 36 22 24 6 -17 19 2 62 -20 36 11 -1 -18 16 -2
$$ packed form
5874AL9j13P1k8M7K0k3J2n6Q1l6K7j5J2n5l4M7QrL7K9o5pK3j0L9p7M6k2nL3M7
5906F4l6n5L1L4q5K1m6N4M5o3rK7M8O8j15nJ48p3l5k6N6l9L3pj5rj11J48o9O6
5936D5l0K0oJ3Rl9m2L4l6N7J5k5m1rO6l0NO4q7kJN7j8k5kj6m5N5J3m7J03o1m4
5969d8N4l2J5J0lQ4q3j7K8J1k5l1L4K2q9J14o5k2O8l8j2J0j4M0L8o2j1OM7l1L4
6000C2on4L0M2o1J1J5J6j4m4N9k2J9L6n9Oj1M1qk7Ol1l4L4J0n0j8R6k3J2J9Lm3
6033a8J8pP7j18O2p8N1L2l1K9j7k4QJ0M8j1n2L9J7Om6j7P2po5K0M6m4K8j9m9K
6065c8M5Rj4jj0q3P8J7qJ0k6K4Rm6N5m6N0L4j13J02q7O7p1M8m1Q8k7%k4j5k4O4
6097B6m7P6oo6O4n9L0j2j7k8L0JJ5Mo2P9p5Q3j4Kj8k3L6j7O0q2N6k5j2j7L4j8
$$ plain form
6129 -2 31 47 -32 18 -10 0 -51 37 10 4 29 27 66 -25 -10 -12 13 70 81 26 39 -10 25 10 -20 17 67 -27 62 -35 -32 30 -47
6162 -47 0 -19 -40 13 -25 9 11 2 -2 33 -7 4 -27 -4 -58 13 9 -10 20 -15 -44 2 20 1 37 1 -9 34 24 -13 9 0 3
6195 3 14 43 36 57 42 18 41 12 -6 -10 7 8 1 -30 8 -49 -15 4 0 -24 33 16 4 5 50 -47 -45 -52 36 71 50 -6 34 -16 30
6230 30 22 -32 -51 -60 26 -61 -16 4 8 -22 19 -27 -31 26 -55 41 37 -40 -15 20 65 -40 -50 -10 -13 -8 -14 -46 -21 33 59 -18 9 23
6264 23 -58 19 -29 -79 62 57 66 27 -9 -25 -17 0 -11 24 -87 76 -12 -48 -3 -34 -34 34 -33 -53 1 19 -61 -110 -11 29 -4
6295 -4 54 27 -1 -7 1 7 -11 38 32 41 -6 -23 -15 -53 -116 -4 53 -5 -43 17 -28 -25 -14 25 22 -6 2 14 10 79 -47 31 -17 -17 61
6330 61 -68 -16 -13 45 -1 -13 18 -63 9 -8 -27 -68 -4 -66 -2 37 -7 -7 -33 -29 -5 38 -8 -31 11 -3 -16 71 18 16 38 54
6362 54 40 6 -53 -51 59 53 56 44 -3 -1 -5 -32 -46 5 33 -18 -28 -60 -25 -20 -7 -20 18 18 6 -10 -52 2 -8 -7 -43 72 20
$$ packed form
6129bL3J6p9N0k8J0n1Q8k7oK5kL9r1J5kK5N7J1n5J3m9L5j5l0L7N0r4Q9r7LO2p7
6162d7M7j9k1N3l8L4KrmL5m0J1l1K3n4P1mj9L0l5k9M6J8j9L6l6j0M3j0l7K2rL
6195CJ1K9pK1j5k4K3k9j8mJ7Jpl1L8n7L4J9mk4N7j7j2JM5r7KpQ8L5k1n6M0n0M6
6230C0qn4j9rQ6q7M5K0Ml0M1m6mN7q1R6mp7K5L5M5j05j0M0lNol2K5N4K6p7K7J4
6264B3q1P7m8n0J41nRl9l6j6QJ7j1L5j11J63q8l6M5l1%O8o7k0N4J8q0m9R9M0l3
6295dN8k7k8oQOj8M9oRm7j7Ql8o3J12N7n8l8O0m5LJ1L9lk8QJ2mO9j26P8m8%P8
6330F1j29N2LN8m6j2L1q1P2j7j9m1O4o2O4L9m4%k6MK4M3m6k3M2j4j3Q7n3kK2J6
6362E4j4l4n9KJ10oLj2m7Kmk7j4N1K8n1j0l2L5NJ3j3L8%j2j6m2N4j0Jl6J15n2
$$ plain form
6395 20 -7 -69 50 2 -49 35 86 46 -25 -9 -41 20 37 -13 -6 28 20 24 -6 22 -26 -10 -11 -52 -16 11 40 21 -39 27 24 -26
6427 -26 -45 -49 32 34 7 -5 17 -52 35 34 -1 11 21 0 -26 -13 63 38 -18 -60 8 1 -18 -1 -8 -35 -61 1 9 12 -37 38 0 -41
6461 -41 21 44 42 16 -16 -25 -29 23 3 -61 47 13 28 6 -8 16 2 5 12 18 -31 8 -84 -24 -24 -32 -45 44 41 -5 85 -20 -7 -36
6495 -36 52 14 -10 25 -4 -19 -54 -30 27 -67 -3 29 21 6 -3 -85 -27 65 -27 15 -31 3 24 32 5 -33 11 48 41 -26 63 34
6527 34 49 94 4 27 18 8 -68 28 50 0 -6 0 39 -55 9 50 -52 -32 -73 21 -13 24 -3 22 8 39 24 -2 -7 5 6 -29
6559 -29 61 58 25 -30 -11 -36 -13 23 14 -74 -1 14 -47 34 -25 30 -43 -1 13 -1 -3 72 -17 -7 2 -22 -63 10 -19 -30 26 -19
6591 -19 -8 -20 46 71 23 59 -8 72 36 14 56 -51 56 5 10 18 -28 46 12 -53 8 -14 10 21 -69 19 10 -14 38 -21 -16
6622 -16 17 20 -22 21 35 -14 42 -8 -25 19 -22 -38 -29 21 12 16 -30 -21 -56 -47 12 8 2 30 33 -22 4 32 -26 -5 -24 35 30 -37 36
$$ packed form
6395B0k7o2J19m8n1Q4N1m0p1J6l2O1J7n0PL4qMl0K8m8J6jm1L6K7K9j9o0O6ln0
6427b6j9mQ1Kk7j2K2o9Q7jl5J2J0k1k6J3P6k5n6m2O8pj9J7pk7k6O2QLm9P5l8m1
6461d1O2K3kk6l2rmN2k0o4J08l4J5k2j4K4j4LPOm9L9r2O0%qj3Q9lm6R0j05J3k9
6495c6Q8l8k4L5k9j5l5K4N7r4O4L2qj5rq2N8R2r2M2m6L4K1Qk7l8M4L7po7Q9k9
6527C4J5M5r0K3rj0p6R6K2n0oOL9r4O4M1j02K0m1R4l4L7k7K5j4L1j5k6nJ2Jl5
6559b9R0ll3n5J9k5K3L6rq8P3J5o1Q1n9N5p3M2J4j4kP5q9J0Rk4m1P3k9j1N6m5
6591a9J1j2O6K5m8L6o7Q0l6k2M2j07J07n1NQm6P4l4o5O1k2K4J1r0Q8rk4N2n9N
6622a6L3Lm2M3J4m9N6n0j7M4m1j6RN0rMm6Rl5RN9moK8Ln5K6K8n8K1j9N9no7P3
$$ plain form
6657 36 -60 -18 -35 4 38 15 19 -14 20 -92 33 22 12 -44 57 -1 -23 -2 -26 -29 -22 -12 -47 -31 5 48 -8 31 27 -6 -75
6688 -75 -48 20 -16 2 -5 15 -22 19 30 34 -3 26 17 25 4 6 19 20 22 81 78 -6 52 -28 -40 16 31 25 64 -49 21 -32 32 -17
6722 -17 -8 68 12 73 -1 -3 40 0 -5 19 -16 34 18 41 -33 18 11 31 -5 -26 17 -20 -30 -3 -79 35 -5 -16 -7 34 -4 6
6754 6 40 18 6 8 -53 33 -68 -20 -37 25 -17 -16 33 18 -51 11 3 -17 -46 14 45 -13 16 46 -3 -27 -8 -82 30 -24 30
6785 30 -48 12 10 -15 11 27 11 -16 -60 12 -8 -8 -12 3 16 29 12 -11 -7 -42 34 -23 24 14 13 8 -3 12 -36 51 -31 2 5 42
6819 42 -40 45 -24 -44 63 -12 -15 46 18 2 13 -25 21 17 39 34 27 21 40 -7 -14 -16 38 -7 -19 -27 -21 28 -8 8 -42 21 60 37
6853 37 12 12 -7 -43 63 -7 -41 46 57 -54 -13 -18 -2 36 -15 -24 42 36 30 -46 -23 7 -2 52 24 -2 -15 11 -61 -4 -7 29 7
6886 7 -46 19 28 31 29 4 -34 13 44 19 1 -59 -40 -30 -12 -58 -39 -11 35 -8 -6 5 55 8 30 -44 -24 28 -67 38 -13 -4 26
$$ packed form
6657C6r6M2j7L9L4k3Ml3L4j12J25j1j0n6J01n8k2K1k4lPJ0l5J6L6M3n6L9ml3o9
6688g5K7O8l6J8pK0l7M1J1Ml7K9rQk1KJ3JKN9lq4N8q0j2N6J5oL9j13P0n3O4m9
6722a7RP6n6O1p4kM3m0nK4l5N0j6K3p4N1pK0l6k1M3l7j0K7p6J14m0j1RM1l8J0
6754FL4k2j2Ko1Q6j01M8j7O2m2JM9j5o9O2qk0k9O0L1n8K9L0m9k4J9p4J12n4N4
6785C0p8O0kk5K6J6j6k7m4P2k0%mJ5J3J3j7k3Ml5P6n7M7j0jnj1J5m8Q7q2L3LL7
6819D2q2Q5o9k0J07p5lO1k8j6J1l8M6mK2npoJ9m7pkN4m5j2qOM9l6J6n0O3L9k3
6853C7k5%j9l6J06p0l4Q7J1j11M1nJ6L8n1rO6oop6K3L0rN4k8k6j3K6p2N7lL6k2
6886Gn3O5RLkk5l8M7L1k5j8o0J9J0J8m6J9K8M6m3KJ1N0m7K2p4K0N2r5J05n1RL0
$$ plain form
6919 26 36 30 12 -21 6 4 -32 9 28 14 29 21 22 -46 -48 -4 38 25 -4 12 7 7 6 21 -1 -13 25 54 -19 -4 14 16 27 -48 -6
6954 -6 9 5 -16 -18 -20 6 -39 22 -26 -20 36 46 26 -15 54 3 -23 27 -27 -19 34 44 -6 24 -61 5 40 28 4 8 32 -63 -6 15
6988 15 7 -4 -10 20 -68 7 68 52 64 4 14 -11 -46 -30 29 87 0 -59 11 15 -61 -45 40 -28 36 4 35 38 47 -5 4 -9 -7 5
7022 5 -7 26 -5 -22 57 0 31 25 21 -1 -15 54 21 -12 -10 -107 55 20 31 40 4 14 30 43 27 -13 53 8 60 60 19 -9 56
7055 56 53 -10 -8 24 -5 -42 -18 -42 19 -24 -36 31 -25 -18 -1 -14 33 5 -53 -26 -31 2 -21 -30 -26 -6 3 -65 -17 11 8 -92 18
7088 18 -8 -16 -19 -20 5 39 -53 -39 41 -49 -34 14 2 -4 -63 54 3 31 -30 -42 24 -33 -17 7 25 51 8 -5 -11 3 6 41 31
7121 31 -3 28 64 38 39 19 -35 -40 7 41 -21 7 -15 6 30 19 15 -60 5 -18 -44 -27 48 9 59 -8 -30 35 0 109 -30
7152 -30 -27 64 -26 -5 -13 -16 45 -43 -10 16 -20 2 -30 54 -5 18 53 3 6 60 -10 -75 36 -17 2 29 42 14 -15 13 67 31
$$ packed form
6919B6J0oj8l3K7kl6M1J9j4J5qJo8kM4M2j3k9J6n%jJ5k2j2L8K9p3J5J8KJ1p5M2
6954fJ5mk1kkK6m5O1m8ON6J0k0m1O9n1k6N0n4QN3J0n0L0q5O6L5j2k4MK4r5N7K1
6988A5qj1oL0q8P5O1j6J2o0J0k5l5J6N9N8q7n9P0Mp6J6Q5o8O4l2L1LRn2Rj3KJ2
7022Ej2L3l1j7P9n7L1omk2j4O9l3l3Kr7J62l5J1Rl6J0J6J3j6m0O6m5N2%m1k8O5
7055E6lo3KL2k9l7K4k4O1m3j2O7n6PJ7j3M7k8n8K7nL3k3rMK0Ro8M8K8lj00J10
7088A8k6qljK5L4r2J4Q0r0J5M8j2on9J17n1K8o1j2O6n7J6K4J8K6m3j3oJ4LL5j0
7121C1l4L1L6k6Jk0n4nM7L4o2K8k2K1K4j1mp5O5k3k6J7P5l9N0o7k2O5l5J09j39
7152c0LR1r0K1qlO1q8L3K6l6K2l2Q4n9K3L5n0LN4p0o5J11n3J9K7J3k8k9K8N4l6
$$ plain form
7184 31 -22 7 0 49 0 21 49 -1 -68 -23 7 39 -22 -18 -26 -1 -43 21 52 -36 53 50 -3 23 10 -77 74 15 1 -27 10 -41
7216 -41 -30 37 37 -3 -18 -43 20 60 35 -11 -57 -21 -55 30 -19 0 -32 59 -24 30 3 -5 21 0 2 -26 -36 -29 -27 -9 23 6 36
7249 36 0 36 -28 -4 36 19 -17 -10 -8 72 -35 -8 61 -3 46 -58 -33 -61 12 26 -3 13 45 5 31 -63 52 -61 27
7278 27 12 -49 -89 -31 -74 24 -59 33 -14 -20 6 42 63 -18 36 13 -11 9 49 -59 -13 -36 -3 -50 -5 86 20 -29 -37 10 13
7309 13 8 20 24 -16 16 -10 12 -12 -9 -29 8 -33 34 -36 36 11 -13 53 31 28 73 -29 -20 -16 -45 5 0 -5 78 21 21 52 -25 3
7343 3 46 -37 -48 48 -6 11 -5 -9 -7 54 -49 -13 -41 21 22 -53 -49 -19 35 22 64 5 -24 41 22 28 26 -26 47 -23 21 -10 -26
7376 -26 -12 -22 55 25 43 40 30 -3 3 1 11 -36 9 59 21 -22 -39 -13 -68 -3 -33 15 4 41 -19 0 1 -79 -12 4 20 -36
7408 -36 54 1 -37 25 32 4 -15 15 -29 -3 -20 4 -63 -7 23 -14 10 -19 41 -30 41 53 14 -27 8 31 14 -33 -13 -25 47
$$ packed form
7184C1n3K9pM9m9K1K8n0o7M5L0L2o1MqK5m2O4L1q8Q9ln3K6j3q7J51n9j4k8L7n1
7216d1J1O7%m0j5k5O3M0k5m6m6L6l4Q5m9J9l2R1q3N4k7qK6k1Kk8j0PKJ8L2j7L0
7249C6l6L6o4K4M0j7l6PKQ0j07K7O9o4M9j04K5k8P3J4k9J6L2m0K6r4J15j13Q8
7278B7j5o1m0N8m3R8q3R2m7oK6L6K1q1N4k3k4K0M0j08M6k3L3m7M5R1o6m9qM7L
7309A3nJ2Mm0L2k6K2k4Lk0L7m1O7p0P2k5k4O6k2lM5j02RMk9N0nnQ3n7%L1p7K8
7343CM3q3j1R6n4J7j6mKO1j03L6k8O2Jp5ML0N4j3M2n9k9O5j9Okn2P3p0M4l1j6
7376b6J4j0P7l0J8lj0l3OkJ0m7M5N0l8m3j7K6n5O5l0M8j1L7o0J9Jq0O7J6J6n6
7408c6R0n3l8O2Pk8j9L0m4K6j7K4o7N6L0l7K4k9O0p1P1J2l9m1L5K3j7m7K0j2P2
$$ plain form
7439 47 8 21 -8 -35 25 -29 17 5 -11 -60 43 -80 6 -5 -11 32 -47 13 8 -56 12 -16 -1 24 31 -13 -23 30 -27 -49 29
7470 29 34 -10 17 -27 9 -2 -27 15 -8 34 66 -33 -24 14 -23 6 13 -10 -5 -18 46 11 -32 -15 39 -23 18 -7 50 -7 -71 -47
7502 -47 -26 -8 26 17 0 -3 26 -20 5 64 -39 -22 12 24 -78 -23 -8 19 -6 17 18 15 60 -33 35 31 32 -15 -28 34 59 9
7534 9 7 -11 -11 6 1 34 64 -11 -52 7 4 4 -44 6 26 -67 13 -24 -13 1 -33 -5 -25 -1 -3 -21 -32 -1 24 -17 -23 18 -22 -37
7568 -37 -17 -10 4 51 -40 -77 62 -52 -12 -46 -56 -13 43 22 -26 10 -46 41 47 23 1 -17 6 7 -40 9 31 11 -13 70 -7
7599 -7 9 -20 -49 -6 22 -30 13 2 12 36 39 22 -60 -14 34 -33 -7 -46 -5 -66 33 -45 1 1 -91 63 -30 -63 1 -71 -56
$$ packed form
7439D7l9J3k9k7O0n4M6j2j6m9J03j23Q6j1oM3p9O0no4O8k8J5K5Pm4j0N3n7k2P8
7470B9Nm4K7m4L6j1k5M2k3M2L2r9RL8l7K9Pk3Nj3O4l5m3J7N4o2M1k5N7n7o4K4
7502d7K1J8L4rj7lK9m6K5N9j03J7L4J2j02N5J5K7k5K3JlM5r3O8mJm7j3O2K5n0
7534Ikj8%J7nL3L0p5m1N9l%m8N0K0r3Q0l7J1J4l4K8k0K4kj8j1L1K5m1oM1m0j5
7568c7K0PJ4M7r1l7J39j14M0l4j0M3N6k1m8L6n6Q7Ok4k2j8K3Jm7M9K2k0k4Q3p7
7599gJ6k9k9M3K8n2M3j1J0K4Lj7q2M6M8o7K6l9M1o1R9p8M6%r2J54r3l3O4p2J5
$$ [...]
8191a1
##END NTUPLES=NMR FID
##END=
