##TITLE=1H_DE-71_2
 CDCl3
 8 sc, 
 30.10.2024
##JCAMPDX= 6.0         $$ Bruker NMR JCAMP-DX V2.0
##DATA TYPE= NMR FID
##DATA CLASS= NTUPLES
##ORIGIN= UXNMR, Bruker Analytische Messtechnik GmbH
##OWNER= root
$$ XWIN-NMR		Version 3.5
$$ Wed Oct 30 14:45:02 2024 Russian Standard Time (UT+4h)  she@DPX200
##.OBSERVE FREQUENCY= 200.1318
##.OBSERVE NUCLEUS= ^1H
##.DELAY= (6, 6)
##.ACQUISITION MODE= SIMULTANEOUS
##.ACQUISITION SCHEME= undefined
##.AVERAGES= 8
##.DIGITISER RES= 18
##SPECTROMETER/DATA SYSTEM= spect
##.PULSE SEQUENCE= zg30
##.SOLVENT NAME= DMSO
##.SHIFT REFERENCE= (INTERNAL, DMSO, 0, 15.7039)
##AUDIT TRAIL= $$ (NUMBER, WHEN, WHO, WHERE, WHAT)
$$ ##TITLE= Audit trail, XWIN-NMR		Version 3.5
$$ ##JCAMPDX= 5.01
$$ ##ORIGIN= Bruker BioSpin GmbH
$$ ##OWNER= she
$$ F:/spectra/data/she/nmr/H-F/1/audita.txt
$$ ##AUDIT TRAIL=  $$ (NUMBER, WHEN, WHO, WHERE, WHAT)
(   1,<2024-10-30 14:43:54.78 +0400>,<she>,<DPX200>,
      <created by zg, POWCHK disabled, PULCHK disabled
       configuration hash MD5:
       00 E9 B6 7A A2 85 ED C7 34 08 36 98 17 FE 4E 26
       data hash MD5: 16K
       18 7A B2 56 F4 9B 92 C3 55 5E B4 69 CA 02 AB 28>)
$$ ##END=
$$ 
$$ hash MD5
$$ DA 7E 06 C7 9F 0E 85 82 7E AF C2 07 90 3E A0 6A
##$RELAX= 
##$RELAX= 
##$RELAX= 
##$RELAX= 
##$RELAX= 
##$RELAX= 
$$ Bruker specific parameters
$$ --------------------------
##$DU= <F:/spectra>
##$EXPNO= 1
##$NAME= <H-F>
##$PROCNO= 1
##$TYPE= <nmr>
##$USER= <she>
##$AMP= (0..31)
100 100 100 100 100 100 100 100 100 100 100 100 100 100 100 100 100 100 
100 100 100 100 100 100 100 100 100 100 100 100 100 100 
##$AQSEQ= 0
##$AQ_mod= 1
##$AUNM= <au_zg>
##$AUTOPOS= <>
##$BF1= 200.13
##$BF2= 200.13
##$BF3= 200.13
##$BF4= 200.13
##$BF5= 200.13
##$BF6= 200.13
##$BF7= 200.13
##$BF8= 200.13
##$BYTORDA= 1
##$CFDGTYP= 0
##$CFRGTYP= 5
##$CHEMSTR= <none>
##$CNST= (0..31)
1 1 145 1 1 1 1 1 1 1 1 1 1 1 1 1 1 1 1 1 1 1 1 1 1 1 1 1 1 1 1 1 
##$CPDPRG= <>
##$CPDPRG1= <>
##$CPDPRG2= <>
##$CPDPRG3= <>
##$CPDPRG4= <mlev>
##$CPDPRG5= <mlev>
##$CPDPRG6= <mlev>
##$CPDPRG7= <mlev>
##$CPDPRG8= <mlev>
##$CPDPRGB= <>
##$CPDPRGT= <>
##$D= (0..31)
0 1.2 0 0 0 0 0 0 0 0.06 0 0.03 0 0 0 0 0.0002 0 0 0 0 0 0 0 0 0 0 0 0 
0 0 0 
##$DATE= 1730285034
##$DBL= (0..7)
120 120 120 120 120 120 120 120 
##$DBP= (0..7)
150 150 150 150 150 150 150 150 
##$DBP07= 0
##$DBPNAM0= <>
##$DBPNAM1= <>
##$DBPNAM2= <>
##$DBPNAM3= <>
##$DBPNAM4= <>
##$DBPNAM5= <>
##$DBPNAM6= <>
##$DBPNAM7= <>
##$DBPOAL= (0..7)
0.5 0.5 0.5 0.5 0.5 0.5 0.5 0.5 
##$DBPOFFS= (0..7)
0 0 0 0 0 0 0 0 
##$DE= 6
##$DECBNUC= <off>
##$DECIM= 24
##$DECNUC= <off>
##$DECSTAT= 4
##$DIGMOD= 1
##$DIGTYP= 9
##$DL= (0..7)
0 120 120 120 120 120 120 120 
##$DP= (0..7)
150 150 150 150 150 150 150 150 
##$DP07= 0
##$DPNAME0= <>
##$DPNAME1= <>
##$DPNAME2= <>
##$DPNAME3= <>
##$DPNAME4= <>
##$DPNAME5= <>
##$DPNAME6= <>
##$DPNAME7= <>
##$DPOAL= (0..7)
0.5 0.5 0.5 0.5 0.5 0.5 0.5 0.5 
##$DPOFFS= (0..7)
0 0 0 0 0 0 0 0 
##$DQDMODE= 0
##$DR= 18
##$DS= 0
##$DSLIST= <SSSSSSSSSSSSSSS>
$$ [...]
##$SUBNAM2= <"">
##$SUBNAM3= <"">
##$SUBNAM4= <"">
##$SUBNAM5= <"">
##$SUBNAM6= <"">
##$SUBNAM7= <"">
##$SUBNAM8= <"">
##$SUBNAM9= <"">
##$SW= 24.0689170037331
##$SWIBOX= (0..15)
0 0 2 0 0 0 0 0 0 0 0 0 0 0 0 0 
##$SW_h= 4816.95568400771
##$TD= 16384
##$TD0= 1
##$TE= 0
##$TE2= 300
##$TE3= 300
##$TEG= 300
##$TL= (0..7)
0 120 120 120 120 120 120 120 
##$TP= (0..7)
150 150 150 150 150 150 150 150 
##$TP07= 0
##$TPNAME0= <>
##$TPNAME1= <>
##$TPNAME2= <>
##$TPNAME3= <>
##$TPNAME4= <>
##$TPNAME5= <>
##$TPNAME6= <>
##$TPNAME7= <>
##$TPOAL= (0..7)
0.5 0.5 0.5 0.5 0.5 0.5 0.5 0.5 
##$TPOFFS= (0..7)
0 0 0 0 0 0 0 0 
##$TUNHIN= 0
##$TUNHOUT= 0
##$TUNXOUT= 0
##$USERA1= <user>
##$USERA2= <user>
##$USERA3= <user>
##$USERA4= <user>
##$USERA5= <user>
##$V9= 5
##$VALIST= <valist>
##$VCLIST= <CCCCCCCCCCCCCCC>
##$VD= 0
##$VDLIST= <DDDDDDDDDDDDDDD>
##$VPLIST= <PPPPPPPPPPPPPPP>
##$VTLIST= <TTTTTTTTTTTTTTT>
##$WBST= 1024
##$WBSW= 4
##$XGAIN= (0..3)
0 0 0 0 
##$XL= 0
##$YL= 0
##$YMAX_a= 153494
##$YMIN_a= -165174
##$ZGOPTNS= <>
##$ZL1= 120
##$ZL2= 120
##$ZL3= 120
##$ZL4= 120
##$ABSF1= 10
##$ABSF2= 0
##$ABSG= 5
##$ABSL= 3
##$ALPHA= 0
##$AQORDER= 0
##$ASSFAC= 0
##$ASSFACI= 0
##$ASSFACX= 0
##$ASSWID= 0
##$AUNMP= <proc_1d>
##$AZFE= 0.1
##$AZFW= 0.1
##$BCFW= 1
##$BC_mod= 2
##$BYTORDP= 1
##$COROFFS= 0
##$CY= 11.3945322036743
##$DATMOD= 1
##$DC= 2
##$DFILT= <>
##$DTYPP= 0
##$F1P= 15.6554695791079
##$F2P= 12.8336369535428
##$FCOR= 0.5
##$FTSIZE= 0
##$FT_mod= 4
##$GAMMA= 1
##$GB= 0.15
##$INTBC= 1
##$INTSCL= 1
##$ISEN= 128
##$LB= 0.24
##$LEV0= 0
##$LPBIN= 0
##$MAXI= 10000
##$MC2= 0
##$MEAN= 0
##$ME_mod= 0
##$MI= 1.114404
##$NCOEF= 0
##$NC_proc= 0
##$NLEV= 6
##$NOISF1= 3.799351
##$NOISF2= 2.8
##$NSP= 1
##$NTH_PI= 0
##$NZP= 0
##$OFFSET= 15.70392
##$PC= 1
##$PHC0= -26368.46
##$PHC1= 39.98743
##$PH_mod= 1
##$PKNL= yes
##$PPARMOD= 0
##$PSCAL= 0
##$PSIGN= 0
##$REVERSE= no
##$SF= 200.130013532006
##$SI= 16384
##$SIGF1= 3
##$SIGF2= 2
##$SINO= 400
##$SIOLD= 16384
##$SREGLST= <1H.CDCl3>
##$SSB= 0
##$STSI= 0
##$STSR= 0
##$SW_p= 3612.71676300578
##$SYMM= 0
##$S_DEV= 0
##$TDeff= 0
##$TDoff= 0
##$TI= <>
##$TILT= no
##$TM1= 0
##$TM2= 0
##$TOPLEV= 0
##$USERP1= <user>
##$USERP2= <user>
##$USERP3= <user>
##$USERP4= <user>
##$USERP5= <user>
##$WDW= 1
##$XDIM= 8192
##$YMAX_p= 0
##$YMIN_p= 0
$$ End of Bruker specific parameters
$$ ---------------------------------
##NTUPLES= NMR FID
##VAR_NAME=  TIME,          FID/REAL,        FID/IMAG
##SYMBOL=    X,             R,               I
##VAR_TYPE=  INDEPENDENT,   DEPENDENT,       DEPENDENT
##VAR_FORM=  AFFN,          ASDF,            ASDF
##VAR_DIM=   8192,          8192,            8192
##UNITS=     SECONDS,       ARBITRARY UNITS, ARBITRARY UNITS
##FACTOR=    0.0002076,     1,               1
##FIRST=     0,             0,               0
##LAST=      1.7004516,     0,               0
##MIN=       0,             -165174,         0
##MAX=       1.7004516,     153494,          0
$$ Real data points
##PAGE= N=1
##DATA TABLE= (X++(R..R)), XYDATA
0@%%%%%%%%%Qj6J6j6K4l2L4m2N6o6P4q8J04j22J41j64J87k12K44k80L18l59M06
32B15m57N14n74O40p13P92q82R80j086J204j332J474j634J809k004K224k474K762
50A458l095L482l941M500n197O090p279Q951j1488J5878l4565J78700j14525j67047
64a28078K08334p1524q0538J74122q6073j51199K08140n71j82954J07881N6749
75E4289j12694R5420J2032j43552J06133R0284j60326K0615J09210r9111j0905
86c8605Q4309q2098N968J11122r8028o7027J42474r662r8796O6761L017o6127
98d6692Q2956o358j15971R2562P5006j31190P794Q8073o2420K1189N5791j15649
110e4909J1089J31006r1233o5495J09766l3915n1058Q7474n0620n4349J29438
$$ y = [0, 0, 0, 0, 0, 0, 0, 0, 0, 0, 8, -8, 8, -8, 16, -16, 18, -24, 32, -34, 40, -48, 56, -66, 75, -89, 98, -114, 130, -150, 168, -191, 215, -242, 272, -302, 338, -375, 417, -465, 515, -571, 633, -699, 775, -859, 950, -1054, 1170, -1304, 1458, -1637, 1845, -2096, 2404, -2793, 3297, -3982, 4969, -6519, 9359, -25206, 153494, 38969, -128078, 80256, 8732, -71806, 102316, 16243, -134956, 73184, 72613, -110341, -2460, 54289, -58405, 37015, 49047, -94505, 11628, 101912, -58414, -37799, 71411, -27700, -38605, 45704, -36394, -30426, 80696, -17332, -84359, 58115, 48453, -50343, 16418, 19435, -46692, 36264, 29906, -86065, 6497, 81503, -49687, -41893, 46180, -16240, 4949, 60740, -54909, -43820, 87186, -4047, -69542, 40224, 6309, -44749, 42725, -7895, -62244, 67194]
121F7194k6013j20689R2132L8825r0512M9649J6132q3785O6821L8714j05121L8802
133a7851Q0115p8279r759N4986m5598J4461N1969p8169j6086Q8067l7399m8587
145d2130N9195q735l0052M9043k4556m4664P3659J1675q2420K3008M1651m0507
157a4833J2681K0871n0180K1973M9876n7212j2828O5965k4621l1384L4539k3763
169h916j2296N6578l2194m9398O0767P230n1619L7194J2259m0457L6416O237o0073
182c8272L9047M1026o2846j122M0160l1960P064L2363m2293L047M8340l7375k2271
195b5092M5204j1506k0056K2724k2653j2373M6750j3393l7608L4613R499k9993
207a3884K0378O003k6715K3921P868m3673J3989L4644k7590q188K2240j6877J036
$$ y = [67194, 41181, -79508, 12624, 51449, -39063, 10586, 26718, -57067, 9754, 48468, -56653, -17851, 62264, -16015, -25774, 29212, -16386, -1925, 50044, -28125, -44211, 43856, 6457, -42130, 17065, 8330, -21722, 27321, 2765, -41899, 31760, 43435, -38985, -15977, 25674, -14833, -2152, 18719, -31461, -9488, 40388, -16824, -29652, 36313, 11692, -19692, 14847, -8916, -21212, 35366, 3172, -46226, 14541, 21771, -29848, 7346, 19605, -20852, 15564, 21801, -38272, 775, 41801, -21045, -22167, 17993, -13967, -6903, 25460, -16833, -13786, 34554, -2821, -25092, 20112, 8606, -11450, 11274, -11379, -23752, 22998, 9605, -28003, 6610, 16109, -13884, 6494, 12497, -14218, 9703, 17571, -26102, -12113, 22531, -5059, -13247, 8993, -7884, -6848]
220f848K7513k2162j2523L3147j2285k7392K4317L396j8288J7581m927k4074K9326
233F781J2844l2768J1947J8838k5523M022J6723k3828N948K2212k9513p542L3523
246A3664r307j2920J8940j0459r248K3437r127j8230K1416j865k1257J2924M826
259B794j0769J5491o29k0878J5484J3085j9711M203J2048j8216Q79J3153j4982
272h048O91J9833j4339j1353J9432k07r432J1984l926j4362J2064K590j4944R607
286d10P750j5626K850J0668q751N298J0664j5799k580J4223q798n618J2037p202
300a294q964J2490k387p242J4851M27j4531P671N119r087N638L015j2320K476
314d138N912p575L718Q881p786r77O190n432J211Q462q000o423P434l861m330
$$ y = [-6848, 20665, -1497, -14020, 19127, 6842, -20550, 3767, 7163, -11125, 6456, 1529, -22545, 6781, 19625, -13143, -1196, 17642, -7881, -3859, 12864, -10964, -5016, 17196, -12317, -19859, 13664, 4357, -8563, 10377, -82, -9330, 14107, 4980, -13250, 8166, 6301, -14956, -2032, 2794, -7975, 7516, 6887, -13991, 1493, 14578, -5133, -930, 11118, -7098, -6219, 6934, -8048, -7357, 12476, -1863, -13216, 6216, 6009, -3423, 8561, 4635, -9727, 2337, 4927, -10017, -410, 7340, -8286, -5436, 5232, -3519, 1779, 12443, -3356, -5936, 8287, -511, -6129, 5908, -1294, -10258, 2232, -155, -7397, 7454, 7881, -6650, 1021, 6140, -2947, 2691, 5706, -6614, -4138, 1774, -5801, -2083, 6798, -988, -1965, 4225, -1207, 4, 8466, 466, -5957, 1477, -2384, -6714]
329f714J0385j469q306P444K044p578Q051N526j1155n94N112o848M5Q449o194
344a802m087P459k122k423Q951q42p385M353j130n573O768Q72q428K830K753n067
360d873M750O602o096p59M408n451k03O810m878m811M001k597k100P383O93m681
376a802L576n43l352M867K004n764L23m3n099M168M441m725R78L566m841R55Q110
393F819m107l935M513n209m082P698l15n789M494N18n940O503M846n436J042J713
409C333o609R11N472m247j235L101m328J11O326q81j646L672l831l303N757m26
425B177l898K571k421m703M958L343k974K578J163m804K224L624k939j50J119
440A868n527j82M293j916Q48L186l599j301N400j197j385M246m101n429M278N17
$$ y = [-6714, 3671, 2202, -6104, 1340, 3384, -4194, 3857, 9383, -1772, -2366, 2746, -4102, -4057, 4392, -1802, -5889, 1570, -552, -2975, 5976, 5134, -2251, 2102, 972, -4601, 2167, 3039, -5389, -2559, 194, -4873, -123, 6479, 383, -376, 4032, -1419, -1622, 5188, 310, -4501, -500, -3097, -5197, 2186, 2879, -1802, 1774, 1231, -2121, 2746, 4750, -1014, -691, -734, -5833, -1665, 2776, -1949, -971, 2595, -2246, -1291, 6819, 2712, -1223, 3290, -1919, -6001, 1697, 1382, -4407, 87, 605, -5335, 1168, 6014, 578, 1620, 3333, -3276, -2365, 3107, -1140, -2375, 726, -3602, -3491, 2835, 1954, 308, 3980, 149, -3154, 2603, 2177, -1721, 850, -1571, -6274, -1316, 2027, -947, 1631, 2794, -2010, 214, 3838, 899, 749, 1868, -3659, -3841, 452, -1464, -616, 2570, -1029, -2330, 3070, 1873, 488, 4734, 633, -4796, -518, -1]
456al295M226J29n294L300L979k995K402K358n640j227L185j920J12K385m031
472b327j620M419k83N77L476k679k159J683j612l49L593k948l967K327J59J53
488a557M439p04l358K981L64l285L137J074m433m04J61k722M552K771m495L00
504a179L128k046Q42L054l294j041K196m943j606P012o85l747K034l50n74N323
520D124j010m267L051l31n003K126K631k387J344j622l897N694M980n171Q3J990
536B335l663J381K239n081J824M525p389k433Q519K29k335L148m482j720Q090
551E187k642o718N374J037p061K629J766j774N783j20r338M887P958o239j544
566h15K931n127J380L983p158J358R529n434o544P042J639j361M127o706m651
$$ y = [-1, -3296, 930, 1059, -4235, -935, 3044, 49, 2451, 4809, -831, -2058, 1127, -793, -681, 1704, -2327, -3947, 472, 189, 766, 4242, 1563, -596, 1087, -525, -874, 2719, -229, -4196, -1869, -1710, -1557, 2882, 2178, -1180, 1801, 2165, -1120, 2017, 3091, -1342, -1746, -1585, -4307, 245, 3016, -1479, -1179, 1949, -97, 745, 3799, 505, -536, 1660, -3283, -4889, 2123, 1438, -2309, -275, -625, -1199, 4124, 3114, -1153, 1898, 1567, -3436, -1310, 1321, -1066, 278, -1344, -5241, 453, 5433, 262, 345, 2335, -1328, 53, 2292, -2789, -965, 3560, -3829, -6262, 2257, 2486, 151, 3299, -1183, -2903, 5187, 2545, -4173, 1201, 2238, -4823, -2194, -428, -2202, 3581, 3461, -5877, -990, 6968, 729, -815, 2116, -3011, -1631, 2352, -4806, -3448, 6081, 647, -5897, 1145, 2784, 1423, 5550, -1156, -5807]
581e807R152o35q928N571L338n908L035R8m133R717K954j4136K020R192n743j344
597a557L136o590K675Q068j0107j884J4709l309r825N239l93j687Q545o563j0991
612a0534J2140M123j2576M539O868n729L610J21r536R184R044j4790m223J0618
626B859l675q17M705q156J553J2803r624q414J4881J404r932K711l022l024J3100
641G352l926j4863J0350Q922j0951P60O032n094N844K316j6547M746J6382j0863
655D60r245R735k321o15R281j0528l944J7831m975j6691J1111O739q738K879k933
670a954q912J5395N427j9170M718J4212r672k237N677p786O160Q449j8858l385
684a1936K0271l802j0910P040k382o30J2289r782j0848J7963J999j8233M619P105
$$ y = [-5807, 3345, 2710, -6218, -647, 2691, -3217, -182, -84, -4217, 5500, 8454, -5682, -3662, 5530, -213, -1557, 1579, -5011, -2336, 5732, -4375, -6259, 8450, 5141, -4684, 555, 162, -1525, 7020, 457, -10534, 1606, 5729, -6847, -2308, 4560, -1169, 2441, 2562, -6974, 2210, 11254, -3536, -7759, 2859, -816, -1633, 3072, -5084, -3531, 9272, -352, -8766, 6115, 7519, -2413, 298, -2724, -5748, 7352, 3426, -11437, -1087, 7835, -3116, -2356, 3676, -1418, 4426, 6742, -9805, -5059, 11323, 460, -8785, 950, -1371, -1986, 7295, -3233, -7177, 10654, 5679, -11012, 99, 6838, -1900, 979, -1954, -10866, 4529, 9956, -9214, -4496, 9716, 44, -2193, 3484, -4302, 1858, 10307, -8551, -11936, 8335, 4533, -6377, 663, -1719, -2349, 9940, 158, -10690, 7273, 9272, -8961, -4342, 2763]
698B763n409O786k447j4451J3478J3101j7210k955J2704n359k363M496j0040L383
712c523J5503j3765j1951J7308L534r519N037l187m796J4223l596j7696J2387
725d1J0505j5563j238P550m303P794L648j8242M391J8461j1129r247J0399k788
739A97k195O757j1373k583K0071n230j7078J1058O132o280N293m192j0215J4786
753E148K910j9046N975J3684r932j172M286p912Q659R979j7650m179J7104n104
767B750q786O880k285j624R537q548q582J7623K755j5376L413M929m415N860j548
782B583j2493R316R313j4411j380J2694l363k109K646q416L375J3172j0522j0621
796a0216J2206J197p201M973k319k687J1517l997j3388J1459Q256j2112K68K894
$$ y = [2763, -2646, 4140, 1693, -12758, 720, 13821, -3389, -6344, 6360, 1001, -1362, 3134, -6906, -3523, 11980, -1785, -13736, 3572, 7106, -2413, 2624, -563, -5359, 8864, 5268, -12428, -41, 10464, -5099, -6337, 1213, -3090, 4704, 8352, -9890, -5499, 12962, 1833, -7414, 2985, 197, -1998, 4759, -6614, -9197, 10874, 5644, -11434, -376, 5756, -524, 4769, 577, -9638, 5148, 8058, -10988, -5013, 8671, -1261, -2433, 1853, -6059, 2600, 12579, -5071, -9250, 7854, 2750, -6036, 844, -1441, -3065, 6472, -2076, -10658, 6965, 9720, -5656, -2243, 2686, -1729, 4131, 2583, -9910, -594, 8719, -5692, -7072, 5622, 2259, 150, 2796, -5620, -2245, 10927, 405, -10216, 1990, 3187, -4014, 959, -1360, -4047, 7470, 3473, -9915, 1544, 9800, -2312, -2044, 850]
810H50n912P299L458j4094M618J3117j0806m202R777k877l88M894j0686k249J5020
825G819m824j1495Q697K017m998N651k615n174J0956L41j3924M770R124o440j322
840a417J571n909N849O622r940j340J0911m010o135N238j683o11O181p436o480
855h589J1284J931q964M081K299l718M428k3p673O798N260j1524p98P849l418
870g77M81L204p000J802R054o775m612R270j923n931L945k119k429Q439l664q307
886g342P347M173n694K363J745m826L841J004p543L858O186o948k196M820j740
901i52J579L595n803j131O929k763m866M660K65l531J777j448j642N831P24o005
917b781J977L693k795M23J392l722J256K433m666k11N941k169l013L381j657k41
$$ y = [850, -5062, 2237, 5695, -8399, -3781, 9336, -1470, -5672, 4105, 1228, 840, 5734, -4952, -7201, 7819, 2995, -8500, 197, 2214, -2784, 2867, 252, -4922, 6034, 6375, -7549, -2779, 6345, -95, -1417, 154, -5755, 94, 6716, -3224, -4564, 6347, 2337, -3798, 1440, -243, -854, 5327, -2109, -8589, 2695, 4626, -4338, -257, 2042, -1676, 2752, 2729, -4944, 1854, 7114, -4410, -5208, 2641, -777, -296, 2908, -4092, -2290, 6764, -11, -4623, 4647, 2724, -3207, 738, -1381, -3810, 4629, 965, -7342, 5, 4178, -1516, 847, 2592, -2234, 1607, 2611, -4932, -1074, 5112, -1836, -4032, 788, -952, 627, 4222, -1581, -2712, 4217, 1454, -3412, 1248, 1513, -2018, -241, -1689, -3331, 2500, 3224, -2781, -804, 2889, 94, 517, 1909, -1813, -557, 1876, -2790, -3001, 2940, 771, -2242, 1139, -518, -759]
933g59M900l170m108M714m88m631L326J565l149K290j02l290M035K722m112%J638
950A381k836J274J399l017R53K174l314j93M185o35j111J185k374k36L290j425
966G00k481J840m80j828K002R91j200J868j79k479J489J808j938k58J91j903M08
983a449J853j016L55J522j603o43K331%j094R18j502j834K031L34j440J172L35
1000B70j548J333J277p72Q41j44k229K8J108o87K09M29j732N17J410m70Q63J177
1018A880j688m56P80p37J73R76j610j243J480K39j54J112L26j618R94L78j000
1035a68J035L14k260q8M61m26J025Q53j076N8N40KL52J267j329j237K67p71J99
1054i82J319l82o80N62L20k69J299J69j094j73o93m22R94M55j115p7Q03r59R66
$$ y = [-759, 4141, 971, -3137, 1577, 1089, -3542, -216, 1349, -1800, 490, 388, -2902, 1133, 3855, -257, -257, 1381, -1455, -181, 1218, -1799, -846, 1328, -1986, -2179, 2006, 1371, 260, 1445, -929, -1165, 2125, 700, -1781, 59, -421, -2249, -247, 744, -456, 1412, 1233, -1246, 243, 2051, 113, -145, 46, -1857, -1449, 404, -612, -257, 1265, -338, -981, 1350, 1350, 256, 1174, -328, -2162, -131, 203, -1237, -65, 270, -1278, 55, 1332, 560, 1401, 1257, -972, -944, 164, -523, -314, 115, -1617, -1100, 310, -160, 703, 1880, 192, -264, 516, -221, -48, 928, -682, -1925, -445, -206, -360, 752, 1078, -540, 454, 832, -168, 867, 1181, -1079, -1167, -706, -1132, -107, 746, -330, -272, 268, 270, 622, 1889, 560, -677, -410, -1181, -982, 337, -45, -725, -163, 157, -112, 1187, 1356, 262, 89, -604, -1026, -32, 423, -692, -769, 34, -925, 41]
1073D1J436r08k59N20j253j46J426l91j233L55o10m97K123N53q35p9K3p88J053
1092E31Q29j361n66J45j123N76J675n44j77J034j161N7J560n81q76N38j110j090
1110a644J287N36q63Q07l1p27J057J270j080j93M82j833n4J151l39n86O86r57
1128a031K7J737L03o85J079r39j707J087Q05j410N91L4k094J317J838j067L62
1145B47J298j555n46J949j067p20J394j749j301J743P25p22J224k04j401J122
1161D37J096j825J029O9k332K90J566j217Q64J092k125K74K355q06r10J745j372
1178B30j829J756p04r70K534q86j950J640J495j511J169Q80k879R45J273k700
1194a507J012K052k703p95K433r00J44K736k366j827L423r21k233K508m99k404
$$ y = [41, 1477, 569, 310, 830, -423, -569, 857, 466, -767, -412, -1022, -1519, 604, 1157, 322, 243, 266, -522, 531, 1360, -1, -567, -422, -1545, -969, 706, 162, -15, 1019, -142, -85, 1475, 894, 18, 556, -554, -1644, -357, 179, -684, 123, 92, -635, 422, 1692, 612, 419, 901, -932, -986, 165, -174, -760, -74, -1031, -1004, 733, 1036, 351, 1430, 491, -1216, -129, 676, -734, -143, -109, -2203, -886, 952, -115, 247, 1545, -10, -556, 1393, 326, -394, 1000, -749, -2050, -307, 418, -304, 920, 716, -685, 437, 1533, -292, 737, 806, -1526, -1236, 330, -887, -23, 1069, -1056, -782, 1573, 767, -143, 1602, 230, -1599, 157, -547, -1517, 1017, 131, -1819, -179, 1316, -195, 974, 1854, -1025, -80, 1193, -1507, -495, 1557, -1146, -1941, 492, -408, -264, 2472, 106, -1721, 1702, 781, -1452, 1056, 557, -1847]
1210a847J685q2k036L348J579m205P02K832k133P13J643l411j38K869l198l58
1226b037M084j423k400K815j379p08M245k089l922L477N27l756K717J004l009
1241a854K560M80l821L046L777m596j428L477k518Q1K750l705p09N132l181k655
1257c164N221J07k879K463k114k492N323k25n713K464K667m099J473K674l060
1272a354K185K582n790O71N912l699l125L499k216o39M617l710k213O602j294
1287B028n736M557J324k957K818j744n021N683K370o733J441M695l382J54K988
1302B485m503K093M563o383k507O999j447l554L107k018j537O249k399n343O245
1317B050K053o519J923J855l200L546P13p564L611O586o215j457N431k862o14
$$ y = [-1847, -162, -244, -2280, 1068, 2647, -1558, -856, 1976, -157, 556, 2199, -1212, -1350, 1519, -1679, -2037, 2047, 624, -1776, 1039, -340, -1048, 3197, 1108, -2814, 663, 1190, -2566, 151, 1155, -1854, 706, 1186, -2635, 411, 4188, -408, -1836, 1641, -877, -796, 1954, -1751, -2460, 2672, -509, -3164, 2057, 2164, -715, 1748, -366, -2858, 2465, 2240, -3473, -1009, 1658, -2441, -968, 1706, -1354, 831, 3413, -2377, -1706, 4206, 507, -2618, 881, -1335, -1974, 2643, -1067, -3280, 3322, 2028, -3708, 849, 2173, -784, 2034, 290, -4731, 952, 3322, -3411, -1970, 2725, -657, -503, 2485, -2018, 75, 4638, -1745, -4252, 2747, 1300, -2254, 853, -1165, -2702, 3547, 1148, -4195, 2050, 4103, -2416, -493, 1362, -1838, 1708, 2421, -5143, -1532, 5054, -1161, -2618, 2813, -49, -663]
1332f63L765n117j94P147m572o223O360J234l538L744k160l474P168K1q222M944
1348B20M440o837O16K602m448M559L333q821P74Q564m293l208M998k714j042N110
1364C853n646l207Q994r43p874L956K304l002M305j110o242O127L351q565J282
1379b417N802m278j58K428m838K805O940p493l136P813j425m015L741k341k043
1394b615O090l212o371P702L155p359J772K304l347M586M76p887L649O346p564
1409b275j863O315k464l46L847o142k1R141m674o374O081Q18m083L502j486l851
1425c875O716l44q115N166N554n500m3J755m273L779L519q160M49P922m912l315
1441c677N214j200o33M412n613k856Q294q84p082L547K060l738L605p27m767N737
$$ y = [-663, 3102, -2015, -2209, 4938, 366, -5857, 503, 1737, -1801, 1943, -217, -3691, 3477, 3498, -4724, 220, 4660, -2177, -1561, 1041, -3407, 1152, 4485, -4336, -3562, 5002, 709, -2499, 2499, -215, -1257, 3853, -1793, -5000, 3994, 3051, -4823, -867, 1437, -1565, 2740, 1630, -4612, 1515, 4866, -3699, -2417, 3385, -893, -1051, 1377, -3461, -656, 6284, -1209, -4345, 3468, 2043, -1972, 1769, -572, -2615, 3475, 263, -6108, 1594, 4749, -2610, -838, 1466, -1881, 2705, 3181, -4706, -1057, 5289, -2275, -4138, 2177, -287, -633, 3214, -2928, -2949, 6192, 1518, -4856, 1225, 2043, -2040, 1462, -24, -3875, 2841, 2497, -5618, -452, 5102, -398, -441, 1314, -2959, 820, 4339, -3821, -3372, 4550, -362, -3677, 1537, 337, -296, 4116, -1497, -4353, 3941, 3057, -4025, -478, 1582, -2156, 1449, 722, -4045, 1692]
1457A692K930p780R17N986l574n68J936m707J520N757n768k765P715j597m218
1472b524L885j132j369N174l369o111O367K783o760J938K375l090K924J166n951
1487c694L908N327o952j590M665j732n18K864m944m19O769k873m367N293L24l371
1503a310K406j088k778N734n32o956L429L978m276R74K112l309K083K512n480
1518b501J019N692l900l259L404r59n70L848l314k659N861l44n079L589J404l552
1534a320J890n83l198L894K452n714L73M446k721K78K130l305O84L782l948k318
1550c178N031r53k793J814o64l71L651j442l921L774J461m409J914J136k450J875
1566D75K59l388K359L192l159o99K605j786k67K481k841r13L563k354j981K719
$$ y = [1692, 4622, -3158, -2241, 3745, 171, -397, 1539, -3168, -1648, 4109, -1659, -4424, 3291, 1694, -2524, 1361, 229, -1140, 4034, 665, -5446, 921, 3704, -3056, -1118, 1257, -1833, 1091, 2257, -3694, 214, 5541, -1411, -3001, 1664, -68, -586, 2278, -2666, -3085, 3684, 811, -3556, 1737, 2061, -1310, 1096, 8, -2770, 2964, 2432, -4524, -1095, 2883, -1393, -419, 1693, -1616, 467, 2979, -2501, -1482, 4210, 310, -2949, 455, -504, -1074, 2774, -540, -3199, 2662, 2318, -2761, 828, 2232, -1320, 570, -13, -3211, 683, 3135, -2579, -2206, 2240, -481, -203, 1927, -1378, -694, 3088, -860, -3178, 1853, 900, -1893, -79, -743, -1114, 2537, 1095, -2826, 948, 2409, -2000, -86, 1050, -1400, 475, 734, -2654, -295, 2897, -262, -961, 1644, -142, -409, 2072, -769, -1682, 1881, -473, -2454, 265]
1582B65J047k001J135k89j607K708N73l375J385J647k467K52J399j914J125J585
1598A468l087N85K908j603j167J642r73r36K212j337j103K259m48k400K241J072
1614A333j233N95L43k349J417J112k177K50J426j612L6J449p99L99J207j424r60
1631i87J908j26j341J007n24j292J393L9j180J672L39j428O22J073j170M66K49
1648G20j530L7J039p71k78J181p47l50J306q8n30J229o97j473J026j29n63Q42
1666B24k1q39K97O69m85N04Q65j251l80O17m47N6R5m07n25P66q0L22O35l51l24
1687f0L71j26n00Q35l64p23m61P34l11Q01K16l71k24M86J04j6M25k63o92r6k56
1708d91m7O59J19l72J16L06J3M98j6p16j11l50r1L76q1K9m14N16j2j35Q41L9p41
$$ y = [265, 1312, -689, 446, 157, -1450, 1258, 1831, -1544, -159, 1488, -979, -727, 672, -1242, -117, 1468, -1619, -1034, 1874, 271, -896, 746, -227, -1163, 1049, -288, -1391, 868, 420, -1980, 261, 1333, 100, 695, 1038, -1311, 106, 1218, -959, -709, 717, -895, -859, 590, -209, 190, 1397, -27, -987, 921, 795, -546, 461, -63, -1355, 38, 77, -1103, 569, 908, -520, 102, 1175, 5, 471, 720, -810, -773, 266, -505, -783, 398, -349, -699, 607, 519, -11, 1218, 521, -952, 74, -55, -618, 224, 203, -636, -339, 330, -155, 349, 1214, -37, -417, 200, -247, -191, -96, -503, -1028, -262, -342, -20, 615, 264, -60, 311, 185, -315, 520, 156, -567, -1028, -294, -605, 196, 412, 41, -183, 303, 407, 391, 816, 553, -139, -235, -491, -538, 121, 240, -132, -16, 290, 303, 801, 785, 69, -42, -392, -483, -107, -188, -159, -573, -57, -69, -204, 637, 676, -65]
1731f5L49k17l63M35j49m99r3J4J48P50K66J6p56M56j68j39O37m04q62K57j59
1752e46J38L95L94k98o2J33J66K16l20n9k05k03j32N6O91l79l62L23Q3L37J99
1773E65J7n60P9n59P9R8M67l08N1j01K24J50J61J9J15k20m67l2J18k0k73P9l08
1796f26J10R29J92k04k67j69P9K23l62P7K08l22p01P59R6J88K22j40o37O81r5
1817B41k15L66l36m97K32P7n4N84j20o72N28J70N7L05K56j069J38k46k46L89M33
1838C21p02K5Q02n43L64K90n46k28N88n53l61N50K41o40K21Qj85R66K67j283P09
1859C11K45q02J59M45p87K19J11n49L87J074o47m89Q50p99M42M15k73p55P07q50
1879e86n64J658J77q36M24n38n35J293M72j162k23N99q33J91R75r77L40O82r31
$$ y = [-65, 284, 67, -296, 139, -10, -509, -602, -588, -440, 310, 576, 592, -164, 292, 124, -15, 622, 218, -644, -387, -546, -408, -13, 381, 83, 21, 154, 320, 536, 216, 157, -48, -251, -383, -327, 364, -15, -377, -54, 29, 366, 565, 582, 22, 101, -458, -379, -281, 186, -122, -71, -172, 52, 202, 363, 382, 497, 277, -190, -222, -104, -124, -397, -318, -626, -516, 413, 605, 401, 134, -35, 44, 267, -95, -18, 190, -132, -833, -74, 22, 210, 432, 292, -345, 336, 241, 26, 392, 56, -441, -209, -132, -186, 398, 278, -394, 134, 304, 361, 666, 922, -147, -9, -255, -501, -112, 321, -381, -356, 446, -97, 267, 557, 11, -217, 371, -182, -543, 7, 248, -392, -171, -163, -348, 618, 885, -398, 311, 556, -246, -87, 358, -429, -210, -99, -648, -261, 813, 166, -323, 527, -272, 170, 585, 312, -443, 264, -586, -1150, 508, 685, -151, 273, -265, -800, 493, 965, -197, -420, 179, -654, -463, 512, -465, -125, 557, -374]
1898c74j45J806o81r25P23o77p58J540m81j194J216M33j594J172R44j077P57J51
1916H36j656R79Q45j728J74J052j191L21Q69j117L39J620j382o07J049K56j384
1933g25J162q85j025K226o83j529J911J115j937r8J191j182J174O69l248P79K255
1950A170j830l71J615p55j67J752j761p68K806q05k673J732M02j276J714j212
1966d27j168J947J367l147J324K080k419k7J285k198J523J523k888l17K847j156
1982A49p31J589j013o09K430k152j316K720K01k740Q74Q01j117J939j38k873K186
1999B00K011k982j43K385j522j37R80k736P96L477k448k075L101k60p40J159r95
2016G1j051K500j219k874L049J230l026R68Q47k047K190J364l663J004L041k776
$$ y = [-374, -519, 1287, 606, -319, 404, -273, -1031, 509, 28, -1166, 50, 483, -1111, 61, 1005, -72, 685, 836, -820, 159, 1004, -724, -550, 502, -689, -368, 501, -616, -277, 1343, -39, -646, 403, 659, -725, 437, -448, -1473, 753, 70, -1459, 452, 1567, -370, -468, 723, -459, 715, 1384, -1864, -1085, 1170, -660, -1031, 584, -171, -338, 1414, -347, -1115, 1691, 886, -1787, -55, 347, -929, 785, -427, -1595, 352, 1719, -1428, -104, 1976, -443, -470, 815, -1383, 140, 1663, -1225, -1542, 1305, 149, -582, 1007, -6, -615, 1815, -337, -1653, 1067, 1268, -1472, -598, 203, -914, 1025, 887, -1986, 200, 2211, -771, -914, 1471, -51, -188, 792, -1944, -1148, 2329, -119, -2194, 907, 647, -93, 1066, 71, -980, 1520, 301, -2573, 476, 1706, -1320, -352, 495, -1552, 638, 2002, -1661, -657, 2384, -392]
2032c92j054K317j324L8K012l244k59M158j017k935J981M76j638J993j285k115
2048b288L207M59l675J211L013k389O14Q89k643K089J928l622l23L049j552j461
2064a494J879p34m46K685k354k073L984J021l734J402N15j512J554l17l054K785
2080A07K115l571n9K764j302L1R60k339L86L129k657k022L590m60j759J612m82
2097D3j161L402j323l653K849J625k643P31M36j518J905O28l418J449L113k502
2113c7j278K065q22q0J685k818r83L807r58k762K793K97j544J388n95j582K662
2130A238N80m009J255K000j488Q9P29j585J133K559l827o2L354j195j964J563
2146C70q62k50K476k105k024L407M31k732J496J077j789J176J06k972K401J885
$$ y = [-392, -1446, 871, -453, -415, 1597, -1647, -1906, 2252, 1235, -1700, 281, 757, -881, 1112, -173, -2288, 919, 1378, -2297, -1086, 1927, -462, 152, 1041, -1602, 487, 2415, -1207, -1530, 1519, -33, -1494, 385, -349, -795, 1890, -464, -2537, 1447, 2468, -1266, 136, 651, -861, 693, 376, -2678, 107, 2222, -1349, -1408, 1356, 54, 85, 1045, -1294, -908, 2221, -436, -2458, 1132, 672, -1087, 525, 43, -1118, 2284, 961, -2692, 157, 1782, -861, -130, 306, -1212, 693, 1321, -2097, -648, 2465, -37, -1315, 750, -72, -152, 1533, -1285, -2268, 1539, 581, -2181, 612, 909, -635, 753, 158, -1424, 1238, 1818, -2191, -936, 1064, -424, -335, 394, -1191, -58, 2501, -1326, -1388, 1966, 771, -1193, 370, -492, -742, 1734, -371, -2395, 1012, 1443, -1289, 207, 1284, -505, 671, 777, -2195, 206, 2091]
2162B091l369k06K505j539L14J043k081P60K576k254j553L047m75j651J170q38
2178d60q25K690p81k681K499Q31j865O87K27j098J412M86l200J253K556j891r50
2195a110J817r04K16J582k100j97K136j180j743J560L32p44P12n74j019J991P20
2212A495k375P33J203j287k5R25j470P60J009k076m14K730o64j109J156q72k41
2229e22J859j342j247J813L58k058P05P82p75J084k1j575J028J179j540K1Q54
2246F03j027M7L77m51m8J711j376j010J688j9l29M95o82q80J585m75j513J461
2264A57M19r96J89N35n74Q29O07k087L11J448j120l42J230q88k21J001p63o00
2282h65J403j35j165J032J00o90M89k38n75N74K44j115J061M02r68N37M96j053
$$ y = [2091, -1278, -1484, 1021, -518, -204, 839, -1242, -482, 2094, -160, -1713, 1334, 859, -792, 378, -460, -1285, 1405, 624, -2057, 442, 1273, -592, 95, 322, -776, 636, 1122, -2078, -825, 1731, -160, -1110, 707, -197, 19, 1601, -499, -696, 1440, 260, -1483, 77, 409, -335, 377, -197, -1216, 775, 1495, -880, -147, 1056, -231, -256, 669, -801, -41, 968, -1108, -1522, 1208, 544, -565, 591, -281, -522, 1337, -5, -1252, 561, 919, -1139, -434, 348, -427, 657, 636, -939, 89, 1268, -272, -251, 603, -424, -377, 0, -451, -499, 1212, -164, -1174, 514, 495, 166, 661, -21, -901, 684, 209, -1304, 157, 576, -420, -231, 304, -270, 559, 1166, -921, -610, 838, -282, -624, 606, -282, -503, 498, -265, -865, 538, 403, -762, 270, 370, -320, 169, -69, -644, -70, 174, -941, 120, 522, -446, 91, 587, -466]
2300d66N27Q21j306k72R24o03J36M23o1n15J105o59l11Q58K9j178M15M29p46K99
2320a51M06p15N36K90l59l40Q13l51R1J85q89K62N25k73m49N92n45K16M72J30
2340D46n57N08j45l35K92j14K43l18k20p4M6M87K0m31O24n79k55N36m01J68J86
2361A27n97k66R12j93J4L12l44K80l6O00j274M93p6j15j76L17j80J38J64l49J16
2382a33M06l01J09J16k24j24j65K37j59L26N0j74J8L58J71l98r8j99L15J33n91
2403c27J83q0k86J30L43L02l64M44k66j99J64j43M44j75o47M08K13l24L73k02
2423iQ9l7P0P7j43K81j88o6o74K73K06J88k32K54K8Q8Q6kj98P4k80j96M63m75
2447c23L59n43K89n8K72j3Q0Rm8K78l64O1L00m77l88K30k77L08N12L05k62J15
$$ y = [-466, 61, 882, -424, -696, 228, -375, -239, 184, 123, -392, 713, 54, -257, 601, 630, -548, -133, 296, -450, -151, 255, -460, 76, 366, 7, -333, 480, 129, 220, 405, -484, -222, 303, 30, -419, 173, -372, -156, 316, 446, -111, 397, 252, -83, 209, 95, 338, 20, -200, -274, -228, 259, 279, -152, 472, -107, -362, 174, -227, -59, 127, -470, -736, 176, -17, -3, 309, -35, 245, 209, 809, -465, 28, -48, -163, -339, -22, -202, -64, 100, -249, -133, 273, -28, 81, 197, -27, -151, -316, -79, -238, 88, 138, -36, -18, 340, 511, 113, 15, -184, 131, 264, -327, -144, -224, -510, -380, -37, 265, -99, 345, 79, -120, 44, -99, 345, 170, -477, -69, 144, -180, 193, -9, 80, 43, 113, 190, 47, 328, 140, 74, -600, -327, -121, 67, -165, 89, 117, 205, 291, 289, 91, 165, -115, -311, 152, -323, 36, -507, -218, -276, -4, -17, 63, 72, 24, 302, -62, -1, 299, -178, -566, -336, -613, -305, 207, 512, 250, 365]
2469C65p0k05k22M49j50j12m24J16OK11K04J7L6k13j60O55j70o55L93J62l67j81
2491c15K50j39qM39r2Q2o2L01k15j61l67K05P8j93M11j45o4j57L22K84k57r1P9
2514A85l76j06J67J28P9L90r26J11O13j51P7J96n05p7N36l57n1KJ34m47K80K44
2536A46j86L72Nn84L50K42l31r0L15p42J08N30m29M97O7n91O8N12j4j89K20k15
2558F1k41O09l07m26N42p3o93O71P4n38P81M71j372PR85m50m32N59p98L54K80
2579F4n3k61J024m30n50N84l23j11M61n48p28R21M77j067M97N32n62L06J93o36
2599b10L44J144j579o90J328n20k54P98j82m92R08k96q47J200l3j036L20Q2n23
2618e38O32O7q58P70R56j139K6P61n75j77P54j487J46J399r15n83Q29j76m66J210
$$ y = [365, 295, 90, -132, 317, 167, 55, -369, -253, -247, -36, 168, 185, 221, 8, -152, 503, 333, -322, 71, 233, -134, -315, -65, -204, -212, 227, 135, 217, 155, 456, 241, 80, -287, -82, -4, -197, 214, 69, 5, -152, 170, 454, 197, 106, 185, -191, -297, -130, -2, 77, 467, -459, -348, 265, 114, 191, 387, -118, -195, 341, -16, -67, -65, 69, -378, -98, 146, -40, 332, 337, -247, 103, 345, 14, -76, 239, -503, -395, 135, -294, 203, 270, -321, -253, 259, 245, 56, 276, 61, -180, 429, 122, -304, 238, 165, -528, 143, 217, -321, 460, 931, -441, -434, 551, 101, -331, 228, -570, -216, 64, 11, -250, 774, 344, -206, 378, 55, -56, 405, -143, -871, 50, 527, -540, -43, 489, -73, 233, 426, -210, 134, 1278, -301, -991, 337, -183, -437, 361, 179, -313, 595, 299, -548, 652, 619, -417, -97, -15, -538, 94, 161, -697, 73, 1029, -110, -84, 677, 102, -75, 679, -808, -662, 737, -178, -761, 68, -108, -574, 636]
2638F36l11o94J002k70j305Q23Q60j183L98J38o03Q70O26j560K71J268q86o84
2656f04J094m09l66J043j174o43J562N8j618J176n3n02J186k48j371J181M70j575
2674g93M08R80o90J83K8j136O63J860j708o01J470n28j137J184p56j02J645r62
2692Hj797K064P45j365L90M89j068Q40J67j844R92J670j994k04J443p43J77O99
2710F69j480Q4K317j462j192J444R2j299J071n78l92J168L49k118J146J259j314
2727b36J49P80j222O13R18k264N58J880j079q19J091l36N8J346j466q74J970q94
2745A73j127Q75L10p70R67m35j250K057J32j772O4J579j309J26P68j129K26J688
2763A173j571q07K149l07j348J010k72k77J453j122j512J826K44j425Q45K64p82
$$ y = [636, 325, -369, 633, 363, -942, -119, 741, -442, -44, 94, -509, 361, 987, -573, -302, 966, 80, -604, 490, 81, -285, 758, -416, -1059, 503, 561, -1057, 119, 66, -436, 750, 502, -869, 312, 782, -793, -385, 595, -95, 88, 116, -1020, -357, 1503, -205, -806, 664, 136, -1001, 183, -573, -675, 970, 8, -1789, 275, 1020, -345, 45, 534, -534, 306, 473, -1371, -379, 1291, -703, -907, 536, -207, -30, 669, -811, -727, 1590, 128, -1064, 380, 472, -827, 244, -334, -726, 442, 791, -1327, -181, 1078, -236, -87, 693, -529, 84, 1002, -1262, -704, 1176, 97, -722, 369, 33, 91, 1437, -29, -903, 1067, 173, -954, -79, 231, -539, 428, -7, -1257, 800, 932, -840, -776, 803, -506, -380, 388, -741, -515, 1173, -398, -1205, 944, 637, -711, 299, 27, -250, 1203, 81, -1431, 395, 639, -786, 59, 323, -459]
2780d59J016j93j339Q08J321j664m20J488p61o0O80j149M41J522j276r30J517
2797E42N9j150Q77m71p63J486j64j790J157R70j096M92j5o09J182K07j804J92
2815f98J777j103o03Q13p21R4J134o64p59J734l21j540J099j00p02Q79m68j066
2833a215J598N00j654L18J149p61O8O44j203M45J125j454m27R51P2m32N05j97
2851C2n26J674q63j011J156K2r95J34O22n21J037k98j489J046P72o61l51O21n22
2870a21n3Q54j446K00J555q87j177J251K14n94R42p22n50J192l6j293O10N27o79
2889b13Q1J84o87J004N15j548M69Q64m11o66P62l91k97K65k00l30J145P9j287
2908f62J067k96m65R39k70p68P17K28j204L63Q37n43N4K24m59L77O65p94n49O32
$$ y = [-459, 557, 364, -975, -167, 1154, -510, -930, 558, -203, -263, 417, -732, -291, 1231, -45, -975, 542, 601, -549, 328, -143, -906, 580, 416, -1374, -217, 753, -343, 149, 134, -475, 707, 914, -890, -698, 1079, -24, -627, 186, -535, -441, 693, 29, -730, 1004, 683, -857, 242, 142, -560, 319, -149, -1215, 383, 883, -771, -453, 696, -65, 3, 647, -556, -111, 1014, -440, -867, 84, 156, -276, 229, 32, -494, 1180, 317, -694, 462, 484, -511, -377, 245, -276, 761, 463, -1026, 20, 792, 131, -220, 401, -121, -174, 680, -766, -566, 989, 102, -1075, 176, 390, -204, 738, 16, -534, 658, 622, -671, -61, 466, -213, -132, 52, -635, 369, 884, -664, -195, 669, 258, -408, 354, -37, -334, -69, -269, -599, 546, 625, -662, 405, 109, -356, 583, 313, -455, 262, 490, -714, -351, 486, -57, -3, 221, -238, 139, 804, 10, -539, 93]
2928I3k16k24M68j82Q8J90k06p59Q23K36p35K31M70l05J54J03j023O58O51r41
2948d26J70Q13n96j22N88o71r3Q23k91o92N10o0o17J013l18j25M54k03m67L56
2968D6L74o13M02K0k66j56M83m51J09N52m72k41L40j27p5J49l89k08O58k2n41
2989d28L45q6Q2J02J81n43P61j83n79P2M59k56J60k29l8j7M70m84K64K40o0m40
3011b07L35j3l1J28j50m38L09L62m90L70j25j97J48Kl26J13M60k10n08L21J03
3032d4k61N53l12j26L37Qj08q4J75J17o9Q3l15j46K33l69K93L35L0l52Q0O4p1
3055E1J3l05J49O1k15JL41J4j41k4n5K6j52K53K37j41J18n39M1K4J51j34K15J47
3079A36K63k36j56K98k72j01jK20l78K68rJ11l23M55j51R3M6N2l27Q7J24k58n4
$$ y = [93, -123, -347, 121, -61, 27, 217, 11, -748, 75, 311, -424, -193, 277, -28, 126, 229, -794, -136, 515, -426, -256, 557, -39, -161, 427, -244, -337, 486, 195, -497, 13, -47, -664, 349, 31, -94, 360, 157, -310, 46, 420, -193, 209, 229, -37, -193, 290, -161, -52, 500, 28, -213, 127, 0, -75, 74, -315, -523, 135, 113, -428, -83, -169, -87, 15, 196, -347, 414, 231, -348, -276, 183, -73, 87, -142, -180, -197, 273, -211, 53, 293, 233, -207, 128, 115, 84, 212, 62, -376, -67, 295, -195, 175, 50, -147, 1, 3, -323, -210, 250, 40, -468, -147, -44, -305, 248, -64, -190, 147, 155, 47, -37, 138, 255, 186, 269, -46, -192, 41, -328, -35, 300, 330, -22, 58, 122, 51, 64, -241, -92, -31, -246, -245, 96, 110, -31, -55, -110, -84, -236, 17, 254, 113, 231, -308, -267, -243, -92, -226, -11, 136, 399, 163, 7, 305, 33, -68, -69, 151, -227, 41, 32, 143, -180, 275, 124, 217, 263, 315, -12, 75, 199, -59, -113]
3102a13o9L26k80L31k34J99K6jj1p0Q5j32j59J14j13J75k60J73J31N3l4K9l31
3125a65J58M2P5k65j45L00j08J19j38M1j06J48K90Jm41N81o87M52j99o6R6J26
3147A09p2L79m94J96l78L66L6k48J52j40j6P6K8n1K53m92M80j72kJ25k0j94k03
3170b82J40Q0q2J97l5n9K17j0n9k2J93l10j23l7k6O7P0j17n5L97k82NN15n71j42
3195c31M62k75M67j5l90J30j59QJ46J3n0K45n43K99k75M41r8j73K89L5p19R9N10
3218A16m40M21q8r8R0K40m22O9n2K06M6k46RJ8M00j02m41Q57k83m84M99m48M1
3241i2L38J5j78l74K86j20M6P04n93j80L23J92o20P33l04k90J27o2j14K56P1l64
3263b00L56J14m53K83K04j13r0n0o77M75K27n81P52r7k16K5N74n61J35J15l10
$$ y = [-113, -182, 144, -136, 195, -39, 160, 186, 185, 174, 104, 189, 57, -102, 12, -101, 74, -186, -13, 118, 171, 137, 166, -165, -7, 35, 110, -155, -300, 0, -108, 11, -127, -86, -192, -44, 246, 247, -194, 387, -300, 152, -47, -113, -17, 109, 37, 416, -78, 118, -260, 106, 142, -106, 46, -94, -110, -34, -6, -57, 196, -296, 184, 12, 10, 135, 115, -79, -282, -142, -62, -144, 53, 18, -41, 176, 166, 107, 85, 278, -32, -155, -192, -218, -151, -81, -198, -253, 144, -138, -133, 382, -189, -331, 131, -144, 323, 308, -82, 48, -111, -103, 43, 56, 6, 251, -292, 7, -268, 173, 75, -98, 191, 226, -493, -394, 116, -324, 97, 9, -89, 1, 241, -181, -112, -164, 42, 88, -158, -149, -131, 269, 167, -274, 583, 300, -184, 315, -133, -92, 246, 261, 83, -291, -5, -125, -79, 625, 32, -148, 175, 367, -253, 480, 176, -114, 13, -49, -163, 93, 164, -200, 156, 270, -183, 100, 304, 191, 101, 51, -626, -151, 76, -505, 247, 150, -66, -41, 533, -28, 107, 222, -88]
3284h8j84L95J6l49K05J81l72L66J02n54L13L90q08J55N66o49J26M59n67O3P26
3305D92k98o81Q38L8l66O6l6j98L51m4p67O08J38m16K74J68l26K31J04q07P34
3326A03L21m76l77L72lJ23J85j88j43P72o26l74O60j40m49L71K7o14O64J07j007
3347f92N81L48K1l19J40p97M41R05j224K79N32k49k8J77j62jM96l76m07Q95l28
3368B32o15M00k47j94M28l09k23R46J03r37K50N25m19J02k7l75J64P55q60O1L67
3389A27q7j87N16m27j19R34m98q44O15K55n83q2M47l72N21j83o95O29O86q53k23
3410d23M49J13k96N05q31j24J062p89k45P79k8j42M66l32o05P86Q8j061M39L79
3430A90q69O63K45o35M53M36j113K0J473o97n63O54n62J26O39n82j12P81k34q60
$$ y = [-88, -272, 123, 139, -210, -5, 176, -196, 170, 272, -282, 31, 421, -387, -232, 334, -315, -189, 270, -297, -234, 492, 194, -487, 351, 389, 23, 89, 53, -145, 206, 162, -605, 3, 141, -275, -1, 167, -159, 72, 176, -631, 103, 424, -52, -429, -57, -60, 63, 248, 60, -83, 689, 63, -311, 349, 209, -240, 131, 158, -456, 208, 315, -692, -111, 237, 258, -61, 79, -718, -277, 628, -596, -317, 215, -34, -62, 115, -47, -48, 448, 72, -335, 560, 232, -383, 17, -230, -424, 4, -305, -528, 418, 521, -416, -166, 359, -60, 42, 15, -360, -196, 559, -301, -240, 127, 40, -147, 369, -58, -177, 757, 259, -585, 30, 285, -298, -380, 67, -305, 216, 33, -662, -33, 653, -200, -423, 26, 139, -157, 348, -483, -607, 455, -334, -579, 200, 172, 30, 496, 164, -441, 345, 433, -628, -189, 190, -679, -16, 229, -406, 47, 483, -630, -610, 863, 166, -397, 257, -305, -179, 460, -122, -234, 547, 313, -547]
3450e47J003Kn55O21o54q28J171K89r73L16M98l04N6O8n83K52P86p55m46J075
3470D92k77p61O18l90MP42k48r84J016K95o60P8R9j36M04q6o98M57Q34q19L1M49
3492D60n23K11M83j243J94Q31k85q01P31j96k00M45j62j46N44k18l92Q1O30n81
3512a37O7j5k58N53J63r66N24P16n18K6K57l56j34O95o67m13R90n48l81M96l28
3533b34J61N23k32p05M94L69q92K26M55l16n6K41k89O5M86m34l13J006m78k53
3553a76N54k34p78Q76m11l74R07Nl63k14J76l08M79L72q60M11M73q27k10O53k5
3574A26J60O8m21j46P07n85m76P35j18l57N97m05k9M13j82n00K08L07r5K95k04
3595I8m30J69M86n30J7K97m0k30K00J44k05M20p86K27M49J62q02L25J27j04K47
$$ y = [-547, 456, 458, -97, 524, -130, -958, 213, 502, -471, -155, 343, 39, 95, 163, -420, -168, 618, -137, -583, 492, 215, -546, 72, -318, -314, 428, 180, -804, 212, 507, -153, -75, 24, -112, 292, 206, -492, -35, 799, -20, 11, 460, -63, 148, 631, -612, -418, 413, 128, -673, 58, -138, -338, 107, -55, -201, 343, 125, -267, -186, 444, -137, -70, -85, -343, 210, 373, -593, -69, 647, 129, 155, 412, 56, -78, 617, -50, -463, 527, -21, -402, 94, -234, -73, 450, 218, -487, 7, 376, -516, -290, 165, -151, -207, 34, -255, -190, 296, -138, -451, 555, 77, -176, 378, 144, -634, 242, -169, -543, 364, 369, 6, -208, -32, -340, 139, 511, -349, 62, 535, -292, -502, 151, 126, 286, 354, -67, -213, 494, -91, -567, 168, 50, -307, 290, -115, -144, 269, 87, -413, -205, 102, 7, 302, 98, -332, -163, 323, -207, -190, 107, 67, -163, 37, 181, -24, 396, -390, -163, 286, 448, -354, -29, 98, -6, 241]
3616B41k51k47O30o4m29k25N58j10o8K3j5M4N8n05L29J84o23L50K06k64p2N04
3638B54k1n54L49q0j72J35j42P2N23k79l57J81K8l07J90L90l50L21n0p1l22K46
3660a6Q7J15L35l10m25J35J02l01K55K99n78J39L90J39k43j62R5J0J59j4o08N34
3682A37k32j5K38K24k13J99M3l99J4J61k72q9K05k60J26Pj47RL04p7K69k57L18
3705B93L3n6n15L50K23m31J76k65L22m16J65QP0j61L62Rj17L4%l0j93n3K55n6
3729Gj83L61P6Pl51J67m9K17m22K52k73K20M4J01m18J33n7J49K68l90J91K40p6
3752B14k65J64j12on4k5J86k13R3pL03k41j43J90m52M48j64J50k18P5p4Q5L68
3775C02K08m42l0N8l2j90l0L73n2k86J79k42K69Lk27Q3j4J2J63j98N9j15K22p1
$$ y = [241, -10, -257, 373, 309, -120, -345, 213, 103, 35, 58, 43, 87, 145, -360, -31, 153, -470, -120, 86, -178, -250, 254, 233, -321, 28, -52, -224, -89, -231, -159, 364, 85, -272, -91, -63, -370, -180, 210, -140, 181, 131, 60, -262, -16, 71, 186, 521, 211, -214, -79, 23, -278, -23, 276, -302, -163, 227, 366, 123, -39, 56, 66, 225, 211, -397, 137, -95, -110, 128, 352, 139, 338, 381, -18, -4, 157, -115, -204, 1, -259, -133, -126, -273, -264, 40, -37, 232, -25, 293, 326, 270, -245, 105, 328, -103, 73, -192, 130, -286, -121, -113, -43, -204, 158, 167, 50, 84, 84, 54, -139, -192, 63, 7, -176, 185, 261, 268, -83, 84, 35, 252, -170, 82, -191, 29, 73, 174, -244, -111, -168, -19, 249, -141, 50, 290, 214, -51, 113, 1, -5, -59, -84, 102, -111, -18, -25, 278, 37, -106, 84, -368, 80, -84, 66, -152, -77, -151, -66, 302, 510, 68, 38, 96, 64, -126, -156, 217, 165, -121, 58, -184, 85, 88, -139, -56, -70, -58, 105, -93, -34, -149, 73, 2]
3799BJ09k71j78K73L40m45J38j42L6K05P7j70J69J17k87k9J27k41J82L18o22M87
3821A95j90K17l25K59m31K79o3J00j61K21P5o13N93m07N13l96L1J78p6R9l89k59
3843e50O76Ll5K13K09p58K36J62r8n6J48l32K47j33M1L2j46L08j78l3j33L64k20
3866c3K38j7l61MJ54M08l32N2m3j84J19J98k52K01p4k04j81M86m21LL91r3k36
3889a77J43K7l71M34r8L2JJ28j57n4Q2l6K21j14o9j49J69l80K17M47l46j17P9
3912h8l57J56J47M10k45K00K04o79M65l13l6J27j32p4K37K79m04J07N9K73m52
3933a16K22Q1k97J77K36k93j40j6l5J77P7l87N39j40k06L47m72M22m41N62k85
3954A2m6J89J0n03O62l22j06L11J56l52K6j44k33Q71o64J5J30J6l73L16J96k01
$$ y = [2, 111, -160, -338, -65, 275, -170, -32, -174, -138, 67, 144, -26, 143, 260, -27, -56, 71, -170, 12, 330, -292, 195, 5, 222, -103, 156, -275, 4, -59, 41, -120, 101, 176, -437, 156, -251, 262, -134, -103, 75, -1, 98, -291, -550, 126, 129, 94, 307, 516, -242, -6, 156, 58, 2, 150, -182, 65, -68, -27, 5, -141, 167, -11, -44, -177, 187, -33, 205, 188, -173, -169, -15, 393, 61, 113, 70, -114, 5, 203, -49, 152, 78, -126, -307, 179, -242, -239, 152, 59, -177, -34, -7, -378, 56, -42, -10, -9, 119, -38, -92, -10, -46, 175, 61, -8, -157, 12, -368, -151, 296, -50, -167, -88, -445, -289, -142, 268, 23, 223, 427, -252, 213, -100, -136, -9, -141, -215, 22, 301, -103, 4, 63, 336, -116, 106, 187, -110, 67, 303, 10, -130, -146, -181, -4, 73, -314, 225, 85, -121, 226, -246, 176, -265, 297, 12, -34, 155, 165, -338, 324, 2, -104, 207, 363, 11, 37, -107, -340, 531, -133, -118, 12, 28, -345, -29, 167, -34]
3976c4J20J80p08N14k5K7j75M13k80m59J072p14j16N31Jm35K50o4k38Q0L1m02
3998d31O4J49l07M85R6j15R3J0l04J67J43j54p0L96j94j65J35l31L56L21j63n62
4020c81P48l20l68M26k35p2L34O9l51J95J25l43J88K08n09K95K47m52oK21P7l69
4042b73J71J72L21j52l05J02K67J1q31O53l50L3J37j5k32O2N01l18P9L24n01o0
4064b04N36m57J93M89n68m79Q60l28l38L47J06q9J50m50M5L30Lp44O34m1P4n1
4086A8L7l29K10M63m91j83L80p5M0k3k71R5N52m71n69O93K65l59k57J29k6K57
4108H5K31o12j62O45k51k89M73n37N10L47q30J93N25k43n57O39l75L8M12n68p3
4129c99L88M59o21K12K17n59N04m3l13K76K98q07J49L85R8j10N2j13k46L54l35
$$ y = [-34, 86, 266, -442, 72, 47, 74, -101, 312, 32, -427, 645, -69, -185, 346, 347, -88, 162, 98, -140, -60, -29, -431, -367, -218, -525, -40, 56, -59, 34, 44, -260, -93, 50, -104, -174, 222, 28, -137, -2, -333, 23, 344, 181, -381, 367, 47, -321, 105, -130, -202, 132, 201, -150, 45, 170, -173, 15, 223, -286, 9, 256, -196, -202, 19, 96, -273, -102, 70, 391, 239, -66, 36, 303, 314, -517, 136, -214, -181, -44, -59, -291, -229, 272, -46, 33, 357, -144, -204, 332, -125, 68, 557, -11, -490, 370, 42, -296, 51, 157, 68, 218, -232, -187, 143, 146, -598, 36, -5, 69, 18, 55, -274, -64, 399, -92, -275, 105, 30, 70, 47, -224, -129, 423, -48, -617, 76, 341, -18, -275, -146, -172, 85, 316, -296, -458, 187, -64, -353, 120, -417, 93, 440, -390, -197, 328, 85, -472, 167, -208, -170, 242, -326, -399, -11, 448, -173, 39, 256, -303, 201, 158, -155, 121, 419, -388, -239, 146, 244, 134, 186, 73, -173, 181, -154]
4150a54l17O36K9l58J25PO5J42J09r05Q56k89rK04J17m46J44J95o58L45K49K7
4172A14m85O72k24p4K75n61j31O15J1m90pM73m06O9Q04q38L33P0n92K51M34n54
4194b41pL56k69Q3J14l58j29P45j29m21L37n61M28k36M34k68j43N93o72K52L60
4215B68m56L44k87j60N98J08n35J31J87r5l14M08p8l37M40j88k58K70j76o0L42
4236A52J80p07M04K03n68M82J28n08j97Q23l13j09K48m31K52l6j5j63O6J16r4
4257h7K07L4k70K54Pl22j91N61k50J30J36k90oJ36l02J54L81j92K58m02j91K09
4279c6J98k18M8L09n17K9K68L6K78l41r6K8J98k79k7J78j69k79L26K75k82K33
4301A60j64k17M30j2l93J63m9Q6j2M3n0m55M50p1j0L71O5n13L84k39j46J57p5
$$ y = [-154, -471, 165, 194, -164, -39, -32, 33, 175, 284, -621, 235, -54, -63, 141, 258, -188, -44, 151, -507, -162, 87, 114, -371, 301, 77, 3, 278, -283, -414, 201, 212, -278, -285, 188, -218, -149, 655, -183, 150, 220, -372, -121, 313, -241, -248, 108, -161, -78, 36, -322, -451, 294, 165, -256, 81, -480, -52, -288, 146, -122, -265, 328, -344, -92, 268, -188, 156, -131, -291, 307, 415, -120, 11, 198, 103, -211, 197, 119, -218, 222, 34, -224, 46, -130, -190, 152, 332, -375, 29, 232, -336, 146, 274, -234, -431, 392, 79, -30, 218, -213, 39, 3, -12, -175, -109, 7, -87, 120, 154, -116, 138, 145, -177, -368, 193, -57, 73, 209, -81, -87, 49, -253, -99, 282, 90, 348, -54, -245, -36, 162, -56, -8, 301, -216, -187, 81, 117, 395, 54, -42, -14, 184, -95, -122, 56, -113, -392, -66, 209, -73, 160, -4, -221, 209, 197, -196, -33, -82, 4, -8, 35, -15, -470, -20, -91, -101, 270, 335, -178, 206, -33, -179, -22, -97]
4324i7j46L82J56l14K26j94k26J4L56Nm01N14k77r7O0j6J25nj14J45k14J20J54
4347A56o9J65o2k07Q3j3k82J56k9k34K50R0J87j69k5l1K67j59k05J11m8j24K7
4370a65L07k43L0R7OJ83p7j50K98j48m66L85J69k7j57KL97m89Q9j52L40o0k69
4393a00k42M44m40J70K46j60k83M50l3p0J04j80j72N21j19k26N8P6l86L49J77
4414A84k04n3Q1K10k77j18J41k04K12p5j53O4L67Ll28K32R8j10k27K12L3k03k14
4437c29M25j98J32q6J46Q1M3rl06R8q8K66j26k1J31l32J92k2K43l84M7R9O1O8
4461A31l5k11L09l86M5M1Jr8k3M51k50r9k1J82k7J00l05k4J91j64k0J84M1q1N2
4486a6K45np3j74K59k73n0M95k36k81L81j33l15K78j15j07j50K11l39L40J91j09
$$ y = [-97, -243, 139, 295, -19, 207, 13, -213, -199, 157, 162, -239, 275, -2, -99, -39, -55, 70, 65, -49, 96, -118, 2, 156, 87, 252, 190, -17, 66, 53, -229, -73, -102, -336, -86, 4, 191, 22, -3, -34, 233, 74, -131, -20, -68, -192, -165, 142, -101, -71, 26, 32, 215, 138, -12, 286, 138, -328, 57, 226, 199, 42, 44, 441, -48, 41, -111, 229, 169, -100, -342, 102, -338, -168, 78, -82, -365, 85, 52, -18, 86, -94, -266, 255, 136, -90, -32, 44, -342, 7, 184, -20, -73, 8, 218, -59, -177, -36, -240, -28, -103, -256, -192, 175, 178, -150, 82, 180, 70, -157, 55, 88, -115, -329, 96, -102, 30, -56, 90, 171, 214, 205, -101, -3, -91, 175, 49, 28, 159, -173, 19, -3, 240, -144, -97, 2, 63, 131, 96, -115, 194, -192, -147, -106, -105, -203, -226, 225, -25, -124, -145, 37, 10, 110, -195, -219, -28, -192, -212, -28, 13, -68, -16, 229, 224, 151, -23, 236, -37, -87, 408, 172, -109, 272, 139, -176, 102, -13, -120, -270, -59, -398, -58, 133, 24]
4508B4K43r7n02M03N3l75K07l5J54j60J34Q1p1l92K13L39l95J53k26P32m50k80
4530b47K50P7l2j42L69j67j46l8L61l24K41j83m9o0L65k13J5J68K7m49J22M67
4552D12k92J95j91k51K80k16J2L6K7l8l58L05l77J99j57M82R5l77J78L22l57J03
4574C2j39K56m81J77N57m32J26j5P8q6l22J45j66R4J98r0J09k91N7J96q1p4J52
4597@L74m51r4L77m99J22N12n53R2K26n21J14P12k34n18M10k66N3L81J1j84K42
4619C06l29m6R7J15k38J56m5P2m6J27o11M40K53l36m1J16k02l60N88L3k26L59
4641A82k69k8K3P3L31l37J49m20P0N99l51r8K46m29N08k25Q5K42j50k5k10J57
4663A23J87p89L99j61K01k10K48l17N34j17k31L23k08k65J17R6k57L60j88j50
$$ y = [24, 267, 170, -332, 71, 124, -251, -44, -79, 75, -85, 49, 130, 59, -333, -120, 219, -176, -23, -249, 483, 33, -247, 3, 80, 48, -94, 275, 108, -38, -76, 285, -39, 202, 19, -30, -90, 275, 62, 77, 245, 272, -177, -55, 412, 120, 315, 124, -127, 153, -63, -51, -15, 12, -26, -384, -79, -456, -257, -414, 68, 163, -214, -36, 286, -71, 32, -107, 149, -332, -155, 402, -30, 96, 81, 159, 73, -249, -104, -270, -176, 22, -68, 41, -250, -193, 3, -78, -152, 0, 374, -77, -171, 206, -293, -171, 341, -212, -120, 106, -415, -301, 411, 177, -341, 69, -197, -144, 237, 248, 64, 306, -23, -69, 28, 143, -95, 61, 16, 88, 42, 169, -442, -2, 251, -85, -126, -10, -212, -572, 16, 49, -177, 182, -87, -115, -92, -19, 312, -25, 124, -296, -226, 373, 22, -76, 170, -259, 249, 24, 109, 351, 201, 176, -34, 123, 310, -479, -80, -241, -40, -250, -2, -319, 215, 98, -133, 190, -18, -283, -166, -70, -327, 33, -155, -305]
4683c05J05L94j14j74L38j44m35P46o31n2J86Q6l16L45K65n17M06Q9n79J24M81
4704B98n43J07J52jj67K79l13J17J57k11J63j2j87p4N17k98j69M30k21m71N09
4725F2j42j6L55k71j15J95q5p2N7L03m45L4K73k56L44q6j18K4jj9k08J94Q8l35
4749b40L25j12j17J11J57l10K74K17n96L78N2Ok81M56m77k70Q39k91l25M96k25
4770F7j87M62o66M13L07l20r0j27K3k0M41n42mJ40J20J11r3j06k31M71k26l54
4792d11N48J15q2j49j74K85k18K57n18Q4k5L71m10O24n58L92K7j85m39Q98m46
4813a4N6l45M55m07K36J21j01o5K08k75KL78j99k97L85j00k00N42j84k71L01K78
4835E04n45j80K53q2L44j37m25L43J42n2J49J29n34J42l6j55P3L59o96J99K53
$$ y = [-305, -200, 194, 80, -94, 244, 100, -335, 411, -220, -272, -86, 0, -316, 29, 294, -223, 183, 272, -307, -183, 298, -245, -138, 14, 13, -154, 125, -188, -71, 86, -125, 38, 26, -161, -235, 282, -16, -185, 245, 24, -447, 62, -80, -96, 259, -12, -127, 68, -17, -89, -32, 271, -174, -140, 133, -123, 221, 135, 17, 41, 40, 21, -187, 7, 95, -240, 85, -27, -144, -33, 124, -186, 88, 305, -291, 87, 139, 145, -136, 320, -157, -427, 412, 121, -204, 292, 67, -120, 342, -324, 89, 396, 76, -14, -141, -118, -138, 303, -239, -243, -103, 17, 128, 35, -71, -302, 169, -57, -411, 137, 252, 170, 21, -153, 132, -86, 171, -347, -263, -288, 83, -327, 297, -261, 131, 158, -27, -466, 432, -14, 42, -303, 152, -255, -19, 102, 1, -64, 144, -131, -129, 249, 50, -247, 138, 38, -162, 380, 196, -75, 226, 504, -41, -221, 32, -50, 294, 157, -268, 75, 217, 165, 314, 443, -91, 51, 15, -140, -67, 292, -404, -205, 48]
4856D8j8R9K2J83m0k52J73m34K91N5l76K46l06K77J3K80o84N33j04k77M8K43k8
4879hn7j9J22m5J84j12k05JJ07j73J03R6n1J78m07J39J51L78m15k45L25k18J52
4902a9J4k17K01K16q8j3j29oj0n8K04j78j3K92k25n9L74j00l11j41j9J39J96J00
4926A50l29K28J55m23J98J99j6P5k88j17J24kk02M97j79k19L48j67K01l38P9K8
4948Bj77J96k88J28L7J05J34l2k02J93J91j28k19J10j48QJ66j42J05j25J55P9
4970A48j9l79K80l37N39j10R6m85J44P9K65j7j21J52l17j61K42Lj88J53K3J37
4992A27o6k19k11J90J34o7oL27j20j72j98O8L03J79m24j09L56P8j00J54l07J81
5014I8J24l87K94r7j96m2K75k7p5N60p43K74k82L40l87J34n3M27j60r8l07L44
$$ y = [48, 30, 129, 151, 334, 294, 42, 215, -219, 72, 127, -249, -3, -309, -32, -19, 261, -423, 110, 6, -271, -223, 20, -8, -65, -84, 38, -7, 177, 65, -140, -139, -32, -205, -102, -6, -57, 121, -286, -147, 4, 382, -33, -278, 47, -171, -19, -5, -222, -21, 195, 107, 94, -35, -41, -51, -109, 95, -83, -96, 196, -29, -88, 286, 186, -125, -266, -285, -146, 50, 150, -179, 49, 204, -219, -21, 178, 162, 237, -51, -168, -44, -46, -248, 249, 70, -149, 199, 32, 233, -105, -26, 2, -175, 21, -267, -139, -102, 3, 137, 105, -97, 96, 287, 159, -60, 50, -98, -90, 76, -66, 39, -86, 69, 148, 129, -250, 30, -307, 232, 122, 218, -267, -123, -44, 221, 204, 83, 235, -82, -243, -1, 2, -186, -33, -10, 127, 61, -158, -369, -179, -45, -112, -118, 209, 89, -83, -281, -213, 90, 269, -155, -264, 92, 170, 70, 224, -83, 98, 222, -165, 129, 32, -164, -206, 69, 42, -33, 527, -216, 58, -224, 116, -271, -137, -190, 237, 77, -21, -328, 16]
5036A6L18n59R6K78j26K72o7j41j67P6P0k13O0J09j39R1JJ76k34J55J50j63k18
5059a59K70J16j36r5q1J02j18p7L7l4J71j36J45N5M7j81J92J0K63n34J86q3QO5
5083C3L1r0j08PK78k70J2O3j00Q8k40M08m59L21k18L82k29L6Q4j49K16j9j20O2
5107A9q0J32r9P1j58K57m35m2K45J77k06K9R8K30o27L20m8J30K62l27Lq3P1J82
5131A21j61J50q0k85M10k07k34L43J12m79L28J30r7k20L17j60l7j0N5J61j53r0
5153h6J21j5J77l61J86J19l63K17j5J55j57L80l10J05r3R0M7K4qk16j21n5J10
5176f9L48o51L10k4K14k86K14L4J47j14n5k52N6K36M0p7o3J77J05m37j51L48k52
5199b02J40qJ40n4j49J69oJ80k91M3K16l78K6J82rJ03m84N53j45p3J52k67L5j60
$$ y = [16, 334, -225, -129, 149, 23, 295, 228, 87, -80, -4, 66, -147, -87, 22, -117, -26, -25, 151, -83, 72, 222, 59, -159, 111, 227, 91, -4, -85, 17, -101, -178, -141, -175, -4, -140, 5, 60, 107, -74, 118, 128, 391, -143, 43, -40, -32, 33, 64, -26, -134, -127, 151, -119, -107, -44, -144, -56, -296, 112, -347, -26, -244, 138, -91, -55, 29, -120, 96, 77, -43, 19, -61, 71, -28, 43, -115, 142, -293, -335, -90, 87, -119, -90, 8, 238, -389, -69, -117, 13, 275, -52, -49, -132, -61, 121, -40, 110, 30, -255, 155, -52, -286, 57, 169, -310, 18, 148, 51, -169, 148, -12, -49, -59, -4, 157, 4, -86, 35, 20, 197, -164, 22, 141, -222, -5, -20, 135, -22, 358, 48, 153, 60, 150, 197, 221, 213, -3, -124, -179, -69, 279, -372, -62, -86, 128, -158, 56, 90, 237, 123, 68, -184, -128, 108, 148, 71, 8, 185, 290, -147, -298, 50, -202, -62, -70, 70, 16, -133, 36, 30, 210, -81, -38, 178, -200, -174, 8, -1, 102, -382, 171, 26, -47, 105, -162, -127, -287]
5223b87K59p1J40J64n25L19N9j44Q2p4j10N37k54J33j7m21K10J76j1k72j4J91
5245G0j90j7J3J60j0J08j94L53k58K12o13N38q7j42K93j85K61n25K66k43L27M4
5267A81J6k09j26k8K88J58j21m56O79q2m13m8K87j40r4N78m89K8n3M5j14J15J13
5290A15K2k57J70r2J26m03O42k82L02j51m4k08k07J92p1L44j20J91k92o2M4J72
5312A31m8J51L7o08K36l0J98N5j18J77m08J05j61K22M67p17J17M36j64P2q5L2
5334I7j16R1J95n63K71N9j07K44k06N9M3r4J64j45j67K53N6l0q9K16j92j36LL8
5358e6J23j59L79k20m2M8J15k86M6J09m93K88j15O05j12j33j53J0o0O9K58K13
5380D34m06k30R2P4L9R0Kk29j4J13j2L07l80O8R6j30P9j02k6J44J3N98m54l06
$$ y = [-287, -28, -99, 41, 205, -320, -1, 58, -86, -4, -78, -188, 349, 95, 228, 211, -210, 0, 176, 165, -107, -121, 70, -120, -137, -124, 36, 26, 134, -60, 293, 35, 247, -366, 172, 85, -57, 236, 51, 312, -213, 53, -190, 137, 181, 197, -12, -138, -166, 122, 280, 159, -297, 382, 300, -113, -161, 126, -14, -108, 470, -19, 9, -44, 1, -113, 2, 115, 137, -120, 50, -42, 84, -319, 323, 41, 343, 192, 148, -60, -267, -75, -146, 198, 78, 269, -23, -85, -41, 131, 83, 234, 271, -337, -101, -131, 67, 122, 4, 181, -227, -122, -283, -61, 406, -311, -194, 242, 78, 150, 65, 97, -19, 72, 267, -296, -25, 34, -73, 171, -35, 24, 67, -27, 137, -8, -175, 78, 134, 104, 15, 231, 39, -97, -94, -56, 67, -92, 287, 67, 25, 73, 188, -98, -52, 57, -436, -148, -263, 342, 230, 97, -56, -46, -106, -37, 221, 434, 28, -202, -110, -36, 3, 93, 95, -134, -148, -35, -47, 260, -120, -52, 44, -86, -7, -109, -135, 9, 22, 620, 166, -140]
5404a40L81k99M8K32j63j90N54o31L53p2j36J24R7j17l10N45K1j68j90N3k10J66
5426e2k15K46p7J49%J23N9l97K16K04m77K29K56k98M9k4K7J92l48J13o4J41n4
5449bk24L83k52K00R6k58q5L74R4k64N9k8p8K73k50M0k3J9J16k22J71k72K21K16
5473C04l97J76l50J66J06L35l20oLQ3j3Jq8k66J57L69l93K52m4k78L13J7j77J82
5497A32j32j16K42oj1j21L23k08k74K16j00J20l1Q3o8n9K78n4m63K07J22l2j43
5520i5M39r6M7n55oN37m29L32j40m8J88M0j13J8k81J85K15M9n32M05Q9k62N8K0
5544F5M1p3Q1j11j64J54p7j60M0q1N83n05L67j84J40j00k94J41K73o0j27O0k57
5567b48K92R8j33L58k30l75M56j79j64J75j7J68l00k0P8J56kl26L06k03J35K84
$$ y = [-140, 241, -58, -10, 222, 59, -131, 423, -208, 145, 73, -63, 61, 158, 41, -269, 276, 297, 129, -61, -8, -218, -52, -267, -21, -98, 51, 51, 174, 233, -164, 52, 256, -221, 8, 264, -34, 15, -9, 18, 210, -138, -25, -89, 52, -2, -226, 157, -95, 105, 201, -57, -142, 232, 326, 62, 121, 93, 15, 288, 38, 78, 55, 74, 190, -32, 139, -133, 88, 304, -93, 83, -267, -101, 5, 340, 20, 14, 17, 100, 87, 88, 0, -266, -109, 260, -133, 119, 75, -203, 110, 127, -50, 132, 0, -116, 126, 120, 109, -12, 311, 103, -171, 45, -55, 65, 34, 117, 49, -10, 268, 214, -249, -42, 80, 48, -95, 344, 248, 295, -260, -266, 271, -158, 174, 34, -14, 174, 214, 101, 119, -162, 23, 238, 287, -245, 160, 249, -13, 45, 65, 106, 33, 114, 3, -161, -7, -84, -244, -204, -285, 298, -207, 160, -24, 116, 16, -278, -137, 136, 76, -51, 9, -248, 44, 142, 9, 367, 137, -238, 218, 39, -125, 50, 33, 201, -99, -119, -41, 115, 113, -213, 93, -110, 25, 309]
5589C09l71K38K3p4K9j77j28J62q0l43K52L51j43J44k6l78M0j35R5J22J20p0j15
5612a55J71N2k25M5K06Pj18j3K96n20L64j38J13q6j02N2K41K0l30K00j23n2N2
5635d3J28J3M3Mm6O1K06k99m1L33m80L40k70J20j46L82l54o0Q3J11J94l51j27
5658a99K90r6N2j30J97j35K12k27OJ13K87l59J23M0k50Q0K80k86p9K48k77K52
5680A42l68K24N4jP6L6l67L60j7l86K00R7n3k57J80jL2K8k99L86J09J6l24J19
5704a4P5m18L84j73K74l70K17j4j20K63K79m40L03J43m65P5m2K46j72J3K0m9k86
5727b71J2L14j27m9J63K8j74L02Nk70J1L28n58M75Q9n01M29l31rR9J72R7n9L2
5751B07j28J36k53L35m23K59R7j96q8q7J63l2k3kN9j06J85J77j59k49J48r5J61
$$ y = [309, -62, 176, 199, 125, 154, -23, -151, 11, -69, -412, -160, 191, 48, 192, 166, -212, -172, -307, -212, -90, 30, -40, -155, 16, 68, -157, -112, 94, 101, -17, -30, 266, -254, 110, -28, 85, -1, -103, -51, 190, 210, -120, 80, -43, -95, -43, 85, 98, 141, 145, 99, 160, 366, 67, 26, 359, -121, 219, -51, 69, -77, 305, -49, -109, -26, 85, 279, -72, -199, 91, -5, 47, -83, 114, -21, 191, -36, -30, 83, 370, 11, 134, 174, -76, 4, 284, -2, -81, 167, -110, 142, -226, -2, 52, 51, 127, 163, -204, 156, 139, -247, -47, 50, -3, -260, -80, -81, -49, -21, -320, 66, 175, 191, -133, -14, 61, -357, 27, -146, 128, -242, -25, -39, -159, 104, 383, -57, 246, 389, -76, -1, -43, 203, 31, 44, 64, 15, -271, -259, 55, -72, -121, 42, 70, -104, 198, 203, -67, -56, 272, -286, 189, 278, -223, 206, -125, -134, -35, 137, 234, 175, 207, 79, 215, -38, 297, -126, 133, 230, 34, -54, -141, 22, -10, -33, -35, 24, -82, 103, 280, 121, -128, 20, -75, 86]
5774H6Q8j17m62J22J09J38j6j52l21O14j74Q0J18j35J19K22o00L55J89l59L39
5795B43n08K47M64m02k00J75Q3j48l92L10L5J0n1J68j72L19l65J78j64J21l6L98
5817C13j82m15L08K54k16k29m4J27K55j01o2j57J02K43j37m08M0M34l65J6J01
5838a23N6j09K45j41K47k40l6oj12K20J58L76m75K25m15j63J61L20n2K27n57M2
5860a52Q6J20K3j31K33r8j48j78L79N9m26L98p0J47J2K27o35j7L77l41j3L9K16
5883A07j99K60j85j6j76L61m09l4K83L4k07j21N45l53L03p5J1k80M9J62K5P5k67
5906a07L2K32q0Rj78j68k9J48J62n3L0J5K5J04p5j59P9j80J42j70L04K69p0k36
5930D6j11j09j03K14J35lq0K23M6j01j4N8k14r6K63m78K84J80j05k47L43J04j15
$$ y = [86, 174, 57, -405, -283, -174, -36, -52, -204, -525, 89, -85, -5, 113, -22, 97, 319, -281, 74, 263, -96, 243, -265, -18, 446, 44, -156, 19, 102, -46, -438, -128, -93, -83, -134, 34, -138, 181, -184, -6, -170, -49, -85, 313, 131, -284, 24, 278, 62, -167, -211, -84, 171, 70, 8, -149, -47, 196, 59, -349, -309, 125, -240, -224, -123, -67, -176, 69, -72, 175, -65, -101, -107, -219, 1, 159, 535, 60, 285, -130, -293, -132, 188, 136, 363, -194, -152, -66, 54, 77, -54, 179, 81, -67, -245, 134, 193, -233, 165, 95, 242, 254, 481, -154, -171, 206, -135, -148, -109, 107, -92, 168, -17, -33, -209, 152, -257, -291, -8, 26, -181, -302, 243, -110, 193, 118, 129, -151, -102, 60, 85, 160, -107, -75, 157, 77, 86, -92, -260, -289, -141, 21, -32, -2, 13, 38, 142, 67, -92, -13, -193, -51, -221, 83, 352, 282, 46, -65, -174, -277, -63, 72, 69, -11, 212, 258, 157, 143, 201, -13, -109, 154, -324, -40, 140, 35, -212, 131, 235, 120]
5953A20k43NR9N8PK7o5L4J23k55q2K96j03k9L80m08J69n5J69m7j93k69L68j62
5977e6k37M71M22p73jJ75J31m09L4J96j67L36Mk7k8M8k05J29k15M56p4n99M12
6000B3k44J38j76J61O1P9q4o2N8J29L41m72QK1R0j7K02k00k69J69n1K80q1N4K5
6025A83m01K13R9j30N0k08L31k16K23l5j92J32P2k01K48k49J03j60N4k5J82j43
6047g0r4j9j25M03l4k47K29q9l31K95j08N86k12j32n3j04J35K15k10K3l55K39
6069e8O6j78j7K59l12K01m4Q0p9Q6q7J0L4m9J38Mk7L55k69k33J39m9j58j89Q47
6094D70p08K08Jn6K2P5k25j2L25O4l86K91jl73L07k16J04O52m26k06K60l48L89
6117B11m56L42m33L45j77R4J7K44J91j74Ll38J68M53m29j20J06N8m08M22n8k05
$$ y = [120, -123, -118, -19, 39, 46, 73, 8, 42, 165, -90, -172, 124, 21, -8, 372, -36, 133, 78, 247, 200, 7, -262, 106, -56, -293, 178, 600, -173, -174, 1, 132, -277, -243, -47, -214, 122, 126, 99, 71, 119, -86, 43, -172, 284, 210, -389, 23, -221, -83, -259, -98, -37, 42, -42, -104, -46, 83, 424, -48, -40, -19, 71, 54, 256, 56, -213, -44, -95, 185, 104, 158, 183, -218, -5, 94, -36, 14, -194, 137, -79, 144, 109, -83, 49, 121, -80, 168, -81, 22, -138, -84, -109, 73, -70, -164, -183, -308, 95, 61, -186, 43, -46, -377, -82, -190, 396, 184, 52, -1, -105, 30, 245, 35, 58, -297, -58, 8, -170, -187, 72, -240, -39, -83, -3, -82, 4, -83, -73, -39, -88, 50, 54, 27, 382, 113, -120, 19, -30, -188, -377, 470, -238, -30, -29, -85, -63, 12, -213, -225, 100, 164, -222, 69, 68, -305, 2, -214, -110, 542, 116, -90, 170, -178, 211, -245, 97, -336, 9, -168, -74, -57, 187, 378, 204, 207, -131, 37, 490, 61, -59, 47, 105, -303, 119, 61, -144]
6139a44J61l57M03j97L67m70J9L67l3j81m7j3J7P8Q6j42n1q5J56k0j15L57k08
6162e2QN8l82K04Q3J93j15l7L7J73j00l9K24k69K39j81J2kk33J62J31kK22k0m04
6187i0opJ28q8K32j88k3j5pJ14n3K77j95j30K08K1j22J44M2l28L8k72K13Jp8L6
6213a48P1j88J03J98pl87M21p0k7M8j60K13K9j24K66l28J06R7j99K15k40K69n57
6236c99L22J99P7m31K70nP3j60J62J10J66l95k05K99L1j37N1J02k42q0J54J61
6258A23l61J81J55J2j3r8j59M71l81l04N11k72K85q7M0k95K28k51R6L5P8Q7O2
6281A43m41J31Q1j4k72M08j1K60k71j7O9J26k95K4K18m68O86l55p0k18K88o7J71
6304A06j03M33k31k38L39m29O9K43l48J61K7K29k6l81N05m00K69j96k25L02o0
$$ y = [-144, 17, -340, 63, -134, 233, -237, -218, 149, 116, -65, -112, -125, -108, -30, 56, -86, -137, -222, -66, -86, -201, 156, -52, -44, 14, -368, -164, -81, 112, -3, -40, -3, 170, 70, 31, 255, -14, 225, 44, 56, 54, -179, -17, 114, 112, 334, 314, -90, -96, -103, 25, -63, 169, -19, -42, -57, -64, 50, -3, 274, 79, -51, 157, 178, 56, 200, 242, -86, -48, -320, -107, -106, -184, -148, -77, -265, -162, 36, 29, -358, 63, -7, -34, 14, -146, 67, 96, -28, 238, -90, 16, 113, -86, 129, -111, 158, -399, -77, 122, 199, -232, 38, 33, 106, -54, 108, 218, 384, -11, -216, 83, 114, -23, 28, 130, -112, -192, -38, 123, -238, -57, 98, 110, 97, -1, -160, 311, -70, -374, 137, -135, 150, 63, 103, -192, 36, -215, -119, -84, -6, 81, 143, -298, -167, -86, -100, -372, 36, 25, 285, 14, -3, 66, 192, -103, -79, 139, -329, 357, 2, -68, -286, 2, -65, 106, 3, 436, 205, -33, 306, -123, -54, 189, -159, 2, 29, 258, 232, -149, 356, -44, 225, 29, -196, 106, 46]
6325D6Q6L7j91n0M48n05J01K45l20O7K98J9r6l36J62Jqj53J35J97m15K78m50L28
6349g6K59P0J00m14J61j05j08K08k70J39L11j85k34K61j0n6j47j37L79j11J98
6370B33r9l86L25o1j57k0M39l14k06M66n5r2k6K80l06J02l69k5L21L3j15K70j49
6393H9J67l96K63k26J43J02j90k01L7q0M27j57Kq7J03L54o63K97kJ3j2q1R1j43
6417a50J93l12J19Q6L2K09j42J38p83O89j18J6K39m81K17j24J34l0k2K52j00p8
6439a6j90J14m8R4j13L16m19M00k7l0o2k31J46J73k18J80n31M88n7K10j21Lj08
6462d7R1J09k12k89M63K43m73K7M15n10J70J0q1J6J39K00j42m06J40K3K5j5j27
6485b31L22j36k5J29j54J30r2l04L14J15oJ2O8n35M36j0l19K18K4O1r3J51j73
$$ y = [46, 132, 169, -22, -72, 376, -129, -28, 217, -103, -36, 262, 281, 185, -151, 11, 12, 4, -149, -14, 183, -232, 46, -404, -76, 183, 253, 353, -61, 100, -5, -113, 95, -175, -36, 275, 90, -144, 117, 107, 51, -96, -233, 146, 35, 233, 134, -252, 73, 12, -145, -165, 274, -40, -246, 220, 165, 73, 47, 327, 21, 123, -246, -271, 50, 83, -32, 238, 89, 256, -140, 123, -103, 40, 142, -48, -249, -212, -292, 135, -22, -20, -107, -4, 350, -313, -16, -18, -5, -17, -98, -7, -150, 43, -269, -150, -64, -32, 177, 35, 173, -610, 79, -39, -23, 216, -265, -48, -172, -38, -68, -90, 162, 62, -16, -206, -92, -140, -46, -159, 157, -262, 138, 111, 81, 19, -212, -66, 107, -111, 69, -462, 26, -31, 179, 58, 61, -47, 44, 153, -59, -348, 115, 358, -115, -88, 327, -183, -13, -3, -84, -68, 71, 271, 129, -277, -137, -114, -89, -104, -231, 91, -45, -70, 59, -95, 35, -57, -361, -47, 68, 62, 74, 142, -393, 43, 33, -286, -68, -44, 17, -76, 75, -98]
6508i8K58j40R5J26k58k41J89J32M1j91J4k75O02m04K37kj82P5lk5K00k29j11
6531a90K18j13J12J39J0l26M00l69j00L1Pk6M47k1l57m6J36J46k80r9J06K85r1
6554A9J59o5j83l0P4K26o42M60l0K39k75J52k4Q2J09k97L03m26K02j58K01K5J0
6577A31k1r3k21M27k95L44l70K12r5k25M05O9n32M8M82l73K92k24J6K7J04l09
6599b01k25K55J90L8K3j61O9j34j83K44j11N94k57j66O6j83R1R5o9q8K44j99J83
6622A15j9O3l6j26K74l90J08k6l9LP8l5J6K9J23j92R5j98M9K96j12Kk33K82n12
6647c85K38L86J57m64K63j65LK19l10L18l86J81N2j76k2J38j19P5l29N84l15j1
6669f8r4k07L18K18M1j10q0j01J01K41k68L32m98r0M94l35K55j0k61j5K20k19
$$ y = [-98, 160, 20, 115, 241, -17, -258, -69, 63, 104, -87, -73, -348, 254, -150, 87, 85, -97, -22, -25, -50, 150, -79, -190, 28, -85, 27, 166, 176, -150, 250, -119, -219, -188, -181, -207, 240, 219, -138, -184, -48, 98, -182, -281, -175, 110, 19, 178, 113, -70, -100, -26, 200, -442, 18, -12, 227, -48, 104, 80, 162, 271, -26, 277, -149, 53, -105, 96, 121, 131, 110, 17, -204, 223, -72, 272, -98, 114, 19, -206, 199, 268, -264, -216, 266, -107, 185, -39, -23, 4, 108, -201, -426, -171, 19, 57, 80, -81, -12, -146, -329, -85, -196, 398, 141, -25, 41, -142, -51, 44, -25, -113, 131, -68, 115, 96, 159, 123, -3, 271, -119, -11, -37, -76, -73, 5, -30, -14, 15, 138, -54, 41, -157, -108, 188, 76, 78, -155, 127, -385, -147, 239, 396, -68, 195, 30, 33, 252, -58, 260, -126, 55, 107, -69, -91, 47, -72, 3, -326, 258, -57, -68, -162, -369, -51, 167, 208, 98, 18, -83, 18, 259, -9, 323, -175, -265, 229, -106, 149, 139, -122, -137, 83, -136]
6691a36L34o3l05M63o05LN51k44m5J45R7j77Q3k84P5K20J29k21R2l1k07J98K00
6714B72m29N0j7R5l1K80l16J39r8M7K02j45n4j92K98j02jj64J67k13r1L79Ql03
6738b19L54j40n9Q0j35M60n07K5K50k08k07N19k68L32j54k49M55l39L5l66M9K65
6760b7K00l60N8K67p8K9k38L22k40J10j84j92K84j0J48J74m46J95o8m7K36l05
6782a72J12J53j51J49j05K1l94N15k34M7K0K26R0k34q4J68J3J07n8j92q9K32k05
6805f5MK60P7k15J0j3M5j40r7n7K77k45rJ54k35L09k97J30n4J75N1k61r1L95j91
6830h3J32k10L05l82J3M68J11n68j3k8K70J15j71j41L18l64J56L4P5m7j5N9j88
6853a54K31k87J80j00J90p6k30j16L64k31L97J18k54J81j32r4K2k54M10j65o1
$$ y = [-136, 198, 135, -170, 293, -312, -309, 242, -2, -47, 98, 195, 18, 101, -183, -108, 112, 241, 20, 112, 81, -126, 72, 272, -157, -107, -124, -29, -60, 220, -96, 43, -55, -8, 194, 49, -5, -197, 101, -1, -2, -166, 1, -212, -303, 76, 84, -219, 135, -5, -64, 16, -119, 341, -166, -141, 109, -99, -306, 213, -55, 277, 123, -126, 329, -10, 25, -341, -292, -27, 173, -187, -129, 138, 60, 89, -149, 173, -67, 43, -141, -333, -49, -59, 89, 263, -183, 12, -56, -103, 133, -172, -60, 93, -58, 91, -14, 7, -387, 128, -106, -59, -39, 187, 277, 43, -41, 127, 140, 247, 189, -3, -92, 140, -65, -61, 199, 276, 61, 71, 58, 103, -37, -134, -191, 86, -159, -168, -14, -249, 60, -237, -107, -161, 14, 65, -196, -287, 108, -83, 49, -161, 144, -238, -225, 243, 354, -214, -227, -255, 15, 130, -41, -182, 136, -228, -72, -38, 37, -10, -25, 34, -154, 77, -210, -30, -130, 60, -16, -246, -362, 2, -229, 168, 286, 32, 213, 81, -13, 9, -245, 165, 0, -61]
6874f1p3K87n8K3j88Q5Q2k06l7K62P3k2o4P1j50lj79K05K0k76L8P4J59kq5o8J19
6901B6k31M52j9n27J92M03p20O07j38j6Q3j3n9q9p3k16O12r3l56R3L38j72j94
6924a10K13j02k98O40n43J53K66j67O1J47N5j44J07j62J08k80K6o8K7K75j8m59
6946b73L71L0j10r7j73M51k15O8m23K87L52k50J12j71L8J70m41M64l17J9PK4m3
6969a20q4K76MK21j42J6j8n7J24k8j50L23l13j43K85o7j2l25mK39j9j36M2K10
6993A22p9j62q9L17j84J75k44J53k48J91O3J7mj08j5N1J67l76L39j10N8L3l05
7016b38L40q0J43k65n0r5L22J38m33L09j65M91k97J16l16J50q1J52k22R3J4K89
7038C15n66J64K91j71J2k16J18K2j0l4j8J93k34J01J25k8m4P6R6k04j89L3J80
$$ y = [-61, -134, 153, 95, 118, -70, 15, 97, -109, -146, 116, 189, 167, 103, 174, 24, 21, -158, 47, 67, -209, -171, -97, 62, 60, -25, -93, 26, -205, 247, 228, -299, -107, 296, -424, 183, 45, 29, 112, 99, 40, -49, -122, -338, 274, 181, -175, -82, 256, 84, -110, 103, 1, -297, 343, -200, -47, 219, 52, 113, 260, 315, 171, 278, 116, 224, -56, -30, -98, -71, 204, 186, -273, 98, 128, 18, -79, -252, 199, -16, 52, -371, -84, 268, 18, 130, -41, -3, 167, -274, 190, -127, -108, -101, -77, -120, -204, 72, 76, 297, 155, 171, 153, 96, 220, 192, 42, 365, 52, -91, 194, 127, 115, -210, -214, 25, 6, -130, -88, 122, 43, -119, -208, 109, -75, 100, -144, 9, -239, -48, 15, 32, 28, -80, -95, -44, 123, -253, 86, -24, 34, 67, -238, 102, 22, 165, -100, -150, -245, 77, 215, -218, 91, -74, 417, 120, 236, -80, 70, -11, 141, -81, 12, 26, 315, -251, -87, 204, 33, 45, -171, -53, -31, -41, -75, -93, 100, -134, -33, 92, 64, 20, 96, 192, -12, -201, -168, 12]
7061A2l7k48K69P9l99L04k6J48M50o07l41N54l89L43kM9r8J26k78j4K83J30l94
7084h6j08R9p0P3r2k0L54m54K93J0J1K15k85j02J80q5J33j45M3K6j61J93q7M70
7108D05k47Jk18M20n47M7J92O3r6o4O5m2R8k2j49K7K03l44N0m9K94Q4jK51q8l70
7134c7r3O0L7Q7K53k02R5m70O43o33L05j85r9K51j00J34J37J0j09m65M29m43N11
7157A16K38m07k14L11K10l49j31L8J40J95N8l84K58j10J02Nn4J09k28k0j09L69
7179A43J13m63L60k17J34j05K72r0l01J05L8N5j09k38M37j70k45N76j05N3n06
7200b63J65J90l80L99J05l46L17m8j34L59o64K37L3r2L50j30q9J80k1r1Q1j48
7222A0k5J46j2k01k28K30L43j88M7m10J29J65P5j83J60J18j24j92J90K56k66m4
$$ y = [12, -25, -273, -4, 75, -324, -20, -46, 102, 552, -55, -396, 158, -231, 112, 110, 159, 61, 187, -91, -105, 178, 308, -86, -194, -95, -165, -92, -184, -204, 150, -304, -11, -1, 10, 225, -60, -162, 18, -67, 66, -79, -36, -10, -171, 22, -65, 405, 158, 159, -59, 361, -186, -139, 53, 116, 20, -44, 21, -21, 77, 55, -94, -67, 136, -208, -158, -207, 87, 171, 170, 421, 333, -37, -130, -70, -33, 54, 307, 105, 200, -270, 373, -260, 45, -140, -239, 12, -88, 46, 183, 193, 84, -381, 48, -395, 116, 354, -53, -267, 44, 254, -95, -226, -188, -48, 147, 205, -179, 79, -31, 71, 76, 22, 131, -97, -117, -226, 143, 256, -207, 153, -64, 70, -35, 237, 147, -154, -49, -11, 44, -65, -303, 134, -36, -281, 295, 190, 243, -263, -98, 92, -288, 111, 216, -130, 187, 139, 5, 364, -300, -63, -30, -122, 228, 98, 9, 189, 168, 77, 158, 10, -15, 131, 119, -82, -310, -80, 263, 75, 122, -288, -159, 6, 81, -102, 58, 176, 52, -140, 50, 306, 40, -4]
7244dN2n0j05j72O44l29L10l26P9j47k79M90m90M15R0k53K8P2K26k26J08k82o5
7267b14L24J20l69L36o3k28K63r8j18J24n5l23P2K93l08K14k25P0M7L92J53l88
7289A9J04m8Kl1k12M07j84l49O13k87k17l8M00l64r6M60J29n38K56pj5l17K2K47
7313d4p5K42Q2j69P1O8k33K12k62J87j14k15J99M42m56j23n1K97J86j10k89nN8
7336a02R5p8j65N6J50j02J75J9K02k22P7k65J81J44l61L49k74J0L05k50j07L88
7358B25j13l38kK72o0L17k17j56K20j24m7J29r6J36J18j41O6nk44k34P13m96K46
7381A69k70J92k10j7N15j06r7j27j41p2J76K06k37k61K23J91q4j4q0k00n3M61
7403A64j86rm7J86j33K8J81r8q4O9j00j58L36o3K35k67J09k39K75J1k87K37k50
$$ y = [-4, 48, -2, -107, -279, 365, 36, 346, 20, 99, -48, -327, 163, -327, 88, 178, -75, -47, 25, 251, 25, 133, -149, -214, 110, 230, -139, 197, 134, -94, 169, 71, -47, 77, 22, -301, -229, 64, -244, -30, -255, -185, -138, 254, 407, 19, 123, 75, 77, 46, -166, 241, 57, -292, 321, 34, -183, -221, 179, -185, -281, 179, 308, -230, 26, 19, 4, -313, -291, -44, -119, 123, 205, 36, 107, 175, -58, 154, -108, 79, -35, -250, -51, 391, -65, -188, -239, 58, 244, 134, -155, -160, -102, -7, -85, -250, -194, -44, -146, 29, 48, 250, 28, 105, -160, 21, 165, -196, 153, -121, -111, 194, -56, -163, 225, 112, -226, -228, 44, -16, 301, 84, -72, 148, 24, -23, 106, 10, 146, 264, 123, 189, 184, -60, -294, 419, -77, 169, -101, 91, -119, -136, 379, 273, 176, 49, -92, -164, 12, 218, -19, -280, -57, 134, 50, 36, -44, -244, -297, 164, -22, -31, -78, 108, -25, 3, 184, 86, 2, 71, -29, -187, 149, 86, 321, 54, 163, -76, 199, 210, -77, 160, -90]
7426i0j41O0J48R5j91K7k2P9l0R3k97L83j71l39P28l60PJ83l26K36k01K36k96
7449a89K25K3l16J15K23m0r7l7K32m7m16K07R0P9K91l12k28m5J07M89m34k65o8
7472d13M86j1k08j67K66N9q9j47J62K9Q5J22n0k07J34K0l19J60O6J28k8O8m82
7495c36K62j06K09j41j65L08J83j59j48j8P0l0N5L61m97J31N3m5M7j64J26J79
7517A75j00n78L21m8N29j11K84k98j4j65J26o5j08J28L6J25k55j28K22j8K15k9
7539B44k97o1K70r2j27r3QM2J6J90N8k5Rm58M80n40mK96J24l13j04J73n4M10j
7564A51R7q2k05k34M63k03o8L36k59o3N33q12M21J3k1J05l5o5j23l2K7P8K90l27
7588a5J68N3q7j19k45l5K96j22J13J82k04J9k59J86Q5j39J89k2k78j1K82R3j74
$$ y = [-90, -231, -171, -23, 72, -119, -92, -114, -35, -65, 28, -269, 114, -57, -396, 332, -28, -21, 162, -164, 72, -129, 107, -189, 36, 59, -257, -142, 81, 41, -56, -93, 139, 92, -324, -117, -27, 52, 343, 31, -197, -242, -135, 354, -80, -345, -413, 73, 62, -146, -313, -47, 12, -77, -224, -62, -33, 52, 174, 124, -83, 51, 71, -248, -88, -22, 106, 78, 146, -336, -74, -180, 29, -112, -277, 31, 214, 55, -93, -111, -41, -71, -16, 345, -152, -21, 32, -13, 34, -130, -4, 175, 75, -503, -182, -230, 299, 188, 472, 174, 160, -5, 121, 56, -52, 76, 112, 237, -18, -146, 76, 58, 273, 244, -53, -114, 156, 64, -63, -156, -148, -106, -90, 100, 158, 133, 142, -316, 164, -376, -380, -84, 40, -273, -377, -204, -258, 152, 151, 248, 166, -39, -273, 190, -13, -81, 255, -4, -67, 466, -346, 75, 88, 67, 172, 137, 72, -51, -83, -56, 22, 312, -15, 153, 206, 119, 0, -245, -280, 16, -106, 7, 189, -15, 4, -255, -69, 16, -123, 66, 44, -234, -245, 37, 130, -44]
7611d4j95J13J96rk8k39q0j01L81pQ7j68k40J19J55J7l04P03k34k66K83o0J42
7634B21j72j20j24l7M98k37n40N42j5Q5L6k79J89K6j08J07k08K0J57J65m75L04
7656C5J08k89J81j29n4j50K75k14L22k05J93j1R6k79p2M74n9k42j0n7J17j6m8
7679c4J20m4M29l48m4j74K2n0L77k67K7n2j79L22O6k04K23k30N4J35k12Q2j33
7702a14K29k43L98m97J18l1k0J4K71k74L18r7K5k92M5j01K41m6L7PL8J08R3k11
7726A6k39L0K44L02l99J68r6j85J70J9j73K74l92L13j46J8K6lK41j08J20k4k2
7749A54l72K54j05L3J53l9k49L56k97j53M24j15p9k29K73nJ77k56Q0r5J02l79
7771c67K26J53o8N2j33K10k29J58M6J38j35j89R7q8N5R8K55l86m5J23J35j94k61
$$ y = [-44, -239, -126, 70, 61, 33, -206, -286, -387, -6, -13, 74, -94, -334, -215, -60, -43, -347, 356, 122, -144, 139, 79, 221, 49, -71, -195, -232, 266, 29, -511, 31, 16, 101, 137, -142, 47, 73, -35, 72, -136, -116, 41, 206, -269, 35, 143, -146, 35, -94, -148, -298, -23, -237, 85, -120, 73, 62, 158, -121, -193, 281, 222, -20, -30, -87, 30, 14, -34, 86, 42, 471, 123, 79, -95, -73, -123, 254, -13, 14, -38, -217, 105, 171, -33, 190, -40, 14, 149, -63, 19, -114, 115, -128, 270, -227, -109, -140, -160, -146, 125, -149, 169, 72, 97, -195, -150, -251, -10, -56, -19, -12, 26, 134, 227, 16, -223, -193, 51, 353, -46, 122, 26, -159, 11, 30, -143, 131, -261, 52, -94, -76, -50, -53, 188, 80, 200, 176, 154, -218, 36, -69, -36, 117, 78, -171, 185, -112, -265, 159, 44, -35, -264, 9, 4, 181, -75, 5, -90, 12, -367, -141, 12, -56, -4, -137, 73, -156, 2, 48, 186, 51, -138, -41, -129, -74, 24, 279, -107, -152, -29, 106, -88, -349]
7794c49K72j09J19L96n31L26k02N8n3J35K2r3K82k27L2j86K69k05q2Q9R1j04R6
7817D6j08j00K39p4k8J22q3J04k08J08k8j5L1j10M5J63n09L85k44P7K89k64J71
7840IJ00L0m34K70K09k99J94j59L78k15k08j22N36l77j36n4L70J11j89K02o8n6
7862I2j67q4k6M13j22j58k45J70L74k44n8J79k68j16P8N1j22M91l38L31L5m77
7884b11J49J8M3O5j00J81m27L70jK97m47J21KJ22k22J25l1j14j22Q8J93l7k84
7907b22J36J07Qk24L20jk21K10k47K65o8j6N9J64l77j3K55j45%q9J34k31k06K56
7931a46K09o6J3J94n41M97k50j0k6J07l31N00L5j34j13j53M1J18J4R4M1n9l3m
7955cl44M08K63l60J73j82K05k70K20R3m92N08K06k94k9K88l60k47K17J27m45
$$ y = [-349, -77, -186, -67, 329, -202, 124, -78, -20, -73, 62, 84, -9, 273, 46, 78, -108, 161, -44, -126, -37, 54, -50, 46, -62, -162, 77, 3, -25, 97, 14, 118, -90, 18, -10, -25, 6, -104, -59, 104, -405, -20, -264, -187, 102, -162, 9, 109, 139, -295, -25, 184, -115, 79, -80, 298, 83, -125, -247, 289, -88, -224, -278, 92, 203, 14, 216, 148, 92, -75, -159, -185, 228, 106, -52, -297, -127, 247, 3, -55, 124, -144, -260, -182, -131, -253, 238, -100, 231, 266, -211, -62, -44, -1, 64, -36, 145, -282, 88, 87, 384, -63, 58, 60, 182, -40, 85, 54, -60, -182, -94, 99, 62, -222, -86, 21, 29, -195, 125, 124, -97, 113, -134, 131, 63, 47, 106, 270, -107, -120, 135, -10, -10, -99, 35, -196, -402, -146, 63, -3, 10, 204, -337, 160, -90, -100, -126, -19, -350, 150, 185, 51, -62, -215, -174, -56, -42, 52, 93, 34, 1, -3, -347, 61, 324, -36, 137, -45, 160, -110, 110, 203, -289, 219, 425, 131, 102, 390, 30, -217, 0, 127, -318]
7976c18o3M11J37l8K0j61J06p0K08R7l86MJ85j0l17M90k51M82p92L91N6k93J66
7999E4l56J81J2L64m5j96Q6KK0k09K02k95L78k33L8K29k70n1P3J94K49o51J54
8022g0N6r0L67k97K3Q8l45j10M67j28K55j03j07J74j02J74j62nl5k15K94K7j92
8045c6j1P1J16o1n2p6k6K00L4K4q8j73J73k13J81k40L2K33L34n08L93n61L69k13
8069i8J79J8m9J03n2j57O6j37m7L20m76P13m60Q1J62M4q5n1J17Ol39K67r1j69
8093a35nJ28L92m26q4K06J15K6m13O14p70P7K91m07M59K5j54m43N38o4J66k89
8115a53J82j0R4L7l46N24k58q6K71m51K31o3k36M58k52L1k34J97l31L56L1k81
8137b89K74j00K05j61K2L8Nn4K42j59k40Q8K15o7L3p7O6k05p9R5K31k22m6o1N76
$$ y = [-318, -381, 30, 167, 129, 149, -12, 94, 24, 232, 329, -57, -53, 132, 122, -195, 295, 44, 526, -266, 125, 181, -112, 54, -302, -121, -109, 255, 210, 14, 100, 102, 122, -87, 115, -180, 198, -35, 3, 232, -38, -89, -16, 178, 427, -224, -70, -14, -104, 263, -34, -11, 77, -268, -378, 89, -39, 216, 113, 6, 180, 78, 252, 90, 85, 50, -165, 129, 156, -36, -47, 24, 140, 79, 27, -49, -75, 125, 159, 183, 95, -78, 95, -118, 63, -177, -145, 88, 422, -86, 307, -254, 115, -98, 81, 99, 50, 153, 101, -56, 10, -127, -174, 146, -330, 383, -77, 4, 166, 210, 125, 74, 191, 197, -142, 125, 34, -135, -140, -12, 380, -46, -130, 76, 191, 217, -196, 418, -352, -275, 16, -391, 68, 93, -61, -504, 34, -30, 136, -153, 29, 19, 113, 150, -196, 328, 70, -16, 255, -196, 35, -28, -264, 194, -58, -27, -261, -64, -395, -39, -8, -289, -15, -115, 90, -71, -49, -11, -6, -60, 182, 23, -217, -129, 86, 19, 52, -25, 41, -164, -243, -148, 83, -139, -185, -246, 330]
8162C30j29l31M62m39L83k5j73n7j13J10J21r3j84J12NL8J02k92N73j87j83k57
8184b27K93r6j16K10r9R1n8
$$ y = [330, 201, -130, 332, -107, 276, 251, 78, 21, -92, 18, 139, 46, -138, -26, -21, 17, 119, -173, 400, 213, 30, -227, 66, -30, -146, 64, -35, 56, -2]
8191b
$$ Imaginary data points
##PAGE= N=2
##DATA TABLE= (X++(I..I)), XYDATA
0@%%%%%%%qJ6j6K4l2L2m0N1n9P2q8J04j20J42j67J93k22K55k94L36l83M34m89
30b59N51o20O95p78Q68r67J077j197J327j470J628j803J998k212K450k718L017
47A587l357L750m205M738n374O152p127Q390j0093J2525j6307K3008l8231J25674
61A01130O844k73148K07160K5530j49491J29736N075j89622J67641P5562k07908
72a01491O2149J33600j28614K9249O7982j32107M7988J29073j48440l4821J43546
83F8114o7736o3811J05436m0644m3325J06646n4851r7003J30762K8184j30620
94e8848M2613N3686p6508M4636L5912j07898N2537J04475j20583l4138J20371
105E6255m1601l8330O8255p6403k8329J34858n4858j06677J11398J5249q9191
$$ y = [0, 0, 0, 0, 0, 0, 0, 0, -8, 8, -8, 16, -16, 16, -24, 27, -32, 40, -48, 56, -64, 78, -89, 104, -118, 137, -157, 179, -204, 230, -259, 292, -328, 367, -411, 457, -510, 567, -630, 697, -773, 855, -948, 1050, -1162, 1288, -1430, 1587, -1770, 1980, -2225, 2513, -2861, 3291, -3836, 4554, -5539, 6986, -9321, 13687, -24544, 101130, 107974, -165174, 41986, 67516, -81975, 47761, 52836, -136786, 30855, 106417, -101491, -39342, 94258, -34356, -5107, 62875, -69232, -21244, 107829, -40611, -75432, 68114, 378, -63433, 42003, 1359, -41966, 64680, 9829, -87174, 43588, 71772, -58848, -16235, 37451, -39057, 5579, 41491, -66407, -13870, 90605, -29978, -64116, 56255, 14654, -23676, 44579, -31824, -60153, 74705, 19847, -86830, 24568, 39817, -49374]
116d9374P1721K357q0704R7718J6457j37029O4253Q4686j02222R092N8891p6189
128d0343K8562O9754r3028R23J00761o6338m6687P4441k3539k4181N5166n0414
140a4923l8604R0750j1089p2549N4842K0186m9776L3680M045n2983N1941K9701
152D5221q4991O381O6355l5115j4217L5726l4905l6N5659m1862l3790O6052q226
165B2252n3904L3666L190k7745M4722r075n7876N0806L1211o0267J7880L4582
177B9442m4621J2549K6398n3466J7035N4904n6040k2090N7291j7780j7459L7695
189B3858k7265j7305M9509k2245l8817M5422L633l6483J9985q60j9989L9423N42
202A9408m5778K6189K5053l5086O284J9294k7284Q539J9150l6406L372M2981k2622
$$ y = [-49374, 22347, 24704, -56000, 41718, 58175, -78854, -14601, 70085, -32137, -23045, 35846, -40343, -11781, 57973, -35055, -34132, 66629, 291, -46396, 28045, 4506, -19675, 35491, -14923, -53527, 37223, 26134, -46415, 8427, 28613, -21163, 12517, 16562, -36421, 15520, 45221, -39770, -33389, 32966, -2149, -16366, 19360, -15545, -15581, 40078, -1784, -35574, 30478, 22252, -31652, 2014, 5204, -22541, 22181, 13106, -44770, 6036, 37247, -23020, -5140, 29442, -15179, -2630, 23768, -29698, -12663, 42241, -13799, -35889, 21402, 3622, -13837, 23858, -3407, -20712, 28797, 6552, -32265, 13157, 16790, -19693, 292, -568, -20557, 18866, 19408, -26370, -181, 24872, -10214, -3930, 15364, -11920, -3381, 15769, -20637, -17265, 25716, 3094]
215C094k1823K7630n190j1424K4847j2593k3266K9017k39l2715K0406J6093k3239
228i402Q432Q567k2996J8828K0979l4179o25K7173k1523p796K3434j6197o029
241a1334K5823j8826j5482L4977j067k4735J6226L03j7062J8786J60k3360J6188
254E97Q257k2937R407J4734j3237O624O166k0341Q665J8566j9579n511J6172j2485
268d902n680J7357p900o874J9427p535j6625J8250O118j6285O402K207j4946Q553
282b433R566j5024M135J2836j3273k010J4668o231k980J0316j2422p647J6052
295E553l383j1092J1539j130j0857J1432L990j0070R672L567j5926L538R751r630
309c046M79O474j0237j20J0799m904j276R775o451n339P692l249k997P499n837
$$ y = [3094, -18729, 8901, 3711, -7713, 17134, 4541, -18725, 10292, 10053, -22662, -2256, 13837, -9402, -970, 7597, -15399, 3429, 24408, -9771, -10396, 16777, -4746, -12542, 10892, -5305, -11334, 14489, -4337, -19819, 15158, 14091, -10644, 5582, 5885, -11177, 7609, 7769, -15591, 597, 8854, -14083, -4676, 10058, -3179, 3445, 9611, -10730, -2065, 16501, -3078, -8589, 7583, -4902, -10582, 6775, -1125, -7999, 11428, 3893, -12732, 5518, 11636, -4649, 1753, 3960, -10986, -2433, 7133, -7891, -3756, 9080, -4193, -6203, 8465, 2234, -746, 9570, -2852, -10499, 5553, 2170, -8922, 2617, 1487, -9370, 2062, 6052, -4018, 5654, 9221, -6705, -3167, 6584, -3046, -2567, 3907, -6330, -6450, 4349, -555, -1831, 7944, 1493, -3846, 3846, 597, -2400, 5099, -738]
324g38q280Q606J465n781Q174J862r495M312O085q036K647O445j0986l703R136
339A713l799k465Q785l433o110P708J433n033O132k0r203K186K993n186L850L812
355C363p573M53P012m001J450O948o649m463N923l167l213P037k871o639N177
370a213J548k772O193J794o753J230K164l666K424K515o465p63L078k963K511
385a138O187m508k228N008l305j112O628l571o836M390j264m137P050K563p305
400c578K833M021n177L304N665p077k187L275m527k07O437k835l518M285j222
415e08j453O575k20n084K360j785l900M694J052n102J690J318l776M610M283l542
431A212j48J658m242Q8M673l469j821J674l673J3O013n71j365K923k375k581M925
$$ y = [-738, -9018, -412, 1053, -4728, 3446, 5308, -4187, 125, 6210, -1826, 821, 7266, -3720, -7423, 1713, -2086, -4551, 4234, 801, -5309, 2399, 3832, -1201, 4931, 4911, -4292, -2106, 887, -4299, -449, 3363, -4210, -3757, 3255, -746, 704, 7652, 1003, -3460, 2463, -704, -3917, 3120, 249, -6390, -1213, 335, -2437, 3756, 5550, -1203, 27, 2191, -1475, 949, 3464, -3001, -3764, -686, -3649, -1138, 5049, 541, -1687, 3321, 16, -1096, 5532, 1961, -4875, -485, -1749, -5886, 1164, 3727, -3578, -745, 3276, -1901, 1403, 7068, -9, -2196, 1079, -3448, -3655, 2782, -53, -3571, 714, -508, -1961, 4614, 4394, -690, 1670, -115, -4015, 679, 1731, -3371, -1681, -363, -4139, 471, 4754, 1212, 1064, 2722, -1520, -1432, 3241, -228, -2049, -375, -4048, -4035, 1978, 1407, 42, 2965, 590, -1991, 2934]
448B934j97l851J950j542n378M626L493l728K282K039m862J748N710m178q99K377
464B524n354j810N120l13j699K736k250j763M683R12j509J519k181k951K016k53
480e73j164K638p36m673L306L147j183K753m43m323J318K008l777J460K056m431
496b617j072K852l44K156L718n000k117M853j729j121L064k966l268L342j720
511a969j705O296J077n944K120K225j900L241l39n754J075K510m749J472M012
526A668k398l0Q47k407L888M754n708k908L824k733o77L571l554o85N380m675
542a843k991Q776J416o041K306j789l196O481p65q083M185M284o832J520N499
557B927k482K136J188q234K391Q915n823n539M747k134r89N388m182j068Q900
$$ y = [2934, 2737, -1114, 836, -706, -6084, -1458, 2035, -1693, 589, 2628, -2234, -486, 5224, 1046, 147, 2524, -2830, -4640, 480, 167, -1532, 1204, -1046, -2809, 1874, 2786, 1277, 2796, 615, -2336, -320, -573, -1737, 901, 165, -4508, -1202, 1945, 762, 3515, 3072, -1251, 67, 2075, -1702, -242, 1814, -2617, -3689, -837, -1181, 975, 4693, -307, -2424, 2429, 700, -421, 2643, -323, -3591, -249, -1969, -3674, 2622, 3699, -2245, -125, 2100, 200, 3441, 3102, -2652, -1577, 933, -3816, -2344, 1668, -730, -760, 87, -2320, 1568, 6322, 614, -2294, 1530, -1203, -1880, 1691, -1863, -2548, 2832, -1843, -4834, 3942, 5358, -683, 1623, -166, -3362, 3119, 2354, -5729, -1544, 2740, -4092, -2572, 2927, 445, 2581, 3769, -4465, -2074, 6841, 1018, -4521, 226, -1908, -2897, 2491, -1691, -2759, 6141]
572F141l562q295P174L899n529J598k863n113Q096K415r986M022P095o409O5M099
588B847m072M740L637j3253o78J2785m761n521N502l413p95R411o957n525J3592
603G539q58j3856N241M642m816N278k533j0840R931Q731j3039J220R918n783j462
618f87L329p697M460R974j2858p232J3612q8n789N494l655k226J1293n238j1728
633i036J3043M540j3567N84L723l461Q809N60j5141P576J3323j1699l944R470
647D780m501n34M317j1995J253J7769q621j4195J2389L433n695P085m857p665
661g037J4170n00j8380Q812J2267j1600j401L955p028J0054Q514j8594l85J8036
675A0883q663q453Q433l247n96Q901j3020o691K1552q5j6753O603M196m767Q468
$$ y = [6141, 2579, -5716, 1458, 5357, -172, 1426, -1437, -6550, 1546, 3961, -6025, -2003, 5092, -1317, -1252, 2847, -1225, 3515, 7152, -6101, -6779, 6006, 1245, -4276, 1226, -2187, -2982, 6429, -528, -6053, 7539, 6681, -7175, -1934, 2708, -2108, 3170, 637, -10203, -272, 8459, -4580, -3360, 6558, 775, -687, 2642, -5055, -595, 9379, -3479, -10711, 2901, 2813, -2976, 2518, -1137, -3363, 7930, 2692, -9036, 4007, 8547, -5020, -4436, -713, -4174, 4635, 5195, -9946, -2370, 10953, -746, -4690, 4780, 279, -255, 4062, -7933, -6680, 11089, 2468, -11727, 662, 4095, -1600, 5485, 628, -7037, 7133, 6633, -11747, -2935, 9332, -2268, -3669, 286, -6742, 3312, 11826, -6768, -7153, 10883, 2220, -6233, 2200, -1047, -1643, 7258, -5762, -12453, 9099, 9014, -7739, -1136, 3060, -1707, 6761]
690F761m715j3183J4417O828j9668K047J3821n933L95K721j2030P899J5397j6430
704a673q740J6419k840q353O214m297j047J4250q907j4561J7017Q301j4358P37
718a838L122o176R355R57j7170Q342J5261j4754o157J3007k011N56M582j3963
732f887k91J9157q427j4889J1584K763p017O277m146n097J6888j566j9991R052
746b590J2277j0409N73R32r151R663P529j7316J436J7739q641p687Q222l566J818
761H29R249j4129q117J8485m80j4022P406L147m991P067l311r632J3874N873j8028
776f780L98J0926n239J135J295r320N664J2000j2444n772J4947j713q110L563
790E50l276m79J1962p729j3097J2411O533j0720L065L224m959P285M1j3812Q012
$$ y = [6761, 2046, -11137, 3280, 10108, -9560, -7513, 6308, 375, 770, 3491, -8539, -640, 14757, -1673, -10413, 6006, 3166, -5187, 1027, -3270, -4317, 9933, 1026, -13535, 3482, 11783, -2575, -1838, 1284, -4892, 4463, 5420, -11750, -3408, 11853, -2901, -9058, 3949, 1938, 2494, 7076, -6887, -7178, 11979, 3552, -11337, 247, 3010, -4007, 2270, -1876, -6973, 9915, 8349, -11642, -2590, 9687, -722, -149, 783, -8368, 1295, 8824, -8492, -7056, 10683, 2042, -5645, 2577, -989, 829, 10078, -4051, -12168, 6317, 5837, -8185, -779, 2368, -2623, 4444, 1133, -8499, 5375, 11248, -6780, -6382, 4544, -695, 440, 1735, -7585, -1921, 10079, -2365, -8137, 6810, 5097, -3013, 550, -2726, -3205, 8757, 1028, -12069, 342, 6875, -3845, -780, 2444, -2515, 4770, 4811, -9001, -989]
805i89J1498j3358m014Q247l600K233N850j1186N19J4545q140r227J1185K76o617
820b778N168n731m433J4311j446j3861P407P461p406K091K109o554O622L044j3614
835g610K818J1766o355m878M694k866K289P188q065m328J1538k798r014N231K073
850A683l605M469l708o537J0146M414j0339J552O183m978J018K177o522L386O566
865E905r835k899J0864j729m109M296m141j154Q852m422p666Q336J270q496L459
880a469K239l631N771l13q851O205O517o891p17M117m557M63L559o198J274P465
896D983n334m286O133L10j316K718l809l078O619r81o317M035K419m536J396J456
912D12k067M138J585o505M82N473l065j609K359l015k66L686l009j497O713j951
$$ y = [-989, 10509, -2849, -6863, 1384, -2216, 17, 5867, -5319, -4800, 9745, 1605, -7622, 3563, 3839, -2778, 2390, -3341, -7774, 6537, 5091, -8770, -1363, 6098, -1308, 783, 2892, -3662, 2960, 6004, -7610, -4792, 6974, 619, -4259, 435, -2431, -142, 7046, -1019, -5347, 6191, 3393, -5621, -390, 1683, -1922, 2547, -1161, -7698, 2448, 6862, -3477, -1925, 4258, -720, 298, 2475, -4047, -661, 5905, -3930, -6829, 4035, 2306, -1803, 2493, -1648, -2802, 6050, 1628, -6038, 2298, 3568, -4928, -1469, 770, -2861, 2910, 2597, -6254, -49, 6468, -423, -1140, 2977, -1580, -1117, 2442, -3756, -2482, 4983, -351, -4637, 1496, 1806, 490, 3208, -601, -3679, 2940, 1959, -4358, -323, 2096, -2440, -1044, 412, -1655, 2483, 4068, -2437, -1955, 3518, 453, -1156, 1203, -1812, -2078, 1608, -1401, -2898, 3815, 1864]
928A864m481L268O11j875L158j745m930L925J853m596K138L141l104O66J489k993
944a611K756K940m851k084L679j473o20K507k208n27L230j878q88L592o41k578
960f55J213j084j063K983o92l455K170J010k012J904J637j961P19J16j982O73
976d79K260k096j606J309m36P4K078l53j241J922r30j427J986M37k137O55p35
993g19j371J666J353j479N03N26r84N87J643j188l82M35k251M17J640m67q08J114
1011B35q05Q4J791l46k93J037j706j547J555N7j161J143n30j293K067O18n26Q07
1029A187L41j888J58Q75q84L94k39j495J26J458l1O59Q54j002n51M64J65l29L36
1048E98j107j168J005K97M5J220j97j102Q01L61l11P66k59j751k32L07l00P79
$$ y = [1864, -2617, 651, 1262, -613, 2545, 800, -4130, -205, 1648, -2948, -810, 2331, -773, -107, 1382, -1611, 1145, 4085, -766, -2850, 829, -644, -1264, 1243, -965, -1492, 1738, -140, -1028, 2564, 1923, -655, 558, -526, -1589, 1394, 702, -2753, -583, 427, -1585, 319, 1956, -5, 714, 830, -1152, -479, 1781, -315, -1921, -612, -1048, -974, 1104, 751, -490, 1432, 502, -925, 1061, 1498, -639, 16, -719, -2090, -424, 929, -550, -47, 479, -505, 82, 1725, 537, 155, 590, -1661, -1244, 396, -71, -879, 235, -570, -486, 1305, 959, 666, 1703, -3, -1550, 5, 62, -1099, 44, -486, -1779, 288, 906, 380, 1187, 1528, -360, -202, 673, -211, 183, -56, -1551, -1425, 33, 2, 661, 1515, 513, -38, 426, 591, 262, 598, -509, -1677, -672, -375, -330, 890, 693, -409, 392, 753, 442, 1208, 949, -802, -1034, -727, -1027, -248]
1066b48O93q66k76J204l49O87P96j230q38L67l95p73J893q35j390P24J054p20
1084e02J681O27j595n47O95j073N68Q02j262l66M93j31L03J698p06m93j3j22k32
1103a75J010m5j605N1k51j65J294P80j021K40P07p53K70J270j087j321K63n85
1121a123K14J266r2o80Q14n30k5J153O20j694L49l79r95N27J333j482K12P40j147
1140i19Q05K168j363r84J331j226r22J962r61r51Q87l64j383K740Q00j414L24
1157E30L24j597O14J141j569L0P40j435p2K241r20k67J645j441r64K505k25k179
1175h99J481m47k223J726O33j571J805P11k954J608K408k224k17J158j935m37
1191a377K390k067l38K927j769j374K614n28o01K058j429k991L328M66l421J774
$$ y = [-248, 445, -421, -697, 507, 158, 845, 1641, 411, -427, -60, -455, -1228, 665, -170, -1560, -836, 218, -502, 1179, 1806, 211, -336, 359, -714, -146, 656, -606, -972, -479, -610, -307, 1391, 685, 192, 179, 57, -175, 835, 790, -815, -764, -1015, -1180, 114, 894, -127, 113, 820, 67, 337, 1607, 520, -801, -538, -1123, -909, 357, 265, -415, 399, -131, -156, 997, 1617, -77, 272, -107, -1102, -575, 758, -724, -512, 228, -919, -114, 2054, 691, -293, 1038, -188, -1110, 852, -109, -1060, -173, -537, -1920, 820, 1620, 206, 530, 854, -743, -129, 1012, -557, -527, 213, -1222, -1294, 947, 27, -240, 1405, -36, -1000, 1505, 1280, -899, 582, 135, -2088, -362, 271, -1300, 505, 1216, -1738, -130, 2278, 54, -163, 995, -940, -1377, 1013, -1054, -1392, 1535, -234, -1608, 1006, 478, -123, 1935, 506, -2485, 843, 1309, -2112, -338]
1207c38J221k808J304J944k315K091K063m028r06L718j776j122K116k389p67L372
1223A380j947j455M178p24l374K352P29k267L107q03m467K825K198l567J205K416
1239A786k607M08K304l607J169M564m390k523L857q60j612L019k004k202N222
1254B524j106m273M527J424m107Q68O07k872L489J536o341J966M512l481o21L723
1270B375k227n00L484m853j321O715k495n029L915K02k484M526j408m122N429
1285B207P41o271K901L539m647J105J076m550L638M879o855o62O413k991k002
1300a479L664k461j118M903m772l890P351M71n854L172N80k360M469j53o377M706
1316H52L566p193m2M591k604P74J985n489J669P394m803m257N880j086k874L680
$$ y = [-338, 883, -1925, -621, 1323, -992, 1099, 3162, -866, -1772, 1946, 170, -952, 1164, -1225, -1992, 1380, -567, -2022, 2156, 1432, -1942, 410, 1139, -1128, 1979, 1176, -3291, -466, 1732, -1835, -630, 1786, -821, -413, 1891, -1716, -547, 4017, -373, -2896, 961, 101, -1511, 1508, -496, -2698, 2524, 1418, -2855, 1672, 3096, -1011, -143, 464, -2408, 1081, 2617, -3724, -1758, 2754, -727, -1348, 2375, 148, -352, 3132, -1721, -3042, 3673, 1178, -3851, 64, 266, -2218, 2308, 900, -3222, 2207, 2948, -3323, -422, 3117, -1530, -425, 651, -3899, -261, 4618, -2237, -2899, 3514, 523, -1479, 2185, -276, -1394, 3509, -1263, -5153, 2198, 2669, -3185, -13, 567, -1793, 2676, 2523, -3854, 852, 4418, -2775, -2817, 1774, -830, -56, 1929, -3560, -1891, 5503, 700, -3557, 2323, 1237, -1637, 2043]
1332B043k610k370O863k458p570O437L944n449J270J154m202M972K148q699K784
1347a743O404o158k177N072k542J207M454o985j711R583k905o642M982M49l878
1362b590M871k485n108Q297J225q879L256N363m435J136J428n900L345N226p781
1377c031r01P554l163l134M428l080K70O464n396n203P784Q75o682L152R01l834
1393b996M819l40o719N977N460q171j228N719l245J028K303o538J454P517n559
1408e19m364P541m75l883L899l178j999P905k411q378N680L597n906K238J372
1423A119l911M532J937p848K762P520o113k924M419k810M62M763o277j751Q527
1438D407k735n882N910Q74l575L284k294n048P703J571q656K447M423l904J284
$$ y = [2043, -567, -2937, 3926, 1468, -6102, 335, 4279, -1170, 100, 1254, -2948, 2024, 4172, -4527, -1743, 4661, -1497, -3674, 1398, -1144, 63, 4517, -2468, -4179, 5404, 2499, -4143, 839, 1288, -2590, 2281, -204, -5312, 2985, 4210, -4669, -1413, 3950, -485, 651, 2079, -3821, -476, 4750, -3031, -3932, 3622, 459, -2675, 1753, -1327, -1057, 5407, 11, -5192, 2592, 3467, -3215, -63, 838, -2996, 1823, 1483, -5236, 741, 6201, -1970, -3198, 2521, -724, 304, 2607, -3931, -2477, 5040, -519, -4883, 2658, 2183, -1700, 2199, -979, -2978, 4927, 2516, -5862, -182, 3415, -2491, -253, 1119, -2792, 1740, 3677, -4171, -1409, 6111, -2, -2926, 1493, -1317, -855, 3908, -2369, -4120, 4407, 1672, -4210, 1700, 2574, -1001, 2283, -11, -5059, 2644, 4215, -4441, -1994, 2429, -1475, -191]
1453a91K439m906L302M846q146q56P445k938l482L016k549K62N670l813m701P122
1469B520Q04o386L139J716l255L371m93o668N390M092o293j90M452k806N13K594
1485B500m644P28O027n386l975O493o45k570K716k409j491O173j262n974M577
1500H58K240n392J993R80k912L494J354o890K526N484l829j648L915k684j52L408
1516B745m187j406O078k628m610M138J018j831K795j605l538M863J476n744J644
1531g92L430l794M84J636l271K456L501n330j082N501j677k078K557j906j298
1546a663L779k811k611M837L79m129K186Q99j603K741n99m058K674K794m325l23
1562a833L250k225L24J731k914Q17M211l012k652L724p43j770J906j234j707K921
$$ y = [-191, 2248, -2658, 644, 5490, -2656, -3512, 3933, 995, -2487, 529, -2020, -1758, 3912, 99, -4602, 2520, 3324, -3062, 77, 1793, -1462, 1909, 1416, -5252, 138, 4230, -2063, -2253, 2199, -607, -94, 2500, -2144, -1416, 4611, -775, -4750, 1743, 1098, -1472, 1244, -1165, -2656, 3517, 2255, -3719, 858, 3098, -2294, -301, 679, -2233, 1261, 2615, -4275, -1749, 3735, -94, -1742, 2173, -511, -663, 2745, -1442, -2848, 3230, 602, -4008, 130, 1148, -683, 2112, 507, -3031, 1832, 3308, -2436, -792, 2638, -1156, -672, 964, -2307, 149, 3650, -1680, -2762, 2739, 1062, -1016, 1541, -365, -1663, 2116, -695, -3306, 1531, 1910, -2219, -33, 866, -737, 2004, 1405, -2653, 21, 2815, -1510, -1833, 1417, -808, -484, 1247, -1667, -850, 3361, 349, -2303, 1421, 678, -1092, 814, -420, -2127, 794]
1578G94j51l200L006J800l067O78Q80k146K023J153l773P49K358j719l93K169
1594A161j322k22J989j954o78L146j023k502J619%j479J414J0j452J557Q46k147
1611a037P89J800j357k32M97j408M23J603k154j09J657p16n87J823m06q50J596
1628A332j375j444K059L89j867N67M87j461J667P23j414Q31O46j844K70J389r34
1645B1k45M28j227Q5J630o24m02J144k27j048J217j12j163Q75j06j376O13Q06
1663B89j000N56P05j016M26P29m90k34P89j152l23Q03k59j1M57k90p11Q06N77
1682F51l40N76L1j395N96J44o17M04j73n07m7P10K76k02O77o30l19M97k10l7J35
1703B20j46p37K26K33l8Q46n3o79K90K03m17K38J9p57q9R6O6L14L96k13k12L38
$$ y = [794, 643, -2557, 449, 2249, -818, -140, 740, -1406, 617, 1770, -2003, -1254, 1104, -615, -1008, 1161, -161, -383, 1606, -348, -1026, 2120, 1097, -1405, 214, 214, -1265, 149, 159, -1293, 264, 1110, -1037, -248, 1552, 195, -37, 460, -948, -525, 1078, -1076, -1185, 472, -244, -831, 992, 586, -264, 1332, -43, -1487, 572, 961, -906, -339, 148, -1313, 354, 1077, -337, 494, 1140, -704, -434, 955, 21, -224, 204, -1023, -938, 692, 68, -334, 810, 583, -465, 752, 640, -523, 352, 246, -1130, -517, 289, -711, -155, 550, -466, -40, 689, 199, -35, 754, -398, -721, 82, -177, -188, 269, -21, -732, 74, 651, 311, 887, 918, -477, 119, 263, -354, 50, -123, -630, -677, 33, 309, 107, 784, 154, -165, 332, 122, 85, 220, 74, -663, -437, -204, -242, 604, 551, -128, 162, 365, -52, 186, 205, -552, -641, -545, -479, -165, 231, 18, -194, 144]
1725A44k5J84p2L00j132K39J80Q4L66k34m22j31N27R4J13M20k33m77J9k60j31
1746d47O23k86p50M28k1L69K66L46m57J3K56l59k9m3J02m40j89L13M26K55J17
1767D93l90j39M24l67M04j49n35k4J79o47N09O86l43p9J4j93K49J33K09m35m34
1788d35l32K58Q71k17k0j32K2J59N10j66l15o9n96j76L65J77J1K4k17j09O39K36
1810D88k55M01o00j62N8K04k56q5J54p08M81Q36m06L05M9k63j42J64k89j2Nn90
1832f23n2L51K23L34L97p96l17J093o2m68M51n21l84K20L01o23P52j66m85L98
1852B3L76l41N33j83p36l52J143m74k46N15n48p2O36k92m0J057m69j032N62K92
1872C52q35O86j39p44J034J46j185R29O66p90j46M83r00P57M70j478j7J290j323
$$ y = [144, 119, 303, 231, 531, -601, -362, -182, -98, 268, 34, -388, -519, 8, 102, 215, 635, 402, -75, -56, -316, -447, 176, -110, -860, -432, -453, -84, 182, 528, 71, 84, 340, -19, -48, -91, 11, -429, -618, -305, 121, 376, 493, 103, -36, 388, 21, 425, 276, -259, -283, -104, -751, -242, 444, 101, 22, 36, -157, 92, 225, 434, -1, -435, -767, -509, 362, 145, 125, -7, 15, 174, 684, 518, 203, 134, -462, -638, -273, -96, -85, -61, -278, -387, 252, 488, 233, 634, 34, -128, -70, 134, -122, -207, -53, -761, -280, 556, 150, 455, 504, 241, 99, 263, -26, -38, -33, -623, -675, -324, -101, 233, 630, -166, -483, 610, 548, 80, 531, 10, -374, -154, 147, -476, 276, 110, -375, 23, 399, 58, 591, 408, -328, -680, 463, -11, -257, 258, -290, -362, 274, -18, -58, 999, 530, -502, 60, 352, -483, 203, 64, -680, 354, 500, -685, 244, 910, 120, -26, 457, -443, 314, 784, -694, -711, 579, -744]
1891g44P5P27j82j67J158j113l11J693m47j192N27k68p02J593m07j468J622P28
1909A122j726N01J061j121N50J32j658O52J632j430p26J755q31m95J453p66o00
1926d95J877j414j580K010M53j630P59k70o14J635M02k263J136J515j820p97J993
1943H97j556K38J032k216M08K801j353j416J717k8q01J307p89j622K659m37k922
1960b081J648J368j374L44M17j688J619J806l069O8K858k052j141J470j045N42
1976c10J736k536q57L517l45k275J824j39j247J493m98k301K261J463l834J026
1992a022K030j175N26N76k349J077K438k724j240K941n36j721J630j366%K847
2008A932j193k947L152Q06k255Q09K1j458J863K17l471K244K578l059n81K461
$$ y = [-744, -669, 58, -124, -291, 867, -246, -557, 1136, 689, -503, 24, -244, -946, 647, 240, -1228, 394, 1122, -604, -103, 958, -163, 387, 519, -1139, -487, 1145, -285, -1011, 744, -87, -582, 871, 105, -495, 1382, -32, -1612, 398, 851, -779, -20, -290, -904, 731, 1133, -1130, 6, 1521, -299, -1096, 897, -659, -421, 611, -1605, -1197, 1604, 251, -1165, 552, 524, -277, 1030, 241, -1381, 1278, 841, -2081, -433, 935, -439, -95, 322, -1366, 253, 2059, -1010, -942, 1916, -136, -1277, 193, -852, -310, 1426, -1110, -1967, 1550, 1205, -1070, 754, 615, -632, 861, 363, -1938, 323, 1786, -2048, -1022, 1008, -167, 359, 935, -1414, -337, 2101, -623, -1863, 1078, 542, -1179, 451, -915, -915, 1932, 739, -2208, 944, 1750, -505, 304, 325, -1133, 730, 947, -2524, -280, 2298, -761, -1342, 1119]
2024A119j295L87J767l344m9L777k168k296K724Jj169J499j128j459L959l50m135
2041b160K059J723k308R78P9k042K341J267m172J000L721k112j584J819j372K39
2057e24K676k730k001L946p00k488J909M84j072K036j158k694L558J028m051Q64
2073i17K056j707N98P35k562J482K663l353q97L430n72j792J543j577n18L467
2089B079j980k442K863J048k568J215O51j591K143l91l739K496K173k934m15K308
2105I16j838J270J035k709N55L462k615j873K643n82j148K207j878j652L782j20
2121A455l761K496J552k447Q06K8j604K292R80m015M39L677k050p70J424j054
2137e52N07K067k528j178L247o02k741J552M43j061J749p27k466K911J508l343
$$ y = [1119, -176, 211, 1978, -1366, -1415, 2362, 194, -2102, 622, 623, -546, 953, -175, -1634, 2325, 1975, -2160, -101, 1622, -686, 292, 371, -1671, 670, 1937, -2235, -1235, 2486, 374, -1210, 609, -763, -524, 2152, -578, -2579, 1367, 667, -1821, 88, 572, -500, 1536, 378, -2316, 1242, 2270, -1781, -917, 1139, -568, 30, 765, -1797, -315, 2348, -1005, -1902, 1528, 956, -836, 707, -870, -1388, 2079, 99, -2343, 520, 1568, -1000, 215, 866, -725, 1418, 1027, -2712, -216, 1957, -977, -1392, 916, -922, 348, 1383, -1326, -771, 2691, 76, -1797, 846, 264, -884, 1323, -555, -2207, 1575, 1455, -2306, 190, 1742, -705, 101, 129, -1475, 817, 1797, -2218, -1779, 1898, -152, -922, 502, -552, -45, 2022, -506, -1684, 1563, 961, -1780, -228, 215, -846, 903, 176, -2290, 621, 2129, -1214]
2153a214O80J800j519K21P26k420J399K387k730j693L311l31j174J405j119l62
2169f33K134j173k621K971N18k527J156L64j011J884L25k842J204K233k317l16
2185f51J478j467J85J597k509M02K833j399j838K020k17q69J413j307r58K294
2201A007m15k378J849J145j699O33L00j076J598O77k911N69J752j161o97J146
2217C39q87L24J179j635m07K311j24k206J256R7o33J057m25j864J877O26j904
2234a019P40J031r73O09K30j514Q99J555k048p16K027j040n96J069m19o21J942
2251A156j006j223J740L24j523M54L3j069J512o3j421J115Q11r11o14J624r80
2268d1L25L31j036n59J790r95n72J249k97n65M47j9o93J591m43j284Q43K21n69
$$ y = [-1214, -534, 1266, -253, -32, 694, -1726, -327, 2060, -670, -2363, 948, 617, -557, 848, -271, -633, 1501, 328, -2293, 678, 1196, -1331, -175, 189, -822, 1062, 1387, -1455, -251, 1982, -335, -651, 827, -640, -455, 1142, -1367, -965, 1868, 469, -1369, 651, 434, -435, 978, -329, -1287, 1007, 592, -1786, 63, 1208, -491, 142, 442, -634, 964, 1641, -1270, -701, 1051, -110, -807, 339, -548, -224, 955, -680, -1087, 1224, 1100, -1106, 150, 247, -386, 671, 246, -1618, 259, 885, -1019, -279, 752, -221, 388, 618, -896, 3, 1558, -490, -1206, 821, -219, -815, 254, -165, -786, 1156, 150, -1073, 667, 991, -532, -78, -45, -1114, 398, 335, -1086, 29, 840, -71, -685, 939, -41, 284, 615, -421, -980, 810, -185, -757, 492, 195, -370, 77, 58, -635, 956, 513, -771, 72, 293, -276]
2287b76K96N6o92N18Q85r96K84R10r47k88M46n37L69L29o68m71J226k46o29R00
2307D69l17l48L84m0n08Q69k9j247O66M4j84n3O61l64qM01m56o4Q18n68l59Q1
2329a52M8j74L24k05l35Q50j29k50L41l96M4J92k20l88J73M88n10P4M11k09O5
2350D2M56j73m20J85j36m3J66n1k95L90j10o42R11K27m53p1l5k19K79L06m86M16
2372B44k07l02O9L15k10%J84L36J99n57K37r7m47K29o02L15L25k61N16l02k39
2393b55N39k52K8N1j53K80m01K70J49k21l3j88K43L33k36J27j65Lk3j83q0q6K71
2416A8j32j46J16j03O40P5l01k17J41K00l65k14O8m58N12n8K88J60j98M5J76j38
2438A09l79O13r8l05m29L5L04j78M78q4K1N2o3J50k20J88n15K91k2m05N04L47
$$ y = [-276, 20, 76, -616, -98, 787, -209, 75, 985, 38, -250, 196, -341, 28, 357, -311, -782, 444, 198, -431, 469, 152, -196, 188, 148, -360, 509, 480, -767, -101, -57, -241, -294, 367, 3, -5, 396, -60, -124, 694, 126, -233, -152, -104, -278, 46, -159, -494, 356, 227, -23, 318, -78, -34, 158, -62, -450, -277, 211, -299, -225, 186, -23, 42, 498, 325, -95, 90, -46, -89, 77, 26, -269, 121, 11, -631, 280, 507, 54, -17, -52, -271, 8, 314, -172, 244, 37, -265, -196, 119, -91, -91, 93, 429, 628, 71, 308, 211, -236, -7, -609, -294, 31, -230, 286, -16, -255, 284, 32, 60, 111, -42, 238, -163, 107, 256, 35, 2, -186, 57, 390, 154, 281, 116, 119, 96, -87, -167, -253, 18, -114, -260, -144, -247, 393, 468, 167, -50, 91, 291, -74, -288, -220, -678, -166, -224, 64, 224, 26, 71, 247, 109, -270, 343, 245, -60, -489, -454, -150, -328, 150, 66, 87, 139, 76, 226, 6, 194, -321, -30, -52, -457, 47, 394]
2460C94m93K18Ql74M20m2M05p86r4M27m08N68p7o80L34J34J08L18J01n63l39L50
2482g1L32l82K01k90k33L00j45P6O32j17l13J19J16j35M05l85o76K95K25k59J20
2503a85N27l15K37l61%K24R7J12j44j48l44K3J34j76N78L7m42n7O35m68k4K88
2525B28l03n0M44k17m64L36K27m20L69K33l27L24Q5o78l6P56n68m03K97k57p5
2546d99P85j95m28J100n41o66N05L18l78K66j39q37P97K20l65J34M01p01K32K49
2566B58j07P5L45r84j61R87l92p05N88K97j052J138m37o2N68jp74N45K73r20N03
2587a8R3j001N65Q94r20p6J466q61m19O73m75M8Q69j124q78J520K98o25R8l9l98
2608c10P48K5j055R67L19j282J23P32p69P17M99j153P4J304q54o87R59l10n16
$$ y = [394, -99, 119, 127, -247, 173, 131, 536, -250, -344, 83, -325, 243, 166, -514, -180, -46, 62, 380, 481, -82, -421, -71, 261, -121, 80, -210, -443, -143, -288, -212, 420, 303, -10, 109, 225, 90, 495, 110, -566, -271, -46, -305, -185, 342, 27, 264, -97, -97, 127, 224, 336, 192, 44, -300, -277, -143, -319, 259, 296, -146, -203, 432, -36, -60, 228, -75, -125, 319, 102, -362, -26, 201, -219, 150, 383, 56, 380, 465, -213, -249, 507, -61, -464, -167, -424, -499, 286, 91, -337, 763, 222, -444, 61, 379, 1, 267, 128, -709, 88, 308, -57, 77, 478, -223, 9, 258, 151, 226, 571, -413, -574, 413, 21, -684, -96, 201, -851, 287, -150, -212, 356, 355, -419, 126, 399, -521, -18, 75, -926, -361, 533, -387, -463, 1003, 142, -277, 396, -79, -31, 838, -286, -1164, 356, 654, 29, 127, 88, -310, 438, 463, -592, 375, 694, -588, -465, 267, -502, 215, 714, -439, -365, 939, 85, -602, 357, 47, -469]
2627d69P83o27m08J548l82j407J043K79q65L87L27r11J073K26j348Q1J640j097
2645a27p53J145n06K30Q32j430k12J788r63r41J033O2o14R60m62q82J331M35j576
2664f50O12N11p39N85K56j353O64R56j732q6J773n42p00J107j084J91J378q87
2682B60j550J789O3j197O71J41r56J683l54j937J611R01j820L81P44q44M36L23
2700C45r92J16J778j746q05K160k74r55J040r78l89J682p49j537J192P08j008
2717d12O67l8q50J096M65j700J35J825j220l66O84q95M16J124j480k73K580j284
2735D74j411J280J4m95O38r31p40K016K6j527K43J334j444N34L77j103O10J367
$$ y = [-469, 314, -313, -721, 827, 445, -962, 81, 360, -505, -118, 209, -702, 371, 597, -751, -670, 970, -127, -880, 265, -241, -11, 821, -609, -821, 967, 4, -937, 96, 158, -456, 504, 42, -840, 491, 926, -650, -38, 473, -266, 319, 575, -778, -114, 842, -890, -976, 797, 255, -445, 662, -422, -231, 1147, 260, -1290, 499, 562, -635, 36, 177, -779, 904, 550, -1387, 224, 1125, -695, -314, 430, -414, 22, 345, -647, -531, 1247, -499, -1304, 856, 582, -373, 667, -311, -700, 982, 233, -1304, -112, 596, -412, 255, 217, -633, 463, 928, -772, -637, 1188, -32, -398, 286, -609, -193, 931, -549, -822, 1758, 474, -937, 343, 357, -138, 500, -431, -1171, 845, 871, -656, -413, 921, -523, 11, 388, -715, -105, 1262]
$$ [...]
8191C37
##END NTUPLES=NMR FID
##END=
